Definition of correct units for the observed determinands in the given WISE SoE DD tables
type: ConceptScheme
notation: QCCombinationTableDeterminandUom
is part of: wise
registration status: Released
user modified: demo_user
date modified: 2019-10-03 10:44:33.0
vocabulary type: Common
is numeric concept identifiers: true
is notations equal identifiers: false

WISE-SoE_Emissions.Emissions - CAS_100-00-5 - kg/a
type: Concept
notation: WISE-SoE_Emissions.Emissions - CAS_100-00-5 - kg/a
definition: The unit of measure for 'CAS_100-00-5' (1-chloro-4-nitrobenzene) in WISE SoE - Emissions: Emissions table is 'kg/a'
status: valid
status modified: 2019-10-03
accepted date: 2019-10-03
in scheme: Definition of correct units for the observed determinands in the given WISE SoE DD tables
has determinand: CAS 100-00-5
has uom: kg.a-1
has table: WISE-SoE Emissions.Emissions

WISE-SoE_Emissions.Emissions - CAS_100-02-7 - kg/a
type: Concept
notation: WISE-SoE_Emissions.Emissions - CAS_100-02-7 - kg/a
definition: The unit of measure for 'CAS_100-02-7' (Nitrophenol) in WISE SoE - Emissions: Emissions table is 'kg/a'
status: valid
status modified: 2019-10-03
accepted date: 2019-10-03
in scheme: Definition of correct units for the observed determinands in the given WISE SoE DD tables
has determinand: CAS 100-02-7
has uom: kg.a-1
has table: WISE-SoE Emissions.Emissions

WISE-SoE_Emissions.Emissions - CAS_100-41-4 - kg/a
type: Concept
notation: WISE-SoE_Emissions.Emissions - CAS_100-41-4 - kg/a
definition: The unit of measure for 'CAS_100-41-4' (Ethylbenzene) in WISE SoE - Emissions: Emissions table is 'kg/a'
status: valid
status modified: 2019-10-03
accepted date: 2019-10-03
in scheme: Definition of correct units for the observed determinands in the given WISE SoE DD tables
has determinand: CAS 100-41-4
has uom: kg.a-1
has table: WISE-SoE Emissions.Emissions

WISE-SoE_Emissions.Emissions - CAS_100-42-5 - kg/a
type: Concept
notation: WISE-SoE_Emissions.Emissions - CAS_100-42-5 - kg/a
definition: The unit of measure for 'CAS_100-42-5' (Styrene) in WISE SoE - Emissions: Emissions table is 'kg/a'
status: valid
status modified: 2019-10-03
accepted date: 2019-10-03
in scheme: Definition of correct units for the observed determinands in the given WISE SoE DD tables
has determinand: CAS 100-42-5
has uom: kg.a-1
has table: WISE-SoE Emissions.Emissions

WISE-SoE_Emissions.Emissions - CAS_100-44-7 - kg/a
type: Concept
notation: WISE-SoE_Emissions.Emissions - CAS_100-44-7 - kg/a
definition: The unit of measure for 'CAS_100-44-7' (Benzyl chloride) in WISE SoE - Emissions: Emissions table is 'kg/a'
status: valid
status modified: 2019-10-03
accepted date: 2019-10-03
in scheme: Definition of correct units for the observed determinands in the given WISE SoE DD tables
has determinand: CAS 100-44-7
has uom: kg.a-1
has table: WISE-SoE Emissions.Emissions

WISE-SoE_Emissions.Emissions - CAS_1002-53-5 - kg/a
type: Concept
notation: WISE-SoE_Emissions.Emissions - CAS_1002-53-5 - kg/a
definition: The unit of measure for 'CAS_1002-53-5' (Dibutyltin) in WISE SoE - Emissions: Emissions table is 'kg/a'
status: valid
status modified: 2019-10-03
accepted date: 2019-10-03
in scheme: Definition of correct units for the observed determinands in the given WISE SoE DD tables
has determinand: CAS 1002-53-5
has uom: kg.a-1
has table: WISE-SoE Emissions.Emissions

WISE-SoE_Emissions.Emissions - CAS_10028-17-8 - kg/a
type: Concept
notation: WISE-SoE_Emissions.Emissions - CAS_10028-17-8 - kg/a
definition: The unit of measure for 'CAS_10028-17-8' (Tritium) in WISE SoE - Emissions: Emissions table is 'kg/a'
status: valid
status modified: 2019-10-03
accepted date: 2019-10-03
in scheme: Definition of correct units for the observed determinands in the given WISE SoE DD tables
has determinand: CAS 10028-17-8
has uom: kg.a-1
has table: WISE-SoE Emissions.Emissions

WISE-SoE_Emissions.Emissions - CAS_10061-01-5 - kg/a
type: Concept
notation: WISE-SoE_Emissions.Emissions - CAS_10061-01-5 - kg/a
definition: The unit of measure for 'CAS_10061-01-5' (cis-1,3-dichloropropene) in WISE SoE - Emissions: Emissions table is 'kg/a'
status: valid
status modified: 2019-10-03
accepted date: 2019-10-03
in scheme: Definition of correct units for the observed determinands in the given WISE SoE DD tables
has determinand: CAS 10061-01-5
has uom: kg.a-1
has table: WISE-SoE Emissions.Emissions

WISE-SoE_Emissions.Emissions - CAS_10061-02-6 - kg/a
type: Concept
notation: WISE-SoE_Emissions.Emissions - CAS_10061-02-6 - kg/a
definition: The unit of measure for 'CAS_10061-02-6' (trans-1,3-dichloropropene) in WISE SoE - Emissions: Emissions table is 'kg/a'
status: valid
status modified: 2019-10-03
accepted date: 2019-10-03
in scheme: Definition of correct units for the observed determinands in the given WISE SoE DD tables
has determinand: CAS 10061-02-6
has uom: kg.a-1
has table: WISE-SoE Emissions.Emissions

WISE-SoE_Emissions.Emissions - CAS_100646-51-3 - kg/a
type: Concept
notation: WISE-SoE_Emissions.Emissions - CAS_100646-51-3 - kg/a
definition: The unit of measure for 'CAS_100646-51-3' (Quizalofop-P-ethyl) in WISE SoE - Emissions: Emissions table is 'kg/a'
status: valid
status modified: 2019-10-03
accepted date: 2019-10-03
in scheme: Definition of correct units for the observed determinands in the given WISE SoE DD tables
has determinand: CAS 100646-51-3
has uom: kg.a-1
has table: WISE-SoE Emissions.Emissions

WISE-SoE_Emissions.Emissions - CAS_1007-28-9 - kg/a
type: Concept
notation: WISE-SoE_Emissions.Emissions - CAS_1007-28-9 - kg/a
definition: The unit of measure for 'CAS_1007-28-9' (Desisopropylatrazine) in WISE SoE - Emissions: Emissions table is 'kg/a'
status: valid
status modified: 2019-10-03
accepted date: 2019-10-03
in scheme: Definition of correct units for the observed determinands in the given WISE SoE DD tables
has determinand: CAS 1007-28-9
has uom: kg.a-1
has table: WISE-SoE Emissions.Emissions

WISE-SoE_Emissions.Emissions - CAS_101-21-3 - kg/a
type: Concept
notation: WISE-SoE_Emissions.Emissions - CAS_101-21-3 - kg/a
definition: The unit of measure for 'CAS_101-21-3' (Chlorpropham) in WISE SoE - Emissions: Emissions table is 'kg/a'
status: valid
status modified: 2019-10-03
accepted date: 2019-10-03
in scheme: Definition of correct units for the observed determinands in the given WISE SoE DD tables
has determinand: CAS 101-21-3
has uom: kg.a-1
has table: WISE-SoE Emissions.Emissions

WISE-SoE_Emissions.Emissions - CAS_101-42-8 - kg/a
type: Concept
notation: WISE-SoE_Emissions.Emissions - CAS_101-42-8 - kg/a
definition: The unit of measure for 'CAS_101-42-8' (Fenuron) in WISE SoE - Emissions: Emissions table is 'kg/a'
status: valid
status modified: 2019-10-03
accepted date: 2019-10-03
in scheme: Definition of correct units for the observed determinands in the given WISE SoE DD tables
has determinand: CAS 101-42-8
has uom: kg.a-1
has table: WISE-SoE Emissions.Emissions

WISE-SoE_Emissions.Emissions - CAS_101-55-3 - kg/a
type: Concept
notation: WISE-SoE_Emissions.Emissions - CAS_101-55-3 - kg/a
definition: The unit of measure for 'CAS_101-55-3' (4-bromophenyl phenyl ether) in WISE SoE - Emissions: Emissions table is 'kg/a'
status: valid
status modified: 2019-10-03
accepted date: 2019-10-03
in scheme: Definition of correct units for the observed determinands in the given WISE SoE DD tables
has determinand: CAS 101-55-3
has uom: kg.a-1
has table: WISE-SoE Emissions.Emissions

WISE-SoE_Emissions.Emissions - CAS_101205-02-1 - kg/a
type: Concept
notation: WISE-SoE_Emissions.Emissions - CAS_101205-02-1 - kg/a
definition: The unit of measure for 'CAS_101205-02-1' (Cycloxydim) in WISE SoE - Emissions: Emissions table is 'kg/a'
status: valid
status modified: 2019-10-03
accepted date: 2019-10-03
in scheme: Definition of correct units for the observed determinands in the given WISE SoE DD tables
has determinand: CAS 101205-02-1
has uom: kg.a-1
has table: WISE-SoE Emissions.Emissions

WISE-SoE_Emissions.Emissions - CAS_1014-69-3 - kg/a
type: Concept
notation: WISE-SoE_Emissions.Emissions - CAS_1014-69-3 - kg/a
definition: The unit of measure for 'CAS_1014-69-3' (Desmetryn) in WISE SoE - Emissions: Emissions table is 'kg/a'
status: valid
status modified: 2019-10-03
accepted date: 2019-10-03
in scheme: Definition of correct units for the observed determinands in the given WISE SoE DD tables
has determinand: CAS 1014-69-3
has uom: kg.a-1
has table: WISE-SoE Emissions.Emissions

WISE-SoE_Emissions.Emissions - CAS_1024-57-3 - kg/a
type: Concept
notation: WISE-SoE_Emissions.Emissions - CAS_1024-57-3 - kg/a
definition: The unit of measure for 'CAS_1024-57-3' (Heptachlor epoxide) in WISE SoE - Emissions: Emissions table is 'kg/a'
status: valid
status modified: 2019-10-03
accepted date: 2019-10-03
in scheme: Definition of correct units for the observed determinands in the given WISE SoE DD tables
has determinand: CAS 1024-57-3
has uom: kg.a-1
has table: WISE-SoE Emissions.Emissions

WISE-SoE_Emissions.Emissions - CAS_10265-92-6 - kg/a
type: Concept
notation: WISE-SoE_Emissions.Emissions - CAS_10265-92-6 - kg/a
definition: The unit of measure for 'CAS_10265-92-6' (Methamidophos) in WISE SoE - Emissions: Emissions table is 'kg/a'
status: valid
status modified: 2019-10-03
accepted date: 2019-10-03
in scheme: Definition of correct units for the observed determinands in the given WISE SoE DD tables
has determinand: CAS 10265-92-6
has uom: kg.a-1
has table: WISE-SoE Emissions.Emissions

WISE-SoE_Emissions.Emissions - CAS_103-65-1 - kg/a
type: Concept
notation: WISE-SoE_Emissions.Emissions - CAS_103-65-1 - kg/a
definition: The unit of measure for 'CAS_103-65-1' (n-propylbenzene) in WISE SoE - Emissions: Emissions table is 'kg/a'
status: valid
status modified: 2019-10-03
accepted date: 2019-10-03
in scheme: Definition of correct units for the observed determinands in the given WISE SoE DD tables
has determinand: CAS 103-65-1
has uom: kg.a-1
has table: WISE-SoE Emissions.Emissions

WISE-SoE_Emissions.Emissions - CAS_1031-07-8 - kg/a
type: Concept
notation: WISE-SoE_Emissions.Emissions - CAS_1031-07-8 - kg/a
definition: The unit of measure for 'CAS_1031-07-8' (Endosulfan sulfate) in WISE SoE - Emissions: Emissions table is 'kg/a'
status: valid
status modified: 2019-10-03
accepted date: 2019-10-03
in scheme: Definition of correct units for the observed determinands in the given WISE SoE DD tables
has determinand: CAS 1031-07-8
has uom: kg.a-1
has table: WISE-SoE Emissions.Emissions

WISE-SoE_Emissions.Emissions - CAS_104-40-5 - kg/a
type: Concept
notation: WISE-SoE_Emissions.Emissions - CAS_104-40-5 - kg/a
definition: The unit of measure for 'CAS_104-40-5' (4-nonylphenol) in WISE SoE - Emissions: Emissions table is 'kg/a'
status: valid
status modified: 2019-10-03
accepted date: 2019-10-03
in scheme: Definition of correct units for the observed determinands in the given WISE SoE DD tables
has determinand: CAS 104-40-5
has uom: kg.a-1
has table: WISE-SoE Emissions.Emissions

WISE-SoE_Emissions.Emissions - CAS_104-51-8 - kg/a
type: Concept
notation: WISE-SoE_Emissions.Emissions - CAS_104-51-8 - kg/a
definition: The unit of measure for 'CAS_104-51-8' (n-butylbenzene) in WISE SoE - Emissions: Emissions table is 'kg/a'
status: valid
status modified: 2019-10-03
accepted date: 2019-10-03
in scheme: Definition of correct units for the observed determinands in the given WISE SoE DD tables
has determinand: CAS 104-51-8
has uom: kg.a-1
has table: WISE-SoE Emissions.Emissions

WISE-SoE_Emissions.Emissions - CAS_104206-82-8 - kg/a
type: Concept
notation: WISE-SoE_Emissions.Emissions - CAS_104206-82-8 - kg/a
definition: The unit of measure for 'CAS_104206-82-8' (Mesotrione) in WISE SoE - Emissions: Emissions table is 'kg/a'
status: valid
status modified: 2019-10-03
accepted date: 2019-10-03
in scheme: Definition of correct units for the observed determinands in the given WISE SoE DD tables
has determinand: CAS 104206-82-8
has uom: kg.a-1
has table: WISE-SoE Emissions.Emissions

WISE-SoE_Emissions.Emissions - CAS_105-67-9 - kg/a
type: Concept
notation: WISE-SoE_Emissions.Emissions - CAS_105-67-9 - kg/a
definition: The unit of measure for 'CAS_105-67-9' (2,4-dimethyl-phenol) in WISE SoE - Emissions: Emissions table is 'kg/a'
status: valid
status modified: 2019-10-03
accepted date: 2019-10-03
in scheme: Definition of correct units for the observed determinands in the given WISE SoE DD tables
has determinand: CAS 105-67-9
has uom: kg.a-1
has table: WISE-SoE Emissions.Emissions

WISE-SoE_Emissions.Emissions - CAS_10599-90-3 - kg/a
type: Concept
notation: WISE-SoE_Emissions.Emissions - CAS_10599-90-3 - kg/a
definition: The unit of measure for 'CAS_10599-90-3' (Chloramide) in WISE SoE - Emissions: Emissions table is 'kg/a'
status: valid
status modified: 2019-10-03
accepted date: 2019-10-03
in scheme: Definition of correct units for the observed determinands in the given WISE SoE DD tables
has determinand: CAS 10599-90-3
has uom: kg.a-1
has table: WISE-SoE Emissions.Emissions

WISE-SoE_Emissions.Emissions - CAS_106-42-3 - kg/a
type: Concept
notation: WISE-SoE_Emissions.Emissions - CAS_106-42-3 - kg/a
definition: The unit of measure for 'CAS_106-42-3' (P-xylene) in WISE SoE - Emissions: Emissions table is 'kg/a'
status: valid
status modified: 2019-10-03
accepted date: 2019-10-03
in scheme: Definition of correct units for the observed determinands in the given WISE SoE DD tables
has determinand: CAS 106-42-3
has uom: kg.a-1
has table: WISE-SoE Emissions.Emissions

WISE-SoE_Emissions.Emissions - CAS_106-43-4 - kg/a
type: Concept
notation: WISE-SoE_Emissions.Emissions - CAS_106-43-4 - kg/a
definition: The unit of measure for 'CAS_106-43-4' (4-chlorotoluene) in WISE SoE - Emissions: Emissions table is 'kg/a'
status: valid
status modified: 2019-10-03
accepted date: 2019-10-03
in scheme: Definition of correct units for the observed determinands in the given WISE SoE DD tables
has determinand: CAS 106-43-4
has uom: kg.a-1
has table: WISE-SoE Emissions.Emissions

WISE-SoE_Emissions.Emissions - CAS_106-44-5 - kg/a
type: Concept
notation: WISE-SoE_Emissions.Emissions - CAS_106-44-5 - kg/a
definition: The unit of measure for 'CAS_106-44-5' (4-methyl-phenol) in WISE SoE - Emissions: Emissions table is 'kg/a'
status: valid
status modified: 2019-10-03
accepted date: 2019-10-03
in scheme: Definition of correct units for the observed determinands in the given WISE SoE DD tables
has determinand: CAS 106-44-5
has uom: kg.a-1
has table: WISE-SoE Emissions.Emissions

WISE-SoE_Emissions.Emissions - CAS_106-46-7 - kg/a
type: Concept
notation: WISE-SoE_Emissions.Emissions - CAS_106-46-7 - kg/a
definition: The unit of measure for 'CAS_106-46-7' (1,4-dichlorobenzene) in WISE SoE - Emissions: Emissions table is 'kg/a'
status: valid
status modified: 2019-10-03
accepted date: 2019-10-03
in scheme: Definition of correct units for the observed determinands in the given WISE SoE DD tables
has determinand: CAS 106-46-7
has uom: kg.a-1
has table: WISE-SoE Emissions.Emissions

WISE-SoE_Emissions.Emissions - CAS_106-47-8 - kg/a
type: Concept
notation: WISE-SoE_Emissions.Emissions - CAS_106-47-8 - kg/a
definition: The unit of measure for 'CAS_106-47-8' (4-chloroaniline) in WISE SoE - Emissions: Emissions table is 'kg/a'
status: valid
status modified: 2019-10-03
accepted date: 2019-10-03
in scheme: Definition of correct units for the observed determinands in the given WISE SoE DD tables
has determinand: CAS 106-47-8
has uom: kg.a-1
has table: WISE-SoE Emissions.Emissions

WISE-SoE_Emissions.Emissions - CAS_106-48-9 - kg/a
type: Concept
notation: WISE-SoE_Emissions.Emissions - CAS_106-48-9 - kg/a
definition: The unit of measure for 'CAS_106-48-9' (4-chlorophenol) in WISE SoE - Emissions: Emissions table is 'kg/a'
status: valid
status modified: 2019-10-03
accepted date: 2019-10-03
in scheme: Definition of correct units for the observed determinands in the given WISE SoE DD tables
has determinand: CAS 106-48-9
has uom: kg.a-1
has table: WISE-SoE Emissions.Emissions

WISE-SoE_Emissions.Emissions - CAS_106-89-8 - kg/a
type: Concept
notation: WISE-SoE_Emissions.Emissions - CAS_106-89-8 - kg/a
definition: The unit of measure for 'CAS_106-89-8' (Epichlorohydrin) in WISE SoE - Emissions: Emissions table is 'kg/a'
status: valid
status modified: 2019-10-03
accepted date: 2019-10-03
in scheme: Definition of correct units for the observed determinands in the given WISE SoE DD tables
has determinand: CAS 106-89-8
has uom: kg.a-1
has table: WISE-SoE Emissions.Emissions

WISE-SoE_Emissions.Emissions - CAS_106-93-4 - kg/a
type: Concept
notation: WISE-SoE_Emissions.Emissions - CAS_106-93-4 - kg/a
definition: The unit of measure for 'CAS_106-93-4' (1,2-dibromoethane) in WISE SoE - Emissions: Emissions table is 'kg/a'
status: valid
status modified: 2019-10-03
accepted date: 2019-10-03
in scheme: Definition of correct units for the observed determinands in the given WISE SoE DD tables
has determinand: CAS 106-93-4
has uom: kg.a-1
has table: WISE-SoE Emissions.Emissions

WISE-SoE_Emissions.Emissions - CAS_10605-21-7 - kg/a
type: Concept
notation: WISE-SoE_Emissions.Emissions - CAS_10605-21-7 - kg/a
definition: The unit of measure for 'CAS_10605-21-7' (Carbendazim) in WISE SoE - Emissions: Emissions table is 'kg/a'
status: valid
status modified: 2019-10-03
accepted date: 2019-10-03
in scheme: Definition of correct units for the observed determinands in the given WISE SoE DD tables
has determinand: CAS 10605-21-7
has uom: kg.a-1
has table: WISE-SoE Emissions.Emissions

WISE-SoE_Emissions.Emissions - CAS_1066-51-9 - kg/a
type: Concept
notation: WISE-SoE_Emissions.Emissions - CAS_1066-51-9 - kg/a
definition: The unit of measure for 'CAS_1066-51-9' (Aminomethylphosphonic acid (AMPA)) in WISE SoE - Emissions: Emissions table is 'kg/a'
status: valid
status modified: 2019-10-03
accepted date: 2019-10-03
in scheme: Definition of correct units for the observed determinands in the given WISE SoE DD tables
has determinand: CAS 1066-51-9
has uom: kg.a-1
has table: WISE-SoE Emissions.Emissions

WISE-SoE_Emissions.Emissions - CAS_106700-29-2 - kg/a
type: Concept
notation: WISE-SoE_Emissions.Emissions - CAS_106700-29-2 - kg/a
definition: The unit of measure for 'CAS_106700-29-2' (Pethoxamid) in WISE SoE - Emissions: Emissions table is 'kg/a'
status: valid
status modified: 2019-10-03
accepted date: 2019-10-03
in scheme: Definition of correct units for the observed determinands in the given WISE SoE DD tables
has determinand: CAS 106700-29-2
has uom: kg.a-1
has table: WISE-SoE Emissions.Emissions

WISE-SoE_Emissions.Emissions - CAS_107-05-1 - kg/a
type: Concept
notation: WISE-SoE_Emissions.Emissions - CAS_107-05-1 - kg/a
definition: The unit of measure for 'CAS_107-05-1' (3-chloropropene) in WISE SoE - Emissions: Emissions table is 'kg/a'
status: valid
status modified: 2019-10-03
accepted date: 2019-10-03
in scheme: Definition of correct units for the observed determinands in the given WISE SoE DD tables
has determinand: CAS 107-05-1
has uom: kg.a-1
has table: WISE-SoE Emissions.Emissions

WISE-SoE_Emissions.Emissions - CAS_107-06-2 - kg/a
type: Concept
notation: WISE-SoE_Emissions.Emissions - CAS_107-06-2 - kg/a
definition: The unit of measure for 'CAS_107-06-2' (1,2-dichloroethane) in WISE SoE - Emissions: Emissions table is 'kg/a'
status: valid
status modified: 2019-10-03
accepted date: 2019-10-03
in scheme: Definition of correct units for the observed determinands in the given WISE SoE DD tables
has determinand: CAS 107-06-2
has uom: kg.a-1
has table: WISE-SoE Emissions.Emissions

WISE-SoE_Emissions.Emissions - CAS_107-07-3 - kg/a
type: Concept
notation: WISE-SoE_Emissions.Emissions - CAS_107-07-3 - kg/a
definition: The unit of measure for 'CAS_107-07-3' (2-Chloroethanol) in WISE SoE - Emissions: Emissions table is 'kg/a'
status: valid
status modified: 2019-10-03
accepted date: 2019-10-03
in scheme: Definition of correct units for the observed determinands in the given WISE SoE DD tables
has determinand: CAS 107-07-3
has uom: kg.a-1
has table: WISE-SoE Emissions.Emissions

WISE-SoE_Emissions.Emissions - CAS_107-13-1 - kg/a
type: Concept
notation: WISE-SoE_Emissions.Emissions - CAS_107-13-1 - kg/a
definition: The unit of measure for 'CAS_107-13-1' (Acrylonitrile) in WISE SoE - Emissions: Emissions table is 'kg/a'
status: valid
status modified: 2019-10-03
accepted date: 2019-10-03
in scheme: Definition of correct units for the observed determinands in the given WISE SoE DD tables
has determinand: CAS 107-13-1
has uom: kg.a-1
has table: WISE-SoE Emissions.Emissions

WISE-SoE_Emissions.Emissions - CAS_107-46-0 - kg/a
type: Concept
notation: WISE-SoE_Emissions.Emissions - CAS_107-46-0 - kg/a
definition: The unit of measure for 'CAS_107-46-0' (Hexamethyldisiloxane (HMDS)) in WISE SoE - Emissions: Emissions table is 'kg/a'
status: valid
status modified: 2019-10-03
accepted date: 2019-10-03
in scheme: Definition of correct units for the observed determinands in the given WISE SoE DD tables
has determinand: CAS 107-46-0
has uom: kg.a-1
has table: WISE-SoE Emissions.Emissions

WISE-SoE_Emissions.Emissions - CAS_1070-78-6 - kg/a
type: Concept
notation: WISE-SoE_Emissions.Emissions - CAS_1070-78-6 - kg/a
definition: The unit of measure for 'CAS_1070-78-6' (1,1,1,3-tetrachloropropane) in WISE SoE - Emissions: Emissions table is 'kg/a'
status: valid
status modified: 2019-10-03
accepted date: 2019-10-03
in scheme: Definition of correct units for the observed determinands in the given WISE SoE DD tables
has determinand: CAS 1070-78-6
has uom: kg.a-1
has table: WISE-SoE Emissions.Emissions

WISE-SoE_Emissions.Emissions - CAS_1071-83-6 - kg/a
type: Concept
notation: WISE-SoE_Emissions.Emissions - CAS_1071-83-6 - kg/a
definition: The unit of measure for 'CAS_1071-83-6' (Glyphosate) in WISE SoE - Emissions: Emissions table is 'kg/a'
status: valid
status modified: 2019-10-03
accepted date: 2019-10-03
in scheme: Definition of correct units for the observed determinands in the given WISE SoE DD tables
has determinand: CAS 1071-83-6
has uom: kg.a-1
has table: WISE-SoE Emissions.Emissions

WISE-SoE_Emissions.Emissions - CAS_107534-96-3 - kg/a
type: Concept
notation: WISE-SoE_Emissions.Emissions - CAS_107534-96-3 - kg/a
definition: The unit of measure for 'CAS_107534-96-3' (Tebuconazole) in WISE SoE - Emissions: Emissions table is 'kg/a'
status: valid
status modified: 2019-10-03
accepted date: 2019-10-03
in scheme: Definition of correct units for the observed determinands in the given WISE SoE DD tables
has determinand: CAS 107534-96-3
has uom: kg.a-1
has table: WISE-SoE Emissions.Emissions

WISE-SoE_Emissions.Emissions - CAS_108-38-3 - kg/a
type: Concept
notation: WISE-SoE_Emissions.Emissions - CAS_108-38-3 - kg/a
definition: The unit of measure for 'CAS_108-38-3' (M-xylene) in WISE SoE - Emissions: Emissions table is 'kg/a'
status: valid
status modified: 2019-10-03
accepted date: 2019-10-03
in scheme: Definition of correct units for the observed determinands in the given WISE SoE DD tables
has determinand: CAS 108-38-3
has uom: kg.a-1
has table: WISE-SoE Emissions.Emissions

WISE-SoE_Emissions.Emissions - CAS_108-41-8 - kg/a
type: Concept
notation: WISE-SoE_Emissions.Emissions - CAS_108-41-8 - kg/a
definition: The unit of measure for 'CAS_108-41-8' (3-chlorotoluene) in WISE SoE - Emissions: Emissions table is 'kg/a'
status: valid
status modified: 2019-10-03
accepted date: 2019-10-03
in scheme: Definition of correct units for the observed determinands in the given WISE SoE DD tables
has determinand: CAS 108-41-8
has uom: kg.a-1
has table: WISE-SoE Emissions.Emissions

WISE-SoE_Emissions.Emissions - CAS_108-42-9 - kg/a
type: Concept
notation: WISE-SoE_Emissions.Emissions - CAS_108-42-9 - kg/a
definition: The unit of measure for 'CAS_108-42-9' (3-chloroaniline) in WISE SoE - Emissions: Emissions table is 'kg/a'
status: valid
status modified: 2019-10-03
accepted date: 2019-10-03
in scheme: Definition of correct units for the observed determinands in the given WISE SoE DD tables
has determinand: CAS 108-42-9
has uom: kg.a-1
has table: WISE-SoE Emissions.Emissions

WISE-SoE_Emissions.Emissions - CAS_108-43-0 - kg/a
type: Concept
notation: WISE-SoE_Emissions.Emissions - CAS_108-43-0 - kg/a
definition: The unit of measure for 'CAS_108-43-0' (3-chlorophenol) in WISE SoE - Emissions: Emissions table is 'kg/a'
status: valid
status modified: 2019-10-03
accepted date: 2019-10-03
in scheme: Definition of correct units for the observed determinands in the given WISE SoE DD tables
has determinand: CAS 108-43-0
has uom: kg.a-1
has table: WISE-SoE Emissions.Emissions

WISE-SoE_Emissions.Emissions - CAS_108-60-1 - kg/a
type: Concept
notation: WISE-SoE_Emissions.Emissions - CAS_108-60-1 - kg/a
definition: The unit of measure for 'CAS_108-60-1' (Bis(2-chloro-1-methylethyl) ether) in WISE SoE - Emissions: Emissions table is 'kg/a'
status: valid
status modified: 2019-10-03
accepted date: 2019-10-03
in scheme: Definition of correct units for the observed determinands in the given WISE SoE DD tables
has determinand: CAS 108-60-1
has uom: kg.a-1
has table: WISE-SoE Emissions.Emissions

WISE-SoE_Emissions.Emissions - CAS_108-67-8 - kg/a
type: Concept
notation: WISE-SoE_Emissions.Emissions - CAS_108-67-8 - kg/a
definition: The unit of measure for 'CAS_108-67-8' (1,3,5-trimethylbenzene) in WISE SoE - Emissions: Emissions table is 'kg/a'
status: valid
status modified: 2019-10-03
accepted date: 2019-10-03
in scheme: Definition of correct units for the observed determinands in the given WISE SoE DD tables
has determinand: CAS 108-67-8
has uom: kg.a-1
has table: WISE-SoE Emissions.Emissions

WISE-SoE_Emissions.Emissions - CAS_108-68-9 - kg/a
type: Concept
notation: WISE-SoE_Emissions.Emissions - CAS_108-68-9 - kg/a
definition: The unit of measure for 'CAS_108-68-9' (3,5-dimethyl-phenol) in WISE SoE - Emissions: Emissions table is 'kg/a'
status: valid
status modified: 2019-10-03
accepted date: 2019-10-03
in scheme: Definition of correct units for the observed determinands in the given WISE SoE DD tables
has determinand: CAS 108-68-9
has uom: kg.a-1
has table: WISE-SoE Emissions.Emissions

WISE-SoE_Emissions.Emissions - CAS_108-70-3 - kg/a
type: Concept
notation: WISE-SoE_Emissions.Emissions - CAS_108-70-3 - kg/a
definition: The unit of measure for 'CAS_108-70-3' (1,3,5-trichlorobenzene) in WISE SoE - Emissions: Emissions table is 'kg/a'
status: valid
status modified: 2019-10-03
accepted date: 2019-10-03
in scheme: Definition of correct units for the observed determinands in the given WISE SoE DD tables
has determinand: CAS 108-70-3
has uom: kg.a-1
has table: WISE-SoE Emissions.Emissions

WISE-SoE_Emissions.Emissions - CAS_108-86-1 - kg/a
type: Concept
notation: WISE-SoE_Emissions.Emissions - CAS_108-86-1 - kg/a
definition: The unit of measure for 'CAS_108-86-1' (Bromobenzene) in WISE SoE - Emissions: Emissions table is 'kg/a'
status: valid
status modified: 2019-10-03
accepted date: 2019-10-03
in scheme: Definition of correct units for the observed determinands in the given WISE SoE DD tables
has determinand: CAS 108-86-1
has uom: kg.a-1
has table: WISE-SoE Emissions.Emissions

WISE-SoE_Emissions.Emissions - CAS_108-88-3 - kg/a
type: Concept
notation: WISE-SoE_Emissions.Emissions - CAS_108-88-3 - kg/a
definition: The unit of measure for 'CAS_108-88-3' (Toluene) in WISE SoE - Emissions: Emissions table is 'kg/a'
status: valid
status modified: 2019-10-03
accepted date: 2019-10-03
in scheme: Definition of correct units for the observed determinands in the given WISE SoE DD tables
has determinand: CAS 108-88-3
has uom: kg.a-1
has table: WISE-SoE Emissions.Emissions

WISE-SoE_Emissions.Emissions - CAS_108-90-7 - kg/a
type: Concept
notation: WISE-SoE_Emissions.Emissions - CAS_108-90-7 - kg/a
definition: The unit of measure for 'CAS_108-90-7' (Chlorobenzene) in WISE SoE - Emissions: Emissions table is 'kg/a'
status: valid
status modified: 2019-10-03
accepted date: 2019-10-03
in scheme: Definition of correct units for the observed determinands in the given WISE SoE DD tables
has determinand: CAS 108-90-7
has uom: kg.a-1
has table: WISE-SoE Emissions.Emissions

WISE-SoE_Emissions.Emissions - CAS_108-95-2 - kg/a
type: Concept
notation: WISE-SoE_Emissions.Emissions - CAS_108-95-2 - kg/a
definition: The unit of measure for 'CAS_108-95-2' (Phenol) in WISE SoE - Emissions: Emissions table is 'kg/a'
status: valid
status modified: 2019-10-03
accepted date: 2019-10-03
in scheme: Definition of correct units for the observed determinands in the given WISE SoE DD tables
has determinand: CAS 108-95-2
has uom: kg.a-1
has table: WISE-SoE Emissions.Emissions

WISE-SoE_Emissions.Emissions - CAS_109-89-7 - kg/a
type: Concept
notation: WISE-SoE_Emissions.Emissions - CAS_109-89-7 - kg/a
definition: The unit of measure for 'CAS_109-89-7' (Diethylamine) in WISE SoE - Emissions: Emissions table is 'kg/a'
status: valid
status modified: 2019-10-03
accepted date: 2019-10-03
in scheme: Definition of correct units for the observed determinands in the given WISE SoE DD tables
has determinand: CAS 109-89-7
has uom: kg.a-1
has table: WISE-SoE Emissions.Emissions

WISE-SoE_Emissions.Emissions - CAS_110488-70-5 - kg/a
type: Concept
notation: WISE-SoE_Emissions.Emissions - CAS_110488-70-5 - kg/a
definition: The unit of measure for 'CAS_110488-70-5' (Dimethomorph) in WISE SoE - Emissions: Emissions table is 'kg/a'
status: valid
status modified: 2019-10-03
accepted date: 2019-10-03
in scheme: Definition of correct units for the observed determinands in the given WISE SoE DD tables
has determinand: CAS 110488-70-5
has uom: kg.a-1
has table: WISE-SoE Emissions.Emissions

WISE-SoE_Emissions.Emissions - CAS_1113-02-6 - kg/a
type: Concept
notation: WISE-SoE_Emissions.Emissions - CAS_1113-02-6 - kg/a
definition: The unit of measure for 'CAS_1113-02-6' (Omethoate) in WISE SoE - Emissions: Emissions table is 'kg/a'
status: valid
status modified: 2019-10-03
accepted date: 2019-10-03
in scheme: Definition of correct units for the observed determinands in the given WISE SoE DD tables
has determinand: CAS 1113-02-6
has uom: kg.a-1
has table: WISE-SoE Emissions.Emissions

WISE-SoE_Emissions.Emissions - CAS_111988-49-9 - kg/a
type: Concept
notation: WISE-SoE_Emissions.Emissions - CAS_111988-49-9 - kg/a
definition: The unit of measure for 'CAS_111988-49-9' (Thiacloprid) in WISE SoE - Emissions: Emissions table is 'kg/a'
status: valid
status modified: 2019-10-03
accepted date: 2019-10-03
in scheme: Definition of correct units for the observed determinands in the given WISE SoE DD tables
has determinand: CAS 111988-49-9
has uom: kg.a-1
has table: WISE-SoE Emissions.Emissions

WISE-SoE_Emissions.Emissions - CAS_111991-09-4 - kg/a
type: Concept
notation: WISE-SoE_Emissions.Emissions - CAS_111991-09-4 - kg/a
definition: The unit of measure for 'CAS_111991-09-4' (Nicosulfuron) in WISE SoE - Emissions: Emissions table is 'kg/a'
status: valid
status modified: 2019-10-03
accepted date: 2019-10-03
in scheme: Definition of correct units for the observed determinands in the given WISE SoE DD tables
has determinand: CAS 111991-09-4
has uom: kg.a-1
has table: WISE-SoE Emissions.Emissions

WISE-SoE_Emissions.Emissions - CAS_112410-23-8 - kg/a
type: Concept
notation: WISE-SoE_Emissions.Emissions - CAS_112410-23-8 - kg/a
definition: The unit of measure for 'CAS_112410-23-8' (Tebufenozide) in WISE SoE - Emissions: Emissions table is 'kg/a'
status: valid
status modified: 2019-10-03
accepted date: 2019-10-03
in scheme: Definition of correct units for the observed determinands in the given WISE SoE DD tables
has determinand: CAS 112410-23-8
has uom: kg.a-1
has table: WISE-SoE Emissions.Emissions

WISE-SoE_Emissions.Emissions - CAS_113096-99-4 - kg/a
type: Concept
notation: WISE-SoE_Emissions.Emissions - CAS_113096-99-4 - kg/a
definition: The unit of measure for 'CAS_113096-99-4' (Cyproconazole) in WISE SoE - Emissions: Emissions table is 'kg/a'
status: valid
status modified: 2019-10-03
accepted date: 2019-10-03
in scheme: Definition of correct units for the observed determinands in the given WISE SoE DD tables
has determinand: CAS 113096-99-4
has uom: kg.a-1
has table: WISE-SoE Emissions.Emissions

WISE-SoE_Emissions.Emissions - CAS_114-07-8 - kg/a
type: Concept
notation: WISE-SoE_Emissions.Emissions - CAS_114-07-8 - kg/a
definition: The unit of measure for 'CAS_114-07-8' (Erythromycin) in WISE SoE - Emissions: Emissions table is 'kg/a'
status: valid
status modified: 2019-10-03
accepted date: 2019-10-03
in scheme: Definition of correct units for the observed determinands in the given WISE SoE DD tables
has determinand: CAS 114-07-8
has uom: kg.a-1
has table: WISE-SoE Emissions.Emissions

WISE-SoE_Emissions.Emissions - CAS_114-26-1 - kg/a
type: Concept
notation: WISE-SoE_Emissions.Emissions - CAS_114-26-1 - kg/a
definition: The unit of measure for 'CAS_114-26-1' (Propoxur) in WISE SoE - Emissions: Emissions table is 'kg/a'
status: valid
status modified: 2019-10-03
accepted date: 2019-10-03
in scheme: Definition of correct units for the observed determinands in the given WISE SoE DD tables
has determinand: CAS 114-26-1
has uom: kg.a-1
has table: WISE-SoE Emissions.Emissions

WISE-SoE_Emissions.Emissions - CAS_115-29-7 - kg/a
type: Concept
notation: WISE-SoE_Emissions.Emissions - CAS_115-29-7 - kg/a
definition: The unit of measure for 'CAS_115-29-7' (Endosulfan) in WISE SoE - Emissions: Emissions table is 'kg/a'
status: valid
status modified: 2019-10-03
accepted date: 2019-10-03
in scheme: Definition of correct units for the observed determinands in the given WISE SoE DD tables
has determinand: CAS 115-29-7
has uom: kg.a-1
has table: WISE-SoE Emissions.Emissions

WISE-SoE_Emissions.Emissions - CAS_115-32-2 - kg/a
type: Concept
notation: WISE-SoE_Emissions.Emissions - CAS_115-32-2 - kg/a
definition: The unit of measure for 'CAS_115-32-2' (Dicofol) in WISE SoE - Emissions: Emissions table is 'kg/a'
status: valid
status modified: 2019-10-03
accepted date: 2019-10-03
in scheme: Definition of correct units for the observed determinands in the given WISE SoE DD tables
has determinand: CAS 115-32-2
has uom: kg.a-1
has table: WISE-SoE Emissions.Emissions

WISE-SoE_Emissions.Emissions - CAS_116-06-3 - kg/a
type: Concept
notation: WISE-SoE_Emissions.Emissions - CAS_116-06-3 - kg/a
definition: The unit of measure for 'CAS_116-06-3' (Aldicarb) in WISE SoE - Emissions: Emissions table is 'kg/a'
status: valid
status modified: 2019-10-03
accepted date: 2019-10-03
in scheme: Definition of correct units for the observed determinands in the given WISE SoE DD tables
has determinand: CAS 116-06-3
has uom: kg.a-1
has table: WISE-SoE Emissions.Emissions

WISE-SoE_Emissions.Emissions - CAS_116-29-0 - kg/a
type: Concept
notation: WISE-SoE_Emissions.Emissions - CAS_116-29-0 - kg/a
definition: The unit of measure for 'CAS_116-29-0' (Teradifon) in WISE SoE - Emissions: Emissions table is 'kg/a'
status: valid
status modified: 2019-10-03
accepted date: 2019-10-03
in scheme: Definition of correct units for the observed determinands in the given WISE SoE DD tables
has determinand: CAS 116-29-0
has uom: kg.a-1
has table: WISE-SoE Emissions.Emissions

WISE-SoE_Emissions.Emissions - CAS_1163-19-5 - kg/a
type: Concept
notation: WISE-SoE_Emissions.Emissions - CAS_1163-19-5 - kg/a
definition: The unit of measure for 'CAS_1163-19-5' (Bis(pentabromophenyl) ether) in WISE SoE - Emissions: Emissions table is 'kg/a'
status: valid
status modified: 2019-10-03
accepted date: 2019-10-03
in scheme: Definition of correct units for the observed determinands in the given WISE SoE DD tables
has determinand: CAS 1163-19-5
has uom: kg.a-1
has table: WISE-SoE Emissions.Emissions

WISE-SoE_Emissions.Emissions - CAS_117-81-7 - kg/a
type: Concept
notation: WISE-SoE_Emissions.Emissions - CAS_117-81-7 - kg/a
definition: The unit of measure for 'CAS_117-81-7' (Di(2-ethylhexyl)phthalate (DEHP)) in WISE SoE - Emissions: Emissions table is 'kg/a'
status: valid
status modified: 2019-10-03
accepted date: 2019-10-03
in scheme: Definition of correct units for the observed determinands in the given WISE SoE DD tables
has determinand: CAS 117-81-7
has uom: kg.a-1
has table: WISE-SoE Emissions.Emissions

WISE-SoE_Emissions.Emissions - CAS_118-74-1 - kg/a
type: Concept
notation: WISE-SoE_Emissions.Emissions - CAS_118-74-1 - kg/a
definition: The unit of measure for 'CAS_118-74-1' (Hexachlorobenzene) in WISE SoE - Emissions: Emissions table is 'kg/a'
status: valid
status modified: 2019-10-03
accepted date: 2019-10-03
in scheme: Definition of correct units for the observed determinands in the given WISE SoE DD tables
has determinand: CAS 118-74-1
has uom: kg.a-1
has table: WISE-SoE Emissions.Emissions

WISE-SoE_Emissions.Emissions - CAS_118-96-7 - kg/a
type: Concept
notation: WISE-SoE_Emissions.Emissions - CAS_118-96-7 - kg/a
definition: The unit of measure for 'CAS_118-96-7' (2,4,6-trinitrotoluene) in WISE SoE - Emissions: Emissions table is 'kg/a'
status: valid
status modified: 2019-10-03
accepted date: 2019-10-03
in scheme: Definition of correct units for the observed determinands in the given WISE SoE DD tables
has determinand: CAS 118-96-7
has uom: kg.a-1
has table: WISE-SoE Emissions.Emissions

WISE-SoE_Emissions.Emissions - CAS_118134-30-8 - kg/a
type: Concept
notation: WISE-SoE_Emissions.Emissions - CAS_118134-30-8 - kg/a
definition: The unit of measure for 'CAS_118134-30-8' (Spiroxamine) in WISE SoE - Emissions: Emissions table is 'kg/a'
status: valid
status modified: 2019-10-03
accepted date: 2019-10-03
in scheme: Definition of correct units for the observed determinands in the given WISE SoE DD tables
has determinand: CAS 118134-30-8
has uom: kg.a-1
has table: WISE-SoE Emissions.Emissions

WISE-SoE_Emissions.Emissions - CAS_1194-65-6 - kg/a
type: Concept
notation: WISE-SoE_Emissions.Emissions - CAS_1194-65-6 - kg/a
definition: The unit of measure for 'CAS_1194-65-6' (Dichlobenil) in WISE SoE - Emissions: Emissions table is 'kg/a'
status: valid
status modified: 2019-10-03
accepted date: 2019-10-03
in scheme: Definition of correct units for the observed determinands in the given WISE SoE DD tables
has determinand: CAS 1194-65-6
has uom: kg.a-1
has table: WISE-SoE Emissions.Emissions

WISE-SoE_Emissions.Emissions - CAS_120-12-7 - kg/a
type: Concept
notation: WISE-SoE_Emissions.Emissions - CAS_120-12-7 - kg/a
definition: The unit of measure for 'CAS_120-12-7' (Anthracene) in WISE SoE - Emissions: Emissions table is 'kg/a'
status: valid
status modified: 2019-10-03
accepted date: 2019-10-03
in scheme: Definition of correct units for the observed determinands in the given WISE SoE DD tables
has determinand: CAS 120-12-7
has uom: kg.a-1
has table: WISE-SoE Emissions.Emissions

WISE-SoE_Emissions.Emissions - CAS_120-36-5 - kg/a
type: Concept
notation: WISE-SoE_Emissions.Emissions - CAS_120-36-5 - kg/a
definition: The unit of measure for 'CAS_120-36-5' (Dichlorprop (2,4-DP)) in WISE SoE - Emissions: Emissions table is 'kg/a'
status: valid
status modified: 2019-10-03
accepted date: 2019-10-03
in scheme: Definition of correct units for the observed determinands in the given WISE SoE DD tables
has determinand: CAS 120-36-5
has uom: kg.a-1
has table: WISE-SoE Emissions.Emissions

WISE-SoE_Emissions.Emissions - CAS_120-82-1 - kg/a
type: Concept
notation: WISE-SoE_Emissions.Emissions - CAS_120-82-1 - kg/a
definition: The unit of measure for 'CAS_120-82-1' (1,2,4-trichlorobenzene) in WISE SoE - Emissions: Emissions table is 'kg/a'
status: valid
status modified: 2019-10-03
accepted date: 2019-10-03
in scheme: Definition of correct units for the observed determinands in the given WISE SoE DD tables
has determinand: CAS 120-82-1
has uom: kg.a-1
has table: WISE-SoE Emissions.Emissions

WISE-SoE_Emissions.Emissions - CAS_120-83-2 - kg/a
type: Concept
notation: WISE-SoE_Emissions.Emissions - CAS_120-83-2 - kg/a
definition: The unit of measure for 'CAS_120-83-2' (2,4-dichlorophenol) in WISE SoE - Emissions: Emissions table is 'kg/a'
status: valid
status modified: 2019-10-03
accepted date: 2019-10-03
in scheme: Definition of correct units for the observed determinands in the given WISE SoE DD tables
has determinand: CAS 120-83-2
has uom: kg.a-1
has table: WISE-SoE Emissions.Emissions

WISE-SoE_Emissions.Emissions - CAS_12002-48-1 - kg/a
type: Concept
notation: WISE-SoE_Emissions.Emissions - CAS_12002-48-1 - kg/a
definition: The unit of measure for 'CAS_12002-48-1' (Trichlorobenzenes (all isomers)) in WISE SoE - Emissions: Emissions table is 'kg/a'
status: valid
status modified: 2019-10-03
accepted date: 2019-10-03
in scheme: Definition of correct units for the observed determinands in the given WISE SoE DD tables
has determinand: CAS 12002-48-1
has uom: kg.a-1
has table: WISE-SoE Emissions.Emissions

WISE-SoE_Emissions.Emissions - CAS_120923-37-7 - kg/a
type: Concept
notation: WISE-SoE_Emissions.Emissions - CAS_120923-37-7 - kg/a
definition: The unit of measure for 'CAS_120923-37-7' (Amidosulfuron) in WISE SoE - Emissions: Emissions table is 'kg/a'
status: valid
status modified: 2019-10-03
accepted date: 2019-10-03
in scheme: Definition of correct units for the observed determinands in the given WISE SoE DD tables
has determinand: CAS 120923-37-7
has uom: kg.a-1
has table: WISE-SoE Emissions.Emissions

WISE-SoE_Emissions.Emissions - CAS_120928-09-8 - kg/a
type: Concept
notation: WISE-SoE_Emissions.Emissions - CAS_120928-09-8 - kg/a
definition: The unit of measure for 'CAS_120928-09-8' (Fenazaquin) in WISE SoE - Emissions: Emissions table is 'kg/a'
status: valid
status modified: 2019-10-03
accepted date: 2019-10-03
in scheme: Definition of correct units for the observed determinands in the given WISE SoE DD tables
has determinand: CAS 120928-09-8
has uom: kg.a-1
has table: WISE-SoE Emissions.Emissions

WISE-SoE_Emissions.Emissions - CAS_121-14-2 - kg/a
type: Concept
notation: WISE-SoE_Emissions.Emissions - CAS_121-14-2 - kg/a
definition: The unit of measure for 'CAS_121-14-2' (2,4-dinitrotoluene) in WISE SoE - Emissions: Emissions table is 'kg/a'
status: valid
status modified: 2019-10-03
accepted date: 2019-10-03
in scheme: Definition of correct units for the observed determinands in the given WISE SoE DD tables
has determinand: CAS 121-14-2
has uom: kg.a-1
has table: WISE-SoE Emissions.Emissions

WISE-SoE_Emissions.Emissions - CAS_121-73-3 - kg/a
type: Concept
notation: WISE-SoE_Emissions.Emissions - CAS_121-73-3 - kg/a
definition: The unit of measure for 'CAS_121-73-3' (1-chloro-3-nitrobenzene) in WISE SoE - Emissions: Emissions table is 'kg/a'
status: valid
status modified: 2019-10-03
accepted date: 2019-10-03
in scheme: Definition of correct units for the observed determinands in the given WISE SoE DD tables
has determinand: CAS 121-73-3
has uom: kg.a-1
has table: WISE-SoE Emissions.Emissions

WISE-SoE_Emissions.Emissions - CAS_121-75-5 - kg/a
type: Concept
notation: WISE-SoE_Emissions.Emissions - CAS_121-75-5 - kg/a
definition: The unit of measure for 'CAS_121-75-5' (Malathion) in WISE SoE - Emissions: Emissions table is 'kg/a'
status: valid
status modified: 2019-10-03
accepted date: 2019-10-03
in scheme: Definition of correct units for the observed determinands in the given WISE SoE DD tables
has determinand: CAS 121-75-5
has uom: kg.a-1
has table: WISE-SoE Emissions.Emissions

WISE-SoE_Emissions.Emissions - CAS_121-86-8 - kg/a
type: Concept
notation: WISE-SoE_Emissions.Emissions - CAS_121-86-8 - kg/a
definition: The unit of measure for 'CAS_121-86-8' (2-chloro-4-nitrotoluene) in WISE SoE - Emissions: Emissions table is 'kg/a'
status: valid
status modified: 2019-10-03
accepted date: 2019-10-03
in scheme: Definition of correct units for the observed determinands in the given WISE SoE DD tables
has determinand: CAS 121-86-8
has uom: kg.a-1
has table: WISE-SoE Emissions.Emissions

WISE-SoE_Emissions.Emissions - CAS_121552-61-2 - kg/a
type: Concept
notation: WISE-SoE_Emissions.Emissions - CAS_121552-61-2 - kg/a
definition: The unit of measure for 'CAS_121552-61-2' (Cyprodinil) in WISE SoE - Emissions: Emissions table is 'kg/a'
status: valid
status modified: 2019-10-03
accepted date: 2019-10-03
in scheme: Definition of correct units for the observed determinands in the given WISE SoE DD tables
has determinand: CAS 121552-61-2
has uom: kg.a-1
has table: WISE-SoE Emissions.Emissions

WISE-SoE_Emissions.Emissions - CAS_121776-33-8 - kg/a
type: Concept
notation: WISE-SoE_Emissions.Emissions - CAS_121776-33-8 - kg/a
definition: The unit of measure for 'CAS_121776-33-8' (Furilazole) in WISE SoE - Emissions: Emissions table is 'kg/a'
status: valid
status modified: 2019-10-03
accepted date: 2019-10-03
in scheme: Definition of correct units for the observed determinands in the given WISE SoE DD tables
has determinand: CAS 121776-33-8
has uom: kg.a-1
has table: WISE-SoE Emissions.Emissions

WISE-SoE_Emissions.Emissions - CAS_122-14-5 - kg/a
type: Concept
notation: WISE-SoE_Emissions.Emissions - CAS_122-14-5 - kg/a
definition: The unit of measure for 'CAS_122-14-5' (Fenitrothion) in WISE SoE - Emissions: Emissions table is 'kg/a'
status: valid
status modified: 2019-10-03
accepted date: 2019-10-03
in scheme: Definition of correct units for the observed determinands in the given WISE SoE DD tables
has determinand: CAS 122-14-5
has uom: kg.a-1
has table: WISE-SoE Emissions.Emissions

WISE-SoE_Emissions.Emissions - CAS_122-34-9 - kg/a
type: Concept
notation: WISE-SoE_Emissions.Emissions - CAS_122-34-9 - kg/a
definition: The unit of measure for 'CAS_122-34-9' (Simazine) in WISE SoE - Emissions: Emissions table is 'kg/a'
status: valid
status modified: 2019-10-03
accepted date: 2019-10-03
in scheme: Definition of correct units for the observed determinands in the given WISE SoE DD tables
has determinand: CAS 122-34-9
has uom: kg.a-1
has table: WISE-SoE Emissions.Emissions

WISE-SoE_Emissions.Emissions - CAS_122-39-4 - kg/a
type: Concept
notation: WISE-SoE_Emissions.Emissions - CAS_122-39-4 - kg/a
definition: The unit of measure for 'CAS_122-39-4' (Diphenylamine) in WISE SoE - Emissions: Emissions table is 'kg/a'
status: valid
status modified: 2019-10-03
accepted date: 2019-10-03
in scheme: Definition of correct units for the observed determinands in the given WISE SoE DD tables
has determinand: CAS 122-39-4
has uom: kg.a-1
has table: WISE-SoE Emissions.Emissions

WISE-SoE_Emissions.Emissions - CAS_122-88-3 - kg/a
type: Concept
notation: WISE-SoE_Emissions.Emissions - CAS_122-88-3 - kg/a
definition: The unit of measure for 'CAS_122-88-3' (4-Chlorophenoxyacetic acid (CPA 4)) in WISE SoE - Emissions: Emissions table is 'kg/a'
status: valid
status modified: 2019-10-03
accepted date: 2019-10-03
in scheme: Definition of correct units for the observed determinands in the given WISE SoE DD tables
has determinand: CAS 122-88-3
has uom: kg.a-1
has table: WISE-SoE Emissions.Emissions

WISE-SoE_Emissions.Emissions - CAS_122931-48-0 - kg/a
type: Concept
notation: WISE-SoE_Emissions.Emissions - CAS_122931-48-0 - kg/a
definition: The unit of measure for 'CAS_122931-48-0' (Rimsulfuron) in WISE SoE - Emissions: Emissions table is 'kg/a'
status: valid
status modified: 2019-10-03
accepted date: 2019-10-03
in scheme: Definition of correct units for the observed determinands in the given WISE SoE DD tables
has determinand: CAS 122931-48-0
has uom: kg.a-1
has table: WISE-SoE Emissions.Emissions

WISE-SoE_Emissions.Emissions - CAS_123-33-1 - kg/a
type: Concept
notation: WISE-SoE_Emissions.Emissions - CAS_123-33-1 - kg/a
definition: The unit of measure for 'CAS_123-33-1' (Maleinhydrazid) in WISE SoE - Emissions: Emissions table is 'kg/a'
status: valid
status modified: 2019-10-03
accepted date: 2019-10-03
in scheme: Definition of correct units for the observed determinands in the given WISE SoE DD tables
has determinand: CAS 123-33-1
has uom: kg.a-1
has table: WISE-SoE Emissions.Emissions

WISE-SoE_Emissions.Emissions - CAS_123-91-1 - kg/a
type: Concept
notation: WISE-SoE_Emissions.Emissions - CAS_123-91-1 - kg/a
definition: The unit of measure for 'CAS_123-91-1' (1,4-dioxane) in WISE SoE - Emissions: Emissions table is 'kg/a'
status: valid
status modified: 2019-10-03
accepted date: 2019-10-03
in scheme: Definition of correct units for the observed determinands in the given WISE SoE DD tables
has determinand: CAS 123-91-1
has uom: kg.a-1
has table: WISE-SoE Emissions.Emissions

WISE-SoE_Emissions.Emissions - CAS_1231244-60-2 - kg/a
type: Concept
notation: WISE-SoE_Emissions.Emissions - CAS_1231244-60-2 - kg/a
definition: The unit of measure for 'CAS_1231244-60-2' (Metazachlor OA) in WISE SoE - Emissions: Emissions table is 'kg/a'
status: valid
status modified: 2019-10-03
accepted date: 2019-10-03
in scheme: Definition of correct units for the observed determinands in the given WISE SoE DD tables
has determinand: CAS 1231244-60-2
has uom: kg.a-1
has table: WISE-SoE Emissions.Emissions

WISE-SoE_Emissions.Emissions - CAS_124-40-3 - kg/a
type: Concept
notation: WISE-SoE_Emissions.Emissions - CAS_124-40-3 - kg/a
definition: The unit of measure for 'CAS_124-40-3' (Dimethylamine) in WISE SoE - Emissions: Emissions table is 'kg/a'
status: valid
status modified: 2019-10-03
accepted date: 2019-10-03
in scheme: Definition of correct units for the observed determinands in the given WISE SoE DD tables
has determinand: CAS 124-40-3
has uom: kg.a-1
has table: WISE-SoE Emissions.Emissions

WISE-SoE_Emissions.Emissions - CAS_124-48-1 - kg/a
type: Concept
notation: WISE-SoE_Emissions.Emissions - CAS_124-48-1 - kg/a
definition: The unit of measure for 'CAS_124-48-1' (Dibromochlorometane) in WISE SoE - Emissions: Emissions table is 'kg/a'
status: valid
status modified: 2019-10-03
accepted date: 2019-10-03
in scheme: Definition of correct units for the observed determinands in the given WISE SoE DD tables
has determinand: CAS 124-48-1
has uom: kg.a-1
has table: WISE-SoE Emissions.Emissions

WISE-SoE_Emissions.Emissions - CAS_124495-18-7 - kg/a
type: Concept
notation: WISE-SoE_Emissions.Emissions - CAS_124495-18-7 - kg/a
definition: The unit of measure for 'CAS_124495-18-7' (Quinoxyfen) in WISE SoE - Emissions: Emissions table is 'kg/a'
status: valid
status modified: 2019-10-03
accepted date: 2019-10-03
in scheme: Definition of correct units for the observed determinands in the given WISE SoE DD tables
has determinand: CAS 124495-18-7
has uom: kg.a-1
has table: WISE-SoE Emissions.Emissions

WISE-SoE_Emissions.Emissions - CAS_126-73-8 - kg/a
type: Concept
notation: WISE-SoE_Emissions.Emissions - CAS_126-73-8 - kg/a
definition: The unit of measure for 'CAS_126-73-8' (Tributyl phosphate) in WISE SoE - Emissions: Emissions table is 'kg/a'
status: valid
status modified: 2019-10-03
accepted date: 2019-10-03
in scheme: Definition of correct units for the observed determinands in the given WISE SoE DD tables
has determinand: CAS 126-73-8
has uom: kg.a-1
has table: WISE-SoE Emissions.Emissions

WISE-SoE_Emissions.Emissions - CAS_126-75-0 - kg/a
type: Concept
notation: WISE-SoE_Emissions.Emissions - CAS_126-75-0 - kg/a
definition: The unit of measure for 'CAS_126-75-0' (Demeton-S) in WISE SoE - Emissions: Emissions table is 'kg/a'
status: valid
status modified: 2019-10-03
accepted date: 2019-10-03
in scheme: Definition of correct units for the observed determinands in the given WISE SoE DD tables
has determinand: CAS 126-75-0
has uom: kg.a-1
has table: WISE-SoE Emissions.Emissions

WISE-SoE_Emissions.Emissions - CAS_126-99-8 - kg/a
type: Concept
notation: WISE-SoE_Emissions.Emissions - CAS_126-99-8 - kg/a
definition: The unit of measure for 'CAS_126-99-8' (2-Chloro-1,3-butadiene) in WISE SoE - Emissions: Emissions table is 'kg/a'
status: valid
status modified: 2019-10-03
accepted date: 2019-10-03
in scheme: Definition of correct units for the observed determinands in the given WISE SoE DD tables
has determinand: CAS 126-99-8
has uom: kg.a-1
has table: WISE-SoE Emissions.Emissions

WISE-SoE_Emissions.Emissions - CAS_126535-15-7 - kg/a
type: Concept
notation: WISE-SoE_Emissions.Emissions - CAS_126535-15-7 - kg/a
definition: The unit of measure for 'CAS_126535-15-7' (Triflusulfuron-methyl) in WISE SoE - Emissions: Emissions table is 'kg/a'
status: valid
status modified: 2019-10-03
accepted date: 2019-10-03
in scheme: Definition of correct units for the observed determinands in the given WISE SoE DD tables
has determinand: CAS 126535-15-7
has uom: kg.a-1
has table: WISE-SoE Emissions.Emissions

WISE-SoE_Emissions.Emissions - CAS_126833-17-8 - kg/a
type: Concept
notation: WISE-SoE_Emissions.Emissions - CAS_126833-17-8 - kg/a
definition: The unit of measure for 'CAS_126833-17-8' (Fenhexamid) in WISE SoE - Emissions: Emissions table is 'kg/a'
status: valid
status modified: 2019-10-03
accepted date: 2019-10-03
in scheme: Definition of correct units for the observed determinands in the given WISE SoE DD tables
has determinand: CAS 126833-17-8
has uom: kg.a-1
has table: WISE-SoE Emissions.Emissions

WISE-SoE_Emissions.Emissions - CAS_127-18-4 - kg/a
type: Concept
notation: WISE-SoE_Emissions.Emissions - CAS_127-18-4 - kg/a
definition: The unit of measure for 'CAS_127-18-4' (Tetrachloroethylene) in WISE SoE - Emissions: Emissions table is 'kg/a'
status: valid
status modified: 2019-10-03
accepted date: 2019-10-03
in scheme: Definition of correct units for the observed determinands in the given WISE SoE DD tables
has determinand: CAS 127-18-4
has uom: kg.a-1
has table: WISE-SoE Emissions.Emissions

WISE-SoE_Emissions.Emissions - CAS_12767-79-2 - kg/a
type: Concept
notation: WISE-SoE_Emissions.Emissions - CAS_12767-79-2 - kg/a
definition: The unit of measure for 'CAS_12767-79-2' (Aroclor) in WISE SoE - Emissions: Emissions table is 'kg/a'
status: valid
status modified: 2019-10-03
accepted date: 2019-10-03
in scheme: Definition of correct units for the observed determinands in the given WISE SoE DD tables
has determinand: CAS 12767-79-2
has uom: kg.a-1
has table: WISE-SoE Emissions.Emissions

WISE-SoE_Emissions.Emissions - CAS_128-37-0 - kg/a
type: Concept
notation: WISE-SoE_Emissions.Emissions - CAS_128-37-0 - kg/a
definition: The unit of measure for 'CAS_128-37-0' (2,6-Ditert-butyl-4-methylphenol) in WISE SoE - Emissions: Emissions table is 'kg/a'
status: valid
status modified: 2019-10-03
accepted date: 2019-10-03
in scheme: Definition of correct units for the observed determinands in the given WISE SoE DD tables
has determinand: CAS 128-37-0
has uom: kg.a-1
has table: WISE-SoE Emissions.Emissions

WISE-SoE_Emissions.Emissions - CAS_129-00-0 - kg/a
type: Concept
notation: WISE-SoE_Emissions.Emissions - CAS_129-00-0 - kg/a
definition: The unit of measure for 'CAS_129-00-0' (Pyrene) in WISE SoE - Emissions: Emissions table is 'kg/a'
status: valid
status modified: 2019-10-03
accepted date: 2019-10-03
in scheme: Definition of correct units for the observed determinands in the given WISE SoE DD tables
has determinand: CAS 129-00-0
has uom: kg.a-1
has table: WISE-SoE Emissions.Emissions

WISE-SoE_Emissions.Emissions - CAS_13071-79-9 - kg/a
type: Concept
notation: WISE-SoE_Emissions.Emissions - CAS_13071-79-9 - kg/a
definition: The unit of measure for 'CAS_13071-79-9' (Terbufos) in WISE SoE - Emissions: Emissions table is 'kg/a'
status: valid
status modified: 2019-10-03
accepted date: 2019-10-03
in scheme: Definition of correct units for the observed determinands in the given WISE SoE DD tables
has determinand: CAS 13071-79-9
has uom: kg.a-1
has table: WISE-SoE Emissions.Emissions

WISE-SoE_Emissions.Emissions - CAS_131-11-3 - kg/a
type: Concept
notation: WISE-SoE_Emissions.Emissions - CAS_131-11-3 - kg/a
definition: The unit of measure for 'CAS_131-11-3' (Dimethyl phthalate) in WISE SoE - Emissions: Emissions table is 'kg/a'
status: valid
status modified: 2019-10-03
accepted date: 2019-10-03
in scheme: Definition of correct units for the observed determinands in the given WISE SoE DD tables
has determinand: CAS 131-11-3
has uom: kg.a-1
has table: WISE-SoE Emissions.Emissions

WISE-SoE_Emissions.Emissions - CAS_131-16-8 - kg/a
type: Concept
notation: WISE-SoE_Emissions.Emissions - CAS_131-16-8 - kg/a
definition: The unit of measure for 'CAS_131-16-8' (Dipropyl phthalate) in WISE SoE - Emissions: Emissions table is 'kg/a'
status: valid
status modified: 2019-10-03
accepted date: 2019-10-03
in scheme: Definition of correct units for the observed determinands in the given WISE SoE DD tables
has determinand: CAS 131-16-8
has uom: kg.a-1
has table: WISE-SoE Emissions.Emissions

WISE-SoE_Emissions.Emissions - CAS_131-18-0 - kg/a
type: Concept
notation: WISE-SoE_Emissions.Emissions - CAS_131-18-0 - kg/a
definition: The unit of measure for 'CAS_131-18-0' (Dipentyl phthalate) in WISE SoE - Emissions: Emissions table is 'kg/a'
status: valid
status modified: 2019-10-03
accepted date: 2019-10-03
in scheme: Definition of correct units for the observed determinands in the given WISE SoE DD tables
has determinand: CAS 131-18-0
has uom: kg.a-1
has table: WISE-SoE Emissions.Emissions

WISE-SoE_Emissions.Emissions - CAS_131341-86-1 - kg/a
type: Concept
notation: WISE-SoE_Emissions.Emissions - CAS_131341-86-1 - kg/a
definition: The unit of measure for 'CAS_131341-86-1' (Fludioxonil) in WISE SoE - Emissions: Emissions table is 'kg/a'
status: valid
status modified: 2019-10-03
accepted date: 2019-10-03
in scheme: Definition of correct units for the observed determinands in the given WISE SoE DD tables
has determinand: CAS 131341-86-1
has uom: kg.a-1
has table: WISE-SoE Emissions.Emissions

WISE-SoE_Emissions.Emissions - CAS_131860-33-8 - kg/a
type: Concept
notation: WISE-SoE_Emissions.Emissions - CAS_131860-33-8 - kg/a
definition: The unit of measure for 'CAS_131860-33-8' (Azoxystrobin) in WISE SoE - Emissions: Emissions table is 'kg/a'
status: valid
status modified: 2019-10-03
accepted date: 2019-10-03
in scheme: Definition of correct units for the observed determinands in the given WISE SoE DD tables
has determinand: CAS 131860-33-8
has uom: kg.a-1
has table: WISE-SoE Emissions.Emissions

WISE-SoE_Emissions.Emissions - CAS_13194-48-4 - kg/a
type: Concept
notation: WISE-SoE_Emissions.Emissions - CAS_13194-48-4 - kg/a
definition: The unit of measure for 'CAS_13194-48-4' (Ethoprophos) in WISE SoE - Emissions: Emissions table is 'kg/a'
status: valid
status modified: 2019-10-03
accepted date: 2019-10-03
in scheme: Definition of correct units for the observed determinands in the given WISE SoE DD tables
has determinand: CAS 13194-48-4
has uom: kg.a-1
has table: WISE-SoE Emissions.Emissions

WISE-SoE_Emissions.Emissions - CAS_1321-64-8 - kg/a
type: Concept
notation: WISE-SoE_Emissions.Emissions - CAS_1321-64-8 - kg/a
definition: The unit of measure for 'CAS_1321-64-8' (Pentachloronaphthalene) in WISE SoE - Emissions: Emissions table is 'kg/a'
status: valid
status modified: 2019-10-03
accepted date: 2019-10-03
in scheme: Definition of correct units for the observed determinands in the given WISE SoE DD tables
has determinand: CAS 1321-64-8
has uom: kg.a-1
has table: WISE-SoE Emissions.Emissions

WISE-SoE_Emissions.Emissions - CAS_1321-65-9 - kg/a
type: Concept
notation: WISE-SoE_Emissions.Emissions - CAS_1321-65-9 - kg/a
definition: The unit of measure for 'CAS_1321-65-9' (Trichloronaphthalene) in WISE SoE - Emissions: Emissions table is 'kg/a'
status: valid
status modified: 2019-10-03
accepted date: 2019-10-03
in scheme: Definition of correct units for the observed determinands in the given WISE SoE DD tables
has determinand: CAS 1321-65-9
has uom: kg.a-1
has table: WISE-SoE Emissions.Emissions

WISE-SoE_Emissions.Emissions - CAS_133-06-2 - kg/a
type: Concept
notation: WISE-SoE_Emissions.Emissions - CAS_133-06-2 - kg/a
definition: The unit of measure for 'CAS_133-06-2' (Captan) in WISE SoE - Emissions: Emissions table is 'kg/a'
status: valid
status modified: 2019-10-03
accepted date: 2019-10-03
in scheme: Definition of correct units for the observed determinands in the given WISE SoE DD tables
has determinand: CAS 133-06-2
has uom: kg.a-1
has table: WISE-SoE Emissions.Emissions

WISE-SoE_Emissions.Emissions - CAS_133-07-3 - kg/a
type: Concept
notation: WISE-SoE_Emissions.Emissions - CAS_133-07-3 - kg/a
definition: The unit of measure for 'CAS_133-07-3' (Folpet) in WISE SoE - Emissions: Emissions table is 'kg/a'
status: valid
status modified: 2019-10-03
accepted date: 2019-10-03
in scheme: Definition of correct units for the observed determinands in the given WISE SoE DD tables
has determinand: CAS 133-07-3
has uom: kg.a-1
has table: WISE-SoE Emissions.Emissions

WISE-SoE_Emissions.Emissions - CAS_133-53-9 - kg/a
type: Concept
notation: WISE-SoE_Emissions.Emissions - CAS_133-53-9 - kg/a
definition: The unit of measure for 'CAS_133-53-9' (2,4-dichloro-3,5-dimethylphenol) in WISE SoE - Emissions: Emissions table is 'kg/a'
status: valid
status modified: 2019-10-03
accepted date: 2019-10-03
in scheme: Definition of correct units for the observed determinands in the given WISE SoE DD tables
has determinand: CAS 133-53-9
has uom: kg.a-1
has table: WISE-SoE Emissions.Emissions

WISE-SoE_Emissions.Emissions - CAS_1330-20-7 - kg/a
type: Concept
notation: WISE-SoE_Emissions.Emissions - CAS_1330-20-7 - kg/a
definition: The unit of measure for 'CAS_1330-20-7' (Xylene) in WISE SoE - Emissions: Emissions table is 'kg/a'
status: valid
status modified: 2019-10-03
accepted date: 2019-10-03
in scheme: Definition of correct units for the observed determinands in the given WISE SoE DD tables
has determinand: CAS 1330-20-7
has uom: kg.a-1
has table: WISE-SoE Emissions.Emissions

WISE-SoE_Emissions.Emissions - CAS_1332-21-4 - kg/a
type: Concept
notation: WISE-SoE_Emissions.Emissions - CAS_1332-21-4 - kg/a
definition: The unit of measure for 'CAS_1332-21-4' (Asbestos) in WISE SoE - Emissions: Emissions table is 'kg/a'
status: valid
status modified: 2019-10-03
accepted date: 2019-10-03
in scheme: Definition of correct units for the observed determinands in the given WISE SoE DD tables
has determinand: CAS 1332-21-4
has uom: kg.a-1
has table: WISE-SoE Emissions.Emissions

WISE-SoE_Emissions.Emissions - CAS_1333-82-0 - kg/a
type: Concept
notation: WISE-SoE_Emissions.Emissions - CAS_1333-82-0 - kg/a
definition: The unit of measure for 'CAS_1333-82-0' (Chromium trioxide (CrO3)) in WISE SoE - Emissions: Emissions table is 'kg/a'
status: valid
status modified: 2019-10-03
accepted date: 2019-10-03
in scheme: Definition of correct units for the observed determinands in the given WISE SoE DD tables
has determinand: CAS 1333-82-0
has uom: kg.a-1
has table: WISE-SoE Emissions.Emissions

WISE-SoE_Emissions.Emissions - CAS_1335-87-1 - kg/a
type: Concept
notation: WISE-SoE_Emissions.Emissions - CAS_1335-87-1 - kg/a
definition: The unit of measure for 'CAS_1335-87-1' (Hexachloronaphthalene) in WISE SoE - Emissions: Emissions table is 'kg/a'
status: valid
status modified: 2019-10-03
accepted date: 2019-10-03
in scheme: Definition of correct units for the observed determinands in the given WISE SoE DD tables
has determinand: CAS 1335-87-1
has uom: kg.a-1
has table: WISE-SoE Emissions.Emissions

WISE-SoE_Emissions.Emissions - CAS_1335-88-2 - kg/a
type: Concept
notation: WISE-SoE_Emissions.Emissions - CAS_1335-88-2 - kg/a
definition: The unit of measure for 'CAS_1335-88-2' (Tetrachloronaphthalene) in WISE SoE - Emissions: Emissions table is 'kg/a'
status: valid
status modified: 2019-10-03
accepted date: 2019-10-03
in scheme: Definition of correct units for the observed determinands in the given WISE SoE DD tables
has determinand: CAS 1335-88-2
has uom: kg.a-1
has table: WISE-SoE Emissions.Emissions

WISE-SoE_Emissions.Emissions - CAS_13351-73-0 - kg/a
type: Concept
notation: WISE-SoE_Emissions.Emissions - CAS_13351-73-0 - kg/a
definition: The unit of measure for 'CAS_13351-73-0' (Tolyltriazole) in WISE SoE - Emissions: Emissions table is 'kg/a'
status: valid
status modified: 2019-10-03
accepted date: 2019-10-03
in scheme: Definition of correct units for the observed determinands in the given WISE SoE DD tables
has determinand: CAS 13351-73-0
has uom: kg.a-1
has table: WISE-SoE Emissions.Emissions

WISE-SoE_Emissions.Emissions - CAS_13356-08-6 - kg/a
type: Concept
notation: WISE-SoE_Emissions.Emissions - CAS_13356-08-6 - kg/a
definition: The unit of measure for 'CAS_13356-08-6' (Fenbutatin oxide) in WISE SoE - Emissions: Emissions table is 'kg/a'
status: valid
status modified: 2019-10-03
accepted date: 2019-10-03
in scheme: Definition of correct units for the observed determinands in the given WISE SoE DD tables
has determinand: CAS 13356-08-6
has uom: kg.a-1
has table: WISE-SoE Emissions.Emissions

WISE-SoE_Emissions.Emissions - CAS_1336-36-3 - kg/a
type: Concept
notation: WISE-SoE_Emissions.Emissions - CAS_1336-36-3 - kg/a
definition: The unit of measure for 'CAS_1336-36-3' (Polychlorinated biphenyls) in WISE SoE - Emissions: Emissions table is 'kg/a'
status: valid
status modified: 2019-10-03
accepted date: 2019-10-03
in scheme: Definition of correct units for the observed determinands in the given WISE SoE DD tables
has determinand: CAS 1336-36-3
has uom: kg.a-1
has table: WISE-SoE Emissions.Emissions

WISE-SoE_Emissions.Emissions - CAS_13360-45-7 - kg/a
type: Concept
notation: WISE-SoE_Emissions.Emissions - CAS_13360-45-7 - kg/a
definition: The unit of measure for 'CAS_13360-45-7' (Chlorbromuron) in WISE SoE - Emissions: Emissions table is 'kg/a'
status: valid
status modified: 2019-10-03
accepted date: 2019-10-03
in scheme: Definition of correct units for the observed determinands in the given WISE SoE DD tables
has determinand: CAS 13360-45-7
has uom: kg.a-1
has table: WISE-SoE Emissions.Emissions

WISE-SoE_Emissions.Emissions - CAS_133855-98-8 - kg/a
type: Concept
notation: WISE-SoE_Emissions.Emissions - CAS_133855-98-8 - kg/a
definition: The unit of measure for 'CAS_133855-98-8' (Epoxiconazole) in WISE SoE - Emissions: Emissions table is 'kg/a'
status: valid
status modified: 2019-10-03
accepted date: 2019-10-03
in scheme: Definition of correct units for the observed determinands in the given WISE SoE DD tables
has determinand: CAS 133855-98-8
has uom: kg.a-1
has table: WISE-SoE Emissions.Emissions

WISE-SoE_Emissions.Emissions - CAS_134-62-3 - kg/a
type: Concept
notation: WISE-SoE_Emissions.Emissions - CAS_134-62-3 - kg/a
definition: The unit of measure for 'CAS_134-62-3' (Diethyltoluamide (DEET)) in WISE SoE - Emissions: Emissions table is 'kg/a'
status: valid
status modified: 2019-10-03
accepted date: 2019-10-03
in scheme: Definition of correct units for the observed determinands in the given WISE SoE DD tables
has determinand: CAS 134-62-3
has uom: kg.a-1
has table: WISE-SoE Emissions.Emissions

WISE-SoE_Emissions.Emissions - CAS_134098-61-6 - kg/a
type: Concept
notation: WISE-SoE_Emissions.Emissions - CAS_134098-61-6 - kg/a
definition: The unit of measure for 'CAS_134098-61-6' (Fenpyroximate) in WISE SoE - Emissions: Emissions table is 'kg/a'
status: valid
status modified: 2019-10-03
accepted date: 2019-10-03
in scheme: Definition of correct units for the observed determinands in the given WISE SoE DD tables
has determinand: CAS 134098-61-6
has uom: kg.a-1
has table: WISE-SoE Emissions.Emissions

WISE-SoE_Emissions.Emissions - CAS_134237-50-6 - kg/a
type: Concept
notation: WISE-SoE_Emissions.Emissions - CAS_134237-50-6 - kg/a
definition: The unit of measure for 'CAS_134237-50-6' (alpha-Hexabromocyclododecane) in WISE SoE - Emissions: Emissions table is 'kg/a'
status: valid
status modified: 2019-10-03
accepted date: 2019-10-03
in scheme: Definition of correct units for the observed determinands in the given WISE SoE DD tables
has determinand: CAS 134237-50-6
has uom: kg.a-1
has table: WISE-SoE Emissions.Emissions

WISE-SoE_Emissions.Emissions - CAS_134237-51-7 - kg/a
type: Concept
notation: WISE-SoE_Emissions.Emissions - CAS_134237-51-7 - kg/a
definition: The unit of measure for 'CAS_134237-51-7' (beta-Hexabromocyclododecane) in WISE SoE - Emissions: Emissions table is 'kg/a'
status: valid
status modified: 2019-10-03
accepted date: 2019-10-03
in scheme: Definition of correct units for the observed determinands in the given WISE SoE DD tables
has determinand: CAS 134237-51-7
has uom: kg.a-1
has table: WISE-SoE Emissions.Emissions

WISE-SoE_Emissions.Emissions - CAS_134237-52-8 - kg/a
type: Concept
notation: WISE-SoE_Emissions.Emissions - CAS_134237-52-8 - kg/a
definition: The unit of measure for 'CAS_134237-52-8' (gamma-Hexabromocyclododecane) in WISE SoE - Emissions: Emissions table is 'kg/a'
status: valid
status modified: 2019-10-03
accepted date: 2019-10-03
in scheme: Definition of correct units for the observed determinands in the given WISE SoE DD tables
has determinand: CAS 134237-52-8
has uom: kg.a-1
has table: WISE-SoE Emissions.Emissions

WISE-SoE_Emissions.Emissions - CAS_13457-18-6 - kg/a
type: Concept
notation: WISE-SoE_Emissions.Emissions - CAS_13457-18-6 - kg/a
definition: The unit of measure for 'CAS_13457-18-6' (Pyrazophos) in WISE SoE - Emissions: Emissions table is 'kg/a'
status: valid
status modified: 2019-10-03
accepted date: 2019-10-03
in scheme: Definition of correct units for the observed determinands in the given WISE SoE DD tables
has determinand: CAS 13457-18-6
has uom: kg.a-1
has table: WISE-SoE Emissions.Emissions

WISE-SoE_Emissions.Emissions - CAS_135-19-3 - kg/a
type: Concept
notation: WISE-SoE_Emissions.Emissions - CAS_135-19-3 - kg/a
definition: The unit of measure for 'CAS_135-19-3' (2-naphthol) in WISE SoE - Emissions: Emissions table is 'kg/a'
status: valid
status modified: 2019-10-03
accepted date: 2019-10-03
in scheme: Definition of correct units for the observed determinands in the given WISE SoE DD tables
has determinand: CAS 135-19-3
has uom: kg.a-1
has table: WISE-SoE Emissions.Emissions

WISE-SoE_Emissions.Emissions - CAS_135-98-8 - kg/a
type: Concept
notation: WISE-SoE_Emissions.Emissions - CAS_135-98-8 - kg/a
definition: The unit of measure for 'CAS_135-98-8' (sec-butylbenzene) in WISE SoE - Emissions: Emissions table is 'kg/a'
status: valid
status modified: 2019-10-03
accepted date: 2019-10-03
in scheme: Definition of correct units for the observed determinands in the given WISE SoE DD tables
has determinand: CAS 135-98-8
has uom: kg.a-1
has table: WISE-SoE Emissions.Emissions

WISE-SoE_Emissions.Emissions - CAS_135410-20-7 - kg/a
type: Concept
notation: WISE-SoE_Emissions.Emissions - CAS_135410-20-7 - kg/a
definition: The unit of measure for 'CAS_135410-20-7' (Ethanimidamide) in WISE SoE - Emissions: Emissions table is 'kg/a'
status: valid
status modified: 2019-10-03
accepted date: 2019-10-03
in scheme: Definition of correct units for the observed determinands in the given WISE SoE DD tables
has determinand: CAS 135410-20-7
has uom: kg.a-1
has table: WISE-SoE Emissions.Emissions

WISE-SoE_Emissions.Emissions - CAS_136-85-6 - kg/a
type: Concept
notation: WISE-SoE_Emissions.Emissions - CAS_136-85-6 - kg/a
definition: The unit of measure for 'CAS_136-85-6' (Methylbenzotriazol) in WISE SoE - Emissions: Emissions table is 'kg/a'
status: valid
status modified: 2019-10-03
accepted date: 2019-10-03
in scheme: Definition of correct units for the observed determinands in the given WISE SoE DD tables
has determinand: CAS 136-85-6
has uom: kg.a-1
has table: WISE-SoE Emissions.Emissions

WISE-SoE_Emissions.Emissions - CAS_136426-54-5 - kg/a
type: Concept
notation: WISE-SoE_Emissions.Emissions - CAS_136426-54-5 - kg/a
definition: The unit of measure for 'CAS_136426-54-5' (Fluquinconazole) in WISE SoE - Emissions: Emissions table is 'kg/a'
status: valid
status modified: 2019-10-03
accepted date: 2019-10-03
in scheme: Definition of correct units for the observed determinands in the given WISE SoE DD tables
has determinand: CAS 136426-54-5
has uom: kg.a-1
has table: WISE-SoE Emissions.Emissions

WISE-SoE_Emissions.Emissions - CAS_136677-10-6 - kg/a
type: Concept
notation: WISE-SoE_Emissions.Emissions - CAS_136677-10-6 - kg/a
definition: The unit of measure for 'CAS_136677-10-6' (Polychlorinated dibenzofurans (10 PCDFs)) in WISE SoE - Emissions: Emissions table is 'kg/a'
status: valid
status modified: 2019-10-03
accepted date: 2019-10-03
in scheme: Definition of correct units for the observed determinands in the given WISE SoE DD tables
has determinand: CAS 136677-10-6
has uom: kg.a-1
has table: WISE-SoE Emissions.Emissions

WISE-SoE_Emissions.Emissions - CAS_13684-56-5 - kg/a
type: Concept
notation: WISE-SoE_Emissions.Emissions - CAS_13684-56-5 - kg/a
definition: The unit of measure for 'CAS_13684-56-5' (Desmedipham) in WISE SoE - Emissions: Emissions table is 'kg/a'
status: valid
status modified: 2019-10-03
accepted date: 2019-10-03
in scheme: Definition of correct units for the observed determinands in the given WISE SoE DD tables
has determinand: CAS 13684-56-5
has uom: kg.a-1
has table: WISE-SoE Emissions.Emissions

WISE-SoE_Emissions.Emissions - CAS_137-26-8 - kg/a
type: Concept
notation: WISE-SoE_Emissions.Emissions - CAS_137-26-8 - kg/a
definition: The unit of measure for 'CAS_137-26-8' (Thiram) in WISE SoE - Emissions: Emissions table is 'kg/a'
status: valid
status modified: 2019-10-03
accepted date: 2019-10-03
in scheme: Definition of correct units for the observed determinands in the given WISE SoE DD tables
has determinand: CAS 137-26-8
has uom: kg.a-1
has table: WISE-SoE Emissions.Emissions

WISE-SoE_Emissions.Emissions - CAS_137-30-4 - kg/a
type: Concept
notation: WISE-SoE_Emissions.Emissions - CAS_137-30-4 - kg/a
definition: The unit of measure for 'CAS_137-30-4' (Ziram) in WISE SoE - Emissions: Emissions table is 'kg/a'
status: valid
status modified: 2019-10-03
accepted date: 2019-10-03
in scheme: Definition of correct units for the observed determinands in the given WISE SoE DD tables
has determinand: CAS 137-30-4
has uom: kg.a-1
has table: WISE-SoE Emissions.Emissions

WISE-SoE_Emissions.Emissions - CAS_137641-05-5 - kg/a
type: Concept
notation: WISE-SoE_Emissions.Emissions - CAS_137641-05-5 - kg/a
definition: The unit of measure for 'CAS_137641-05-5' (Picolinafen) in WISE SoE - Emissions: Emissions table is 'kg/a'
status: valid
status modified: 2019-10-03
accepted date: 2019-10-03
in scheme: Definition of correct units for the observed determinands in the given WISE SoE DD tables
has determinand: CAS 137641-05-5
has uom: kg.a-1
has table: WISE-SoE Emissions.Emissions

WISE-SoE_Emissions.Emissions - CAS_138261-41-3 - kg/a
type: Concept
notation: WISE-SoE_Emissions.Emissions - CAS_138261-41-3 - kg/a
definition: The unit of measure for 'CAS_138261-41-3' (Imidacloprid) in WISE SoE - Emissions: Emissions table is 'kg/a'
status: valid
status modified: 2019-10-03
accepted date: 2019-10-03
in scheme: Definition of correct units for the observed determinands in the given WISE SoE DD tables
has determinand: CAS 138261-41-3
has uom: kg.a-1
has table: WISE-SoE Emissions.Emissions

WISE-SoE_Emissions.Emissions - CAS_139-13-9 - kg/a
type: Concept
notation: WISE-SoE_Emissions.Emissions - CAS_139-13-9 - kg/a
definition: The unit of measure for 'CAS_139-13-9' (NTA) in WISE SoE - Emissions: Emissions table is 'kg/a'
status: valid
status modified: 2019-10-03
accepted date: 2019-10-03
in scheme: Definition of correct units for the observed determinands in the given WISE SoE DD tables
has determinand: CAS 139-13-9
has uom: kg.a-1
has table: WISE-SoE Emissions.Emissions

WISE-SoE_Emissions.Emissions - CAS_139-40-2 - kg/a
type: Concept
notation: WISE-SoE_Emissions.Emissions - CAS_139-40-2 - kg/a
definition: The unit of measure for 'CAS_139-40-2' (Propazine) in WISE SoE - Emissions: Emissions table is 'kg/a'
status: valid
status modified: 2019-10-03
accepted date: 2019-10-03
in scheme: Definition of correct units for the observed determinands in the given WISE SoE DD tables
has determinand: CAS 139-40-2
has uom: kg.a-1
has table: WISE-SoE Emissions.Emissions

WISE-SoE_Emissions.Emissions - CAS_139528-85-1 - kg/a
type: Concept
notation: WISE-SoE_Emissions.Emissions - CAS_139528-85-1 - kg/a
definition: The unit of measure for 'CAS_139528-85-1' (Metosulam) in WISE SoE - Emissions: Emissions table is 'kg/a'
status: valid
status modified: 2019-10-03
accepted date: 2019-10-03
in scheme: Definition of correct units for the observed determinands in the given WISE SoE DD tables
has determinand: CAS 139528-85-1
has uom: kg.a-1
has table: WISE-SoE Emissions.Emissions

WISE-SoE_Emissions.Emissions - CAS_139968-49-3 - kg/a
type: Concept
notation: WISE-SoE_Emissions.Emissions - CAS_139968-49-3 - kg/a
definition: The unit of measure for 'CAS_139968-49-3' (Metaflumizone) in WISE SoE - Emissions: Emissions table is 'kg/a'
status: valid
status modified: 2019-10-03
accepted date: 2019-10-03
in scheme: Definition of correct units for the observed determinands in the given WISE SoE DD tables
has determinand: CAS 139968-49-3
has uom: kg.a-1
has table: WISE-SoE Emissions.Emissions

WISE-SoE_Emissions.Emissions - CAS_140-57-8 - kg/a
type: Concept
notation: WISE-SoE_Emissions.Emissions - CAS_140-57-8 - kg/a
definition: The unit of measure for 'CAS_140-57-8' (Aramite) in WISE SoE - Emissions: Emissions table is 'kg/a'
status: valid
status modified: 2019-10-03
accepted date: 2019-10-03
in scheme: Definition of correct units for the observed determinands in the given WISE SoE DD tables
has determinand: CAS 140-57-8
has uom: kg.a-1
has table: WISE-SoE Emissions.Emissions

WISE-SoE_Emissions.Emissions - CAS_140-66-9 - kg/a
type: Concept
notation: WISE-SoE_Emissions.Emissions - CAS_140-66-9 - kg/a
definition: The unit of measure for 'CAS_140-66-9' (Octylphenol (4-(1,1',3,3'-tetramethylbutyl)-phenol)) in WISE SoE - Emissions: Emissions table is 'kg/a'
status: valid
status modified: 2019-10-03
accepted date: 2019-10-03
in scheme: Definition of correct units for the observed determinands in the given WISE SoE DD tables
has determinand: CAS 140-66-9
has uom: kg.a-1
has table: WISE-SoE Emissions.Emissions

WISE-SoE_Emissions.Emissions - CAS_140923-17-7 - kg/a
type: Concept
notation: WISE-SoE_Emissions.Emissions - CAS_140923-17-7 - kg/a
definition: The unit of measure for 'CAS_140923-17-7' (Iprovalicarb) in WISE SoE - Emissions: Emissions table is 'kg/a'
status: valid
status modified: 2019-10-03
accepted date: 2019-10-03
in scheme: Definition of correct units for the observed determinands in the given WISE SoE DD tables
has determinand: CAS 140923-17-7
has uom: kg.a-1
has table: WISE-SoE Emissions.Emissions

WISE-SoE_Emissions.Emissions - CAS_141112-29-0 - kg/a
type: Concept
notation: WISE-SoE_Emissions.Emissions - CAS_141112-29-0 - kg/a
definition: The unit of measure for 'CAS_141112-29-0' (Isoxaflutole) in WISE SoE - Emissions: Emissions table is 'kg/a'
status: valid
status modified: 2019-10-03
accepted date: 2019-10-03
in scheme: Definition of correct units for the observed determinands in the given WISE SoE DD tables
has determinand: CAS 141112-29-0
has uom: kg.a-1
has table: WISE-SoE Emissions.Emissions

WISE-SoE_Emissions.Emissions - CAS_141517-21-7 - kg/a
type: Concept
notation: WISE-SoE_Emissions.Emissions - CAS_141517-21-7 - kg/a
definition: The unit of measure for 'CAS_141517-21-7' (Trifloxystrobin) in WISE SoE - Emissions: Emissions table is 'kg/a'
status: valid
status modified: 2019-10-03
accepted date: 2019-10-03
in scheme: Definition of correct units for the observed determinands in the given WISE SoE DD tables
has determinand: CAS 141517-21-7
has uom: kg.a-1
has table: WISE-SoE Emissions.Emissions

WISE-SoE_Emissions.Emissions - CAS_141776-32-1 - kg/a
type: Concept
notation: WISE-SoE_Emissions.Emissions - CAS_141776-32-1 - kg/a
definition: The unit of measure for 'CAS_141776-32-1' (Sulfosulfuron) in WISE SoE - Emissions: Emissions table is 'kg/a'
status: valid
status modified: 2019-10-03
accepted date: 2019-10-03
in scheme: Definition of correct units for the observed determinands in the given WISE SoE DD tables
has determinand: CAS 141776-32-1
has uom: kg.a-1
has table: WISE-SoE Emissions.Emissions

WISE-SoE_Emissions.Emissions - CAS_1418095-02-9 - kg/a
type: Concept
notation: WISE-SoE_Emissions.Emissions - CAS_1418095-02-9 - kg/a
definition: The unit of measure for 'CAS_1418095-02-9' (Chlorothalonil ESA (VIS-01)) in WISE SoE - Emissions: Emissions table is 'kg/a'
status: valid
status modified: 2019-10-03
accepted date: 2019-10-03
in scheme: Definition of correct units for the observed determinands in the given WISE SoE DD tables
has determinand: CAS 1418095-02-9
has uom: kg.a-1
has table: WISE-SoE Emissions.Emissions

WISE-SoE_Emissions.Emissions - CAS_142-28-9 - kg/a
type: Concept
notation: WISE-SoE_Emissions.Emissions - CAS_142-28-9 - kg/a
definition: The unit of measure for 'CAS_142-28-9' (1,3-dichloropropane) in WISE SoE - Emissions: Emissions table is 'kg/a'
status: valid
status modified: 2019-10-03
accepted date: 2019-10-03
in scheme: Definition of correct units for the observed determinands in the given WISE SoE DD tables
has determinand: CAS 142-28-9
has uom: kg.a-1
has table: WISE-SoE Emissions.Emissions

WISE-SoE_Emissions.Emissions - CAS_142363-53-9 - kg/a
type: Concept
notation: WISE-SoE_Emissions.Emissions - CAS_142363-53-9 - kg/a
definition: The unit of measure for 'CAS_142363-53-9' (Alachlor ESA) in WISE SoE - Emissions: Emissions table is 'kg/a'
status: valid
status modified: 2019-10-03
accepted date: 2019-10-03
in scheme: Definition of correct units for the observed determinands in the given WISE SoE DD tables
has determinand: CAS 142363-53-9
has uom: kg.a-1
has table: WISE-SoE Emissions.Emissions

WISE-SoE_Emissions.Emissions - CAS_142459-58-3 - kg/a
type: Concept
notation: WISE-SoE_Emissions.Emissions - CAS_142459-58-3 - kg/a
definition: The unit of measure for 'CAS_142459-58-3' (Flufenacet) in WISE SoE - Emissions: Emissions table is 'kg/a'
status: valid
status modified: 2019-10-03
accepted date: 2019-10-03
in scheme: Definition of correct units for the observed determinands in the given WISE SoE DD tables
has determinand: CAS 142459-58-3
has uom: kg.a-1
has table: WISE-SoE Emissions.Emissions

WISE-SoE_Emissions.Emissions - CAS_14265-44-2 - kg/a
type: Concept
notation: WISE-SoE_Emissions.Emissions - CAS_14265-44-2 - kg/a
definition: The unit of measure for 'CAS_14265-44-2' (Phosphate) in WISE SoE - Emissions: Emissions table is 'kg/a'
status: valid
status modified: 2019-10-03
accepted date: 2019-10-03
in scheme: Definition of correct units for the observed determinands in the given WISE SoE DD tables
has determinand: CAS 14265-44-2
has uom: kg.a-1
has table: WISE-SoE Emissions.Emissions

WISE-SoE_Emissions.Emissions - CAS_143-50-0 - kg/a
type: Concept
notation: WISE-SoE_Emissions.Emissions - CAS_143-50-0 - kg/a
definition: The unit of measure for 'CAS_143-50-0' (Chlordecone (Kepone)) in WISE SoE - Emissions: Emissions table is 'kg/a'
status: valid
status modified: 2019-10-03
accepted date: 2019-10-03
in scheme: Definition of correct units for the observed determinands in the given WISE SoE DD tables
has determinand: CAS 143-50-0
has uom: kg.a-1
has table: WISE-SoE Emissions.Emissions

WISE-SoE_Emissions.Emissions - CAS_143390-89-0 - kg/a
type: Concept
notation: WISE-SoE_Emissions.Emissions - CAS_143390-89-0 - kg/a
definition: The unit of measure for 'CAS_143390-89-0' (Kresoxim-methyl) in WISE SoE - Emissions: Emissions table is 'kg/a'
status: valid
status modified: 2019-10-03
accepted date: 2019-10-03
in scheme: Definition of correct units for the observed determinands in the given WISE SoE DD tables
has determinand: CAS 143390-89-0
has uom: kg.a-1
has table: WISE-SoE Emissions.Emissions

WISE-SoE_Emissions.Emissions - CAS_144-49-0 - kg/a
type: Concept
notation: WISE-SoE_Emissions.Emissions - CAS_144-49-0 - kg/a
definition: The unit of measure for 'CAS_144-49-0' (Fluoroacetic acid) in WISE SoE - Emissions: Emissions table is 'kg/a'
status: valid
status modified: 2019-10-03
accepted date: 2019-10-03
in scheme: Definition of correct units for the observed determinands in the given WISE SoE DD tables
has determinand: CAS 144-49-0
has uom: kg.a-1
has table: WISE-SoE Emissions.Emissions

WISE-SoE_Emissions.Emissions - CAS_1461-25-2 - kg/a
type: Concept
notation: WISE-SoE_Emissions.Emissions - CAS_1461-25-2 - kg/a
definition: The unit of measure for 'CAS_1461-25-2' (Tetrabutyltin) in WISE SoE - Emissions: Emissions table is 'kg/a'
status: valid
status modified: 2019-10-03
accepted date: 2019-10-03
in scheme: Definition of correct units for the observed determinands in the given WISE SoE DD tables
has determinand: CAS 1461-25-2
has uom: kg.a-1
has table: WISE-SoE Emissions.Emissions

WISE-SoE_Emissions.Emissions - CAS_14797-55-8 - t/a
type: Concept
notation: WISE-SoE_Emissions.Emissions - CAS_14797-55-8 - t/a
definition: The unit of measure for 'CAS_14797-55-8' (Nitrate) in WISE SoE - Emissions: Emissions table is 't/a'
status: valid
status modified: 2019-10-03
accepted date: 2019-10-03
in scheme: Definition of correct units for the observed determinands in the given WISE SoE DD tables
has determinand: CAS 14797-55-8
has uom: t.a-1
has table: WISE-SoE Emissions.Emissions

WISE-SoE_Emissions.Emissions - CAS_14798-03-9 - t/a
type: Concept
notation: WISE-SoE_Emissions.Emissions - CAS_14798-03-9 - t/a
definition: The unit of measure for 'CAS_14798-03-9' (Ammonium) in WISE SoE - Emissions: Emissions table is 't/a'
status: valid
status modified: 2019-10-03
accepted date: 2019-10-03
in scheme: Definition of correct units for the observed determinands in the given WISE SoE DD tables
has determinand: CAS 14798-03-9
has uom: t.a-1
has table: WISE-SoE Emissions.Emissions

WISE-SoE_Emissions.Emissions - CAS_14816-18-3 - kg/a
type: Concept
notation: WISE-SoE_Emissions.Emissions - CAS_14816-18-3 - kg/a
definition: The unit of measure for 'CAS_14816-18-3' (Phoxim) in WISE SoE - Emissions: Emissions table is 'kg/a'
status: valid
status modified: 2019-10-03
accepted date: 2019-10-03
in scheme: Definition of correct units for the observed determinands in the given WISE SoE DD tables
has determinand: CAS 14816-18-3
has uom: kg.a-1
has table: WISE-SoE Emissions.Emissions

WISE-SoE_Emissions.Emissions - CAS_14866-68-3 - kg/a
type: Concept
notation: WISE-SoE_Emissions.Emissions - CAS_14866-68-3 - kg/a
definition: The unit of measure for 'CAS_14866-68-3' (Chlorates) in WISE SoE - Emissions: Emissions table is 'kg/a'
status: valid
status modified: 2019-10-03
accepted date: 2019-10-03
in scheme: Definition of correct units for the observed determinands in the given WISE SoE DD tables
has determinand: CAS 14866-68-3
has uom: kg.a-1
has table: WISE-SoE Emissions.Emissions

WISE-SoE_Emissions.Emissions - CAS_14998-27-7 - kg/a
type: Concept
notation: WISE-SoE_Emissions.Emissions - CAS_14998-27-7 - kg/a
definition: The unit of measure for 'CAS_14998-27-7' (Chlorite) in WISE SoE - Emissions: Emissions table is 'kg/a'
status: valid
status modified: 2019-10-03
accepted date: 2019-10-03
in scheme: Definition of correct units for the observed determinands in the given WISE SoE DD tables
has determinand: CAS 14998-27-7
has uom: kg.a-1
has table: WISE-SoE Emissions.Emissions

WISE-SoE_Emissions.Emissions - CAS_150-68-5 - kg/a
type: Concept
notation: WISE-SoE_Emissions.Emissions - CAS_150-68-5 - kg/a
definition: The unit of measure for 'CAS_150-68-5' (Monuron) in WISE SoE - Emissions: Emissions table is 'kg/a'
status: valid
status modified: 2019-10-03
accepted date: 2019-10-03
in scheme: Definition of correct units for the observed determinands in the given WISE SoE DD tables
has determinand: CAS 150-68-5
has uom: kg.a-1
has table: WISE-SoE Emissions.Emissions

WISE-SoE_Emissions.Emissions - CAS_151-21-3 - kg/a
type: Concept
notation: WISE-SoE_Emissions.Emissions - CAS_151-21-3 - kg/a
definition: The unit of measure for 'CAS_151-21-3' (Sodium dodecyl sulfate) in WISE SoE - Emissions: Emissions table is 'kg/a'
status: valid
status modified: 2019-10-03
accepted date: 2019-10-03
in scheme: Definition of correct units for the observed determinands in the given WISE SoE DD tables
has determinand: CAS 151-21-3
has uom: kg.a-1
has table: WISE-SoE Emissions.Emissions

WISE-SoE_Emissions.Emissions - CAS_15165-67-0 - kg/a
type: Concept
notation: WISE-SoE_Emissions.Emissions - CAS_15165-67-0 - kg/a
definition: The unit of measure for 'CAS_15165-67-0' (Dichlorprop-P) in WISE SoE - Emissions: Emissions table is 'kg/a'
status: valid
status modified: 2019-10-03
accepted date: 2019-10-03
in scheme: Definition of correct units for the observed determinands in the given WISE SoE DD tables
has determinand: CAS 15165-67-0
has uom: kg.a-1
has table: WISE-SoE Emissions.Emissions

WISE-SoE_Emissions.Emissions - CAS_152019-73-3 - kg/a
type: Concept
notation: WISE-SoE_Emissions.Emissions - CAS_152019-73-3 - kg/a
definition: The unit of measure for 'CAS_152019-73-3' (Metolachlor OA) in WISE SoE - Emissions: Emissions table is 'kg/a'
status: valid
status modified: 2019-10-03
accepted date: 2019-10-03
in scheme: Definition of correct units for the observed determinands in the given WISE SoE DD tables
has determinand: CAS 152019-73-3
has uom: kg.a-1
has table: WISE-SoE Emissions.Emissions

WISE-SoE_Emissions.Emissions - CAS_15299-99-7 - kg/a
type: Concept
notation: WISE-SoE_Emissions.Emissions - CAS_15299-99-7 - kg/a
definition: The unit of measure for 'CAS_15299-99-7' (Napropamide) in WISE SoE - Emissions: Emissions table is 'kg/a'
status: valid
status modified: 2019-10-03
accepted date: 2019-10-03
in scheme: Definition of correct units for the observed determinands in the given WISE SoE DD tables
has determinand: CAS 15299-99-7
has uom: kg.a-1
has table: WISE-SoE Emissions.Emissions

WISE-SoE_Emissions.Emissions - CAS_15307-79-6 - kg/a
type: Concept
notation: WISE-SoE_Emissions.Emissions - CAS_15307-79-6 - kg/a
definition: The unit of measure for 'CAS_15307-79-6' (Diclofenac sodium) in WISE SoE - Emissions: Emissions table is 'kg/a'
status: valid
status modified: 2019-10-03
accepted date: 2019-10-03
in scheme: Definition of correct units for the observed determinands in the given WISE SoE DD tables
has determinand: CAS 15307-79-6
has uom: kg.a-1
has table: WISE-SoE Emissions.Emissions

WISE-SoE_Emissions.Emissions - CAS_15307-86-5 - kg/a
type: Concept
notation: WISE-SoE_Emissions.Emissions - CAS_15307-86-5 - kg/a
definition: The unit of measure for 'CAS_15307-86-5' (Diclofenac) in WISE SoE - Emissions: Emissions table is 'kg/a'
status: valid
status modified: 2019-10-03
accepted date: 2019-10-03
in scheme: Definition of correct units for the observed determinands in the given WISE SoE DD tables
has determinand: CAS 15307-86-5
has uom: kg.a-1
has table: WISE-SoE Emissions.Emissions

WISE-SoE_Emissions.Emissions - CAS_153719-23-4 - kg/a
type: Concept
notation: WISE-SoE_Emissions.Emissions - CAS_153719-23-4 - kg/a
definition: The unit of measure for 'CAS_153719-23-4' (Thiamethoxam) in WISE SoE - Emissions: Emissions table is 'kg/a'
status: valid
status modified: 2019-10-03
accepted date: 2019-10-03
in scheme: Definition of correct units for the observed determinands in the given WISE SoE DD tables
has determinand: CAS 153719-23-4
has uom: kg.a-1
has table: WISE-SoE Emissions.Emissions

WISE-SoE_Emissions.Emissions - CAS_15541-45-4 - kg/a
type: Concept
notation: WISE-SoE_Emissions.Emissions - CAS_15541-45-4 - kg/a
definition: The unit of measure for 'CAS_15541-45-4' (Bromate) in WISE SoE - Emissions: Emissions table is 'kg/a'
status: valid
status modified: 2019-10-03
accepted date: 2019-10-03
in scheme: Definition of correct units for the observed determinands in the given WISE SoE DD tables
has determinand: CAS 15541-45-4
has uom: kg.a-1
has table: WISE-SoE Emissions.Emissions

WISE-SoE_Emissions.Emissions - CAS_15545-48-9 - kg/a
type: Concept
notation: WISE-SoE_Emissions.Emissions - CAS_15545-48-9 - kg/a
definition: The unit of measure for 'CAS_15545-48-9' (Chlortoluron) in WISE SoE - Emissions: Emissions table is 'kg/a'
status: valid
status modified: 2019-10-03
accepted date: 2019-10-03
in scheme: Definition of correct units for the observed determinands in the given WISE SoE DD tables
has determinand: CAS 15545-48-9
has uom: kg.a-1
has table: WISE-SoE Emissions.Emissions

WISE-SoE_Emissions.Emissions - CAS_156-59-2 - kg/a
type: Concept
notation: WISE-SoE_Emissions.Emissions - CAS_156-59-2 - kg/a
definition: The unit of measure for 'CAS_156-59-2' (cis-1,2-dichloroethene) in WISE SoE - Emissions: Emissions table is 'kg/a'
status: valid
status modified: 2019-10-03
accepted date: 2019-10-03
in scheme: Definition of correct units for the observed determinands in the given WISE SoE DD tables
has determinand: CAS 156-59-2
has uom: kg.a-1
has table: WISE-SoE Emissions.Emissions

WISE-SoE_Emissions.Emissions - CAS_156-60-5 - kg/a
type: Concept
notation: WISE-SoE_Emissions.Emissions - CAS_156-60-5 - kg/a
definition: The unit of measure for 'CAS_156-60-5' (trans-1,2-dichloroethene) in WISE SoE - Emissions: Emissions table is 'kg/a'
status: valid
status modified: 2019-10-03
accepted date: 2019-10-03
in scheme: Definition of correct units for the observed determinands in the given WISE SoE DD tables
has determinand: CAS 156-60-5
has uom: kg.a-1
has table: WISE-SoE Emissions.Emissions

WISE-SoE_Emissions.Emissions - CAS_1563-66-2 - kg/a
type: Concept
notation: WISE-SoE_Emissions.Emissions - CAS_1563-66-2 - kg/a
definition: The unit of measure for 'CAS_1563-66-2' (Carbofuran) in WISE SoE - Emissions: Emissions table is 'kg/a'
status: valid
status modified: 2019-10-03
accepted date: 2019-10-03
in scheme: Definition of correct units for the observed determinands in the given WISE SoE DD tables
has determinand: CAS 1563-66-2
has uom: kg.a-1
has table: WISE-SoE Emissions.Emissions

WISE-SoE_Emissions.Emissions - CAS_15687-27-1 - kg/a
type: Concept
notation: WISE-SoE_Emissions.Emissions - CAS_15687-27-1 - kg/a
definition: The unit of measure for 'CAS_15687-27-1' (Ibuprofen) in WISE SoE - Emissions: Emissions table is 'kg/a'
status: valid
status modified: 2019-10-03
accepted date: 2019-10-03
in scheme: Definition of correct units for the observed determinands in the given WISE SoE DD tables
has determinand: CAS 15687-27-1
has uom: kg.a-1
has table: WISE-SoE Emissions.Emissions

WISE-SoE_Emissions.Emissions - CAS_1570-64-5 - kg/a
type: Concept
notation: WISE-SoE_Emissions.Emissions - CAS_1570-64-5 - kg/a
definition: The unit of measure for 'CAS_1570-64-5' (4-chloro-2-methylphenol) in WISE SoE - Emissions: Emissions table is 'kg/a'
status: valid
status modified: 2019-10-03
accepted date: 2019-10-03
in scheme: Definition of correct units for the observed determinands in the given WISE SoE DD tables
has determinand: CAS 1570-64-5
has uom: kg.a-1
has table: WISE-SoE Emissions.Emissions

WISE-SoE_Emissions.Emissions - CAS_1570-65-6 - kg/a
type: Concept
notation: WISE-SoE_Emissions.Emissions - CAS_1570-65-6 - kg/a
definition: The unit of measure for 'CAS_1570-65-6' (4,6-dichloro-2-methylphenol) in WISE SoE - Emissions: Emissions table is 'kg/a'
status: valid
status modified: 2019-10-03
accepted date: 2019-10-03
in scheme: Definition of correct units for the observed determinands in the given WISE SoE DD tables
has determinand: CAS 1570-65-6
has uom: kg.a-1
has table: WISE-SoE Emissions.Emissions

WISE-SoE_Emissions.Emissions - CAS_1582-09-8 - kg/a
type: Concept
notation: WISE-SoE_Emissions.Emissions - CAS_1582-09-8 - kg/a
definition: The unit of measure for 'CAS_1582-09-8' (Trifluralin) in WISE SoE - Emissions: Emissions table is 'kg/a'
status: valid
status modified: 2019-10-03
accepted date: 2019-10-03
in scheme: Definition of correct units for the observed determinands in the given WISE SoE DD tables
has determinand: CAS 1582-09-8
has uom: kg.a-1
has table: WISE-SoE Emissions.Emissions

WISE-SoE_Emissions.Emissions - CAS_15950-66-0 - kg/a
type: Concept
notation: WISE-SoE_Emissions.Emissions - CAS_15950-66-0 - kg/a
definition: The unit of measure for 'CAS_15950-66-0' (2,3,4-Trichlorophenol) in WISE SoE - Emissions: Emissions table is 'kg/a'
status: valid
status modified: 2019-10-03
accepted date: 2019-10-03
in scheme: Definition of correct units for the observed determinands in the given WISE SoE DD tables
has determinand: CAS 15950-66-0
has uom: kg.a-1
has table: WISE-SoE Emissions.Emissions

WISE-SoE_Emissions.Emissions - CAS_15972-60-8 - kg/a
type: Concept
notation: WISE-SoE_Emissions.Emissions - CAS_15972-60-8 - kg/a
definition: The unit of measure for 'CAS_15972-60-8' (Alachlor) in WISE SoE - Emissions: Emissions table is 'kg/a'
status: valid
status modified: 2019-10-03
accepted date: 2019-10-03
in scheme: Definition of correct units for the observed determinands in the given WISE SoE DD tables
has determinand: CAS 15972-60-8
has uom: kg.a-1
has table: WISE-SoE Emissions.Emissions

WISE-SoE_Emissions.Emissions - CAS_160430-64-8 - kg/a
type: Concept
notation: WISE-SoE_Emissions.Emissions - CAS_160430-64-8 - kg/a
definition: The unit of measure for 'CAS_160430-64-8' (Acetamiprid) in WISE SoE - Emissions: Emissions table is 'kg/a'
status: valid
status modified: 2019-10-03
accepted date: 2019-10-03
in scheme: Definition of correct units for the observed determinands in the given WISE SoE DD tables
has determinand: CAS 160430-64-8
has uom: kg.a-1
has table: WISE-SoE Emissions.Emissions

WISE-SoE_Emissions.Emissions - CAS_1610-18-0 - kg/a
type: Concept
notation: WISE-SoE_Emissions.Emissions - CAS_1610-18-0 - kg/a
definition: The unit of measure for 'CAS_1610-18-0' (Prometon) in WISE SoE - Emissions: Emissions table is 'kg/a'
status: valid
status modified: 2019-10-03
accepted date: 2019-10-03
in scheme: Definition of correct units for the observed determinands in the given WISE SoE DD tables
has determinand: CAS 1610-18-0
has uom: kg.a-1
has table: WISE-SoE Emissions.Emissions

WISE-SoE_Emissions.Emissions - CAS_16118-49-3 - kg/a
type: Concept
notation: WISE-SoE_Emissions.Emissions - CAS_16118-49-3 - kg/a
definition: The unit of measure for 'CAS_16118-49-3' (Carbetamide) in WISE SoE - Emissions: Emissions table is 'kg/a'
status: valid
status modified: 2019-10-03
accepted date: 2019-10-03
in scheme: Definition of correct units for the observed determinands in the given WISE SoE DD tables
has determinand: CAS 16118-49-3
has uom: kg.a-1
has table: WISE-SoE Emissions.Emissions

WISE-SoE_Emissions.Emissions - CAS_1634-04-4 - kg/a
type: Concept
notation: WISE-SoE_Emissions.Emissions - CAS_1634-04-4 - kg/a
definition: The unit of measure for 'CAS_1634-04-4' (MTBE) in WISE SoE - Emissions: Emissions table is 'kg/a'
status: valid
status modified: 2019-10-03
accepted date: 2019-10-03
in scheme: Definition of correct units for the observed determinands in the given WISE SoE DD tables
has determinand: CAS 1634-04-4
has uom: kg.a-1
has table: WISE-SoE Emissions.Emissions

WISE-SoE_Emissions.Emissions - CAS_1646-87-3 - kg/a
type: Concept
notation: WISE-SoE_Emissions.Emissions - CAS_1646-87-3 - kg/a
definition: The unit of measure for 'CAS_1646-87-3' (Aldicarb sulfoxide) in WISE SoE - Emissions: Emissions table is 'kg/a'
status: valid
status modified: 2019-10-03
accepted date: 2019-10-03
in scheme: Definition of correct units for the observed determinands in the given WISE SoE DD tables
has determinand: CAS 1646-87-3
has uom: kg.a-1
has table: WISE-SoE Emissions.Emissions

WISE-SoE_Emissions.Emissions - CAS_1646-88-4 - kg/a
type: Concept
notation: WISE-SoE_Emissions.Emissions - CAS_1646-88-4 - kg/a
definition: The unit of measure for 'CAS_1646-88-4' (Aldoxycarb) in WISE SoE - Emissions: Emissions table is 'kg/a'
status: valid
status modified: 2019-10-03
accepted date: 2019-10-03
in scheme: Definition of correct units for the observed determinands in the given WISE SoE DD tables
has determinand: CAS 1646-88-4
has uom: kg.a-1
has table: WISE-SoE Emissions.Emissions

WISE-SoE_Emissions.Emissions - CAS_16478-18-5 - kg/a
type: Concept
notation: WISE-SoE_Emissions.Emissions - CAS_16478-18-5 - kg/a
definition: The unit of measure for 'CAS_16478-18-5' (Pentachloroiodobenzene) in WISE SoE - Emissions: Emissions table is 'kg/a'
status: valid
status modified: 2019-10-03
accepted date: 2019-10-03
in scheme: Definition of correct units for the observed determinands in the given WISE SoE DD tables
has determinand: CAS 16478-18-5
has uom: kg.a-1
has table: WISE-SoE Emissions.Emissions

WISE-SoE_Emissions.Emissions - CAS_16484-77-8 - kg/a
type: Concept
notation: WISE-SoE_Emissions.Emissions - CAS_16484-77-8 - kg/a
definition: The unit of measure for 'CAS_16484-77-8' (Mecoprop-P (MCPP-P)) in WISE SoE - Emissions: Emissions table is 'kg/a'
status: valid
status modified: 2019-10-03
accepted date: 2019-10-03
in scheme: Definition of correct units for the observed determinands in the given WISE SoE DD tables
has determinand: CAS 16484-77-8
has uom: kg.a-1
has table: WISE-SoE Emissions.Emissions

WISE-SoE_Emissions.Emissions - CAS_16655-82-6 - kg/a
type: Concept
notation: WISE-SoE_Emissions.Emissions - CAS_16655-82-6 - kg/a
definition: The unit of measure for 'CAS_16655-82-6' (3-hydroxycarbofuran) in WISE SoE - Emissions: Emissions table is 'kg/a'
status: valid
status modified: 2019-10-03
accepted date: 2019-10-03
in scheme: Definition of correct units for the observed determinands in the given WISE SoE DD tables
has determinand: CAS 16655-82-6
has uom: kg.a-1
has table: WISE-SoE Emissions.Emissions

WISE-SoE_Emissions.Emissions - CAS_16672-87-0 - kg/a
type: Concept
notation: WISE-SoE_Emissions.Emissions - CAS_16672-87-0 - kg/a
definition: The unit of measure for 'CAS_16672-87-0' (2-chloroethylphosphonic acid) in WISE SoE - Emissions: Emissions table is 'kg/a'
status: valid
status modified: 2019-10-03
accepted date: 2019-10-03
in scheme: Definition of correct units for the observed determinands in the given WISE SoE DD tables
has determinand: CAS 16672-87-0
has uom: kg.a-1
has table: WISE-SoE Emissions.Emissions

WISE-SoE_Emissions.Emissions - CAS_1668-54-8 - kg/a
type: Concept
notation: WISE-SoE_Emissions.Emissions - CAS_1668-54-8 - kg/a
definition: The unit of measure for 'CAS_1668-54-8' (2-methyl-4-amino-6-methoxy-s-triazine) in WISE SoE - Emissions: Emissions table is 'kg/a'
status: valid
status modified: 2019-10-03
accepted date: 2019-10-03
in scheme: Definition of correct units for the observed determinands in the given WISE SoE DD tables
has determinand: CAS 1668-54-8
has uom: kg.a-1
has table: WISE-SoE Emissions.Emissions

WISE-SoE_Emissions.Emissions - CAS_16752-77-5 - kg/a
type: Concept
notation: WISE-SoE_Emissions.Emissions - CAS_16752-77-5 - kg/a
definition: The unit of measure for 'CAS_16752-77-5' (Methomyl) in WISE SoE - Emissions: Emissions table is 'kg/a'
status: valid
status modified: 2019-10-03
accepted date: 2019-10-03
in scheme: Definition of correct units for the observed determinands in the given WISE SoE DD tables
has determinand: CAS 16752-77-5
has uom: kg.a-1
has table: WISE-SoE Emissions.Emissions

WISE-SoE_Emissions.Emissions - CAS_16887-00-6 - kg/a
type: Concept
notation: WISE-SoE_Emissions.Emissions - CAS_16887-00-6 - kg/a
definition: The unit of measure for 'CAS_16887-00-6' (Chloride) in WISE SoE - Emissions: Emissions table is 'kg/a'
status: valid
status modified: 2019-10-03
accepted date: 2019-10-03
in scheme: Definition of correct units for the observed determinands in the given WISE SoE DD tables
has determinand: CAS 16887-00-6
has uom: kg.a-1
has table: WISE-SoE Emissions.Emissions

WISE-SoE_Emissions.Emissions - CAS_1689-83-4 - kg/a
type: Concept
notation: WISE-SoE_Emissions.Emissions - CAS_1689-83-4 - kg/a
definition: The unit of measure for 'CAS_1689-83-4' (Ioxynil) in WISE SoE - Emissions: Emissions table is 'kg/a'
status: valid
status modified: 2019-10-03
accepted date: 2019-10-03
in scheme: Definition of correct units for the observed determinands in the given WISE SoE DD tables
has determinand: CAS 1689-83-4
has uom: kg.a-1
has table: WISE-SoE Emissions.Emissions

WISE-SoE_Emissions.Emissions - CAS_1689-84-5 - kg/a
type: Concept
notation: WISE-SoE_Emissions.Emissions - CAS_1689-84-5 - kg/a
definition: The unit of measure for 'CAS_1689-84-5' (Bromoxynil) in WISE SoE - Emissions: Emissions table is 'kg/a'
status: valid
status modified: 2019-10-03
accepted date: 2019-10-03
in scheme: Definition of correct units for the observed determinands in the given WISE SoE DD tables
has determinand: CAS 1689-84-5
has uom: kg.a-1
has table: WISE-SoE Emissions.Emissions

WISE-SoE_Emissions.Emissions - CAS_1689-99-2 - kg/a
type: Concept
notation: WISE-SoE_Emissions.Emissions - CAS_1689-99-2 - kg/a
definition: The unit of measure for 'CAS_1689-99-2' (Bromoxynil octanoate) in WISE SoE - Emissions: Emissions table is 'kg/a'
status: valid
status modified: 2019-10-03
accepted date: 2019-10-03
in scheme: Definition of correct units for the observed determinands in the given WISE SoE DD tables
has determinand: CAS 1689-99-2
has uom: kg.a-1
has table: WISE-SoE Emissions.Emissions

WISE-SoE_Emissions.Emissions - CAS_1698-60-8 - kg/a
type: Concept
notation: WISE-SoE_Emissions.Emissions - CAS_1698-60-8 - kg/a
definition: The unit of measure for 'CAS_1698-60-8' (Chloridazon) in WISE SoE - Emissions: Emissions table is 'kg/a'
status: valid
status modified: 2019-10-03
accepted date: 2019-10-03
in scheme: Definition of correct units for the observed determinands in the given WISE SoE DD tables
has determinand: CAS 1698-60-8
has uom: kg.a-1
has table: WISE-SoE Emissions.Emissions

WISE-SoE_Emissions.Emissions - CAS_16984-48-8 - kg/a
type: Concept
notation: WISE-SoE_Emissions.Emissions - CAS_16984-48-8 - kg/a
definition: The unit of measure for 'CAS_16984-48-8' (Fluoride) in WISE SoE - Emissions: Emissions table is 'kg/a'
status: valid
status modified: 2019-10-03
accepted date: 2019-10-03
in scheme: Definition of correct units for the observed determinands in the given WISE SoE DD tables
has determinand: CAS 16984-48-8
has uom: kg.a-1
has table: WISE-SoE Emissions.Emissions

WISE-SoE_Emissions.Emissions - CAS_1702-17-6 - kg/a
type: Concept
notation: WISE-SoE_Emissions.Emissions - CAS_1702-17-6 - kg/a
definition: The unit of measure for 'CAS_1702-17-6' (Clopyralid) in WISE SoE - Emissions: Emissions table is 'kg/a'
status: valid
status modified: 2019-10-03
accepted date: 2019-10-03
in scheme: Definition of correct units for the observed determinands in the given WISE SoE DD tables
has determinand: CAS 1702-17-6
has uom: kg.a-1
has table: WISE-SoE Emissions.Emissions

WISE-SoE_Emissions.Emissions - CAS_17040-19-6 - kg/a
type: Concept
notation: WISE-SoE_Emissions.Emissions - CAS_17040-19-6 - kg/a
definition: The unit of measure for 'CAS_17040-19-6' (Demeton-S-methylsulfon) in WISE SoE - Emissions: Emissions table is 'kg/a'
status: valid
status modified: 2019-10-03
accepted date: 2019-10-03
in scheme: Definition of correct units for the observed determinands in the given WISE SoE DD tables
has determinand: CAS 17040-19-6
has uom: kg.a-1
has table: WISE-SoE Emissions.Emissions

WISE-SoE_Emissions.Emissions - CAS_171118-09-5 - kg/a
type: Concept
notation: WISE-SoE_Emissions.Emissions - CAS_171118-09-5 - kg/a
definition: The unit of measure for 'CAS_171118-09-5' (Metolachlor ESA) in WISE SoE - Emissions: Emissions table is 'kg/a'
status: valid
status modified: 2019-10-03
accepted date: 2019-10-03
in scheme: Definition of correct units for the observed determinands in the given WISE SoE DD tables
has determinand: CAS 171118-09-5
has uom: kg.a-1
has table: WISE-SoE Emissions.Emissions

WISE-SoE_Emissions.Emissions - CAS_171262-17-2 - kg/a
type: Concept
notation: WISE-SoE_Emissions.Emissions - CAS_171262-17-2 - kg/a
definition: The unit of measure for 'CAS_171262-17-2' (Alachlor OA) in WISE SoE - Emissions: Emissions table is 'kg/a'
status: valid
status modified: 2019-10-03
accepted date: 2019-10-03
in scheme: Definition of correct units for the observed determinands in the given WISE SoE DD tables
has determinand: CAS 171262-17-2
has uom: kg.a-1
has table: WISE-SoE Emissions.Emissions

WISE-SoE_Emissions.Emissions - CAS_17254-80-7 - kg/a
type: Concept
notation: WISE-SoE_Emissions.Emissions - CAS_17254-80-7 - kg/a
definition: The unit of measure for 'CAS_17254-80-7' (Chloridazon methyl desphenyl) in WISE SoE - Emissions: Emissions table is 'kg/a'
status: valid
status modified: 2019-10-03
accepted date: 2019-10-03
in scheme: Definition of correct units for the observed determinands in the given WISE SoE DD tables
has determinand: CAS 17254-80-7
has uom: kg.a-1
has table: WISE-SoE Emissions.Emissions

WISE-SoE_Emissions.Emissions - CAS_172960-62-2 - kg/a
type: Concept
notation: WISE-SoE_Emissions.Emissions - CAS_172960-62-2 - kg/a
definition: The unit of measure for 'CAS_172960-62-2' (Metazachlor ESA) in WISE SoE - Emissions: Emissions table is 'kg/a'
status: valid
status modified: 2019-10-03
accepted date: 2019-10-03
in scheme: Definition of correct units for the observed determinands in the given WISE SoE DD tables
has determinand: CAS 172960-62-2
has uom: kg.a-1
has table: WISE-SoE Emissions.Emissions

WISE-SoE_Emissions.Emissions - CAS_1746-01-6 - kg/a
type: Concept
notation: WISE-SoE_Emissions.Emissions - CAS_1746-01-6 - kg/a
definition: The unit of measure for 'CAS_1746-01-6' (TCDD (2,3,7,8-tetrachlorodibenzo-p-dioxin)) in WISE SoE - Emissions: Emissions table is 'kg/a'
status: valid
status modified: 2019-10-03
accepted date: 2019-10-03
in scheme: Definition of correct units for the observed determinands in the given WISE SoE DD tables
has determinand: CAS 1746-01-6
has uom: kg.a-1
has table: WISE-SoE Emissions.Emissions

WISE-SoE_Emissions.Emissions - CAS_1746-81-2 - kg/a
type: Concept
notation: WISE-SoE_Emissions.Emissions - CAS_1746-81-2 - kg/a
definition: The unit of measure for 'CAS_1746-81-2' (Monolinuron) in WISE SoE - Emissions: Emissions table is 'kg/a'
status: valid
status modified: 2019-10-03
accepted date: 2019-10-03
in scheme: Definition of correct units for the observed determinands in the given WISE SoE DD tables
has determinand: CAS 1746-81-2
has uom: kg.a-1
has table: WISE-SoE Emissions.Emissions

WISE-SoE_Emissions.Emissions - CAS_175013-18-0 - kg/a
type: Concept
notation: WISE-SoE_Emissions.Emissions - CAS_175013-18-0 - kg/a
definition: The unit of measure for 'CAS_175013-18-0' (Carbamic acid) in WISE SoE - Emissions: Emissions table is 'kg/a'
status: valid
status modified: 2019-10-03
accepted date: 2019-10-03
in scheme: Definition of correct units for the observed determinands in the given WISE SoE DD tables
has determinand: CAS 175013-18-0
has uom: kg.a-1
has table: WISE-SoE Emissions.Emissions

WISE-SoE_Emissions.Emissions - CAS_1763-23-1 - kg/a
type: Concept
notation: WISE-SoE_Emissions.Emissions - CAS_1763-23-1 - kg/a
definition: The unit of measure for 'CAS_1763-23-1' (Perfluorooctane sulfonic acid (PFOS) and its derivatives) in WISE SoE - Emissions: Emissions table is 'kg/a'
status: valid
status modified: 2019-10-03
accepted date: 2019-10-03
in scheme: Definition of correct units for the observed determinands in the given WISE SoE DD tables
has determinand: CAS 1763-23-1
has uom: kg.a-1
has table: WISE-SoE Emissions.Emissions

WISE-SoE_Emissions.Emissions - CAS_1806-26-4 - kg/a
type: Concept
notation: WISE-SoE_Emissions.Emissions - CAS_1806-26-4 - kg/a
definition: The unit of measure for 'CAS_1806-26-4' (Octylphenol) in WISE SoE - Emissions: Emissions table is 'kg/a'
status: valid
status modified: 2019-10-03
accepted date: 2019-10-03
in scheme: Definition of correct units for the observed determinands in the given WISE SoE DD tables
has determinand: CAS 1806-26-4
has uom: kg.a-1
has table: WISE-SoE Emissions.Emissions

WISE-SoE_Emissions.Emissions - CAS_18181-70-9 - kg/a
type: Concept
notation: WISE-SoE_Emissions.Emissions - CAS_18181-70-9 - kg/a
definition: The unit of measure for 'CAS_18181-70-9' (Iodofenphos) in WISE SoE - Emissions: Emissions table is 'kg/a'
status: valid
status modified: 2019-10-03
accepted date: 2019-10-03
in scheme: Definition of correct units for the observed determinands in the given WISE SoE DD tables
has determinand: CAS 18181-70-9
has uom: kg.a-1
has table: WISE-SoE Emissions.Emissions

WISE-SoE_Emissions.Emissions - CAS_18181-80-1 - kg/a
type: Concept
notation: WISE-SoE_Emissions.Emissions - CAS_18181-80-1 - kg/a
definition: The unit of measure for 'CAS_18181-80-1' (Bromopropylate) in WISE SoE - Emissions: Emissions table is 'kg/a'
status: valid
status modified: 2019-10-03
accepted date: 2019-10-03
in scheme: Definition of correct units for the observed determinands in the given WISE SoE DD tables
has determinand: CAS 18181-80-1
has uom: kg.a-1
has table: WISE-SoE Emissions.Emissions

WISE-SoE_Emissions.Emissions - CAS_182346-21-0 - kg/a
type: Concept
notation: WISE-SoE_Emissions.Emissions - CAS_182346-21-0 - kg/a
definition: The unit of measure for 'CAS_182346-21-0' (BDE 85 (2,2’,3,4,4’-pentabromodiphenyl ether)) in WISE SoE - Emissions: Emissions table is 'kg/a'
status: valid
status modified: 2019-10-03
accepted date: 2019-10-03
in scheme: Definition of correct units for the observed determinands in the given WISE SoE DD tables
has determinand: CAS 182346-21-0
has uom: kg.a-1
has table: WISE-SoE Emissions.Emissions

WISE-SoE_Emissions.Emissions - CAS_1825-21-4 - kg/a
type: Concept
notation: WISE-SoE_Emissions.Emissions - CAS_1825-21-4 - kg/a
definition: The unit of measure for 'CAS_1825-21-4' (Pentachloroanisole) in WISE SoE - Emissions: Emissions table is 'kg/a'
status: valid
status modified: 2019-10-03
accepted date: 2019-10-03
in scheme: Definition of correct units for the observed determinands in the given WISE SoE DD tables
has determinand: CAS 1825-21-4
has uom: kg.a-1
has table: WISE-SoE Emissions.Emissions

WISE-SoE_Emissions.Emissions - CAS_182636-13-1 - kg/a
type: Concept
notation: WISE-SoE_Emissions.Emissions - CAS_182636-13-1 - kg/a
definition: The unit of measure for 'CAS_182636-13-1' (Imazamox) in WISE SoE - Emissions: Emissions table is 'kg/a'
status: valid
status modified: 2019-10-03
accepted date: 2019-10-03
in scheme: Definition of correct units for the observed determinands in the given WISE SoE DD tables
has determinand: CAS 182636-13-1
has uom: kg.a-1
has table: WISE-SoE Emissions.Emissions

WISE-SoE_Emissions.Emissions - CAS_182677-30-1 - kg/a
type: Concept
notation: WISE-SoE_Emissions.Emissions - CAS_182677-30-1 - kg/a
definition: The unit of measure for 'CAS_182677-30-1' (BDE 138 (2,2’,3,4,4’,5’-hexabromodiphenyl ether)) in WISE SoE - Emissions: Emissions table is 'kg/a'
status: valid
status modified: 2019-10-03
accepted date: 2019-10-03
in scheme: Definition of correct units for the observed determinands in the given WISE SoE DD tables
has determinand: CAS 182677-30-1
has uom: kg.a-1
has table: WISE-SoE Emissions.Emissions

WISE-SoE_Emissions.Emissions - CAS_1836-75-5 - kg/a
type: Concept
notation: WISE-SoE_Emissions.Emissions - CAS_1836-75-5 - kg/a
definition: The unit of measure for 'CAS_1836-75-5' (Nitrophen) in WISE SoE - Emissions: Emissions table is 'kg/a'
status: valid
status modified: 2019-10-03
accepted date: 2019-10-03
in scheme: Definition of correct units for the observed determinands in the given WISE SoE DD tables
has determinand: CAS 1836-75-5
has uom: kg.a-1
has table: WISE-SoE Emissions.Emissions

WISE-SoE_Emissions.Emissions - CAS_185119-76-0 - kg/a
type: Concept
notation: WISE-SoE_Emissions.Emissions - CAS_185119-76-0 - kg/a
definition: The unit of measure for 'CAS_185119-76-0' (Iodosulfuron-methyl) in WISE SoE - Emissions: Emissions table is 'kg/a'
status: valid
status modified: 2019-10-03
accepted date: 2019-10-03
in scheme: Definition of correct units for the observed determinands in the given WISE SoE DD tables
has determinand: CAS 185119-76-0
has uom: kg.a-1
has table: WISE-SoE Emissions.Emissions

WISE-SoE_Emissions.Emissions - CAS_18540-29-9 - kg/a
type: Concept
notation: WISE-SoE_Emissions.Emissions - CAS_18540-29-9 - kg/a
definition: The unit of measure for 'CAS_18540-29-9' (Chromium (VI)) in WISE SoE - Emissions: Emissions table is 'kg/a'
status: valid
status modified: 2019-10-03
accepted date: 2019-10-03
in scheme: Definition of correct units for the observed determinands in the given WISE SoE DD tables
has determinand: CAS 18540-29-9
has uom: kg.a-1
has table: WISE-SoE Emissions.Emissions

WISE-SoE_Emissions.Emissions - CAS_1861-40-1 - kg/a
type: Concept
notation: WISE-SoE_Emissions.Emissions - CAS_1861-40-1 - kg/a
definition: The unit of measure for 'CAS_1861-40-1' (Benfluralin) in WISE SoE - Emissions: Emissions table is 'kg/a'
status: valid
status modified: 2019-10-03
accepted date: 2019-10-03
in scheme: Definition of correct units for the observed determinands in the given WISE SoE DD tables
has determinand: CAS 1861-40-1
has uom: kg.a-1
has table: WISE-SoE Emissions.Emissions

WISE-SoE_Emissions.Emissions - CAS_18691-97-9 - kg/a
type: Concept
notation: WISE-SoE_Emissions.Emissions - CAS_18691-97-9 - kg/a
definition: The unit of measure for 'CAS_18691-97-9' (Methabenzthiazuron) in WISE SoE - Emissions: Emissions table is 'kg/a'
status: valid
status modified: 2019-10-03
accepted date: 2019-10-03
in scheme: Definition of correct units for the observed determinands in the given WISE SoE DD tables
has determinand: CAS 18691-97-9
has uom: kg.a-1
has table: WISE-SoE Emissions.Emissions

WISE-SoE_Emissions.Emissions - CAS_187022-11-3 - kg/a
type: Concept
notation: WISE-SoE_Emissions.Emissions - CAS_187022-11-3 - kg/a
definition: The unit of measure for 'CAS_187022-11-3' (Acetochlor ESA) in WISE SoE - Emissions: Emissions table is 'kg/a'
status: valid
status modified: 2019-10-03
accepted date: 2019-10-03
in scheme: Definition of correct units for the observed determinands in the given WISE SoE DD tables
has determinand: CAS 187022-11-3
has uom: kg.a-1
has table: WISE-SoE Emissions.Emissions

WISE-SoE_Emissions.Emissions - CAS_18785-72-3 - t/a
type: Concept
notation: WISE-SoE_Emissions.Emissions - CAS_18785-72-3 - t/a
definition: The unit of measure for 'CAS_18785-72-3' (Sulphate) in WISE SoE - Emissions: Emissions table is 't/a'
status: valid
status modified: 2019-10-03
accepted date: 2019-10-03
in scheme: Definition of correct units for the observed determinands in the given WISE SoE DD tables
has determinand: CAS 18785-72-3
has uom: t.a-1
has table: WISE-SoE Emissions.Emissions

WISE-SoE_Emissions.Emissions - CAS_188425-85-6 - kg/a
type: Concept
notation: WISE-SoE_Emissions.Emissions - CAS_188425-85-6 - kg/a
definition: The unit of measure for 'CAS_188425-85-6' (Boscalid) in WISE SoE - Emissions: Emissions table is 'kg/a'
status: valid
status modified: 2019-10-03
accepted date: 2019-10-03
in scheme: Definition of correct units for the observed determinands in the given WISE SoE DD tables
has determinand: CAS 188425-85-6
has uom: kg.a-1
has table: WISE-SoE Emissions.Emissions

WISE-SoE_Emissions.Emissions - CAS_189-55-9 - kg/a
type: Concept
notation: WISE-SoE_Emissions.Emissions - CAS_189-55-9 - kg/a
definition: The unit of measure for 'CAS_189-55-9' (Dibenzo(a,i)pyrene) in WISE SoE - Emissions: Emissions table is 'kg/a'
status: valid
status modified: 2019-10-03
accepted date: 2019-10-03
in scheme: Definition of correct units for the observed determinands in the given WISE SoE DD tables
has determinand: CAS 189-55-9
has uom: kg.a-1
has table: WISE-SoE Emissions.Emissions

WISE-SoE_Emissions.Emissions - CAS_189084-64-8 - kg/a
type: Concept
notation: WISE-SoE_Emissions.Emissions - CAS_189084-64-8 - kg/a
definition: The unit of measure for 'CAS_189084-64-8' (BDE 100 (2,2’,4,4’,6-pentabromodiphenyl ether)) in WISE SoE - Emissions: Emissions table is 'kg/a'
status: valid
status modified: 2019-10-03
accepted date: 2019-10-03
in scheme: Definition of correct units for the observed determinands in the given WISE SoE DD tables
has determinand: CAS 189084-64-8
has uom: kg.a-1
has table: WISE-SoE Emissions.Emissions

WISE-SoE_Emissions.Emissions - CAS_1897-45-6 - kg/a
type: Concept
notation: WISE-SoE_Emissions.Emissions - CAS_1897-45-6 - kg/a
definition: The unit of measure for 'CAS_1897-45-6' (Chlorothalonil) in WISE SoE - Emissions: Emissions table is 'kg/a'
status: valid
status modified: 2019-10-03
accepted date: 2019-10-03
in scheme: Definition of correct units for the observed determinands in the given WISE SoE DD tables
has determinand: CAS 1897-45-6
has uom: kg.a-1
has table: WISE-SoE Emissions.Emissions

WISE-SoE_Emissions.Emissions - CAS_191-24-2 - kg/a
type: Concept
notation: WISE-SoE_Emissions.Emissions - CAS_191-24-2 - kg/a
definition: The unit of measure for 'CAS_191-24-2' (Benzo(g,h,i)perylene) in WISE SoE - Emissions: Emissions table is 'kg/a'
status: valid
status modified: 2019-10-03
accepted date: 2019-10-03
in scheme: Definition of correct units for the observed determinands in the given WISE SoE DD tables
has determinand: CAS 191-24-2
has uom: kg.a-1
has table: WISE-SoE Emissions.Emissions

WISE-SoE_Emissions.Emissions - CAS_191-30-0 - kg/a
type: Concept
notation: WISE-SoE_Emissions.Emissions - CAS_191-30-0 - kg/a
definition: The unit of measure for 'CAS_191-30-0' (Dibenzo(a,l)pyrene) in WISE SoE - Emissions: Emissions table is 'kg/a'
status: valid
status modified: 2019-10-03
accepted date: 2019-10-03
in scheme: Definition of correct units for the observed determinands in the given WISE SoE DD tables
has determinand: CAS 191-30-0
has uom: kg.a-1
has table: WISE-SoE Emissions.Emissions

WISE-SoE_Emissions.Emissions - CAS_1912-24-9 - kg/a
type: Concept
notation: WISE-SoE_Emissions.Emissions - CAS_1912-24-9 - kg/a
definition: The unit of measure for 'CAS_1912-24-9' (Atrazine) in WISE SoE - Emissions: Emissions table is 'kg/a'
status: valid
status modified: 2019-10-03
accepted date: 2019-10-03
in scheme: Definition of correct units for the observed determinands in the given WISE SoE DD tables
has determinand: CAS 1912-24-9
has uom: kg.a-1
has table: WISE-SoE Emissions.Emissions

WISE-SoE_Emissions.Emissions - CAS_1912-26-1 - kg/a
type: Concept
notation: WISE-SoE_Emissions.Emissions - CAS_1912-26-1 - kg/a
definition: The unit of measure for 'CAS_1912-26-1' (Trietazine) in WISE SoE - Emissions: Emissions table is 'kg/a'
status: valid
status modified: 2019-10-03
accepted date: 2019-10-03
in scheme: Definition of correct units for the observed determinands in the given WISE SoE DD tables
has determinand: CAS 1912-26-1
has uom: kg.a-1
has table: WISE-SoE Emissions.Emissions

WISE-SoE_Emissions.Emissions - CAS_1918-00-9 - kg/a
type: Concept
notation: WISE-SoE_Emissions.Emissions - CAS_1918-00-9 - kg/a
definition: The unit of measure for 'CAS_1918-00-9' (Dicamba) in WISE SoE - Emissions: Emissions table is 'kg/a'
status: valid
status modified: 2019-10-03
accepted date: 2019-10-03
in scheme: Definition of correct units for the observed determinands in the given WISE SoE DD tables
has determinand: CAS 1918-00-9
has uom: kg.a-1
has table: WISE-SoE Emissions.Emissions

WISE-SoE_Emissions.Emissions - CAS_1918-02-1 - kg/a
type: Concept
notation: WISE-SoE_Emissions.Emissions - CAS_1918-02-1 - kg/a
definition: The unit of measure for 'CAS_1918-02-1' (Picloram) in WISE SoE - Emissions: Emissions table is 'kg/a'
status: valid
status modified: 2019-10-03
accepted date: 2019-10-03
in scheme: Definition of correct units for the observed determinands in the given WISE SoE DD tables
has determinand: CAS 1918-02-1
has uom: kg.a-1
has table: WISE-SoE Emissions.Emissions

WISE-SoE_Emissions.Emissions - CAS_1918-13-4 - kg/a
type: Concept
notation: WISE-SoE_Emissions.Emissions - CAS_1918-13-4 - kg/a
definition: The unit of measure for 'CAS_1918-13-4' (Chlorthiamid) in WISE SoE - Emissions: Emissions table is 'kg/a'
status: valid
status modified: 2019-10-03
accepted date: 2019-10-03
in scheme: Definition of correct units for the observed determinands in the given WISE SoE DD tables
has determinand: CAS 1918-13-4
has uom: kg.a-1
has table: WISE-SoE Emissions.Emissions

WISE-SoE_Emissions.Emissions - CAS_1918-16-7 - kg/a
type: Concept
notation: WISE-SoE_Emissions.Emissions - CAS_1918-16-7 - kg/a
definition: The unit of measure for 'CAS_1918-16-7' (Propachlor) in WISE SoE - Emissions: Emissions table is 'kg/a'
status: valid
status modified: 2019-10-03
accepted date: 2019-10-03
in scheme: Definition of correct units for the observed determinands in the given WISE SoE DD tables
has determinand: CAS 1918-16-7
has uom: kg.a-1
has table: WISE-SoE Emissions.Emissions

WISE-SoE_Emissions.Emissions - CAS_192-65-4 - kg/a
type: Concept
notation: WISE-SoE_Emissions.Emissions - CAS_192-65-4 - kg/a
definition: The unit of measure for 'CAS_192-65-4' (Dibenzo(a,e)pyrene) in WISE SoE - Emissions: Emissions table is 'kg/a'
status: valid
status modified: 2019-10-03
accepted date: 2019-10-03
in scheme: Definition of correct units for the observed determinands in the given WISE SoE DD tables
has determinand: CAS 192-65-4
has uom: kg.a-1
has table: WISE-SoE Emissions.Emissions

WISE-SoE_Emissions.Emissions - CAS_192-97-2 - kg/a
type: Concept
notation: WISE-SoE_Emissions.Emissions - CAS_192-97-2 - kg/a
definition: The unit of measure for 'CAS_192-97-2' (Benzo[e]pyrene) in WISE SoE - Emissions: Emissions table is 'kg/a'
status: valid
status modified: 2019-10-03
accepted date: 2019-10-03
in scheme: Definition of correct units for the observed determinands in the given WISE SoE DD tables
has determinand: CAS 192-97-2
has uom: kg.a-1
has table: WISE-SoE Emissions.Emissions

WISE-SoE_Emissions.Emissions - CAS_193-39-5 - kg/a
type: Concept
notation: WISE-SoE_Emissions.Emissions - CAS_193-39-5 - kg/a
definition: The unit of measure for 'CAS_193-39-5' (Indeno(1,2,3-cd)pyrene) in WISE SoE - Emissions: Emissions table is 'kg/a'
status: valid
status modified: 2019-10-03
accepted date: 2019-10-03
in scheme: Definition of correct units for the observed determinands in the given WISE SoE DD tables
has determinand: CAS 193-39-5
has uom: kg.a-1
has table: WISE-SoE Emissions.Emissions

WISE-SoE_Emissions.Emissions - CAS_19408-74-3 - kg/a
type: Concept
notation: WISE-SoE_Emissions.Emissions - CAS_19408-74-3 - kg/a
definition: The unit of measure for 'CAS_19408-74-3' (1,2,3,7,8,9-H6CDD) in WISE SoE - Emissions: Emissions table is 'kg/a'
status: valid
status modified: 2019-10-03
accepted date: 2019-10-03
in scheme: Definition of correct units for the observed determinands in the given WISE SoE DD tables
has determinand: CAS 19408-74-3
has uom: kg.a-1
has table: WISE-SoE Emissions.Emissions

WISE-SoE_Emissions.Emissions - CAS_194992-44-4 - kg/a
type: Concept
notation: WISE-SoE_Emissions.Emissions - CAS_194992-44-4 - kg/a
definition: The unit of measure for 'CAS_194992-44-4' (Acetochlor OA) in WISE SoE - Emissions: Emissions table is 'kg/a'
status: valid
status modified: 2019-10-03
accepted date: 2019-10-03
in scheme: Definition of correct units for the observed determinands in the given WISE SoE DD tables
has determinand: CAS 194992-44-4
has uom: kg.a-1
has table: WISE-SoE Emissions.Emissions

WISE-SoE_Emissions.Emissions - CAS_19666-30-9 - kg/a
type: Concept
notation: WISE-SoE_Emissions.Emissions - CAS_19666-30-9 - kg/a
definition: The unit of measure for 'CAS_19666-30-9' (Oxadiazon) in WISE SoE - Emissions: Emissions table is 'kg/a'
status: valid
status modified: 2019-10-03
accepted date: 2019-10-03
in scheme: Definition of correct units for the observed determinands in the given WISE SoE DD tables
has determinand: CAS 19666-30-9
has uom: kg.a-1
has table: WISE-SoE Emissions.Emissions

WISE-SoE_Emissions.Emissions - CAS_198-55-0 - kg/a
type: Concept
notation: WISE-SoE_Emissions.Emissions - CAS_198-55-0 - kg/a
definition: The unit of measure for 'CAS_198-55-0' (Perylene) in WISE SoE - Emissions: Emissions table is 'kg/a'
status: valid
status modified: 2019-10-03
accepted date: 2019-10-03
in scheme: Definition of correct units for the observed determinands in the given WISE SoE DD tables
has determinand: CAS 198-55-0
has uom: kg.a-1
has table: WISE-SoE Emissions.Emissions

WISE-SoE_Emissions.Emissions - CAS_1982-47-4 - kg/a
type: Concept
notation: WISE-SoE_Emissions.Emissions - CAS_1982-47-4 - kg/a
definition: The unit of measure for 'CAS_1982-47-4' (Chloroxuron) in WISE SoE - Emissions: Emissions table is 'kg/a'
status: valid
status modified: 2019-10-03
accepted date: 2019-10-03
in scheme: Definition of correct units for the observed determinands in the given WISE SoE DD tables
has determinand: CAS 1982-47-4
has uom: kg.a-1
has table: WISE-SoE Emissions.Emissions

WISE-SoE_Emissions.Emissions - CAS_19937-59-8 - kg/a
type: Concept
notation: WISE-SoE_Emissions.Emissions - CAS_19937-59-8 - kg/a
definition: The unit of measure for 'CAS_19937-59-8' (Metoxuron) in WISE SoE - Emissions: Emissions table is 'kg/a'
status: valid
status modified: 2019-10-03
accepted date: 2019-10-03
in scheme: Definition of correct units for the observed determinands in the given WISE SoE DD tables
has determinand: CAS 19937-59-8
has uom: kg.a-1
has table: WISE-SoE Emissions.Emissions

WISE-SoE_Emissions.Emissions - CAS_2008-58-4 - kg/a
type: Concept
notation: WISE-SoE_Emissions.Emissions - CAS_2008-58-4 - kg/a
definition: The unit of measure for 'CAS_2008-58-4' (2,6-dichlorobenzamide) in WISE SoE - Emissions: Emissions table is 'kg/a'
status: valid
status modified: 2019-10-03
accepted date: 2019-10-03
in scheme: Definition of correct units for the observed determinands in the given WISE SoE DD tables
has determinand: CAS 2008-58-4
has uom: kg.a-1
has table: WISE-SoE Emissions.Emissions

WISE-SoE_Emissions.Emissions - CAS_201668-32-8 - kg/a
type: Concept
notation: WISE-SoE_Emissions.Emissions - CAS_201668-32-8 - kg/a
definition: The unit of measure for 'CAS_201668-32-8' (Flufenacet ESA) in WISE SoE - Emissions: Emissions table is 'kg/a'
status: valid
status modified: 2019-10-03
accepted date: 2019-10-03
in scheme: Definition of correct units for the observed determinands in the given WISE SoE DD tables
has determinand: CAS 201668-32-8
has uom: kg.a-1
has table: WISE-SoE Emissions.Emissions

WISE-SoE_Emissions.Emissions - CAS_2032-65-7 - kg/a
type: Concept
notation: WISE-SoE_Emissions.Emissions - CAS_2032-65-7 - kg/a
definition: The unit of measure for 'CAS_2032-65-7' (Methiocarb) in WISE SoE - Emissions: Emissions table is 'kg/a'
status: valid
status modified: 2019-10-03
accepted date: 2019-10-03
in scheme: Definition of correct units for the observed determinands in the given WISE SoE DD tables
has determinand: CAS 2032-65-7
has uom: kg.a-1
has table: WISE-SoE Emissions.Emissions

WISE-SoE_Emissions.Emissions - CAS_20461-54-5 - kg/a
type: Concept
notation: WISE-SoE_Emissions.Emissions - CAS_20461-54-5 - kg/a
definition: The unit of measure for 'CAS_20461-54-5' (Iodide) in WISE SoE - Emissions: Emissions table is 'kg/a'
status: valid
status modified: 2019-10-03
accepted date: 2019-10-03
in scheme: Definition of correct units for the observed determinands in the given WISE SoE DD tables
has determinand: CAS 20461-54-5
has uom: kg.a-1
has table: WISE-SoE Emissions.Emissions

WISE-SoE_Emissions.Emissions - CAS_205-82-3 - kg/a
type: Concept
notation: WISE-SoE_Emissions.Emissions - CAS_205-82-3 - kg/a
definition: The unit of measure for 'CAS_205-82-3' (Benzo(j)fluoranthene) in WISE SoE - Emissions: Emissions table is 'kg/a'
status: valid
status modified: 2019-10-03
accepted date: 2019-10-03
in scheme: Definition of correct units for the observed determinands in the given WISE SoE DD tables
has determinand: CAS 205-82-3
has uom: kg.a-1
has table: WISE-SoE Emissions.Emissions

WISE-SoE_Emissions.Emissions - CAS_205-99-2 - kg/a
type: Concept
notation: WISE-SoE_Emissions.Emissions - CAS_205-99-2 - kg/a
definition: The unit of measure for 'CAS_205-99-2' (Benzo(b)fluoranthene) in WISE SoE - Emissions: Emissions table is 'kg/a'
status: valid
status modified: 2019-10-03
accepted date: 2019-10-03
in scheme: Definition of correct units for the observed determinands in the given WISE SoE DD tables
has determinand: CAS 205-99-2
has uom: kg.a-1
has table: WISE-SoE Emissions.Emissions

WISE-SoE_Emissions.Emissions - CAS_2051-24-3 - kg/a
type: Concept
notation: WISE-SoE_Emissions.Emissions - CAS_2051-24-3 - kg/a
definition: The unit of measure for 'CAS_2051-24-3' (PCB 209 (5,5’,6,6’-decachlorobiphenyl)) in WISE SoE - Emissions: Emissions table is 'kg/a'
status: valid
status modified: 2019-10-03
accepted date: 2019-10-03
in scheme: Definition of correct units for the observed determinands in the given WISE SoE DD tables
has determinand: CAS 2051-24-3
has uom: kg.a-1
has table: WISE-SoE Emissions.Emissions

WISE-SoE_Emissions.Emissions - CAS_205939-58-8 - kg/a
type: Concept
notation: WISE-SoE_Emissions.Emissions - CAS_205939-58-8 - kg/a
definition: The unit of measure for 'CAS_205939-58-8' (Dimethenamid ESA) in WISE SoE - Emissions: Emissions table is 'kg/a'
status: valid
status modified: 2019-10-03
accepted date: 2019-10-03
in scheme: Definition of correct units for the observed determinands in the given WISE SoE DD tables
has determinand: CAS 205939-58-8
has uom: kg.a-1
has table: WISE-SoE Emissions.Emissions

WISE-SoE_Emissions.Emissions - CAS_206-44-0 - kg/a
type: Concept
notation: WISE-SoE_Emissions.Emissions - CAS_206-44-0 - kg/a
definition: The unit of measure for 'CAS_206-44-0' (Fluoranthene) in WISE SoE - Emissions: Emissions table is 'kg/a'
status: valid
status modified: 2019-10-03
accepted date: 2019-10-03
in scheme: Definition of correct units for the observed determinands in the given WISE SoE DD tables
has determinand: CAS 206-44-0
has uom: kg.a-1
has table: WISE-SoE Emissions.Emissions

WISE-SoE_Emissions.Emissions - CAS_207-08-9 - kg/a
type: Concept
notation: WISE-SoE_Emissions.Emissions - CAS_207-08-9 - kg/a
definition: The unit of measure for 'CAS_207-08-9' (Benzo(k)fluoranthene) in WISE SoE - Emissions: Emissions table is 'kg/a'
status: valid
status modified: 2019-10-03
accepted date: 2019-10-03
in scheme: Definition of correct units for the observed determinands in the given WISE SoE DD tables
has determinand: CAS 207-08-9
has uom: kg.a-1
has table: WISE-SoE Emissions.Emissions

WISE-SoE_Emissions.Emissions - CAS_207122-15-4 - kg/a
type: Concept
notation: WISE-SoE_Emissions.Emissions - CAS_207122-15-4 - kg/a
definition: The unit of measure for 'CAS_207122-15-4' (BDE 154 (2,2’,4,4’,5,6’-hexabromodiphenyl ether)) in WISE SoE - Emissions: Emissions table is 'kg/a'
status: valid
status modified: 2019-10-03
accepted date: 2019-10-03
in scheme: Definition of correct units for the observed determinands in the given WISE SoE DD tables
has determinand: CAS 207122-15-4
has uom: kg.a-1
has table: WISE-SoE Emissions.Emissions

WISE-SoE_Emissions.Emissions - CAS_208-96-8 - kg/a
type: Concept
notation: WISE-SoE_Emissions.Emissions - CAS_208-96-8 - kg/a
definition: The unit of measure for 'CAS_208-96-8' (Acenaphthylene) in WISE SoE - Emissions: Emissions table is 'kg/a'
status: valid
status modified: 2019-10-03
accepted date: 2019-10-03
in scheme: Definition of correct units for the observed determinands in the given WISE SoE DD tables
has determinand: CAS 208-96-8
has uom: kg.a-1
has table: WISE-SoE Emissions.Emissions

WISE-SoE_Emissions.Emissions - CAS_2104-64-5 - kg/a
type: Concept
notation: WISE-SoE_Emissions.Emissions - CAS_2104-64-5 - kg/a
definition: The unit of measure for 'CAS_2104-64-5' (Ethyl O-(p-nitrophenyl) phenyl phosphonothionate (EPN)) in WISE SoE - Emissions: Emissions table is 'kg/a'
status: valid
status modified: 2019-10-03
accepted date: 2019-10-03
in scheme: Definition of correct units for the observed determinands in the given WISE SoE DD tables
has determinand: CAS 2104-64-5
has uom: kg.a-1
has table: WISE-SoE Emissions.Emissions

WISE-SoE_Emissions.Emissions - CAS_2104-96-3 - kg/a
type: Concept
notation: WISE-SoE_Emissions.Emissions - CAS_2104-96-3 - kg/a
definition: The unit of measure for 'CAS_2104-96-3' (Bromophos) in WISE SoE - Emissions: Emissions table is 'kg/a'
status: valid
status modified: 2019-10-03
accepted date: 2019-10-03
in scheme: Definition of correct units for the observed determinands in the given WISE SoE DD tables
has determinand: CAS 2104-96-3
has uom: kg.a-1
has table: WISE-SoE Emissions.Emissions

WISE-SoE_Emissions.Emissions - CAS_21087-64-9 - kg/a
type: Concept
notation: WISE-SoE_Emissions.Emissions - CAS_21087-64-9 - kg/a
definition: The unit of measure for 'CAS_21087-64-9' (Metribuzin) in WISE SoE - Emissions: Emissions table is 'kg/a'
status: valid
status modified: 2019-10-03
accepted date: 2019-10-03
in scheme: Definition of correct units for the observed determinands in the given WISE SoE DD tables
has determinand: CAS 21087-64-9
has uom: kg.a-1
has table: WISE-SoE Emissions.Emissions

WISE-SoE_Emissions.Emissions - CAS_210880-92-5 - kg/a
type: Concept
notation: WISE-SoE_Emissions.Emissions - CAS_210880-92-5 - kg/a
definition: The unit of measure for 'CAS_210880-92-5' (Clothianidin) in WISE SoE - Emissions: Emissions table is 'kg/a'
status: valid
status modified: 2019-10-03
accepted date: 2019-10-03
in scheme: Definition of correct units for the observed determinands in the given WISE SoE DD tables
has determinand: CAS 210880-92-5
has uom: kg.a-1
has table: WISE-SoE Emissions.Emissions

WISE-SoE_Emissions.Emissions - CAS_2163-68-0 - kg/a
type: Concept
notation: WISE-SoE_Emissions.Emissions - CAS_2163-68-0 - kg/a
definition: The unit of measure for 'CAS_2163-68-0' (Hydroxyatrazine) in WISE SoE - Emissions: Emissions table is 'kg/a'
status: valid
status modified: 2019-10-03
accepted date: 2019-10-03
in scheme: Definition of correct units for the observed determinands in the given WISE SoE DD tables
has determinand: CAS 2163-68-0
has uom: kg.a-1
has table: WISE-SoE Emissions.Emissions

WISE-SoE_Emissions.Emissions - CAS_2164-08-1 - kg/a
type: Concept
notation: WISE-SoE_Emissions.Emissions - CAS_2164-08-1 - kg/a
definition: The unit of measure for 'CAS_2164-08-1' (Lenacil) in WISE SoE - Emissions: Emissions table is 'kg/a'
status: valid
status modified: 2019-10-03
accepted date: 2019-10-03
in scheme: Definition of correct units for the observed determinands in the given WISE SoE DD tables
has determinand: CAS 2164-08-1
has uom: kg.a-1
has table: WISE-SoE Emissions.Emissions

WISE-SoE_Emissions.Emissions - CAS_21725-46-2 - kg/a
type: Concept
notation: WISE-SoE_Emissions.Emissions - CAS_21725-46-2 - kg/a
definition: The unit of measure for 'CAS_21725-46-2' (Cyanazine) in WISE SoE - Emissions: Emissions table is 'kg/a'
status: valid
status modified: 2019-10-03
accepted date: 2019-10-03
in scheme: Definition of correct units for the observed determinands in the given WISE SoE DD tables
has determinand: CAS 21725-46-2
has uom: kg.a-1
has table: WISE-SoE Emissions.Emissions

WISE-SoE_Emissions.Emissions - CAS_218-01-9 - kg/a
type: Concept
notation: WISE-SoE_Emissions.Emissions - CAS_218-01-9 - kg/a
definition: The unit of measure for 'CAS_218-01-9' (Chrysene) in WISE SoE - Emissions: Emissions table is 'kg/a'
status: valid
status modified: 2019-10-03
accepted date: 2019-10-03
in scheme: Definition of correct units for the observed determinands in the given WISE SoE DD tables
has determinand: CAS 218-01-9
has uom: kg.a-1
has table: WISE-SoE Emissions.Emissions

WISE-SoE_Emissions.Emissions - CAS_2212-67-1 - kg/a
type: Concept
notation: WISE-SoE_Emissions.Emissions - CAS_2212-67-1 - kg/a
definition: The unit of measure for 'CAS_2212-67-1' (Molinate) in WISE SoE - Emissions: Emissions table is 'kg/a'
status: valid
status modified: 2019-10-03
accepted date: 2019-10-03
in scheme: Definition of correct units for the observed determinands in the given WISE SoE DD tables
has determinand: CAS 2212-67-1
has uom: kg.a-1
has table: WISE-SoE Emissions.Emissions

WISE-SoE_Emissions.Emissions - CAS_22204-53-1 - kg/a
type: Concept
notation: WISE-SoE_Emissions.Emissions - CAS_22204-53-1 - kg/a
definition: The unit of measure for 'CAS_22204-53-1' (Naproxen) in WISE SoE - Emissions: Emissions table is 'kg/a'
status: valid
status modified: 2019-10-03
accepted date: 2019-10-03
in scheme: Definition of correct units for the observed determinands in the given WISE SoE DD tables
has determinand: CAS 22204-53-1
has uom: kg.a-1
has table: WISE-SoE Emissions.Emissions

WISE-SoE_Emissions.Emissions - CAS_22224-92-6 - kg/a
type: Concept
notation: WISE-SoE_Emissions.Emissions - CAS_22224-92-6 - kg/a
definition: The unit of measure for 'CAS_22224-92-6' (Fenamiphos) in WISE SoE - Emissions: Emissions table is 'kg/a'
status: valid
status modified: 2019-10-03
accepted date: 2019-10-03
in scheme: Definition of correct units for the observed determinands in the given WISE SoE DD tables
has determinand: CAS 22224-92-6
has uom: kg.a-1
has table: WISE-SoE Emissions.Emissions

WISE-SoE_Emissions.Emissions - CAS_2227-13-6 - kg/a
type: Concept
notation: WISE-SoE_Emissions.Emissions - CAS_2227-13-6 - kg/a
definition: The unit of measure for 'CAS_2227-13-6' (Tetrasul) in WISE SoE - Emissions: Emissions table is 'kg/a'
status: valid
status modified: 2019-10-03
accepted date: 2019-10-03
in scheme: Definition of correct units for the observed determinands in the given WISE SoE DD tables
has determinand: CAS 2227-13-6
has uom: kg.a-1
has table: WISE-SoE Emissions.Emissions

WISE-SoE_Emissions.Emissions - CAS_2234-13-1 - kg/a
type: Concept
notation: WISE-SoE_Emissions.Emissions - CAS_2234-13-1 - kg/a
definition: The unit of measure for 'CAS_2234-13-1' (Octachloronaphthalene) in WISE SoE - Emissions: Emissions table is 'kg/a'
status: valid
status modified: 2019-10-03
accepted date: 2019-10-03
in scheme: Definition of correct units for the observed determinands in the given WISE SoE DD tables
has determinand: CAS 2234-13-1
has uom: kg.a-1
has table: WISE-SoE Emissions.Emissions

WISE-SoE_Emissions.Emissions - CAS_22781-23-3 - kg/a
type: Concept
notation: WISE-SoE_Emissions.Emissions - CAS_22781-23-3 - kg/a
definition: The unit of measure for 'CAS_22781-23-3' (Bendiocarb) in WISE SoE - Emissions: Emissions table is 'kg/a'
status: valid
status modified: 2019-10-03
accepted date: 2019-10-03
in scheme: Definition of correct units for the observed determinands in the given WISE SoE DD tables
has determinand: CAS 22781-23-3
has uom: kg.a-1
has table: WISE-SoE Emissions.Emissions

WISE-SoE_Emissions.Emissions - CAS_2303-17-5 - kg/a
type: Concept
notation: WISE-SoE_Emissions.Emissions - CAS_2303-17-5 - kg/a
definition: The unit of measure for 'CAS_2303-17-5' (Tri-allate) in WISE SoE - Emissions: Emissions table is 'kg/a'
status: valid
status modified: 2019-10-03
accepted date: 2019-10-03
in scheme: Definition of correct units for the observed determinands in the given WISE SoE DD tables
has determinand: CAS 2303-17-5
has uom: kg.a-1
has table: WISE-SoE Emissions.Emissions

WISE-SoE_Emissions.Emissions - CAS_2310-17-0 - kg/a
type: Concept
notation: WISE-SoE_Emissions.Emissions - CAS_2310-17-0 - kg/a
definition: The unit of measure for 'CAS_2310-17-0' (Phosalone) in WISE SoE - Emissions: Emissions table is 'kg/a'
status: valid
status modified: 2019-10-03
accepted date: 2019-10-03
in scheme: Definition of correct units for the observed determinands in the given WISE SoE DD tables
has determinand: CAS 2310-17-0
has uom: kg.a-1
has table: WISE-SoE Emissions.Emissions

WISE-SoE_Emissions.Emissions - CAS_23103-98-2 - kg/a
type: Concept
notation: WISE-SoE_Emissions.Emissions - CAS_23103-98-2 - kg/a
definition: The unit of measure for 'CAS_23103-98-2' (Pirimicarb) in WISE SoE - Emissions: Emissions table is 'kg/a'
status: valid
status modified: 2019-10-03
accepted date: 2019-10-03
in scheme: Definition of correct units for the observed determinands in the given WISE SoE DD tables
has determinand: CAS 23103-98-2
has uom: kg.a-1
has table: WISE-SoE Emissions.Emissions

WISE-SoE_Emissions.Emissions - CAS_2312-35-8 - kg/a
type: Concept
notation: WISE-SoE_Emissions.Emissions - CAS_2312-35-8 - kg/a
definition: The unit of measure for 'CAS_2312-35-8' (Propargite) in WISE SoE - Emissions: Emissions table is 'kg/a'
status: valid
status modified: 2019-10-03
accepted date: 2019-10-03
in scheme: Definition of correct units for the observed determinands in the given WISE SoE DD tables
has determinand: CAS 2312-35-8
has uom: kg.a-1
has table: WISE-SoE Emissions.Emissions

WISE-SoE_Emissions.Emissions - CAS_23135-22-0 - kg/a
type: Concept
notation: WISE-SoE_Emissions.Emissions - CAS_23135-22-0 - kg/a
definition: The unit of measure for 'CAS_23135-22-0' (Oxamyl) in WISE SoE - Emissions: Emissions table is 'kg/a'
status: valid
status modified: 2019-10-03
accepted date: 2019-10-03
in scheme: Definition of correct units for the observed determinands in the given WISE SoE DD tables
has determinand: CAS 23135-22-0
has uom: kg.a-1
has table: WISE-SoE Emissions.Emissions

WISE-SoE_Emissions.Emissions - CAS_23505-41-1 - kg/a
type: Concept
notation: WISE-SoE_Emissions.Emissions - CAS_23505-41-1 - kg/a
definition: The unit of measure for 'CAS_23505-41-1' (Pirimiphos-ethyl) in WISE SoE - Emissions: Emissions table is 'kg/a'
status: valid
status modified: 2019-10-03
accepted date: 2019-10-03
in scheme: Definition of correct units for the observed determinands in the given WISE SoE DD tables
has determinand: CAS 23505-41-1
has uom: kg.a-1
has table: WISE-SoE Emissions.Emissions

WISE-SoE_Emissions.Emissions - CAS_23560-59-0 - kg/a
type: Concept
notation: WISE-SoE_Emissions.Emissions - CAS_23560-59-0 - kg/a
definition: The unit of measure for 'CAS_23560-59-0' (Heptenophos) in WISE SoE - Emissions: Emissions table is 'kg/a'
status: valid
status modified: 2019-10-03
accepted date: 2019-10-03
in scheme: Definition of correct units for the observed determinands in the given WISE SoE DD tables
has determinand: CAS 23560-59-0
has uom: kg.a-1
has table: WISE-SoE Emissions.Emissions

WISE-SoE_Emissions.Emissions - CAS_23564-05-8 - kg/a
type: Concept
notation: WISE-SoE_Emissions.Emissions - CAS_23564-05-8 - kg/a
definition: The unit of measure for 'CAS_23564-05-8' (Thiophanate-methyl) in WISE SoE - Emissions: Emissions table is 'kg/a'
status: valid
status modified: 2019-10-03
accepted date: 2019-10-03
in scheme: Definition of correct units for the observed determinands in the given WISE SoE DD tables
has determinand: CAS 23564-05-8
has uom: kg.a-1
has table: WISE-SoE Emissions.Emissions

WISE-SoE_Emissions.Emissions - CAS_23593-75-1 - kg/a
type: Concept
notation: WISE-SoE_Emissions.Emissions - CAS_23593-75-1 - kg/a
definition: The unit of measure for 'CAS_23593-75-1' (Clotrimazole) in WISE SoE - Emissions: Emissions table is 'kg/a'
status: valid
status modified: 2019-10-03
accepted date: 2019-10-03
in scheme: Definition of correct units for the observed determinands in the given WISE SoE DD tables
has determinand: CAS 23593-75-1
has uom: kg.a-1
has table: WISE-SoE Emissions.Emissions

WISE-SoE_Emissions.Emissions - CAS_2385-85-5 - kg/a
type: Concept
notation: WISE-SoE_Emissions.Emissions - CAS_2385-85-5 - kg/a
definition: The unit of measure for 'CAS_2385-85-5' (Mirex) in WISE SoE - Emissions: Emissions table is 'kg/a'
status: valid
status modified: 2019-10-03
accepted date: 2019-10-03
in scheme: Definition of correct units for the observed determinands in the given WISE SoE DD tables
has determinand: CAS 2385-85-5
has uom: kg.a-1
has table: WISE-SoE Emissions.Emissions

WISE-SoE_Emissions.Emissions - CAS_23947-60-6 - kg/a
type: Concept
notation: WISE-SoE_Emissions.Emissions - CAS_23947-60-6 - kg/a
definition: The unit of measure for 'CAS_23947-60-6' (Ethirimol) in WISE SoE - Emissions: Emissions table is 'kg/a'
status: valid
status modified: 2019-10-03
accepted date: 2019-10-03
in scheme: Definition of correct units for the observed determinands in the given WISE SoE DD tables
has determinand: CAS 23947-60-6
has uom: kg.a-1
has table: WISE-SoE Emissions.Emissions

WISE-SoE_Emissions.Emissions - CAS_23950-58-5 - kg/a
type: Concept
notation: WISE-SoE_Emissions.Emissions - CAS_23950-58-5 - kg/a
definition: The unit of measure for 'CAS_23950-58-5' (Propyzamide) in WISE SoE - Emissions: Emissions table is 'kg/a'
status: valid
status modified: 2019-10-03
accepted date: 2019-10-03
in scheme: Definition of correct units for the observed determinands in the given WISE SoE DD tables
has determinand: CAS 23950-58-5
has uom: kg.a-1
has table: WISE-SoE Emissions.Emissions

WISE-SoE_Emissions.Emissions - CAS_24017-47-8 - kg/a
type: Concept
notation: WISE-SoE_Emissions.Emissions - CAS_24017-47-8 - kg/a
definition: The unit of measure for 'CAS_24017-47-8' (Triazophos) in WISE SoE - Emissions: Emissions table is 'kg/a'
status: valid
status modified: 2019-10-03
accepted date: 2019-10-03
in scheme: Definition of correct units for the observed determinands in the given WISE SoE DD tables
has determinand: CAS 24017-47-8
has uom: kg.a-1
has table: WISE-SoE Emissions.Emissions

WISE-SoE_Emissions.Emissions - CAS_2440-02-0 - kg/a
type: Concept
notation: WISE-SoE_Emissions.Emissions - CAS_2440-02-0 - kg/a
definition: The unit of measure for 'CAS_2440-02-0' (Heptachloronorbornene) in WISE SoE - Emissions: Emissions table is 'kg/a'
status: valid
status modified: 2019-10-03
accepted date: 2019-10-03
in scheme: Definition of correct units for the observed determinands in the given WISE SoE DD tables
has determinand: CAS 2440-02-0
has uom: kg.a-1
has table: WISE-SoE Emissions.Emissions

WISE-SoE_Emissions.Emissions - CAS_24579-73-5 - kg/a
type: Concept
notation: WISE-SoE_Emissions.Emissions - CAS_24579-73-5 - kg/a
definition: The unit of measure for 'CAS_24579-73-5' (Propamocarb) in WISE SoE - Emissions: Emissions table is 'kg/a'
status: valid
status modified: 2019-10-03
accepted date: 2019-10-03
in scheme: Definition of correct units for the observed determinands in the given WISE SoE DD tables
has determinand: CAS 24579-73-5
has uom: kg.a-1
has table: WISE-SoE Emissions.Emissions

WISE-SoE_Emissions.Emissions - CAS_24959-67-9 - kg/a
type: Concept
notation: WISE-SoE_Emissions.Emissions - CAS_24959-67-9 - kg/a
definition: The unit of measure for 'CAS_24959-67-9' (Bromide) in WISE SoE - Emissions: Emissions table is 'kg/a'
status: valid
status modified: 2019-10-03
accepted date: 2019-10-03
in scheme: Definition of correct units for the observed determinands in the given WISE SoE DD tables
has determinand: CAS 24959-67-9
has uom: kg.a-1
has table: WISE-SoE Emissions.Emissions

WISE-SoE_Emissions.Emissions - CAS_25057-89-0 - kg/a
type: Concept
notation: WISE-SoE_Emissions.Emissions - CAS_25057-89-0 - kg/a
definition: The unit of measure for 'CAS_25057-89-0' (Bentazone) in WISE SoE - Emissions: Emissions table is 'kg/a'
status: valid
status modified: 2019-10-03
accepted date: 2019-10-03
in scheme: Definition of correct units for the observed determinands in the given WISE SoE DD tables
has determinand: CAS 25057-89-0
has uom: kg.a-1
has table: WISE-SoE Emissions.Emissions

WISE-SoE_Emissions.Emissions - CAS_25140-90-3 - kg/a
type: Concept
notation: WISE-SoE_Emissions.Emissions - CAS_25140-90-3 - kg/a
definition: The unit of measure for 'CAS_25140-90-3' (2-(2,6-dichlorophenoxy)propionic acid (2,6-DCPP)) in WISE SoE - Emissions: Emissions table is 'kg/a'
status: valid
status modified: 2019-10-03
accepted date: 2019-10-03
in scheme: Definition of correct units for the observed determinands in the given WISE SoE DD tables
has determinand: CAS 25140-90-3
has uom: kg.a-1
has table: WISE-SoE Emissions.Emissions

WISE-SoE_Emissions.Emissions - CAS_25167-83-3 - kg/a
type: Concept
notation: WISE-SoE_Emissions.Emissions - CAS_25167-83-3 - kg/a
definition: The unit of measure for 'CAS_25167-83-3' (Tetrachlorophenols) in WISE SoE - Emissions: Emissions table is 'kg/a'
status: valid
status modified: 2019-10-03
accepted date: 2019-10-03
in scheme: Definition of correct units for the observed determinands in the given WISE SoE DD tables
has determinand: CAS 25167-83-3
has uom: kg.a-1
has table: WISE-SoE Emissions.Emissions

WISE-SoE_Emissions.Emissions - CAS_2540-82-1 - kg/a
type: Concept
notation: WISE-SoE_Emissions.Emissions - CAS_2540-82-1 - kg/a
definition: The unit of measure for 'CAS_2540-82-1' (Formothion) in WISE SoE - Emissions: Emissions table is 'kg/a'
status: valid
status modified: 2019-10-03
accepted date: 2019-10-03
in scheme: Definition of correct units for the observed determinands in the given WISE SoE DD tables
has determinand: CAS 2540-82-1
has uom: kg.a-1
has table: WISE-SoE Emissions.Emissions

WISE-SoE_Emissions.Emissions - CAS_25637-99-4 - kg/a
type: Concept
notation: WISE-SoE_Emissions.Emissions - CAS_25637-99-4 - kg/a
definition: The unit of measure for 'CAS_25637-99-4' (1,3,5,7,9,11-hexabromocyclododecane) in WISE SoE - Emissions: Emissions table is 'kg/a'
status: valid
status modified: 2019-10-03
accepted date: 2019-10-03
in scheme: Definition of correct units for the observed determinands in the given WISE SoE DD tables
has determinand: CAS 25637-99-4
has uom: kg.a-1
has table: WISE-SoE Emissions.Emissions

WISE-SoE_Emissions.Emissions - CAS_2599-11-3 - kg/a
type: Concept
notation: WISE-SoE_Emissions.Emissions - CAS_2599-11-3 - kg/a
definition: The unit of measure for 'CAS_2599-11-3' (Hydroxysimazine) in WISE SoE - Emissions: Emissions table is 'kg/a'
status: valid
status modified: 2019-10-03
accepted date: 2019-10-03
in scheme: Definition of correct units for the observed determinands in the given WISE SoE DD tables
has determinand: CAS 2599-11-3
has uom: kg.a-1
has table: WISE-SoE Emissions.Emissions

WISE-SoE_Emissions.Emissions - CAS_262-12-4 - kg/a
type: Concept
notation: WISE-SoE_Emissions.Emissions - CAS_262-12-4 - kg/a
definition: The unit of measure for 'CAS_262-12-4' (Dibenzodioxin) in WISE SoE - Emissions: Emissions table is 'kg/a'
status: valid
status modified: 2019-10-03
accepted date: 2019-10-03
in scheme: Definition of correct units for the observed determinands in the given WISE SoE DD tables
has determinand: CAS 262-12-4
has uom: kg.a-1
has table: WISE-SoE Emissions.Emissions

WISE-SoE_Emissions.Emissions - CAS_26225-79-6 - kg/a
type: Concept
notation: WISE-SoE_Emissions.Emissions - CAS_26225-79-6 - kg/a
definition: The unit of measure for 'CAS_26225-79-6' (Ethofumesate) in WISE SoE - Emissions: Emissions table is 'kg/a'
status: valid
status modified: 2019-10-03
accepted date: 2019-10-03
in scheme: Definition of correct units for the observed determinands in the given WISE SoE DD tables
has determinand: CAS 26225-79-6
has uom: kg.a-1
has table: WISE-SoE Emissions.Emissions

WISE-SoE_Emissions.Emissions - CAS_26259-45-0 - kg/a
type: Concept
notation: WISE-SoE_Emissions.Emissions - CAS_26259-45-0 - kg/a
definition: The unit of measure for 'CAS_26259-45-0' (Secbumeton) in WISE SoE - Emissions: Emissions table is 'kg/a'
status: valid
status modified: 2019-10-03
accepted date: 2019-10-03
in scheme: Definition of correct units for the observed determinands in the given WISE SoE DD tables
has determinand: CAS 26259-45-0
has uom: kg.a-1
has table: WISE-SoE Emissions.Emissions

WISE-SoE_Emissions.Emissions - CAS_2642-71-9 - kg/a
type: Concept
notation: WISE-SoE_Emissions.Emissions - CAS_2642-71-9 - kg/a
definition: The unit of measure for 'CAS_2642-71-9' (Azinphos-ethyl) in WISE SoE - Emissions: Emissions table is 'kg/a'
status: valid
status modified: 2019-10-03
accepted date: 2019-10-03
in scheme: Definition of correct units for the observed determinands in the given WISE SoE DD tables
has determinand: CAS 2642-71-9
has uom: kg.a-1
has table: WISE-SoE Emissions.Emissions

WISE-SoE_Emissions.Emissions - CAS_26787-78-0 - kg/a
type: Concept
notation: WISE-SoE_Emissions.Emissions - CAS_26787-78-0 - kg/a
definition: The unit of measure for 'CAS_26787-78-0' (Amoxicillin) in WISE SoE - Emissions: Emissions table is 'kg/a'
status: valid
status modified: 2019-10-03
accepted date: 2019-10-03
in scheme: Definition of correct units for the observed determinands in the given WISE SoE DD tables
has determinand: CAS 26787-78-0
has uom: kg.a-1
has table: WISE-SoE Emissions.Emissions

WISE-SoE_Emissions.Emissions - CAS_2813-95-8 - kg/a
type: Concept
notation: WISE-SoE_Emissions.Emissions - CAS_2813-95-8 - kg/a
definition: The unit of measure for 'CAS_2813-95-8' (Dinoseb acetate) in WISE SoE - Emissions: Emissions table is 'kg/a'
status: valid
status modified: 2019-10-03
accepted date: 2019-10-03
in scheme: Definition of correct units for the observed determinands in the given WISE SoE DD tables
has determinand: CAS 2813-95-8
has uom: kg.a-1
has table: WISE-SoE Emissions.Emissions

WISE-SoE_Emissions.Emissions - CAS_28159-98-0 - kg/a
type: Concept
notation: WISE-SoE_Emissions.Emissions - CAS_28159-98-0 - kg/a
definition: The unit of measure for 'CAS_28159-98-0' (Cybutryne) in WISE SoE - Emissions: Emissions table is 'kg/a'
status: valid
status modified: 2019-10-03
accepted date: 2019-10-03
in scheme: Definition of correct units for the observed determinands in the given WISE SoE DD tables
has determinand: CAS 28159-98-0
has uom: kg.a-1
has table: WISE-SoE Emissions.Emissions

WISE-SoE_Emissions.Emissions - CAS_28249-77-6 - kg/a
type: Concept
notation: WISE-SoE_Emissions.Emissions - CAS_28249-77-6 - kg/a
definition: The unit of measure for 'CAS_28249-77-6' (Thiobencarb) in WISE SoE - Emissions: Emissions table is 'kg/a'
status: valid
status modified: 2019-10-03
accepted date: 2019-10-03
in scheme: Definition of correct units for the observed determinands in the given WISE SoE DD tables
has determinand: CAS 28249-77-6
has uom: kg.a-1
has table: WISE-SoE Emissions.Emissions

WISE-SoE_Emissions.Emissions - CAS_288-88-0 - kg/a
type: Concept
notation: WISE-SoE_Emissions.Emissions - CAS_288-88-0 - kg/a
definition: The unit of measure for 'CAS_288-88-0' (1H-1,2,4-Triazole) in WISE SoE - Emissions: Emissions table is 'kg/a'
status: valid
status modified: 2019-10-03
accepted date: 2019-10-03
in scheme: Definition of correct units for the observed determinands in the given WISE SoE DD tables
has determinand: CAS 288-88-0
has uom: kg.a-1
has table: WISE-SoE Emissions.Emissions

WISE-SoE_Emissions.Emissions - CAS_29122-68-7 - kg/a
type: Concept
notation: WISE-SoE_Emissions.Emissions - CAS_29122-68-7 - kg/a
definition: The unit of measure for 'CAS_29122-68-7' (Atenolol) in WISE SoE - Emissions: Emissions table is 'kg/a'
status: valid
status modified: 2019-10-03
accepted date: 2019-10-03
in scheme: Definition of correct units for the observed determinands in the given WISE SoE DD tables
has determinand: CAS 29122-68-7
has uom: kg.a-1
has table: WISE-SoE Emissions.Emissions

WISE-SoE_Emissions.Emissions - CAS_2921-88-2 - kg/a
type: Concept
notation: WISE-SoE_Emissions.Emissions - CAS_2921-88-2 - kg/a
definition: The unit of measure for 'CAS_2921-88-2' (Chlorpyrifos) in WISE SoE - Emissions: Emissions table is 'kg/a'
status: valid
status modified: 2019-10-03
accepted date: 2019-10-03
in scheme: Definition of correct units for the observed determinands in the given WISE SoE DD tables
has determinand: CAS 2921-88-2
has uom: kg.a-1
has table: WISE-SoE Emissions.Emissions

WISE-SoE_Emissions.Emissions - CAS_29232-93-7 - kg/a
type: Concept
notation: WISE-SoE_Emissions.Emissions - CAS_29232-93-7 - kg/a
definition: The unit of measure for 'CAS_29232-93-7' (Pirimiphos-methyl) in WISE SoE - Emissions: Emissions table is 'kg/a'
status: valid
status modified: 2019-10-03
accepted date: 2019-10-03
in scheme: Definition of correct units for the observed determinands in the given WISE SoE DD tables
has determinand: CAS 29232-93-7
has uom: kg.a-1
has table: WISE-SoE Emissions.Emissions

WISE-SoE_Emissions.Emissions - CAS_294-62-2 - kg/a
type: Concept
notation: WISE-SoE_Emissions.Emissions - CAS_294-62-2 - kg/a
definition: The unit of measure for 'CAS_294-62-2' (Cyclododecane) in WISE SoE - Emissions: Emissions table is 'kg/a'
status: valid
status modified: 2019-10-03
accepted date: 2019-10-03
in scheme: Definition of correct units for the observed determinands in the given WISE SoE DD tables
has determinand: CAS 294-62-2
has uom: kg.a-1
has table: WISE-SoE Emissions.Emissions

WISE-SoE_Emissions.Emissions - CAS_297-78-9 - kg/a
type: Concept
notation: WISE-SoE_Emissions.Emissions - CAS_297-78-9 - kg/a
definition: The unit of measure for 'CAS_297-78-9' (Isobenzane) in WISE SoE - Emissions: Emissions table is 'kg/a'
status: valid
status modified: 2019-10-03
accepted date: 2019-10-03
in scheme: Definition of correct units for the observed determinands in the given WISE SoE DD tables
has determinand: CAS 297-78-9
has uom: kg.a-1
has table: WISE-SoE Emissions.Emissions

WISE-SoE_Emissions.Emissions - CAS_298-00-0 - kg/a
type: Concept
notation: WISE-SoE_Emissions.Emissions - CAS_298-00-0 - kg/a
definition: The unit of measure for 'CAS_298-00-0' (Parathion-methyl) in WISE SoE - Emissions: Emissions table is 'kg/a'
status: valid
status modified: 2019-10-03
accepted date: 2019-10-03
in scheme: Definition of correct units for the observed determinands in the given WISE SoE DD tables
has determinand: CAS 298-00-0
has uom: kg.a-1
has table: WISE-SoE Emissions.Emissions

WISE-SoE_Emissions.Emissions - CAS_298-02-2 - kg/a
type: Concept
notation: WISE-SoE_Emissions.Emissions - CAS_298-02-2 - kg/a
definition: The unit of measure for 'CAS_298-02-2' (Phorate) in WISE SoE - Emissions: Emissions table is 'kg/a'
status: valid
status modified: 2019-10-03
accepted date: 2019-10-03
in scheme: Definition of correct units for the observed determinands in the given WISE SoE DD tables
has determinand: CAS 298-02-2
has uom: kg.a-1
has table: WISE-SoE Emissions.Emissions

WISE-SoE_Emissions.Emissions - CAS_298-03-3 - kg/a
type: Concept
notation: WISE-SoE_Emissions.Emissions - CAS_298-03-3 - kg/a
definition: The unit of measure for 'CAS_298-03-3' (Demeton-O) in WISE SoE - Emissions: Emissions table is 'kg/a'
status: valid
status modified: 2019-10-03
accepted date: 2019-10-03
in scheme: Definition of correct units for the observed determinands in the given WISE SoE DD tables
has determinand: CAS 298-03-3
has uom: kg.a-1
has table: WISE-SoE Emissions.Emissions

WISE-SoE_Emissions.Emissions - CAS_298-04-4 - kg/a
type: Concept
notation: WISE-SoE_Emissions.Emissions - CAS_298-04-4 - kg/a
definition: The unit of measure for 'CAS_298-04-4' (Disulfoton) in WISE SoE - Emissions: Emissions table is 'kg/a'
status: valid
status modified: 2019-10-03
accepted date: 2019-10-03
in scheme: Definition of correct units for the observed determinands in the given WISE SoE DD tables
has determinand: CAS 298-04-4
has uom: kg.a-1
has table: WISE-SoE Emissions.Emissions

WISE-SoE_Emissions.Emissions - CAS_298-46-4 - kg/a
type: Concept
notation: WISE-SoE_Emissions.Emissions - CAS_298-46-4 - kg/a
definition: The unit of measure for 'CAS_298-46-4' (Carbamazepin) in WISE SoE - Emissions: Emissions table is 'kg/a'
status: valid
status modified: 2019-10-03
accepted date: 2019-10-03
in scheme: Definition of correct units for the observed determinands in the given WISE SoE DD tables
has determinand: CAS 298-46-4
has uom: kg.a-1
has table: WISE-SoE Emissions.Emissions

WISE-SoE_Emissions.Emissions - CAS_299-84-3 - kg/a
type: Concept
notation: WISE-SoE_Emissions.Emissions - CAS_299-84-3 - kg/a
definition: The unit of measure for 'CAS_299-84-3' (Fenchlorphos) in WISE SoE - Emissions: Emissions table is 'kg/a'
status: valid
status modified: 2019-10-03
accepted date: 2019-10-03
in scheme: Definition of correct units for the observed determinands in the given WISE SoE DD tables
has determinand: CAS 299-84-3
has uom: kg.a-1
has table: WISE-SoE Emissions.Emissions

WISE-SoE_Emissions.Emissions - CAS_29973-13-5 - kg/a
type: Concept
notation: WISE-SoE_Emissions.Emissions - CAS_29973-13-5 - kg/a
definition: The unit of measure for 'CAS_29973-13-5' (Ethiofencarb) in WISE SoE - Emissions: Emissions table is 'kg/a'
status: valid
status modified: 2019-10-03
accepted date: 2019-10-03
in scheme: Definition of correct units for the observed determinands in the given WISE SoE DD tables
has determinand: CAS 29973-13-5
has uom: kg.a-1
has table: WISE-SoE Emissions.Emissions

WISE-SoE_Emissions.Emissions - CAS_30125-63-4 - kg/a
type: Concept
notation: WISE-SoE_Emissions.Emissions - CAS_30125-63-4 - kg/a
definition: The unit of measure for 'CAS_30125-63-4' (Desethylterbuthylazine) in WISE SoE - Emissions: Emissions table is 'kg/a'
status: valid
status modified: 2019-10-03
accepted date: 2019-10-03
in scheme: Definition of correct units for the observed determinands in the given WISE SoE DD tables
has determinand: CAS 30125-63-4
has uom: kg.a-1
has table: WISE-SoE Emissions.Emissions

WISE-SoE_Emissions.Emissions - CAS_3018-12-0 - kg/a
type: Concept
notation: WISE-SoE_Emissions.Emissions - CAS_3018-12-0 - kg/a
definition: The unit of measure for 'CAS_3018-12-0' (Dichloroacetonitrile) in WISE SoE - Emissions: Emissions table is 'kg/a'
status: valid
status modified: 2019-10-03
accepted date: 2019-10-03
in scheme: Definition of correct units for the observed determinands in the given WISE SoE DD tables
has determinand: CAS 3018-12-0
has uom: kg.a-1
has table: WISE-SoE Emissions.Emissions

WISE-SoE_Emissions.Emissions - CAS_302-17-0 - kg/a
type: Concept
notation: WISE-SoE_Emissions.Emissions - CAS_302-17-0 - kg/a
definition: The unit of measure for 'CAS_302-17-0' (2,2,2-trichloroethane-1,1-diol) in WISE SoE - Emissions: Emissions table is 'kg/a'
status: valid
status modified: 2019-10-03
accepted date: 2019-10-03
in scheme: Definition of correct units for the observed determinands in the given WISE SoE DD tables
has determinand: CAS 302-17-0
has uom: kg.a-1
has table: WISE-SoE Emissions.Emissions

WISE-SoE_Emissions.Emissions - CAS_30560-19-1 - kg/a
type: Concept
notation: WISE-SoE_Emissions.Emissions - CAS_30560-19-1 - kg/a
definition: The unit of measure for 'CAS_30560-19-1' (Acephate) in WISE SoE - Emissions: Emissions table is 'kg/a'
status: valid
status modified: 2019-10-03
accepted date: 2019-10-03
in scheme: Definition of correct units for the observed determinands in the given WISE SoE DD tables
has determinand: CAS 30560-19-1
has uom: kg.a-1
has table: WISE-SoE Emissions.Emissions

WISE-SoE_Emissions.Emissions - CAS_3060-89-7 - kg/a
type: Concept
notation: WISE-SoE_Emissions.Emissions - CAS_3060-89-7 - kg/a
definition: The unit of measure for 'CAS_3060-89-7' (Metobromuron) in WISE SoE - Emissions: Emissions table is 'kg/a'
status: valid
status modified: 2019-10-03
accepted date: 2019-10-03
in scheme: Definition of correct units for the observed determinands in the given WISE SoE DD tables
has determinand: CAS 3060-89-7
has uom: kg.a-1
has table: WISE-SoE Emissions.Emissions

WISE-SoE_Emissions.Emissions - CAS_309-00-2 - kg/a
type: Concept
notation: WISE-SoE_Emissions.Emissions - CAS_309-00-2 - kg/a
definition: The unit of measure for 'CAS_309-00-2' (Aldrin) in WISE SoE - Emissions: Emissions table is 'kg/a'
status: valid
status modified: 2019-10-03
accepted date: 2019-10-03
in scheme: Definition of correct units for the observed determinands in the given WISE SoE DD tables
has determinand: CAS 309-00-2
has uom: kg.a-1
has table: WISE-SoE Emissions.Emissions

WISE-SoE_Emissions.Emissions - CAS_31218-83-4 - kg/a
type: Concept
notation: WISE-SoE_Emissions.Emissions - CAS_31218-83-4 - kg/a
definition: The unit of measure for 'CAS_31218-83-4' (Propetamphos) in WISE SoE - Emissions: Emissions table is 'kg/a'
status: valid
status modified: 2019-10-03
accepted date: 2019-10-03
in scheme: Definition of correct units for the observed determinands in the given WISE SoE DD tables
has determinand: CAS 31218-83-4
has uom: kg.a-1
has table: WISE-SoE Emissions.Emissions

WISE-SoE_Emissions.Emissions - CAS_314-40-9 - kg/a
type: Concept
notation: WISE-SoE_Emissions.Emissions - CAS_314-40-9 - kg/a
definition: The unit of measure for 'CAS_314-40-9' (Bromacil) in WISE SoE - Emissions: Emissions table is 'kg/a'
status: valid
status modified: 2019-10-03
accepted date: 2019-10-03
in scheme: Definition of correct units for the observed determinands in the given WISE SoE DD tables
has determinand: CAS 314-40-9
has uom: kg.a-1
has table: WISE-SoE Emissions.Emissions

WISE-SoE_Emissions.Emissions - CAS_31508-00-6 - kg/a
type: Concept
notation: WISE-SoE_Emissions.Emissions - CAS_31508-00-6 - kg/a
definition: The unit of measure for 'CAS_31508-00-6' (PCB 118 (2,3’,4,4’,5-pentachlorobiphenyl)) in WISE SoE - Emissions: Emissions table is 'kg/a'
status: valid
status modified: 2019-10-03
accepted date: 2019-10-03
in scheme: Definition of correct units for the observed determinands in the given WISE SoE DD tables
has determinand: CAS 31508-00-6
has uom: kg.a-1
has table: WISE-SoE Emissions.Emissions

WISE-SoE_Emissions.Emissions - CAS_319-84-6 - kg/a
type: Concept
notation: WISE-SoE_Emissions.Emissions - CAS_319-84-6 - kg/a
definition: The unit of measure for 'CAS_319-84-6' (Alpha-HCH) in WISE SoE - Emissions: Emissions table is 'kg/a'
status: valid
status modified: 2019-10-03
accepted date: 2019-10-03
in scheme: Definition of correct units for the observed determinands in the given WISE SoE DD tables
has determinand: CAS 319-84-6
has uom: kg.a-1
has table: WISE-SoE Emissions.Emissions

WISE-SoE_Emissions.Emissions - CAS_319-85-7 - kg/a
type: Concept
notation: WISE-SoE_Emissions.Emissions - CAS_319-85-7 - kg/a
definition: The unit of measure for 'CAS_319-85-7' (Beta-HCH) in WISE SoE - Emissions: Emissions table is 'kg/a'
status: valid
status modified: 2019-10-03
accepted date: 2019-10-03
in scheme: Definition of correct units for the observed determinands in the given WISE SoE DD tables
has determinand: CAS 319-85-7
has uom: kg.a-1
has table: WISE-SoE Emissions.Emissions

WISE-SoE_Emissions.Emissions - CAS_319-86-8 - kg/a
type: Concept
notation: WISE-SoE_Emissions.Emissions - CAS_319-86-8 - kg/a
definition: The unit of measure for 'CAS_319-86-8' (Delta-HCH) in WISE SoE - Emissions: Emissions table is 'kg/a'
status: valid
status modified: 2019-10-03
accepted date: 2019-10-03
in scheme: Definition of correct units for the observed determinands in the given WISE SoE DD tables
has determinand: CAS 319-86-8
has uom: kg.a-1
has table: WISE-SoE Emissions.Emissions

WISE-SoE_Emissions.Emissions - CAS_3194-55-6 - kg/a
type: Concept
notation: WISE-SoE_Emissions.Emissions - CAS_3194-55-6 - kg/a
definition: The unit of measure for 'CAS_3194-55-6' (1,2,5,6,9,10-hexabromocyclododecane) in WISE SoE - Emissions: Emissions table is 'kg/a'
status: valid
status modified: 2019-10-03
accepted date: 2019-10-03
in scheme: Definition of correct units for the observed determinands in the given WISE SoE DD tables
has determinand: CAS 3194-55-6
has uom: kg.a-1
has table: WISE-SoE Emissions.Emissions

WISE-SoE_Emissions.Emissions - CAS_32-23-5 - kg/a
type: Concept
notation: WISE-SoE_Emissions.Emissions - CAS_32-23-5 - kg/a
definition: The unit of measure for 'CAS_32-23-5' (2,4-DEP) in WISE SoE - Emissions: Emissions table is 'kg/a'
status: valid
status modified: 2019-10-03
accepted date: 2019-10-03
in scheme: Definition of correct units for the observed determinands in the given WISE SoE DD tables
has determinand: CAS 32-23-5
has uom: kg.a-1
has table: WISE-SoE Emissions.Emissions

WISE-SoE_Emissions.Emissions - CAS_3209-22-1 - kg/a
type: Concept
notation: WISE-SoE_Emissions.Emissions - CAS_3209-22-1 - kg/a
definition: The unit of measure for 'CAS_3209-22-1' (1,2-Dichloro-3-nitrobenzene) in WISE SoE - Emissions: Emissions table is 'kg/a'
status: valid
status modified: 2019-10-03
accepted date: 2019-10-03
in scheme: Definition of correct units for the observed determinands in the given WISE SoE DD tables
has determinand: CAS 3209-22-1
has uom: kg.a-1
has table: WISE-SoE Emissions.Emissions

WISE-SoE_Emissions.Emissions - CAS_32241-08-0 - kg/a
type: Concept
notation: WISE-SoE_Emissions.Emissions - CAS_32241-08-0 - kg/a
definition: The unit of measure for 'CAS_32241-08-0' (Heptachloronaphthalene) in WISE SoE - Emissions: Emissions table is 'kg/a'
status: valid
status modified: 2019-10-03
accepted date: 2019-10-03
in scheme: Definition of correct units for the observed determinands in the given WISE SoE DD tables
has determinand: CAS 32241-08-0
has uom: kg.a-1
has table: WISE-SoE Emissions.Emissions

WISE-SoE_Emissions.Emissions - CAS_3252-43-5 - kg/a
type: Concept
notation: WISE-SoE_Emissions.Emissions - CAS_3252-43-5 - kg/a
definition: The unit of measure for 'CAS_3252-43-5' (Dibromoacetonitrile) in WISE SoE - Emissions: Emissions table is 'kg/a'
status: valid
status modified: 2019-10-03
accepted date: 2019-10-03
in scheme: Definition of correct units for the observed determinands in the given WISE SoE DD tables
has determinand: CAS 3252-43-5
has uom: kg.a-1
has table: WISE-SoE Emissions.Emissions

WISE-SoE_Emissions.Emissions - CAS_32534-81-9 - kg/a
type: Concept
notation: WISE-SoE_Emissions.Emissions - CAS_32534-81-9 - kg/a
definition: The unit of measure for 'CAS_32534-81-9' (Pentabromodiphenylether) in WISE SoE - Emissions: Emissions table is 'kg/a'
status: valid
status modified: 2019-10-03
accepted date: 2019-10-03
in scheme: Definition of correct units for the observed determinands in the given WISE SoE DD tables
has determinand: CAS 32534-81-9
has uom: kg.a-1
has table: WISE-SoE Emissions.Emissions

WISE-SoE_Emissions.Emissions - CAS_32536-52-0 - kg/a
type: Concept
notation: WISE-SoE_Emissions.Emissions - CAS_32536-52-0 - kg/a
definition: The unit of measure for 'CAS_32536-52-0' (Octabromodiphenyl ether) in WISE SoE - Emissions: Emissions table is 'kg/a'
status: valid
status modified: 2019-10-03
accepted date: 2019-10-03
in scheme: Definition of correct units for the observed determinands in the given WISE SoE DD tables
has determinand: CAS 32536-52-0
has uom: kg.a-1
has table: WISE-SoE Emissions.Emissions

WISE-SoE_Emissions.Emissions - CAS_32598-13-3 - kg/a
type: Concept
notation: WISE-SoE_Emissions.Emissions - CAS_32598-13-3 - kg/a
definition: The unit of measure for 'CAS_32598-13-3' (PCB 77 (3,3’,4,4’-tetrachlorobiphenyl)) in WISE SoE - Emissions: Emissions table is 'kg/a'
status: valid
status modified: 2019-10-03
accepted date: 2019-10-03
in scheme: Definition of correct units for the observed determinands in the given WISE SoE DD tables
has determinand: CAS 32598-13-3
has uom: kg.a-1
has table: WISE-SoE Emissions.Emissions

WISE-SoE_Emissions.Emissions - CAS_32598-14-4 - kg/a
type: Concept
notation: WISE-SoE_Emissions.Emissions - CAS_32598-14-4 - kg/a
definition: The unit of measure for 'CAS_32598-14-4' (PCB 105 (2,3,3’,4,4’-pentachlorobiphenyl)) in WISE SoE - Emissions: Emissions table is 'kg/a'
status: valid
status modified: 2019-10-03
accepted date: 2019-10-03
in scheme: Definition of correct units for the observed determinands in the given WISE SoE DD tables
has determinand: CAS 32598-14-4
has uom: kg.a-1
has table: WISE-SoE Emissions.Emissions

WISE-SoE_Emissions.Emissions - CAS_3268-87-9 - kg/a
type: Concept
notation: WISE-SoE_Emissions.Emissions - CAS_3268-87-9 - kg/a
definition: The unit of measure for 'CAS_3268-87-9' (1,2,3,4,6,7,8,9-O8CDD) in WISE SoE - Emissions: Emissions table is 'kg/a'
status: valid
status modified: 2019-10-03
accepted date: 2019-10-03
in scheme: Definition of correct units for the observed determinands in the given WISE SoE DD tables
has determinand: CAS 3268-87-9
has uom: kg.a-1
has table: WISE-SoE Emissions.Emissions

WISE-SoE_Emissions.Emissions - CAS_32774-16-6 - kg/a
type: Concept
notation: WISE-SoE_Emissions.Emissions - CAS_32774-16-6 - kg/a
definition: The unit of measure for 'CAS_32774-16-6' (PCB 169 (3,3’,4,4’,5,5’-hexachlorobiphenyl)) in WISE SoE - Emissions: Emissions table is 'kg/a'
status: valid
status modified: 2019-10-03
accepted date: 2019-10-03
in scheme: Definition of correct units for the observed determinands in the given WISE SoE DD tables
has determinand: CAS 32774-16-6
has uom: kg.a-1
has table: WISE-SoE Emissions.Emissions

WISE-SoE_Emissions.Emissions - CAS_32809-16-8 - kg/a
type: Concept
notation: WISE-SoE_Emissions.Emissions - CAS_32809-16-8 - kg/a
definition: The unit of measure for 'CAS_32809-16-8' (Procymidone) in WISE SoE - Emissions: Emissions table is 'kg/a'
status: valid
status modified: 2019-10-03
accepted date: 2019-10-03
in scheme: Definition of correct units for the observed determinands in the given WISE SoE DD tables
has determinand: CAS 32809-16-8
has uom: kg.a-1
has table: WISE-SoE Emissions.Emissions

WISE-SoE_Emissions.Emissions - CAS_330-54-1 - kg/a
type: Concept
notation: WISE-SoE_Emissions.Emissions - CAS_330-54-1 - kg/a
definition: The unit of measure for 'CAS_330-54-1' (Diuron) in WISE SoE - Emissions: Emissions table is 'kg/a'
status: valid
status modified: 2019-10-03
accepted date: 2019-10-03
in scheme: Definition of correct units for the observed determinands in the given WISE SoE DD tables
has determinand: CAS 330-54-1
has uom: kg.a-1
has table: WISE-SoE Emissions.Emissions

WISE-SoE_Emissions.Emissions - CAS_330-55-2 - kg/a
type: Concept
notation: WISE-SoE_Emissions.Emissions - CAS_330-55-2 - kg/a
definition: The unit of measure for 'CAS_330-55-2' (Linuron) in WISE SoE - Emissions: Emissions table is 'kg/a'
status: valid
status modified: 2019-10-03
accepted date: 2019-10-03
in scheme: Definition of correct units for the observed determinands in the given WISE SoE DD tables
has determinand: CAS 330-55-2
has uom: kg.a-1
has table: WISE-SoE Emissions.Emissions

WISE-SoE_Emissions.Emissions - CAS_3307-39-9 - kg/a
type: Concept
notation: WISE-SoE_Emissions.Emissions - CAS_3307-39-9 - kg/a
definition: The unit of measure for 'CAS_3307-39-9' (2-(4-chlorophenoxy)propionic acid (4-CPP)) in WISE SoE - Emissions: Emissions table is 'kg/a'
status: valid
status modified: 2019-10-03
accepted date: 2019-10-03
in scheme: Definition of correct units for the observed determinands in the given WISE SoE DD tables
has determinand: CAS 3307-39-9
has uom: kg.a-1
has table: WISE-SoE Emissions.Emissions

WISE-SoE_Emissions.Emissions - CAS_33213-65-9 - kg/a
type: Concept
notation: WISE-SoE_Emissions.Emissions - CAS_33213-65-9 - kg/a
definition: The unit of measure for 'CAS_33213-65-9' (Beta-Endosulfan) in WISE SoE - Emissions: Emissions table is 'kg/a'
status: valid
status modified: 2019-10-03
accepted date: 2019-10-03
in scheme: Definition of correct units for the observed determinands in the given WISE SoE DD tables
has determinand: CAS 33213-65-9
has uom: kg.a-1
has table: WISE-SoE Emissions.Emissions

WISE-SoE_Emissions.Emissions - CAS_333-41-5 - kg/a
type: Concept
notation: WISE-SoE_Emissions.Emissions - CAS_333-41-5 - kg/a
definition: The unit of measure for 'CAS_333-41-5' (Diazinon) in WISE SoE - Emissions: Emissions table is 'kg/a'
status: valid
status modified: 2019-10-03
accepted date: 2019-10-03
in scheme: Definition of correct units for the observed determinands in the given WISE SoE DD tables
has determinand: CAS 333-41-5
has uom: kg.a-1
has table: WISE-SoE Emissions.Emissions

WISE-SoE_Emissions.Emissions - CAS_3337-71-1 - kg/a
type: Concept
notation: WISE-SoE_Emissions.Emissions - CAS_3337-71-1 - kg/a
definition: The unit of measure for 'CAS_3337-71-1' (Asulam) in WISE SoE - Emissions: Emissions table is 'kg/a'
status: valid
status modified: 2019-10-03
accepted date: 2019-10-03
in scheme: Definition of correct units for the observed determinands in the given WISE SoE DD tables
has determinand: CAS 3337-71-1
has uom: kg.a-1
has table: WISE-SoE Emissions.Emissions

WISE-SoE_Emissions.Emissions - CAS_335-67-1 - kg/a
type: Concept
notation: WISE-SoE_Emissions.Emissions - CAS_335-67-1 - kg/a
definition: The unit of measure for 'CAS_335-67-1' (PFOA) in WISE SoE - Emissions: Emissions table is 'kg/a'
status: valid
status modified: 2019-10-03
accepted date: 2019-10-03
in scheme: Definition of correct units for the observed determinands in the given WISE SoE DD tables
has determinand: CAS 335-67-1
has uom: kg.a-1
has table: WISE-SoE Emissions.Emissions

WISE-SoE_Emissions.Emissions - CAS_33693-04-8 - kg/a
type: Concept
notation: WISE-SoE_Emissions.Emissions - CAS_33693-04-8 - kg/a
definition: The unit of measure for 'CAS_33693-04-8' (Terbumeton) in WISE SoE - Emissions: Emissions table is 'kg/a'
status: valid
status modified: 2019-10-03
accepted date: 2019-10-03
in scheme: Definition of correct units for the observed determinands in the given WISE SoE DD tables
has determinand: CAS 33693-04-8
has uom: kg.a-1
has table: WISE-SoE Emissions.Emissions

WISE-SoE_Emissions.Emissions - CAS_3380-34-5 - kg/a
type: Concept
notation: WISE-SoE_Emissions.Emissions - CAS_3380-34-5 - kg/a
definition: The unit of measure for 'CAS_3380-34-5' (Triclosan) in WISE SoE - Emissions: Emissions table is 'kg/a'
status: valid
status modified: 2019-10-03
accepted date: 2019-10-03
in scheme: Definition of correct units for the observed determinands in the given WISE SoE DD tables
has determinand: CAS 3380-34-5
has uom: kg.a-1
has table: WISE-SoE Emissions.Emissions

WISE-SoE_Emissions.Emissions - CAS_3397-62-4 - kg/a
type: Concept
notation: WISE-SoE_Emissions.Emissions - CAS_3397-62-4 - kg/a
definition: The unit of measure for 'CAS_3397-62-4' (Deisopropyldeethylatrazine) in WISE SoE - Emissions: Emissions table is 'kg/a'
status: valid
status modified: 2019-10-03
accepted date: 2019-10-03
in scheme: Definition of correct units for the observed determinands in the given WISE SoE DD tables
has determinand: CAS 3397-62-4
has uom: kg.a-1
has table: WISE-SoE Emissions.Emissions

WISE-SoE_Emissions.Emissions - CAS_34123-59-6 - kg/a
type: Concept
notation: WISE-SoE_Emissions.Emissions - CAS_34123-59-6 - kg/a
definition: The unit of measure for 'CAS_34123-59-6' (Isoproturon) in WISE SoE - Emissions: Emissions table is 'kg/a'
status: valid
status modified: 2019-10-03
accepted date: 2019-10-03
in scheme: Definition of correct units for the observed determinands in the given WISE SoE DD tables
has determinand: CAS 34123-59-6
has uom: kg.a-1
has table: WISE-SoE Emissions.Emissions

WISE-SoE_Emissions.Emissions - CAS_3424-82-6 - kg/a
type: Concept
notation: WISE-SoE_Emissions.Emissions - CAS_3424-82-6 - kg/a
definition: The unit of measure for 'CAS_3424-82-6' (o,p'-DDE) in WISE SoE - Emissions: Emissions table is 'kg/a'
status: valid
status modified: 2019-10-03
accepted date: 2019-10-03
in scheme: Definition of correct units for the observed determinands in the given WISE SoE DD tables
has determinand: CAS 3424-82-6
has uom: kg.a-1
has table: WISE-SoE Emissions.Emissions

WISE-SoE_Emissions.Emissions - CAS_34256-82-1 - kg/a
type: Concept
notation: WISE-SoE_Emissions.Emissions - CAS_34256-82-1 - kg/a
definition: The unit of measure for 'CAS_34256-82-1' (Acetochlor) in WISE SoE - Emissions: Emissions table is 'kg/a'
status: valid
status modified: 2019-10-03
accepted date: 2019-10-03
in scheme: Definition of correct units for the observed determinands in the given WISE SoE DD tables
has determinand: CAS 34256-82-1
has uom: kg.a-1
has table: WISE-SoE Emissions.Emissions

WISE-SoE_Emissions.Emissions - CAS_34622-58-7 - kg/a
type: Concept
notation: WISE-SoE_Emissions.Emissions - CAS_34622-58-7 - kg/a
definition: The unit of measure for 'CAS_34622-58-7' (Orbencarb) in WISE SoE - Emissions: Emissions table is 'kg/a'
status: valid
status modified: 2019-10-03
accepted date: 2019-10-03
in scheme: Definition of correct units for the observed determinands in the given WISE SoE DD tables
has determinand: CAS 34622-58-7
has uom: kg.a-1
has table: WISE-SoE Emissions.Emissions

WISE-SoE_Emissions.Emissions - CAS_35045-02-4 - kg/a
type: Concept
notation: WISE-SoE_Emissions.Emissions - CAS_35045-02-4 - kg/a
definition: The unit of measure for 'CAS_35045-02-4' (Metribuzin-DA) in WISE SoE - Emissions: Emissions table is 'kg/a'
status: valid
status modified: 2019-10-03
accepted date: 2019-10-03
in scheme: Definition of correct units for the observed determinands in the given WISE SoE DD tables
has determinand: CAS 35045-02-4
has uom: kg.a-1
has table: WISE-SoE Emissions.Emissions

WISE-SoE_Emissions.Emissions - CAS_35065-27-1 - kg/a
type: Concept
notation: WISE-SoE_Emissions.Emissions - CAS_35065-27-1 - kg/a
definition: The unit of measure for 'CAS_35065-27-1' (PCB 153 (2,2’,4,4’,5,5’-hexachlorobiphenyl)) in WISE SoE - Emissions: Emissions table is 'kg/a'
status: valid
status modified: 2019-10-03
accepted date: 2019-10-03
in scheme: Definition of correct units for the observed determinands in the given WISE SoE DD tables
has determinand: CAS 35065-27-1
has uom: kg.a-1
has table: WISE-SoE Emissions.Emissions

WISE-SoE_Emissions.Emissions - CAS_35065-28-2 - kg/a
type: Concept
notation: WISE-SoE_Emissions.Emissions - CAS_35065-28-2 - kg/a
definition: The unit of measure for 'CAS_35065-28-2' (PCB 138 (2,2’,3,4,4’,5’-hexachlorobiphenyl)) in WISE SoE - Emissions: Emissions table is 'kg/a'
status: valid
status modified: 2019-10-03
accepted date: 2019-10-03
in scheme: Definition of correct units for the observed determinands in the given WISE SoE DD tables
has determinand: CAS 35065-28-2
has uom: kg.a-1
has table: WISE-SoE Emissions.Emissions

WISE-SoE_Emissions.Emissions - CAS_35065-29-3 - kg/a
type: Concept
notation: WISE-SoE_Emissions.Emissions - CAS_35065-29-3 - kg/a
definition: The unit of measure for 'CAS_35065-29-3' (PCB 180 (2,2’,3,4,4’,5,5’-heptachlorobiphenyl)) in WISE SoE - Emissions: Emissions table is 'kg/a'
status: valid
status modified: 2019-10-03
accepted date: 2019-10-03
in scheme: Definition of correct units for the observed determinands in the given WISE SoE DD tables
has determinand: CAS 35065-29-3
has uom: kg.a-1
has table: WISE-SoE Emissions.Emissions

WISE-SoE_Emissions.Emissions - CAS_35065-30-6 - kg/a
type: Concept
notation: WISE-SoE_Emissions.Emissions - CAS_35065-30-6 - kg/a
definition: The unit of measure for 'CAS_35065-30-6' (PCB 170 (1,2,3,4-tetrachloro-5-(2,3,4-trichlorophenyl)benzene)) in WISE SoE - Emissions: Emissions table is 'kg/a'
status: valid
status modified: 2019-10-03
accepted date: 2019-10-03
in scheme: Definition of correct units for the observed determinands in the given WISE SoE DD tables
has determinand: CAS 35065-30-6
has uom: kg.a-1
has table: WISE-SoE Emissions.Emissions

WISE-SoE_Emissions.Emissions - CAS_35367-38-5 - kg/a
type: Concept
notation: WISE-SoE_Emissions.Emissions - CAS_35367-38-5 - kg/a
definition: The unit of measure for 'CAS_35367-38-5' (Diflubenzuron) in WISE SoE - Emissions: Emissions table is 'kg/a'
status: valid
status modified: 2019-10-03
accepted date: 2019-10-03
in scheme: Definition of correct units for the observed determinands in the given WISE SoE DD tables
has determinand: CAS 35367-38-5
has uom: kg.a-1
has table: WISE-SoE Emissions.Emissions

WISE-SoE_Emissions.Emissions - CAS_35554-44-0 - kg/a
type: Concept
notation: WISE-SoE_Emissions.Emissions - CAS_35554-44-0 - kg/a
definition: The unit of measure for 'CAS_35554-44-0' (Imazalil) in WISE SoE - Emissions: Emissions table is 'kg/a'
status: valid
status modified: 2019-10-03
accepted date: 2019-10-03
in scheme: Definition of correct units for the observed determinands in the given WISE SoE DD tables
has determinand: CAS 35554-44-0
has uom: kg.a-1
has table: WISE-SoE Emissions.Emissions

WISE-SoE_Emissions.Emissions - CAS_35693-99-3 - kg/a
type: Concept
notation: WISE-SoE_Emissions.Emissions - CAS_35693-99-3 - kg/a
definition: The unit of measure for 'CAS_35693-99-3' (PCB 52 (2,2’,5,5’-tetrachlorobiphenyl)) in WISE SoE - Emissions: Emissions table is 'kg/a'
status: valid
status modified: 2019-10-03
accepted date: 2019-10-03
in scheme: Definition of correct units for the observed determinands in the given WISE SoE DD tables
has determinand: CAS 35693-99-3
has uom: kg.a-1
has table: WISE-SoE Emissions.Emissions

WISE-SoE_Emissions.Emissions - CAS_35694-08-7 - kg/a
type: Concept
notation: WISE-SoE_Emissions.Emissions - CAS_35694-08-7 - kg/a
definition: The unit of measure for 'CAS_35694-08-7' (PCB 194 (1,2,3,4-tetrachloro-5-(2,3,4,5-tetrachlorophenyl)benzene)) in WISE SoE - Emissions: Emissions table is 'kg/a'
status: valid
status modified: 2019-10-03
accepted date: 2019-10-03
in scheme: Definition of correct units for the observed determinands in the given WISE SoE DD tables
has determinand: CAS 35694-08-7
has uom: kg.a-1
has table: WISE-SoE Emissions.Emissions

WISE-SoE_Emissions.Emissions - CAS_35822-46-9 - kg/a
type: Concept
notation: WISE-SoE_Emissions.Emissions - CAS_35822-46-9 - kg/a
definition: The unit of measure for 'CAS_35822-46-9' (1,2,3,4,6,7,8-H7CDD) in WISE SoE - Emissions: Emissions table is 'kg/a'
status: valid
status modified: 2019-10-03
accepted date: 2019-10-03
in scheme: Definition of correct units for the observed determinands in the given WISE SoE DD tables
has determinand: CAS 35822-46-9
has uom: kg.a-1
has table: WISE-SoE Emissions.Emissions

WISE-SoE_Emissions.Emissions - CAS_36065-30-2 - kg/a
type: Concept
notation: WISE-SoE_Emissions.Emissions - CAS_36065-30-2 - kg/a
definition: The unit of measure for 'CAS_36065-30-2' (2,4,6-tribromophenyl 2-methyl-2,3-dibromopropy ether) in WISE SoE - Emissions: Emissions table is 'kg/a'
status: valid
status modified: 2019-10-03
accepted date: 2019-10-03
in scheme: Definition of correct units for the observed determinands in the given WISE SoE DD tables
has determinand: CAS 36065-30-2
has uom: kg.a-1
has table: WISE-SoE Emissions.Emissions

WISE-SoE_Emissions.Emissions - CAS_36355-01-8 - kg/a
type: Concept
notation: WISE-SoE_Emissions.Emissions - CAS_36355-01-8 - kg/a
definition: The unit of measure for 'CAS_36355-01-8' (Hexabromobiphenyl) in WISE SoE - Emissions: Emissions table is 'kg/a'
status: valid
status modified: 2019-10-03
accepted date: 2019-10-03
in scheme: Definition of correct units for the observed determinands in the given WISE SoE DD tables
has determinand: CAS 36355-01-8
has uom: kg.a-1
has table: WISE-SoE Emissions.Emissions

WISE-SoE_Emissions.Emissions - CAS_36483-60-0 - kg/a
type: Concept
notation: WISE-SoE_Emissions.Emissions - CAS_36483-60-0 - kg/a
definition: The unit of measure for 'CAS_36483-60-0' (Hexabromodiphenylether) in WISE SoE - Emissions: Emissions table is 'kg/a'
status: valid
status modified: 2019-10-03
accepted date: 2019-10-03
in scheme: Definition of correct units for the observed determinands in the given WISE SoE DD tables
has determinand: CAS 36483-60-0
has uom: kg.a-1
has table: WISE-SoE Emissions.Emissions

WISE-SoE_Emissions.Emissions - CAS_36643-28-4 - kg/a
type: Concept
notation: WISE-SoE_Emissions.Emissions - CAS_36643-28-4 - kg/a
definition: The unit of measure for 'CAS_36643-28-4' (Tributyltin-cation) in WISE SoE - Emissions: Emissions table is 'kg/a'
status: valid
status modified: 2019-10-03
accepted date: 2019-10-03
in scheme: Definition of correct units for the observed determinands in the given WISE SoE DD tables
has determinand: CAS 36643-28-4
has uom: kg.a-1
has table: WISE-SoE Emissions.Emissions

WISE-SoE_Emissions.Emissions - CAS_36734-19-7 - kg/a
type: Concept
notation: WISE-SoE_Emissions.Emissions - CAS_36734-19-7 - kg/a
definition: The unit of measure for 'CAS_36734-19-7' (Iprodione) in WISE SoE - Emissions: Emissions table is 'kg/a'
status: valid
status modified: 2019-10-03
accepted date: 2019-10-03
in scheme: Definition of correct units for the observed determinands in the given WISE SoE DD tables
has determinand: CAS 36734-19-7
has uom: kg.a-1
has table: WISE-SoE Emissions.Emissions

WISE-SoE_Emissions.Emissions - CAS_36756-79-3 - kg/a
type: Concept
notation: WISE-SoE_Emissions.Emissions - CAS_36756-79-3 - kg/a
definition: The unit of measure for 'CAS_36756-79-3' (Tiocarbazil) in WISE SoE - Emissions: Emissions table is 'kg/a'
status: valid
status modified: 2019-10-03
accepted date: 2019-10-03
in scheme: Definition of correct units for the observed determinands in the given WISE SoE DD tables
has determinand: CAS 36756-79-3
has uom: kg.a-1
has table: WISE-SoE Emissions.Emissions

WISE-SoE_Emissions.Emissions - CAS_37350-58-6 - kg/a
type: Concept
notation: WISE-SoE_Emissions.Emissions - CAS_37350-58-6 - kg/a
definition: The unit of measure for 'CAS_37350-58-6' (Metoprolol) in WISE SoE - Emissions: Emissions table is 'kg/a'
status: valid
status modified: 2019-10-03
accepted date: 2019-10-03
in scheme: Definition of correct units for the observed determinands in the given WISE SoE DD tables
has determinand: CAS 37350-58-6
has uom: kg.a-1
has table: WISE-SoE Emissions.Emissions

WISE-SoE_Emissions.Emissions - CAS_3766-60-7 - kg/a
type: Concept
notation: WISE-SoE_Emissions.Emissions - CAS_3766-60-7 - kg/a
definition: The unit of measure for 'CAS_3766-60-7' (Buturon) in WISE SoE - Emissions: Emissions table is 'kg/a'
status: valid
status modified: 2019-10-03
accepted date: 2019-10-03
in scheme: Definition of correct units for the observed determinands in the given WISE SoE DD tables
has determinand: CAS 3766-60-7
has uom: kg.a-1
has table: WISE-SoE Emissions.Emissions

WISE-SoE_Emissions.Emissions - CAS_37680-73-2 - kg/a
type: Concept
notation: WISE-SoE_Emissions.Emissions - CAS_37680-73-2 - kg/a
definition: The unit of measure for 'CAS_37680-73-2' (PCB 101 (2,2’,4,5,5’-pentachlorobiphenyl)) in WISE SoE - Emissions: Emissions table is 'kg/a'
status: valid
status modified: 2019-10-03
accepted date: 2019-10-03
in scheme: Definition of correct units for the observed determinands in the given WISE SoE DD tables
has determinand: CAS 37680-73-2
has uom: kg.a-1
has table: WISE-SoE Emissions.Emissions

WISE-SoE_Emissions.Emissions - CAS_380412-59-9 - kg/a
type: Concept
notation: WISE-SoE_Emissions.Emissions - CAS_380412-59-9 - kg/a
definition: The unit of measure for 'CAS_380412-59-9' (Dimethenamid OA) in WISE SoE - Emissions: Emissions table is 'kg/a'
status: valid
status modified: 2019-10-03
accepted date: 2019-10-03
in scheme: Definition of correct units for the observed determinands in the given WISE SoE DD tables
has determinand: CAS 380412-59-9
has uom: kg.a-1
has table: WISE-SoE Emissions.Emissions

WISE-SoE_Emissions.Emissions - CAS_3813-05-6 - kg/a
type: Concept
notation: WISE-SoE_Emissions.Emissions - CAS_3813-05-6 - kg/a
definition: The unit of measure for 'CAS_3813-05-6' (Benazolin) in WISE SoE - Emissions: Emissions table is 'kg/a'
status: valid
status modified: 2019-10-03
accepted date: 2019-10-03
in scheme: Definition of correct units for the observed determinands in the given WISE SoE DD tables
has determinand: CAS 3813-05-6
has uom: kg.a-1
has table: WISE-SoE Emissions.Emissions

WISE-SoE_Emissions.Emissions - CAS_38260-54-7 - kg/a
type: Concept
notation: WISE-SoE_Emissions.Emissions - CAS_38260-54-7 - kg/a
definition: The unit of measure for 'CAS_38260-54-7' (Phosphorothioic acid) in WISE SoE - Emissions: Emissions table is 'kg/a'
status: valid
status modified: 2019-10-03
accepted date: 2019-10-03
in scheme: Definition of correct units for the observed determinands in the given WISE SoE DD tables
has determinand: CAS 38260-54-7
has uom: kg.a-1
has table: WISE-SoE Emissions.Emissions

WISE-SoE_Emissions.Emissions - CAS_38379-99-6 - kg/a
type: Concept
notation: WISE-SoE_Emissions.Emissions - CAS_38379-99-6 - kg/a
definition: The unit of measure for 'CAS_38379-99-6' (PCB 95 (2,2',3,5',6-Pentachlorobiphenyl)) in WISE SoE - Emissions: Emissions table is 'kg/a'
status: valid
status modified: 2019-10-03
accepted date: 2019-10-03
in scheme: Definition of correct units for the observed determinands in the given WISE SoE DD tables
has determinand: CAS 38379-99-6
has uom: kg.a-1
has table: WISE-SoE Emissions.Emissions

WISE-SoE_Emissions.Emissions - CAS_38380-01-7 - kg/a
type: Concept
notation: WISE-SoE_Emissions.Emissions - CAS_38380-01-7 - kg/a
definition: The unit of measure for 'CAS_38380-01-7' (PCB 99 (2,2',4,4',5-Pentachlorobiphenyl)) in WISE SoE - Emissions: Emissions table is 'kg/a'
status: valid
status modified: 2019-10-03
accepted date: 2019-10-03
in scheme: Definition of correct units for the observed determinands in the given WISE SoE DD tables
has determinand: CAS 38380-01-7
has uom: kg.a-1
has table: WISE-SoE Emissions.Emissions

WISE-SoE_Emissions.Emissions - CAS_38380-03-9 - kg/a
type: Concept
notation: WISE-SoE_Emissions.Emissions - CAS_38380-03-9 - kg/a
definition: The unit of measure for 'CAS_38380-03-9' (PCB 110 (2,3,3',4',6-Pentachlorobiphenyl)) in WISE SoE - Emissions: Emissions table is 'kg/a'
status: valid
status modified: 2019-10-03
accepted date: 2019-10-03
in scheme: Definition of correct units for the observed determinands in the given WISE SoE DD tables
has determinand: CAS 38380-03-9
has uom: kg.a-1
has table: WISE-SoE Emissions.Emissions

WISE-SoE_Emissions.Emissions - CAS_38380-04-0 - kg/a
type: Concept
notation: WISE-SoE_Emissions.Emissions - CAS_38380-04-0 - kg/a
definition: The unit of measure for 'CAS_38380-04-0' (PCB 149 (2,2',3,4',5',6-Hexachlorobiphenyl)) in WISE SoE - Emissions: Emissions table is 'kg/a'
status: valid
status modified: 2019-10-03
accepted date: 2019-10-03
in scheme: Definition of correct units for the observed determinands in the given WISE SoE DD tables
has determinand: CAS 38380-04-0
has uom: kg.a-1
has table: WISE-SoE Emissions.Emissions

WISE-SoE_Emissions.Emissions - CAS_38380-08-4 - kg/a
type: Concept
notation: WISE-SoE_Emissions.Emissions - CAS_38380-08-4 - kg/a
definition: The unit of measure for 'CAS_38380-08-4' (PCB 156 (2,3,3’,4,4’,5-hexachlorobiphenyl)) in WISE SoE - Emissions: Emissions table is 'kg/a'
status: valid
status modified: 2019-10-03
accepted date: 2019-10-03
in scheme: Definition of correct units for the observed determinands in the given WISE SoE DD tables
has determinand: CAS 38380-08-4
has uom: kg.a-1
has table: WISE-SoE Emissions.Emissions

WISE-SoE_Emissions.Emissions - CAS_38939-88-7 - kg/a
type: Concept
notation: WISE-SoE_Emissions.Emissions - CAS_38939-88-7 - kg/a
definition: The unit of measure for 'CAS_38939-88-7' (3-chloro-4-nitrotoluene) in WISE SoE - Emissions: Emissions table is 'kg/a'
status: valid
status modified: 2019-10-03
accepted date: 2019-10-03
in scheme: Definition of correct units for the observed determinands in the given WISE SoE DD tables
has determinand: CAS 38939-88-7
has uom: kg.a-1
has table: WISE-SoE Emissions.Emissions

WISE-SoE_Emissions.Emissions - CAS_39001-02-0 - kg/a
type: Concept
notation: WISE-SoE_Emissions.Emissions - CAS_39001-02-0 - kg/a
definition: The unit of measure for 'CAS_39001-02-0' (1,2,3,4,6,7,8,9-O8CDF) in WISE SoE - Emissions: Emissions table is 'kg/a'
status: valid
status modified: 2019-10-03
accepted date: 2019-10-03
in scheme: Definition of correct units for the observed determinands in the given WISE SoE DD tables
has determinand: CAS 39001-02-0
has uom: kg.a-1
has table: WISE-SoE Emissions.Emissions

WISE-SoE_Emissions.Emissions - CAS_39227-28-6 - kg/a
type: Concept
notation: WISE-SoE_Emissions.Emissions - CAS_39227-28-6 - kg/a
definition: The unit of measure for 'CAS_39227-28-6' (1,2,3,4,7,8-H6CDD) in WISE SoE - Emissions: Emissions table is 'kg/a'
status: valid
status modified: 2019-10-03
accepted date: 2019-10-03
in scheme: Definition of correct units for the observed determinands in the given WISE SoE DD tables
has determinand: CAS 39227-28-6
has uom: kg.a-1
has table: WISE-SoE Emissions.Emissions

WISE-SoE_Emissions.Emissions - CAS_39635-31-9 - kg/a
type: Concept
notation: WISE-SoE_Emissions.Emissions - CAS_39635-31-9 - kg/a
definition: The unit of measure for 'CAS_39635-31-9' (PCB 189 (1,2,3,4-tetrachloro-5-(3,4,5-trichlorophenyl)benzene)) in WISE SoE - Emissions: Emissions table is 'kg/a'
status: valid
status modified: 2019-10-03
accepted date: 2019-10-03
in scheme: Definition of correct units for the observed determinands in the given WISE SoE DD tables
has determinand: CAS 39635-31-9
has uom: kg.a-1
has table: WISE-SoE Emissions.Emissions

WISE-SoE_Emissions.Emissions - CAS_39765-80-5 - kg/a
type: Concept
notation: WISE-SoE_Emissions.Emissions - CAS_39765-80-5 - kg/a
definition: The unit of measure for 'CAS_39765-80-5' (trans-Nonachlor) in WISE SoE - Emissions: Emissions table is 'kg/a'
status: valid
status modified: 2019-10-03
accepted date: 2019-10-03
in scheme: Definition of correct units for the observed determinands in the given WISE SoE DD tables
has determinand: CAS 39765-80-5
has uom: kg.a-1
has table: WISE-SoE Emissions.Emissions

WISE-SoE_Emissions.Emissions - CAS_3984-14-3 - kg/a
type: Concept
notation: WISE-SoE_Emissions.Emissions - CAS_3984-14-3 - kg/a
definition: The unit of measure for 'CAS_3984-14-3' (N,N-dimethylsulfamide) in WISE SoE - Emissions: Emissions table is 'kg/a'
status: valid
status modified: 2019-10-03
accepted date: 2019-10-03
in scheme: Definition of correct units for the observed determinands in the given WISE SoE DD tables
has determinand: CAS 3984-14-3
has uom: kg.a-1
has table: WISE-SoE Emissions.Emissions

WISE-SoE_Emissions.Emissions - CAS_40088-47-9 - kg/a
type: Concept
notation: WISE-SoE_Emissions.Emissions - CAS_40088-47-9 - kg/a
definition: The unit of measure for 'CAS_40088-47-9' (Tetrabromodiphenylether) in WISE SoE - Emissions: Emissions table is 'kg/a'
status: valid
status modified: 2019-10-03
accepted date: 2019-10-03
in scheme: Definition of correct units for the observed determinands in the given WISE SoE DD tables
has determinand: CAS 40088-47-9
has uom: kg.a-1
has table: WISE-SoE Emissions.Emissions

WISE-SoE_Emissions.Emissions - CAS_40321-76-4 - kg/a
type: Concept
notation: WISE-SoE_Emissions.Emissions - CAS_40321-76-4 - kg/a
definition: The unit of measure for 'CAS_40321-76-4' (1,2,3,7,8-P5CDD) in WISE SoE - Emissions: Emissions table is 'kg/a'
status: valid
status modified: 2019-10-03
accepted date: 2019-10-03
in scheme: Definition of correct units for the observed determinands in the given WISE SoE DD tables
has determinand: CAS 40321-76-4
has uom: kg.a-1
has table: WISE-SoE Emissions.Emissions

WISE-SoE_Emissions.Emissions - CAS_40487-42-1 - kg/a
type: Concept
notation: WISE-SoE_Emissions.Emissions - CAS_40487-42-1 - kg/a
definition: The unit of measure for 'CAS_40487-42-1' (Pendimethalin) in WISE SoE - Emissions: Emissions table is 'kg/a'
status: valid
status modified: 2019-10-03
accepted date: 2019-10-03
in scheme: Definition of correct units for the observed determinands in the given WISE SoE DD tables
has determinand: CAS 40487-42-1
has uom: kg.a-1
has table: WISE-SoE Emissions.Emissions

WISE-SoE_Emissions.Emissions - CAS_41318-75-6 - kg/a
type: Concept
notation: WISE-SoE_Emissions.Emissions - CAS_41318-75-6 - kg/a
definition: The unit of measure for 'CAS_41318-75-6' (BDE 28 (2,4,4'-tribromodiphenyl ether)) in WISE SoE - Emissions: Emissions table is 'kg/a'
status: valid
status modified: 2019-10-03
accepted date: 2019-10-03
in scheme: Definition of correct units for the observed determinands in the given WISE SoE DD tables
has determinand: CAS 41318-75-6
has uom: kg.a-1
has table: WISE-SoE Emissions.Emissions

WISE-SoE_Emissions.Emissions - CAS_41394-05-2 - kg/a
type: Concept
notation: WISE-SoE_Emissions.Emissions - CAS_41394-05-2 - kg/a
definition: The unit of measure for 'CAS_41394-05-2' (Metamitron) in WISE SoE - Emissions: Emissions table is 'kg/a'
status: valid
status modified: 2019-10-03
accepted date: 2019-10-03
in scheme: Definition of correct units for the observed determinands in the given WISE SoE DD tables
has determinand: CAS 41394-05-2
has uom: kg.a-1
has table: WISE-SoE Emissions.Emissions

WISE-SoE_Emissions.Emissions - CAS_41464-42-0 - kg/a
type: Concept
notation: WISE-SoE_Emissions.Emissions - CAS_41464-42-0 - kg/a
definition: The unit of measure for 'CAS_41464-42-0' (PCB 72 (2,3',5,5'-Tetrachlorobiphenyl)) in WISE SoE - Emissions: Emissions table is 'kg/a'
status: valid
status modified: 2019-10-03
accepted date: 2019-10-03
in scheme: Definition of correct units for the observed determinands in the given WISE SoE DD tables
has determinand: CAS 41464-42-0
has uom: kg.a-1
has table: WISE-SoE Emissions.Emissions

WISE-SoE_Emissions.Emissions - CAS_41483-43-6 - kg/a
type: Concept
notation: WISE-SoE_Emissions.Emissions - CAS_41483-43-6 - kg/a
definition: The unit of measure for 'CAS_41483-43-6' (Bupirimate) in WISE SoE - Emissions: Emissions table is 'kg/a'
status: valid
status modified: 2019-10-03
accepted date: 2019-10-03
in scheme: Definition of correct units for the observed determinands in the given WISE SoE DD tables
has determinand: CAS 41483-43-6
has uom: kg.a-1
has table: WISE-SoE Emissions.Emissions

WISE-SoE_Emissions.Emissions - CAS_41859-67-0 - kg/a
type: Concept
notation: WISE-SoE_Emissions.Emissions - CAS_41859-67-0 - kg/a
definition: The unit of measure for 'CAS_41859-67-0' (Bezafibrate) in WISE SoE - Emissions: Emissions table is 'kg/a'
status: valid
status modified: 2019-10-03
accepted date: 2019-10-03
in scheme: Definition of correct units for the observed determinands in the given WISE SoE DD tables
has determinand: CAS 41859-67-0
has uom: kg.a-1
has table: WISE-SoE Emissions.Emissions

WISE-SoE_Emissions.Emissions - CAS_4234-79-1 - kg/a
type: Concept
notation: WISE-SoE_Emissions.Emissions - CAS_4234-79-1 - kg/a
definition: The unit of measure for 'CAS_4234-79-1' (Kelevan) in WISE SoE - Emissions: Emissions table is 'kg/a'
status: valid
status modified: 2019-10-03
accepted date: 2019-10-03
in scheme: Definition of correct units for the observed determinands in the given WISE SoE DD tables
has determinand: CAS 4234-79-1
has uom: kg.a-1
has table: WISE-SoE Emissions.Emissions

WISE-SoE_Emissions.Emissions - CAS_4245-76-5 - kg/a
type: Concept
notation: WISE-SoE_Emissions.Emissions - CAS_4245-76-5 - kg/a
definition: The unit of measure for 'CAS_4245-76-5' (N-methyl-N'-nitroguanidine) in WISE SoE - Emissions: Emissions table is 'kg/a'
status: valid
status modified: 2019-10-03
accepted date: 2019-10-03
in scheme: Definition of correct units for the observed determinands in the given WISE SoE DD tables
has determinand: CAS 4245-76-5
has uom: kg.a-1
has table: WISE-SoE Emissions.Emissions

WISE-SoE_Emissions.Emissions - CAS_42576-02-3 - kg/a
type: Concept
notation: WISE-SoE_Emissions.Emissions - CAS_42576-02-3 - kg/a
definition: The unit of measure for 'CAS_42576-02-3' (Bifenox) in WISE SoE - Emissions: Emissions table is 'kg/a'
status: valid
status modified: 2019-10-03
accepted date: 2019-10-03
in scheme: Definition of correct units for the observed determinands in the given WISE SoE DD tables
has determinand: CAS 42576-02-3
has uom: kg.a-1
has table: WISE-SoE Emissions.Emissions

WISE-SoE_Emissions.Emissions - CAS_42874-03-3 - kg/a
type: Concept
notation: WISE-SoE_Emissions.Emissions - CAS_42874-03-3 - kg/a
definition: The unit of measure for 'CAS_42874-03-3' (CAS_42874-03-3 - Oxyfluorfen) in WISE SoE - Emissions: Emissions table is 'kg/a'
status: valid
status modified: 2019-10-03
accepted date: 2019-10-03
in scheme: Definition of correct units for the observed determinands in the given WISE SoE DD tables
has determinand: CAS 42874-03-3
has uom: kg.a-1
has table: WISE-SoE Emissions.Emissions

WISE-SoE_Emissions.Emissions - CAS_43121-43-3 - kg/a
type: Concept
notation: WISE-SoE_Emissions.Emissions - CAS_43121-43-3 - kg/a
definition: The unit of measure for 'CAS_43121-43-3' (Triadimefon) in WISE SoE - Emissions: Emissions table is 'kg/a'
status: valid
status modified: 2019-10-03
accepted date: 2019-10-03
in scheme: Definition of correct units for the observed determinands in the given WISE SoE DD tables
has determinand: CAS 43121-43-3
has uom: kg.a-1
has table: WISE-SoE Emissions.Emissions

WISE-SoE_Emissions.Emissions - CAS_4636-83-3 - kg/a
type: Concept
notation: WISE-SoE_Emissions.Emissions - CAS_4636-83-3 - kg/a
definition: The unit of measure for 'CAS_4636-83-3' (Morfamquat) in WISE SoE - Emissions: Emissions table is 'kg/a'
status: valid
status modified: 2019-10-03
accepted date: 2019-10-03
in scheme: Definition of correct units for the observed determinands in the given WISE SoE DD tables
has determinand: CAS 4636-83-3
has uom: kg.a-1
has table: WISE-SoE Emissions.Emissions

WISE-SoE_Emissions.Emissions - CAS_465-73-6 - kg/a
type: Concept
notation: WISE-SoE_Emissions.Emissions - CAS_465-73-6 - kg/a
definition: The unit of measure for 'CAS_465-73-6' (Isodrin) in WISE SoE - Emissions: Emissions table is 'kg/a'
status: valid
status modified: 2019-10-03
accepted date: 2019-10-03
in scheme: Definition of correct units for the observed determinands in the given WISE SoE DD tables
has determinand: CAS 465-73-6
has uom: kg.a-1
has table: WISE-SoE Emissions.Emissions

WISE-SoE_Emissions.Emissions - CAS_470-90-6 - kg/a
type: Concept
notation: WISE-SoE_Emissions.Emissions - CAS_470-90-6 - kg/a
definition: The unit of measure for 'CAS_470-90-6' (Chlorfenvinphos) in WISE SoE - Emissions: Emissions table is 'kg/a'
status: valid
status modified: 2019-10-03
accepted date: 2019-10-03
in scheme: Definition of correct units for the observed determinands in the given WISE SoE DD tables
has determinand: CAS 470-90-6
has uom: kg.a-1
has table: WISE-SoE Emissions.Emissions

WISE-SoE_Emissions.Emissions - CAS_4901-51-3 - kg/a
type: Concept
notation: WISE-SoE_Emissions.Emissions - CAS_4901-51-3 - kg/a
definition: The unit of measure for 'CAS_4901-51-3' (2,3,4,5-tetrachlorophenol) in WISE SoE - Emissions: Emissions table is 'kg/a'
status: valid
status modified: 2019-10-03
accepted date: 2019-10-03
in scheme: Definition of correct units for the observed determinands in the given WISE SoE DD tables
has determinand: CAS 4901-51-3
has uom: kg.a-1
has table: WISE-SoE Emissions.Emissions

WISE-SoE_Emissions.Emissions - CAS_4904-61-4 - kg/a
type: Concept
notation: WISE-SoE_Emissions.Emissions - CAS_4904-61-4 - kg/a
definition: The unit of measure for 'CAS_4904-61-4' (1,5,9-cyclododecatriene) in WISE SoE - Emissions: Emissions table is 'kg/a'
status: valid
status modified: 2019-10-03
accepted date: 2019-10-03
in scheme: Definition of correct units for the observed determinands in the given WISE SoE DD tables
has determinand: CAS 4904-61-4
has uom: kg.a-1
has table: WISE-SoE Emissions.Emissions

WISE-SoE_Emissions.Emissions - CAS_50-00-0 - kg/a
type: Concept
notation: WISE-SoE_Emissions.Emissions - CAS_50-00-0 - kg/a
definition: The unit of measure for 'CAS_50-00-0' (Formaldehyde) in WISE SoE - Emissions: Emissions table is 'kg/a'
status: valid
status modified: 2019-10-03
accepted date: 2019-10-03
in scheme: Definition of correct units for the observed determinands in the given WISE SoE DD tables
has determinand: CAS 50-00-0
has uom: kg.a-1
has table: WISE-SoE Emissions.Emissions

WISE-SoE_Emissions.Emissions - CAS_50-28-2 - kg/a
type: Concept
notation: WISE-SoE_Emissions.Emissions - CAS_50-28-2 - kg/a
definition: The unit of measure for 'CAS_50-28-2' (17beta-estradiol (E2)) in WISE SoE - Emissions: Emissions table is 'kg/a'
status: valid
status modified: 2019-10-03
accepted date: 2019-10-03
in scheme: Definition of correct units for the observed determinands in the given WISE SoE DD tables
has determinand: CAS 50-28-2
has uom: kg.a-1
has table: WISE-SoE Emissions.Emissions

WISE-SoE_Emissions.Emissions - CAS_50-29-3 - kg/a
type: Concept
notation: WISE-SoE_Emissions.Emissions - CAS_50-29-3 - kg/a
definition: The unit of measure for 'CAS_50-29-3' (DDT, p,p') in WISE SoE - Emissions: Emissions table is 'kg/a'
status: valid
status modified: 2019-10-03
accepted date: 2019-10-03
in scheme: Definition of correct units for the observed determinands in the given WISE SoE DD tables
has determinand: CAS 50-29-3
has uom: kg.a-1
has table: WISE-SoE Emissions.Emissions

WISE-SoE_Emissions.Emissions - CAS_50-30-6 - kg/a
type: Concept
notation: WISE-SoE_Emissions.Emissions - CAS_50-30-6 - kg/a
definition: The unit of measure for 'CAS_50-30-6' (2,6-dichlorobenzoic acid) in WISE SoE - Emissions: Emissions table is 'kg/a'
status: valid
status modified: 2019-10-03
accepted date: 2019-10-03
in scheme: Definition of correct units for the observed determinands in the given WISE SoE DD tables
has determinand: CAS 50-30-6
has uom: kg.a-1
has table: WISE-SoE Emissions.Emissions

WISE-SoE_Emissions.Emissions - CAS_50-31-7 - kg/a
type: Concept
notation: WISE-SoE_Emissions.Emissions - CAS_50-31-7 - kg/a
definition: The unit of measure for 'CAS_50-31-7' (2,3,6-trichlorobenzoic acid) in WISE SoE - Emissions: Emissions table is 'kg/a'
status: valid
status modified: 2019-10-03
accepted date: 2019-10-03
in scheme: Definition of correct units for the observed determinands in the given WISE SoE DD tables
has determinand: CAS 50-31-7
has uom: kg.a-1
has table: WISE-SoE Emissions.Emissions

WISE-SoE_Emissions.Emissions - CAS_50-32-8 - kg/a
type: Concept
notation: WISE-SoE_Emissions.Emissions - CAS_50-32-8 - kg/a
definition: The unit of measure for 'CAS_50-32-8' (Benzo(a)pyrene) in WISE SoE - Emissions: Emissions table is 'kg/a'
status: valid
status modified: 2019-10-03
accepted date: 2019-10-03
in scheme: Definition of correct units for the observed determinands in the given WISE SoE DD tables
has determinand: CAS 50-32-8
has uom: kg.a-1
has table: WISE-SoE Emissions.Emissions

WISE-SoE_Emissions.Emissions - CAS_50471-44-8 - kg/a
type: Concept
notation: WISE-SoE_Emissions.Emissions - CAS_50471-44-8 - kg/a
definition: The unit of measure for 'CAS_50471-44-8' (Vinclozolin) in WISE SoE - Emissions: Emissions table is 'kg/a'
status: valid
status modified: 2019-10-03
accepted date: 2019-10-03
in scheme: Definition of correct units for the observed determinands in the given WISE SoE DD tables
has determinand: CAS 50471-44-8
has uom: kg.a-1
has table: WISE-SoE Emissions.Emissions

WISE-SoE_Emissions.Emissions - CAS_50563-36-5 - kg/a
type: Concept
notation: WISE-SoE_Emissions.Emissions - CAS_50563-36-5 - kg/a
definition: The unit of measure for 'CAS_50563-36-5' (Dimethachlor) in WISE SoE - Emissions: Emissions table is 'kg/a'
status: valid
status modified: 2019-10-03
accepted date: 2019-10-03
in scheme: Definition of correct units for the observed determinands in the given WISE SoE DD tables
has determinand: CAS 50563-36-5
has uom: kg.a-1
has table: WISE-SoE Emissions.Emissions

WISE-SoE_Emissions.Emissions - CAS_506-77-4 - kg/a
type: Concept
notation: WISE-SoE_Emissions.Emissions - CAS_506-77-4 - kg/a
definition: The unit of measure for 'CAS_506-77-4' (Cyanogen chloride) in WISE SoE - Emissions: Emissions table is 'kg/a'
status: valid
status modified: 2019-10-03
accepted date: 2019-10-03
in scheme: Definition of correct units for the observed determinands in the given WISE SoE DD tables
has determinand: CAS 506-77-4
has uom: kg.a-1
has table: WISE-SoE Emissions.Emissions

WISE-SoE_Emissions.Emissions - CAS_51000-52-3 - kg/a
type: Concept
notation: WISE-SoE_Emissions.Emissions - CAS_51000-52-3 - kg/a
definition: The unit of measure for 'CAS_51000-52-3' (Vinyl neodecanoate) in WISE SoE - Emissions: Emissions table is 'kg/a'
status: valid
status modified: 2019-10-03
accepted date: 2019-10-03
in scheme: Definition of correct units for the observed determinands in the given WISE SoE DD tables
has determinand: CAS 51000-52-3
has uom: kg.a-1
has table: WISE-SoE Emissions.Emissions

WISE-SoE_Emissions.Emissions - CAS_5103-71-9 - kg/a
type: Concept
notation: WISE-SoE_Emissions.Emissions - CAS_5103-71-9 - kg/a
definition: The unit of measure for 'CAS_5103-71-9' (Alpha-Chlordan) in WISE SoE - Emissions: Emissions table is 'kg/a'
status: valid
status modified: 2019-10-03
accepted date: 2019-10-03
in scheme: Definition of correct units for the observed determinands in the given WISE SoE DD tables
has determinand: CAS 5103-71-9
has uom: kg.a-1
has table: WISE-SoE Emissions.Emissions

WISE-SoE_Emissions.Emissions - CAS_5103-74-2 - kg/a
type: Concept
notation: WISE-SoE_Emissions.Emissions - CAS_5103-74-2 - kg/a
definition: The unit of measure for 'CAS_5103-74-2' (Trans-chlordane) in WISE SoE - Emissions: Emissions table is 'kg/a'
status: valid
status modified: 2019-10-03
accepted date: 2019-10-03
in scheme: Definition of correct units for the observed determinands in the given WISE SoE DD tables
has determinand: CAS 5103-74-2
has uom: kg.a-1
has table: WISE-SoE Emissions.Emissions

WISE-SoE_Emissions.Emissions - CAS_512-04-9 - kg/a
type: Concept
notation: WISE-SoE_Emissions.Emissions - CAS_512-04-9 - kg/a
definition: The unit of measure for 'CAS_512-04-9' (Diosgenin) in WISE SoE - Emissions: Emissions table is 'kg/a'
status: valid
status modified: 2019-10-03
accepted date: 2019-10-03
in scheme: Definition of correct units for the observed determinands in the given WISE SoE DD tables
has determinand: CAS 512-04-9
has uom: kg.a-1
has table: WISE-SoE Emissions.Emissions

WISE-SoE_Emissions.Emissions - CAS_51207-31-9 - kg/a
type: Concept
notation: WISE-SoE_Emissions.Emissions - CAS_51207-31-9 - kg/a
definition: The unit of measure for 'CAS_51207-31-9' (2,3,7,8-T4CDF) in WISE SoE - Emissions: Emissions table is 'kg/a'
status: valid
status modified: 2019-10-03
accepted date: 2019-10-03
in scheme: Definition of correct units for the observed determinands in the given WISE SoE DD tables
has determinand: CAS 51207-31-9
has uom: kg.a-1
has table: WISE-SoE Emissions.Emissions

WISE-SoE_Emissions.Emissions - CAS_51218-45-2 - kg/a
type: Concept
notation: WISE-SoE_Emissions.Emissions - CAS_51218-45-2 - kg/a
definition: The unit of measure for 'CAS_51218-45-2' (Metolachlor) in WISE SoE - Emissions: Emissions table is 'kg/a'
status: valid
status modified: 2019-10-03
accepted date: 2019-10-03
in scheme: Definition of correct units for the observed determinands in the given WISE SoE DD tables
has determinand: CAS 51218-45-2
has uom: kg.a-1
has table: WISE-SoE Emissions.Emissions

WISE-SoE_Emissions.Emissions - CAS_51235-04-2 - kg/a
type: Concept
notation: WISE-SoE_Emissions.Emissions - CAS_51235-04-2 - kg/a
definition: The unit of measure for 'CAS_51235-04-2' (Hexazinone) in WISE SoE - Emissions: Emissions table is 'kg/a'
status: valid
status modified: 2019-10-03
accepted date: 2019-10-03
in scheme: Definition of correct units for the observed determinands in the given WISE SoE DD tables
has determinand: CAS 51235-04-2
has uom: kg.a-1
has table: WISE-SoE Emissions.Emissions

WISE-SoE_Emissions.Emissions - CAS_51908-16-8 - kg/a
type: Concept
notation: WISE-SoE_Emissions.Emissions - CAS_51908-16-8 - kg/a
definition: The unit of measure for 'CAS_51908-16-8' (PCB 146 (2,2',3,4',5,5'-Hexachlorobiphenyl)) in WISE SoE - Emissions: Emissions table is 'kg/a'
status: valid
status modified: 2019-10-03
accepted date: 2019-10-03
in scheme: Definition of correct units for the observed determinands in the given WISE SoE DD tables
has determinand: CAS 51908-16-8
has uom: kg.a-1
has table: WISE-SoE Emissions.Emissions

WISE-SoE_Emissions.Emissions - CAS_52-51-7 - kg/a
type: Concept
notation: WISE-SoE_Emissions.Emissions - CAS_52-51-7 - kg/a
definition: The unit of measure for 'CAS_52-51-7' (Bronopol) in WISE SoE - Emissions: Emissions table is 'kg/a'
status: valid
status modified: 2019-10-03
accepted date: 2019-10-03
in scheme: Definition of correct units for the observed determinands in the given WISE SoE DD tables
has determinand: CAS 52-51-7
has uom: kg.a-1
has table: WISE-SoE Emissions.Emissions

WISE-SoE_Emissions.Emissions - CAS_52-68-6 - kg/a
type: Concept
notation: WISE-SoE_Emissions.Emissions - CAS_52-68-6 - kg/a
definition: The unit of measure for 'CAS_52-68-6' (Trichlorfon) in WISE SoE - Emissions: Emissions table is 'kg/a'
status: valid
status modified: 2019-10-03
accepted date: 2019-10-03
in scheme: Definition of correct units for the observed determinands in the given WISE SoE DD tables
has determinand: CAS 52-68-6
has uom: kg.a-1
has table: WISE-SoE Emissions.Emissions

WISE-SoE_Emissions.Emissions - CAS_52236-30-3 - kg/a
type: Concept
notation: WISE-SoE_Emissions.Emissions - CAS_52236-30-3 - kg/a
definition: The unit of measure for 'CAS_52236-30-3' (Desamino-diketo-metribuzin) in WISE SoE - Emissions: Emissions table is 'kg/a'
status: valid
status modified: 2019-10-03
accepted date: 2019-10-03
in scheme: Definition of correct units for the observed determinands in the given WISE SoE DD tables
has determinand: CAS 52236-30-3
has uom: kg.a-1
has table: WISE-SoE Emissions.Emissions

WISE-SoE_Emissions.Emissions - CAS_52315-07-8 - kg/a
type: Concept
notation: WISE-SoE_Emissions.Emissions - CAS_52315-07-8 - kg/a
definition: The unit of measure for 'CAS_52315-07-8' (Cypermethrin) in WISE SoE - Emissions: Emissions table is 'kg/a'
status: valid
status modified: 2019-10-03
accepted date: 2019-10-03
in scheme: Definition of correct units for the observed determinands in the given WISE SoE DD tables
has determinand: CAS 52315-07-8
has uom: kg.a-1
has table: WISE-SoE Emissions.Emissions

WISE-SoE_Emissions.Emissions - CAS_525-66-6 - kg/a
type: Concept
notation: WISE-SoE_Emissions.Emissions - CAS_525-66-6 - kg/a
definition: The unit of measure for 'CAS_525-66-6' (Propranolol) in WISE SoE - Emissions: Emissions table is 'kg/a'
status: valid
status modified: 2019-10-03
accepted date: 2019-10-03
in scheme: Definition of correct units for the observed determinands in the given WISE SoE DD tables
has determinand: CAS 525-66-6
has uom: kg.a-1
has table: WISE-SoE Emissions.Emissions

WISE-SoE_Emissions.Emissions - CAS_526-75-0 - kg/a
type: Concept
notation: WISE-SoE_Emissions.Emissions - CAS_526-75-0 - kg/a
definition: The unit of measure for 'CAS_526-75-0' (2,3-dimethyl-phenol) in WISE SoE - Emissions: Emissions table is 'kg/a'
status: valid
status modified: 2019-10-03
accepted date: 2019-10-03
in scheme: Definition of correct units for the observed determinands in the given WISE SoE DD tables
has determinand: CAS 526-75-0
has uom: kg.a-1
has table: WISE-SoE Emissions.Emissions

WISE-SoE_Emissions.Emissions - CAS_52645-53-1 - kg/a
type: Concept
notation: WISE-SoE_Emissions.Emissions - CAS_52645-53-1 - kg/a
definition: The unit of measure for 'CAS_52645-53-1' (Permethrin-cis+trans) in WISE SoE - Emissions: Emissions table is 'kg/a'
status: valid
status modified: 2019-10-03
accepted date: 2019-10-03
in scheme: Definition of correct units for the observed determinands in the given WISE SoE DD tables
has determinand: CAS 52645-53-1
has uom: kg.a-1
has table: WISE-SoE Emissions.Emissions

WISE-SoE_Emissions.Emissions - CAS_52663-63-5 - kg/a
type: Concept
notation: WISE-SoE_Emissions.Emissions - CAS_52663-63-5 - kg/a
definition: The unit of measure for 'CAS_52663-63-5' (PCB 151 (2,2',3,5,5',6-Hexachlorobiphenyl)) in WISE SoE - Emissions: Emissions table is 'kg/a'
status: valid
status modified: 2019-10-03
accepted date: 2019-10-03
in scheme: Definition of correct units for the observed determinands in the given WISE SoE DD tables
has determinand: CAS 52663-63-5
has uom: kg.a-1
has table: WISE-SoE Emissions.Emissions

WISE-SoE_Emissions.Emissions - CAS_52663-68-0 - kg/a
type: Concept
notation: WISE-SoE_Emissions.Emissions - CAS_52663-68-0 - kg/a
definition: The unit of measure for 'CAS_52663-68-0' (PCB 187 (2,2',3,4',5,5',6-Heptachlorobiphenyl)) in WISE SoE - Emissions: Emissions table is 'kg/a'
status: valid
status modified: 2019-10-03
accepted date: 2019-10-03
in scheme: Definition of correct units for the observed determinands in the given WISE SoE DD tables
has determinand: CAS 52663-68-0
has uom: kg.a-1
has table: WISE-SoE Emissions.Emissions

WISE-SoE_Emissions.Emissions - CAS_52663-69-1 - kg/a
type: Concept
notation: WISE-SoE_Emissions.Emissions - CAS_52663-69-1 - kg/a
definition: The unit of measure for 'CAS_52663-69-1' (PCB 183 (82,2',3,4,4',5',6-Heptachloro-1,1'-biphenyl)) in WISE SoE - Emissions: Emissions table is 'kg/a'
status: valid
status modified: 2019-10-03
accepted date: 2019-10-03
in scheme: Definition of correct units for the observed determinands in the given WISE SoE DD tables
has determinand: CAS 52663-69-1
has uom: kg.a-1
has table: WISE-SoE Emissions.Emissions

WISE-SoE_Emissions.Emissions - CAS_52663-70-4 - kg/a
type: Concept
notation: WISE-SoE_Emissions.Emissions - CAS_52663-70-4 - kg/a
definition: The unit of measure for 'CAS_52663-70-4' (PCB 177 (3,3',4',5,6-Heptachlorobiphenyl)) in WISE SoE - Emissions: Emissions table is 'kg/a'
status: valid
status modified: 2019-10-03
accepted date: 2019-10-03
in scheme: Definition of correct units for the observed determinands in the given WISE SoE DD tables
has determinand: CAS 52663-70-4
has uom: kg.a-1
has table: WISE-SoE Emissions.Emissions

WISE-SoE_Emissions.Emissions - CAS_52663-72-6 - kg/a
type: Concept
notation: WISE-SoE_Emissions.Emissions - CAS_52663-72-6 - kg/a
definition: The unit of measure for 'CAS_52663-72-6' (PCB 167 (1,2,3-trichloro-5-(2,4,5-trichlorophenyl)benzene)) in WISE SoE - Emissions: Emissions table is 'kg/a'
status: valid
status modified: 2019-10-03
accepted date: 2019-10-03
in scheme: Definition of correct units for the observed determinands in the given WISE SoE DD tables
has determinand: CAS 52663-72-6
has uom: kg.a-1
has table: WISE-SoE Emissions.Emissions

WISE-SoE_Emissions.Emissions - CAS_52888-80-9 - kg/a
type: Concept
notation: WISE-SoE_Emissions.Emissions - CAS_52888-80-9 - kg/a
definition: The unit of measure for 'CAS_52888-80-9' (Prosulfocarb) in WISE SoE - Emissions: Emissions table is 'kg/a'
status: valid
status modified: 2019-10-03
accepted date: 2019-10-03
in scheme: Definition of correct units for the observed determinands in the given WISE SoE DD tables
has determinand: CAS 52888-80-9
has uom: kg.a-1
has table: WISE-SoE Emissions.Emissions

WISE-SoE_Emissions.Emissions - CAS_52918-63-5 - kg/a
type: Concept
notation: WISE-SoE_Emissions.Emissions - CAS_52918-63-5 - kg/a
definition: The unit of measure for 'CAS_52918-63-5' (Deltamethrin) in WISE SoE - Emissions: Emissions table is 'kg/a'
status: valid
status modified: 2019-10-03
accepted date: 2019-10-03
in scheme: Definition of correct units for the observed determinands in the given WISE SoE DD tables
has determinand: CAS 52918-63-5
has uom: kg.a-1
has table: WISE-SoE Emissions.Emissions

WISE-SoE_Emissions.Emissions - CAS_53-16-7 - kg/a
type: Concept
notation: WISE-SoE_Emissions.Emissions - CAS_53-16-7 - kg/a
definition: The unit of measure for 'CAS_53-16-7' (Estrone (E1)) in WISE SoE - Emissions: Emissions table is 'kg/a'
status: valid
status modified: 2019-10-03
accepted date: 2019-10-03
in scheme: Definition of correct units for the observed determinands in the given WISE SoE DD tables
has determinand: CAS 53-16-7
has uom: kg.a-1
has table: WISE-SoE Emissions.Emissions

WISE-SoE_Emissions.Emissions - CAS_53-19-0 - kg/a
type: Concept
notation: WISE-SoE_Emissions.Emissions - CAS_53-19-0 - kg/a
definition: The unit of measure for 'CAS_53-19-0' (o,p'-DDD) in WISE SoE - Emissions: Emissions table is 'kg/a'
status: valid
status modified: 2019-10-03
accepted date: 2019-10-03
in scheme: Definition of correct units for the observed determinands in the given WISE SoE DD tables
has determinand: CAS 53-19-0
has uom: kg.a-1
has table: WISE-SoE Emissions.Emissions

WISE-SoE_Emissions.Emissions - CAS_53-70-3 - kg/a
type: Concept
notation: WISE-SoE_Emissions.Emissions - CAS_53-70-3 - kg/a
definition: The unit of measure for 'CAS_53-70-3' (Dibenzo(a,h)anthracene) in WISE SoE - Emissions: Emissions table is 'kg/a'
status: valid
status modified: 2019-10-03
accepted date: 2019-10-03
in scheme: Definition of correct units for the observed determinands in the given WISE SoE DD tables
has determinand: CAS 53-70-3
has uom: kg.a-1
has table: WISE-SoE Emissions.Emissions

WISE-SoE_Emissions.Emissions - CAS_53112-28-0 - kg/a
type: Concept
notation: WISE-SoE_Emissions.Emissions - CAS_53112-28-0 - kg/a
definition: The unit of measure for 'CAS_53112-28-0' (Pyrimethanil) in WISE SoE - Emissions: Emissions table is 'kg/a'
status: valid
status modified: 2019-10-03
accepted date: 2019-10-03
in scheme: Definition of correct units for the observed determinands in the given WISE SoE DD tables
has determinand: CAS 53112-28-0
has uom: kg.a-1
has table: WISE-SoE Emissions.Emissions

WISE-SoE_Emissions.Emissions - CAS_534-52-1 - kg/a
type: Concept
notation: WISE-SoE_Emissions.Emissions - CAS_534-52-1 - kg/a
definition: The unit of measure for 'CAS_534-52-1' (Dinitro-o-cresol (DNOC)) in WISE SoE - Emissions: Emissions table is 'kg/a'
status: valid
status modified: 2019-10-03
accepted date: 2019-10-03
in scheme: Definition of correct units for the observed determinands in the given WISE SoE DD tables
has determinand: CAS 534-52-1
has uom: kg.a-1
has table: WISE-SoE Emissions.Emissions

WISE-SoE_Emissions.Emissions - CAS_5367-28-2 - kg/a
type: Concept
notation: WISE-SoE_Emissions.Emissions - CAS_5367-28-2 - kg/a
definition: The unit of measure for 'CAS_5367-28-2' (3-chloro-6-nitrotoluene) in WISE SoE - Emissions: Emissions table is 'kg/a'
status: valid
status modified: 2019-10-03
accepted date: 2019-10-03
in scheme: Definition of correct units for the observed determinands in the given WISE SoE DD tables
has determinand: CAS 5367-28-2
has uom: kg.a-1
has table: WISE-SoE Emissions.Emissions

WISE-SoE_Emissions.Emissions - CAS_540-59-0 - kg/a
type: Concept
notation: WISE-SoE_Emissions.Emissions - CAS_540-59-0 - kg/a
definition: The unit of measure for 'CAS_540-59-0' (1,2-dichloroethene) in WISE SoE - Emissions: Emissions table is 'kg/a'
status: valid
status modified: 2019-10-03
accepted date: 2019-10-03
in scheme: Definition of correct units for the observed determinands in the given WISE SoE DD tables
has determinand: CAS 540-59-0
has uom: kg.a-1
has table: WISE-SoE Emissions.Emissions

WISE-SoE_Emissions.Emissions - CAS_541-73-1 - kg/a
type: Concept
notation: WISE-SoE_Emissions.Emissions - CAS_541-73-1 - kg/a
definition: The unit of measure for 'CAS_541-73-1' (1,3-dichlorobenzene) in WISE SoE - Emissions: Emissions table is 'kg/a'
status: valid
status modified: 2019-10-03
accepted date: 2019-10-03
in scheme: Definition of correct units for the observed determinands in the given WISE SoE DD tables
has determinand: CAS 541-73-1
has uom: kg.a-1
has table: WISE-SoE Emissions.Emissions

WISE-SoE_Emissions.Emissions - CAS_542-75-6 - kg/a
type: Concept
notation: WISE-SoE_Emissions.Emissions - CAS_542-75-6 - kg/a
definition: The unit of measure for 'CAS_542-75-6' (1,3-dichloropropene) in WISE SoE - Emissions: Emissions table is 'kg/a'
status: valid
status modified: 2019-10-03
accepted date: 2019-10-03
in scheme: Definition of correct units for the observed determinands in the given WISE SoE DD tables
has determinand: CAS 542-75-6
has uom: kg.a-1
has table: WISE-SoE Emissions.Emissions

WISE-SoE_Emissions.Emissions - CAS_5436-43-1 - kg/a
type: Concept
notation: WISE-SoE_Emissions.Emissions - CAS_5436-43-1 - kg/a
definition: The unit of measure for 'CAS_5436-43-1' (BDE 47 (2,2’,4,4’-tetrabromodiphenyl ether)) in WISE SoE - Emissions: Emissions table is 'kg/a'
status: valid
status modified: 2019-10-03
accepted date: 2019-10-03
in scheme: Definition of correct units for the observed determinands in the given WISE SoE DD tables
has determinand: CAS 5436-43-1
has uom: kg.a-1
has table: WISE-SoE Emissions.Emissions

WISE-SoE_Emissions.Emissions - CAS_5466-77-3 - kg/a
type: Concept
notation: WISE-SoE_Emissions.Emissions - CAS_5466-77-3 - kg/a
definition: The unit of measure for 'CAS_5466-77-3' (2-Ethylhexyl 4-methoxycinnamate) in WISE SoE - Emissions: Emissions table is 'kg/a'
status: valid
status modified: 2019-10-03
accepted date: 2019-10-03
in scheme: Definition of correct units for the observed determinands in the given WISE SoE DD tables
has determinand: CAS 5466-77-3
has uom: kg.a-1
has table: WISE-SoE Emissions.Emissions

WISE-SoE_Emissions.Emissions - CAS_54910-89-3 - kg/a
type: Concept
notation: WISE-SoE_Emissions.Emissions - CAS_54910-89-3 - kg/a
definition: The unit of measure for 'CAS_54910-89-3' (Fluoxetine) in WISE SoE - Emissions: Emissions table is 'kg/a'
status: valid
status modified: 2019-10-03
accepted date: 2019-10-03
in scheme: Definition of correct units for the observed determinands in the given WISE SoE DD tables
has determinand: CAS 54910-89-3
has uom: kg.a-1
has table: WISE-SoE Emissions.Emissions

WISE-SoE_Emissions.Emissions - CAS_55-38-9 - kg/a
type: Concept
notation: WISE-SoE_Emissions.Emissions - CAS_55-38-9 - kg/a
definition: The unit of measure for 'CAS_55-38-9' (Fenthion) in WISE SoE - Emissions: Emissions table is 'kg/a'
status: valid
status modified: 2019-10-03
accepted date: 2019-10-03
in scheme: Definition of correct units for the observed determinands in the given WISE SoE DD tables
has determinand: CAS 55-38-9
has uom: kg.a-1
has table: WISE-SoE Emissions.Emissions

WISE-SoE_Emissions.Emissions - CAS_55179-31-2 - kg/a
type: Concept
notation: WISE-SoE_Emissions.Emissions - CAS_55179-31-2 - kg/a
definition: The unit of measure for 'CAS_55179-31-2' (Bitertanol) in WISE SoE - Emissions: Emissions table is 'kg/a'
status: valid
status modified: 2019-10-03
accepted date: 2019-10-03
in scheme: Definition of correct units for the observed determinands in the given WISE SoE DD tables
has determinand: CAS 55179-31-2
has uom: kg.a-1
has table: WISE-SoE Emissions.Emissions

WISE-SoE_Emissions.Emissions - CAS_55219-65-3 - kg/a
type: Concept
notation: WISE-SoE_Emissions.Emissions - CAS_55219-65-3 - kg/a
definition: The unit of measure for 'CAS_55219-65-3' (Triadimenol) in WISE SoE - Emissions: Emissions table is 'kg/a'
status: valid
status modified: 2019-10-03
accepted date: 2019-10-03
in scheme: Definition of correct units for the observed determinands in the given WISE SoE DD tables
has determinand: CAS 55219-65-3
has uom: kg.a-1
has table: WISE-SoE Emissions.Emissions

WISE-SoE_Emissions.Emissions - CAS_55335-06-3 - kg/a
type: Concept
notation: WISE-SoE_Emissions.Emissions - CAS_55335-06-3 - kg/a
definition: The unit of measure for 'CAS_55335-06-3' (Triclopyr) in WISE SoE - Emissions: Emissions table is 'kg/a'
status: valid
status modified: 2019-10-03
accepted date: 2019-10-03
in scheme: Definition of correct units for the observed determinands in the given WISE SoE DD tables
has determinand: CAS 55335-06-3
has uom: kg.a-1
has table: WISE-SoE Emissions.Emissions

WISE-SoE_Emissions.Emissions - CAS_554-00-7 - kg/a
type: Concept
notation: WISE-SoE_Emissions.Emissions - CAS_554-00-7 - kg/a
definition: The unit of measure for 'CAS_554-00-7' (2,4-dichloroaniline) in WISE SoE - Emissions: Emissions table is 'kg/a'
status: valid
status modified: 2019-10-03
accepted date: 2019-10-03
in scheme: Definition of correct units for the observed determinands in the given WISE SoE DD tables
has determinand: CAS 554-00-7
has uom: kg.a-1
has table: WISE-SoE Emissions.Emissions

WISE-SoE_Emissions.Emissions - CAS_555-37-3 - kg/a
type: Concept
notation: WISE-SoE_Emissions.Emissions - CAS_555-37-3 - kg/a
definition: The unit of measure for 'CAS_555-37-3' (Neburon) in WISE SoE - Emissions: Emissions table is 'kg/a'
status: valid
status modified: 2019-10-03
accepted date: 2019-10-03
in scheme: Definition of correct units for the observed determinands in the given WISE SoE DD tables
has determinand: CAS 555-37-3
has uom: kg.a-1
has table: WISE-SoE Emissions.Emissions

WISE-SoE_Emissions.Emissions - CAS_55512-33-9 - kg/a
type: Concept
notation: WISE-SoE_Emissions.Emissions - CAS_55512-33-9 - kg/a
definition: The unit of measure for 'CAS_55512-33-9' (Pyridate) in WISE SoE - Emissions: Emissions table is 'kg/a'
status: valid
status modified: 2019-10-03
accepted date: 2019-10-03
in scheme: Definition of correct units for the observed determinands in the given WISE SoE DD tables
has determinand: CAS 55512-33-9
has uom: kg.a-1
has table: WISE-SoE Emissions.Emissions

WISE-SoE_Emissions.Emissions - CAS_55525-54-7 - kg/a
type: Concept
notation: WISE-SoE_Emissions.Emissions - CAS_55525-54-7 - kg/a
definition: The unit of measure for 'CAS_55525-54-7' (3,3’-(ureylenedimethylene)bis(3,5,5’- trimethylcyclohexyl) diisocyanate) in WISE SoE - Emissions: Emissions table is 'kg/a'
status: valid
status modified: 2019-10-03
accepted date: 2019-10-03
in scheme: Definition of correct units for the observed determinands in the given WISE SoE DD tables
has determinand: CAS 55525-54-7
has uom: kg.a-1
has table: WISE-SoE Emissions.Emissions

WISE-SoE_Emissions.Emissions - CAS_556-88-7 - kg/a
type: Concept
notation: WISE-SoE_Emissions.Emissions - CAS_556-88-7 - kg/a
definition: The unit of measure for 'CAS_556-88-7' (Nitroguanidine) in WISE SoE - Emissions: Emissions table is 'kg/a'
status: valid
status modified: 2019-10-03
accepted date: 2019-10-03
in scheme: Definition of correct units for the observed determinands in the given WISE SoE DD tables
has determinand: CAS 556-88-7
has uom: kg.a-1
has table: WISE-SoE Emissions.Emissions

WISE-SoE_Emissions.Emissions - CAS_55673-89-7 - kg/a
type: Concept
notation: WISE-SoE_Emissions.Emissions - CAS_55673-89-7 - kg/a
definition: The unit of measure for 'CAS_55673-89-7' (1,2,3,4,7,8,9-H7CDF) in WISE SoE - Emissions: Emissions table is 'kg/a'
status: valid
status modified: 2019-10-03
accepted date: 2019-10-03
in scheme: Definition of correct units for the observed determinands in the given WISE SoE DD tables
has determinand: CAS 55673-89-7
has uom: kg.a-1
has table: WISE-SoE Emissions.Emissions

WISE-SoE_Emissions.Emissions - CAS_5598-13-0 - kg/a
type: Concept
notation: WISE-SoE_Emissions.Emissions - CAS_5598-13-0 - kg/a
definition: The unit of measure for 'CAS_5598-13-0' (Chlorpyrifos-methyl) in WISE SoE - Emissions: Emissions table is 'kg/a'
status: valid
status modified: 2019-10-03
accepted date: 2019-10-03
in scheme: Definition of correct units for the observed determinands in the given WISE SoE DD tables
has determinand: CAS 5598-13-0
has uom: kg.a-1
has table: WISE-SoE Emissions.Emissions

WISE-SoE_Emissions.Emissions - CAS_56-23-5 - kg/a
type: Concept
notation: WISE-SoE_Emissions.Emissions - CAS_56-23-5 - kg/a
definition: The unit of measure for 'CAS_56-23-5' (Carbon tetrachloride) in WISE SoE - Emissions: Emissions table is 'kg/a'
status: valid
status modified: 2019-10-03
accepted date: 2019-10-03
in scheme: Definition of correct units for the observed determinands in the given WISE SoE DD tables
has determinand: CAS 56-23-5
has uom: kg.a-1
has table: WISE-SoE Emissions.Emissions

WISE-SoE_Emissions.Emissions - CAS_56-38-2 - kg/a
type: Concept
notation: WISE-SoE_Emissions.Emissions - CAS_56-38-2 - kg/a
definition: The unit of measure for 'CAS_56-38-2' (Parathion) in WISE SoE - Emissions: Emissions table is 'kg/a'
status: valid
status modified: 2019-10-03
accepted date: 2019-10-03
in scheme: Definition of correct units for the observed determinands in the given WISE SoE DD tables
has determinand: CAS 56-38-2
has uom: kg.a-1
has table: WISE-SoE Emissions.Emissions

WISE-SoE_Emissions.Emissions - CAS_56-55-3 - kg/a
type: Concept
notation: WISE-SoE_Emissions.Emissions - CAS_56-55-3 - kg/a
definition: The unit of measure for 'CAS_56-55-3' (Benzo(a)anthracene) in WISE SoE - Emissions: Emissions table is 'kg/a'
status: valid
status modified: 2019-10-03
accepted date: 2019-10-03
in scheme: Definition of correct units for the observed determinands in the given WISE SoE DD tables
has determinand: CAS 56-55-3
has uom: kg.a-1
has table: WISE-SoE Emissions.Emissions

WISE-SoE_Emissions.Emissions - CAS_56-72-4 - kg/a
type: Concept
notation: WISE-SoE_Emissions.Emissions - CAS_56-72-4 - kg/a
definition: The unit of measure for 'CAS_56-72-4' (Coumaphos) in WISE SoE - Emissions: Emissions table is 'kg/a'
status: valid
status modified: 2019-10-03
accepted date: 2019-10-03
in scheme: Definition of correct units for the observed determinands in the given WISE SoE DD tables
has determinand: CAS 56-72-4
has uom: kg.a-1
has table: WISE-SoE Emissions.Emissions

WISE-SoE_Emissions.Emissions - CAS_563-12-2 - kg/a
type: Concept
notation: WISE-SoE_Emissions.Emissions - CAS_563-12-2 - kg/a
definition: The unit of measure for 'CAS_563-12-2' (Ethion) in WISE SoE - Emissions: Emissions table is 'kg/a'
status: valid
status modified: 2019-10-03
accepted date: 2019-10-03
in scheme: Definition of correct units for the observed determinands in the given WISE SoE DD tables
has determinand: CAS 563-12-2
has uom: kg.a-1
has table: WISE-SoE Emissions.Emissions

WISE-SoE_Emissions.Emissions - CAS_563-58-6 - kg/a
type: Concept
notation: WISE-SoE_Emissions.Emissions - CAS_563-58-6 - kg/a
definition: The unit of measure for 'CAS_563-58-6' (1,1-dichloropropene) in WISE SoE - Emissions: Emissions table is 'kg/a'
status: valid
status modified: 2019-10-03
accepted date: 2019-10-03
in scheme: Definition of correct units for the observed determinands in the given WISE SoE DD tables
has determinand: CAS 563-58-6
has uom: kg.a-1
has table: WISE-SoE Emissions.Emissions

WISE-SoE_Emissions.Emissions - CAS_56507-37-0 - kg/a
type: Concept
notation: WISE-SoE_Emissions.Emissions - CAS_56507-37-0 - kg/a
definition: The unit of measure for 'CAS_56507-37-0' (Diketo-metribuzin) in WISE SoE - Emissions: Emissions table is 'kg/a'
status: valid
status modified: 2019-10-03
accepted date: 2019-10-03
in scheme: Definition of correct units for the observed determinands in the given WISE SoE DD tables
has determinand: CAS 56507-37-0
has uom: kg.a-1
has table: WISE-SoE Emissions.Emissions

WISE-SoE_Emissions.Emissions - CAS_57-12-5 - kg/a
type: Concept
notation: WISE-SoE_Emissions.Emissions - CAS_57-12-5 - kg/a
definition: The unit of measure for 'CAS_57-12-5' (Free cyanide) in WISE SoE - Emissions: Emissions table is 'kg/a'
status: valid
status modified: 2019-10-03
accepted date: 2019-10-03
in scheme: Definition of correct units for the observed determinands in the given WISE SoE DD tables
has determinand: CAS 57-12-5
has uom: kg.a-1
has table: WISE-SoE Emissions.Emissions

WISE-SoE_Emissions.Emissions - CAS_57-63-6 - kg/a
type: Concept
notation: WISE-SoE_Emissions.Emissions - CAS_57-63-6 - kg/a
definition: The unit of measure for 'CAS_57-63-6' (17alpha-ethinylestradiol (EE2)) in WISE SoE - Emissions: Emissions table is 'kg/a'
status: valid
status modified: 2019-10-03
accepted date: 2019-10-03
in scheme: Definition of correct units for the observed determinands in the given WISE SoE DD tables
has determinand: CAS 57-63-6
has uom: kg.a-1
has table: WISE-SoE Emissions.Emissions

WISE-SoE_Emissions.Emissions - CAS_57-74-9 - kg/a
type: Concept
notation: WISE-SoE_Emissions.Emissions - CAS_57-74-9 - kg/a
definition: The unit of measure for 'CAS_57-74-9' (Chlordane) in WISE SoE - Emissions: Emissions table is 'kg/a'
status: valid
status modified: 2019-10-03
accepted date: 2019-10-03
in scheme: Definition of correct units for the observed determinands in the given WISE SoE DD tables
has determinand: CAS 57-74-9
has uom: kg.a-1
has table: WISE-SoE Emissions.Emissions

WISE-SoE_Emissions.Emissions - CAS_57018-04-9 - kg/a
type: Concept
notation: WISE-SoE_Emissions.Emissions - CAS_57018-04-9 - kg/a
definition: The unit of measure for 'CAS_57018-04-9' (Tolclofos methyl) in WISE SoE - Emissions: Emissions table is 'kg/a'
status: valid
status modified: 2019-10-03
accepted date: 2019-10-03
in scheme: Definition of correct units for the observed determinands in the given WISE SoE DD tables
has determinand: CAS 57018-04-9
has uom: kg.a-1
has table: WISE-SoE Emissions.Emissions

WISE-SoE_Emissions.Emissions - CAS_57117-31-4 - kg/a
type: Concept
notation: WISE-SoE_Emissions.Emissions - CAS_57117-31-4 - kg/a
definition: The unit of measure for 'CAS_57117-31-4' (2,3,4,7,8-P5CDF) in WISE SoE - Emissions: Emissions table is 'kg/a'
status: valid
status modified: 2019-10-03
accepted date: 2019-10-03
in scheme: Definition of correct units for the observed determinands in the given WISE SoE DD tables
has determinand: CAS 57117-31-4
has uom: kg.a-1
has table: WISE-SoE Emissions.Emissions

WISE-SoE_Emissions.Emissions - CAS_57117-41-6 - kg/a
type: Concept
notation: WISE-SoE_Emissions.Emissions - CAS_57117-41-6 - kg/a
definition: The unit of measure for 'CAS_57117-41-6' (1,2,3,7,8-P5CDF) in WISE SoE - Emissions: Emissions table is 'kg/a'
status: valid
status modified: 2019-10-03
accepted date: 2019-10-03
in scheme: Definition of correct units for the observed determinands in the given WISE SoE DD tables
has determinand: CAS 57117-41-6
has uom: kg.a-1
has table: WISE-SoE Emissions.Emissions

WISE-SoE_Emissions.Emissions - CAS_57117-44-9 - kg/a
type: Concept
notation: WISE-SoE_Emissions.Emissions - CAS_57117-44-9 - kg/a
definition: The unit of measure for 'CAS_57117-44-9' (1,2,3,6,7,8-H6CDF) in WISE SoE - Emissions: Emissions table is 'kg/a'
status: valid
status modified: 2019-10-03
accepted date: 2019-10-03
in scheme: Definition of correct units for the observed determinands in the given WISE SoE DD tables
has determinand: CAS 57117-44-9
has uom: kg.a-1
has table: WISE-SoE Emissions.Emissions

WISE-SoE_Emissions.Emissions - CAS_57465-28-8 - kg/a
type: Concept
notation: WISE-SoE_Emissions.Emissions - CAS_57465-28-8 - kg/a
definition: The unit of measure for 'CAS_57465-28-8' (PCB 126 (3,3’,4,4’,5-pentachlorobiphenyl)) in WISE SoE - Emissions: Emissions table is 'kg/a'
status: valid
status modified: 2019-10-03
accepted date: 2019-10-03
in scheme: Definition of correct units for the observed determinands in the given WISE SoE DD tables
has determinand: CAS 57465-28-8
has uom: kg.a-1
has table: WISE-SoE Emissions.Emissions

WISE-SoE_Emissions.Emissions - CAS_576-26-1 - kg/a
type: Concept
notation: WISE-SoE_Emissions.Emissions - CAS_576-26-1 - kg/a
definition: The unit of measure for 'CAS_576-26-1' (2,6-dimethyl-phenol) in WISE SoE - Emissions: Emissions table is 'kg/a'
status: valid
status modified: 2019-10-03
accepted date: 2019-10-03
in scheme: Definition of correct units for the observed determinands in the given WISE SoE DD tables
has determinand: CAS 576-26-1
has uom: kg.a-1
has table: WISE-SoE Emissions.Emissions

WISE-SoE_Emissions.Emissions - CAS_57646-30-7 - kg/a
type: Concept
notation: WISE-SoE_Emissions.Emissions - CAS_57646-30-7 - kg/a
definition: The unit of measure for 'CAS_57646-30-7' (Furalaxyl) in WISE SoE - Emissions: Emissions table is 'kg/a'
status: valid
status modified: 2019-10-03
accepted date: 2019-10-03
in scheme: Definition of correct units for the observed determinands in the given WISE SoE DD tables
has determinand: CAS 57646-30-7
has uom: kg.a-1
has table: WISE-SoE Emissions.Emissions

WISE-SoE_Emissions.Emissions - CAS_57653-85-7 - kg/a
type: Concept
notation: WISE-SoE_Emissions.Emissions - CAS_57653-85-7 - kg/a
definition: The unit of measure for 'CAS_57653-85-7' (1,2,3,6,7,8-H6CDD) in WISE SoE - Emissions: Emissions table is 'kg/a'
status: valid
status modified: 2019-10-03
accepted date: 2019-10-03
in scheme: Definition of correct units for the observed determinands in the given WISE SoE DD tables
has determinand: CAS 57653-85-7
has uom: kg.a-1
has table: WISE-SoE Emissions.Emissions

WISE-SoE_Emissions.Emissions - CAS_57837-19-1 - kg/a
type: Concept
notation: WISE-SoE_Emissions.Emissions - CAS_57837-19-1 - kg/a
definition: The unit of measure for 'CAS_57837-19-1' (Metalaxyl) in WISE SoE - Emissions: Emissions table is 'kg/a'
status: valid
status modified: 2019-10-03
accepted date: 2019-10-03
in scheme: Definition of correct units for the observed determinands in the given WISE SoE DD tables
has determinand: CAS 57837-19-1
has uom: kg.a-1
has table: WISE-SoE Emissions.Emissions

WISE-SoE_Emissions.Emissions - CAS_57966-95-7 - kg/a
type: Concept
notation: WISE-SoE_Emissions.Emissions - CAS_57966-95-7 - kg/a
definition: The unit of measure for 'CAS_57966-95-7' (Cymoxanil) in WISE SoE - Emissions: Emissions table is 'kg/a'
status: valid
status modified: 2019-10-03
accepted date: 2019-10-03
in scheme: Definition of correct units for the observed determinands in the given WISE SoE DD tables
has determinand: CAS 57966-95-7
has uom: kg.a-1
has table: WISE-SoE Emissions.Emissions

WISE-SoE_Emissions.Emissions - CAS_58-08-2 - kg/a
type: Concept
notation: WISE-SoE_Emissions.Emissions - CAS_58-08-2 - kg/a
definition: The unit of measure for 'CAS_58-08-2' (Caffeine) in WISE SoE - Emissions: Emissions table is 'kg/a'
status: valid
status modified: 2019-10-03
accepted date: 2019-10-03
in scheme: Definition of correct units for the observed determinands in the given WISE SoE DD tables
has determinand: CAS 58-08-2
has uom: kg.a-1
has table: WISE-SoE Emissions.Emissions

WISE-SoE_Emissions.Emissions - CAS_58-89-9 - kg/a
type: Concept
notation: WISE-SoE_Emissions.Emissions - CAS_58-89-9 - kg/a
definition: The unit of measure for 'CAS_58-89-9' (Gamma-HCH (Lindane)) in WISE SoE - Emissions: Emissions table is 'kg/a'
status: valid
status modified: 2019-10-03
accepted date: 2019-10-03
in scheme: Definition of correct units for the observed determinands in the given WISE SoE DD tables
has determinand: CAS 58-89-9
has uom: kg.a-1
has table: WISE-SoE Emissions.Emissions

WISE-SoE_Emissions.Emissions - CAS_58-90-2 - kg/a
type: Concept
notation: WISE-SoE_Emissions.Emissions - CAS_58-90-2 - kg/a
definition: The unit of measure for 'CAS_58-90-2' (2,3,4,6-tetrachlorophenol) in WISE SoE - Emissions: Emissions table is 'kg/a'
status: valid
status modified: 2019-10-03
accepted date: 2019-10-03
in scheme: Definition of correct units for the observed determinands in the given WISE SoE DD tables
has determinand: CAS 58-90-2
has uom: kg.a-1
has table: WISE-SoE Emissions.Emissions

WISE-SoE_Emissions.Emissions - CAS_59-50-7 - kg/a
type: Concept
notation: WISE-SoE_Emissions.Emissions - CAS_59-50-7 - kg/a
definition: The unit of measure for 'CAS_59-50-7' (3-methyl-4-chlorophenol) in WISE SoE - Emissions: Emissions table is 'kg/a'
status: valid
status modified: 2019-10-03
accepted date: 2019-10-03
in scheme: Definition of correct units for the observed determinands in the given WISE SoE DD tables
has determinand: CAS 59-50-7
has uom: kg.a-1
has table: WISE-SoE Emissions.Emissions

WISE-SoE_Emissions.Emissions - CAS_5915-41-3 - kg/a
type: Concept
notation: WISE-SoE_Emissions.Emissions - CAS_5915-41-3 - kg/a
definition: The unit of measure for 'CAS_5915-41-3' (Terbuthylazine) in WISE SoE - Emissions: Emissions table is 'kg/a'
status: valid
status modified: 2019-10-03
accepted date: 2019-10-03
in scheme: Definition of correct units for the observed determinands in the given WISE SoE DD tables
has determinand: CAS 5915-41-3
has uom: kg.a-1
has table: WISE-SoE Emissions.Emissions

WISE-SoE_Emissions.Emissions - CAS_594-20-7 - kg/a
type: Concept
notation: WISE-SoE_Emissions.Emissions - CAS_594-20-7 - kg/a
definition: The unit of measure for 'CAS_594-20-7' (2,2-dichloropropane) in WISE SoE - Emissions: Emissions table is 'kg/a'
status: valid
status modified: 2019-10-03
accepted date: 2019-10-03
in scheme: Definition of correct units for the observed determinands in the given WISE SoE DD tables
has determinand: CAS 594-20-7
has uom: kg.a-1
has table: WISE-SoE Emissions.Emissions

WISE-SoE_Emissions.Emissions - CAS_59473-04-0 - kg/a
type: Concept
notation: WISE-SoE_Emissions.Emissions - CAS_59473-04-0 - kg/a
definition: The unit of measure for 'CAS_59473-04-0' (AOX) in WISE SoE - Emissions: Emissions table is 'kg/a'
status: valid
status modified: 2019-10-03
accepted date: 2019-10-03
in scheme: Definition of correct units for the observed determinands in the given WISE SoE DD tables
has determinand: CAS 59473-04-0
has uom: kg.a-1
has table: WISE-SoE Emissions.Emissions

WISE-SoE_Emissions.Emissions - CAS_60-00-4 - kg/a
type: Concept
notation: WISE-SoE_Emissions.Emissions - CAS_60-00-4 - kg/a
definition: The unit of measure for 'CAS_60-00-4' (EDTA) in WISE SoE - Emissions: Emissions table is 'kg/a'
status: valid
status modified: 2019-10-03
accepted date: 2019-10-03
in scheme: Definition of correct units for the observed determinands in the given WISE SoE DD tables
has determinand: CAS 60-00-4
has uom: kg.a-1
has table: WISE-SoE Emissions.Emissions

WISE-SoE_Emissions.Emissions - CAS_60-51-5 - kg/a
type: Concept
notation: WISE-SoE_Emissions.Emissions - CAS_60-51-5 - kg/a
definition: The unit of measure for 'CAS_60-51-5' (Dimethoate) in WISE SoE - Emissions: Emissions table is 'kg/a'
status: valid
status modified: 2019-10-03
accepted date: 2019-10-03
in scheme: Definition of correct units for the observed determinands in the given WISE SoE DD tables
has determinand: CAS 60-51-5
has uom: kg.a-1
has table: WISE-SoE Emissions.Emissions

WISE-SoE_Emissions.Emissions - CAS_60-57-1 - kg/a
type: Concept
notation: WISE-SoE_Emissions.Emissions - CAS_60-57-1 - kg/a
definition: The unit of measure for 'CAS_60-57-1' (Dieldrin) in WISE SoE - Emissions: Emissions table is 'kg/a'
status: valid
status modified: 2019-10-03
accepted date: 2019-10-03
in scheme: Definition of correct units for the observed determinands in the given WISE SoE DD tables
has determinand: CAS 60-57-1
has uom: kg.a-1
has table: WISE-SoE Emissions.Emissions

WISE-SoE_Emissions.Emissions - CAS_60145-21-3 - kg/a
type: Concept
notation: WISE-SoE_Emissions.Emissions - CAS_60145-21-3 - kg/a
definition: The unit of measure for 'CAS_60145-21-3' (PCB 103 (2,2',4,5',6-pentachlorobiphenyl)) in WISE SoE - Emissions: Emissions table is 'kg/a'
status: valid
status modified: 2019-10-03
accepted date: 2019-10-03
in scheme: Definition of correct units for the observed determinands in the given WISE SoE DD tables
has determinand: CAS 60145-21-3
has uom: kg.a-1
has table: WISE-SoE Emissions.Emissions

WISE-SoE_Emissions.Emissions - CAS_60168-88-9 - kg/a
type: Concept
notation: WISE-SoE_Emissions.Emissions - CAS_60168-88-9 - kg/a
definition: The unit of measure for 'CAS_60168-88-9' (Fenarimol) in WISE SoE - Emissions: Emissions table is 'kg/a'
status: valid
status modified: 2019-10-03
accepted date: 2019-10-03
in scheme: Definition of correct units for the observed determinands in the given WISE SoE DD tables
has determinand: CAS 60168-88-9
has uom: kg.a-1
has table: WISE-SoE Emissions.Emissions

WISE-SoE_Emissions.Emissions - CAS_60207-90-1 - kg/a
type: Concept
notation: WISE-SoE_Emissions.Emissions - CAS_60207-90-1 - kg/a
definition: The unit of measure for 'CAS_60207-90-1' (Propiconazole) in WISE SoE - Emissions: Emissions table is 'kg/a'
status: valid
status modified: 2019-10-03
accepted date: 2019-10-03
in scheme: Definition of correct units for the observed determinands in the given WISE SoE DD tables
has determinand: CAS 60207-90-1
has uom: kg.a-1
has table: WISE-SoE Emissions.Emissions

WISE-SoE_Emissions.Emissions - CAS_603-35-0 - kg/a
type: Concept
notation: WISE-SoE_Emissions.Emissions - CAS_603-35-0 - kg/a
definition: The unit of measure for 'CAS_603-35-0' (Triphenyl phosphine) in WISE SoE - Emissions: Emissions table is 'kg/a'
status: valid
status modified: 2019-10-03
accepted date: 2019-10-03
in scheme: Definition of correct units for the observed determinands in the given WISE SoE DD tables
has determinand: CAS 603-35-0
has uom: kg.a-1
has table: WISE-SoE Emissions.Emissions

WISE-SoE_Emissions.Emissions - CAS_60348-60-9 - kg/a
type: Concept
notation: WISE-SoE_Emissions.Emissions - CAS_60348-60-9 - kg/a
definition: The unit of measure for 'CAS_60348-60-9' (BDE 99 (2,2’,4,4’,5-pentabromodiphenyl ether)) in WISE SoE - Emissions: Emissions table is 'kg/a'
status: valid
status modified: 2019-10-03
accepted date: 2019-10-03
in scheme: Definition of correct units for the observed determinands in the given WISE SoE DD tables
has determinand: CAS 60348-60-9
has uom: kg.a-1
has table: WISE-SoE Emissions.Emissions

WISE-SoE_Emissions.Emissions - CAS_608-27-5 - kg/a
type: Concept
notation: WISE-SoE_Emissions.Emissions - CAS_608-27-5 - kg/a
definition: The unit of measure for 'CAS_608-27-5' (2,3-Dichloroaniline) in WISE SoE - Emissions: Emissions table is 'kg/a'
status: valid
status modified: 2019-10-03
accepted date: 2019-10-03
in scheme: Definition of correct units for the observed determinands in the given WISE SoE DD tables
has determinand: CAS 608-27-5
has uom: kg.a-1
has table: WISE-SoE Emissions.Emissions

WISE-SoE_Emissions.Emissions - CAS_608-31-1 - kg/a
type: Concept
notation: WISE-SoE_Emissions.Emissions - CAS_608-31-1 - kg/a
definition: The unit of measure for 'CAS_608-31-1' (2,6-Dichloroaniline) in WISE SoE - Emissions: Emissions table is 'kg/a'
status: valid
status modified: 2019-10-03
accepted date: 2019-10-03
in scheme: Definition of correct units for the observed determinands in the given WISE SoE DD tables
has determinand: CAS 608-31-1
has uom: kg.a-1
has table: WISE-SoE Emissions.Emissions

WISE-SoE_Emissions.Emissions - CAS_608-73-1 - kg/a
type: Concept
notation: WISE-SoE_Emissions.Emissions - CAS_608-73-1 - kg/a
definition: The unit of measure for 'CAS_608-73-1' (Hexachlorocyclohexane) in WISE SoE - Emissions: Emissions table is 'kg/a'
status: valid
status modified: 2019-10-03
accepted date: 2019-10-03
in scheme: Definition of correct units for the observed determinands in the given WISE SoE DD tables
has determinand: CAS 608-73-1
has uom: kg.a-1
has table: WISE-SoE Emissions.Emissions

WISE-SoE_Emissions.Emissions - CAS_608-93-5 - kg/a
type: Concept
notation: WISE-SoE_Emissions.Emissions - CAS_608-93-5 - kg/a
definition: The unit of measure for 'CAS_608-93-5' (Pentachlorobenzene) in WISE SoE - Emissions: Emissions table is 'kg/a'
status: valid
status modified: 2019-10-03
accepted date: 2019-10-03
in scheme: Definition of correct units for the observed determinands in the given WISE SoE DD tables
has determinand: CAS 608-93-5
has uom: kg.a-1
has table: WISE-SoE Emissions.Emissions

WISE-SoE_Emissions.Emissions - CAS_60851-34-5 - kg/a
type: Concept
notation: WISE-SoE_Emissions.Emissions - CAS_60851-34-5 - kg/a
definition: The unit of measure for 'CAS_60851-34-5' (2,3,4,6,7,8-H6CDF) in WISE SoE - Emissions: Emissions table is 'kg/a'
status: valid
status modified: 2019-10-03
accepted date: 2019-10-03
in scheme: Definition of correct units for the observed determinands in the given WISE SoE DD tables
has determinand: CAS 60851-34-5
has uom: kg.a-1
has table: WISE-SoE Emissions.Emissions

WISE-SoE_Emissions.Emissions - CAS_609-19-8 - kg/a
type: Concept
notation: WISE-SoE_Emissions.Emissions - CAS_609-19-8 - kg/a
definition: The unit of measure for 'CAS_609-19-8' (3,4,5-Trichlorophenol) in WISE SoE - Emissions: Emissions table is 'kg/a'
status: valid
status modified: 2019-10-03
accepted date: 2019-10-03
in scheme: Definition of correct units for the observed determinands in the given WISE SoE DD tables
has determinand: CAS 609-19-8
has uom: kg.a-1
has table: WISE-SoE Emissions.Emissions

WISE-SoE_Emissions.Emissions - CAS_6108-10-7 - kg/a
type: Concept
notation: WISE-SoE_Emissions.Emissions - CAS_6108-10-7 - kg/a
definition: The unit of measure for 'CAS_6108-10-7' (Epsilon-HCH) in WISE SoE - Emissions: Emissions table is 'kg/a'
status: valid
status modified: 2019-10-03
accepted date: 2019-10-03
in scheme: Definition of correct units for the observed determinands in the given WISE SoE DD tables
has determinand: CAS 6108-10-7
has uom: kg.a-1
has table: WISE-SoE Emissions.Emissions

WISE-SoE_Emissions.Emissions - CAS_611-06-3 - kg/a
type: Concept
notation: WISE-SoE_Emissions.Emissions - CAS_611-06-3 - kg/a
definition: The unit of measure for 'CAS_611-06-3' (2,4-Dichloro-1-nitrobenzene) in WISE SoE - Emissions: Emissions table is 'kg/a'
status: valid
status modified: 2019-10-03
accepted date: 2019-10-03
in scheme: Definition of correct units for the observed determinands in the given WISE SoE DD tables
has determinand: CAS 611-06-3
has uom: kg.a-1
has table: WISE-SoE Emissions.Emissions

WISE-SoE_Emissions.Emissions - CAS_615-65-6 - kg/a
type: Concept
notation: WISE-SoE_Emissions.Emissions - CAS_615-65-6 - kg/a
definition: The unit of measure for 'CAS_615-65-6' (2-Chloro-4-methylaniline) in WISE SoE - Emissions: Emissions table is 'kg/a'
status: valid
status modified: 2019-10-03
accepted date: 2019-10-03
in scheme: Definition of correct units for the observed determinands in the given WISE SoE DD tables
has determinand: CAS 615-65-6
has uom: kg.a-1
has table: WISE-SoE Emissions.Emissions

WISE-SoE_Emissions.Emissions - CAS_6164-98-3 - kg/a
type: Concept
notation: WISE-SoE_Emissions.Emissions - CAS_6164-98-3 - kg/a
definition: The unit of measure for 'CAS_6164-98-3' (Chlordimeform) in WISE SoE - Emissions: Emissions table is 'kg/a'
status: valid
status modified: 2019-10-03
accepted date: 2019-10-03
in scheme: Definition of correct units for the observed determinands in the given WISE SoE DD tables
has determinand: CAS 6164-98-3
has uom: kg.a-1
has table: WISE-SoE Emissions.Emissions

WISE-SoE_Emissions.Emissions - CAS_6190-65-4 - kg/a
type: Concept
notation: WISE-SoE_Emissions.Emissions - CAS_6190-65-4 - kg/a
definition: The unit of measure for 'CAS_6190-65-4' (Desethylatrazine) in WISE SoE - Emissions: Emissions table is 'kg/a'
status: valid
status modified: 2019-10-03
accepted date: 2019-10-03
in scheme: Definition of correct units for the observed determinands in the given WISE SoE DD tables
has determinand: CAS 6190-65-4
has uom: kg.a-1
has table: WISE-SoE Emissions.Emissions

WISE-SoE_Emissions.Emissions - CAS_62-53-3 - kg/a
type: Concept
notation: WISE-SoE_Emissions.Emissions - CAS_62-53-3 - kg/a
definition: The unit of measure for 'CAS_62-53-3' (Aniline) in WISE SoE - Emissions: Emissions table is 'kg/a'
status: valid
status modified: 2019-10-03
accepted date: 2019-10-03
in scheme: Definition of correct units for the observed determinands in the given WISE SoE DD tables
has determinand: CAS 62-53-3
has uom: kg.a-1
has table: WISE-SoE Emissions.Emissions

WISE-SoE_Emissions.Emissions - CAS_62-73-7 - kg/a
type: Concept
notation: WISE-SoE_Emissions.Emissions - CAS_62-73-7 - kg/a
definition: The unit of measure for 'CAS_62-73-7' (Dichlorvos) in WISE SoE - Emissions: Emissions table is 'kg/a'
status: valid
status modified: 2019-10-03
accepted date: 2019-10-03
in scheme: Definition of correct units for the observed determinands in the given WISE SoE DD tables
has determinand: CAS 62-73-7
has uom: kg.a-1
has table: WISE-SoE Emissions.Emissions

WISE-SoE_Emissions.Emissions - CAS_626-43-7 - kg/a
type: Concept
notation: WISE-SoE_Emissions.Emissions - CAS_626-43-7 - kg/a
definition: The unit of measure for 'CAS_626-43-7' (3,5-Dichloroaniline) in WISE SoE - Emissions: Emissions table is 'kg/a'
status: valid
status modified: 2019-10-03
accepted date: 2019-10-03
in scheme: Definition of correct units for the observed determinands in the given WISE SoE DD tables
has determinand: CAS 626-43-7
has uom: kg.a-1
has table: WISE-SoE Emissions.Emissions

WISE-SoE_Emissions.Emissions - CAS_63-25-2 - kg/a
type: Concept
notation: WISE-SoE_Emissions.Emissions - CAS_63-25-2 - kg/a
definition: The unit of measure for 'CAS_63-25-2' (Carbaryl) in WISE SoE - Emissions: Emissions table is 'kg/a'
status: valid
status modified: 2019-10-03
accepted date: 2019-10-03
in scheme: Definition of correct units for the observed determinands in the given WISE SoE DD tables
has determinand: CAS 63-25-2
has uom: kg.a-1
has table: WISE-SoE Emissions.Emissions

WISE-SoE_Emissions.Emissions - CAS_630-20-6 - kg/a
type: Concept
notation: WISE-SoE_Emissions.Emissions - CAS_630-20-6 - kg/a
definition: The unit of measure for 'CAS_630-20-6' (1,1,1,2-tetrachloroethane) in WISE SoE - Emissions: Emissions table is 'kg/a'
status: valid
status modified: 2019-10-03
accepted date: 2019-10-03
in scheme: Definition of correct units for the observed determinands in the given WISE SoE DD tables
has determinand: CAS 630-20-6
has uom: kg.a-1
has table: WISE-SoE Emissions.Emissions

WISE-SoE_Emissions.Emissions - CAS_6339-19-1 - kg/a
type: Concept
notation: WISE-SoE_Emissions.Emissions - CAS_6339-19-1 - kg/a
definition: The unit of measure for 'CAS_6339-19-1' (Chloridazon desphenyl) in WISE SoE - Emissions: Emissions table is 'kg/a'
status: valid
status modified: 2019-10-03
accepted date: 2019-10-03
in scheme: Definition of correct units for the observed determinands in the given WISE SoE DD tables
has determinand: CAS 6339-19-1
has uom: kg.a-1
has table: WISE-SoE Emissions.Emissions

WISE-SoE_Emissions.Emissions - CAS_64743-03-9 - kg/a
type: Concept
notation: WISE-SoE_Emissions.Emissions - CAS_64743-03-9 - kg/a
definition: The unit of measure for 'CAS_64743-03-9' (Phenols) in WISE SoE - Emissions: Emissions table is 'kg/a'
status: valid
status modified: 2019-10-03
accepted date: 2019-10-03
in scheme: Definition of correct units for the observed determinands in the given WISE SoE DD tables
has determinand: CAS 64743-03-9
has uom: kg.a-1
has table: WISE-SoE Emissions.Emissions

WISE-SoE_Emissions.Emissions - CAS_64902-72-3 - kg/a
type: Concept
notation: WISE-SoE_Emissions.Emissions - CAS_64902-72-3 - kg/a
definition: The unit of measure for 'CAS_64902-72-3' (Chlorsulfuron) in WISE SoE - Emissions: Emissions table is 'kg/a'
status: valid
status modified: 2019-10-03
accepted date: 2019-10-03
in scheme: Definition of correct units for the observed determinands in the given WISE SoE DD tables
has determinand: CAS 64902-72-3
has uom: kg.a-1
has table: WISE-SoE Emissions.Emissions

WISE-SoE_Emissions.Emissions - CAS_65510-44-3 - kg/a
type: Concept
notation: WISE-SoE_Emissions.Emissions - CAS_65510-44-3 - kg/a
definition: The unit of measure for 'CAS_65510-44-3' (PCB 123 (1,2,3-trichloro-5-(2,4-dichlorophenyl)benzene)) in WISE SoE - Emissions: Emissions table is 'kg/a'
status: valid
status modified: 2019-10-03
accepted date: 2019-10-03
in scheme: Definition of correct units for the observed determinands in the given WISE SoE DD tables
has determinand: CAS 65510-44-3
has uom: kg.a-1
has table: WISE-SoE Emissions.Emissions

WISE-SoE_Emissions.Emissions - CAS_66215-27-8 - kg/a
type: Concept
notation: WISE-SoE_Emissions.Emissions - CAS_66215-27-8 - kg/a
definition: The unit of measure for 'CAS_66215-27-8' (Cyromazine) in WISE SoE - Emissions: Emissions table is 'kg/a'
status: valid
status modified: 2019-10-03
accepted date: 2019-10-03
in scheme: Definition of correct units for the observed determinands in the given WISE SoE DD tables
has determinand: CAS 66215-27-8
has uom: kg.a-1
has table: WISE-SoE Emissions.Emissions

WISE-SoE_Emissions.Emissions - CAS_66246-88-6 - kg/a
type: Concept
notation: WISE-SoE_Emissions.Emissions - CAS_66246-88-6 - kg/a
definition: The unit of measure for 'CAS_66246-88-6' (Penconazole) in WISE SoE - Emissions: Emissions table is 'kg/a'
status: valid
status modified: 2019-10-03
accepted date: 2019-10-03
in scheme: Definition of correct units for the observed determinands in the given WISE SoE DD tables
has determinand: CAS 66246-88-6
has uom: kg.a-1
has table: WISE-SoE Emissions.Emissions

WISE-SoE_Emissions.Emissions - CAS_66753-07-9 - kg/a
type: Concept
notation: WISE-SoE_Emissions.Emissions - CAS_66753-07-9 - kg/a
definition: The unit of measure for 'CAS_66753-07-9' (Hydroxyterbuthylazine) in WISE SoE - Emissions: Emissions table is 'kg/a'
status: valid
status modified: 2019-10-03
accepted date: 2019-10-03
in scheme: Definition of correct units for the observed determinands in the given WISE SoE DD tables
has determinand: CAS 66753-07-9
has uom: kg.a-1
has table: WISE-SoE Emissions.Emissions

WISE-SoE_Emissions.Emissions - CAS_67-66-3 - kg/a
type: Concept
notation: WISE-SoE_Emissions.Emissions - CAS_67-66-3 - kg/a
definition: The unit of measure for 'CAS_67-66-3' (Trichloromethane) in WISE SoE - Emissions: Emissions table is 'kg/a'
status: valid
status modified: 2019-10-03
accepted date: 2019-10-03
in scheme: Definition of correct units for the observed determinands in the given WISE SoE DD tables
has determinand: CAS 67-66-3
has uom: kg.a-1
has table: WISE-SoE Emissions.Emissions

WISE-SoE_Emissions.Emissions - CAS_67-72-1 - kg/a
type: Concept
notation: WISE-SoE_Emissions.Emissions - CAS_67-72-1 - kg/a
definition: The unit of measure for 'CAS_67-72-1' (Hexachloroethane) in WISE SoE - Emissions: Emissions table is 'kg/a'
status: valid
status modified: 2019-10-03
accepted date: 2019-10-03
in scheme: Definition of correct units for the observed determinands in the given WISE SoE DD tables
has determinand: CAS 67-72-1
has uom: kg.a-1
has table: WISE-SoE Emissions.Emissions

WISE-SoE_Emissions.Emissions - CAS_67129-08-2 - kg/a
type: Concept
notation: WISE-SoE_Emissions.Emissions - CAS_67129-08-2 - kg/a
definition: The unit of measure for 'CAS_67129-08-2' (Metazachlor) in WISE SoE - Emissions: Emissions table is 'kg/a'
status: valid
status modified: 2019-10-03
accepted date: 2019-10-03
in scheme: Definition of correct units for the observed determinands in the given WISE SoE DD tables
has determinand: CAS 67129-08-2
has uom: kg.a-1
has table: WISE-SoE Emissions.Emissions

WISE-SoE_Emissions.Emissions - CAS_67562-39-4 - kg/a
type: Concept
notation: WISE-SoE_Emissions.Emissions - CAS_67562-39-4 - kg/a
definition: The unit of measure for 'CAS_67562-39-4' (1,2,3,4,6,7,8-H7CDF) in WISE SoE - Emissions: Emissions table is 'kg/a'
status: valid
status modified: 2019-10-03
accepted date: 2019-10-03
in scheme: Definition of correct units for the observed determinands in the given WISE SoE DD tables
has determinand: CAS 67562-39-4
has uom: kg.a-1
has table: WISE-SoE Emissions.Emissions

WISE-SoE_Emissions.Emissions - CAS_67564-91-4 - kg/a
type: Concept
notation: WISE-SoE_Emissions.Emissions - CAS_67564-91-4 - kg/a
definition: The unit of measure for 'CAS_67564-91-4' (Fenpropimorph) in WISE SoE - Emissions: Emissions table is 'kg/a'
status: valid
status modified: 2019-10-03
accepted date: 2019-10-03
in scheme: Definition of correct units for the observed determinands in the given WISE SoE DD tables
has determinand: CAS 67564-91-4
has uom: kg.a-1
has table: WISE-SoE Emissions.Emissions

WISE-SoE_Emissions.Emissions - CAS_67747-09-5 - kg/a
type: Concept
notation: WISE-SoE_Emissions.Emissions - CAS_67747-09-5 - kg/a
definition: The unit of measure for 'CAS_67747-09-5' (Prochloraz) in WISE SoE - Emissions: Emissions table is 'kg/a'
status: valid
status modified: 2019-10-03
accepted date: 2019-10-03
in scheme: Definition of correct units for the observed determinands in the given WISE SoE DD tables
has determinand: CAS 67747-09-5
has uom: kg.a-1
has table: WISE-SoE Emissions.Emissions

WISE-SoE_Emissions.Emissions - CAS_68631-49-2 - kg/a
type: Concept
notation: WISE-SoE_Emissions.Emissions - CAS_68631-49-2 - kg/a
definition: The unit of measure for 'CAS_68631-49-2' (BDE 153 (2,2’,4,4’,5,5’-hexabromodiphenyl ether)) in WISE SoE - Emissions: Emissions table is 'kg/a'
status: valid
status modified: 2019-10-03
accepted date: 2019-10-03
in scheme: Definition of correct units for the observed determinands in the given WISE SoE DD tables
has determinand: CAS 68631-49-2
has uom: kg.a-1
has table: WISE-SoE Emissions.Emissions

WISE-SoE_Emissions.Emissions - CAS_68928-80-3 - kg/a
type: Concept
notation: WISE-SoE_Emissions.Emissions - CAS_68928-80-3 - kg/a
definition: The unit of measure for 'CAS_68928-80-3' (BDE 183 (Heptabromodiphenylether)) in WISE SoE - Emissions: Emissions table is 'kg/a'
status: valid
status modified: 2019-10-03
accepted date: 2019-10-03
in scheme: Definition of correct units for the observed determinands in the given WISE SoE DD tables
has determinand: CAS 68928-80-3
has uom: kg.a-1
has table: WISE-SoE Emissions.Emissions

WISE-SoE_Emissions.Emissions - CAS_69327-76-0 - kg/a
type: Concept
notation: WISE-SoE_Emissions.Emissions - CAS_69327-76-0 - kg/a
definition: The unit of measure for 'CAS_69327-76-0' (Buprofezin) in WISE SoE - Emissions: Emissions table is 'kg/a'
status: valid
status modified: 2019-10-03
accepted date: 2019-10-03
in scheme: Definition of correct units for the observed determinands in the given WISE SoE DD tables
has determinand: CAS 69327-76-0
has uom: kg.a-1
has table: WISE-SoE Emissions.Emissions

WISE-SoE_Emissions.Emissions - CAS_69377-81-7 - kg/a
type: Concept
notation: WISE-SoE_Emissions.Emissions - CAS_69377-81-7 - kg/a
definition: The unit of measure for 'CAS_69377-81-7' (Fluroxypyr) in WISE SoE - Emissions: Emissions table is 'kg/a'
status: valid
status modified: 2019-10-03
accepted date: 2019-10-03
in scheme: Definition of correct units for the observed determinands in the given WISE SoE DD tables
has determinand: CAS 69377-81-7
has uom: kg.a-1
has table: WISE-SoE Emissions.Emissions

WISE-SoE_Emissions.Emissions - CAS_69782-90-7 - kg/a
type: Concept
notation: WISE-SoE_Emissions.Emissions - CAS_69782-90-7 - kg/a
definition: The unit of measure for 'CAS_69782-90-7' (PCB 157 (2,3,3’,4,4’,5’-hexachlorobiphenyl)) in WISE SoE - Emissions: Emissions table is 'kg/a'
status: valid
status modified: 2019-10-03
accepted date: 2019-10-03
in scheme: Definition of correct units for the observed determinands in the given WISE SoE DD tables
has determinand: CAS 69782-90-7
has uom: kg.a-1
has table: WISE-SoE Emissions.Emissions

WISE-SoE_Emissions.Emissions - CAS_7012-37-5 - kg/a
type: Concept
notation: WISE-SoE_Emissions.Emissions - CAS_7012-37-5 - kg/a
definition: The unit of measure for 'CAS_7012-37-5' (PCB 28 (2,4,4’-trichlorobiphenyl)) in WISE SoE - Emissions: Emissions table is 'kg/a'
status: valid
status modified: 2019-10-03
accepted date: 2019-10-03
in scheme: Definition of correct units for the observed determinands in the given WISE SoE DD tables
has determinand: CAS 7012-37-5
has uom: kg.a-1
has table: WISE-SoE Emissions.Emissions

WISE-SoE_Emissions.Emissions - CAS_70124-77-5 - kg/a
type: Concept
notation: WISE-SoE_Emissions.Emissions - CAS_70124-77-5 - kg/a
definition: The unit of measure for 'CAS_70124-77-5' (Flucythrinate) in WISE SoE - Emissions: Emissions table is 'kg/a'
status: valid
status modified: 2019-10-03
accepted date: 2019-10-03
in scheme: Definition of correct units for the observed determinands in the given WISE SoE DD tables
has determinand: CAS 70124-77-5
has uom: kg.a-1
has table: WISE-SoE Emissions.Emissions

WISE-SoE_Emissions.Emissions - CAS_70362-41-3 - kg/a
type: Concept
notation: WISE-SoE_Emissions.Emissions - CAS_70362-41-3 - kg/a
definition: The unit of measure for 'CAS_70362-41-3' (PCB 106 (2,3,3',4,5'-pentachlorobiphenyl)) in WISE SoE - Emissions: Emissions table is 'kg/a'
status: valid
status modified: 2019-10-03
accepted date: 2019-10-03
in scheme: Definition of correct units for the observed determinands in the given WISE SoE DD tables
has determinand: CAS 70362-41-3
has uom: kg.a-1
has table: WISE-SoE Emissions.Emissions

WISE-SoE_Emissions.Emissions - CAS_70362-50-4 - kg/a
type: Concept
notation: WISE-SoE_Emissions.Emissions - CAS_70362-50-4 - kg/a
definition: The unit of measure for 'CAS_70362-50-4' (PCB 81 (3,4,4',5-tetrachlorobiphenyl)) in WISE SoE - Emissions: Emissions table is 'kg/a'
status: valid
status modified: 2019-10-03
accepted date: 2019-10-03
in scheme: Definition of correct units for the observed determinands in the given WISE SoE DD tables
has determinand: CAS 70362-50-4
has uom: kg.a-1
has table: WISE-SoE Emissions.Emissions

WISE-SoE_Emissions.Emissions - CAS_70630-17-0 - kg/a
type: Concept
notation: WISE-SoE_Emissions.Emissions - CAS_70630-17-0 - kg/a
definition: The unit of measure for 'CAS_70630-17-0' (Metalaxyl-M) in WISE SoE - Emissions: Emissions table is 'kg/a'
status: valid
status modified: 2019-10-03
accepted date: 2019-10-03
in scheme: Definition of correct units for the observed determinands in the given WISE SoE DD tables
has determinand: CAS 70630-17-0
has uom: kg.a-1
has table: WISE-SoE Emissions.Emissions

WISE-SoE_Emissions.Emissions - CAS_70648-26-9 - kg/a
type: Concept
notation: WISE-SoE_Emissions.Emissions - CAS_70648-26-9 - kg/a
definition: The unit of measure for 'CAS_70648-26-9' (1,2,3,4,7,8-H6CDF) in WISE SoE - Emissions: Emissions table is 'kg/a'
status: valid
status modified: 2019-10-03
accepted date: 2019-10-03
in scheme: Definition of correct units for the observed determinands in the given WISE SoE DD tables
has determinand: CAS 70648-26-9
has uom: kg.a-1
has table: WISE-SoE Emissions.Emissions

WISE-SoE_Emissions.Emissions - CAS_70776-03-3 - kg/a
type: Concept
notation: WISE-SoE_Emissions.Emissions - CAS_70776-03-3 - kg/a
definition: The unit of measure for 'CAS_70776-03-3' (Naphthalene, chloro derivatives) in WISE SoE - Emissions: Emissions table is 'kg/a'
status: valid
status modified: 2019-10-03
accepted date: 2019-10-03
in scheme: Definition of correct units for the observed determinands in the given WISE SoE DD tables
has determinand: CAS 70776-03-3
has uom: kg.a-1
has table: WISE-SoE Emissions.Emissions

WISE-SoE_Emissions.Emissions - CAS_7085-19-0 - kg/a
type: Concept
notation: WISE-SoE_Emissions.Emissions - CAS_7085-19-0 - kg/a
definition: The unit of measure for 'CAS_7085-19-0' (Mecoprop) in WISE SoE - Emissions: Emissions table is 'kg/a'
status: valid
status modified: 2019-10-03
accepted date: 2019-10-03
in scheme: Definition of correct units for the observed determinands in the given WISE SoE DD tables
has determinand: CAS 7085-19-0
has uom: kg.a-1
has table: WISE-SoE Emissions.Emissions

WISE-SoE_Emissions.Emissions - CAS_709-98-8 - kg/a
type: Concept
notation: WISE-SoE_Emissions.Emissions - CAS_709-98-8 - kg/a
definition: The unit of measure for 'CAS_709-98-8' (Propanil) in WISE SoE - Emissions: Emissions table is 'kg/a'
status: valid
status modified: 2019-10-03
accepted date: 2019-10-03
in scheme: Definition of correct units for the observed determinands in the given WISE SoE DD tables
has determinand: CAS 709-98-8
has uom: kg.a-1
has table: WISE-SoE Emissions.Emissions

WISE-SoE_Emissions.Emissions - CAS_71-43-2 - kg/a
type: Concept
notation: WISE-SoE_Emissions.Emissions - CAS_71-43-2 - kg/a
definition: The unit of measure for 'CAS_71-43-2' (Benzene) in WISE SoE - Emissions: Emissions table is 'kg/a'
status: valid
status modified: 2019-10-03
accepted date: 2019-10-03
in scheme: Definition of correct units for the observed determinands in the given WISE SoE DD tables
has determinand: CAS 71-43-2
has uom: kg.a-1
has table: WISE-SoE Emissions.Emissions

WISE-SoE_Emissions.Emissions - CAS_71-55-6 - kg/a
type: Concept
notation: WISE-SoE_Emissions.Emissions - CAS_71-55-6 - kg/a
definition: The unit of measure for 'CAS_71-55-6' (1,1,1-trichloroethane) in WISE SoE - Emissions: Emissions table is 'kg/a'
status: valid
status modified: 2019-10-03
accepted date: 2019-10-03
in scheme: Definition of correct units for the observed determinands in the given WISE SoE DD tables
has determinand: CAS 71-55-6
has uom: kg.a-1
has table: WISE-SoE Emissions.Emissions

WISE-SoE_Emissions.Emissions - CAS_71626-11-4 - kg/a
type: Concept
notation: WISE-SoE_Emissions.Emissions - CAS_71626-11-4 - kg/a
definition: The unit of measure for 'CAS_71626-11-4' (Benalaxyl) in WISE SoE - Emissions: Emissions table is 'kg/a'
status: valid
status modified: 2019-10-03
accepted date: 2019-10-03
in scheme: Definition of correct units for the observed determinands in the given WISE SoE DD tables
has determinand: CAS 71626-11-4
has uom: kg.a-1
has table: WISE-SoE Emissions.Emissions

WISE-SoE_Emissions.Emissions - CAS_72-20-8 - kg/a
type: Concept
notation: WISE-SoE_Emissions.Emissions - CAS_72-20-8 - kg/a
definition: The unit of measure for 'CAS_72-20-8' (Endrin) in WISE SoE - Emissions: Emissions table is 'kg/a'
status: valid
status modified: 2019-10-03
accepted date: 2019-10-03
in scheme: Definition of correct units for the observed determinands in the given WISE SoE DD tables
has determinand: CAS 72-20-8
has uom: kg.a-1
has table: WISE-SoE Emissions.Emissions

WISE-SoE_Emissions.Emissions - CAS_72-43-5 - kg/a
type: Concept
notation: WISE-SoE_Emissions.Emissions - CAS_72-43-5 - kg/a
definition: The unit of measure for 'CAS_72-43-5' (Methoxychlor) in WISE SoE - Emissions: Emissions table is 'kg/a'
status: valid
status modified: 2019-10-03
accepted date: 2019-10-03
in scheme: Definition of correct units for the observed determinands in the given WISE SoE DD tables
has determinand: CAS 72-43-5
has uom: kg.a-1
has table: WISE-SoE Emissions.Emissions

WISE-SoE_Emissions.Emissions - CAS_72-54-8 - kg/a
type: Concept
notation: WISE-SoE_Emissions.Emissions - CAS_72-54-8 - kg/a
definition: The unit of measure for 'CAS_72-54-8' (p,p'-DDD) in WISE SoE - Emissions: Emissions table is 'kg/a'
status: valid
status modified: 2019-10-03
accepted date: 2019-10-03
in scheme: Definition of correct units for the observed determinands in the given WISE SoE DD tables
has determinand: CAS 72-54-8
has uom: kg.a-1
has table: WISE-SoE Emissions.Emissions

WISE-SoE_Emissions.Emissions - CAS_72-55-9 - kg/a
type: Concept
notation: WISE-SoE_Emissions.Emissions - CAS_72-55-9 - kg/a
definition: The unit of measure for 'CAS_72-55-9' (p,p'-DDE) in WISE SoE - Emissions: Emissions table is 'kg/a'
status: valid
status modified: 2019-10-03
accepted date: 2019-10-03
in scheme: Definition of correct units for the observed determinands in the given WISE SoE DD tables
has determinand: CAS 72-55-9
has uom: kg.a-1
has table: WISE-SoE Emissions.Emissions

WISE-SoE_Emissions.Emissions - CAS_72178-02-0 - kg/a
type: Concept
notation: WISE-SoE_Emissions.Emissions - CAS_72178-02-0 - kg/a
definition: The unit of measure for 'CAS_72178-02-0' (Fomesafen) in WISE SoE - Emissions: Emissions table is 'kg/a'
status: valid
status modified: 2019-10-03
accepted date: 2019-10-03
in scheme: Definition of correct units for the observed determinands in the given WISE SoE DD tables
has determinand: CAS 72178-02-0
has uom: kg.a-1
has table: WISE-SoE Emissions.Emissions

WISE-SoE_Emissions.Emissions - CAS_723-46-6 - kg/a
type: Concept
notation: WISE-SoE_Emissions.Emissions - CAS_723-46-6 - kg/a
definition: The unit of measure for 'CAS_723-46-6' (Sulfamethoxazol) in WISE SoE - Emissions: Emissions table is 'kg/a'
status: valid
status modified: 2019-10-03
accepted date: 2019-10-03
in scheme: Definition of correct units for the observed determinands in the given WISE SoE DD tables
has determinand: CAS 723-46-6
has uom: kg.a-1
has table: WISE-SoE Emissions.Emissions

WISE-SoE_Emissions.Emissions - CAS_7286-69-3 - kg/a
type: Concept
notation: WISE-SoE_Emissions.Emissions - CAS_7286-69-3 - kg/a
definition: The unit of measure for 'CAS_7286-69-3' (Sebuthylazine) in WISE SoE - Emissions: Emissions table is 'kg/a'
status: valid
status modified: 2019-10-03
accepted date: 2019-10-03
in scheme: Definition of correct units for the observed determinands in the given WISE SoE DD tables
has determinand: CAS 7286-69-3
has uom: kg.a-1
has table: WISE-SoE Emissions.Emissions

WISE-SoE_Emissions.Emissions - CAS_7287-19-6 - kg/a
type: Concept
notation: WISE-SoE_Emissions.Emissions - CAS_7287-19-6 - kg/a
definition: The unit of measure for 'CAS_7287-19-6' (Prometryn) in WISE SoE - Emissions: Emissions table is 'kg/a'
status: valid
status modified: 2019-10-03
accepted date: 2019-10-03
in scheme: Definition of correct units for the observed determinands in the given WISE SoE DD tables
has determinand: CAS 7287-19-6
has uom: kg.a-1
has table: WISE-SoE Emissions.Emissions

WISE-SoE_Emissions.Emissions - CAS_72918-21-9 - kg/a
type: Concept
notation: WISE-SoE_Emissions.Emissions - CAS_72918-21-9 - kg/a
definition: The unit of measure for 'CAS_72918-21-9' (1,2,3,7,8,9-H6CDF) in WISE SoE - Emissions: Emissions table is 'kg/a'
status: valid
status modified: 2019-10-03
accepted date: 2019-10-03
in scheme: Definition of correct units for the observed determinands in the given WISE SoE DD tables
has determinand: CAS 72918-21-9
has uom: kg.a-1
has table: WISE-SoE Emissions.Emissions

WISE-SoE_Emissions.Emissions - CAS_731-27-1 - kg/a
type: Concept
notation: WISE-SoE_Emissions.Emissions - CAS_731-27-1 - kg/a
definition: The unit of measure for 'CAS_731-27-1' (Tolylfluanid) in WISE SoE - Emissions: Emissions table is 'kg/a'
status: valid
status modified: 2019-10-03
accepted date: 2019-10-03
in scheme: Definition of correct units for the observed determinands in the given WISE SoE DD tables
has determinand: CAS 731-27-1
has uom: kg.a-1
has table: WISE-SoE Emissions.Emissions

WISE-SoE_Emissions.Emissions - CAS_732-11-6 - kg/a
type: Concept
notation: WISE-SoE_Emissions.Emissions - CAS_732-11-6 - kg/a
definition: The unit of measure for 'CAS_732-11-6' (Fosmet) in WISE SoE - Emissions: Emissions table is 'kg/a'
status: valid
status modified: 2019-10-03
accepted date: 2019-10-03
in scheme: Definition of correct units for the observed determinands in the given WISE SoE DD tables
has determinand: CAS 732-11-6
has uom: kg.a-1
has table: WISE-SoE Emissions.Emissions

WISE-SoE_Emissions.Emissions - CAS_732-26-3 - kg/a
type: Concept
notation: WISE-SoE_Emissions.Emissions - CAS_732-26-3 - kg/a
definition: The unit of measure for 'CAS_732-26-3' (2,4,6-tri-tert-butylphenol) in WISE SoE - Emissions: Emissions table is 'kg/a'
status: valid
status modified: 2019-10-03
accepted date: 2019-10-03
in scheme: Definition of correct units for the observed determinands in the given WISE SoE DD tables
has determinand: CAS 732-26-3
has uom: kg.a-1
has table: WISE-SoE Emissions.Emissions

WISE-SoE_Emissions.Emissions - CAS_738-70-5 - kg/a
type: Concept
notation: WISE-SoE_Emissions.Emissions - CAS_738-70-5 - kg/a
definition: The unit of measure for 'CAS_738-70-5' (Trimethoprim) in WISE SoE - Emissions: Emissions table is 'kg/a'
status: valid
status modified: 2019-10-03
accepted date: 2019-10-03
in scheme: Definition of correct units for the observed determinands in the given WISE SoE DD tables
has determinand: CAS 738-70-5
has uom: kg.a-1
has table: WISE-SoE Emissions.Emissions

WISE-SoE_Emissions.Emissions - CAS_74-83-9 - kg/a
type: Concept
notation: WISE-SoE_Emissions.Emissions - CAS_74-83-9 - kg/a
definition: The unit of measure for 'CAS_74-83-9' (Bromomethane) in WISE SoE - Emissions: Emissions table is 'kg/a'
status: valid
status modified: 2019-10-03
accepted date: 2019-10-03
in scheme: Definition of correct units for the observed determinands in the given WISE SoE DD tables
has determinand: CAS 74-83-9
has uom: kg.a-1
has table: WISE-SoE Emissions.Emissions

WISE-SoE_Emissions.Emissions - CAS_74-87-3 - kg/a
type: Concept
notation: WISE-SoE_Emissions.Emissions - CAS_74-87-3 - kg/a
definition: The unit of measure for 'CAS_74-87-3' (Methyl chloride) in WISE SoE - Emissions: Emissions table is 'kg/a'
status: valid
status modified: 2019-10-03
accepted date: 2019-10-03
in scheme: Definition of correct units for the observed determinands in the given WISE SoE DD tables
has determinand: CAS 74-87-3
has uom: kg.a-1
has table: WISE-SoE Emissions.Emissions

WISE-SoE_Emissions.Emissions - CAS_74-90-8 - kg/a
type: Concept
notation: WISE-SoE_Emissions.Emissions - CAS_74-90-8 - kg/a
definition: The unit of measure for 'CAS_74-90-8' (Hydrogen cyanide) in WISE SoE - Emissions: Emissions table is 'kg/a'
status: valid
status modified: 2019-10-03
accepted date: 2019-10-03
in scheme: Definition of correct units for the observed determinands in the given WISE SoE DD tables
has determinand: CAS 74-90-8
has uom: kg.a-1
has table: WISE-SoE Emissions.Emissions

WISE-SoE_Emissions.Emissions - CAS_74-95-3 - kg/a
type: Concept
notation: WISE-SoE_Emissions.Emissions - CAS_74-95-3 - kg/a
definition: The unit of measure for 'CAS_74-95-3' (Dibromomethane) in WISE SoE - Emissions: Emissions table is 'kg/a'
status: valid
status modified: 2019-10-03
accepted date: 2019-10-03
in scheme: Definition of correct units for the observed determinands in the given WISE SoE DD tables
has determinand: CAS 74-95-3
has uom: kg.a-1
has table: WISE-SoE Emissions.Emissions

WISE-SoE_Emissions.Emissions - CAS_74-97-5 - kg/a
type: Concept
notation: WISE-SoE_Emissions.Emissions - CAS_74-97-5 - kg/a
definition: The unit of measure for 'CAS_74-97-5' (Bromochloromethane) in WISE SoE - Emissions: Emissions table is 'kg/a'
status: valid
status modified: 2019-10-03
accepted date: 2019-10-03
in scheme: Definition of correct units for the observed determinands in the given WISE SoE DD tables
has determinand: CAS 74-97-5
has uom: kg.a-1
has table: WISE-SoE Emissions.Emissions

WISE-SoE_Emissions.Emissions - CAS_74070-46-5 - kg/a
type: Concept
notation: WISE-SoE_Emissions.Emissions - CAS_74070-46-5 - kg/a
definition: The unit of measure for 'CAS_74070-46-5' (Aclonifen) in WISE SoE - Emissions: Emissions table is 'kg/a'
status: valid
status modified: 2019-10-03
accepted date: 2019-10-03
in scheme: Definition of correct units for the observed determinands in the given WISE SoE DD tables
has determinand: CAS 74070-46-5
has uom: kg.a-1
has table: WISE-SoE Emissions.Emissions

WISE-SoE_Emissions.Emissions - CAS_74223-64-6 - kg/a
type: Concept
notation: WISE-SoE_Emissions.Emissions - CAS_74223-64-6 - kg/a
definition: The unit of measure for 'CAS_74223-64-6' (Metsulfuronmethyl) in WISE SoE - Emissions: Emissions table is 'kg/a'
status: valid
status modified: 2019-10-03
accepted date: 2019-10-03
in scheme: Definition of correct units for the observed determinands in the given WISE SoE DD tables
has determinand: CAS 74223-64-6
has uom: kg.a-1
has table: WISE-SoE Emissions.Emissions

WISE-SoE_Emissions.Emissions - CAS_7429-90-5 - kg/a
type: Concept
notation: WISE-SoE_Emissions.Emissions - CAS_7429-90-5 - kg/a
definition: The unit of measure for 'CAS_7429-90-5' (Aluminium and its compounds) in WISE SoE - Emissions: Emissions table is 'kg/a'
status: valid
status modified: 2019-10-03
accepted date: 2019-10-03
in scheme: Definition of correct units for the observed determinands in the given WISE SoE DD tables
has determinand: CAS 7429-90-5
has uom: kg.a-1
has table: WISE-SoE Emissions.Emissions

WISE-SoE_Emissions.Emissions - CAS_7439-89-6 - kg/a
type: Concept
notation: WISE-SoE_Emissions.Emissions - CAS_7439-89-6 - kg/a
definition: The unit of measure for 'CAS_7439-89-6' (Iron and its compounds) in WISE SoE - Emissions: Emissions table is 'kg/a'
status: valid
status modified: 2019-10-03
accepted date: 2019-10-03
in scheme: Definition of correct units for the observed determinands in the given WISE SoE DD tables
has determinand: CAS 7439-89-6
has uom: kg.a-1
has table: WISE-SoE Emissions.Emissions

WISE-SoE_Emissions.Emissions - CAS_7439-92-1 - kg/a
type: Concept
notation: WISE-SoE_Emissions.Emissions - CAS_7439-92-1 - kg/a
definition: The unit of measure for 'CAS_7439-92-1' (Lead and its compounds) in WISE SoE - Emissions: Emissions table is 'kg/a'
status: valid
status modified: 2019-10-03
accepted date: 2019-10-03
in scheme: Definition of correct units for the observed determinands in the given WISE SoE DD tables
has determinand: CAS 7439-92-1
has uom: kg.a-1
has table: WISE-SoE Emissions.Emissions

WISE-SoE_Emissions.Emissions - CAS_7439-93-2 - kg/a
type: Concept
notation: WISE-SoE_Emissions.Emissions - CAS_7439-93-2 - kg/a
definition: The unit of measure for 'CAS_7439-93-2' (Lithium) in WISE SoE - Emissions: Emissions table is 'kg/a'
status: valid
status modified: 2019-10-03
accepted date: 2019-10-03
in scheme: Definition of correct units for the observed determinands in the given WISE SoE DD tables
has determinand: CAS 7439-93-2
has uom: kg.a-1
has table: WISE-SoE Emissions.Emissions

WISE-SoE_Emissions.Emissions - CAS_7439-95-4 - kg/a
type: Concept
notation: WISE-SoE_Emissions.Emissions - CAS_7439-95-4 - kg/a
definition: The unit of measure for 'CAS_7439-95-4' (Magnesium) in WISE SoE - Emissions: Emissions table is 'kg/a'
status: valid
status modified: 2019-10-03
accepted date: 2019-10-03
in scheme: Definition of correct units for the observed determinands in the given WISE SoE DD tables
has determinand: CAS 7439-95-4
has uom: kg.a-1
has table: WISE-SoE Emissions.Emissions

WISE-SoE_Emissions.Emissions - CAS_7439-96-5 - kg/a
type: Concept
notation: WISE-SoE_Emissions.Emissions - CAS_7439-96-5 - kg/a
definition: The unit of measure for 'CAS_7439-96-5' (Manganese and its compounds) in WISE SoE - Emissions: Emissions table is 'kg/a'
status: valid
status modified: 2019-10-03
accepted date: 2019-10-03
in scheme: Definition of correct units for the observed determinands in the given WISE SoE DD tables
has determinand: CAS 7439-96-5
has uom: kg.a-1
has table: WISE-SoE Emissions.Emissions

WISE-SoE_Emissions.Emissions - CAS_7439-97-6 - kg/a
type: Concept
notation: WISE-SoE_Emissions.Emissions - CAS_7439-97-6 - kg/a
definition: The unit of measure for 'CAS_7439-97-6' (Mercury and its compounds) in WISE SoE - Emissions: Emissions table is 'kg/a'
status: valid
status modified: 2019-10-03
accepted date: 2019-10-03
in scheme: Definition of correct units for the observed determinands in the given WISE SoE DD tables
has determinand: CAS 7439-97-6
has uom: kg.a-1
has table: WISE-SoE Emissions.Emissions

WISE-SoE_Emissions.Emissions - CAS_7439-98-7 - kg/a
type: Concept
notation: WISE-SoE_Emissions.Emissions - CAS_7439-98-7 - kg/a
definition: The unit of measure for 'CAS_7439-98-7' (Molybdenum and its compounds) in WISE SoE - Emissions: Emissions table is 'kg/a'
status: valid
status modified: 2019-10-03
accepted date: 2019-10-03
in scheme: Definition of correct units for the observed determinands in the given WISE SoE DD tables
has determinand: CAS 7439-98-7
has uom: kg.a-1
has table: WISE-SoE Emissions.Emissions

WISE-SoE_Emissions.Emissions - CAS_7440-02-0 - kg/a
type: Concept
notation: WISE-SoE_Emissions.Emissions - CAS_7440-02-0 - kg/a
definition: The unit of measure for 'CAS_7440-02-0' (Nickel and its compounds) in WISE SoE - Emissions: Emissions table is 'kg/a'
status: valid
status modified: 2019-10-03
accepted date: 2019-10-03
in scheme: Definition of correct units for the observed determinands in the given WISE SoE DD tables
has determinand: CAS 7440-02-0
has uom: kg.a-1
has table: WISE-SoE Emissions.Emissions

WISE-SoE_Emissions.Emissions - CAS_7440-09-7 - kg/a
type: Concept
notation: WISE-SoE_Emissions.Emissions - CAS_7440-09-7 - kg/a
definition: The unit of measure for 'CAS_7440-09-7' (Potassium) in WISE SoE - Emissions: Emissions table is 'kg/a'
status: valid
status modified: 2019-10-03
accepted date: 2019-10-03
in scheme: Definition of correct units for the observed determinands in the given WISE SoE DD tables
has determinand: CAS 7440-09-7
has uom: kg.a-1
has table: WISE-SoE Emissions.Emissions

WISE-SoE_Emissions.Emissions - CAS_7440-22-4 - kg/a
type: Concept
notation: WISE-SoE_Emissions.Emissions - CAS_7440-22-4 - kg/a
definition: The unit of measure for 'CAS_7440-22-4' (Silver) in WISE SoE - Emissions: Emissions table is 'kg/a'
status: valid
status modified: 2019-10-03
accepted date: 2019-10-03
in scheme: Definition of correct units for the observed determinands in the given WISE SoE DD tables
has determinand: CAS 7440-22-4
has uom: kg.a-1
has table: WISE-SoE Emissions.Emissions

WISE-SoE_Emissions.Emissions - CAS_7440-23-5 - kg/a
type: Concept
notation: WISE-SoE_Emissions.Emissions - CAS_7440-23-5 - kg/a
definition: The unit of measure for 'CAS_7440-23-5' (Sodium) in WISE SoE - Emissions: Emissions table is 'kg/a'
status: valid
status modified: 2019-10-03
accepted date: 2019-10-03
in scheme: Definition of correct units for the observed determinands in the given WISE SoE DD tables
has determinand: CAS 7440-23-5
has uom: kg.a-1
has table: WISE-SoE Emissions.Emissions

WISE-SoE_Emissions.Emissions - CAS_7440-24-6 - kg/a
type: Concept
notation: WISE-SoE_Emissions.Emissions - CAS_7440-24-6 - kg/a
definition: The unit of measure for 'CAS_7440-24-6' (Strontium) in WISE SoE - Emissions: Emissions table is 'kg/a'
status: valid
status modified: 2019-10-03
accepted date: 2019-10-03
in scheme: Definition of correct units for the observed determinands in the given WISE SoE DD tables
has determinand: CAS 7440-24-6
has uom: kg.a-1
has table: WISE-SoE Emissions.Emissions

WISE-SoE_Emissions.Emissions - CAS_7440-28-0 - kg/a
type: Concept
notation: WISE-SoE_Emissions.Emissions - CAS_7440-28-0 - kg/a
definition: The unit of measure for 'CAS_7440-28-0' (Thallium) in WISE SoE - Emissions: Emissions table is 'kg/a'
status: valid
status modified: 2019-10-03
accepted date: 2019-10-03
in scheme: Definition of correct units for the observed determinands in the given WISE SoE DD tables
has determinand: CAS 7440-28-0
has uom: kg.a-1
has table: WISE-SoE Emissions.Emissions

WISE-SoE_Emissions.Emissions - CAS_7440-31-5 - kg/a
type: Concept
notation: WISE-SoE_Emissions.Emissions - CAS_7440-31-5 - kg/a
definition: The unit of measure for 'CAS_7440-31-5' (Tin and its compounds) in WISE SoE - Emissions: Emissions table is 'kg/a'
status: valid
status modified: 2019-10-03
accepted date: 2019-10-03
in scheme: Definition of correct units for the observed determinands in the given WISE SoE DD tables
has determinand: CAS 7440-31-5
has uom: kg.a-1
has table: WISE-SoE Emissions.Emissions

WISE-SoE_Emissions.Emissions - CAS_7440-32-6 - kg/a
type: Concept
notation: WISE-SoE_Emissions.Emissions - CAS_7440-32-6 - kg/a
definition: The unit of measure for 'CAS_7440-32-6' (Titanium) in WISE SoE - Emissions: Emissions table is 'kg/a'
status: valid
status modified: 2019-10-03
accepted date: 2019-10-03
in scheme: Definition of correct units for the observed determinands in the given WISE SoE DD tables
has determinand: CAS 7440-32-6
has uom: kg.a-1
has table: WISE-SoE Emissions.Emissions

WISE-SoE_Emissions.Emissions - CAS_7440-33-7 - kg/a
type: Concept
notation: WISE-SoE_Emissions.Emissions - CAS_7440-33-7 - kg/a
definition: The unit of measure for 'CAS_7440-33-7' (Tungsten and its compounds) in WISE SoE - Emissions: Emissions table is 'kg/a'
status: valid
status modified: 2019-10-03
accepted date: 2019-10-03
in scheme: Definition of correct units for the observed determinands in the given WISE SoE DD tables
has determinand: CAS 7440-33-7
has uom: kg.a-1
has table: WISE-SoE Emissions.Emissions

WISE-SoE_Emissions.Emissions - CAS_7440-36-0 - kg/a
type: Concept
notation: WISE-SoE_Emissions.Emissions - CAS_7440-36-0 - kg/a
definition: The unit of measure for 'CAS_7440-36-0' (Antimony) in WISE SoE - Emissions: Emissions table is 'kg/a'
status: valid
status modified: 2019-10-03
accepted date: 2019-10-03
in scheme: Definition of correct units for the observed determinands in the given WISE SoE DD tables
has determinand: CAS 7440-36-0
has uom: kg.a-1
has table: WISE-SoE Emissions.Emissions

WISE-SoE_Emissions.Emissions - CAS_7440-38-2 - kg/a
type: Concept
notation: WISE-SoE_Emissions.Emissions - CAS_7440-38-2 - kg/a
definition: The unit of measure for 'CAS_7440-38-2' (Arsenic and its compounds) in WISE SoE - Emissions: Emissions table is 'kg/a'
status: valid
status modified: 2019-10-03
accepted date: 2019-10-03
in scheme: Definition of correct units for the observed determinands in the given WISE SoE DD tables
has determinand: CAS 7440-38-2
has uom: kg.a-1
has table: WISE-SoE Emissions.Emissions

WISE-SoE_Emissions.Emissions - CAS_7440-39-3 - kg/a
type: Concept
notation: WISE-SoE_Emissions.Emissions - CAS_7440-39-3 - kg/a
definition: The unit of measure for 'CAS_7440-39-3' (Barium) in WISE SoE - Emissions: Emissions table is 'kg/a'
status: valid
status modified: 2019-10-03
accepted date: 2019-10-03
in scheme: Definition of correct units for the observed determinands in the given WISE SoE DD tables
has determinand: CAS 7440-39-3
has uom: kg.a-1
has table: WISE-SoE Emissions.Emissions

WISE-SoE_Emissions.Emissions - CAS_7440-41-7 - kg/a
type: Concept
notation: WISE-SoE_Emissions.Emissions - CAS_7440-41-7 - kg/a
definition: The unit of measure for 'CAS_7440-41-7' (Beryllium) in WISE SoE - Emissions: Emissions table is 'kg/a'
status: valid
status modified: 2019-10-03
accepted date: 2019-10-03
in scheme: Definition of correct units for the observed determinands in the given WISE SoE DD tables
has determinand: CAS 7440-41-7
has uom: kg.a-1
has table: WISE-SoE Emissions.Emissions

WISE-SoE_Emissions.Emissions - CAS_7440-42-8 - kg/a
type: Concept
notation: WISE-SoE_Emissions.Emissions - CAS_7440-42-8 - kg/a
definition: The unit of measure for 'CAS_7440-42-8' (Boron) in WISE SoE - Emissions: Emissions table is 'kg/a'
status: valid
status modified: 2019-10-03
accepted date: 2019-10-03
in scheme: Definition of correct units for the observed determinands in the given WISE SoE DD tables
has determinand: CAS 7440-42-8
has uom: kg.a-1
has table: WISE-SoE Emissions.Emissions

WISE-SoE_Emissions.Emissions - CAS_7440-43-9 - kg/a
type: Concept
notation: WISE-SoE_Emissions.Emissions - CAS_7440-43-9 - kg/a
definition: The unit of measure for 'CAS_7440-43-9' (Cadmium and its compounds) in WISE SoE - Emissions: Emissions table is 'kg/a'
status: valid
status modified: 2019-10-03
accepted date: 2019-10-03
in scheme: Definition of correct units for the observed determinands in the given WISE SoE DD tables
has determinand: CAS 7440-43-9
has uom: kg.a-1
has table: WISE-SoE Emissions.Emissions

WISE-SoE_Emissions.Emissions - CAS_7440-47-3 - kg/a
type: Concept
notation: WISE-SoE_Emissions.Emissions - CAS_7440-47-3 - kg/a
definition: The unit of measure for 'CAS_7440-47-3' (Chromium and its compounds) in WISE SoE - Emissions: Emissions table is 'kg/a'
status: valid
status modified: 2019-10-03
accepted date: 2019-10-03
in scheme: Definition of correct units for the observed determinands in the given WISE SoE DD tables
has determinand: CAS 7440-47-3
has uom: kg.a-1
has table: WISE-SoE Emissions.Emissions

WISE-SoE_Emissions.Emissions - CAS_7440-48-4 - kg/a
type: Concept
notation: WISE-SoE_Emissions.Emissions - CAS_7440-48-4 - kg/a
definition: The unit of measure for 'CAS_7440-48-4' (Cobalt and its compounds) in WISE SoE - Emissions: Emissions table is 'kg/a'
status: valid
status modified: 2019-10-03
accepted date: 2019-10-03
in scheme: Definition of correct units for the observed determinands in the given WISE SoE DD tables
has determinand: CAS 7440-48-4
has uom: kg.a-1
has table: WISE-SoE Emissions.Emissions

WISE-SoE_Emissions.Emissions - CAS_7440-50-8 - kg/a
type: Concept
notation: WISE-SoE_Emissions.Emissions - CAS_7440-50-8 - kg/a
definition: The unit of measure for 'CAS_7440-50-8' (Copper and its compounds) in WISE SoE - Emissions: Emissions table is 'kg/a'
status: valid
status modified: 2019-10-03
accepted date: 2019-10-03
in scheme: Definition of correct units for the observed determinands in the given WISE SoE DD tables
has determinand: CAS 7440-50-8
has uom: kg.a-1
has table: WISE-SoE Emissions.Emissions

WISE-SoE_Emissions.Emissions - CAS_7440-61-1 - kg/a
type: Concept
notation: WISE-SoE_Emissions.Emissions - CAS_7440-61-1 - kg/a
definition: The unit of measure for 'CAS_7440-61-1' (Uranium) in WISE SoE - Emissions: Emissions table is 'kg/a'
status: valid
status modified: 2019-10-03
accepted date: 2019-10-03
in scheme: Definition of correct units for the observed determinands in the given WISE SoE DD tables
has determinand: CAS 7440-61-1
has uom: kg.a-1
has table: WISE-SoE Emissions.Emissions

WISE-SoE_Emissions.Emissions - CAS_7440-62-2 - kg/a
type: Concept
notation: WISE-SoE_Emissions.Emissions - CAS_7440-62-2 - kg/a
definition: The unit of measure for 'CAS_7440-62-2' (Vanadium and its compounds) in WISE SoE - Emissions: Emissions table is 'kg/a'
status: valid
status modified: 2019-10-03
accepted date: 2019-10-03
in scheme: Definition of correct units for the observed determinands in the given WISE SoE DD tables
has determinand: CAS 7440-62-2
has uom: kg.a-1
has table: WISE-SoE Emissions.Emissions

WISE-SoE_Emissions.Emissions - CAS_7440-66-6 - kg/a
type: Concept
notation: WISE-SoE_Emissions.Emissions - CAS_7440-66-6 - kg/a
definition: The unit of measure for 'CAS_7440-66-6' (Zinc and its compounds) in WISE SoE - Emissions: Emissions table is 'kg/a'
status: valid
status modified: 2019-10-03
accepted date: 2019-10-03
in scheme: Definition of correct units for the observed determinands in the given WISE SoE DD tables
has determinand: CAS 7440-66-6
has uom: kg.a-1
has table: WISE-SoE Emissions.Emissions

WISE-SoE_Emissions.Emissions - CAS_7440-70-2 - kg/a
type: Concept
notation: WISE-SoE_Emissions.Emissions - CAS_7440-70-2 - kg/a
definition: The unit of measure for 'CAS_7440-70-2' (Calcium) in WISE SoE - Emissions: Emissions table is 'kg/a'
status: valid
status modified: 2019-10-03
accepted date: 2019-10-03
in scheme: Definition of correct units for the observed determinands in the given WISE SoE DD tables
has determinand: CAS 7440-70-2
has uom: kg.a-1
has table: WISE-SoE Emissions.Emissions

WISE-SoE_Emissions.Emissions - CAS_74472-37-0 - kg/a
type: Concept
notation: WISE-SoE_Emissions.Emissions - CAS_74472-37-0 - kg/a
definition: The unit of measure for 'CAS_74472-37-0' (PCB 114 (2,3,4,4',5-pentachlorobiphenyl)) in WISE SoE - Emissions: Emissions table is 'kg/a'
status: valid
status modified: 2019-10-03
accepted date: 2019-10-03
in scheme: Definition of correct units for the observed determinands in the given WISE SoE DD tables
has determinand: CAS 74472-37-0
has uom: kg.a-1
has table: WISE-SoE Emissions.Emissions

WISE-SoE_Emissions.Emissions - CAS_75-01-4 - kg/a
type: Concept
notation: WISE-SoE_Emissions.Emissions - CAS_75-01-4 - kg/a
definition: The unit of measure for 'CAS_75-01-4' (Chloroethene (vinylchloride)) in WISE SoE - Emissions: Emissions table is 'kg/a'
status: valid
status modified: 2019-10-03
accepted date: 2019-10-03
in scheme: Definition of correct units for the observed determinands in the given WISE SoE DD tables
has determinand: CAS 75-01-4
has uom: kg.a-1
has table: WISE-SoE Emissions.Emissions

WISE-SoE_Emissions.Emissions - CAS_75-09-2 - kg/a
type: Concept
notation: WISE-SoE_Emissions.Emissions - CAS_75-09-2 - kg/a
definition: The unit of measure for 'CAS_75-09-2' (Dichloromethane) in WISE SoE - Emissions: Emissions table is 'kg/a'
status: valid
status modified: 2019-10-03
accepted date: 2019-10-03
in scheme: Definition of correct units for the observed determinands in the given WISE SoE DD tables
has determinand: CAS 75-09-2
has uom: kg.a-1
has table: WISE-SoE Emissions.Emissions

WISE-SoE_Emissions.Emissions - CAS_75-21-8 - kg/a
type: Concept
notation: WISE-SoE_Emissions.Emissions - CAS_75-21-8 - kg/a
definition: The unit of measure for 'CAS_75-21-8' (Ethylene oxide) in WISE SoE - Emissions: Emissions table is 'kg/a'
status: valid
status modified: 2019-10-03
accepted date: 2019-10-03
in scheme: Definition of correct units for the observed determinands in the given WISE SoE DD tables
has determinand: CAS 75-21-8
has uom: kg.a-1
has table: WISE-SoE Emissions.Emissions

WISE-SoE_Emissions.Emissions - CAS_75-25-2 - kg/a
type: Concept
notation: WISE-SoE_Emissions.Emissions - CAS_75-25-2 - kg/a
definition: The unit of measure for 'CAS_75-25-2' (Bromoform) in WISE SoE - Emissions: Emissions table is 'kg/a'
status: valid
status modified: 2019-10-03
accepted date: 2019-10-03
in scheme: Definition of correct units for the observed determinands in the given WISE SoE DD tables
has determinand: CAS 75-25-2
has uom: kg.a-1
has table: WISE-SoE Emissions.Emissions

WISE-SoE_Emissions.Emissions - CAS_75-27-4 - kg/a
type: Concept
notation: WISE-SoE_Emissions.Emissions - CAS_75-27-4 - kg/a
definition: The unit of measure for 'CAS_75-27-4' (Bromodichloromethane) in WISE SoE - Emissions: Emissions table is 'kg/a'
status: valid
status modified: 2019-10-03
accepted date: 2019-10-03
in scheme: Definition of correct units for the observed determinands in the given WISE SoE DD tables
has determinand: CAS 75-27-4
has uom: kg.a-1
has table: WISE-SoE Emissions.Emissions

WISE-SoE_Emissions.Emissions - CAS_75-34-3 - kg/a
type: Concept
notation: WISE-SoE_Emissions.Emissions - CAS_75-34-3 - kg/a
definition: The unit of measure for 'CAS_75-34-3' (1,1-dichloroethane) in WISE SoE - Emissions: Emissions table is 'kg/a'
status: valid
status modified: 2019-10-03
accepted date: 2019-10-03
in scheme: Definition of correct units for the observed determinands in the given WISE SoE DD tables
has determinand: CAS 75-34-3
has uom: kg.a-1
has table: WISE-SoE Emissions.Emissions

WISE-SoE_Emissions.Emissions - CAS_75-35-4 - kg/a
type: Concept
notation: WISE-SoE_Emissions.Emissions - CAS_75-35-4 - kg/a
definition: The unit of measure for 'CAS_75-35-4' (1,1-dichloroethene) in WISE SoE - Emissions: Emissions table is 'kg/a'
status: valid
status modified: 2019-10-03
accepted date: 2019-10-03
in scheme: Definition of correct units for the observed determinands in the given WISE SoE DD tables
has determinand: CAS 75-35-4
has uom: kg.a-1
has table: WISE-SoE Emissions.Emissions

WISE-SoE_Emissions.Emissions - CAS_75-69-4 - kg/a
type: Concept
notation: WISE-SoE_Emissions.Emissions - CAS_75-69-4 - kg/a
definition: The unit of measure for 'CAS_75-69-4' (Trichlorofluoromethane) in WISE SoE - Emissions: Emissions table is 'kg/a'
status: valid
status modified: 2019-10-03
accepted date: 2019-10-03
in scheme: Definition of correct units for the observed determinands in the given WISE SoE DD tables
has determinand: CAS 75-69-4
has uom: kg.a-1
has table: WISE-SoE Emissions.Emissions

WISE-SoE_Emissions.Emissions - CAS_75-71-8 - kg/a
type: Concept
notation: WISE-SoE_Emissions.Emissions - CAS_75-71-8 - kg/a
definition: The unit of measure for 'CAS_75-71-8' (Dichlorodifluoromethane) in WISE SoE - Emissions: Emissions table is 'kg/a'
status: valid
status modified: 2019-10-03
accepted date: 2019-10-03
in scheme: Definition of correct units for the observed determinands in the given WISE SoE DD tables
has determinand: CAS 75-71-8
has uom: kg.a-1
has table: WISE-SoE Emissions.Emissions

WISE-SoE_Emissions.Emissions - CAS_75-99-0 - kg/a
type: Concept
notation: WISE-SoE_Emissions.Emissions - CAS_75-99-0 - kg/a
definition: The unit of measure for 'CAS_75-99-0' (Dalapon) in WISE SoE - Emissions: Emissions table is 'kg/a'
status: valid
status modified: 2019-10-03
accepted date: 2019-10-03
in scheme: Definition of correct units for the observed determinands in the given WISE SoE DD tables
has determinand: CAS 75-99-0
has uom: kg.a-1
has table: WISE-SoE Emissions.Emissions

WISE-SoE_Emissions.Emissions - CAS_76-03-9 - kg/a
type: Concept
notation: WISE-SoE_Emissions.Emissions - CAS_76-03-9 - kg/a
definition: The unit of measure for 'CAS_76-03-9' (Trichloroacetic acid) in WISE SoE - Emissions: Emissions table is 'kg/a'
status: valid
status modified: 2019-10-03
accepted date: 2019-10-03
in scheme: Definition of correct units for the observed determinands in the given WISE SoE DD tables
has determinand: CAS 76-03-9
has uom: kg.a-1
has table: WISE-SoE Emissions.Emissions

WISE-SoE_Emissions.Emissions - CAS_76-13-1 - kg/a
type: Concept
notation: WISE-SoE_Emissions.Emissions - CAS_76-13-1 - kg/a
definition: The unit of measure for 'CAS_76-13-1' (1,1,2-trichlorotrifluoroethane) in WISE SoE - Emissions: Emissions table is 'kg/a'
status: valid
status modified: 2019-10-03
accepted date: 2019-10-03
in scheme: Definition of correct units for the observed determinands in the given WISE SoE DD tables
has determinand: CAS 76-13-1
has uom: kg.a-1
has table: WISE-SoE Emissions.Emissions

WISE-SoE_Emissions.Emissions - CAS_76-44-8 - kg/a
type: Concept
notation: WISE-SoE_Emissions.Emissions - CAS_76-44-8 - kg/a
definition: The unit of measure for 'CAS_76-44-8' (Heptachlor) in WISE SoE - Emissions: Emissions table is 'kg/a'
status: valid
status modified: 2019-10-03
accepted date: 2019-10-03
in scheme: Definition of correct units for the observed determinands in the given WISE SoE DD tables
has determinand: CAS 76-44-8
has uom: kg.a-1
has table: WISE-SoE Emissions.Emissions

WISE-SoE_Emissions.Emissions - CAS_76578-12-6 - kg/a
type: Concept
notation: WISE-SoE_Emissions.Emissions - CAS_76578-12-6 - kg/a
definition: The unit of measure for 'CAS_76578-12-6' (Quizalofop) in WISE SoE - Emissions: Emissions table is 'kg/a'
status: valid
status modified: 2019-10-03
accepted date: 2019-10-03
in scheme: Definition of correct units for the observed determinands in the given WISE SoE DD tables
has determinand: CAS 76578-12-6
has uom: kg.a-1
has table: WISE-SoE Emissions.Emissions

WISE-SoE_Emissions.Emissions - CAS_77-47-4 - kg/a
type: Concept
notation: WISE-SoE_Emissions.Emissions - CAS_77-47-4 - kg/a
definition: The unit of measure for 'CAS_77-47-4' (Hexachlorocyclopentadiene (HCCP)) in WISE SoE - Emissions: Emissions table is 'kg/a'
status: valid
status modified: 2019-10-03
accepted date: 2019-10-03
in scheme: Definition of correct units for the observed determinands in the given WISE SoE DD tables
has determinand: CAS 77-47-4
has uom: kg.a-1
has table: WISE-SoE Emissions.Emissions

WISE-SoE_Emissions.Emissions - CAS_7723-14-0 - t/a
type: Concept
notation: WISE-SoE_Emissions.Emissions - CAS_7723-14-0 - t/a
definition: The unit of measure for 'CAS_7723-14-0' (Total phosphorus) in WISE SoE - Emissions: Emissions table is 't/a'
status: valid
status modified: 2019-10-03
accepted date: 2019-10-03
in scheme: Definition of correct units for the observed determinands in the given WISE SoE DD tables
has determinand: CAS 7723-14-0
has uom: t.a-1
has table: WISE-SoE Emissions.Emissions

WISE-SoE_Emissions.Emissions - CAS_77732-09-3 - kg/a
type: Concept
notation: WISE-SoE_Emissions.Emissions - CAS_77732-09-3 - kg/a
definition: The unit of measure for 'CAS_77732-09-3' (Oxadixyl) in WISE SoE - Emissions: Emissions table is 'kg/a'
status: valid
status modified: 2019-10-03
accepted date: 2019-10-03
in scheme: Definition of correct units for the observed determinands in the given WISE SoE DD tables
has determinand: CAS 77732-09-3
has uom: kg.a-1
has table: WISE-SoE Emissions.Emissions

WISE-SoE_Emissions.Emissions - CAS_7782-41-4 - kg/a
type: Concept
notation: WISE-SoE_Emissions.Emissions - CAS_7782-41-4 - kg/a
definition: The unit of measure for 'CAS_7782-41-4' (Fluorine) in WISE SoE - Emissions: Emissions table is 'kg/a'
status: valid
status modified: 2019-10-03
accepted date: 2019-10-03
in scheme: Definition of correct units for the observed determinands in the given WISE SoE DD tables
has determinand: CAS 7782-41-4
has uom: kg.a-1
has table: WISE-SoE Emissions.Emissions

WISE-SoE_Emissions.Emissions - CAS_7782-49-2 - kg/a
type: Concept
notation: WISE-SoE_Emissions.Emissions - CAS_7782-49-2 - kg/a
definition: The unit of measure for 'CAS_7782-49-2' (Selenium and its compounds) in WISE SoE - Emissions: Emissions table is 'kg/a'
status: valid
status modified: 2019-10-03
accepted date: 2019-10-03
in scheme: Definition of correct units for the observed determinands in the given WISE SoE DD tables
has determinand: CAS 7782-49-2
has uom: kg.a-1
has table: WISE-SoE Emissions.Emissions

WISE-SoE_Emissions.Emissions - CAS_7783-06-4 - kg/a
type: Concept
notation: WISE-SoE_Emissions.Emissions - CAS_7783-06-4 - kg/a
definition: The unit of measure for 'CAS_7783-06-4' (Hydrogen sulphide) in WISE SoE - Emissions: Emissions table is 'kg/a'
status: valid
status modified: 2019-10-03
accepted date: 2019-10-03
in scheme: Definition of correct units for the observed determinands in the given WISE SoE DD tables
has determinand: CAS 7783-06-4
has uom: kg.a-1
has table: WISE-SoE Emissions.Emissions

WISE-SoE_Emissions.Emissions - CAS_7786-34-7 - kg/a
type: Concept
notation: WISE-SoE_Emissions.Emissions - CAS_7786-34-7 - kg/a
definition: The unit of measure for 'CAS_7786-34-7' (Mevinphos) in WISE SoE - Emissions: Emissions table is 'kg/a'
status: valid
status modified: 2019-10-03
accepted date: 2019-10-03
in scheme: Definition of correct units for the observed determinands in the given WISE SoE DD tables
has determinand: CAS 7786-34-7
has uom: kg.a-1
has table: WISE-SoE Emissions.Emissions

WISE-SoE_Emissions.Emissions - CAS_7790-93-4 - kg/a
type: Concept
notation: WISE-SoE_Emissions.Emissions - CAS_7790-93-4 - kg/a
definition: The unit of measure for 'CAS_7790-93-4' (Chloric acid) in WISE SoE - Emissions: Emissions table is 'kg/a'
status: valid
status modified: 2019-10-03
accepted date: 2019-10-03
in scheme: Definition of correct units for the observed determinands in the given WISE SoE DD tables
has determinand: CAS 7790-93-4
has uom: kg.a-1
has table: WISE-SoE Emissions.Emissions

WISE-SoE_Emissions.Emissions - CAS_78-87-5 - kg/a
type: Concept
notation: WISE-SoE_Emissions.Emissions - CAS_78-87-5 - kg/a
definition: The unit of measure for 'CAS_78-87-5' (1,2-dichloropropane) in WISE SoE - Emissions: Emissions table is 'kg/a'
status: valid
status modified: 2019-10-03
accepted date: 2019-10-03
in scheme: Definition of correct units for the observed determinands in the given WISE SoE DD tables
has determinand: CAS 78-87-5
has uom: kg.a-1
has table: WISE-SoE Emissions.Emissions

WISE-SoE_Emissions.Emissions - CAS_78-88-6 - kg/a
type: Concept
notation: WISE-SoE_Emissions.Emissions - CAS_78-88-6 - kg/a
definition: The unit of measure for 'CAS_78-88-6' (2,3-dichloropropene) in WISE SoE - Emissions: Emissions table is 'kg/a'
status: valid
status modified: 2019-10-03
accepted date: 2019-10-03
in scheme: Definition of correct units for the observed determinands in the given WISE SoE DD tables
has determinand: CAS 78-88-6
has uom: kg.a-1
has table: WISE-SoE Emissions.Emissions

WISE-SoE_Emissions.Emissions - CAS_786-19-6 - kg/a
type: Concept
notation: WISE-SoE_Emissions.Emissions - CAS_786-19-6 - kg/a
definition: The unit of measure for 'CAS_786-19-6' (Carbophenothion) in WISE SoE - Emissions: Emissions table is 'kg/a'
status: valid
status modified: 2019-10-03
accepted date: 2019-10-03
in scheme: Definition of correct units for the observed determinands in the given WISE SoE DD tables
has determinand: CAS 786-19-6
has uom: kg.a-1
has table: WISE-SoE Emissions.Emissions

WISE-SoE_Emissions.Emissions - CAS_789-02-6 - kg/a
type: Concept
notation: WISE-SoE_Emissions.Emissions - CAS_789-02-6 - kg/a
definition: The unit of measure for 'CAS_789-02-6' (DDT, o,p') in WISE SoE - Emissions: Emissions table is 'kg/a'
status: valid
status modified: 2019-10-03
accepted date: 2019-10-03
in scheme: Definition of correct units for the observed determinands in the given WISE SoE DD tables
has determinand: CAS 789-02-6
has uom: kg.a-1
has table: WISE-SoE Emissions.Emissions

WISE-SoE_Emissions.Emissions - CAS_79-00-5 - kg/a
type: Concept
notation: WISE-SoE_Emissions.Emissions - CAS_79-00-5 - kg/a
definition: The unit of measure for 'CAS_79-00-5' (1,1,2-trichloroethane) in WISE SoE - Emissions: Emissions table is 'kg/a'
status: valid
status modified: 2019-10-03
accepted date: 2019-10-03
in scheme: Definition of correct units for the observed determinands in the given WISE SoE DD tables
has determinand: CAS 79-00-5
has uom: kg.a-1
has table: WISE-SoE Emissions.Emissions

WISE-SoE_Emissions.Emissions - CAS_79-01-6 - kg/a
type: Concept
notation: WISE-SoE_Emissions.Emissions - CAS_79-01-6 - kg/a
definition: The unit of measure for 'CAS_79-01-6' (Trichloroethylene) in WISE SoE - Emissions: Emissions table is 'kg/a'
status: valid
status modified: 2019-10-03
accepted date: 2019-10-03
in scheme: Definition of correct units for the observed determinands in the given WISE SoE DD tables
has determinand: CAS 79-01-6
has uom: kg.a-1
has table: WISE-SoE Emissions.Emissions

WISE-SoE_Emissions.Emissions - CAS_79-06-1 - kg/a
type: Concept
notation: WISE-SoE_Emissions.Emissions - CAS_79-06-1 - kg/a
definition: The unit of measure for 'CAS_79-06-1' (Acrylamide) in WISE SoE - Emissions: Emissions table is 'kg/a'
status: valid
status modified: 2019-10-03
accepted date: 2019-10-03
in scheme: Definition of correct units for the observed determinands in the given WISE SoE DD tables
has determinand: CAS 79-06-1
has uom: kg.a-1
has table: WISE-SoE Emissions.Emissions

WISE-SoE_Emissions.Emissions - CAS_79-11-8 - kg/a
type: Concept
notation: WISE-SoE_Emissions.Emissions - CAS_79-11-8 - kg/a
definition: The unit of measure for 'CAS_79-11-8' (Chloroacetic acid) in WISE SoE - Emissions: Emissions table is 'kg/a'
status: valid
status modified: 2019-10-03
accepted date: 2019-10-03
in scheme: Definition of correct units for the observed determinands in the given WISE SoE DD tables
has determinand: CAS 79-11-8
has uom: kg.a-1
has table: WISE-SoE Emissions.Emissions

WISE-SoE_Emissions.Emissions - CAS_79-34-5 - kg/a
type: Concept
notation: WISE-SoE_Emissions.Emissions - CAS_79-34-5 - kg/a
definition: The unit of measure for 'CAS_79-34-5' (1,1,2,2-tetrachloroethane) in WISE SoE - Emissions: Emissions table is 'kg/a'
status: valid
status modified: 2019-10-03
accepted date: 2019-10-03
in scheme: Definition of correct units for the observed determinands in the given WISE SoE DD tables
has determinand: CAS 79-34-5
has uom: kg.a-1
has table: WISE-SoE Emissions.Emissions

WISE-SoE_Emissions.Emissions - CAS_79-43-6 - kg/a
type: Concept
notation: WISE-SoE_Emissions.Emissions - CAS_79-43-6 - kg/a
definition: The unit of measure for 'CAS_79-43-6' (Dichloroacetic acid) in WISE SoE - Emissions: Emissions table is 'kg/a'
status: valid
status modified: 2019-10-03
accepted date: 2019-10-03
in scheme: Definition of correct units for the observed determinands in the given WISE SoE DD tables
has determinand: CAS 79-43-6
has uom: kg.a-1
has table: WISE-SoE Emissions.Emissions

WISE-SoE_Emissions.Emissions - CAS_79-57-2 - kg/a
type: Concept
notation: WISE-SoE_Emissions.Emissions - CAS_79-57-2 - kg/a
definition: The unit of measure for 'CAS_79-57-2' (Oxytetracycline) in WISE SoE - Emissions: Emissions table is 'kg/a'
status: valid
status modified: 2019-10-03
accepted date: 2019-10-03
in scheme: Definition of correct units for the observed determinands in the given WISE SoE DD tables
has determinand: CAS 79-57-2
has uom: kg.a-1
has table: WISE-SoE Emissions.Emissions

WISE-SoE_Emissions.Emissions - CAS_79-94-7 - kg/a
type: Concept
notation: WISE-SoE_Emissions.Emissions - CAS_79-94-7 - kg/a
definition: The unit of measure for 'CAS_79-94-7' (Tetrabromobisphenol A (TBBP-A)) in WISE SoE - Emissions: Emissions table is 'kg/a'
status: valid
status modified: 2019-10-03
accepted date: 2019-10-03
in scheme: Definition of correct units for the observed determinands in the given WISE SoE DD tables
has determinand: CAS 79-94-7
has uom: kg.a-1
has table: WISE-SoE Emissions.Emissions

WISE-SoE_Emissions.Emissions - CAS_79241-46-6 - kg/a
type: Concept
notation: WISE-SoE_Emissions.Emissions - CAS_79241-46-6 - kg/a
definition: The unit of measure for 'CAS_79241-46-6' (Fluazifop-P-butyl) in WISE SoE - Emissions: Emissions table is 'kg/a'
status: valid
status modified: 2019-10-03
accepted date: 2019-10-03
in scheme: Definition of correct units for the observed determinands in the given WISE SoE DD tables
has determinand: CAS 79241-46-6
has uom: kg.a-1
has table: WISE-SoE Emissions.Emissions

WISE-SoE_Emissions.Emissions - CAS_79277-27-3 - kg/a
type: Concept
notation: WISE-SoE_Emissions.Emissions - CAS_79277-27-3 - kg/a
definition: The unit of measure for 'CAS_79277-27-3' (Thifensulfuron-methyl) in WISE SoE - Emissions: Emissions table is 'kg/a'
status: valid
status modified: 2019-10-03
accepted date: 2019-10-03
in scheme: Definition of correct units for the observed determinands in the given WISE SoE DD tables
has determinand: CAS 79277-27-3
has uom: kg.a-1
has table: WISE-SoE Emissions.Emissions

WISE-SoE_Emissions.Emissions - CAS_793-24-8 - kg/a
type: Concept
notation: WISE-SoE_Emissions.Emissions - CAS_793-24-8 - kg/a
definition: The unit of measure for 'CAS_793-24-8' (4-(dimethylbutylamino) diphenylamin (6PPD)) in WISE SoE - Emissions: Emissions table is 'kg/a'
status: valid
status modified: 2019-10-03
accepted date: 2019-10-03
in scheme: Definition of correct units for the observed determinands in the given WISE SoE DD tables
has determinand: CAS 793-24-8
has uom: kg.a-1
has table: WISE-SoE Emissions.Emissions

WISE-SoE_Emissions.Emissions - CAS_80-05-7 - kg/a
type: Concept
notation: WISE-SoE_Emissions.Emissions - CAS_80-05-7 - kg/a
definition: The unit of measure for 'CAS_80-05-7' (Bisphenol A) in WISE SoE - Emissions: Emissions table is 'kg/a'
status: valid
status modified: 2019-10-03
accepted date: 2019-10-03
in scheme: Definition of correct units for the observed determinands in the given WISE SoE DD tables
has determinand: CAS 80-05-7
has uom: kg.a-1
has table: WISE-SoE Emissions.Emissions

WISE-SoE_Emissions.Emissions - CAS_8001-35-2 - kg/a
type: Concept
notation: WISE-SoE_Emissions.Emissions - CAS_8001-35-2 - kg/a
definition: The unit of measure for 'CAS_8001-35-2' (Toxaphene) in WISE SoE - Emissions: Emissions table is 'kg/a'
status: valid
status modified: 2019-10-03
accepted date: 2019-10-03
in scheme: Definition of correct units for the observed determinands in the given WISE SoE DD tables
has determinand: CAS 8001-35-2
has uom: kg.a-1
has table: WISE-SoE Emissions.Emissions

WISE-SoE_Emissions.Emissions - CAS_8065-48-3 - kg/a
type: Concept
notation: WISE-SoE_Emissions.Emissions - CAS_8065-48-3 - kg/a
definition: The unit of measure for 'CAS_8065-48-3' (Demeton-O and Demeton-S (mixture)) in WISE SoE - Emissions: Emissions table is 'kg/a'
status: valid
status modified: 2019-10-03
accepted date: 2019-10-03
in scheme: Definition of correct units for the observed determinands in the given WISE SoE DD tables
has determinand: CAS 8065-48-3
has uom: kg.a-1
has table: WISE-SoE Emissions.Emissions

WISE-SoE_Emissions.Emissions - CAS_80844-07-1 - kg/a
type: Concept
notation: WISE-SoE_Emissions.Emissions - CAS_80844-07-1 - kg/a
definition: The unit of measure for 'CAS_80844-07-1' (Etofenprox) in WISE SoE - Emissions: Emissions table is 'kg/a'
status: valid
status modified: 2019-10-03
accepted date: 2019-10-03
in scheme: Definition of correct units for the observed determinands in the given WISE SoE DD tables
has determinand: CAS 80844-07-1
has uom: kg.a-1
has table: WISE-SoE Emissions.Emissions

WISE-SoE_Emissions.Emissions - CAS_81-15-2 - kg/a
type: Concept
notation: WISE-SoE_Emissions.Emissions - CAS_81-15-2 - kg/a
definition: The unit of measure for 'CAS_81-15-2' (Musk xylene) in WISE SoE - Emissions: Emissions table is 'kg/a'
status: valid
status modified: 2019-10-03
accepted date: 2019-10-03
in scheme: Definition of correct units for the observed determinands in the given WISE SoE DD tables
has determinand: CAS 81-15-2
has uom: kg.a-1
has table: WISE-SoE Emissions.Emissions

WISE-SoE_Emissions.Emissions - CAS_81103-11-9 - kg/a
type: Concept
notation: WISE-SoE_Emissions.Emissions - CAS_81103-11-9 - kg/a
definition: The unit of measure for 'CAS_81103-11-9' (Clarithromycin) in WISE SoE - Emissions: Emissions table is 'kg/a'
status: valid
status modified: 2019-10-03
accepted date: 2019-10-03
in scheme: Definition of correct units for the observed determinands in the given WISE SoE DD tables
has determinand: CAS 81103-11-9
has uom: kg.a-1
has table: WISE-SoE Emissions.Emissions

WISE-SoE_Emissions.Emissions - CAS_81406-37-3 - kg/a
type: Concept
notation: WISE-SoE_Emissions.Emissions - CAS_81406-37-3 - kg/a
definition: The unit of measure for 'CAS_81406-37-3' (Fluroxypyr-meptyl) in WISE SoE - Emissions: Emissions table is 'kg/a'
status: valid
status modified: 2019-10-03
accepted date: 2019-10-03
in scheme: Definition of correct units for the observed determinands in the given WISE SoE DD tables
has determinand: CAS 81406-37-3
has uom: kg.a-1
has table: WISE-SoE Emissions.Emissions

WISE-SoE_Emissions.Emissions - CAS_81777-89-1 - kg/a
type: Concept
notation: WISE-SoE_Emissions.Emissions - CAS_81777-89-1 - kg/a
definition: The unit of measure for 'CAS_81777-89-1' (Clomazone) in WISE SoE - Emissions: Emissions table is 'kg/a'
status: valid
status modified: 2019-10-03
accepted date: 2019-10-03
in scheme: Definition of correct units for the observed determinands in the given WISE SoE DD tables
has determinand: CAS 81777-89-1
has uom: kg.a-1
has table: WISE-SoE Emissions.Emissions

WISE-SoE_Emissions.Emissions - CAS_82-68-8 - kg/a
type: Concept
notation: WISE-SoE_Emissions.Emissions - CAS_82-68-8 - kg/a
definition: The unit of measure for 'CAS_82-68-8' (Quintozene) in WISE SoE - Emissions: Emissions table is 'kg/a'
status: valid
status modified: 2019-10-03
accepted date: 2019-10-03
in scheme: Definition of correct units for the observed determinands in the given WISE SoE DD tables
has determinand: CAS 82-68-8
has uom: kg.a-1
has table: WISE-SoE Emissions.Emissions

WISE-SoE_Emissions.Emissions - CAS_82097-50-5 - kg/a
type: Concept
notation: WISE-SoE_Emissions.Emissions - CAS_82097-50-5 - kg/a
definition: The unit of measure for 'CAS_82097-50-5' (Triasulfuron) in WISE SoE - Emissions: Emissions table is 'kg/a'
status: valid
status modified: 2019-10-03
accepted date: 2019-10-03
in scheme: Definition of correct units for the observed determinands in the given WISE SoE DD tables
has determinand: CAS 82097-50-5
has uom: kg.a-1
has table: WISE-SoE Emissions.Emissions

WISE-SoE_Emissions.Emissions - CAS_82558-50-7 - kg/a
type: Concept
notation: WISE-SoE_Emissions.Emissions - CAS_82558-50-7 - kg/a
definition: The unit of measure for 'CAS_82558-50-7' (Benzamide) in WISE SoE - Emissions: Emissions table is 'kg/a'
status: valid
status modified: 2019-10-03
accepted date: 2019-10-03
in scheme: Definition of correct units for the observed determinands in the given WISE SoE DD tables
has determinand: CAS 82558-50-7
has uom: kg.a-1
has table: WISE-SoE Emissions.Emissions

WISE-SoE_Emissions.Emissions - CAS_83-32-9 - kg/a
type: Concept
notation: WISE-SoE_Emissions.Emissions - CAS_83-32-9 - kg/a
definition: The unit of measure for 'CAS_83-32-9' (Acenaphthene) in WISE SoE - Emissions: Emissions table is 'kg/a'
status: valid
status modified: 2019-10-03
accepted date: 2019-10-03
in scheme: Definition of correct units for the observed determinands in the given WISE SoE DD tables
has determinand: CAS 83-32-9
has uom: kg.a-1
has table: WISE-SoE Emissions.Emissions

WISE-SoE_Emissions.Emissions - CAS_83-42-1 - kg/a
type: Concept
notation: WISE-SoE_Emissions.Emissions - CAS_83-42-1 - kg/a
definition: The unit of measure for 'CAS_83-42-1' (2-chloro-6-nitrotoluene) in WISE SoE - Emissions: Emissions table is 'kg/a'
status: valid
status modified: 2019-10-03
accepted date: 2019-10-03
in scheme: Definition of correct units for the observed determinands in the given WISE SoE DD tables
has determinand: CAS 83-42-1
has uom: kg.a-1
has table: WISE-SoE Emissions.Emissions

WISE-SoE_Emissions.Emissions - CAS_83055-99-6 - kg/a
type: Concept
notation: WISE-SoE_Emissions.Emissions - CAS_83055-99-6 - kg/a
definition: The unit of measure for 'CAS_83055-99-6' (Bensulfuron-methyl) in WISE SoE - Emissions: Emissions table is 'kg/a'
status: valid
status modified: 2019-10-03
accepted date: 2019-10-03
in scheme: Definition of correct units for the observed determinands in the given WISE SoE DD tables
has determinand: CAS 83055-99-6
has uom: kg.a-1
has table: WISE-SoE Emissions.Emissions

WISE-SoE_Emissions.Emissions - CAS_83164-33-4 - kg/a
type: Concept
notation: WISE-SoE_Emissions.Emissions - CAS_83164-33-4 - kg/a
definition: The unit of measure for 'CAS_83164-33-4' (Diflufenican) in WISE SoE - Emissions: Emissions table is 'kg/a'
status: valid
status modified: 2019-10-03
accepted date: 2019-10-03
in scheme: Definition of correct units for the observed determinands in the given WISE SoE DD tables
has determinand: CAS 83164-33-4
has uom: kg.a-1
has table: WISE-SoE Emissions.Emissions

WISE-SoE_Emissions.Emissions - CAS_834-12-8 - kg/a
type: Concept
notation: WISE-SoE_Emissions.Emissions - CAS_834-12-8 - kg/a
definition: The unit of measure for 'CAS_834-12-8' (Ametryn) in WISE SoE - Emissions: Emissions table is 'kg/a'
status: valid
status modified: 2019-10-03
accepted date: 2019-10-03
in scheme: Definition of correct units for the observed determinands in the given WISE SoE DD tables
has determinand: CAS 834-12-8
has uom: kg.a-1
has table: WISE-SoE Emissions.Emissions

WISE-SoE_Emissions.Emissions - CAS_83905-01-5 - kg/a
type: Concept
notation: WISE-SoE_Emissions.Emissions - CAS_83905-01-5 - kg/a
definition: The unit of measure for 'CAS_83905-01-5' (Azitromycin) in WISE SoE - Emissions: Emissions table is 'kg/a'
status: valid
status modified: 2019-10-03
accepted date: 2019-10-03
in scheme: Definition of correct units for the observed determinands in the given WISE SoE DD tables
has determinand: CAS 83905-01-5
has uom: kg.a-1
has table: WISE-SoE Emissions.Emissions

WISE-SoE_Emissions.Emissions - CAS_84-66-2 - kg/a
type: Concept
notation: WISE-SoE_Emissions.Emissions - CAS_84-66-2 - kg/a
definition: The unit of measure for 'CAS_84-66-2' (Di-ethyl phthalate) in WISE SoE - Emissions: Emissions table is 'kg/a'
status: valid
status modified: 2019-10-03
accepted date: 2019-10-03
in scheme: Definition of correct units for the observed determinands in the given WISE SoE DD tables
has determinand: CAS 84-66-2
has uom: kg.a-1
has table: WISE-SoE Emissions.Emissions

WISE-SoE_Emissions.Emissions - CAS_84-69-5 - kg/a
type: Concept
notation: WISE-SoE_Emissions.Emissions - CAS_84-69-5 - kg/a
definition: The unit of measure for 'CAS_84-69-5' (Di-iso-butyl phthalate) in WISE SoE - Emissions: Emissions table is 'kg/a'
status: valid
status modified: 2019-10-03
accepted date: 2019-10-03
in scheme: Definition of correct units for the observed determinands in the given WISE SoE DD tables
has determinand: CAS 84-69-5
has uom: kg.a-1
has table: WISE-SoE Emissions.Emissions

WISE-SoE_Emissions.Emissions - CAS_84-74-2 - kg/a
type: Concept
notation: WISE-SoE_Emissions.Emissions - CAS_84-74-2 - kg/a
definition: The unit of measure for 'CAS_84-74-2' (Dibutylphthalate) in WISE SoE - Emissions: Emissions table is 'kg/a'
status: valid
status modified: 2019-10-03
accepted date: 2019-10-03
in scheme: Definition of correct units for the observed determinands in the given WISE SoE DD tables
has determinand: CAS 84-74-2
has uom: kg.a-1
has table: WISE-SoE Emissions.Emissions

WISE-SoE_Emissions.Emissions - CAS_84852-15-3 - kg/a
type: Concept
notation: WISE-SoE_Emissions.Emissions - CAS_84852-15-3 - kg/a
definition: The unit of measure for 'CAS_84852-15-3' (4-nonylphenol, branched) in WISE SoE - Emissions: Emissions table is 'kg/a'
status: valid
status modified: 2019-10-03
accepted date: 2019-10-03
in scheme: Definition of correct units for the observed determinands in the given WISE SoE DD tables
has determinand: CAS 84852-15-3
has uom: kg.a-1
has table: WISE-SoE Emissions.Emissions

WISE-SoE_Emissions.Emissions - CAS_85-01-8 - kg/a
type: Concept
notation: WISE-SoE_Emissions.Emissions - CAS_85-01-8 - kg/a
definition: The unit of measure for 'CAS_85-01-8' (Phenanthrene) in WISE SoE - Emissions: Emissions table is 'kg/a'
status: valid
status modified: 2019-10-03
accepted date: 2019-10-03
in scheme: Definition of correct units for the observed determinands in the given WISE SoE DD tables
has determinand: CAS 85-01-8
has uom: kg.a-1
has table: WISE-SoE Emissions.Emissions

WISE-SoE_Emissions.Emissions - CAS_85-22-3 - kg/a
type: Concept
notation: WISE-SoE_Emissions.Emissions - CAS_85-22-3 - kg/a
definition: The unit of measure for 'CAS_85-22-3' (Pentabromoethylbenzene) in WISE SoE - Emissions: Emissions table is 'kg/a'
status: valid
status modified: 2019-10-03
accepted date: 2019-10-03
in scheme: Definition of correct units for the observed determinands in the given WISE SoE DD tables
has determinand: CAS 85-22-3
has uom: kg.a-1
has table: WISE-SoE Emissions.Emissions

WISE-SoE_Emissions.Emissions - CAS_85-68-7 - kg/a
type: Concept
notation: WISE-SoE_Emissions.Emissions - CAS_85-68-7 - kg/a
definition: The unit of measure for 'CAS_85-68-7' (Butyl benzyl phthalate (BBP)) in WISE SoE - Emissions: Emissions table is 'kg/a'
status: valid
status modified: 2019-10-03
accepted date: 2019-10-03
in scheme: Definition of correct units for the observed determinands in the given WISE SoE DD tables
has determinand: CAS 85-68-7
has uom: kg.a-1
has table: WISE-SoE Emissions.Emissions

WISE-SoE_Emissions.Emissions - CAS_85509-19-9 - kg/a
type: Concept
notation: WISE-SoE_Emissions.Emissions - CAS_85509-19-9 - kg/a
definition: The unit of measure for 'CAS_85509-19-9' (Flusilazole) in WISE SoE - Emissions: Emissions table is 'kg/a'
status: valid
status modified: 2019-10-03
accepted date: 2019-10-03
in scheme: Definition of correct units for the observed determinands in the given WISE SoE DD tables
has determinand: CAS 85509-19-9
has uom: kg.a-1
has table: WISE-SoE Emissions.Emissions

WISE-SoE_Emissions.Emissions - CAS_85535-84-8 - kg/a
type: Concept
notation: WISE-SoE_Emissions.Emissions - CAS_85535-84-8 - kg/a
definition: The unit of measure for 'CAS_85535-84-8' (Chloroalkanes C10-13) in WISE SoE - Emissions: Emissions table is 'kg/a'
status: valid
status modified: 2019-10-03
accepted date: 2019-10-03
in scheme: Definition of correct units for the observed determinands in the given WISE SoE DD tables
has determinand: CAS 85535-84-8
has uom: kg.a-1
has table: WISE-SoE Emissions.Emissions

WISE-SoE_Emissions.Emissions - CAS_85535-85-9 - kg/a
type: Concept
notation: WISE-SoE_Emissions.Emissions - CAS_85535-85-9 - kg/a
definition: The unit of measure for 'CAS_85535-85-9' (Chloroalkanes C14-17,MCCP) in WISE SoE - Emissions: Emissions table is 'kg/a'
status: valid
status modified: 2019-10-03
accepted date: 2019-10-03
in scheme: Definition of correct units for the observed determinands in the given WISE SoE DD tables
has determinand: CAS 85535-85-9
has uom: kg.a-1
has table: WISE-SoE Emissions.Emissions

WISE-SoE_Emissions.Emissions - CAS_85721-33-1 - kg/a
type: Concept
notation: WISE-SoE_Emissions.Emissions - CAS_85721-33-1 - kg/a
definition: The unit of measure for 'CAS_85721-33-1' (Ciprofloxacin) in WISE SoE - Emissions: Emissions table is 'kg/a'
status: valid
status modified: 2019-10-03
accepted date: 2019-10-03
in scheme: Definition of correct units for the observed determinands in the given WISE SoE DD tables
has determinand: CAS 85721-33-1
has uom: kg.a-1
has table: WISE-SoE Emissions.Emissions

WISE-SoE_Emissions.Emissions - CAS_86-50-0 - kg/a
type: Concept
notation: WISE-SoE_Emissions.Emissions - CAS_86-50-0 - kg/a
definition: The unit of measure for 'CAS_86-50-0' (Azinphos-methyl) in WISE SoE - Emissions: Emissions table is 'kg/a'
status: valid
status modified: 2019-10-03
accepted date: 2019-10-03
in scheme: Definition of correct units for the observed determinands in the given WISE SoE DD tables
has determinand: CAS 86-50-0
has uom: kg.a-1
has table: WISE-SoE Emissions.Emissions

WISE-SoE_Emissions.Emissions - CAS_86-73-7 - kg/a
type: Concept
notation: WISE-SoE_Emissions.Emissions - CAS_86-73-7 - kg/a
definition: The unit of measure for 'CAS_86-73-7' (Fluorene) in WISE SoE - Emissions: Emissions table is 'kg/a'
status: valid
status modified: 2019-10-03
accepted date: 2019-10-03
in scheme: Definition of correct units for the observed determinands in the given WISE SoE DD tables
has determinand: CAS 86-73-7
has uom: kg.a-1
has table: WISE-SoE Emissions.Emissions

WISE-SoE_Emissions.Emissions - CAS_86209-51-0 - kg/a
type: Concept
notation: WISE-SoE_Emissions.Emissions - CAS_86209-51-0 - kg/a
definition: The unit of measure for 'CAS_86209-51-0' (Primisulfuron-methyl) in WISE SoE - Emissions: Emissions table is 'kg/a'
status: valid
status modified: 2019-10-03
accepted date: 2019-10-03
in scheme: Definition of correct units for the observed determinands in the given WISE SoE DD tables
has determinand: CAS 86209-51-0
has uom: kg.a-1
has table: WISE-SoE Emissions.Emissions

WISE-SoE_Emissions.Emissions - CAS_87-60-5 - kg/a
type: Concept
notation: WISE-SoE_Emissions.Emissions - CAS_87-60-5 - kg/a
definition: The unit of measure for 'CAS_87-60-5' (3-chloro-o-toluidine) in WISE SoE - Emissions: Emissions table is 'kg/a'
status: valid
status modified: 2019-10-03
accepted date: 2019-10-03
in scheme: Definition of correct units for the observed determinands in the given WISE SoE DD tables
has determinand: CAS 87-60-5
has uom: kg.a-1
has table: WISE-SoE Emissions.Emissions

WISE-SoE_Emissions.Emissions - CAS_87-61-6 - kg/a
type: Concept
notation: WISE-SoE_Emissions.Emissions - CAS_87-61-6 - kg/a
definition: The unit of measure for 'CAS_87-61-6' (1,2,3-trichlorobenzene) in WISE SoE - Emissions: Emissions table is 'kg/a'
status: valid
status modified: 2019-10-03
accepted date: 2019-10-03
in scheme: Definition of correct units for the observed determinands in the given WISE SoE DD tables
has determinand: CAS 87-61-6
has uom: kg.a-1
has table: WISE-SoE Emissions.Emissions

WISE-SoE_Emissions.Emissions - CAS_87-65-0 - kg/a
type: Concept
notation: WISE-SoE_Emissions.Emissions - CAS_87-65-0 - kg/a
definition: The unit of measure for 'CAS_87-65-0' (2,6-dichlorophenol) in WISE SoE - Emissions: Emissions table is 'kg/a'
status: valid
status modified: 2019-10-03
accepted date: 2019-10-03
in scheme: Definition of correct units for the observed determinands in the given WISE SoE DD tables
has determinand: CAS 87-65-0
has uom: kg.a-1
has table: WISE-SoE Emissions.Emissions

WISE-SoE_Emissions.Emissions - CAS_87-68-3 - kg/a
type: Concept
notation: WISE-SoE_Emissions.Emissions - CAS_87-68-3 - kg/a
definition: The unit of measure for 'CAS_87-68-3' (Hexachlorobutadiene) in WISE SoE - Emissions: Emissions table is 'kg/a'
status: valid
status modified: 2019-10-03
accepted date: 2019-10-03
in scheme: Definition of correct units for the observed determinands in the given WISE SoE DD tables
has determinand: CAS 87-68-3
has uom: kg.a-1
has table: WISE-SoE Emissions.Emissions

WISE-SoE_Emissions.Emissions - CAS_87-86-5 - kg/a
type: Concept
notation: WISE-SoE_Emissions.Emissions - CAS_87-86-5 - kg/a
definition: The unit of measure for 'CAS_87-86-5' (Pentachlorophenol) in WISE SoE - Emissions: Emissions table is 'kg/a'
status: valid
status modified: 2019-10-03
accepted date: 2019-10-03
in scheme: Definition of correct units for the observed determinands in the given WISE SoE DD tables
has determinand: CAS 87-86-5
has uom: kg.a-1
has table: WISE-SoE Emissions.Emissions

WISE-SoE_Emissions.Emissions - CAS_87674-68-8 - kg/a
type: Concept
notation: WISE-SoE_Emissions.Emissions - CAS_87674-68-8 - kg/a
definition: The unit of measure for 'CAS_87674-68-8' (Dimethenamid) in WISE SoE - Emissions: Emissions table is 'kg/a'
status: valid
status modified: 2019-10-03
accepted date: 2019-10-03
in scheme: Definition of correct units for the observed determinands in the given WISE SoE DD tables
has determinand: CAS 87674-68-8
has uom: kg.a-1
has table: WISE-SoE Emissions.Emissions

WISE-SoE_Emissions.Emissions - CAS_87820-88-0 - kg/a
type: Concept
notation: WISE-SoE_Emissions.Emissions - CAS_87820-88-0 - kg/a
definition: The unit of measure for 'CAS_87820-88-0' (Tralkoxydim) in WISE SoE - Emissions: Emissions table is 'kg/a'
status: valid
status modified: 2019-10-03
accepted date: 2019-10-03
in scheme: Definition of correct units for the observed determinands in the given WISE SoE DD tables
has determinand: CAS 87820-88-0
has uom: kg.a-1
has table: WISE-SoE Emissions.Emissions

WISE-SoE_Emissions.Emissions - CAS_88-06-2 - kg/a
type: Concept
notation: WISE-SoE_Emissions.Emissions - CAS_88-06-2 - kg/a
definition: The unit of measure for 'CAS_88-06-2' (2,4,6-trichlorophenol) in WISE SoE - Emissions: Emissions table is 'kg/a'
status: valid
status modified: 2019-10-03
accepted date: 2019-10-03
in scheme: Definition of correct units for the observed determinands in the given WISE SoE DD tables
has determinand: CAS 88-06-2
has uom: kg.a-1
has table: WISE-SoE Emissions.Emissions

WISE-SoE_Emissions.Emissions - CAS_88-73-3 - kg/a
type: Concept
notation: WISE-SoE_Emissions.Emissions - CAS_88-73-3 - kg/a
definition: The unit of measure for 'CAS_88-73-3' (1-chloro-2-nitrobenzene) in WISE SoE - Emissions: Emissions table is 'kg/a'
status: valid
status modified: 2019-10-03
accepted date: 2019-10-03
in scheme: Definition of correct units for the observed determinands in the given WISE SoE DD tables
has determinand: CAS 88-73-3
has uom: kg.a-1
has table: WISE-SoE Emissions.Emissions

WISE-SoE_Emissions.Emissions - CAS_88-85-7 - kg/a
type: Concept
notation: WISE-SoE_Emissions.Emissions - CAS_88-85-7 - kg/a
definition: The unit of measure for 'CAS_88-85-7' (Dinoseb) in WISE SoE - Emissions: Emissions table is 'kg/a'
status: valid
status modified: 2019-10-03
accepted date: 2019-10-03
in scheme: Definition of correct units for the observed determinands in the given WISE SoE DD tables
has determinand: CAS 88-85-7
has uom: kg.a-1
has table: WISE-SoE Emissions.Emissions

WISE-SoE_Emissions.Emissions - CAS_886-50-0 - kg/a
type: Concept
notation: WISE-SoE_Emissions.Emissions - CAS_886-50-0 - kg/a
definition: The unit of measure for 'CAS_886-50-0' (Terbutryn) in WISE SoE - Emissions: Emissions table is 'kg/a'
status: valid
status modified: 2019-10-03
accepted date: 2019-10-03
in scheme: Definition of correct units for the observed determinands in the given WISE SoE DD tables
has determinand: CAS 886-50-0
has uom: kg.a-1
has table: WISE-SoE Emissions.Emissions

WISE-SoE_Emissions.Emissions - CAS_88671-89-0 - kg/a
type: Concept
notation: WISE-SoE_Emissions.Emissions - CAS_88671-89-0 - kg/a
definition: The unit of measure for 'CAS_88671-89-0' (Myclobutanil) in WISE SoE - Emissions: Emissions table is 'kg/a'
status: valid
status modified: 2019-10-03
accepted date: 2019-10-03
in scheme: Definition of correct units for the observed determinands in the given WISE SoE DD tables
has determinand: CAS 88671-89-0
has uom: kg.a-1
has table: WISE-SoE Emissions.Emissions

WISE-SoE_Emissions.Emissions - CAS_89-21-4 - kg/a
type: Concept
notation: WISE-SoE_Emissions.Emissions - CAS_89-21-4 - kg/a
definition: The unit of measure for 'CAS_89-21-4' (4-chloro-2-nitroanisole) in WISE SoE - Emissions: Emissions table is 'kg/a'
status: valid
status modified: 2019-10-03
accepted date: 2019-10-03
in scheme: Definition of correct units for the observed determinands in the given WISE SoE DD tables
has determinand: CAS 89-21-4
has uom: kg.a-1
has table: WISE-SoE Emissions.Emissions

WISE-SoE_Emissions.Emissions - CAS_89-59-8 - kg/a
type: Concept
notation: WISE-SoE_Emissions.Emissions - CAS_89-59-8 - kg/a
definition: The unit of measure for 'CAS_89-59-8' (4-Chloro-2-nitrotoluene) in WISE SoE - Emissions: Emissions table is 'kg/a'
status: valid
status modified: 2019-10-03
accepted date: 2019-10-03
in scheme: Definition of correct units for the observed determinands in the given WISE SoE DD tables
has determinand: CAS 89-59-8
has uom: kg.a-1
has table: WISE-SoE Emissions.Emissions

WISE-SoE_Emissions.Emissions - CAS_89-60-1 - kg/a
type: Concept
notation: WISE-SoE_Emissions.Emissions - CAS_89-60-1 - kg/a
definition: The unit of measure for 'CAS_89-60-1' (4-chloro-3-nitrotoluene) in WISE SoE - Emissions: Emissions table is 'kg/a'
status: valid
status modified: 2019-10-03
accepted date: 2019-10-03
in scheme: Definition of correct units for the observed determinands in the given WISE SoE DD tables
has determinand: CAS 89-60-1
has uom: kg.a-1
has table: WISE-SoE Emissions.Emissions

WISE-SoE_Emissions.Emissions - CAS_89-61-2 - kg/a
type: Concept
notation: WISE-SoE_Emissions.Emissions - CAS_89-61-2 - kg/a
definition: The unit of measure for 'CAS_89-61-2' (1,4-dichloro-2-nitrobenzene) in WISE SoE - Emissions: Emissions table is 'kg/a'
status: valid
status modified: 2019-10-03
accepted date: 2019-10-03
in scheme: Definition of correct units for the observed determinands in the given WISE SoE DD tables
has determinand: CAS 89-61-2
has uom: kg.a-1
has table: WISE-SoE Emissions.Emissions

WISE-SoE_Emissions.Emissions - CAS_89-63-4 - kg/a
type: Concept
notation: WISE-SoE_Emissions.Emissions - CAS_89-63-4 - kg/a
definition: The unit of measure for 'CAS_89-63-4' (4-chloro-2-nitroaniline) in WISE SoE - Emissions: Emissions table is 'kg/a'
status: valid
status modified: 2019-10-03
accepted date: 2019-10-03
in scheme: Definition of correct units for the observed determinands in the given WISE SoE DD tables
has determinand: CAS 89-63-4
has uom: kg.a-1
has table: WISE-SoE Emissions.Emissions

WISE-SoE_Emissions.Emissions - CAS_90-12-0 - kg/a
type: Concept
notation: WISE-SoE_Emissions.Emissions - CAS_90-12-0 - kg/a
definition: The unit of measure for 'CAS_90-12-0' (1-methylnaphthalene) in WISE SoE - Emissions: Emissions table is 'kg/a'
status: valid
status modified: 2019-10-03
accepted date: 2019-10-03
in scheme: Definition of correct units for the observed determinands in the given WISE SoE DD tables
has determinand: CAS 90-12-0
has uom: kg.a-1
has table: WISE-SoE Emissions.Emissions

WISE-SoE_Emissions.Emissions - CAS_90-13-1 - kg/a
type: Concept
notation: WISE-SoE_Emissions.Emissions - CAS_90-13-1 - kg/a
definition: The unit of measure for 'CAS_90-13-1' (1-Chloronaphthalene) in WISE SoE - Emissions: Emissions table is 'kg/a'
status: valid
status modified: 2019-10-03
accepted date: 2019-10-03
in scheme: Definition of correct units for the observed determinands in the given WISE SoE DD tables
has determinand: CAS 90-13-1
has uom: kg.a-1
has table: WISE-SoE Emissions.Emissions

WISE-SoE_Emissions.Emissions - CAS_9016-45-9 - kg/a
type: Concept
notation: WISE-SoE_Emissions.Emissions - CAS_9016-45-9 - kg/a
definition: The unit of measure for 'CAS_9016-45-9' (Nonylphenol ethoxylate) in WISE SoE - Emissions: Emissions table is 'kg/a'
status: valid
status modified: 2019-10-03
accepted date: 2019-10-03
in scheme: Definition of correct units for the observed determinands in the given WISE SoE DD tables
has determinand: CAS 9016-45-9
has uom: kg.a-1
has table: WISE-SoE Emissions.Emissions

WISE-SoE_Emissions.Emissions - CAS_91-20-3 - kg/a
type: Concept
notation: WISE-SoE_Emissions.Emissions - CAS_91-20-3 - kg/a
definition: The unit of measure for 'CAS_91-20-3' (Naphthalene) in WISE SoE - Emissions: Emissions table is 'kg/a'
status: valid
status modified: 2019-10-03
accepted date: 2019-10-03
in scheme: Definition of correct units for the observed determinands in the given WISE SoE DD tables
has determinand: CAS 91-20-3
has uom: kg.a-1
has table: WISE-SoE Emissions.Emissions

WISE-SoE_Emissions.Emissions - CAS_91-57-6 - kg/a
type: Concept
notation: WISE-SoE_Emissions.Emissions - CAS_91-57-6 - kg/a
definition: The unit of measure for 'CAS_91-57-6' (2-methylnaphthalene) in WISE SoE - Emissions: Emissions table is 'kg/a'
status: valid
status modified: 2019-10-03
accepted date: 2019-10-03
in scheme: Definition of correct units for the observed determinands in the given WISE SoE DD tables
has determinand: CAS 91-57-6
has uom: kg.a-1
has table: WISE-SoE Emissions.Emissions

WISE-SoE_Emissions.Emissions - CAS_91-94-1 - kg/a
type: Concept
notation: WISE-SoE_Emissions.Emissions - CAS_91-94-1 - kg/a
definition: The unit of measure for 'CAS_91-94-1' (3,3'-dichlorobenzidine) in WISE SoE - Emissions: Emissions table is 'kg/a'
status: valid
status modified: 2019-10-03
accepted date: 2019-10-03
in scheme: Definition of correct units for the observed determinands in the given WISE SoE DD tables
has determinand: CAS 91-94-1
has uom: kg.a-1
has table: WISE-SoE Emissions.Emissions

WISE-SoE_Emissions.Emissions - CAS_919-86-8 - kg/a
type: Concept
notation: WISE-SoE_Emissions.Emissions - CAS_919-86-8 - kg/a
definition: The unit of measure for 'CAS_919-86-8' (Demeton-S-methyl) in WISE SoE - Emissions: Emissions table is 'kg/a'
status: valid
status modified: 2019-10-03
accepted date: 2019-10-03
in scheme: Definition of correct units for the observed determinands in the given WISE SoE DD tables
has determinand: CAS 919-86-8
has uom: kg.a-1
has table: WISE-SoE Emissions.Emissions

WISE-SoE_Emissions.Emissions - CAS_92-52-4 - kg/a
type: Concept
notation: WISE-SoE_Emissions.Emissions - CAS_92-52-4 - kg/a
definition: The unit of measure for 'CAS_92-52-4' (Biphenyl) in WISE SoE - Emissions: Emissions table is 'kg/a'
status: valid
status modified: 2019-10-03
accepted date: 2019-10-03
in scheme: Definition of correct units for the observed determinands in the given WISE SoE DD tables
has determinand: CAS 92-52-4
has uom: kg.a-1
has table: WISE-SoE Emissions.Emissions

WISE-SoE_Emissions.Emissions - CAS_92-87-5 - kg/a
type: Concept
notation: WISE-SoE_Emissions.Emissions - CAS_92-87-5 - kg/a
definition: The unit of measure for 'CAS_92-87-5' (Benzidine) in WISE SoE - Emissions: Emissions table is 'kg/a'
status: valid
status modified: 2019-10-03
accepted date: 2019-10-03
in scheme: Definition of correct units for the observed determinands in the given WISE SoE DD tables
has determinand: CAS 92-87-5
has uom: kg.a-1
has table: WISE-SoE Emissions.Emissions

WISE-SoE_Emissions.Emissions - CAS_93-65-2 - kg/a
type: Concept
notation: WISE-SoE_Emissions.Emissions - CAS_93-65-2 - kg/a
definition: The unit of measure for 'CAS_93-65-2' (Mecoprop) in WISE SoE - Emissions: Emissions table is 'kg/a'
status: valid
status modified: 2019-10-03
accepted date: 2019-10-03
in scheme: Definition of correct units for the observed determinands in the given WISE SoE DD tables
has determinand: CAS 93-65-2
has uom: kg.a-1
has table: WISE-SoE Emissions.Emissions

WISE-SoE_Emissions.Emissions - CAS_93-72-1 - kg/a
type: Concept
notation: WISE-SoE_Emissions.Emissions - CAS_93-72-1 - kg/a
definition: The unit of measure for 'CAS_93-72-1' (Fenoprop) in WISE SoE - Emissions: Emissions table is 'kg/a'
status: valid
status modified: 2019-10-03
accepted date: 2019-10-03
in scheme: Definition of correct units for the observed determinands in the given WISE SoE DD tables
has determinand: CAS 93-72-1
has uom: kg.a-1
has table: WISE-SoE Emissions.Emissions

WISE-SoE_Emissions.Emissions - CAS_93-76-5 - kg/a
type: Concept
notation: WISE-SoE_Emissions.Emissions - CAS_93-76-5 - kg/a
definition: The unit of measure for 'CAS_93-76-5' (2,4,5-T) in WISE SoE - Emissions: Emissions table is 'kg/a'
status: valid
status modified: 2019-10-03
accepted date: 2019-10-03
in scheme: Definition of correct units for the observed determinands in the given WISE SoE DD tables
has determinand: CAS 93-76-5
has uom: kg.a-1
has table: WISE-SoE Emissions.Emissions

WISE-SoE_Emissions.Emissions - CAS_933-75-5 - kg/a
type: Concept
notation: WISE-SoE_Emissions.Emissions - CAS_933-75-5 - kg/a
definition: The unit of measure for 'CAS_933-75-5' (2,3,6-Trichlorophenol) in WISE SoE - Emissions: Emissions table is 'kg/a'
status: valid
status modified: 2019-10-03
accepted date: 2019-10-03
in scheme: Definition of correct units for the observed determinands in the given WISE SoE DD tables
has determinand: CAS 933-75-5
has uom: kg.a-1
has table: WISE-SoE Emissions.Emissions

WISE-SoE_Emissions.Emissions - CAS_933-78-8 - kg/a
type: Concept
notation: WISE-SoE_Emissions.Emissions - CAS_933-78-8 - kg/a
definition: The unit of measure for 'CAS_933-78-8' (2,3,5-trichlorophenol) in WISE SoE - Emissions: Emissions table is 'kg/a'
status: valid
status modified: 2019-10-03
accepted date: 2019-10-03
in scheme: Definition of correct units for the observed determinands in the given WISE SoE DD tables
has determinand: CAS 933-78-8
has uom: kg.a-1
has table: WISE-SoE Emissions.Emissions

WISE-SoE_Emissions.Emissions - CAS_94-74-6 - kg/a
type: Concept
notation: WISE-SoE_Emissions.Emissions - CAS_94-74-6 - kg/a
definition: The unit of measure for 'CAS_94-74-6' (MCPA) in WISE SoE - Emissions: Emissions table is 'kg/a'
status: valid
status modified: 2019-10-03
accepted date: 2019-10-03
in scheme: Definition of correct units for the observed determinands in the given WISE SoE DD tables
has determinand: CAS 94-74-6
has uom: kg.a-1
has table: WISE-SoE Emissions.Emissions

WISE-SoE_Emissions.Emissions - CAS_94-75-7 - kg/a
type: Concept
notation: WISE-SoE_Emissions.Emissions - CAS_94-75-7 - kg/a
definition: The unit of measure for 'CAS_94-75-7' (2,4-dichlorophenoxyacetic acid, 2-4 D) in WISE SoE - Emissions: Emissions table is 'kg/a'
status: valid
status modified: 2019-10-03
accepted date: 2019-10-03
in scheme: Definition of correct units for the observed determinands in the given WISE SoE DD tables
has determinand: CAS 94-75-7
has uom: kg.a-1
has table: WISE-SoE Emissions.Emissions

WISE-SoE_Emissions.Emissions - CAS_94-81-5 - kg/a
type: Concept
notation: WISE-SoE_Emissions.Emissions - CAS_94-81-5 - kg/a
definition: The unit of measure for 'CAS_94-81-5' (MCPB) in WISE SoE - Emissions: Emissions table is 'kg/a'
status: valid
status modified: 2019-10-03
accepted date: 2019-10-03
in scheme: Definition of correct units for the observed determinands in the given WISE SoE DD tables
has determinand: CAS 94-81-5
has uom: kg.a-1
has table: WISE-SoE Emissions.Emissions

WISE-SoE_Emissions.Emissions - CAS_94-82-6 - kg/a
type: Concept
notation: WISE-SoE_Emissions.Emissions - CAS_94-82-6 - kg/a
definition: The unit of measure for 'CAS_94-82-6' (2,4-DB) in WISE SoE - Emissions: Emissions table is 'kg/a'
status: valid
status modified: 2019-10-03
accepted date: 2019-10-03
in scheme: Definition of correct units for the observed determinands in the given WISE SoE DD tables
has determinand: CAS 94-82-6
has uom: kg.a-1
has table: WISE-SoE Emissions.Emissions

WISE-SoE_Emissions.Emissions - CAS_94125-34-5 - kg/a
type: Concept
notation: WISE-SoE_Emissions.Emissions - CAS_94125-34-5 - kg/a
definition: The unit of measure for 'CAS_94125-34-5' (Prosulfuron) in WISE SoE - Emissions: Emissions table is 'kg/a'
status: valid
status modified: 2019-10-03
accepted date: 2019-10-03
in scheme: Definition of correct units for the observed determinands in the given WISE SoE DD tables
has determinand: CAS 94125-34-5
has uom: kg.a-1
has table: WISE-SoE Emissions.Emissions

WISE-SoE_Emissions.Emissions - CAS_944-22-9 - kg/a
type: Concept
notation: WISE-SoE_Emissions.Emissions - CAS_944-22-9 - kg/a
definition: The unit of measure for 'CAS_944-22-9' (Fonofos) in WISE SoE - Emissions: Emissions table is 'kg/a'
status: valid
status modified: 2019-10-03
accepted date: 2019-10-03
in scheme: Definition of correct units for the observed determinands in the given WISE SoE DD tables
has determinand: CAS 944-22-9
has uom: kg.a-1
has table: WISE-SoE Emissions.Emissions

WISE-SoE_Emissions.Emissions - CAS_95-14-7 - kg/a
type: Concept
notation: WISE-SoE_Emissions.Emissions - CAS_95-14-7 - kg/a
definition: The unit of measure for 'CAS_95-14-7' (Benzotriazol) in WISE SoE - Emissions: Emissions table is 'kg/a'
status: valid
status modified: 2019-10-03
accepted date: 2019-10-03
in scheme: Definition of correct units for the observed determinands in the given WISE SoE DD tables
has determinand: CAS 95-14-7
has uom: kg.a-1
has table: WISE-SoE Emissions.Emissions

WISE-SoE_Emissions.Emissions - CAS_95-16-9 - kg/a
type: Concept
notation: WISE-SoE_Emissions.Emissions - CAS_95-16-9 - kg/a
definition: The unit of measure for 'CAS_95-16-9' (Benzosulfonazole) in WISE SoE - Emissions: Emissions table is 'kg/a'
status: valid
status modified: 2019-10-03
accepted date: 2019-10-03
in scheme: Definition of correct units for the observed determinands in the given WISE SoE DD tables
has determinand: CAS 95-16-9
has uom: kg.a-1
has table: WISE-SoE Emissions.Emissions

WISE-SoE_Emissions.Emissions - CAS_95-47-6 - kg/a
type: Concept
notation: WISE-SoE_Emissions.Emissions - CAS_95-47-6 - kg/a
definition: The unit of measure for 'CAS_95-47-6' (O-xylene) in WISE SoE - Emissions: Emissions table is 'kg/a'
status: valid
status modified: 2019-10-03
accepted date: 2019-10-03
in scheme: Definition of correct units for the observed determinands in the given WISE SoE DD tables
has determinand: CAS 95-47-6
has uom: kg.a-1
has table: WISE-SoE Emissions.Emissions

WISE-SoE_Emissions.Emissions - CAS_95-48-7 - kg/a
type: Concept
notation: WISE-SoE_Emissions.Emissions - CAS_95-48-7 - kg/a
definition: The unit of measure for 'CAS_95-48-7' (2-methyl-phenol) in WISE SoE - Emissions: Emissions table is 'kg/a'
status: valid
status modified: 2019-10-03
accepted date: 2019-10-03
in scheme: Definition of correct units for the observed determinands in the given WISE SoE DD tables
has determinand: CAS 95-48-7
has uom: kg.a-1
has table: WISE-SoE Emissions.Emissions

WISE-SoE_Emissions.Emissions - CAS_95-49-8 - kg/a
type: Concept
notation: WISE-SoE_Emissions.Emissions - CAS_95-49-8 - kg/a
definition: The unit of measure for 'CAS_95-49-8' (2-chlorotoluene) in WISE SoE - Emissions: Emissions table is 'kg/a'
status: valid
status modified: 2019-10-03
accepted date: 2019-10-03
in scheme: Definition of correct units for the observed determinands in the given WISE SoE DD tables
has determinand: CAS 95-49-8
has uom: kg.a-1
has table: WISE-SoE Emissions.Emissions

WISE-SoE_Emissions.Emissions - CAS_95-50-1 - kg/a
type: Concept
notation: WISE-SoE_Emissions.Emissions - CAS_95-50-1 - kg/a
definition: The unit of measure for 'CAS_95-50-1' (1,2-dichlorobenzene) in WISE SoE - Emissions: Emissions table is 'kg/a'
status: valid
status modified: 2019-10-03
accepted date: 2019-10-03
in scheme: Definition of correct units for the observed determinands in the given WISE SoE DD tables
has determinand: CAS 95-50-1
has uom: kg.a-1
has table: WISE-SoE Emissions.Emissions

WISE-SoE_Emissions.Emissions - CAS_95-51-2 - kg/a
type: Concept
notation: WISE-SoE_Emissions.Emissions - CAS_95-51-2 - kg/a
definition: The unit of measure for 'CAS_95-51-2' (2-chloroaniline) in WISE SoE - Emissions: Emissions table is 'kg/a'
status: valid
status modified: 2019-10-03
accepted date: 2019-10-03
in scheme: Definition of correct units for the observed determinands in the given WISE SoE DD tables
has determinand: CAS 95-51-2
has uom: kg.a-1
has table: WISE-SoE Emissions.Emissions

WISE-SoE_Emissions.Emissions - CAS_95-57-8 - kg/a
type: Concept
notation: WISE-SoE_Emissions.Emissions - CAS_95-57-8 - kg/a
definition: The unit of measure for 'CAS_95-57-8' (2-chlorophenol) in WISE SoE - Emissions: Emissions table is 'kg/a'
status: valid
status modified: 2019-10-03
accepted date: 2019-10-03
in scheme: Definition of correct units for the observed determinands in the given WISE SoE DD tables
has determinand: CAS 95-57-8
has uom: kg.a-1
has table: WISE-SoE Emissions.Emissions

WISE-SoE_Emissions.Emissions - CAS_95-63-6 - kg/a
type: Concept
notation: WISE-SoE_Emissions.Emissions - CAS_95-63-6 - kg/a
definition: The unit of measure for 'CAS_95-63-6' (1,2,4-trimethylbenzene) in WISE SoE - Emissions: Emissions table is 'kg/a'
status: valid
status modified: 2019-10-03
accepted date: 2019-10-03
in scheme: Definition of correct units for the observed determinands in the given WISE SoE DD tables
has determinand: CAS 95-63-6
has uom: kg.a-1
has table: WISE-SoE Emissions.Emissions

WISE-SoE_Emissions.Emissions - CAS_95-65-8 - kg/a
type: Concept
notation: WISE-SoE_Emissions.Emissions - CAS_95-65-8 - kg/a
definition: The unit of measure for 'CAS_95-65-8' (3,4-dimethyl-phenol) in WISE SoE - Emissions: Emissions table is 'kg/a'
status: valid
status modified: 2019-10-03
accepted date: 2019-10-03
in scheme: Definition of correct units for the observed determinands in the given WISE SoE DD tables
has determinand: CAS 95-65-8
has uom: kg.a-1
has table: WISE-SoE Emissions.Emissions

WISE-SoE_Emissions.Emissions - CAS_95-74-9 - kg/a
type: Concept
notation: WISE-SoE_Emissions.Emissions - CAS_95-74-9 - kg/a
definition: The unit of measure for 'CAS_95-74-9' (3-chloro-p-toluidine) in WISE SoE - Emissions: Emissions table is 'kg/a'
status: valid
status modified: 2019-10-03
accepted date: 2019-10-03
in scheme: Definition of correct units for the observed determinands in the given WISE SoE DD tables
has determinand: CAS 95-74-9
has uom: kg.a-1
has table: WISE-SoE Emissions.Emissions

WISE-SoE_Emissions.Emissions - CAS_95-76-1 - kg/a
type: Concept
notation: WISE-SoE_Emissions.Emissions - CAS_95-76-1 - kg/a
definition: The unit of measure for 'CAS_95-76-1' (3,4-dichloroaniline) in WISE SoE - Emissions: Emissions table is 'kg/a'
status: valid
status modified: 2019-10-03
accepted date: 2019-10-03
in scheme: Definition of correct units for the observed determinands in the given WISE SoE DD tables
has determinand: CAS 95-76-1
has uom: kg.a-1
has table: WISE-SoE Emissions.Emissions

WISE-SoE_Emissions.Emissions - CAS_95-79-4 - kg/a
type: Concept
notation: WISE-SoE_Emissions.Emissions - CAS_95-79-4 - kg/a
definition: The unit of measure for 'CAS_95-79-4' (5-chloro-o-toluidine) in WISE SoE - Emissions: Emissions table is 'kg/a'
status: valid
status modified: 2019-10-03
accepted date: 2019-10-03
in scheme: Definition of correct units for the observed determinands in the given WISE SoE DD tables
has determinand: CAS 95-79-4
has uom: kg.a-1
has table: WISE-SoE Emissions.Emissions

WISE-SoE_Emissions.Emissions - CAS_95-82-9 - kg/a
type: Concept
notation: WISE-SoE_Emissions.Emissions - CAS_95-82-9 - kg/a
definition: The unit of measure for 'CAS_95-82-9' (2,5-dichloroaniline) in WISE SoE - Emissions: Emissions table is 'kg/a'
status: valid
status modified: 2019-10-03
accepted date: 2019-10-03
in scheme: Definition of correct units for the observed determinands in the given WISE SoE DD tables
has determinand: CAS 95-82-9
has uom: kg.a-1
has table: WISE-SoE Emissions.Emissions

WISE-SoE_Emissions.Emissions - CAS_95-85-2 - kg/a
type: Concept
notation: WISE-SoE_Emissions.Emissions - CAS_95-85-2 - kg/a
definition: The unit of measure for 'CAS_95-85-2' (2-amino-4-chlorophenol) in WISE SoE - Emissions: Emissions table is 'kg/a'
status: valid
status modified: 2019-10-03
accepted date: 2019-10-03
in scheme: Definition of correct units for the observed determinands in the given WISE SoE DD tables
has determinand: CAS 95-85-2
has uom: kg.a-1
has table: WISE-SoE Emissions.Emissions

WISE-SoE_Emissions.Emissions - CAS_95-87-4 - kg/a
type: Concept
notation: WISE-SoE_Emissions.Emissions - CAS_95-87-4 - kg/a
definition: The unit of measure for 'CAS_95-87-4' (2,5-dimethylphenol) in WISE SoE - Emissions: Emissions table is 'kg/a'
status: valid
status modified: 2019-10-03
accepted date: 2019-10-03
in scheme: Definition of correct units for the observed determinands in the given WISE SoE DD tables
has determinand: CAS 95-87-4
has uom: kg.a-1
has table: WISE-SoE Emissions.Emissions

WISE-SoE_Emissions.Emissions - CAS_95-94-3 - kg/a
type: Concept
notation: WISE-SoE_Emissions.Emissions - CAS_95-94-3 - kg/a
definition: The unit of measure for 'CAS_95-94-3' (1,2,4,5-tetrachlorobenzene) in WISE SoE - Emissions: Emissions table is 'kg/a'
status: valid
status modified: 2019-10-03
accepted date: 2019-10-03
in scheme: Definition of correct units for the observed determinands in the given WISE SoE DD tables
has determinand: CAS 95-94-3
has uom: kg.a-1
has table: WISE-SoE Emissions.Emissions

WISE-SoE_Emissions.Emissions - CAS_95-95-4 - kg/a
type: Concept
notation: WISE-SoE_Emissions.Emissions - CAS_95-95-4 - kg/a
definition: The unit of measure for 'CAS_95-95-4' (2,4,5-trichlorophenol) in WISE SoE - Emissions: Emissions table is 'kg/a'
status: valid
status modified: 2019-10-03
accepted date: 2019-10-03
in scheme: Definition of correct units for the observed determinands in the given WISE SoE DD tables
has determinand: CAS 95-95-4
has uom: kg.a-1
has table: WISE-SoE Emissions.Emissions

WISE-SoE_Emissions.Emissions - CAS_950-37-8 - kg/a
type: Concept
notation: WISE-SoE_Emissions.Emissions - CAS_950-37-8 - kg/a
definition: The unit of measure for 'CAS_950-37-8' (Methidathion) in WISE SoE - Emissions: Emissions table is 'kg/a'
status: valid
status modified: 2019-10-03
accepted date: 2019-10-03
in scheme: Definition of correct units for the observed determinands in the given WISE SoE DD tables
has determinand: CAS 950-37-8
has uom: kg.a-1
has table: WISE-SoE Emissions.Emissions

WISE-SoE_Emissions.Emissions - CAS_95465-99-9 - kg/a
type: Concept
notation: WISE-SoE_Emissions.Emissions - CAS_95465-99-9 - kg/a
definition: The unit of measure for 'CAS_95465-99-9' (Cadusafos) in WISE SoE - Emissions: Emissions table is 'kg/a'
status: valid
status modified: 2019-10-03
accepted date: 2019-10-03
in scheme: Definition of correct units for the observed determinands in the given WISE SoE DD tables
has determinand: CAS 95465-99-9
has uom: kg.a-1
has table: WISE-SoE Emissions.Emissions

WISE-SoE_Emissions.Emissions - CAS_95617-09-7 - kg/a
type: Concept
notation: WISE-SoE_Emissions.Emissions - CAS_95617-09-7 - kg/a
definition: The unit of measure for 'CAS_95617-09-7' (Fenoxaprop) in WISE SoE - Emissions: Emissions table is 'kg/a'
status: valid
status modified: 2019-10-03
accepted date: 2019-10-03
in scheme: Definition of correct units for the observed determinands in the given WISE SoE DD tables
has determinand: CAS 95617-09-7
has uom: kg.a-1
has table: WISE-SoE Emissions.Emissions

WISE-SoE_Emissions.Emissions - CAS_959-98-8 - kg/a
type: Concept
notation: WISE-SoE_Emissions.Emissions - CAS_959-98-8 - kg/a
definition: The unit of measure for 'CAS_959-98-8' (Alpha-Endosulfan) in WISE SoE - Emissions: Emissions table is 'kg/a'
status: valid
status modified: 2019-10-03
accepted date: 2019-10-03
in scheme: Definition of correct units for the observed determinands in the given WISE SoE DD tables
has determinand: CAS 959-98-8
has uom: kg.a-1
has table: WISE-SoE Emissions.Emissions

WISE-SoE_Emissions.Emissions - CAS_96-12-8 - kg/a
type: Concept
notation: WISE-SoE_Emissions.Emissions - CAS_96-12-8 - kg/a
definition: The unit of measure for 'CAS_96-12-8' (1,2-dibromo-3-chloropropane) in WISE SoE - Emissions: Emissions table is 'kg/a'
status: valid
status modified: 2019-10-03
accepted date: 2019-10-03
in scheme: Definition of correct units for the observed determinands in the given WISE SoE DD tables
has determinand: CAS 96-12-8
has uom: kg.a-1
has table: WISE-SoE Emissions.Emissions

WISE-SoE_Emissions.Emissions - CAS_96-18-4 - kg/a
type: Concept
notation: WISE-SoE_Emissions.Emissions - CAS_96-18-4 - kg/a
definition: The unit of measure for 'CAS_96-18-4' (1,2,3-trichloropropane) in WISE SoE - Emissions: Emissions table is 'kg/a'
status: valid
status modified: 2019-10-03
accepted date: 2019-10-03
in scheme: Definition of correct units for the observed determinands in the given WISE SoE DD tables
has determinand: CAS 96-18-4
has uom: kg.a-1
has table: WISE-SoE Emissions.Emissions

WISE-SoE_Emissions.Emissions - CAS_96-23-1 - kg/a
type: Concept
notation: WISE-SoE_Emissions.Emissions - CAS_96-23-1 - kg/a
definition: The unit of measure for 'CAS_96-23-1' (1,3-dichloropropan-2-ol) in WISE SoE - Emissions: Emissions table is 'kg/a'
status: valid
status modified: 2019-10-03
accepted date: 2019-10-03
in scheme: Definition of correct units for the observed determinands in the given WISE SoE DD tables
has determinand: CAS 96-23-1
has uom: kg.a-1
has table: WISE-SoE Emissions.Emissions

WISE-SoE_Emissions.Emissions - CAS_96-45-7 - kg/a
type: Concept
notation: WISE-SoE_Emissions.Emissions - CAS_96-45-7 - kg/a
definition: The unit of measure for 'CAS_96-45-7' (Ethylenethiourea (ETU)) in WISE SoE - Emissions: Emissions table is 'kg/a'
status: valid
status modified: 2019-10-03
accepted date: 2019-10-03
in scheme: Definition of correct units for the observed determinands in the given WISE SoE DD tables
has determinand: CAS 96-45-7
has uom: kg.a-1
has table: WISE-SoE Emissions.Emissions

WISE-SoE_Emissions.Emissions - CAS_96489-71-3 - kg/a
type: Concept
notation: WISE-SoE_Emissions.Emissions - CAS_96489-71-3 - kg/a
definition: The unit of measure for 'CAS_96489-71-3' (Pyridaben) in WISE SoE - Emissions: Emissions table is 'kg/a'
status: valid
status modified: 2019-10-03
accepted date: 2019-10-03
in scheme: Definition of correct units for the observed determinands in the given WISE SoE DD tables
has determinand: CAS 96489-71-3
has uom: kg.a-1
has table: WISE-SoE Emissions.Emissions

WISE-SoE_Emissions.Emissions - CAS_97-00-7 - kg/a
type: Concept
notation: WISE-SoE_Emissions.Emissions - CAS_97-00-7 - kg/a
definition: The unit of measure for 'CAS_97-00-7' (1-chloro-2,4-dinitrobenzene) in WISE SoE - Emissions: Emissions table is 'kg/a'
status: valid
status modified: 2019-10-03
accepted date: 2019-10-03
in scheme: Definition of correct units for the observed determinands in the given WISE SoE DD tables
has determinand: CAS 97-00-7
has uom: kg.a-1
has table: WISE-SoE Emissions.Emissions

WISE-SoE_Emissions.Emissions - CAS_98-06-6 - kg/a
type: Concept
notation: WISE-SoE_Emissions.Emissions - CAS_98-06-6 - kg/a
definition: The unit of measure for 'CAS_98-06-6' (tert-butylbenzene) in WISE SoE - Emissions: Emissions table is 'kg/a'
status: valid
status modified: 2019-10-03
accepted date: 2019-10-03
in scheme: Definition of correct units for the observed determinands in the given WISE SoE DD tables
has determinand: CAS 98-06-6
has uom: kg.a-1
has table: WISE-SoE Emissions.Emissions

WISE-SoE_Emissions.Emissions - CAS_98-51-1 - kg/a
type: Concept
notation: WISE-SoE_Emissions.Emissions - CAS_98-51-1 - kg/a
definition: The unit of measure for 'CAS_98-51-1' (4-tert-butyltoluene) in WISE SoE - Emissions: Emissions table is 'kg/a'
status: valid
status modified: 2019-10-03
accepted date: 2019-10-03
in scheme: Definition of correct units for the observed determinands in the given WISE SoE DD tables
has determinand: CAS 98-51-1
has uom: kg.a-1
has table: WISE-SoE Emissions.Emissions

WISE-SoE_Emissions.Emissions - CAS_98-82-8 - kg/a
type: Concept
notation: WISE-SoE_Emissions.Emissions - CAS_98-82-8 - kg/a
definition: The unit of measure for 'CAS_98-82-8' (Isopropylbenzene) in WISE SoE - Emissions: Emissions table is 'kg/a'
status: valid
status modified: 2019-10-03
accepted date: 2019-10-03
in scheme: Definition of correct units for the observed determinands in the given WISE SoE DD tables
has determinand: CAS 98-82-8
has uom: kg.a-1
has table: WISE-SoE Emissions.Emissions

WISE-SoE_Emissions.Emissions - CAS_98-87-3 - kg/a
type: Concept
notation: WISE-SoE_Emissions.Emissions - CAS_98-87-3 - kg/a
definition: The unit of measure for 'CAS_98-87-3' (a,a-dichlorotoluene) in WISE SoE - Emissions: Emissions table is 'kg/a'
status: valid
status modified: 2019-10-03
accepted date: 2019-10-03
in scheme: Definition of correct units for the observed determinands in the given WISE SoE DD tables
has determinand: CAS 98-87-3
has uom: kg.a-1
has table: WISE-SoE Emissions.Emissions

WISE-SoE_Emissions.Emissions - CAS_98-95-3 - kg/a
type: Concept
notation: WISE-SoE_Emissions.Emissions - CAS_98-95-3 - kg/a
definition: The unit of measure for 'CAS_98-95-3' (Nitrobenzene) in WISE SoE - Emissions: Emissions table is 'kg/a'
status: valid
status modified: 2019-10-03
accepted date: 2019-10-03
in scheme: Definition of correct units for the observed determinands in the given WISE SoE DD tables
has determinand: CAS 98-95-3
has uom: kg.a-1
has table: WISE-SoE Emissions.Emissions

WISE-SoE_Emissions.Emissions - CAS_99-30-9 - kg/a
type: Concept
notation: WISE-SoE_Emissions.Emissions - CAS_99-30-9 - kg/a
definition: The unit of measure for 'CAS_99-30-9' (Dicloran) in WISE SoE - Emissions: Emissions table is 'kg/a'
status: valid
status modified: 2019-10-03
accepted date: 2019-10-03
in scheme: Definition of correct units for the observed determinands in the given WISE SoE DD tables
has determinand: CAS 99-30-9
has uom: kg.a-1
has table: WISE-SoE Emissions.Emissions

WISE-SoE_Emissions.Emissions - CAS_99-54-7 - kg/a
type: Concept
notation: WISE-SoE_Emissions.Emissions - CAS_99-54-7 - kg/a
definition: The unit of measure for 'CAS_99-54-7' (1,2-Dichloro-4-nitrobenzene) in WISE SoE - Emissions: Emissions table is 'kg/a'
status: valid
status modified: 2019-10-03
accepted date: 2019-10-03
in scheme: Definition of correct units for the observed determinands in the given WISE SoE DD tables
has determinand: CAS 99-54-7
has uom: kg.a-1
has table: WISE-SoE Emissions.Emissions

WISE-SoE_Emissions.Emissions - CAS_99-87-6 - kg/a
type: Concept
notation: WISE-SoE_Emissions.Emissions - CAS_99-87-6 - kg/a
definition: The unit of measure for 'CAS_99-87-6' (4-isopropyltoluene) in WISE SoE - Emissions: Emissions table is 'kg/a'
status: valid
status modified: 2019-10-03
accepted date: 2019-10-03
in scheme: Definition of correct units for the observed determinands in the given WISE SoE DD tables
has determinand: CAS 99-87-6
has uom: kg.a-1
has table: WISE-SoE Emissions.Emissions

WISE-SoE_Emissions.Emissions - CAS_99105-77-8 - kg/a
type: Concept
notation: WISE-SoE_Emissions.Emissions - CAS_99105-77-8 - kg/a
definition: The unit of measure for 'CAS_99105-77-8' (Sulcotrione) in WISE SoE - Emissions: Emissions table is 'kg/a'
status: valid
status modified: 2019-10-03
accepted date: 2019-10-03
in scheme: Definition of correct units for the observed determinands in the given WISE SoE DD tables
has determinand: CAS 99105-77-8
has uom: kg.a-1
has table: WISE-SoE Emissions.Emissions

WISE-SoE_Emissions.Emissions - CAS_994-05-8 - kg/a
type: Concept
notation: WISE-SoE_Emissions.Emissions - CAS_994-05-8 - kg/a
definition: The unit of measure for 'CAS_994-05-8' (TAME) in WISE SoE - Emissions: Emissions table is 'kg/a'
status: valid
status modified: 2019-10-03
accepted date: 2019-10-03
in scheme: Definition of correct units for the observed determinands in the given WISE SoE DD tables
has determinand: CAS 994-05-8
has uom: kg.a-1
has table: WISE-SoE Emissions.Emissions

WISE-SoE_Emissions.Emissions - CAS_999-81-5 - kg/a
type: Concept
notation: WISE-SoE_Emissions.Emissions - CAS_999-81-5 - kg/a
definition: The unit of measure for 'CAS_999-81-5' (Chlormequat chloride) in WISE SoE - Emissions: Emissions table is 'kg/a'
status: valid
status modified: 2019-10-03
accepted date: 2019-10-03
in scheme: Definition of correct units for the observed determinands in the given WISE SoE DD tables
has determinand: CAS 999-81-5
has uom: kg.a-1
has table: WISE-SoE Emissions.Emissions

WISE-SoE_Emissions.Emissions - EEA_00-00-0 - kg/a
type: Concept
notation: WISE-SoE_Emissions.Emissions - EEA_00-00-0 - kg/a
definition: The unit of measure for 'EEA_00-00-0' (Other chemical parameter) in WISE SoE - Emissions: Emissions table is 'kg/a'
status: valid
status modified: 2019-10-03
accepted date: 2019-10-03
in scheme: Definition of correct units for the observed determinands in the given WISE SoE DD tables
has determinand: EEA 00-00-0
has uom: kg.a-1
has table: WISE-SoE Emissions.Emissions

WISE-SoE_Emissions.Emissions - EEA_31-02-7 - t/a
type: Concept
notation: WISE-SoE_Emissions.Emissions - EEA_31-02-7 - t/a
definition: The unit of measure for 'EEA_31-02-7' (Total suspended solids) in WISE SoE - Emissions: Emissions table is 't/a'
status: valid
status modified: 2019-10-03
accepted date: 2019-10-03
in scheme: Definition of correct units for the observed determinands in the given WISE SoE DD tables
has determinand: EEA 31-02-7
has uom: t.a-1
has table: WISE-SoE Emissions.Emissions

WISE-SoE_Emissions.Emissions - EEA_3133-01-5 - t/a
type: Concept
notation: WISE-SoE_Emissions.Emissions - EEA_3133-01-5 - t/a
definition: The unit of measure for 'EEA_3133-01-5' (BOD5) in WISE SoE - Emissions: Emissions table is 't/a'
status: valid
status modified: 2019-10-03
accepted date: 2019-10-03
in scheme: Definition of correct units for the observed determinands in the given WISE SoE DD tables
has determinand: EEA 3133-01-5
has uom: t.a-1
has table: WISE-SoE Emissions.Emissions

WISE-SoE_Emissions.Emissions - EEA_3133-02-6 - t/a
type: Concept
notation: WISE-SoE_Emissions.Emissions - EEA_3133-02-6 - t/a
definition: The unit of measure for 'EEA_3133-02-6' (BOD7) in WISE SoE - Emissions: Emissions table is 't/a'
status: valid
status modified: 2019-10-03
accepted date: 2019-10-03
in scheme: Definition of correct units for the observed determinands in the given WISE SoE DD tables
has determinand: EEA 3133-02-6
has uom: t.a-1
has table: WISE-SoE Emissions.Emissions

WISE-SoE_Emissions.Emissions - EEA_3133-03-7 - t/a
type: Concept
notation: WISE-SoE_Emissions.Emissions - EEA_3133-03-7 - t/a
definition: The unit of measure for 'EEA_3133-03-7' (CODCr) in WISE SoE - Emissions: Emissions table is 't/a'
status: valid
status modified: 2019-10-03
accepted date: 2019-10-03
in scheme: Definition of correct units for the observed determinands in the given WISE SoE DD tables
has determinand: EEA 3133-03-7
has uom: t.a-1
has table: WISE-SoE Emissions.Emissions

WISE-SoE_Emissions.Emissions - EEA_3133-04-8 - t/a
type: Concept
notation: WISE-SoE_Emissions.Emissions - EEA_3133-04-8 - t/a
definition: The unit of measure for 'EEA_3133-04-8' (CODMn) in WISE SoE - Emissions: Emissions table is 't/a'
status: valid
status modified: 2019-10-03
accepted date: 2019-10-03
in scheme: Definition of correct units for the observed determinands in the given WISE SoE DD tables
has determinand: EEA 3133-04-8
has uom: t.a-1
has table: WISE-SoE Emissions.Emissions

WISE-SoE_Emissions.Emissions - EEA_3133-05-9 - kg/a
type: Concept
notation: WISE-SoE_Emissions.Emissions - EEA_3133-05-9 - kg/a
definition: The unit of measure for 'EEA_3133-05-9' (Dissolved organic carbon (DOC)) in WISE SoE - Emissions: Emissions table is 'kg/a'
status: valid
status modified: 2019-10-03
accepted date: 2019-10-03
in scheme: Definition of correct units for the observed determinands in the given WISE SoE DD tables
has determinand: EEA 3133-05-9
has uom: kg.a-1
has table: WISE-SoE Emissions.Emissions

WISE-SoE_Emissions.Emissions - EEA_3133-06-0 - t/a
type: Concept
notation: WISE-SoE_Emissions.Emissions - EEA_3133-06-0 - t/a
definition: The unit of measure for 'EEA_3133-06-0' (Total organic carbon (TOC)) in WISE SoE - Emissions: Emissions table is 't/a'
status: valid
status modified: 2019-10-03
accepted date: 2019-10-03
in scheme: Definition of correct units for the observed determinands in the given WISE SoE DD tables
has determinand: EEA 3133-06-0
has uom: t.a-1
has table: WISE-SoE Emissions.Emissions

WISE-SoE_Emissions.Emissions - EEA_3142-02-7 - t/a
type: Concept
notation: WISE-SoE_Emissions.Emissions - EEA_3142-02-7 - t/a
definition: The unit of measure for 'EEA_3142-02-7' (Chlorine Cl-) in WISE SoE - Emissions: Emissions table is 't/a'
status: valid
status modified: 2019-10-03
accepted date: 2019-10-03
in scheme: Definition of correct units for the observed determinands in the given WISE SoE DD tables
has determinand: EEA 3142-02-7
has uom: t.a-1
has table: WISE-SoE Emissions.Emissions

WISE-SoE_Emissions.Emissions - EEA_3161-02-2 - kg/a
type: Concept
notation: WISE-SoE_Emissions.Emissions - EEA_3161-02-2 - kg/a
definition: The unit of measure for 'EEA_3161-02-2' (Total oxidised nitrogen) in WISE SoE - Emissions: Emissions table is 'kg/a'
status: valid
status modified: 2019-10-03
accepted date: 2019-10-03
in scheme: Definition of correct units for the observed determinands in the given WISE SoE DD tables
has determinand: EEA 3161-02-2
has uom: kg.a-1
has table: WISE-SoE Emissions.Emissions

WISE-SoE_Emissions.Emissions - EEA_3161-03-3 - kg/a
type: Concept
notation: WISE-SoE_Emissions.Emissions - EEA_3161-03-3 - kg/a
definition: The unit of measure for 'EEA_3161-03-3' (Total organic nitrogen) in WISE SoE - Emissions: Emissions table is 'kg/a'
status: valid
status modified: 2019-10-03
accepted date: 2019-10-03
in scheme: Definition of correct units for the observed determinands in the given WISE SoE DD tables
has determinand: EEA 3161-03-3
has uom: kg.a-1
has table: WISE-SoE Emissions.Emissions

WISE-SoE_Emissions.Emissions - EEA_31613-01-1 - kg/a
type: Concept
notation: WISE-SoE_Emissions.Emissions - EEA_31613-01-1 - kg/a
definition: The unit of measure for 'EEA_31613-01-1' (Non-ionised ammonia) in WISE SoE - Emissions: Emissions table is 'kg/a'
status: valid
status modified: 2019-10-03
accepted date: 2019-10-03
in scheme: Definition of correct units for the observed determinands in the given WISE SoE DD tables
has determinand: EEA 31613-01-1
has uom: kg.a-1
has table: WISE-SoE Emissions.Emissions

WISE-SoE_Emissions.Emissions - EEA_31615-01-7 - t/a
type: Concept
notation: WISE-SoE_Emissions.Emissions - EEA_31615-01-7 - t/a
definition: The unit of measure for 'EEA_31615-01-7' (Total nitrogen) in WISE SoE - Emissions: Emissions table is 't/a'
status: valid
status modified: 2019-10-03
accepted date: 2019-10-03
in scheme: Definition of correct units for the observed determinands in the given WISE SoE DD tables
has determinand: EEA 31615-01-7
has uom: t.a-1
has table: WISE-SoE Emissions.Emissions

WISE-SoE_Emissions.Emissions - EEA_32-02-0 - kg/a
type: Concept
notation: WISE-SoE_Emissions.Emissions - EEA_32-02-0 - kg/a
definition: The unit of measure for 'EEA_32-02-0' (Total cyclodiene pesticides (aldrin + dieldrin + endrin + isodrin)) in WISE SoE - Emissions: Emissions table is 'kg/a'
status: valid
status modified: 2019-10-03
accepted date: 2019-10-03
in scheme: Definition of correct units for the observed determinands in the given WISE SoE DD tables
has determinand: EEA 32-02-0
has uom: kg.a-1
has table: WISE-SoE Emissions.Emissions

WISE-SoE_Emissions.Emissions - EEA_32-03-1 - kg/a
type: Concept
notation: WISE-SoE_Emissions.Emissions - EEA_32-03-1 - kg/a
definition: The unit of measure for 'EEA_32-03-1' (Total DDT (DDT, p,p' + DDT, o,p' + DDE, p,p' + DDD, p,p')) in WISE SoE - Emissions: Emissions table is 'kg/a'
status: valid
status modified: 2019-10-03
accepted date: 2019-10-03
in scheme: Definition of correct units for the observed determinands in the given WISE SoE DD tables
has determinand: EEA 32-03-1
has uom: kg.a-1
has table: WISE-SoE Emissions.Emissions

WISE-SoE_Emissions.Emissions - EEA_32-04-2 - kg/a
type: Concept
notation: WISE-SoE_Emissions.Emissions - EEA_32-04-2 - kg/a
definition: The unit of measure for 'EEA_32-04-2' (Brominated diphenylethers (congener numbers 28, 47, 99, 100, 153 and 154)) in WISE SoE - Emissions: Emissions table is 'kg/a'
status: valid
status modified: 2019-10-03
accepted date: 2019-10-03
in scheme: Definition of correct units for the observed determinands in the given WISE SoE DD tables
has determinand: EEA 32-04-2
has uom: kg.a-1
has table: WISE-SoE Emissions.Emissions

WISE-SoE_Emissions.Emissions - EEA_32-23-5 - kg/a
type: Concept
notation: WISE-SoE_Emissions.Emissions - EEA_32-23-5 - kg/a
definition: The unit of measure for 'EEA_32-23-5' (Total Benzo(b)fluor-anthene (CAS_205-99-2) + Benzo(k)fluor-anthene (CAS_207-08-9)) in WISE SoE - Emissions: Emissions table is 'kg/a'
status: valid
status modified: 2019-10-03
accepted date: 2019-10-03
in scheme: Definition of correct units for the observed determinands in the given WISE SoE DD tables
has determinand: EEA 32-23-5
has uom: kg.a-1
has table: WISE-SoE Emissions.Emissions

WISE-SoE_Emissions.Emissions - EEA_32-24-6 - kg/a
type: Concept
notation: WISE-SoE_Emissions.Emissions - EEA_32-24-6 - kg/a
definition: The unit of measure for 'EEA_32-24-6' (Total Benzo(g,h,i)perylene (CAS_191-24-2) + Indeno(1,2,3-cd)pyrene (CAS_193-39-5)) in WISE SoE - Emissions: Emissions table is 'kg/a'
status: valid
status modified: 2019-10-03
accepted date: 2019-10-03
in scheme: Definition of correct units for the observed determinands in the given WISE SoE DD tables
has determinand: EEA 32-24-6
has uom: kg.a-1
has table: WISE-SoE Emissions.Emissions

WISE-SoE_Emissions.Emissions - EEA_33-01-2 - kg/a
type: Concept
notation: WISE-SoE_Emissions.Emissions - EEA_33-01-2 - kg/a
definition: The unit of measure for 'EEA_33-01-2' (Alkalised benzene) in WISE SoE - Emissions: Emissions table is 'kg/a'
status: valid
status modified: 2019-10-03
accepted date: 2019-10-03
in scheme: Definition of correct units for the observed determinands in the given WISE SoE DD tables
has determinand: EEA 33-01-2
has uom: kg.a-1
has table: WISE-SoE Emissions.Emissions

WISE-SoE_Emissions.Emissions - EEA_33-02-3 - kg/a
type: Concept
notation: WISE-SoE_Emissions.Emissions - EEA_33-02-3 - kg/a
definition: The unit of measure for 'EEA_33-02-3' (Benzol) in WISE SoE - Emissions: Emissions table is 'kg/a'
status: valid
status modified: 2019-10-03
accepted date: 2019-10-03
in scheme: Definition of correct units for the observed determinands in the given WISE SoE DD tables
has determinand: EEA 33-02-3
has uom: kg.a-1
has table: WISE-SoE Emissions.Emissions

WISE-SoE_Emissions.Emissions - EEA_33-04-5 - kg/a
type: Concept
notation: WISE-SoE_Emissions.Emissions - EEA_33-04-5 - kg/a
definition: The unit of measure for 'EEA_33-04-5' (Brominated flame retardants) in WISE SoE - Emissions: Emissions table is 'kg/a'
status: valid
status modified: 2019-10-03
accepted date: 2019-10-03
in scheme: Definition of correct units for the observed determinands in the given WISE SoE DD tables
has determinand: EEA 33-04-5
has uom: kg.a-1
has table: WISE-SoE Emissions.Emissions

WISE-SoE_Emissions.Emissions - EEA_33-05-6 - kg/a
type: Concept
notation: WISE-SoE_Emissions.Emissions - EEA_33-05-6 - kg/a
definition: The unit of measure for 'EEA_33-05-6' (BTEX) in WISE SoE - Emissions: Emissions table is 'kg/a'
status: valid
status modified: 2019-10-03
accepted date: 2019-10-03
in scheme: Definition of correct units for the observed determinands in the given WISE SoE DD tables
has determinand: EEA 33-05-6
has uom: kg.a-1
has table: WISE-SoE Emissions.Emissions

WISE-SoE_Emissions.Emissions - EEA_33-06-7 - kg/a
type: Concept
notation: WISE-SoE_Emissions.Emissions - EEA_33-06-7 - kg/a
definition: The unit of measure for 'EEA_33-06-7' (Chlorinated benzene) in WISE SoE - Emissions: Emissions table is 'kg/a'
status: valid
status modified: 2019-10-03
accepted date: 2019-10-03
in scheme: Definition of correct units for the observed determinands in the given WISE SoE DD tables
has determinand: EEA 33-06-7
has uom: kg.a-1
has table: WISE-SoE Emissions.Emissions

WISE-SoE_Emissions.Emissions - EEA_33-07-8 - kg/a
type: Concept
notation: WISE-SoE_Emissions.Emissions - EEA_33-07-8 - kg/a
definition: The unit of measure for 'EEA_33-07-8' (Chlorinated phenol) in WISE SoE - Emissions: Emissions table is 'kg/a'
status: valid
status modified: 2019-10-03
accepted date: 2019-10-03
in scheme: Definition of correct units for the observed determinands in the given WISE SoE DD tables
has determinand: EEA 33-07-8
has uom: kg.a-1
has table: WISE-SoE Emissions.Emissions

WISE-SoE_Emissions.Emissions - EEA_33-08-9 - kg/a
type: Concept
notation: WISE-SoE_Emissions.Emissions - EEA_33-08-9 - kg/a
definition: The unit of measure for 'EEA_33-08-9' (Chromium (III)) in WISE SoE - Emissions: Emissions table is 'kg/a'
status: valid
status modified: 2019-10-03
accepted date: 2019-10-03
in scheme: Definition of correct units for the observed determinands in the given WISE SoE DD tables
has determinand: EEA 33-08-9
has uom: kg.a-1
has table: WISE-SoE Emissions.Emissions

WISE-SoE_Emissions.Emissions - EEA_33-09-0 - kg/a
type: Concept
notation: WISE-SoE_Emissions.Emissions - EEA_33-09-0 - kg/a
definition: The unit of measure for 'EEA_33-09-0' (Detergents) in WISE SoE - Emissions: Emissions table is 'kg/a'
status: valid
status modified: 2019-10-03
accepted date: 2019-10-03
in scheme: Definition of correct units for the observed determinands in the given WISE SoE DD tables
has determinand: EEA 33-09-0
has uom: kg.a-1
has table: WISE-SoE Emissions.Emissions

WISE-SoE_Emissions.Emissions - EEA_33-10-3 - kg/a
type: Concept
notation: WISE-SoE_Emissions.Emissions - EEA_33-10-3 - kg/a
definition: The unit of measure for 'EEA_33-10-3' (Dichlorobenzene) in WISE SoE - Emissions: Emissions table is 'kg/a'
status: valid
status modified: 2019-10-03
accepted date: 2019-10-03
in scheme: Definition of correct units for the observed determinands in the given WISE SoE DD tables
has determinand: EEA 33-10-3
has uom: kg.a-1
has table: WISE-SoE Emissions.Emissions

WISE-SoE_Emissions.Emissions - EEA_33-11-4 - kg/a
type: Concept
notation: WISE-SoE_Emissions.Emissions - EEA_33-11-4 - kg/a
definition: The unit of measure for 'EEA_33-11-4' (Dichlorophenol) in WISE SoE - Emissions: Emissions table is 'kg/a'
status: valid
status modified: 2019-10-03
accepted date: 2019-10-03
in scheme: Definition of correct units for the observed determinands in the given WISE SoE DD tables
has determinand: EEA 33-11-4
has uom: kg.a-1
has table: WISE-SoE Emissions.Emissions

WISE-SoE_Emissions.Emissions - EEA_33-13-6 - kg/a
type: Concept
notation: WISE-SoE_Emissions.Emissions - EEA_33-13-6 - kg/a
definition: The unit of measure for 'EEA_33-13-6' (DOX) in WISE SoE - Emissions: Emissions table is 'kg/a'
status: valid
status modified: 2019-10-03
accepted date: 2019-10-03
in scheme: Definition of correct units for the observed determinands in the given WISE SoE DD tables
has determinand: EEA 33-13-6
has uom: kg.a-1
has table: WISE-SoE Emissions.Emissions

WISE-SoE_Emissions.Emissions - EEA_33-14-7 - kg/a
type: Concept
notation: WISE-SoE_Emissions.Emissions - EEA_33-14-7 - kg/a
definition: The unit of measure for 'EEA_33-14-7' (Extractable organically bound chlorine) in WISE SoE - Emissions: Emissions table is 'kg/a'
status: valid
status modified: 2019-10-03
accepted date: 2019-10-03
in scheme: Definition of correct units for the observed determinands in the given WISE SoE DD tables
has determinand: EEA 33-14-7
has uom: kg.a-1
has table: WISE-SoE Emissions.Emissions

WISE-SoE_Emissions.Emissions - EEA_33-15-8 - kg/a
type: Concept
notation: WISE-SoE_Emissions.Emissions - EEA_33-15-8 - kg/a
definition: The unit of measure for 'EEA_33-15-8' (Halogenated organic compounds) in WISE SoE - Emissions: Emissions table is 'kg/a'
status: valid
status modified: 2019-10-03
accepted date: 2019-10-03
in scheme: Definition of correct units for the observed determinands in the given WISE SoE DD tables
has determinand: EEA 33-15-8
has uom: kg.a-1
has table: WISE-SoE Emissions.Emissions

WISE-SoE_Emissions.Emissions - EEA_33-17-0 - kg/a
type: Concept
notation: WISE-SoE_Emissions.Emissions - EEA_33-17-0 - kg/a
definition: The unit of measure for 'EEA_33-17-0' (Hydrocarbons) in WISE SoE - Emissions: Emissions table is 'kg/a'
status: valid
status modified: 2019-10-03
accepted date: 2019-10-03
in scheme: Definition of correct units for the observed determinands in the given WISE SoE DD tables
has determinand: EEA 33-17-0
has uom: kg.a-1
has table: WISE-SoE Emissions.Emissions

WISE-SoE_Emissions.Emissions - EEA_33-18-1 - kg/a
type: Concept
notation: WISE-SoE_Emissions.Emissions - EEA_33-18-1 - kg/a
definition: The unit of measure for 'EEA_33-18-1' (Meta xylene + para xylene) in WISE SoE - Emissions: Emissions table is 'kg/a'
status: valid
status modified: 2019-10-03
accepted date: 2019-10-03
in scheme: Definition of correct units for the observed determinands in the given WISE SoE DD tables
has determinand: EEA 33-18-1
has uom: kg.a-1
has table: WISE-SoE Emissions.Emissions

WISE-SoE_Emissions.Emissions - EEA_33-19-2 - kg/a
type: Concept
notation: WISE-SoE_Emissions.Emissions - EEA_33-19-2 - kg/a
definition: The unit of measure for 'EEA_33-19-2' (Mono basic phenols) in WISE SoE - Emissions: Emissions table is 'kg/a'
status: valid
status modified: 2019-10-03
accepted date: 2019-10-03
in scheme: Definition of correct units for the observed determinands in the given WISE SoE DD tables
has determinand: EEA 33-19-2
has uom: kg.a-1
has table: WISE-SoE Emissions.Emissions

WISE-SoE_Emissions.Emissions - EEA_33-20-5 - kg/a
type: Concept
notation: WISE-SoE_Emissions.Emissions - EEA_33-20-5 - kg/a
definition: The unit of measure for 'EEA_33-20-5' (Monochlorophenols) in WISE SoE - Emissions: Emissions table is 'kg/a'
status: valid
status modified: 2019-10-03
accepted date: 2019-10-03
in scheme: Definition of correct units for the observed determinands in the given WISE SoE DD tables
has determinand: EEA 33-20-5
has uom: kg.a-1
has table: WISE-SoE Emissions.Emissions

WISE-SoE_Emissions.Emissions - EEA_33-21-6 - kg/a
type: Concept
notation: WISE-SoE_Emissions.Emissions - EEA_33-21-6 - kg/a
definition: The unit of measure for 'EEA_33-21-6' (Nitrobenzene) in WISE SoE - Emissions: Emissions table is 'kg/a'
status: valid
status modified: 2019-10-03
accepted date: 2019-10-03
in scheme: Definition of correct units for the observed determinands in the given WISE SoE DD tables
has determinand: EEA 33-21-6
has uom: kg.a-1
has table: WISE-SoE Emissions.Emissions

WISE-SoE_Emissions.Emissions - EEA_33-22-7 - kg/a
type: Concept
notation: WISE-SoE_Emissions.Emissions - EEA_33-22-7 - kg/a
definition: The unit of measure for 'EEA_33-22-7' (Oil fractions (C10-40)) in WISE SoE - Emissions: Emissions table is 'kg/a'
status: valid
status modified: 2019-10-03
accepted date: 2019-10-03
in scheme: Definition of correct units for the observed determinands in the given WISE SoE DD tables
has determinand: EEA 33-22-7
has uom: kg.a-1
has table: WISE-SoE Emissions.Emissions

WISE-SoE_Emissions.Emissions - EEA_33-23-8 - kg/a
type: Concept
notation: WISE-SoE_Emissions.Emissions - EEA_33-23-8 - kg/a
definition: The unit of measure for 'EEA_33-23-8' (Petroleum hydrocarbons) in WISE SoE - Emissions: Emissions table is 'kg/a'
status: valid
status modified: 2019-10-03
accepted date: 2019-10-03
in scheme: Definition of correct units for the observed determinands in the given WISE SoE DD tables
has determinand: EEA 33-23-8
has uom: kg.a-1
has table: WISE-SoE Emissions.Emissions

WISE-SoE_Emissions.Emissions - EEA_33-24-9 - kg/a
type: Concept
notation: WISE-SoE_Emissions.Emissions - EEA_33-24-9 - kg/a
definition: The unit of measure for 'EEA_33-24-9' (Petroleum products) in WISE SoE - Emissions: Emissions table is 'kg/a'
status: valid
status modified: 2019-10-03
accepted date: 2019-10-03
in scheme: Definition of correct units for the observed determinands in the given WISE SoE DD tables
has determinand: EEA 33-24-9
has uom: kg.a-1
has table: WISE-SoE Emissions.Emissions

WISE-SoE_Emissions.Emissions - EEA_33-26-1 - kg/a
type: Concept
notation: WISE-SoE_Emissions.Emissions - EEA_33-26-1 - kg/a
definition: The unit of measure for 'EEA_33-26-1' (Polychlorinated dibenzodioxins (PCDD)) in WISE SoE - Emissions: Emissions table is 'kg/a'
status: valid
status modified: 2019-10-03
accepted date: 2019-10-03
in scheme: Definition of correct units for the observed determinands in the given WISE SoE DD tables
has determinand: EEA 33-26-1
has uom: kg.a-1
has table: WISE-SoE Emissions.Emissions

WISE-SoE_Emissions.Emissions - EEA_33-27-2 - kg/a
type: Concept
notation: WISE-SoE_Emissions.Emissions - EEA_33-27-2 - kg/a
definition: The unit of measure for 'EEA_33-27-2' (Radionuclides) in WISE SoE - Emissions: Emissions table is 'kg/a'
status: valid
status modified: 2019-10-03
accepted date: 2019-10-03
in scheme: Definition of correct units for the observed determinands in the given WISE SoE DD tables
has determinand: EEA 33-27-2
has uom: kg.a-1
has table: WISE-SoE Emissions.Emissions

WISE-SoE_Emissions.Emissions - EEA_33-28-3 - kg/a
type: Concept
notation: WISE-SoE_Emissions.Emissions - EEA_33-28-3 - kg/a
definition: The unit of measure for 'EEA_33-28-3' (Surfactants (anionic and nonionic)) in WISE SoE - Emissions: Emissions table is 'kg/a'
status: valid
status modified: 2019-10-03
accepted date: 2019-10-03
in scheme: Definition of correct units for the observed determinands in the given WISE SoE DD tables
has determinand: EEA 33-28-3
has uom: kg.a-1
has table: WISE-SoE Emissions.Emissions

WISE-SoE_Emissions.Emissions - EEA_33-29-4 - kg/a
type: Concept
notation: WISE-SoE_Emissions.Emissions - EEA_33-29-4 - kg/a
definition: The unit of measure for 'EEA_33-29-4' (Surfactants (anionic)) in WISE SoE - Emissions: Emissions table is 'kg/a'
status: valid
status modified: 2019-10-03
accepted date: 2019-10-03
in scheme: Definition of correct units for the observed determinands in the given WISE SoE DD tables
has determinand: EEA 33-29-4
has uom: kg.a-1
has table: WISE-SoE Emissions.Emissions

WISE-SoE_Emissions.Emissions - EEA_33-31-8 - kg/a
type: Concept
notation: WISE-SoE_Emissions.Emissions - EEA_33-31-8 - kg/a
definition: The unit of measure for 'EEA_33-31-8' (Total chrysene + triphenylene) in WISE SoE - Emissions: Emissions table is 'kg/a'
status: valid
status modified: 2019-10-03
accepted date: 2019-10-03
in scheme: Definition of correct units for the observed determinands in the given WISE SoE DD tables
has determinand: EEA 33-31-8
has uom: kg.a-1
has table: WISE-SoE Emissions.Emissions

WISE-SoE_Emissions.Emissions - EEA_33-32-9 - kg/a
type: Concept
notation: WISE-SoE_Emissions.Emissions - EEA_33-32-9 - kg/a
definition: The unit of measure for 'EEA_33-32-9' (Total DDD (DDD, o,p' + DDD, p,p')) in WISE SoE - Emissions: Emissions table is 'kg/a'
status: valid
status modified: 2019-10-03
accepted date: 2019-10-03
in scheme: Definition of correct units for the observed determinands in the given WISE SoE DD tables
has determinand: EEA 33-32-9
has uom: kg.a-1
has table: WISE-SoE Emissions.Emissions

WISE-SoE_Emissions.Emissions - EEA_33-36-3 - kg/a
type: Concept
notation: WISE-SoE_Emissions.Emissions - EEA_33-36-3 - kg/a
definition: The unit of measure for 'EEA_33-36-3' (Total hydrocarbons) in WISE SoE - Emissions: Emissions table is 'kg/a'
status: valid
status modified: 2019-10-03
accepted date: 2019-10-03
in scheme: Definition of correct units for the observed determinands in the given WISE SoE DD tables
has determinand: EEA 33-36-3
has uom: kg.a-1
has table: WISE-SoE Emissions.Emissions

WISE-SoE_Emissions.Emissions - EEA_33-38-5 - kg/a
type: Concept
notation: WISE-SoE_Emissions.Emissions - EEA_33-38-5 - kg/a
definition: The unit of measure for 'EEA_33-38-5' (Polychlorinated biphenyls (7 PCB: 28,52,101,118,138,153,180)) in WISE SoE - Emissions: Emissions table is 'kg/a'
status: valid
status modified: 2019-10-03
accepted date: 2019-10-03
in scheme: Definition of correct units for the observed determinands in the given WISE SoE DD tables
has determinand: EEA 33-38-5
has uom: kg.a-1
has table: WISE-SoE Emissions.Emissions

WISE-SoE_Emissions.Emissions - EEA_33-40-9 - kg/a
type: Concept
notation: WISE-SoE_Emissions.Emissions - EEA_33-40-9 - kg/a
definition: The unit of measure for 'EEA_33-40-9' (Total dioxins and furans (PCDD + PCDF)) in WISE SoE - Emissions: Emissions table is 'kg/a'
status: valid
status modified: 2019-10-03
accepted date: 2019-10-03
in scheme: Definition of correct units for the observed determinands in the given WISE SoE DD tables
has determinand: EEA 33-40-9
has uom: kg.a-1
has table: WISE-SoE Emissions.Emissions

WISE-SoE_Emissions.Emissions - EEA_33-41-0 - kg/a
type: Concept
notation: WISE-SoE_Emissions.Emissions - EEA_33-41-0 - kg/a
definition: The unit of measure for 'EEA_33-41-0' (Total tri-, tetra- and pentachlorophenol) in WISE SoE - Emissions: Emissions table is 'kg/a'
status: valid
status modified: 2019-10-03
accepted date: 2019-10-03
in scheme: Definition of correct units for the observed determinands in the given WISE SoE DD tables
has determinand: EEA 33-41-0
has uom: kg.a-1
has table: WISE-SoE Emissions.Emissions

WISE-SoE_Emissions.Emissions - EEA_33-42-1 - kg/a
type: Concept
notation: WISE-SoE_Emissions.Emissions - EEA_33-42-1 - kg/a
definition: The unit of measure for 'EEA_33-42-1' (Total trichloroethylene + tetrachloroethylene) in WISE SoE - Emissions: Emissions table is 'kg/a'
status: valid
status modified: 2019-10-03
accepted date: 2019-10-03
in scheme: Definition of correct units for the observed determinands in the given WISE SoE DD tables
has determinand: EEA 33-42-1
has uom: kg.a-1
has table: WISE-SoE Emissions.Emissions

WISE-SoE_Emissions.Emissions - EEA_33-43-2 - kg/a
type: Concept
notation: WISE-SoE_Emissions.Emissions - EEA_33-43-2 - kg/a
definition: The unit of measure for 'EEA_33-43-2' (Total trihalomethanes) in WISE SoE - Emissions: Emissions table is 'kg/a'
status: valid
status modified: 2019-10-03
accepted date: 2019-10-03
in scheme: Definition of correct units for the observed determinands in the given WISE SoE DD tables
has determinand: EEA 33-43-2
has uom: kg.a-1
has table: WISE-SoE Emissions.Emissions

WISE-SoE_Emissions.Emissions - EEA_33-44-3 - kg/a
type: Concept
notation: WISE-SoE_Emissions.Emissions - EEA_33-44-3 - kg/a
definition: The unit of measure for 'EEA_33-44-3' (Total highly volatile halogenated hydrocarbons) in WISE SoE - Emissions: Emissions table is 'kg/a'
status: valid
status modified: 2019-10-03
accepted date: 2019-10-03
in scheme: Definition of correct units for the observed determinands in the given WISE SoE DD tables
has determinand: EEA 33-44-3
has uom: kg.a-1
has table: WISE-SoE Emissions.Emissions

WISE-SoE_Emissions.Emissions - EEA_33-45-4 - kg/a
type: Concept
notation: WISE-SoE_Emissions.Emissions - EEA_33-45-4 - kg/a
definition: The unit of measure for 'EEA_33-45-4' (Volatile halogenated hydrocarbons (VHH)) in WISE SoE - Emissions: Emissions table is 'kg/a'
status: valid
status modified: 2019-10-03
accepted date: 2019-10-03
in scheme: Definition of correct units for the observed determinands in the given WISE SoE DD tables
has determinand: EEA 33-45-4
has uom: kg.a-1
has table: WISE-SoE Emissions.Emissions

WISE-SoE_Emissions.Emissions - EEA_33-46-5 - kg/a
type: Concept
notation: WISE-SoE_Emissions.Emissions - EEA_33-46-5 - kg/a
definition: The unit of measure for 'EEA_33-46-5' (Volatile organic halogens (VOX)) in WISE SoE - Emissions: Emissions table is 'kg/a'
status: valid
status modified: 2019-10-03
accepted date: 2019-10-03
in scheme: Definition of correct units for the observed determinands in the given WISE SoE DD tables
has determinand: EEA 33-46-5
has uom: kg.a-1
has table: WISE-SoE Emissions.Emissions

WISE-SoE_Emissions.Emissions - EEA_33-50-1 - kg/a
type: Concept
notation: WISE-SoE_Emissions.Emissions - EEA_33-50-1 - kg/a
definition: The unit of measure for 'EEA_33-50-1' (Heptachlor and heptachlor epoxide) in WISE SoE - Emissions: Emissions table is 'kg/a'
status: valid
status modified: 2019-10-03
accepted date: 2019-10-03
in scheme: Definition of correct units for the observed determinands in the given WISE SoE DD tables
has determinand: EEA 33-50-1
has uom: kg.a-1
has table: WISE-SoE Emissions.Emissions

WISE-SoE_Emissions.Emissions - EEA_33-51-2 - kg/a
type: Concept
notation: WISE-SoE_Emissions.Emissions - EEA_33-51-2 - kg/a
definition: The unit of measure for 'EEA_33-51-2' (Total macrolide antibiotics (erythromycin + clarithromycin + azithromycin)) in WISE SoE - Emissions: Emissions table is 'kg/a'
status: valid
status modified: 2019-10-03
accepted date: 2019-10-03
in scheme: Definition of correct units for the observed determinands in the given WISE SoE DD tables
has determinand: EEA 33-51-2
has uom: kg.a-1
has table: WISE-SoE Emissions.Emissions

WISE-SoE_Emissions.Emissions - EEA_33-52-3 - kg/a
type: Concept
notation: WISE-SoE_Emissions.Emissions - EEA_33-52-3 - kg/a
definition: The unit of measure for 'EEA_33-52-3' (Total neonicotinoid insecticides (imidacloprid + thiacloprid + thiamethoxam + clothianidin + acetamiprid)) in WISE SoE - Emissions: Emissions table is 'kg/a'
status: valid
status modified: 2019-10-03
accepted date: 2019-10-03
in scheme: Definition of correct units for the observed determinands in the given WISE SoE DD tables
has determinand: EEA 33-52-3
has uom: kg.a-1
has table: WISE-SoE Emissions.Emissions

WISE-SoE_Emissions.Emissions - EEA_33-53-4 - kg/a
type: Concept
notation: WISE-SoE_Emissions.Emissions - EEA_33-53-4 - kg/a
definition: The unit of measure for 'EEA_33-53-4' (Total Estrone (E1) + 17beta-estradiol (E2)) in WISE SoE - Emissions: Emissions table is 'kg/a'
status: valid
status modified: 2019-10-03
accepted date: 2019-10-03
in scheme: Definition of correct units for the observed determinands in the given WISE SoE DD tables
has determinand: EEA 33-53-4
has uom: kg.a-1
has table: WISE-SoE Emissions.Emissions

WISE-SoE_Emissions.Emissions - EEA_33-54-5 - kg/a
type: Concept
notation: WISE-SoE_Emissions.Emissions - EEA_33-54-5 - kg/a
definition: The unit of measure for 'EEA_33-54-5' (Dioxin-like polychlorinated biphenyls (12 PCB-DLs: 77,81,105,114,118,123,126,156,157,167,169,189)) in WISE SoE - Emissions: Emissions table is 'kg/a'
status: valid
status modified: 2019-10-03
accepted date: 2019-10-03
in scheme: Definition of correct units for the observed determinands in the given WISE SoE DD tables
has determinand: EEA 33-54-5
has uom: kg.a-1
has table: WISE-SoE Emissions.Emissions

WISE-SoE_Emissions.Emissions - EEA_33-55-6 - kg/a
type: Concept
notation: WISE-SoE_Emissions.Emissions - EEA_33-55-6 - kg/a
definition: The unit of measure for 'EEA_33-55-6' (Octylphenols (CAS 1806-26-4) including isomer 4-(1,1',3,3'-tetramethylbutyl)-phenol (CAS 140-66-9)) in WISE SoE - Emissions: Emissions table is 'kg/a'
status: valid
status modified: 2019-10-03
accepted date: 2019-10-03
in scheme: Definition of correct units for the observed determinands in the given WISE SoE DD tables
has determinand: EEA 33-55-6
has uom: kg.a-1
has table: WISE-SoE Emissions.Emissions

WISE-SoE_Emissions.Emissions - EEA_33-56-7 - kg/a
type: Concept
notation: WISE-SoE_Emissions.Emissions - EEA_33-56-7 - kg/a
definition: The unit of measure for 'EEA_33-56-7' (Total PAHs (Benzo(a)pyrene, Benzo(b)fluoranthene, Benzo(k)fluoranthene, Benzo(ghi)perylene, Indeno(1,2,3-cd)pyrene)) in WISE SoE - Emissions: Emissions table is 'kg/a'
status: valid
status modified: 2019-10-03
accepted date: 2019-10-03
in scheme: Definition of correct units for the observed determinands in the given WISE SoE DD tables
has determinand: EEA 33-56-7
has uom: kg.a-1
has table: WISE-SoE Emissions.Emissions

WISE-SoE_Emissions.Emissions - EEA_33-57-8 - kg/a
type: Concept
notation: WISE-SoE_Emissions.Emissions - EEA_33-57-8 - kg/a
definition: The unit of measure for 'EEA_33-57-8' (Hexabromocyclododecanes (HBCDD)) in WISE SoE - Emissions: Emissions table is 'kg/a'
status: valid
status modified: 2019-10-03
accepted date: 2019-10-03
in scheme: Definition of correct units for the observed determinands in the given WISE SoE DD tables
has determinand: EEA 33-57-8
has uom: kg.a-1
has table: WISE-SoE Emissions.Emissions

WISE-SoE_Emissions.Emissions - EEA_33-58-9 - kg/a
type: Concept
notation: WISE-SoE_Emissions.Emissions - EEA_33-58-9 - kg/a
definition: The unit of measure for 'EEA_33-58-9' (Dioxins and dioxin-like compounds (7 PCDDs + 10 PCDFs + 12 PCB-DLs)) in WISE SoE - Emissions: Emissions table is 'kg/a'
status: valid
status modified: 2019-10-03
accepted date: 2019-10-03
in scheme: Definition of correct units for the observed determinands in the given WISE SoE DD tables
has determinand: EEA 33-58-9
has uom: kg.a-1
has table: WISE-SoE Emissions.Emissions

WISE-SoE_Emissions.Emissions - EEA_33-59-0 - kg/a
type: Concept
notation: WISE-SoE_Emissions.Emissions - EEA_33-59-0 - kg/a
definition: The unit of measure for 'EEA_33-59-0' (Nonylphenol and nonylphenol ethoxylates (NP + NPEs)) in WISE SoE - Emissions: Emissions table is 'kg/a'
status: valid
status modified: 2019-10-03
accepted date: 2019-10-03
in scheme: Definition of correct units for the observed determinands in the given WISE SoE DD tables
has determinand: EEA 33-59-0
has uom: kg.a-1
has table: WISE-SoE Emissions.Emissions

WISE-SoE_Emissions.Emissions - EEA_33-60-3 - kg/a
type: Concept
notation: WISE-SoE_Emissions.Emissions - EEA_33-60-3 - kg/a
definition: The unit of measure for 'EEA_33-60-3' (Organotin compounds (as total Sn)) in WISE SoE - Emissions: Emissions table is 'kg/a'
status: valid
status modified: 2019-10-03
accepted date: 2019-10-03
in scheme: Definition of correct units for the observed determinands in the given WISE SoE DD tables
has determinand: EEA 33-60-3
has uom: kg.a-1
has table: WISE-SoE Emissions.Emissions

WISE-SoE_Emissions.Emissions - EEA_33-61-4 - kg/a
type: Concept
notation: WISE-SoE_Emissions.Emissions - EEA_33-61-4 - kg/a
definition: The unit of measure for 'EEA_33-61-4' (Triphenyltin and compounds) in WISE SoE - Emissions: Emissions table is 'kg/a'
status: valid
status modified: 2019-10-03
accepted date: 2019-10-03
in scheme: Definition of correct units for the observed determinands in the given WISE SoE DD tables
has determinand: EEA 33-61-4
has uom: kg.a-1
has table: WISE-SoE Emissions.Emissions

WISE-SoE_Emissions.Emissions - EEA_33-62-5 - kg/a
type: Concept
notation: WISE-SoE_Emissions.Emissions - EEA_33-62-5 - kg/a
definition: The unit of measure for 'EEA_33-62-5' (Total PAHs (4 PAHs: Benzo(a)pyrene, Benzo(b)fluoranthene, Benzo(k)fluoranthene, Indeno(1,2,3-cd)pyrene)) in WISE SoE - Emissions: Emissions table is 'kg/a'
status: valid
status modified: 2019-10-03
accepted date: 2019-10-03
in scheme: Definition of correct units for the observed determinands in the given WISE SoE DD tables
has determinand: EEA 33-62-5
has uom: kg.a-1
has table: WISE-SoE Emissions.Emissions

WISE-SoE_Emissions.Emissions - EEA_33-63-6 - kg/a
type: Concept
notation: WISE-SoE_Emissions.Emissions - EEA_33-63-6 - kg/a
definition: The unit of measure for 'EEA_33-63-6' (Total brominated diphenylethers (penta-BDE + octa-BDE + deca-BDE)) in WISE SoE - Emissions: Emissions table is 'kg/a'
status: valid
status modified: 2019-10-03
accepted date: 2019-10-03
in scheme: Definition of correct units for the observed determinands in the given WISE SoE DD tables
has determinand: EEA 33-63-6
has uom: kg.a-1
has table: WISE-SoE Emissions.Emissions

WISE-SoE_Emissions.Emissions - EEA_33-64-7 - kg/a
type: Concept
notation: WISE-SoE_Emissions.Emissions - EEA_33-64-7 - kg/a
definition: The unit of measure for 'EEA_33-64-7' (Total cyanide) in WISE SoE - Emissions: Emissions table is 'kg/a'
status: valid
status modified: 2019-10-03
accepted date: 2019-10-03
in scheme: Definition of correct units for the observed determinands in the given WISE SoE DD tables
has determinand: EEA 33-64-7
has uom: kg.a-1
has table: WISE-SoE Emissions.Emissions

WISE-SoE_Emissions.Emissions - EEA_33-65-8 - kg/a
type: Concept
notation: WISE-SoE_Emissions.Emissions - EEA_33-65-8 - kg/a
definition: The unit of measure for 'EEA_33-65-8' (Oxydemeton-methyl) in WISE SoE - Emissions: Emissions table is 'kg/a'
status: valid
status modified: 2019-10-03
accepted date: 2019-10-03
in scheme: Definition of correct units for the observed determinands in the given WISE SoE DD tables
has determinand: EEA 33-65-8
has uom: kg.a-1
has table: WISE-SoE Emissions.Emissions

WISE-SoE_Emissions.Emissions - EEA_34-01-5 - kg/a
type: Concept
notation: WISE-SoE_Emissions.Emissions - EEA_34-01-5 - kg/a
definition: The unit of measure for 'EEA_34-01-5' (Pesticides (Active substances in pesticides, including their relevant metabolites, degradation and reaction products)) in WISE SoE - Emissions: Emissions table is 'kg/a'
status: valid
status modified: 2019-10-03
accepted date: 2019-10-03
in scheme: Definition of correct units for the observed determinands in the given WISE SoE DD tables
has determinand: EEA 34-01-5
has uom: kg.a-1
has table: WISE-SoE Emissions.Emissions

WISE-SoE_WaterQuality.AggregatedData - CAS_100-00-5 - ug/L
type: Concept
notation: WISE-SoE_WaterQuality.AggregatedData - CAS_100-00-5 - ug/L
definition: The unit of measure for 'CAS_100-00-5' (1-chloro-4-nitrobenzene) in WISE SoE - Water Quality: Aggregated data table is 'ug/L'
status: valid
status modified: 2019-10-03
accepted date: 2019-10-03
in scheme: Definition of correct units for the observed determinands in the given WISE SoE DD tables
has determinand: CAS 100-00-5
has uom: ug.L-1
has table: WISE-SoE WaterQuality.AggregatedData

WISE-SoE_WaterQuality.AggregatedData - CAS_100-02-7 - ug/L
type: Concept
notation: WISE-SoE_WaterQuality.AggregatedData - CAS_100-02-7 - ug/L
definition: The unit of measure for 'CAS_100-02-7' (Nitrophenol) in WISE SoE - Water Quality: Aggregated data table is 'ug/L'
status: valid
status modified: 2019-10-03
accepted date: 2019-10-03
in scheme: Definition of correct units for the observed determinands in the given WISE SoE DD tables
has determinand: CAS 100-02-7
has uom: ug.L-1
has table: WISE-SoE WaterQuality.AggregatedData

WISE-SoE_WaterQuality.AggregatedData - CAS_100-41-4 - ug/L
type: Concept
notation: WISE-SoE_WaterQuality.AggregatedData - CAS_100-41-4 - ug/L
definition: The unit of measure for 'CAS_100-41-4' (Ethylbenzene) in WISE SoE - Water Quality: Aggregated data table is 'ug/L'
status: valid
status modified: 2019-10-03
accepted date: 2019-10-03
in scheme: Definition of correct units for the observed determinands in the given WISE SoE DD tables
has determinand: CAS 100-41-4
has uom: ug.L-1
has table: WISE-SoE WaterQuality.AggregatedData

WISE-SoE_WaterQuality.AggregatedData - CAS_100-42-5 - ug/L
type: Concept
notation: WISE-SoE_WaterQuality.AggregatedData - CAS_100-42-5 - ug/L
definition: The unit of measure for 'CAS_100-42-5' (Styrene) in WISE SoE - Water Quality: Aggregated data table is 'ug/L'
status: valid
status modified: 2019-10-03
accepted date: 2019-10-03
in scheme: Definition of correct units for the observed determinands in the given WISE SoE DD tables
has determinand: CAS 100-42-5
has uom: ug.L-1
has table: WISE-SoE WaterQuality.AggregatedData

WISE-SoE_WaterQuality.AggregatedData - CAS_100-44-7 - ug/L
type: Concept
notation: WISE-SoE_WaterQuality.AggregatedData - CAS_100-44-7 - ug/L
definition: The unit of measure for 'CAS_100-44-7' (Benzyl chloride) in WISE SoE - Water Quality: Aggregated data table is 'ug/L'
status: valid
status modified: 2019-10-03
accepted date: 2019-10-03
in scheme: Definition of correct units for the observed determinands in the given WISE SoE DD tables
has determinand: CAS 100-44-7
has uom: ug.L-1
has table: WISE-SoE WaterQuality.AggregatedData

WISE-SoE_WaterQuality.AggregatedData - CAS_1002-53-5 - ug/L
type: Concept
notation: WISE-SoE_WaterQuality.AggregatedData - CAS_1002-53-5 - ug/L
definition: The unit of measure for 'CAS_1002-53-5' (Dibutyltin) in WISE SoE - Water Quality: Aggregated data table is 'ug/L'
status: valid
status modified: 2019-10-03
accepted date: 2019-10-03
in scheme: Definition of correct units for the observed determinands in the given WISE SoE DD tables
has determinand: CAS 1002-53-5
has uom: ug.L-1
has table: WISE-SoE WaterQuality.AggregatedData

WISE-SoE_WaterQuality.AggregatedData - CAS_10028-17-8 - ug/L
type: Concept
notation: WISE-SoE_WaterQuality.AggregatedData - CAS_10028-17-8 - ug/L
definition: The unit of measure for 'CAS_10028-17-8' (Tritium) in WISE SoE - Water Quality: Aggregated data table is 'ug/L'
status: valid
status modified: 2019-10-03
accepted date: 2019-10-03
in scheme: Definition of correct units for the observed determinands in the given WISE SoE DD tables
has determinand: CAS 10028-17-8
has uom: ug.L-1
has table: WISE-SoE WaterQuality.AggregatedData

WISE-SoE_WaterQuality.AggregatedData - CAS_10061-01-5 - ug/L
type: Concept
notation: WISE-SoE_WaterQuality.AggregatedData - CAS_10061-01-5 - ug/L
definition: The unit of measure for 'CAS_10061-01-5' (cis-1,3-dichloropropene) in WISE SoE - Water Quality: Aggregated data table is 'ug/L'
status: valid
status modified: 2019-10-03
accepted date: 2019-10-03
in scheme: Definition of correct units for the observed determinands in the given WISE SoE DD tables
has determinand: CAS 10061-01-5
has uom: ug.L-1
has table: WISE-SoE WaterQuality.AggregatedData

WISE-SoE_WaterQuality.AggregatedData - CAS_10061-02-6 - ug/L
type: Concept
notation: WISE-SoE_WaterQuality.AggregatedData - CAS_10061-02-6 - ug/L
definition: The unit of measure for 'CAS_10061-02-6' (trans-1,3-dichloropropene) in WISE SoE - Water Quality: Aggregated data table is 'ug/L'
status: valid
status modified: 2019-10-03
accepted date: 2019-10-03
in scheme: Definition of correct units for the observed determinands in the given WISE SoE DD tables
has determinand: CAS 10061-02-6
has uom: ug.L-1
has table: WISE-SoE WaterQuality.AggregatedData

WISE-SoE_WaterQuality.AggregatedData - CAS_100646-51-3 - ug/L
type: Concept
notation: WISE-SoE_WaterQuality.AggregatedData - CAS_100646-51-3 - ug/L
definition: The unit of measure for 'CAS_100646-51-3' (Quizalofop-P-ethyl) in WISE SoE - Water Quality: Aggregated data table is 'ug/L'
status: valid
status modified: 2019-10-03
accepted date: 2019-10-03
in scheme: Definition of correct units for the observed determinands in the given WISE SoE DD tables
has determinand: CAS 100646-51-3
has uom: ug.L-1
has table: WISE-SoE WaterQuality.AggregatedData

WISE-SoE_WaterQuality.AggregatedData - CAS_1007-28-9 - ug/L
type: Concept
notation: WISE-SoE_WaterQuality.AggregatedData - CAS_1007-28-9 - ug/L
definition: The unit of measure for 'CAS_1007-28-9' (Desisopropylatrazine) in WISE SoE - Water Quality: Aggregated data table is 'ug/L'
status: valid
status modified: 2019-10-03
accepted date: 2019-10-03
in scheme: Definition of correct units for the observed determinands in the given WISE SoE DD tables
has determinand: CAS 1007-28-9
has uom: ug.L-1
has table: WISE-SoE WaterQuality.AggregatedData

WISE-SoE_WaterQuality.AggregatedData - CAS_101-21-3 - ug/L
type: Concept
notation: WISE-SoE_WaterQuality.AggregatedData - CAS_101-21-3 - ug/L
definition: The unit of measure for 'CAS_101-21-3' (Chlorpropham) in WISE SoE - Water Quality: Aggregated data table is 'ug/L'
status: valid
status modified: 2019-10-03
accepted date: 2019-10-03
in scheme: Definition of correct units for the observed determinands in the given WISE SoE DD tables
has determinand: CAS 101-21-3
has uom: ug.L-1
has table: WISE-SoE WaterQuality.AggregatedData

WISE-SoE_WaterQuality.AggregatedData - CAS_101-42-8 - ug/L
type: Concept
notation: WISE-SoE_WaterQuality.AggregatedData - CAS_101-42-8 - ug/L
definition: The unit of measure for 'CAS_101-42-8' (Fenuron) in WISE SoE - Water Quality: Aggregated data table is 'ug/L'
status: valid
status modified: 2019-10-03
accepted date: 2019-10-03
in scheme: Definition of correct units for the observed determinands in the given WISE SoE DD tables
has determinand: CAS 101-42-8
has uom: ug.L-1
has table: WISE-SoE WaterQuality.AggregatedData

WISE-SoE_WaterQuality.AggregatedData - CAS_101-55-3 - ug/L
type: Concept
notation: WISE-SoE_WaterQuality.AggregatedData - CAS_101-55-3 - ug/L
definition: The unit of measure for 'CAS_101-55-3' (4-bromophenyl phenyl ether) in WISE SoE - Water Quality: Aggregated data table is 'ug/L'
status: valid
status modified: 2019-10-03
accepted date: 2019-10-03
in scheme: Definition of correct units for the observed determinands in the given WISE SoE DD tables
has determinand: CAS 101-55-3
has uom: ug.L-1
has table: WISE-SoE WaterQuality.AggregatedData

WISE-SoE_WaterQuality.AggregatedData - CAS_101205-02-1 - ug/L
type: Concept
notation: WISE-SoE_WaterQuality.AggregatedData - CAS_101205-02-1 - ug/L
definition: The unit of measure for 'CAS_101205-02-1' (Cycloxydim) in WISE SoE - Water Quality: Aggregated data table is 'ug/L'
status: valid
status modified: 2019-10-03
accepted date: 2019-10-03
in scheme: Definition of correct units for the observed determinands in the given WISE SoE DD tables
has determinand: CAS 101205-02-1
has uom: ug.L-1
has table: WISE-SoE WaterQuality.AggregatedData

WISE-SoE_WaterQuality.AggregatedData - CAS_1014-69-3 - ug/L
type: Concept
notation: WISE-SoE_WaterQuality.AggregatedData - CAS_1014-69-3 - ug/L
definition: The unit of measure for 'CAS_1014-69-3' (Desmetryn) in WISE SoE - Water Quality: Aggregated data table is 'ug/L'
status: valid
status modified: 2019-10-03
accepted date: 2019-10-03
in scheme: Definition of correct units for the observed determinands in the given WISE SoE DD tables
has determinand: CAS 1014-69-3
has uom: ug.L-1
has table: WISE-SoE WaterQuality.AggregatedData

WISE-SoE_WaterQuality.AggregatedData - CAS_1024-57-3 - ug/L
type: Concept
notation: WISE-SoE_WaterQuality.AggregatedData - CAS_1024-57-3 - ug/L
definition: The unit of measure for 'CAS_1024-57-3' (Heptachlor epoxide) in WISE SoE - Water Quality: Aggregated data table is 'ug/L'
status: valid
status modified: 2019-10-03
accepted date: 2019-10-03
in scheme: Definition of correct units for the observed determinands in the given WISE SoE DD tables
has determinand: CAS 1024-57-3
has uom: ug.L-1
has table: WISE-SoE WaterQuality.AggregatedData

WISE-SoE_WaterQuality.AggregatedData - CAS_10265-92-6 - ug/L
type: Concept
notation: WISE-SoE_WaterQuality.AggregatedData - CAS_10265-92-6 - ug/L
definition: The unit of measure for 'CAS_10265-92-6' (Methamidophos) in WISE SoE - Water Quality: Aggregated data table is 'ug/L'
status: valid
status modified: 2019-10-03
accepted date: 2019-10-03
in scheme: Definition of correct units for the observed determinands in the given WISE SoE DD tables
has determinand: CAS 10265-92-6
has uom: ug.L-1
has table: WISE-SoE WaterQuality.AggregatedData

WISE-SoE_WaterQuality.AggregatedData - CAS_103-65-1 - ug/L
type: Concept
notation: WISE-SoE_WaterQuality.AggregatedData - CAS_103-65-1 - ug/L
definition: The unit of measure for 'CAS_103-65-1' (n-propylbenzene) in WISE SoE - Water Quality: Aggregated data table is 'ug/L'
status: valid
status modified: 2019-10-03
accepted date: 2019-10-03
in scheme: Definition of correct units for the observed determinands in the given WISE SoE DD tables
has determinand: CAS 103-65-1
has uom: ug.L-1
has table: WISE-SoE WaterQuality.AggregatedData

WISE-SoE_WaterQuality.AggregatedData - CAS_1031-07-8 - ug/L
type: Concept
notation: WISE-SoE_WaterQuality.AggregatedData - CAS_1031-07-8 - ug/L
definition: The unit of measure for 'CAS_1031-07-8' (Endosulfan sulfate) in WISE SoE - Water Quality: Aggregated data table is 'ug/L'
status: valid
status modified: 2019-10-03
accepted date: 2019-10-03
in scheme: Definition of correct units for the observed determinands in the given WISE SoE DD tables
has determinand: CAS 1031-07-8
has uom: ug.L-1
has table: WISE-SoE WaterQuality.AggregatedData

WISE-SoE_WaterQuality.AggregatedData - CAS_104-40-5 - ug/L
type: Concept
notation: WISE-SoE_WaterQuality.AggregatedData - CAS_104-40-5 - ug/L
definition: The unit of measure for 'CAS_104-40-5' (4-nonylphenol) in WISE SoE - Water Quality: Aggregated data table is 'ug/L'
status: valid
status modified: 2019-10-03
accepted date: 2019-10-03
in scheme: Definition of correct units for the observed determinands in the given WISE SoE DD tables
has determinand: CAS 104-40-5
has uom: ug.L-1
has table: WISE-SoE WaterQuality.AggregatedData

WISE-SoE_WaterQuality.AggregatedData - CAS_104-51-8 - ug/L
type: Concept
notation: WISE-SoE_WaterQuality.AggregatedData - CAS_104-51-8 - ug/L
definition: The unit of measure for 'CAS_104-51-8' (n-butylbenzene) in WISE SoE - Water Quality: Aggregated data table is 'ug/L'
status: valid
status modified: 2019-10-03
accepted date: 2019-10-03
in scheme: Definition of correct units for the observed determinands in the given WISE SoE DD tables
has determinand: CAS 104-51-8
has uom: ug.L-1
has table: WISE-SoE WaterQuality.AggregatedData

WISE-SoE_WaterQuality.AggregatedData - CAS_104206-82-8 - ug/L
type: Concept
notation: WISE-SoE_WaterQuality.AggregatedData - CAS_104206-82-8 - ug/L
definition: The unit of measure for 'CAS_104206-82-8' (Mesotrione) in WISE SoE - Water Quality: Aggregated data table is 'ug/L'
status: valid
status modified: 2019-10-03
accepted date: 2019-10-03
in scheme: Definition of correct units for the observed determinands in the given WISE SoE DD tables
has determinand: CAS 104206-82-8
has uom: ug.L-1
has table: WISE-SoE WaterQuality.AggregatedData

WISE-SoE_WaterQuality.AggregatedData - CAS_105-67-9 - ug/L
type: Concept
notation: WISE-SoE_WaterQuality.AggregatedData - CAS_105-67-9 - ug/L
definition: The unit of measure for 'CAS_105-67-9' (2,4-dimethyl-phenol) in WISE SoE - Water Quality: Aggregated data table is 'ug/L'
status: valid
status modified: 2019-10-03
accepted date: 2019-10-03
in scheme: Definition of correct units for the observed determinands in the given WISE SoE DD tables
has determinand: CAS 105-67-9
has uom: ug.L-1
has table: WISE-SoE WaterQuality.AggregatedData

WISE-SoE_WaterQuality.AggregatedData - CAS_105827-78-9 - ug/L
type: Concept
notation: WISE-SoE_WaterQuality.AggregatedData - CAS_105827-78-9 - ug/L
definition: The unit of measure for 'CAS_105827-78-9' (Imidacloprid (Watch list only alternative code)) in WISE SoE - Water Quality: Aggregated data table is 'ug/L'
status: valid
status modified: 2019-10-03
accepted date: 2019-10-03
in scheme: Definition of correct units for the observed determinands in the given WISE SoE DD tables
has determinand: CAS 105827-78-9
has uom: ug.L-1
has table: WISE-SoE WaterQuality.AggregatedData

WISE-SoE_WaterQuality.AggregatedData - CAS_10599-90-3 - ug/L
type: Concept
notation: WISE-SoE_WaterQuality.AggregatedData - CAS_10599-90-3 - ug/L
definition: The unit of measure for 'CAS_10599-90-3' (Chloramide) in WISE SoE - Water Quality: Aggregated data table is 'ug/L'
status: valid
status modified: 2019-10-03
accepted date: 2019-10-03
in scheme: Definition of correct units for the observed determinands in the given WISE SoE DD tables
has determinand: CAS 10599-90-3
has uom: ug.L-1
has table: WISE-SoE WaterQuality.AggregatedData

WISE-SoE_WaterQuality.AggregatedData - CAS_106-42-3 - ug/L
type: Concept
notation: WISE-SoE_WaterQuality.AggregatedData - CAS_106-42-3 - ug/L
definition: The unit of measure for 'CAS_106-42-3' (P-xylene) in WISE SoE - Water Quality: Aggregated data table is 'ug/L'
status: valid
status modified: 2019-10-03
accepted date: 2019-10-03
in scheme: Definition of correct units for the observed determinands in the given WISE SoE DD tables
has determinand: CAS 106-42-3
has uom: ug.L-1
has table: WISE-SoE WaterQuality.AggregatedData

WISE-SoE_WaterQuality.AggregatedData - CAS_106-43-4 - ug/L
type: Concept
notation: WISE-SoE_WaterQuality.AggregatedData - CAS_106-43-4 - ug/L
definition: The unit of measure for 'CAS_106-43-4' (4-chlorotoluene) in WISE SoE - Water Quality: Aggregated data table is 'ug/L'
status: valid
status modified: 2019-10-03
accepted date: 2019-10-03
in scheme: Definition of correct units for the observed determinands in the given WISE SoE DD tables
has determinand: CAS 106-43-4
has uom: ug.L-1
has table: WISE-SoE WaterQuality.AggregatedData

WISE-SoE_WaterQuality.AggregatedData - CAS_106-44-5 - ug/L
type: Concept
notation: WISE-SoE_WaterQuality.AggregatedData - CAS_106-44-5 - ug/L
definition: The unit of measure for 'CAS_106-44-5' (4-methyl-phenol) in WISE SoE - Water Quality: Aggregated data table is 'ug/L'
status: valid
status modified: 2019-10-03
accepted date: 2019-10-03
in scheme: Definition of correct units for the observed determinands in the given WISE SoE DD tables
has determinand: CAS 106-44-5
has uom: ug.L-1
has table: WISE-SoE WaterQuality.AggregatedData

WISE-SoE_WaterQuality.AggregatedData - CAS_106-46-7 - ug/L
type: Concept
notation: WISE-SoE_WaterQuality.AggregatedData - CAS_106-46-7 - ug/L
definition: The unit of measure for 'CAS_106-46-7' (1,4-dichlorobenzene) in WISE SoE - Water Quality: Aggregated data table is 'ug/L'
status: valid
status modified: 2019-10-03
accepted date: 2019-10-03
in scheme: Definition of correct units for the observed determinands in the given WISE SoE DD tables
has determinand: CAS 106-46-7
has uom: ug.L-1
has table: WISE-SoE WaterQuality.AggregatedData

WISE-SoE_WaterQuality.AggregatedData - CAS_106-47-8 - ug/L
type: Concept
notation: WISE-SoE_WaterQuality.AggregatedData - CAS_106-47-8 - ug/L
definition: The unit of measure for 'CAS_106-47-8' (4-chloroaniline) in WISE SoE - Water Quality: Aggregated data table is 'ug/L'
status: valid
status modified: 2019-10-03
accepted date: 2019-10-03
in scheme: Definition of correct units for the observed determinands in the given WISE SoE DD tables
has determinand: CAS 106-47-8
has uom: ug.L-1
has table: WISE-SoE WaterQuality.AggregatedData

WISE-SoE_WaterQuality.AggregatedData - CAS_106-48-9 - ug/L
type: Concept
notation: WISE-SoE_WaterQuality.AggregatedData - CAS_106-48-9 - ug/L
definition: The unit of measure for 'CAS_106-48-9' (4-chlorophenol) in WISE SoE - Water Quality: Aggregated data table is 'ug/L'
status: valid
status modified: 2019-10-03
accepted date: 2019-10-03
in scheme: Definition of correct units for the observed determinands in the given WISE SoE DD tables
has determinand: CAS 106-48-9
has uom: ug.L-1
has table: WISE-SoE WaterQuality.AggregatedData

WISE-SoE_WaterQuality.AggregatedData - CAS_106-89-8 - ug/L
type: Concept
notation: WISE-SoE_WaterQuality.AggregatedData - CAS_106-89-8 - ug/L
definition: The unit of measure for 'CAS_106-89-8' (Epichlorohydrin) in WISE SoE - Water Quality: Aggregated data table is 'ug/L'
status: valid
status modified: 2019-10-03
accepted date: 2019-10-03
in scheme: Definition of correct units for the observed determinands in the given WISE SoE DD tables
has determinand: CAS 106-89-8
has uom: ug.L-1
has table: WISE-SoE WaterQuality.AggregatedData

WISE-SoE_WaterQuality.AggregatedData - CAS_106-93-4 - ug/L
type: Concept
notation: WISE-SoE_WaterQuality.AggregatedData - CAS_106-93-4 - ug/L
definition: The unit of measure for 'CAS_106-93-4' (1,2-dibromoethane) in WISE SoE - Water Quality: Aggregated data table is 'ug/L'
status: valid
status modified: 2019-10-03
accepted date: 2019-10-03
in scheme: Definition of correct units for the observed determinands in the given WISE SoE DD tables
has determinand: CAS 106-93-4
has uom: ug.L-1
has table: WISE-SoE WaterQuality.AggregatedData

WISE-SoE_WaterQuality.AggregatedData - CAS_10605-21-7 - ug/L
type: Concept
notation: WISE-SoE_WaterQuality.AggregatedData - CAS_10605-21-7 - ug/L
definition: The unit of measure for 'CAS_10605-21-7' (Carbendazim) in WISE SoE - Water Quality: Aggregated data table is 'ug/L'
status: valid
status modified: 2019-10-03
accepted date: 2019-10-03
in scheme: Definition of correct units for the observed determinands in the given WISE SoE DD tables
has determinand: CAS 10605-21-7
has uom: ug.L-1
has table: WISE-SoE WaterQuality.AggregatedData

WISE-SoE_WaterQuality.AggregatedData - CAS_1066-51-9 - ug/L
type: Concept
notation: WISE-SoE_WaterQuality.AggregatedData - CAS_1066-51-9 - ug/L
definition: The unit of measure for 'CAS_1066-51-9' (Aminomethylphosphonic acid (AMPA)) in WISE SoE - Water Quality: Aggregated data table is 'ug/L'
status: valid
status modified: 2019-10-03
accepted date: 2019-10-03
in scheme: Definition of correct units for the observed determinands in the given WISE SoE DD tables
has determinand: CAS 1066-51-9
has uom: ug.L-1
has table: WISE-SoE WaterQuality.AggregatedData

WISE-SoE_WaterQuality.AggregatedData - CAS_106700-29-2 - ug/L
type: Concept
notation: WISE-SoE_WaterQuality.AggregatedData - CAS_106700-29-2 - ug/L
definition: The unit of measure for 'CAS_106700-29-2' (Pethoxamid) in WISE SoE - Water Quality: Aggregated data table is 'ug/L'
status: valid
status modified: 2019-10-03
accepted date: 2019-10-03
in scheme: Definition of correct units for the observed determinands in the given WISE SoE DD tables
has determinand: CAS 106700-29-2
has uom: ug.L-1
has table: WISE-SoE WaterQuality.AggregatedData

WISE-SoE_WaterQuality.AggregatedData - CAS_107-05-1 - ug/L
type: Concept
notation: WISE-SoE_WaterQuality.AggregatedData - CAS_107-05-1 - ug/L
definition: The unit of measure for 'CAS_107-05-1' (3-chloropropene) in WISE SoE - Water Quality: Aggregated data table is 'ug/L'
status: valid
status modified: 2019-10-03
accepted date: 2019-10-03
in scheme: Definition of correct units for the observed determinands in the given WISE SoE DD tables
has determinand: CAS 107-05-1
has uom: ug.L-1
has table: WISE-SoE WaterQuality.AggregatedData

WISE-SoE_WaterQuality.AggregatedData - CAS_107-06-2 - ug/L
type: Concept
notation: WISE-SoE_WaterQuality.AggregatedData - CAS_107-06-2 - ug/L
definition: The unit of measure for 'CAS_107-06-2' (1,2-dichloroethane) in WISE SoE - Water Quality: Aggregated data table is 'ug/L'
status: valid
status modified: 2019-10-03
accepted date: 2019-10-03
in scheme: Definition of correct units for the observed determinands in the given WISE SoE DD tables
has determinand: CAS 107-06-2
has uom: ug.L-1
has table: WISE-SoE WaterQuality.AggregatedData

WISE-SoE_WaterQuality.AggregatedData - CAS_107-07-3 - ug/L
type: Concept
notation: WISE-SoE_WaterQuality.AggregatedData - CAS_107-07-3 - ug/L
definition: The unit of measure for 'CAS_107-07-3' (2-Chloroethanol) in WISE SoE - Water Quality: Aggregated data table is 'ug/L'
status: valid
status modified: 2019-10-03
accepted date: 2019-10-03
in scheme: Definition of correct units for the observed determinands in the given WISE SoE DD tables
has determinand: CAS 107-07-3
has uom: ug.L-1
has table: WISE-SoE WaterQuality.AggregatedData

WISE-SoE_WaterQuality.AggregatedData - CAS_107-13-1 - ug/L
type: Concept
notation: WISE-SoE_WaterQuality.AggregatedData - CAS_107-13-1 - ug/L
definition: The unit of measure for 'CAS_107-13-1' (Acrylonitrile) in WISE SoE - Water Quality: Aggregated data table is 'ug/L'
status: valid
status modified: 2019-10-03
accepted date: 2019-10-03
in scheme: Definition of correct units for the observed determinands in the given WISE SoE DD tables
has determinand: CAS 107-13-1
has uom: ug.L-1
has table: WISE-SoE WaterQuality.AggregatedData

WISE-SoE_WaterQuality.AggregatedData - CAS_107-46-0 - ug/L
type: Concept
notation: WISE-SoE_WaterQuality.AggregatedData - CAS_107-46-0 - ug/L
definition: The unit of measure for 'CAS_107-46-0' (Hexamethyldisiloxane (HMDS)) in WISE SoE - Water Quality: Aggregated data table is 'ug/L'
status: valid
status modified: 2019-10-03
accepted date: 2019-10-03
in scheme: Definition of correct units for the observed determinands in the given WISE SoE DD tables
has determinand: CAS 107-46-0
has uom: ug.L-1
has table: WISE-SoE WaterQuality.AggregatedData

WISE-SoE_WaterQuality.AggregatedData - CAS_1070-78-6 - ug/L
type: Concept
notation: WISE-SoE_WaterQuality.AggregatedData - CAS_1070-78-6 - ug/L
definition: The unit of measure for 'CAS_1070-78-6' (1,1,1,3-tetrachloropropane) in WISE SoE - Water Quality: Aggregated data table is 'ug/L'
status: valid
status modified: 2019-10-03
accepted date: 2019-10-03
in scheme: Definition of correct units for the observed determinands in the given WISE SoE DD tables
has determinand: CAS 1070-78-6
has uom: ug.L-1
has table: WISE-SoE WaterQuality.AggregatedData

WISE-SoE_WaterQuality.AggregatedData - CAS_1071-83-6 - ug/L
type: Concept
notation: WISE-SoE_WaterQuality.AggregatedData - CAS_1071-83-6 - ug/L
definition: The unit of measure for 'CAS_1071-83-6' (Glyphosate) in WISE SoE - Water Quality: Aggregated data table is 'ug/L'
status: valid
status modified: 2019-10-03
accepted date: 2019-10-03
in scheme: Definition of correct units for the observed determinands in the given WISE SoE DD tables
has determinand: CAS 1071-83-6
has uom: ug.L-1
has table: WISE-SoE WaterQuality.AggregatedData

WISE-SoE_WaterQuality.AggregatedData - CAS_107534-96-3 - ug/L
type: Concept
notation: WISE-SoE_WaterQuality.AggregatedData - CAS_107534-96-3 - ug/L
definition: The unit of measure for 'CAS_107534-96-3' (Tebuconazole) in WISE SoE - Water Quality: Aggregated data table is 'ug/L'
status: valid
status modified: 2019-10-03
accepted date: 2019-10-03
in scheme: Definition of correct units for the observed determinands in the given WISE SoE DD tables
has determinand: CAS 107534-96-3
has uom: ug.L-1
has table: WISE-SoE WaterQuality.AggregatedData

WISE-SoE_WaterQuality.AggregatedData - CAS_108-38-3 - ug/L
type: Concept
notation: WISE-SoE_WaterQuality.AggregatedData - CAS_108-38-3 - ug/L
definition: The unit of measure for 'CAS_108-38-3' (M-xylene) in WISE SoE - Water Quality: Aggregated data table is 'ug/L'
status: valid
status modified: 2019-10-03
accepted date: 2019-10-03
in scheme: Definition of correct units for the observed determinands in the given WISE SoE DD tables
has determinand: CAS 108-38-3
has uom: ug.L-1
has table: WISE-SoE WaterQuality.AggregatedData

WISE-SoE_WaterQuality.AggregatedData - CAS_108-41-8 - ug/L
type: Concept
notation: WISE-SoE_WaterQuality.AggregatedData - CAS_108-41-8 - ug/L
definition: The unit of measure for 'CAS_108-41-8' (3-chlorotoluene) in WISE SoE - Water Quality: Aggregated data table is 'ug/L'
status: valid
status modified: 2019-10-03
accepted date: 2019-10-03
in scheme: Definition of correct units for the observed determinands in the given WISE SoE DD tables
has determinand: CAS 108-41-8
has uom: ug.L-1
has table: WISE-SoE WaterQuality.AggregatedData

WISE-SoE_WaterQuality.AggregatedData - CAS_108-42-9 - ug/L
type: Concept
notation: WISE-SoE_WaterQuality.AggregatedData - CAS_108-42-9 - ug/L
definition: The unit of measure for 'CAS_108-42-9' (3-chloroaniline) in WISE SoE - Water Quality: Aggregated data table is 'ug/L'
status: valid
status modified: 2019-10-03
accepted date: 2019-10-03
in scheme: Definition of correct units for the observed determinands in the given WISE SoE DD tables
has determinand: CAS 108-42-9
has uom: ug.L-1
has table: WISE-SoE WaterQuality.AggregatedData

WISE-SoE_WaterQuality.AggregatedData - CAS_108-43-0 - ug/L
type: Concept
notation: WISE-SoE_WaterQuality.AggregatedData - CAS_108-43-0 - ug/L
definition: The unit of measure for 'CAS_108-43-0' (3-chlorophenol) in WISE SoE - Water Quality: Aggregated data table is 'ug/L'
status: valid
status modified: 2019-10-03
accepted date: 2019-10-03
in scheme: Definition of correct units for the observed determinands in the given WISE SoE DD tables
has determinand: CAS 108-43-0
has uom: ug.L-1
has table: WISE-SoE WaterQuality.AggregatedData

WISE-SoE_WaterQuality.AggregatedData - CAS_108-60-1 - ug/L
type: Concept
notation: WISE-SoE_WaterQuality.AggregatedData - CAS_108-60-1 - ug/L
definition: The unit of measure for 'CAS_108-60-1' (Bis(2-chloro-1-methylethyl) ether) in WISE SoE - Water Quality: Aggregated data table is 'ug/L'
status: valid
status modified: 2019-10-03
accepted date: 2019-10-03
in scheme: Definition of correct units for the observed determinands in the given WISE SoE DD tables
has determinand: CAS 108-60-1
has uom: ug.L-1
has table: WISE-SoE WaterQuality.AggregatedData

WISE-SoE_WaterQuality.AggregatedData - CAS_108-67-8 - ug/L
type: Concept
notation: WISE-SoE_WaterQuality.AggregatedData - CAS_108-67-8 - ug/L
definition: The unit of measure for 'CAS_108-67-8' (1,3,5-trimethylbenzene) in WISE SoE - Water Quality: Aggregated data table is 'ug/L'
status: valid
status modified: 2019-10-03
accepted date: 2019-10-03
in scheme: Definition of correct units for the observed determinands in the given WISE SoE DD tables
has determinand: CAS 108-67-8
has uom: ug.L-1
has table: WISE-SoE WaterQuality.AggregatedData

WISE-SoE_WaterQuality.AggregatedData - CAS_108-68-9 - ug/L
type: Concept
notation: WISE-SoE_WaterQuality.AggregatedData - CAS_108-68-9 - ug/L
definition: The unit of measure for 'CAS_108-68-9' (3,5-dimethyl-phenol) in WISE SoE - Water Quality: Aggregated data table is 'ug/L'
status: valid
status modified: 2019-10-03
accepted date: 2019-10-03
in scheme: Definition of correct units for the observed determinands in the given WISE SoE DD tables
has determinand: CAS 108-68-9
has uom: ug.L-1
has table: WISE-SoE WaterQuality.AggregatedData

WISE-SoE_WaterQuality.AggregatedData - CAS_108-70-3 - ug/L
type: Concept
notation: WISE-SoE_WaterQuality.AggregatedData - CAS_108-70-3 - ug/L
definition: The unit of measure for 'CAS_108-70-3' (1,3,5-trichlorobenzene) in WISE SoE - Water Quality: Aggregated data table is 'ug/L'
status: valid
status modified: 2019-10-03
accepted date: 2019-10-03
in scheme: Definition of correct units for the observed determinands in the given WISE SoE DD tables
has determinand: CAS 108-70-3
has uom: ug.L-1
has table: WISE-SoE WaterQuality.AggregatedData

WISE-SoE_WaterQuality.AggregatedData - CAS_108-86-1 - ug/L
type: Concept
notation: WISE-SoE_WaterQuality.AggregatedData - CAS_108-86-1 - ug/L
definition: The unit of measure for 'CAS_108-86-1' (Bromobenzene) in WISE SoE - Water Quality: Aggregated data table is 'ug/L'
status: valid
status modified: 2019-10-03
accepted date: 2019-10-03
in scheme: Definition of correct units for the observed determinands in the given WISE SoE DD tables
has determinand: CAS 108-86-1
has uom: ug.L-1
has table: WISE-SoE WaterQuality.AggregatedData

WISE-SoE_WaterQuality.AggregatedData - CAS_108-88-3 - ug/L
type: Concept
notation: WISE-SoE_WaterQuality.AggregatedData - CAS_108-88-3 - ug/L
definition: The unit of measure for 'CAS_108-88-3' (Toluene) in WISE SoE - Water Quality: Aggregated data table is 'ug/L'
status: valid
status modified: 2019-10-03
accepted date: 2019-10-03
in scheme: Definition of correct units for the observed determinands in the given WISE SoE DD tables
has determinand: CAS 108-88-3
has uom: ug.L-1
has table: WISE-SoE WaterQuality.AggregatedData

WISE-SoE_WaterQuality.AggregatedData - CAS_108-90-7 - ug/L
type: Concept
notation: WISE-SoE_WaterQuality.AggregatedData - CAS_108-90-7 - ug/L
definition: The unit of measure for 'CAS_108-90-7' (Chlorobenzene) in WISE SoE - Water Quality: Aggregated data table is 'ug/L'
status: valid
status modified: 2019-10-03
accepted date: 2019-10-03
in scheme: Definition of correct units for the observed determinands in the given WISE SoE DD tables
has determinand: CAS 108-90-7
has uom: ug.L-1
has table: WISE-SoE WaterQuality.AggregatedData

WISE-SoE_WaterQuality.AggregatedData - CAS_108-95-2 - ug/L
type: Concept
notation: WISE-SoE_WaterQuality.AggregatedData - CAS_108-95-2 - ug/L
definition: The unit of measure for 'CAS_108-95-2' (Phenol) in WISE SoE - Water Quality: Aggregated data table is 'ug/L'
status: valid
status modified: 2019-10-03
accepted date: 2019-10-03
in scheme: Definition of correct units for the observed determinands in the given WISE SoE DD tables
has determinand: CAS 108-95-2
has uom: ug.L-1
has table: WISE-SoE WaterQuality.AggregatedData

WISE-SoE_WaterQuality.AggregatedData - CAS_109-89-7 - ug/L
type: Concept
notation: WISE-SoE_WaterQuality.AggregatedData - CAS_109-89-7 - ug/L
definition: The unit of measure for 'CAS_109-89-7' (Diethylamine) in WISE SoE - Water Quality: Aggregated data table is 'ug/L'
status: valid
status modified: 2019-10-03
accepted date: 2019-10-03
in scheme: Definition of correct units for the observed determinands in the given WISE SoE DD tables
has determinand: CAS 109-89-7
has uom: ug.L-1
has table: WISE-SoE WaterQuality.AggregatedData

WISE-SoE_WaterQuality.AggregatedData - CAS_110488-70-5 - ug/L
type: Concept
notation: WISE-SoE_WaterQuality.AggregatedData - CAS_110488-70-5 - ug/L
definition: The unit of measure for 'CAS_110488-70-5' (Dimethomorph) in WISE SoE - Water Quality: Aggregated data table is 'ug/L'
status: valid
status modified: 2019-10-03
accepted date: 2019-10-03
in scheme: Definition of correct units for the observed determinands in the given WISE SoE DD tables
has determinand: CAS 110488-70-5
has uom: ug.L-1
has table: WISE-SoE WaterQuality.AggregatedData

WISE-SoE_WaterQuality.AggregatedData - CAS_1113-02-6 - ug/L
type: Concept
notation: WISE-SoE_WaterQuality.AggregatedData - CAS_1113-02-6 - ug/L
definition: The unit of measure for 'CAS_1113-02-6' (Omethoate) in WISE SoE - Water Quality: Aggregated data table is 'ug/L'
status: valid
status modified: 2019-10-03
accepted date: 2019-10-03
in scheme: Definition of correct units for the observed determinands in the given WISE SoE DD tables
has determinand: CAS 1113-02-6
has uom: ug.L-1
has table: WISE-SoE WaterQuality.AggregatedData

WISE-SoE_WaterQuality.AggregatedData - CAS_111988-49-9 - ug/L
type: Concept
notation: WISE-SoE_WaterQuality.AggregatedData - CAS_111988-49-9 - ug/L
definition: The unit of measure for 'CAS_111988-49-9' (Thiacloprid) in WISE SoE - Water Quality: Aggregated data table is 'ug/L'
status: valid
status modified: 2019-10-03
accepted date: 2019-10-03
in scheme: Definition of correct units for the observed determinands in the given WISE SoE DD tables
has determinand: CAS 111988-49-9
has uom: ug.L-1
has table: WISE-SoE WaterQuality.AggregatedData

WISE-SoE_WaterQuality.AggregatedData - CAS_111991-09-4 - ug/L
type: Concept
notation: WISE-SoE_WaterQuality.AggregatedData - CAS_111991-09-4 - ug/L
definition: The unit of measure for 'CAS_111991-09-4' (Nicosulfuron) in WISE SoE - Water Quality: Aggregated data table is 'ug/L'
status: valid
status modified: 2019-10-03
accepted date: 2019-10-03
in scheme: Definition of correct units for the observed determinands in the given WISE SoE DD tables
has determinand: CAS 111991-09-4
has uom: ug.L-1
has table: WISE-SoE WaterQuality.AggregatedData

WISE-SoE_WaterQuality.AggregatedData - CAS_112410-23-8 - ug/L
type: Concept
notation: WISE-SoE_WaterQuality.AggregatedData - CAS_112410-23-8 - ug/L
definition: The unit of measure for 'CAS_112410-23-8' (Tebufenozide) in WISE SoE - Water Quality: Aggregated data table is 'ug/L'
status: valid
status modified: 2019-10-03
accepted date: 2019-10-03
in scheme: Definition of correct units for the observed determinands in the given WISE SoE DD tables
has determinand: CAS 112410-23-8
has uom: ug.L-1
has table: WISE-SoE WaterQuality.AggregatedData

WISE-SoE_WaterQuality.AggregatedData - CAS_113096-99-4 - ug/L
type: Concept
notation: WISE-SoE_WaterQuality.AggregatedData - CAS_113096-99-4 - ug/L
definition: The unit of measure for 'CAS_113096-99-4' (Cyproconazole) in WISE SoE - Water Quality: Aggregated data table is 'ug/L'
status: valid
status modified: 2019-10-03
accepted date: 2019-10-03
in scheme: Definition of correct units for the observed determinands in the given WISE SoE DD tables
has determinand: CAS 113096-99-4
has uom: ug.L-1
has table: WISE-SoE WaterQuality.AggregatedData

WISE-SoE_WaterQuality.AggregatedData - CAS_114-07-8 - ug/L
type: Concept
notation: WISE-SoE_WaterQuality.AggregatedData - CAS_114-07-8 - ug/L
definition: The unit of measure for 'CAS_114-07-8' (Erythromycin) in WISE SoE - Water Quality: Aggregated data table is 'ug/L'
status: valid
status modified: 2019-10-03
accepted date: 2019-10-03
in scheme: Definition of correct units for the observed determinands in the given WISE SoE DD tables
has determinand: CAS 114-07-8
has uom: ug.L-1
has table: WISE-SoE WaterQuality.AggregatedData

WISE-SoE_WaterQuality.AggregatedData - CAS_114-26-1 - ug/L
type: Concept
notation: WISE-SoE_WaterQuality.AggregatedData - CAS_114-26-1 - ug/L
definition: The unit of measure for 'CAS_114-26-1' (Propoxur) in WISE SoE - Water Quality: Aggregated data table is 'ug/L'
status: valid
status modified: 2019-10-03
accepted date: 2019-10-03
in scheme: Definition of correct units for the observed determinands in the given WISE SoE DD tables
has determinand: CAS 114-26-1
has uom: ug.L-1
has table: WISE-SoE WaterQuality.AggregatedData

WISE-SoE_WaterQuality.AggregatedData - CAS_115-29-7 - ug/L
type: Concept
notation: WISE-SoE_WaterQuality.AggregatedData - CAS_115-29-7 - ug/L
definition: The unit of measure for 'CAS_115-29-7' (Endosulfan) in WISE SoE - Water Quality: Aggregated data table is 'ug/L'
status: valid
status modified: 2019-10-03
accepted date: 2019-10-03
in scheme: Definition of correct units for the observed determinands in the given WISE SoE DD tables
has determinand: CAS 115-29-7
has uom: ug.L-1
has table: WISE-SoE WaterQuality.AggregatedData

WISE-SoE_WaterQuality.AggregatedData - CAS_115-32-2 - ug/L
type: Concept
notation: WISE-SoE_WaterQuality.AggregatedData - CAS_115-32-2 - ug/L
definition: The unit of measure for 'CAS_115-32-2' (Dicofol) in WISE SoE - Water Quality: Aggregated data table is 'ug/L'
status: valid
status modified: 2019-10-03
accepted date: 2019-10-03
in scheme: Definition of correct units for the observed determinands in the given WISE SoE DD tables
has determinand: CAS 115-32-2
has uom: ug.L-1
has table: WISE-SoE WaterQuality.AggregatedData

WISE-SoE_WaterQuality.AggregatedData - CAS_116-06-3 - ug/L
type: Concept
notation: WISE-SoE_WaterQuality.AggregatedData - CAS_116-06-3 - ug/L
definition: The unit of measure for 'CAS_116-06-3' (Aldicarb) in WISE SoE - Water Quality: Aggregated data table is 'ug/L'
status: valid
status modified: 2019-10-03
accepted date: 2019-10-03
in scheme: Definition of correct units for the observed determinands in the given WISE SoE DD tables
has determinand: CAS 116-06-3
has uom: ug.L-1
has table: WISE-SoE WaterQuality.AggregatedData

WISE-SoE_WaterQuality.AggregatedData - CAS_116-29-0 - ug/L
type: Concept
notation: WISE-SoE_WaterQuality.AggregatedData - CAS_116-29-0 - ug/L
definition: The unit of measure for 'CAS_116-29-0' (Teradifon) in WISE SoE - Water Quality: Aggregated data table is 'ug/L'
status: valid
status modified: 2019-10-03
accepted date: 2019-10-03
in scheme: Definition of correct units for the observed determinands in the given WISE SoE DD tables
has determinand: CAS 116-29-0
has uom: ug.L-1
has table: WISE-SoE WaterQuality.AggregatedData

WISE-SoE_WaterQuality.AggregatedData - CAS_1163-19-5 - ug/L
type: Concept
notation: WISE-SoE_WaterQuality.AggregatedData - CAS_1163-19-5 - ug/L
definition: The unit of measure for 'CAS_1163-19-5' (Bis(pentabromophenyl) ether) in WISE SoE - Water Quality: Aggregated data table is 'ug/L'
status: valid
status modified: 2019-10-03
accepted date: 2019-10-03
in scheme: Definition of correct units for the observed determinands in the given WISE SoE DD tables
has determinand: CAS 1163-19-5
has uom: ug.L-1
has table: WISE-SoE WaterQuality.AggregatedData

WISE-SoE_WaterQuality.AggregatedData - CAS_117-81-7 - ug/L
type: Concept
notation: WISE-SoE_WaterQuality.AggregatedData - CAS_117-81-7 - ug/L
definition: The unit of measure for 'CAS_117-81-7' (Di(2-ethylhexyl)phthalate (DEHP)) in WISE SoE - Water Quality: Aggregated data table is 'ug/L'
status: valid
status modified: 2019-10-03
accepted date: 2019-10-03
in scheme: Definition of correct units for the observed determinands in the given WISE SoE DD tables
has determinand: CAS 117-81-7
has uom: ug.L-1
has table: WISE-SoE WaterQuality.AggregatedData

WISE-SoE_WaterQuality.AggregatedData - CAS_118-74-1 - ug/L
type: Concept
notation: WISE-SoE_WaterQuality.AggregatedData - CAS_118-74-1 - ug/L
definition: The unit of measure for 'CAS_118-74-1' (Hexachlorobenzene) in WISE SoE - Water Quality: Aggregated data table is 'ug/L'
status: valid
status modified: 2019-10-03
accepted date: 2019-10-03
in scheme: Definition of correct units for the observed determinands in the given WISE SoE DD tables
has determinand: CAS 118-74-1
has uom: ug.L-1
has table: WISE-SoE WaterQuality.AggregatedData

WISE-SoE_WaterQuality.AggregatedData - CAS_118-96-7 - ug/L
type: Concept
notation: WISE-SoE_WaterQuality.AggregatedData - CAS_118-96-7 - ug/L
definition: The unit of measure for 'CAS_118-96-7' (2,4,6-trinitrotoluene) in WISE SoE - Water Quality: Aggregated data table is 'ug/L'
status: valid
status modified: 2019-10-03
accepted date: 2019-10-03
in scheme: Definition of correct units for the observed determinands in the given WISE SoE DD tables
has determinand: CAS 118-96-7
has uom: ug.L-1
has table: WISE-SoE WaterQuality.AggregatedData

WISE-SoE_WaterQuality.AggregatedData - CAS_118134-30-8 - ug/L
type: Concept
notation: WISE-SoE_WaterQuality.AggregatedData - CAS_118134-30-8 - ug/L
definition: The unit of measure for 'CAS_118134-30-8' (Spiroxamine) in WISE SoE - Water Quality: Aggregated data table is 'ug/L'
status: valid
status modified: 2019-10-03
accepted date: 2019-10-03
in scheme: Definition of correct units for the observed determinands in the given WISE SoE DD tables
has determinand: CAS 118134-30-8
has uom: ug.L-1
has table: WISE-SoE WaterQuality.AggregatedData

WISE-SoE_WaterQuality.AggregatedData - CAS_1194-65-6 - ug/L
type: Concept
notation: WISE-SoE_WaterQuality.AggregatedData - CAS_1194-65-6 - ug/L
definition: The unit of measure for 'CAS_1194-65-6' (Dichlobenil) in WISE SoE - Water Quality: Aggregated data table is 'ug/L'
status: valid
status modified: 2019-10-03
accepted date: 2019-10-03
in scheme: Definition of correct units for the observed determinands in the given WISE SoE DD tables
has determinand: CAS 1194-65-6
has uom: ug.L-1
has table: WISE-SoE WaterQuality.AggregatedData

WISE-SoE_WaterQuality.AggregatedData - CAS_120-12-7 - ug/L
type: Concept
notation: WISE-SoE_WaterQuality.AggregatedData - CAS_120-12-7 - ug/L
definition: The unit of measure for 'CAS_120-12-7' (Anthracene) in WISE SoE - Water Quality: Aggregated data table is 'ug/L'
status: valid
status modified: 2019-10-03
accepted date: 2019-10-03
in scheme: Definition of correct units for the observed determinands in the given WISE SoE DD tables
has determinand: CAS 120-12-7
has uom: ug.L-1
has table: WISE-SoE WaterQuality.AggregatedData

WISE-SoE_WaterQuality.AggregatedData - CAS_120-36-5 - ug/L
type: Concept
notation: WISE-SoE_WaterQuality.AggregatedData - CAS_120-36-5 - ug/L
definition: The unit of measure for 'CAS_120-36-5' (Dichlorprop (2,4-DP)) in WISE SoE - Water Quality: Aggregated data table is 'ug/L'
status: valid
status modified: 2019-10-03
accepted date: 2019-10-03
in scheme: Definition of correct units for the observed determinands in the given WISE SoE DD tables
has determinand: CAS 120-36-5
has uom: ug.L-1
has table: WISE-SoE WaterQuality.AggregatedData

WISE-SoE_WaterQuality.AggregatedData - CAS_120-82-1 - ug/L
type: Concept
notation: WISE-SoE_WaterQuality.AggregatedData - CAS_120-82-1 - ug/L
definition: The unit of measure for 'CAS_120-82-1' (1,2,4-trichlorobenzene) in WISE SoE - Water Quality: Aggregated data table is 'ug/L'
status: valid
status modified: 2019-10-03
accepted date: 2019-10-03
in scheme: Definition of correct units for the observed determinands in the given WISE SoE DD tables
has determinand: CAS 120-82-1
has uom: ug.L-1
has table: WISE-SoE WaterQuality.AggregatedData

WISE-SoE_WaterQuality.AggregatedData - CAS_120-83-2 - ug/L
type: Concept
notation: WISE-SoE_WaterQuality.AggregatedData - CAS_120-83-2 - ug/L
definition: The unit of measure for 'CAS_120-83-2' (2,4-dichlorophenol) in WISE SoE - Water Quality: Aggregated data table is 'ug/L'
status: valid
status modified: 2019-10-03
accepted date: 2019-10-03
in scheme: Definition of correct units for the observed determinands in the given WISE SoE DD tables
has determinand: CAS 120-83-2
has uom: ug.L-1
has table: WISE-SoE WaterQuality.AggregatedData

WISE-SoE_WaterQuality.AggregatedData - CAS_12002-48-1 - ug/L
type: Concept
notation: WISE-SoE_WaterQuality.AggregatedData - CAS_12002-48-1 - ug/L
definition: The unit of measure for 'CAS_12002-48-1' (Trichlorobenzenes (all isomers)) in WISE SoE - Water Quality: Aggregated data table is 'ug/L'
status: valid
status modified: 2019-10-03
accepted date: 2019-10-03
in scheme: Definition of correct units for the observed determinands in the given WISE SoE DD tables
has determinand: CAS 12002-48-1
has uom: ug.L-1
has table: WISE-SoE WaterQuality.AggregatedData

WISE-SoE_WaterQuality.AggregatedData - CAS_120923-37-7 - ug/L
type: Concept
notation: WISE-SoE_WaterQuality.AggregatedData - CAS_120923-37-7 - ug/L
definition: The unit of measure for 'CAS_120923-37-7' (Amidosulfuron) in WISE SoE - Water Quality: Aggregated data table is 'ug/L'
status: valid
status modified: 2019-10-03
accepted date: 2019-10-03
in scheme: Definition of correct units for the observed determinands in the given WISE SoE DD tables
has determinand: CAS 120923-37-7
has uom: ug.L-1
has table: WISE-SoE WaterQuality.AggregatedData

WISE-SoE_WaterQuality.AggregatedData - CAS_120928-09-8 - ug/L
type: Concept
notation: WISE-SoE_WaterQuality.AggregatedData - CAS_120928-09-8 - ug/L
definition: The unit of measure for 'CAS_120928-09-8' (Fenazaquin) in WISE SoE - Water Quality: Aggregated data table is 'ug/L'
status: valid
status modified: 2019-10-03
accepted date: 2019-10-03
in scheme: Definition of correct units for the observed determinands in the given WISE SoE DD tables
has determinand: CAS 120928-09-8
has uom: ug.L-1
has table: WISE-SoE WaterQuality.AggregatedData

WISE-SoE_WaterQuality.AggregatedData - CAS_121-14-2 - ug/L
type: Concept
notation: WISE-SoE_WaterQuality.AggregatedData - CAS_121-14-2 - ug/L
definition: The unit of measure for 'CAS_121-14-2' (2,4-dinitrotoluene) in WISE SoE - Water Quality: Aggregated data table is 'ug/L'
status: valid
status modified: 2019-10-03
accepted date: 2019-10-03
in scheme: Definition of correct units for the observed determinands in the given WISE SoE DD tables
has determinand: CAS 121-14-2
has uom: ug.L-1
has table: WISE-SoE WaterQuality.AggregatedData

WISE-SoE_WaterQuality.AggregatedData - CAS_121-73-3 - ug/L
type: Concept
notation: WISE-SoE_WaterQuality.AggregatedData - CAS_121-73-3 - ug/L
definition: The unit of measure for 'CAS_121-73-3' (1-chloro-3-nitrobenzene) in WISE SoE - Water Quality: Aggregated data table is 'ug/L'
status: valid
status modified: 2019-10-03
accepted date: 2019-10-03
in scheme: Definition of correct units for the observed determinands in the given WISE SoE DD tables
has determinand: CAS 121-73-3
has uom: ug.L-1
has table: WISE-SoE WaterQuality.AggregatedData

WISE-SoE_WaterQuality.AggregatedData - CAS_121-75-5 - ug/L
type: Concept
notation: WISE-SoE_WaterQuality.AggregatedData - CAS_121-75-5 - ug/L
definition: The unit of measure for 'CAS_121-75-5' (Malathion) in WISE SoE - Water Quality: Aggregated data table is 'ug/L'
status: valid
status modified: 2019-10-03
accepted date: 2019-10-03
in scheme: Definition of correct units for the observed determinands in the given WISE SoE DD tables
has determinand: CAS 121-75-5
has uom: ug.L-1
has table: WISE-SoE WaterQuality.AggregatedData

WISE-SoE_WaterQuality.AggregatedData - CAS_121-86-8 - ug/L
type: Concept
notation: WISE-SoE_WaterQuality.AggregatedData - CAS_121-86-8 - ug/L
definition: The unit of measure for 'CAS_121-86-8' (2-chloro-4-nitrotoluene) in WISE SoE - Water Quality: Aggregated data table is 'ug/L'
status: valid
status modified: 2019-10-03
accepted date: 2019-10-03
in scheme: Definition of correct units for the observed determinands in the given WISE SoE DD tables
has determinand: CAS 121-86-8
has uom: ug.L-1
has table: WISE-SoE WaterQuality.AggregatedData

WISE-SoE_WaterQuality.AggregatedData - CAS_121552-61-2 - ug/L
type: Concept
notation: WISE-SoE_WaterQuality.AggregatedData - CAS_121552-61-2 - ug/L
definition: The unit of measure for 'CAS_121552-61-2' (Cyprodinil) in WISE SoE - Water Quality: Aggregated data table is 'ug/L'
status: valid
status modified: 2019-10-03
accepted date: 2019-10-03
in scheme: Definition of correct units for the observed determinands in the given WISE SoE DD tables
has determinand: CAS 121552-61-2
has uom: ug.L-1
has table: WISE-SoE WaterQuality.AggregatedData

WISE-SoE_WaterQuality.AggregatedData - CAS_121776-33-8 - ug/L
type: Concept
notation: WISE-SoE_WaterQuality.AggregatedData - CAS_121776-33-8 - ug/L
definition: The unit of measure for 'CAS_121776-33-8' (Furilazole) in WISE SoE - Water Quality: Aggregated data table is 'ug/L'
status: valid
status modified: 2019-10-03
accepted date: 2019-10-03
in scheme: Definition of correct units for the observed determinands in the given WISE SoE DD tables
has determinand: CAS 121776-33-8
has uom: ug.L-1
has table: WISE-SoE WaterQuality.AggregatedData

WISE-SoE_WaterQuality.AggregatedData - CAS_122-14-5 - ug/L
type: Concept
notation: WISE-SoE_WaterQuality.AggregatedData - CAS_122-14-5 - ug/L
definition: The unit of measure for 'CAS_122-14-5' (Fenitrothion) in WISE SoE - Water Quality: Aggregated data table is 'ug/L'
status: valid
status modified: 2019-10-03
accepted date: 2019-10-03
in scheme: Definition of correct units for the observed determinands in the given WISE SoE DD tables
has determinand: CAS 122-14-5
has uom: ug.L-1
has table: WISE-SoE WaterQuality.AggregatedData

WISE-SoE_WaterQuality.AggregatedData - CAS_122-34-9 - ug/L
type: Concept
notation: WISE-SoE_WaterQuality.AggregatedData - CAS_122-34-9 - ug/L
definition: The unit of measure for 'CAS_122-34-9' (Simazine) in WISE SoE - Water Quality: Aggregated data table is 'ug/L'
status: valid
status modified: 2019-10-03
accepted date: 2019-10-03
in scheme: Definition of correct units for the observed determinands in the given WISE SoE DD tables
has determinand: CAS 122-34-9
has uom: ug.L-1
has table: WISE-SoE WaterQuality.AggregatedData

WISE-SoE_WaterQuality.AggregatedData - CAS_122-39-4 - ug/L
type: Concept
notation: WISE-SoE_WaterQuality.AggregatedData - CAS_122-39-4 - ug/L
definition: The unit of measure for 'CAS_122-39-4' (Diphenylamine) in WISE SoE - Water Quality: Aggregated data table is 'ug/L'
status: valid
status modified: 2019-10-03
accepted date: 2019-10-03
in scheme: Definition of correct units for the observed determinands in the given WISE SoE DD tables
has determinand: CAS 122-39-4
has uom: ug.L-1
has table: WISE-SoE WaterQuality.AggregatedData

WISE-SoE_WaterQuality.AggregatedData - CAS_122-88-3 - ug/L
type: Concept
notation: WISE-SoE_WaterQuality.AggregatedData - CAS_122-88-3 - ug/L
definition: The unit of measure for 'CAS_122-88-3' (4-Chlorophenoxyacetic acid (CPA 4)) in WISE SoE - Water Quality: Aggregated data table is 'ug/L'
status: valid
status modified: 2019-10-03
accepted date: 2019-10-03
in scheme: Definition of correct units for the observed determinands in the given WISE SoE DD tables
has determinand: CAS 122-88-3
has uom: ug.L-1
has table: WISE-SoE WaterQuality.AggregatedData

WISE-SoE_WaterQuality.AggregatedData - CAS_122931-48-0 - ug/L
type: Concept
notation: WISE-SoE_WaterQuality.AggregatedData - CAS_122931-48-0 - ug/L
definition: The unit of measure for 'CAS_122931-48-0' (Rimsulfuron) in WISE SoE - Water Quality: Aggregated data table is 'ug/L'
status: valid
status modified: 2019-10-03
accepted date: 2019-10-03
in scheme: Definition of correct units for the observed determinands in the given WISE SoE DD tables
has determinand: CAS 122931-48-0
has uom: ug.L-1
has table: WISE-SoE WaterQuality.AggregatedData

WISE-SoE_WaterQuality.AggregatedData - CAS_123-33-1 - ug/L
type: Concept
notation: WISE-SoE_WaterQuality.AggregatedData - CAS_123-33-1 - ug/L
definition: The unit of measure for 'CAS_123-33-1' (Maleinhydrazid) in WISE SoE - Water Quality: Aggregated data table is 'ug/L'
status: valid
status modified: 2019-10-03
accepted date: 2019-10-03
in scheme: Definition of correct units for the observed determinands in the given WISE SoE DD tables
has determinand: CAS 123-33-1
has uom: ug.L-1
has table: WISE-SoE WaterQuality.AggregatedData

WISE-SoE_WaterQuality.AggregatedData - CAS_123-91-1 - ug/L
type: Concept
notation: WISE-SoE_WaterQuality.AggregatedData - CAS_123-91-1 - ug/L
definition: The unit of measure for 'CAS_123-91-1' (1,4-dioxane) in WISE SoE - Water Quality: Aggregated data table is 'ug/L'
status: valid
status modified: 2019-10-03
accepted date: 2019-10-03
in scheme: Definition of correct units for the observed determinands in the given WISE SoE DD tables
has determinand: CAS 123-91-1
has uom: ug.L-1
has table: WISE-SoE WaterQuality.AggregatedData

WISE-SoE_WaterQuality.AggregatedData - CAS_1231244-60-2 - ug/L
type: Concept
notation: WISE-SoE_WaterQuality.AggregatedData - CAS_1231244-60-2 - ug/L
definition: The unit of measure for 'CAS_1231244-60-2' (Metazachlor OA) in WISE SoE - Water Quality: Aggregated data table is 'ug/L'
status: valid
status modified: 2019-10-03
accepted date: 2019-10-03
in scheme: Definition of correct units for the observed determinands in the given WISE SoE DD tables
has determinand: CAS 1231244-60-2
has uom: ug.L-1
has table: WISE-SoE WaterQuality.AggregatedData

WISE-SoE_WaterQuality.AggregatedData - CAS_124-40-3 - ug/L
type: Concept
notation: WISE-SoE_WaterQuality.AggregatedData - CAS_124-40-3 - ug/L
definition: The unit of measure for 'CAS_124-40-3' (Dimethylamine) in WISE SoE - Water Quality: Aggregated data table is 'ug/L'
status: valid
status modified: 2019-10-03
accepted date: 2019-10-03
in scheme: Definition of correct units for the observed determinands in the given WISE SoE DD tables
has determinand: CAS 124-40-3
has uom: ug.L-1
has table: WISE-SoE WaterQuality.AggregatedData

WISE-SoE_WaterQuality.AggregatedData - CAS_124-48-1 - ug/L
type: Concept
notation: WISE-SoE_WaterQuality.AggregatedData - CAS_124-48-1 - ug/L
definition: The unit of measure for 'CAS_124-48-1' (Dibromochlorometane) in WISE SoE - Water Quality: Aggregated data table is 'ug/L'
status: valid
status modified: 2019-10-03
accepted date: 2019-10-03
in scheme: Definition of correct units for the observed determinands in the given WISE SoE DD tables
has determinand: CAS 124-48-1
has uom: ug.L-1
has table: WISE-SoE WaterQuality.AggregatedData

WISE-SoE_WaterQuality.AggregatedData - CAS_124495-18-7 - ug/L
type: Concept
notation: WISE-SoE_WaterQuality.AggregatedData - CAS_124495-18-7 - ug/L
definition: The unit of measure for 'CAS_124495-18-7' (Quinoxyfen) in WISE SoE - Water Quality: Aggregated data table is 'ug/L'
status: valid
status modified: 2019-10-03
accepted date: 2019-10-03
in scheme: Definition of correct units for the observed determinands in the given WISE SoE DD tables
has determinand: CAS 124495-18-7
has uom: ug.L-1
has table: WISE-SoE WaterQuality.AggregatedData

WISE-SoE_WaterQuality.AggregatedData - CAS_126-73-8 - ug/L
type: Concept
notation: WISE-SoE_WaterQuality.AggregatedData - CAS_126-73-8 - ug/L
definition: The unit of measure for 'CAS_126-73-8' (Tributyl phosphate) in WISE SoE - Water Quality: Aggregated data table is 'ug/L'
status: valid
status modified: 2019-10-03
accepted date: 2019-10-03
in scheme: Definition of correct units for the observed determinands in the given WISE SoE DD tables
has determinand: CAS 126-73-8
has uom: ug.L-1
has table: WISE-SoE WaterQuality.AggregatedData

WISE-SoE_WaterQuality.AggregatedData - CAS_126-75-0 - ug/L
type: Concept
notation: WISE-SoE_WaterQuality.AggregatedData - CAS_126-75-0 - ug/L
definition: The unit of measure for 'CAS_126-75-0' (Demeton-S) in WISE SoE - Water Quality: Aggregated data table is 'ug/L'
status: valid
status modified: 2019-10-03
accepted date: 2019-10-03
in scheme: Definition of correct units for the observed determinands in the given WISE SoE DD tables
has determinand: CAS 126-75-0
has uom: ug.L-1
has table: WISE-SoE WaterQuality.AggregatedData

WISE-SoE_WaterQuality.AggregatedData - CAS_126-99-8 - ug/L
type: Concept
notation: WISE-SoE_WaterQuality.AggregatedData - CAS_126-99-8 - ug/L
definition: The unit of measure for 'CAS_126-99-8' (2-Chloro-1,3-butadiene) in WISE SoE - Water Quality: Aggregated data table is 'ug/L'
status: valid
status modified: 2019-10-03
accepted date: 2019-10-03
in scheme: Definition of correct units for the observed determinands in the given WISE SoE DD tables
has determinand: CAS 126-99-8
has uom: ug.L-1
has table: WISE-SoE WaterQuality.AggregatedData

WISE-SoE_WaterQuality.AggregatedData - CAS_126535-15-7 - ug/L
type: Concept
notation: WISE-SoE_WaterQuality.AggregatedData - CAS_126535-15-7 - ug/L
definition: The unit of measure for 'CAS_126535-15-7' (Triflusulfuron-methyl) in WISE SoE - Water Quality: Aggregated data table is 'ug/L'
status: valid
status modified: 2019-10-03
accepted date: 2019-10-03
in scheme: Definition of correct units for the observed determinands in the given WISE SoE DD tables
has determinand: CAS 126535-15-7
has uom: ug.L-1
has table: WISE-SoE WaterQuality.AggregatedData

WISE-SoE_WaterQuality.AggregatedData - CAS_126833-17-8 - ug/L
type: Concept
notation: WISE-SoE_WaterQuality.AggregatedData - CAS_126833-17-8 - ug/L
definition: The unit of measure for 'CAS_126833-17-8' (Fenhexamid) in WISE SoE - Water Quality: Aggregated data table is 'ug/L'
status: valid
status modified: 2019-10-03
accepted date: 2019-10-03
in scheme: Definition of correct units for the observed determinands in the given WISE SoE DD tables
has determinand: CAS 126833-17-8
has uom: ug.L-1
has table: WISE-SoE WaterQuality.AggregatedData

WISE-SoE_WaterQuality.AggregatedData - CAS_127-18-4 - ug/L
type: Concept
notation: WISE-SoE_WaterQuality.AggregatedData - CAS_127-18-4 - ug/L
definition: The unit of measure for 'CAS_127-18-4' (Tetrachloroethylene) in WISE SoE - Water Quality: Aggregated data table is 'ug/L'
status: valid
status modified: 2019-10-03
accepted date: 2019-10-03
in scheme: Definition of correct units for the observed determinands in the given WISE SoE DD tables
has determinand: CAS 127-18-4
has uom: ug.L-1
has table: WISE-SoE WaterQuality.AggregatedData

WISE-SoE_WaterQuality.AggregatedData - CAS_12767-79-2 - ug/L
type: Concept
notation: WISE-SoE_WaterQuality.AggregatedData - CAS_12767-79-2 - ug/L
definition: The unit of measure for 'CAS_12767-79-2' (Aroclor) in WISE SoE - Water Quality: Aggregated data table is 'ug/L'
status: valid
status modified: 2019-10-03
accepted date: 2019-10-03
in scheme: Definition of correct units for the observed determinands in the given WISE SoE DD tables
has determinand: CAS 12767-79-2
has uom: ug.L-1
has table: WISE-SoE WaterQuality.AggregatedData

WISE-SoE_WaterQuality.AggregatedData - CAS_128-37-0 - ug/L
type: Concept
notation: WISE-SoE_WaterQuality.AggregatedData - CAS_128-37-0 - ug/L
definition: The unit of measure for 'CAS_128-37-0' (2,6-Ditert-butyl-4-methylphenol) in WISE SoE - Water Quality: Aggregated data table is 'ug/L'
status: valid
status modified: 2019-10-03
accepted date: 2019-10-03
in scheme: Definition of correct units for the observed determinands in the given WISE SoE DD tables
has determinand: CAS 128-37-0
has uom: ug.L-1
has table: WISE-SoE WaterQuality.AggregatedData

WISE-SoE_WaterQuality.AggregatedData - CAS_129-00-0 - ug/L
type: Concept
notation: WISE-SoE_WaterQuality.AggregatedData - CAS_129-00-0 - ug/L
definition: The unit of measure for 'CAS_129-00-0' (Pyrene) in WISE SoE - Water Quality: Aggregated data table is 'ug/L'
status: valid
status modified: 2019-10-03
accepted date: 2019-10-03
in scheme: Definition of correct units for the observed determinands in the given WISE SoE DD tables
has determinand: CAS 129-00-0
has uom: ug.L-1
has table: WISE-SoE WaterQuality.AggregatedData

WISE-SoE_WaterQuality.AggregatedData - CAS_13071-79-9 - ug/L
type: Concept
notation: WISE-SoE_WaterQuality.AggregatedData - CAS_13071-79-9 - ug/L
definition: The unit of measure for 'CAS_13071-79-9' (Terbufos) in WISE SoE - Water Quality: Aggregated data table is 'ug/L'
status: valid
status modified: 2019-10-03
accepted date: 2019-10-03
in scheme: Definition of correct units for the observed determinands in the given WISE SoE DD tables
has determinand: CAS 13071-79-9
has uom: ug.L-1
has table: WISE-SoE WaterQuality.AggregatedData

WISE-SoE_WaterQuality.AggregatedData - CAS_131-11-3 - ug/L
type: Concept
notation: WISE-SoE_WaterQuality.AggregatedData - CAS_131-11-3 - ug/L
definition: The unit of measure for 'CAS_131-11-3' (Dimethyl phthalate) in WISE SoE - Water Quality: Aggregated data table is 'ug/L'
status: valid
status modified: 2019-10-03
accepted date: 2019-10-03
in scheme: Definition of correct units for the observed determinands in the given WISE SoE DD tables
has determinand: CAS 131-11-3
has uom: ug.L-1
has table: WISE-SoE WaterQuality.AggregatedData

WISE-SoE_WaterQuality.AggregatedData - CAS_131-16-8 - ug/L
type: Concept
notation: WISE-SoE_WaterQuality.AggregatedData - CAS_131-16-8 - ug/L
definition: The unit of measure for 'CAS_131-16-8' (Dipropyl phthalate) in WISE SoE - Water Quality: Aggregated data table is 'ug/L'
status: valid
status modified: 2019-10-03
accepted date: 2019-10-03
in scheme: Definition of correct units for the observed determinands in the given WISE SoE DD tables
has determinand: CAS 131-16-8
has uom: ug.L-1
has table: WISE-SoE WaterQuality.AggregatedData

WISE-SoE_WaterQuality.AggregatedData - CAS_131-18-0 - ug/L
type: Concept
notation: WISE-SoE_WaterQuality.AggregatedData - CAS_131-18-0 - ug/L
definition: The unit of measure for 'CAS_131-18-0' (Dipentyl phthalate) in WISE SoE - Water Quality: Aggregated data table is 'ug/L'
status: valid
status modified: 2019-10-03
accepted date: 2019-10-03
in scheme: Definition of correct units for the observed determinands in the given WISE SoE DD tables
has determinand: CAS 131-18-0
has uom: ug.L-1
has table: WISE-SoE WaterQuality.AggregatedData

WISE-SoE_WaterQuality.AggregatedData - CAS_131341-86-1 - ug/L
type: Concept
notation: WISE-SoE_WaterQuality.AggregatedData - CAS_131341-86-1 - ug/L
definition: The unit of measure for 'CAS_131341-86-1' (Fludioxonil) in WISE SoE - Water Quality: Aggregated data table is 'ug/L'
status: valid
status modified: 2019-10-03
accepted date: 2019-10-03
in scheme: Definition of correct units for the observed determinands in the given WISE SoE DD tables
has determinand: CAS 131341-86-1
has uom: ug.L-1
has table: WISE-SoE WaterQuality.AggregatedData

WISE-SoE_WaterQuality.AggregatedData - CAS_131860-33-8 - ug/L
type: Concept
notation: WISE-SoE_WaterQuality.AggregatedData - CAS_131860-33-8 - ug/L
definition: The unit of measure for 'CAS_131860-33-8' (Azoxystrobin) in WISE SoE - Water Quality: Aggregated data table is 'ug/L'
status: valid
status modified: 2019-10-03
accepted date: 2019-10-03
in scheme: Definition of correct units for the observed determinands in the given WISE SoE DD tables
has determinand: CAS 131860-33-8
has uom: ug.L-1
has table: WISE-SoE WaterQuality.AggregatedData

WISE-SoE_WaterQuality.AggregatedData - CAS_13194-48-4 - ug/L
type: Concept
notation: WISE-SoE_WaterQuality.AggregatedData - CAS_13194-48-4 - ug/L
definition: The unit of measure for 'CAS_13194-48-4' (Ethoprophos) in WISE SoE - Water Quality: Aggregated data table is 'ug/L'
status: valid
status modified: 2019-10-03
accepted date: 2019-10-03
in scheme: Definition of correct units for the observed determinands in the given WISE SoE DD tables
has determinand: CAS 13194-48-4
has uom: ug.L-1
has table: WISE-SoE WaterQuality.AggregatedData

WISE-SoE_WaterQuality.AggregatedData - CAS_1321-64-8 - ug/L
type: Concept
notation: WISE-SoE_WaterQuality.AggregatedData - CAS_1321-64-8 - ug/L
definition: The unit of measure for 'CAS_1321-64-8' (Pentachloronaphthalene) in WISE SoE - Water Quality: Aggregated data table is 'ug/L'
status: valid
status modified: 2019-10-03
accepted date: 2019-10-03
in scheme: Definition of correct units for the observed determinands in the given WISE SoE DD tables
has determinand: CAS 1321-64-8
has uom: ug.L-1
has table: WISE-SoE WaterQuality.AggregatedData

WISE-SoE_WaterQuality.AggregatedData - CAS_1321-65-9 - ug/L
type: Concept
notation: WISE-SoE_WaterQuality.AggregatedData - CAS_1321-65-9 - ug/L
definition: The unit of measure for 'CAS_1321-65-9' (Trichloronaphthalene) in WISE SoE - Water Quality: Aggregated data table is 'ug/L'
status: valid
status modified: 2019-10-03
accepted date: 2019-10-03
in scheme: Definition of correct units for the observed determinands in the given WISE SoE DD tables
has determinand: CAS 1321-65-9
has uom: ug.L-1
has table: WISE-SoE WaterQuality.AggregatedData

WISE-SoE_WaterQuality.AggregatedData - CAS_133-06-2 - ug/L
type: Concept
notation: WISE-SoE_WaterQuality.AggregatedData - CAS_133-06-2 - ug/L
definition: The unit of measure for 'CAS_133-06-2' (Captan) in WISE SoE - Water Quality: Aggregated data table is 'ug/L'
status: valid
status modified: 2019-10-03
accepted date: 2019-10-03
in scheme: Definition of correct units for the observed determinands in the given WISE SoE DD tables
has determinand: CAS 133-06-2
has uom: ug.L-1
has table: WISE-SoE WaterQuality.AggregatedData

WISE-SoE_WaterQuality.AggregatedData - CAS_133-07-3 - ug/L
type: Concept
notation: WISE-SoE_WaterQuality.AggregatedData - CAS_133-07-3 - ug/L
definition: The unit of measure for 'CAS_133-07-3' (Folpet) in WISE SoE - Water Quality: Aggregated data table is 'ug/L'
status: valid
status modified: 2019-10-03
accepted date: 2019-10-03
in scheme: Definition of correct units for the observed determinands in the given WISE SoE DD tables
has determinand: CAS 133-07-3
has uom: ug.L-1
has table: WISE-SoE WaterQuality.AggregatedData

WISE-SoE_WaterQuality.AggregatedData - CAS_133-53-9 - ug/L
type: Concept
notation: WISE-SoE_WaterQuality.AggregatedData - CAS_133-53-9 - ug/L
definition: The unit of measure for 'CAS_133-53-9' (2,4-dichloro-3,5-dimethylphenol) in WISE SoE - Water Quality: Aggregated data table is 'ug/L'
status: valid
status modified: 2019-10-03
accepted date: 2019-10-03
in scheme: Definition of correct units for the observed determinands in the given WISE SoE DD tables
has determinand: CAS 133-53-9
has uom: ug.L-1
has table: WISE-SoE WaterQuality.AggregatedData

WISE-SoE_WaterQuality.AggregatedData - CAS_1330-20-7 - ug/L
type: Concept
notation: WISE-SoE_WaterQuality.AggregatedData - CAS_1330-20-7 - ug/L
definition: The unit of measure for 'CAS_1330-20-7' (Xylene) in WISE SoE - Water Quality: Aggregated data table is 'ug/L'
status: valid
status modified: 2019-10-03
accepted date: 2019-10-03
in scheme: Definition of correct units for the observed determinands in the given WISE SoE DD tables
has determinand: CAS 1330-20-7
has uom: ug.L-1
has table: WISE-SoE WaterQuality.AggregatedData

WISE-SoE_WaterQuality.AggregatedData - CAS_1332-21-4 - ug/L
type: Concept
notation: WISE-SoE_WaterQuality.AggregatedData - CAS_1332-21-4 - ug/L
definition: The unit of measure for 'CAS_1332-21-4' (Asbestos) in WISE SoE - Water Quality: Aggregated data table is 'ug/L'
status: valid
status modified: 2019-10-03
accepted date: 2019-10-03
in scheme: Definition of correct units for the observed determinands in the given WISE SoE DD tables
has determinand: CAS 1332-21-4
has uom: ug.L-1
has table: WISE-SoE WaterQuality.AggregatedData

WISE-SoE_WaterQuality.AggregatedData - CAS_1333-82-0 - ug/L
type: Concept
notation: WISE-SoE_WaterQuality.AggregatedData - CAS_1333-82-0 - ug/L
definition: The unit of measure for 'CAS_1333-82-0' (Chromium trioxide (CrO3)) in WISE SoE - Water Quality: Aggregated data table is 'ug/L'
status: valid
status modified: 2019-10-03
accepted date: 2019-10-03
in scheme: Definition of correct units for the observed determinands in the given WISE SoE DD tables
has determinand: CAS 1333-82-0
has uom: ug.L-1
has table: WISE-SoE WaterQuality.AggregatedData

WISE-SoE_WaterQuality.AggregatedData - CAS_1335-87-1 - ug/L
type: Concept
notation: WISE-SoE_WaterQuality.AggregatedData - CAS_1335-87-1 - ug/L
definition: The unit of measure for 'CAS_1335-87-1' (Hexachloronaphthalene) in WISE SoE - Water Quality: Aggregated data table is 'ug/L'
status: valid
status modified: 2019-10-03
accepted date: 2019-10-03
in scheme: Definition of correct units for the observed determinands in the given WISE SoE DD tables
has determinand: CAS 1335-87-1
has uom: ug.L-1
has table: WISE-SoE WaterQuality.AggregatedData

WISE-SoE_WaterQuality.AggregatedData - CAS_1335-88-2 - ug/L
type: Concept
notation: WISE-SoE_WaterQuality.AggregatedData - CAS_1335-88-2 - ug/L
definition: The unit of measure for 'CAS_1335-88-2' (Tetrachloronaphthalene) in WISE SoE - Water Quality: Aggregated data table is 'ug/L'
status: valid
status modified: 2019-10-03
accepted date: 2019-10-03
in scheme: Definition of correct units for the observed determinands in the given WISE SoE DD tables
has determinand: CAS 1335-88-2
has uom: ug.L-1
has table: WISE-SoE WaterQuality.AggregatedData

WISE-SoE_WaterQuality.AggregatedData - CAS_13351-73-0 - ug/L
type: Concept
notation: WISE-SoE_WaterQuality.AggregatedData - CAS_13351-73-0 - ug/L
definition: The unit of measure for 'CAS_13351-73-0' (Tolyltriazole) in WISE SoE - Water Quality: Aggregated data table is 'ug/L'
status: valid
status modified: 2019-10-03
accepted date: 2019-10-03
in scheme: Definition of correct units for the observed determinands in the given WISE SoE DD tables
has determinand: CAS 13351-73-0
has uom: ug.L-1
has table: WISE-SoE WaterQuality.AggregatedData

WISE-SoE_WaterQuality.AggregatedData - CAS_13356-08-6 - ug/L
type: Concept
notation: WISE-SoE_WaterQuality.AggregatedData - CAS_13356-08-6 - ug/L
definition: The unit of measure for 'CAS_13356-08-6' (Fenbutatin oxide) in WISE SoE - Water Quality: Aggregated data table is 'ug/L'
status: valid
status modified: 2019-10-03
accepted date: 2019-10-03
in scheme: Definition of correct units for the observed determinands in the given WISE SoE DD tables
has determinand: CAS 13356-08-6
has uom: ug.L-1
has table: WISE-SoE WaterQuality.AggregatedData

WISE-SoE_WaterQuality.AggregatedData - CAS_1336-36-3 - ug/L
type: Concept
notation: WISE-SoE_WaterQuality.AggregatedData - CAS_1336-36-3 - ug/L
definition: The unit of measure for 'CAS_1336-36-3' (Polychlorinated biphenyls) in WISE SoE - Water Quality: Aggregated data table is 'ug/L'
status: valid
status modified: 2019-10-03
accepted date: 2019-10-03
in scheme: Definition of correct units for the observed determinands in the given WISE SoE DD tables
has determinand: CAS 1336-36-3
has uom: ug.L-1
has table: WISE-SoE WaterQuality.AggregatedData

WISE-SoE_WaterQuality.AggregatedData - CAS_13360-45-7 - ug/L
type: Concept
notation: WISE-SoE_WaterQuality.AggregatedData - CAS_13360-45-7 - ug/L
definition: The unit of measure for 'CAS_13360-45-7' (Chlorbromuron) in WISE SoE - Water Quality: Aggregated data table is 'ug/L'
status: valid
status modified: 2019-10-03
accepted date: 2019-10-03
in scheme: Definition of correct units for the observed determinands in the given WISE SoE DD tables
has determinand: CAS 13360-45-7
has uom: ug.L-1
has table: WISE-SoE WaterQuality.AggregatedData

WISE-SoE_WaterQuality.AggregatedData - CAS_133855-98-8 - ug/L
type: Concept
notation: WISE-SoE_WaterQuality.AggregatedData - CAS_133855-98-8 - ug/L
definition: The unit of measure for 'CAS_133855-98-8' (Epoxiconazole) in WISE SoE - Water Quality: Aggregated data table is 'ug/L'
status: valid
status modified: 2019-10-03
accepted date: 2019-10-03
in scheme: Definition of correct units for the observed determinands in the given WISE SoE DD tables
has determinand: CAS 133855-98-8
has uom: ug.L-1
has table: WISE-SoE WaterQuality.AggregatedData

WISE-SoE_WaterQuality.AggregatedData - CAS_134-62-3 - ug/L
type: Concept
notation: WISE-SoE_WaterQuality.AggregatedData - CAS_134-62-3 - ug/L
definition: The unit of measure for 'CAS_134-62-3' (Diethyltoluamide (DEET)) in WISE SoE - Water Quality: Aggregated data table is 'ug/L'
status: valid
status modified: 2019-10-03
accepted date: 2019-10-03
in scheme: Definition of correct units for the observed determinands in the given WISE SoE DD tables
has determinand: CAS 134-62-3
has uom: ug.L-1
has table: WISE-SoE WaterQuality.AggregatedData

WISE-SoE_WaterQuality.AggregatedData - CAS_134098-61-6 - ug/L
type: Concept
notation: WISE-SoE_WaterQuality.AggregatedData - CAS_134098-61-6 - ug/L
definition: The unit of measure for 'CAS_134098-61-6' (Fenpyroximate) in WISE SoE - Water Quality: Aggregated data table is 'ug/L'
status: valid
status modified: 2019-10-03
accepted date: 2019-10-03
in scheme: Definition of correct units for the observed determinands in the given WISE SoE DD tables
has determinand: CAS 134098-61-6
has uom: ug.L-1
has table: WISE-SoE WaterQuality.AggregatedData

WISE-SoE_WaterQuality.AggregatedData - CAS_134237-50-6 - ug/L
type: Concept
notation: WISE-SoE_WaterQuality.AggregatedData - CAS_134237-50-6 - ug/L
definition: The unit of measure for 'CAS_134237-50-6' (alpha-Hexabromocyclododecane) in WISE SoE - Water Quality: Aggregated data table is 'ug/L'
status: valid
status modified: 2019-10-03
accepted date: 2019-10-03
in scheme: Definition of correct units for the observed determinands in the given WISE SoE DD tables
has determinand: CAS 134237-50-6
has uom: ug.L-1
has table: WISE-SoE WaterQuality.AggregatedData

WISE-SoE_WaterQuality.AggregatedData - CAS_134237-51-7 - ug/L
type: Concept
notation: WISE-SoE_WaterQuality.AggregatedData - CAS_134237-51-7 - ug/L
definition: The unit of measure for 'CAS_134237-51-7' (beta-Hexabromocyclododecane) in WISE SoE - Water Quality: Aggregated data table is 'ug/L'
status: valid
status modified: 2019-10-03
accepted date: 2019-10-03
in scheme: Definition of correct units for the observed determinands in the given WISE SoE DD tables
has determinand: CAS 134237-51-7
has uom: ug.L-1
has table: WISE-SoE WaterQuality.AggregatedData

WISE-SoE_WaterQuality.AggregatedData - CAS_134237-52-8 - ug/L
type: Concept
notation: WISE-SoE_WaterQuality.AggregatedData - CAS_134237-52-8 - ug/L
definition: The unit of measure for 'CAS_134237-52-8' (gamma-Hexabromocyclododecane) in WISE SoE - Water Quality: Aggregated data table is 'ug/L'
status: valid
status modified: 2019-10-03
accepted date: 2019-10-03
in scheme: Definition of correct units for the observed determinands in the given WISE SoE DD tables
has determinand: CAS 134237-52-8
has uom: ug.L-1
has table: WISE-SoE WaterQuality.AggregatedData

WISE-SoE_WaterQuality.AggregatedData - CAS_13457-18-6 - ug/L
type: Concept
notation: WISE-SoE_WaterQuality.AggregatedData - CAS_13457-18-6 - ug/L
definition: The unit of measure for 'CAS_13457-18-6' (Pyrazophos) in WISE SoE - Water Quality: Aggregated data table is 'ug/L'
status: valid
status modified: 2019-10-03
accepted date: 2019-10-03
in scheme: Definition of correct units for the observed determinands in the given WISE SoE DD tables
has determinand: CAS 13457-18-6
has uom: ug.L-1
has table: WISE-SoE WaterQuality.AggregatedData

WISE-SoE_WaterQuality.AggregatedData - CAS_135-19-3 - ug/L
type: Concept
notation: WISE-SoE_WaterQuality.AggregatedData - CAS_135-19-3 - ug/L
definition: The unit of measure for 'CAS_135-19-3' (2-naphthol) in WISE SoE - Water Quality: Aggregated data table is 'ug/L'
status: valid
status modified: 2019-10-03
accepted date: 2019-10-03
in scheme: Definition of correct units for the observed determinands in the given WISE SoE DD tables
has determinand: CAS 135-19-3
has uom: ug.L-1
has table: WISE-SoE WaterQuality.AggregatedData

WISE-SoE_WaterQuality.AggregatedData - CAS_135-98-8 - ug/L
type: Concept
notation: WISE-SoE_WaterQuality.AggregatedData - CAS_135-98-8 - ug/L
definition: The unit of measure for 'CAS_135-98-8' (sec-butylbenzene) in WISE SoE - Water Quality: Aggregated data table is 'ug/L'
status: valid
status modified: 2019-10-03
accepted date: 2019-10-03
in scheme: Definition of correct units for the observed determinands in the given WISE SoE DD tables
has determinand: CAS 135-98-8
has uom: ug.L-1
has table: WISE-SoE WaterQuality.AggregatedData

WISE-SoE_WaterQuality.AggregatedData - CAS_135410-20-7 - ug/L
type: Concept
notation: WISE-SoE_WaterQuality.AggregatedData - CAS_135410-20-7 - ug/L
definition: The unit of measure for 'CAS_135410-20-7' (Ethanimidamide) in WISE SoE - Water Quality: Aggregated data table is 'ug/L'
status: valid
status modified: 2019-10-03
accepted date: 2019-10-03
in scheme: Definition of correct units for the observed determinands in the given WISE SoE DD tables
has determinand: CAS 135410-20-7
has uom: ug.L-1
has table: WISE-SoE WaterQuality.AggregatedData

WISE-SoE_WaterQuality.AggregatedData - CAS_136-85-6 - ug/L
type: Concept
notation: WISE-SoE_WaterQuality.AggregatedData - CAS_136-85-6 - ug/L
definition: The unit of measure for 'CAS_136-85-6' (Methylbenzotriazol) in WISE SoE - Water Quality: Aggregated data table is 'ug/L'
status: valid
status modified: 2019-10-03
accepted date: 2019-10-03
in scheme: Definition of correct units for the observed determinands in the given WISE SoE DD tables
has determinand: CAS 136-85-6
has uom: ug.L-1
has table: WISE-SoE WaterQuality.AggregatedData

WISE-SoE_WaterQuality.AggregatedData - CAS_136426-54-5 - ug/L
type: Concept
notation: WISE-SoE_WaterQuality.AggregatedData - CAS_136426-54-5 - ug/L
definition: The unit of measure for 'CAS_136426-54-5' (Fluquinconazole) in WISE SoE - Water Quality: Aggregated data table is 'ug/L'
status: valid
status modified: 2019-10-03
accepted date: 2019-10-03
in scheme: Definition of correct units for the observed determinands in the given WISE SoE DD tables
has determinand: CAS 136426-54-5
has uom: ug.L-1
has table: WISE-SoE WaterQuality.AggregatedData

WISE-SoE_WaterQuality.AggregatedData - CAS_136677-10-6 - ug/L
type: Concept
notation: WISE-SoE_WaterQuality.AggregatedData - CAS_136677-10-6 - ug/L
definition: The unit of measure for 'CAS_136677-10-6' (Polychlorinated dibenzofurans (10 PCDFs)) in WISE SoE - Water Quality: Aggregated data table is 'ug/L'
status: valid
status modified: 2019-10-03
accepted date: 2019-10-03
in scheme: Definition of correct units for the observed determinands in the given WISE SoE DD tables
has determinand: CAS 136677-10-6
has uom: ug.L-1
has table: WISE-SoE WaterQuality.AggregatedData

WISE-SoE_WaterQuality.AggregatedData - CAS_13684-56-5 - ug/L
type: Concept
notation: WISE-SoE_WaterQuality.AggregatedData - CAS_13684-56-5 - ug/L
definition: The unit of measure for 'CAS_13684-56-5' (Desmedipham) in WISE SoE - Water Quality: Aggregated data table is 'ug/L'
status: valid
status modified: 2019-10-03
accepted date: 2019-10-03
in scheme: Definition of correct units for the observed determinands in the given WISE SoE DD tables
has determinand: CAS 13684-56-5
has uom: ug.L-1
has table: WISE-SoE WaterQuality.AggregatedData

WISE-SoE_WaterQuality.AggregatedData - CAS_137-26-8 - ug/L
type: Concept
notation: WISE-SoE_WaterQuality.AggregatedData - CAS_137-26-8 - ug/L
definition: The unit of measure for 'CAS_137-26-8' (Thiram) in WISE SoE - Water Quality: Aggregated data table is 'ug/L'
status: valid
status modified: 2019-10-03
accepted date: 2019-10-03
in scheme: Definition of correct units for the observed determinands in the given WISE SoE DD tables
has determinand: CAS 137-26-8
has uom: ug.L-1
has table: WISE-SoE WaterQuality.AggregatedData

WISE-SoE_WaterQuality.AggregatedData - CAS_137-30-4 - ug/L
type: Concept
notation: WISE-SoE_WaterQuality.AggregatedData - CAS_137-30-4 - ug/L
definition: The unit of measure for 'CAS_137-30-4' (Ziram) in WISE SoE - Water Quality: Aggregated data table is 'ug/L'
status: valid
status modified: 2019-10-03
accepted date: 2019-10-03
in scheme: Definition of correct units for the observed determinands in the given WISE SoE DD tables
has determinand: CAS 137-30-4
has uom: ug.L-1
has table: WISE-SoE WaterQuality.AggregatedData

WISE-SoE_WaterQuality.AggregatedData - CAS_137641-05-5 - ug/L
type: Concept
notation: WISE-SoE_WaterQuality.AggregatedData - CAS_137641-05-5 - ug/L
definition: The unit of measure for 'CAS_137641-05-5' (Picolinafen) in WISE SoE - Water Quality: Aggregated data table is 'ug/L'
status: valid
status modified: 2019-10-03
accepted date: 2019-10-03
in scheme: Definition of correct units for the observed determinands in the given WISE SoE DD tables
has determinand: CAS 137641-05-5
has uom: ug.L-1
has table: WISE-SoE WaterQuality.AggregatedData

WISE-SoE_WaterQuality.AggregatedData - CAS_138261-41-3 - ug/L
type: Concept
notation: WISE-SoE_WaterQuality.AggregatedData - CAS_138261-41-3 - ug/L
definition: The unit of measure for 'CAS_138261-41-3' (Imidacloprid) in WISE SoE - Water Quality: Aggregated data table is 'ug/L'
status: valid
status modified: 2019-10-03
accepted date: 2019-10-03
in scheme: Definition of correct units for the observed determinands in the given WISE SoE DD tables
has determinand: CAS 138261-41-3
has uom: ug.L-1
has table: WISE-SoE WaterQuality.AggregatedData

WISE-SoE_WaterQuality.AggregatedData - CAS_139-13-9 - ug/L
type: Concept
notation: WISE-SoE_WaterQuality.AggregatedData - CAS_139-13-9 - ug/L
definition: The unit of measure for 'CAS_139-13-9' (NTA) in WISE SoE - Water Quality: Aggregated data table is 'ug/L'
status: valid
status modified: 2019-10-03
accepted date: 2019-10-03
in scheme: Definition of correct units for the observed determinands in the given WISE SoE DD tables
has determinand: CAS 139-13-9
has uom: ug.L-1
has table: WISE-SoE WaterQuality.AggregatedData

WISE-SoE_WaterQuality.AggregatedData - CAS_139-40-2 - ug/L
type: Concept
notation: WISE-SoE_WaterQuality.AggregatedData - CAS_139-40-2 - ug/L
definition: The unit of measure for 'CAS_139-40-2' (Propazine) in WISE SoE - Water Quality: Aggregated data table is 'ug/L'
status: valid
status modified: 2019-10-03
accepted date: 2019-10-03
in scheme: Definition of correct units for the observed determinands in the given WISE SoE DD tables
has determinand: CAS 139-40-2
has uom: ug.L-1
has table: WISE-SoE WaterQuality.AggregatedData

WISE-SoE_WaterQuality.AggregatedData - CAS_139528-85-1 - ug/L
type: Concept
notation: WISE-SoE_WaterQuality.AggregatedData - CAS_139528-85-1 - ug/L
definition: The unit of measure for 'CAS_139528-85-1' (Metosulam) in WISE SoE - Water Quality: Aggregated data table is 'ug/L'
status: valid
status modified: 2019-10-03
accepted date: 2019-10-03
in scheme: Definition of correct units for the observed determinands in the given WISE SoE DD tables
has determinand: CAS 139528-85-1
has uom: ug.L-1
has table: WISE-SoE WaterQuality.AggregatedData

WISE-SoE_WaterQuality.AggregatedData - CAS_139968-49-3 - ug/L
type: Concept
notation: WISE-SoE_WaterQuality.AggregatedData - CAS_139968-49-3 - ug/L
definition: The unit of measure for 'CAS_139968-49-3' (Metaflumizone) in WISE SoE - Water Quality: Aggregated data table is 'ug/L'
status: valid
status modified: 2019-10-03
accepted date: 2019-10-03
in scheme: Definition of correct units for the observed determinands in the given WISE SoE DD tables
has determinand: CAS 139968-49-3
has uom: ug.L-1
has table: WISE-SoE WaterQuality.AggregatedData

WISE-SoE_WaterQuality.AggregatedData - CAS_140-57-8 - ug/L
type: Concept
notation: WISE-SoE_WaterQuality.AggregatedData - CAS_140-57-8 - ug/L
definition: The unit of measure for 'CAS_140-57-8' (Aramite) in WISE SoE - Water Quality: Aggregated data table is 'ug/L'
status: valid
status modified: 2019-10-03
accepted date: 2019-10-03
in scheme: Definition of correct units for the observed determinands in the given WISE SoE DD tables
has determinand: CAS 140-57-8
has uom: ug.L-1
has table: WISE-SoE WaterQuality.AggregatedData

WISE-SoE_WaterQuality.AggregatedData - CAS_140-66-9 - ug/L
type: Concept
notation: WISE-SoE_WaterQuality.AggregatedData - CAS_140-66-9 - ug/L
definition: The unit of measure for 'CAS_140-66-9' (Octylphenol (4-(1,1',3,3'-tetramethylbutyl)-phenol)) in WISE SoE - Water Quality: Aggregated data table is 'ug/L'
status: valid
status modified: 2019-10-03
accepted date: 2019-10-03
in scheme: Definition of correct units for the observed determinands in the given WISE SoE DD tables
has determinand: CAS 140-66-9
has uom: ug.L-1
has table: WISE-SoE WaterQuality.AggregatedData

WISE-SoE_WaterQuality.AggregatedData - CAS_140923-17-7 - ug/L
type: Concept
notation: WISE-SoE_WaterQuality.AggregatedData - CAS_140923-17-7 - ug/L
definition: The unit of measure for 'CAS_140923-17-7' (Iprovalicarb) in WISE SoE - Water Quality: Aggregated data table is 'ug/L'
status: valid
status modified: 2019-10-03
accepted date: 2019-10-03
in scheme: Definition of correct units for the observed determinands in the given WISE SoE DD tables
has determinand: CAS 140923-17-7
has uom: ug.L-1
has table: WISE-SoE WaterQuality.AggregatedData

WISE-SoE_WaterQuality.AggregatedData - CAS_141112-29-0 - ug/L
type: Concept
notation: WISE-SoE_WaterQuality.AggregatedData - CAS_141112-29-0 - ug/L
definition: The unit of measure for 'CAS_141112-29-0' (Isoxaflutole) in WISE SoE - Water Quality: Aggregated data table is 'ug/L'
status: valid
status modified: 2019-10-03
accepted date: 2019-10-03
in scheme: Definition of correct units for the observed determinands in the given WISE SoE DD tables
has determinand: CAS 141112-29-0
has uom: ug.L-1
has table: WISE-SoE WaterQuality.AggregatedData

WISE-SoE_WaterQuality.AggregatedData - CAS_141517-21-7 - ug/L
type: Concept
notation: WISE-SoE_WaterQuality.AggregatedData - CAS_141517-21-7 - ug/L
definition: The unit of measure for 'CAS_141517-21-7' (Trifloxystrobin) in WISE SoE - Water Quality: Aggregated data table is 'ug/L'
status: valid
status modified: 2019-10-03
accepted date: 2019-10-03
in scheme: Definition of correct units for the observed determinands in the given WISE SoE DD tables
has determinand: CAS 141517-21-7
has uom: ug.L-1
has table: WISE-SoE WaterQuality.AggregatedData

WISE-SoE_WaterQuality.AggregatedData - CAS_141776-32-1 - ug/L
type: Concept
notation: WISE-SoE_WaterQuality.AggregatedData - CAS_141776-32-1 - ug/L
definition: The unit of measure for 'CAS_141776-32-1' (Sulfosulfuron) in WISE SoE - Water Quality: Aggregated data table is 'ug/L'
status: valid
status modified: 2019-10-03
accepted date: 2019-10-03
in scheme: Definition of correct units for the observed determinands in the given WISE SoE DD tables
has determinand: CAS 141776-32-1
has uom: ug.L-1
has table: WISE-SoE WaterQuality.AggregatedData

WISE-SoE_WaterQuality.AggregatedData - CAS_1418095-02-9 - ug/L
type: Concept
notation: WISE-SoE_WaterQuality.AggregatedData - CAS_1418095-02-9 - ug/L
definition: The unit of measure for 'CAS_1418095-02-9' (Chlorothalonil ESA (VIS-01)) in WISE SoE - Water Quality: Aggregated data table is 'ug/L'
status: valid
status modified: 2019-10-03
accepted date: 2019-10-03
in scheme: Definition of correct units for the observed determinands in the given WISE SoE DD tables
has determinand: CAS 1418095-02-9
has uom: ug.L-1
has table: WISE-SoE WaterQuality.AggregatedData

WISE-SoE_WaterQuality.AggregatedData - CAS_142-28-9 - ug/L
type: Concept
notation: WISE-SoE_WaterQuality.AggregatedData - CAS_142-28-9 - ug/L
definition: The unit of measure for 'CAS_142-28-9' (1,3-dichloropropane) in WISE SoE - Water Quality: Aggregated data table is 'ug/L'
status: valid
status modified: 2019-10-03
accepted date: 2019-10-03
in scheme: Definition of correct units for the observed determinands in the given WISE SoE DD tables
has determinand: CAS 142-28-9
has uom: ug.L-1
has table: WISE-SoE WaterQuality.AggregatedData

WISE-SoE_WaterQuality.AggregatedData - CAS_142363-53-9 - ug/L
type: Concept
notation: WISE-SoE_WaterQuality.AggregatedData - CAS_142363-53-9 - ug/L
definition: The unit of measure for 'CAS_142363-53-9' (Alachlor ESA) in WISE SoE - Water Quality: Aggregated data table is 'ug/L'
status: valid
status modified: 2019-10-03
accepted date: 2019-10-03
in scheme: Definition of correct units for the observed determinands in the given WISE SoE DD tables
has determinand: CAS 142363-53-9
has uom: ug.L-1
has table: WISE-SoE WaterQuality.AggregatedData

WISE-SoE_WaterQuality.AggregatedData - CAS_142459-58-3 - ug/L
type: Concept
notation: WISE-SoE_WaterQuality.AggregatedData - CAS_142459-58-3 - ug/L
definition: The unit of measure for 'CAS_142459-58-3' (Flufenacet) in WISE SoE - Water Quality: Aggregated data table is 'ug/L'
status: valid
status modified: 2019-10-03
accepted date: 2019-10-03
in scheme: Definition of correct units for the observed determinands in the given WISE SoE DD tables
has determinand: CAS 142459-58-3
has uom: ug.L-1
has table: WISE-SoE WaterQuality.AggregatedData

WISE-SoE_WaterQuality.AggregatedData - CAS_14265-44-2 - mg{P}/L
type: Concept
notation: WISE-SoE_WaterQuality.AggregatedData - CAS_14265-44-2 - mg{P}/L
definition: The unit of measure for 'CAS_14265-44-2' (Phosphate) in WISE SoE - Water Quality: Aggregated data table is 'mg{P}/L'
status: valid
status modified: 2019-10-03
accepted date: 2019-10-03
in scheme: Definition of correct units for the observed determinands in the given WISE SoE DD tables
has determinand: CAS 14265-44-2
has uom: mg{P}.L-1
has table: WISE-SoE WaterQuality.AggregatedData

WISE-SoE_WaterQuality.AggregatedData - CAS_143-50-0 - ug/L
type: Concept
notation: WISE-SoE_WaterQuality.AggregatedData - CAS_143-50-0 - ug/L
definition: The unit of measure for 'CAS_143-50-0' (Chlordecone (Kepone)) in WISE SoE - Water Quality: Aggregated data table is 'ug/L'
status: valid
status modified: 2019-10-03
accepted date: 2019-10-03
in scheme: Definition of correct units for the observed determinands in the given WISE SoE DD tables
has determinand: CAS 143-50-0
has uom: ug.L-1
has table: WISE-SoE WaterQuality.AggregatedData

WISE-SoE_WaterQuality.AggregatedData - CAS_143390-89-0 - ug/L
type: Concept
notation: WISE-SoE_WaterQuality.AggregatedData - CAS_143390-89-0 - ug/L
definition: The unit of measure for 'CAS_143390-89-0' (Kresoxim-methyl) in WISE SoE - Water Quality: Aggregated data table is 'ug/L'
status: valid
status modified: 2019-10-03
accepted date: 2019-10-03
in scheme: Definition of correct units for the observed determinands in the given WISE SoE DD tables
has determinand: CAS 143390-89-0
has uom: ug.L-1
has table: WISE-SoE WaterQuality.AggregatedData

WISE-SoE_WaterQuality.AggregatedData - CAS_144-49-0 - ug/L
type: Concept
notation: WISE-SoE_WaterQuality.AggregatedData - CAS_144-49-0 - ug/L
definition: The unit of measure for 'CAS_144-49-0' (Fluoroacetic acid) in WISE SoE - Water Quality: Aggregated data table is 'ug/L'
status: valid
status modified: 2019-10-03
accepted date: 2019-10-03
in scheme: Definition of correct units for the observed determinands in the given WISE SoE DD tables
has determinand: CAS 144-49-0
has uom: ug.L-1
has table: WISE-SoE WaterQuality.AggregatedData

WISE-SoE_WaterQuality.AggregatedData - CAS_1461-25-2 - ug/L
type: Concept
notation: WISE-SoE_WaterQuality.AggregatedData - CAS_1461-25-2 - ug/L
definition: The unit of measure for 'CAS_1461-25-2' (Tetrabutyltin) in WISE SoE - Water Quality: Aggregated data table is 'ug/L'
status: valid
status modified: 2019-10-03
accepted date: 2019-10-03
in scheme: Definition of correct units for the observed determinands in the given WISE SoE DD tables
has determinand: CAS 1461-25-2
has uom: ug.L-1
has table: WISE-SoE WaterQuality.AggregatedData

WISE-SoE_WaterQuality.AggregatedData - CAS_14797-55-8 - mg{NO3}/L
type: Concept
notation: WISE-SoE_WaterQuality.AggregatedData - CAS_14797-55-8 - mg{NO3}/L
definition: The unit of measure for 'CAS_14797-55-8' (Nitrate) in WISE SoE - Water Quality: Aggregated data table is 'mg{NO3}/L'
status: valid
status modified: 2019-10-03
accepted date: 2019-10-03
in scheme: Definition of correct units for the observed determinands in the given WISE SoE DD tables
has determinand: CAS 14797-55-8
has uom: mg{NO3}.L-1
has table: WISE-SoE WaterQuality.AggregatedData

WISE-SoE_WaterQuality.AggregatedData - CAS_14797-65-0 - mg{NO2}/L
type: Concept
notation: WISE-SoE_WaterQuality.AggregatedData - CAS_14797-65-0 - mg{NO2}/L
definition: The unit of measure for 'CAS_14797-65-0' (Nitrite) in WISE SoE - Water Quality: Aggregated data table is 'mg{NO2}/L'
status: valid
status modified: 2019-10-03
accepted date: 2019-10-03
in scheme: Definition of correct units for the observed determinands in the given WISE SoE DD tables
has determinand: CAS 14797-65-0
has uom: mg{NO2}.L-1
has table: WISE-SoE WaterQuality.AggregatedData

WISE-SoE_WaterQuality.AggregatedData - CAS_14798-03-9 - mg{NH4}/L
type: Concept
notation: WISE-SoE_WaterQuality.AggregatedData - CAS_14798-03-9 - mg{NH4}/L
definition: The unit of measure for 'CAS_14798-03-9' (Ammonium) in WISE SoE - Water Quality: Aggregated data table is 'mg{NH4}/L'
status: valid
status modified: 2019-10-03
accepted date: 2019-10-03
in scheme: Definition of correct units for the observed determinands in the given WISE SoE DD tables
has determinand: CAS 14798-03-9
has uom: mg{NH4}.L-1
has table: WISE-SoE WaterQuality.AggregatedData

WISE-SoE_WaterQuality.AggregatedData - CAS_14816-18-3 - ug/L
type: Concept
notation: WISE-SoE_WaterQuality.AggregatedData - CAS_14816-18-3 - ug/L
definition: The unit of measure for 'CAS_14816-18-3' (Phoxim) in WISE SoE - Water Quality: Aggregated data table is 'ug/L'
status: valid
status modified: 2019-10-03
accepted date: 2019-10-03
in scheme: Definition of correct units for the observed determinands in the given WISE SoE DD tables
has determinand: CAS 14816-18-3
has uom: ug.L-1
has table: WISE-SoE WaterQuality.AggregatedData

WISE-SoE_WaterQuality.AggregatedData - CAS_14866-68-3 - ug/L
type: Concept
notation: WISE-SoE_WaterQuality.AggregatedData - CAS_14866-68-3 - ug/L
definition: The unit of measure for 'CAS_14866-68-3' (Chlorates) in WISE SoE - Water Quality: Aggregated data table is 'ug/L'
status: valid
status modified: 2019-10-03
accepted date: 2019-10-03
in scheme: Definition of correct units for the observed determinands in the given WISE SoE DD tables
has determinand: CAS 14866-68-3
has uom: ug.L-1
has table: WISE-SoE WaterQuality.AggregatedData

WISE-SoE_WaterQuality.AggregatedData - CAS_14998-27-7 - ug/L
type: Concept
notation: WISE-SoE_WaterQuality.AggregatedData - CAS_14998-27-7 - ug/L
definition: The unit of measure for 'CAS_14998-27-7' (Chlorite) in WISE SoE - Water Quality: Aggregated data table is 'ug/L'
status: valid
status modified: 2019-10-03
accepted date: 2019-10-03
in scheme: Definition of correct units for the observed determinands in the given WISE SoE DD tables
has determinand: CAS 14998-27-7
has uom: ug.L-1
has table: WISE-SoE WaterQuality.AggregatedData

WISE-SoE_WaterQuality.AggregatedData - CAS_150-68-5 - ug/L
type: Concept
notation: WISE-SoE_WaterQuality.AggregatedData - CAS_150-68-5 - ug/L
definition: The unit of measure for 'CAS_150-68-5' (Monuron) in WISE SoE - Water Quality: Aggregated data table is 'ug/L'
status: valid
status modified: 2019-10-03
accepted date: 2019-10-03
in scheme: Definition of correct units for the observed determinands in the given WISE SoE DD tables
has determinand: CAS 150-68-5
has uom: ug.L-1
has table: WISE-SoE WaterQuality.AggregatedData

WISE-SoE_WaterQuality.AggregatedData - CAS_151-21-3 - ug/L
type: Concept
notation: WISE-SoE_WaterQuality.AggregatedData - CAS_151-21-3 - ug/L
definition: The unit of measure for 'CAS_151-21-3' (Sodium dodecyl sulfate) in WISE SoE - Water Quality: Aggregated data table is 'ug/L'
status: valid
status modified: 2019-10-03
accepted date: 2019-10-03
in scheme: Definition of correct units for the observed determinands in the given WISE SoE DD tables
has determinand: CAS 151-21-3
has uom: ug.L-1
has table: WISE-SoE WaterQuality.AggregatedData

WISE-SoE_WaterQuality.AggregatedData - CAS_15165-67-0 - ug/L
type: Concept
notation: WISE-SoE_WaterQuality.AggregatedData - CAS_15165-67-0 - ug/L
definition: The unit of measure for 'CAS_15165-67-0' (Dichlorprop-P) in WISE SoE - Water Quality: Aggregated data table is 'ug/L'
status: valid
status modified: 2019-10-03
accepted date: 2019-10-03
in scheme: Definition of correct units for the observed determinands in the given WISE SoE DD tables
has determinand: CAS 15165-67-0
has uom: ug.L-1
has table: WISE-SoE WaterQuality.AggregatedData

WISE-SoE_WaterQuality.AggregatedData - CAS_152019-73-3 - ug/L
type: Concept
notation: WISE-SoE_WaterQuality.AggregatedData - CAS_152019-73-3 - ug/L
definition: The unit of measure for 'CAS_152019-73-3' (Metolachlor OA) in WISE SoE - Water Quality: Aggregated data table is 'ug/L'
status: valid
status modified: 2019-10-03
accepted date: 2019-10-03
in scheme: Definition of correct units for the observed determinands in the given WISE SoE DD tables
has determinand: CAS 152019-73-3
has uom: ug.L-1
has table: WISE-SoE WaterQuality.AggregatedData

WISE-SoE_WaterQuality.AggregatedData - CAS_15299-99-7 - ug/L
type: Concept
notation: WISE-SoE_WaterQuality.AggregatedData - CAS_15299-99-7 - ug/L
definition: The unit of measure for 'CAS_15299-99-7' (Napropamide) in WISE SoE - Water Quality: Aggregated data table is 'ug/L'
status: valid
status modified: 2019-10-03
accepted date: 2019-10-03
in scheme: Definition of correct units for the observed determinands in the given WISE SoE DD tables
has determinand: CAS 15299-99-7
has uom: ug.L-1
has table: WISE-SoE WaterQuality.AggregatedData

WISE-SoE_WaterQuality.AggregatedData - CAS_15307-79-6 - ug/L
type: Concept
notation: WISE-SoE_WaterQuality.AggregatedData - CAS_15307-79-6 - ug/L
definition: The unit of measure for 'CAS_15307-79-6' (Diclofenac sodium) in WISE SoE - Water Quality: Aggregated data table is 'ug/L'
status: valid
status modified: 2019-10-03
accepted date: 2019-10-03
in scheme: Definition of correct units for the observed determinands in the given WISE SoE DD tables
has determinand: CAS 15307-79-6
has uom: ug.L-1
has table: WISE-SoE WaterQuality.AggregatedData

WISE-SoE_WaterQuality.AggregatedData - CAS_15307-86-5 - ug/L
type: Concept
notation: WISE-SoE_WaterQuality.AggregatedData - CAS_15307-86-5 - ug/L
definition: The unit of measure for 'CAS_15307-86-5' (Diclofenac) in WISE SoE - Water Quality: Aggregated data table is 'ug/L'
status: valid
status modified: 2019-10-03
accepted date: 2019-10-03
in scheme: Definition of correct units for the observed determinands in the given WISE SoE DD tables
has determinand: CAS 15307-86-5
has uom: ug.L-1
has table: WISE-SoE WaterQuality.AggregatedData

WISE-SoE_WaterQuality.AggregatedData - CAS_153719-23-4 - ug/L
type: Concept
notation: WISE-SoE_WaterQuality.AggregatedData - CAS_153719-23-4 - ug/L
definition: The unit of measure for 'CAS_153719-23-4' (Thiamethoxam) in WISE SoE - Water Quality: Aggregated data table is 'ug/L'
status: valid
status modified: 2019-10-03
accepted date: 2019-10-03
in scheme: Definition of correct units for the observed determinands in the given WISE SoE DD tables
has determinand: CAS 153719-23-4
has uom: ug.L-1
has table: WISE-SoE WaterQuality.AggregatedData

WISE-SoE_WaterQuality.AggregatedData - CAS_15541-45-4 - ug/L
type: Concept
notation: WISE-SoE_WaterQuality.AggregatedData - CAS_15541-45-4 - ug/L
definition: The unit of measure for 'CAS_15541-45-4' (Bromate) in WISE SoE - Water Quality: Aggregated data table is 'ug/L'
status: valid
status modified: 2019-10-03
accepted date: 2019-10-03
in scheme: Definition of correct units for the observed determinands in the given WISE SoE DD tables
has determinand: CAS 15541-45-4
has uom: ug.L-1
has table: WISE-SoE WaterQuality.AggregatedData

WISE-SoE_WaterQuality.AggregatedData - CAS_15545-48-9 - ug/L
type: Concept
notation: WISE-SoE_WaterQuality.AggregatedData - CAS_15545-48-9 - ug/L
definition: The unit of measure for 'CAS_15545-48-9' (Chlortoluron) in WISE SoE - Water Quality: Aggregated data table is 'ug/L'
status: valid
status modified: 2019-10-03
accepted date: 2019-10-03
in scheme: Definition of correct units for the observed determinands in the given WISE SoE DD tables
has determinand: CAS 15545-48-9
has uom: ug.L-1
has table: WISE-SoE WaterQuality.AggregatedData

WISE-SoE_WaterQuality.AggregatedData - CAS_156-59-2 - ug/L
type: Concept
notation: WISE-SoE_WaterQuality.AggregatedData - CAS_156-59-2 - ug/L
definition: The unit of measure for 'CAS_156-59-2' (cis-1,2-dichloroethene) in WISE SoE - Water Quality: Aggregated data table is 'ug/L'
status: valid
status modified: 2019-10-03
accepted date: 2019-10-03
in scheme: Definition of correct units for the observed determinands in the given WISE SoE DD tables
has determinand: CAS 156-59-2
has uom: ug.L-1
has table: WISE-SoE WaterQuality.AggregatedData

WISE-SoE_WaterQuality.AggregatedData - CAS_156-60-5 - ug/L
type: Concept
notation: WISE-SoE_WaterQuality.AggregatedData - CAS_156-60-5 - ug/L
definition: The unit of measure for 'CAS_156-60-5' (trans-1,2-dichloroethene) in WISE SoE - Water Quality: Aggregated data table is 'ug/L'
status: valid
status modified: 2019-10-03
accepted date: 2019-10-03
in scheme: Definition of correct units for the observed determinands in the given WISE SoE DD tables
has determinand: CAS 156-60-5
has uom: ug.L-1
has table: WISE-SoE WaterQuality.AggregatedData

WISE-SoE_WaterQuality.AggregatedData - CAS_1563-66-2 - ug/L
type: Concept
notation: WISE-SoE_WaterQuality.AggregatedData - CAS_1563-66-2 - ug/L
definition: The unit of measure for 'CAS_1563-66-2' (Carbofuran) in WISE SoE - Water Quality: Aggregated data table is 'ug/L'
status: valid
status modified: 2019-10-03
accepted date: 2019-10-03
in scheme: Definition of correct units for the observed determinands in the given WISE SoE DD tables
has determinand: CAS 1563-66-2
has uom: ug.L-1
has table: WISE-SoE WaterQuality.AggregatedData

WISE-SoE_WaterQuality.AggregatedData - CAS_15687-27-1 - ug/L
type: Concept
notation: WISE-SoE_WaterQuality.AggregatedData - CAS_15687-27-1 - ug/L
definition: The unit of measure for 'CAS_15687-27-1' (Ibuprofen) in WISE SoE - Water Quality: Aggregated data table is 'ug/L'
status: valid
status modified: 2019-10-03
accepted date: 2019-10-03
in scheme: Definition of correct units for the observed determinands in the given WISE SoE DD tables
has determinand: CAS 15687-27-1
has uom: ug.L-1
has table: WISE-SoE WaterQuality.AggregatedData

WISE-SoE_WaterQuality.AggregatedData - CAS_1570-64-5 - ug/L
type: Concept
notation: WISE-SoE_WaterQuality.AggregatedData - CAS_1570-64-5 - ug/L
definition: The unit of measure for 'CAS_1570-64-5' (4-chloro-2-methylphenol) in WISE SoE - Water Quality: Aggregated data table is 'ug/L'
status: valid
status modified: 2019-10-03
accepted date: 2019-10-03
in scheme: Definition of correct units for the observed determinands in the given WISE SoE DD tables
has determinand: CAS 1570-64-5
has uom: ug.L-1
has table: WISE-SoE WaterQuality.AggregatedData

WISE-SoE_WaterQuality.AggregatedData - CAS_1570-65-6 - ug/L
type: Concept
notation: WISE-SoE_WaterQuality.AggregatedData - CAS_1570-65-6 - ug/L
definition: The unit of measure for 'CAS_1570-65-6' (4,6-dichloro-2-methylphenol) in WISE SoE - Water Quality: Aggregated data table is 'ug/L'
status: valid
status modified: 2019-10-03
accepted date: 2019-10-03
in scheme: Definition of correct units for the observed determinands in the given WISE SoE DD tables
has determinand: CAS 1570-65-6
has uom: ug.L-1
has table: WISE-SoE WaterQuality.AggregatedData

WISE-SoE_WaterQuality.AggregatedData - CAS_1582-09-8 - ug/L
type: Concept
notation: WISE-SoE_WaterQuality.AggregatedData - CAS_1582-09-8 - ug/L
definition: The unit of measure for 'CAS_1582-09-8' (Trifluralin) in WISE SoE - Water Quality: Aggregated data table is 'ug/L'
status: valid
status modified: 2019-10-03
accepted date: 2019-10-03
in scheme: Definition of correct units for the observed determinands in the given WISE SoE DD tables
has determinand: CAS 1582-09-8
has uom: ug.L-1
has table: WISE-SoE WaterQuality.AggregatedData

WISE-SoE_WaterQuality.AggregatedData - CAS_15950-66-0 - ug/L
type: Concept
notation: WISE-SoE_WaterQuality.AggregatedData - CAS_15950-66-0 - ug/L
definition: The unit of measure for 'CAS_15950-66-0' (2,3,4-Trichlorophenol) in WISE SoE - Water Quality: Aggregated data table is 'ug/L'
status: valid
status modified: 2019-10-03
accepted date: 2019-10-03
in scheme: Definition of correct units for the observed determinands in the given WISE SoE DD tables
has determinand: CAS 15950-66-0
has uom: ug.L-1
has table: WISE-SoE WaterQuality.AggregatedData

WISE-SoE_WaterQuality.AggregatedData - CAS_15972-60-8 - ug/L
type: Concept
notation: WISE-SoE_WaterQuality.AggregatedData - CAS_15972-60-8 - ug/L
definition: The unit of measure for 'CAS_15972-60-8' (Alachlor) in WISE SoE - Water Quality: Aggregated data table is 'ug/L'
status: valid
status modified: 2019-10-03
accepted date: 2019-10-03
in scheme: Definition of correct units for the observed determinands in the given WISE SoE DD tables
has determinand: CAS 15972-60-8
has uom: ug.L-1
has table: WISE-SoE WaterQuality.AggregatedData

WISE-SoE_WaterQuality.AggregatedData - CAS_160430-64-8 - ug/L
type: Concept
notation: WISE-SoE_WaterQuality.AggregatedData - CAS_160430-64-8 - ug/L
definition: The unit of measure for 'CAS_160430-64-8' (Acetamiprid) in WISE SoE - Water Quality: Aggregated data table is 'ug/L'
status: valid
status modified: 2019-10-03
accepted date: 2019-10-03
in scheme: Definition of correct units for the observed determinands in the given WISE SoE DD tables
has determinand: CAS 160430-64-8
has uom: ug.L-1
has table: WISE-SoE WaterQuality.AggregatedData

WISE-SoE_WaterQuality.AggregatedData - CAS_1610-18-0 - ug/L
type: Concept
notation: WISE-SoE_WaterQuality.AggregatedData - CAS_1610-18-0 - ug/L
definition: The unit of measure for 'CAS_1610-18-0' (Prometon) in WISE SoE - Water Quality: Aggregated data table is 'ug/L'
status: valid
status modified: 2019-10-03
accepted date: 2019-10-03
in scheme: Definition of correct units for the observed determinands in the given WISE SoE DD tables
has determinand: CAS 1610-18-0
has uom: ug.L-1
has table: WISE-SoE WaterQuality.AggregatedData

WISE-SoE_WaterQuality.AggregatedData - CAS_16118-49-3 - ug/L
type: Concept
notation: WISE-SoE_WaterQuality.AggregatedData - CAS_16118-49-3 - ug/L
definition: The unit of measure for 'CAS_16118-49-3' (Carbetamide) in WISE SoE - Water Quality: Aggregated data table is 'ug/L'
status: valid
status modified: 2019-10-03
accepted date: 2019-10-03
in scheme: Definition of correct units for the observed determinands in the given WISE SoE DD tables
has determinand: CAS 16118-49-3
has uom: ug.L-1
has table: WISE-SoE WaterQuality.AggregatedData

WISE-SoE_WaterQuality.AggregatedData - CAS_1634-04-4 - ug/L
type: Concept
notation: WISE-SoE_WaterQuality.AggregatedData - CAS_1634-04-4 - ug/L
definition: The unit of measure for 'CAS_1634-04-4' (MTBE) in WISE SoE - Water Quality: Aggregated data table is 'ug/L'
status: valid
status modified: 2019-10-03
accepted date: 2019-10-03
in scheme: Definition of correct units for the observed determinands in the given WISE SoE DD tables
has determinand: CAS 1634-04-4
has uom: ug.L-1
has table: WISE-SoE WaterQuality.AggregatedData

WISE-SoE_WaterQuality.AggregatedData - CAS_1646-87-3 - ug/L
type: Concept
notation: WISE-SoE_WaterQuality.AggregatedData - CAS_1646-87-3 - ug/L
definition: The unit of measure for 'CAS_1646-87-3' (Aldicarb sulfoxide) in WISE SoE - Water Quality: Aggregated data table is 'ug/L'
status: valid
status modified: 2019-10-03
accepted date: 2019-10-03
in scheme: Definition of correct units for the observed determinands in the given WISE SoE DD tables
has determinand: CAS 1646-87-3
has uom: ug.L-1
has table: WISE-SoE WaterQuality.AggregatedData

WISE-SoE_WaterQuality.AggregatedData - CAS_1646-88-4 - ug/L
type: Concept
notation: WISE-SoE_WaterQuality.AggregatedData - CAS_1646-88-4 - ug/L
definition: The unit of measure for 'CAS_1646-88-4' (Aldoxycarb) in WISE SoE - Water Quality: Aggregated data table is 'ug/L'
status: valid
status modified: 2019-10-03
accepted date: 2019-10-03
in scheme: Definition of correct units for the observed determinands in the given WISE SoE DD tables
has determinand: CAS 1646-88-4
has uom: ug.L-1
has table: WISE-SoE WaterQuality.AggregatedData

WISE-SoE_WaterQuality.AggregatedData - CAS_16478-18-5 - ug/L
type: Concept
notation: WISE-SoE_WaterQuality.AggregatedData - CAS_16478-18-5 - ug/L
definition: The unit of measure for 'CAS_16478-18-5' (Pentachloroiodobenzene) in WISE SoE - Water Quality: Aggregated data table is 'ug/L'
status: valid
status modified: 2019-10-03
accepted date: 2019-10-03
in scheme: Definition of correct units for the observed determinands in the given WISE SoE DD tables
has determinand: CAS 16478-18-5
has uom: ug.L-1
has table: WISE-SoE WaterQuality.AggregatedData

WISE-SoE_WaterQuality.AggregatedData - CAS_16484-77-8 - ug/L
type: Concept
notation: WISE-SoE_WaterQuality.AggregatedData - CAS_16484-77-8 - ug/L
definition: The unit of measure for 'CAS_16484-77-8' (Mecoprop-P (MCPP-P)) in WISE SoE - Water Quality: Aggregated data table is 'ug/L'
status: valid
status modified: 2019-10-03
accepted date: 2019-10-03
in scheme: Definition of correct units for the observed determinands in the given WISE SoE DD tables
has determinand: CAS 16484-77-8
has uom: ug.L-1
has table: WISE-SoE WaterQuality.AggregatedData

WISE-SoE_WaterQuality.AggregatedData - CAS_16655-82-6 - ug/L
type: Concept
notation: WISE-SoE_WaterQuality.AggregatedData - CAS_16655-82-6 - ug/L
definition: The unit of measure for 'CAS_16655-82-6' (3-hydroxycarbofuran) in WISE SoE - Water Quality: Aggregated data table is 'ug/L'
status: valid
status modified: 2019-10-03
accepted date: 2019-10-03
in scheme: Definition of correct units for the observed determinands in the given WISE SoE DD tables
has determinand: CAS 16655-82-6
has uom: ug.L-1
has table: WISE-SoE WaterQuality.AggregatedData

WISE-SoE_WaterQuality.AggregatedData - CAS_16672-87-0 - ug/L
type: Concept
notation: WISE-SoE_WaterQuality.AggregatedData - CAS_16672-87-0 - ug/L
definition: The unit of measure for 'CAS_16672-87-0' (2-chloroethylphosphonic acid) in WISE SoE - Water Quality: Aggregated data table is 'ug/L'
status: valid
status modified: 2019-10-03
accepted date: 2019-10-03
in scheme: Definition of correct units for the observed determinands in the given WISE SoE DD tables
has determinand: CAS 16672-87-0
has uom: ug.L-1
has table: WISE-SoE WaterQuality.AggregatedData

WISE-SoE_WaterQuality.AggregatedData - CAS_1668-54-8 - ug/L
type: Concept
notation: WISE-SoE_WaterQuality.AggregatedData - CAS_1668-54-8 - ug/L
definition: The unit of measure for 'CAS_1668-54-8' (2-methyl-4-amino-6-methoxy-s-triazine) in WISE SoE - Water Quality: Aggregated data table is 'ug/L'
status: valid
status modified: 2019-10-03
accepted date: 2019-10-03
in scheme: Definition of correct units for the observed determinands in the given WISE SoE DD tables
has determinand: CAS 1668-54-8
has uom: ug.L-1
has table: WISE-SoE WaterQuality.AggregatedData

WISE-SoE_WaterQuality.AggregatedData - CAS_16752-77-5 - ug/L
type: Concept
notation: WISE-SoE_WaterQuality.AggregatedData - CAS_16752-77-5 - ug/L
definition: The unit of measure for 'CAS_16752-77-5' (Methomyl) in WISE SoE - Water Quality: Aggregated data table is 'ug/L'
status: valid
status modified: 2019-10-03
accepted date: 2019-10-03
in scheme: Definition of correct units for the observed determinands in the given WISE SoE DD tables
has determinand: CAS 16752-77-5
has uom: ug.L-1
has table: WISE-SoE WaterQuality.AggregatedData

WISE-SoE_WaterQuality.AggregatedData - CAS_16887-00-6 - mg/L
type: Concept
notation: WISE-SoE_WaterQuality.AggregatedData - CAS_16887-00-6 - mg/L
definition: The unit of measure for 'CAS_16887-00-6' (Chloride) in WISE SoE - Water Quality: Aggregated data table is 'mg/L'
status: valid
status modified: 2019-10-03
accepted date: 2019-10-03
in scheme: Definition of correct units for the observed determinands in the given WISE SoE DD tables
has determinand: CAS 16887-00-6
has uom: mg.L-1
has table: WISE-SoE WaterQuality.AggregatedData

WISE-SoE_WaterQuality.AggregatedData - CAS_1689-83-4 - ug/L
type: Concept
notation: WISE-SoE_WaterQuality.AggregatedData - CAS_1689-83-4 - ug/L
definition: The unit of measure for 'CAS_1689-83-4' (Ioxynil) in WISE SoE - Water Quality: Aggregated data table is 'ug/L'
status: valid
status modified: 2019-10-03
accepted date: 2019-10-03
in scheme: Definition of correct units for the observed determinands in the given WISE SoE DD tables
has determinand: CAS 1689-83-4
has uom: ug.L-1
has table: WISE-SoE WaterQuality.AggregatedData

WISE-SoE_WaterQuality.AggregatedData - CAS_1689-84-5 - ug/L
type: Concept
notation: WISE-SoE_WaterQuality.AggregatedData - CAS_1689-84-5 - ug/L
definition: The unit of measure for 'CAS_1689-84-5' (Bromoxynil) in WISE SoE - Water Quality: Aggregated data table is 'ug/L'
status: valid
status modified: 2019-10-03
accepted date: 2019-10-03
in scheme: Definition of correct units for the observed determinands in the given WISE SoE DD tables
has determinand: CAS 1689-84-5
has uom: ug.L-1
has table: WISE-SoE WaterQuality.AggregatedData

WISE-SoE_WaterQuality.AggregatedData - CAS_1689-99-2 - ug/L
type: Concept
notation: WISE-SoE_WaterQuality.AggregatedData - CAS_1689-99-2 - ug/L
definition: The unit of measure for 'CAS_1689-99-2' (Bromoxynil octanoate) in WISE SoE - Water Quality: Aggregated data table is 'ug/L'
status: valid
status modified: 2019-10-03
accepted date: 2019-10-03
in scheme: Definition of correct units for the observed determinands in the given WISE SoE DD tables
has determinand: CAS 1689-99-2
has uom: ug.L-1
has table: WISE-SoE WaterQuality.AggregatedData

WISE-SoE_WaterQuality.AggregatedData - CAS_1698-60-8 - ug/L
type: Concept
notation: WISE-SoE_WaterQuality.AggregatedData - CAS_1698-60-8 - ug/L
definition: The unit of measure for 'CAS_1698-60-8' (Chloridazon) in WISE SoE - Water Quality: Aggregated data table is 'ug/L'
status: valid
status modified: 2019-10-03
accepted date: 2019-10-03
in scheme: Definition of correct units for the observed determinands in the given WISE SoE DD tables
has determinand: CAS 1698-60-8
has uom: ug.L-1
has table: WISE-SoE WaterQuality.AggregatedData

WISE-SoE_WaterQuality.AggregatedData - CAS_16984-48-8 - ug/L
type: Concept
notation: WISE-SoE_WaterQuality.AggregatedData - CAS_16984-48-8 - ug/L
definition: The unit of measure for 'CAS_16984-48-8' (Fluoride) in WISE SoE - Water Quality: Aggregated data table is 'ug/L'
status: valid
status modified: 2019-10-03
accepted date: 2019-10-03
in scheme: Definition of correct units for the observed determinands in the given WISE SoE DD tables
has determinand: CAS 16984-48-8
has uom: ug.L-1
has table: WISE-SoE WaterQuality.AggregatedData

WISE-SoE_WaterQuality.AggregatedData - CAS_1702-17-6 - ug/L
type: Concept
notation: WISE-SoE_WaterQuality.AggregatedData - CAS_1702-17-6 - ug/L
definition: The unit of measure for 'CAS_1702-17-6' (Clopyralid) in WISE SoE - Water Quality: Aggregated data table is 'ug/L'
status: valid
status modified: 2019-10-03
accepted date: 2019-10-03
in scheme: Definition of correct units for the observed determinands in the given WISE SoE DD tables
has determinand: CAS 1702-17-6
has uom: ug.L-1
has table: WISE-SoE WaterQuality.AggregatedData

WISE-SoE_WaterQuality.AggregatedData - CAS_17040-19-6 - ug/L
type: Concept
notation: WISE-SoE_WaterQuality.AggregatedData - CAS_17040-19-6 - ug/L
definition: The unit of measure for 'CAS_17040-19-6' (Demeton-S-methylsulfon) in WISE SoE - Water Quality: Aggregated data table is 'ug/L'
status: valid
status modified: 2019-10-03
accepted date: 2019-10-03
in scheme: Definition of correct units for the observed determinands in the given WISE SoE DD tables
has determinand: CAS 17040-19-6
has uom: ug.L-1
has table: WISE-SoE WaterQuality.AggregatedData

WISE-SoE_WaterQuality.AggregatedData - CAS_171118-09-5 - ug/L
type: Concept
notation: WISE-SoE_WaterQuality.AggregatedData - CAS_171118-09-5 - ug/L
definition: The unit of measure for 'CAS_171118-09-5' (Metolachlor ESA) in WISE SoE - Water Quality: Aggregated data table is 'ug/L'
status: valid
status modified: 2019-10-03
accepted date: 2019-10-03
in scheme: Definition of correct units for the observed determinands in the given WISE SoE DD tables
has determinand: CAS 171118-09-5
has uom: ug.L-1
has table: WISE-SoE WaterQuality.AggregatedData

WISE-SoE_WaterQuality.AggregatedData - CAS_171262-17-2 - ug/L
type: Concept
notation: WISE-SoE_WaterQuality.AggregatedData - CAS_171262-17-2 - ug/L
definition: The unit of measure for 'CAS_171262-17-2' (Alachlor OA) in WISE SoE - Water Quality: Aggregated data table is 'ug/L'
status: valid
status modified: 2019-10-03
accepted date: 2019-10-03
in scheme: Definition of correct units for the observed determinands in the given WISE SoE DD tables
has determinand: CAS 171262-17-2
has uom: ug.L-1
has table: WISE-SoE WaterQuality.AggregatedData

WISE-SoE_WaterQuality.AggregatedData - CAS_17254-80-7 - ug/L
type: Concept
notation: WISE-SoE_WaterQuality.AggregatedData - CAS_17254-80-7 - ug/L
definition: The unit of measure for 'CAS_17254-80-7' (Chloridazon methyl desphenyl) in WISE SoE - Water Quality: Aggregated data table is 'ug/L'
status: valid
status modified: 2019-10-03
accepted date: 2019-10-03
in scheme: Definition of correct units for the observed determinands in the given WISE SoE DD tables
has determinand: CAS 17254-80-7
has uom: ug.L-1
has table: WISE-SoE WaterQuality.AggregatedData

WISE-SoE_WaterQuality.AggregatedData - CAS_172960-62-2 - ug/L
type: Concept
notation: WISE-SoE_WaterQuality.AggregatedData - CAS_172960-62-2 - ug/L
definition: The unit of measure for 'CAS_172960-62-2' (Metazachlor ESA) in WISE SoE - Water Quality: Aggregated data table is 'ug/L'
status: valid
status modified: 2019-10-03
accepted date: 2019-10-03
in scheme: Definition of correct units for the observed determinands in the given WISE SoE DD tables
has determinand: CAS 172960-62-2
has uom: ug.L-1
has table: WISE-SoE WaterQuality.AggregatedData

WISE-SoE_WaterQuality.AggregatedData - CAS_1746-01-6 - ug/L
type: Concept
notation: WISE-SoE_WaterQuality.AggregatedData - CAS_1746-01-6 - ug/L
definition: The unit of measure for 'CAS_1746-01-6' (TCDD (2,3,7,8-tetrachlorodibenzo-p-dioxin)) in WISE SoE - Water Quality: Aggregated data table is 'ug/L'
status: valid
status modified: 2019-10-03
accepted date: 2019-10-03
in scheme: Definition of correct units for the observed determinands in the given WISE SoE DD tables
has determinand: CAS 1746-01-6
has uom: ug.L-1
has table: WISE-SoE WaterQuality.AggregatedData

WISE-SoE_WaterQuality.AggregatedData - CAS_1746-81-2 - ug/L
type: Concept
notation: WISE-SoE_WaterQuality.AggregatedData - CAS_1746-81-2 - ug/L
definition: The unit of measure for 'CAS_1746-81-2' (Monolinuron) in WISE SoE - Water Quality: Aggregated data table is 'ug/L'
status: valid
status modified: 2019-10-03
accepted date: 2019-10-03
in scheme: Definition of correct units for the observed determinands in the given WISE SoE DD tables
has determinand: CAS 1746-81-2
has uom: ug.L-1
has table: WISE-SoE WaterQuality.AggregatedData

WISE-SoE_WaterQuality.AggregatedData - CAS_175013-18-0 - ug/L
type: Concept
notation: WISE-SoE_WaterQuality.AggregatedData - CAS_175013-18-0 - ug/L
definition: The unit of measure for 'CAS_175013-18-0' (Carbamic acid) in WISE SoE - Water Quality: Aggregated data table is 'ug/L'
status: valid
status modified: 2019-10-03
accepted date: 2019-10-03
in scheme: Definition of correct units for the observed determinands in the given WISE SoE DD tables
has determinand: CAS 175013-18-0
has uom: ug.L-1
has table: WISE-SoE WaterQuality.AggregatedData

WISE-SoE_WaterQuality.AggregatedData - CAS_1763-23-1 - ug/L
type: Concept
notation: WISE-SoE_WaterQuality.AggregatedData - CAS_1763-23-1 - ug/L
definition: The unit of measure for 'CAS_1763-23-1' (Perfluorooctane sulfonic acid (PFOS) and its derivatives) in WISE SoE - Water Quality: Aggregated data table is 'ug/L'
status: valid
status modified: 2019-10-03
accepted date: 2019-10-03
in scheme: Definition of correct units for the observed determinands in the given WISE SoE DD tables
has determinand: CAS 1763-23-1
has uom: ug.L-1
has table: WISE-SoE WaterQuality.AggregatedData

WISE-SoE_WaterQuality.AggregatedData - CAS_1806-26-4 - ug/L
type: Concept
notation: WISE-SoE_WaterQuality.AggregatedData - CAS_1806-26-4 - ug/L
definition: The unit of measure for 'CAS_1806-26-4' (Octylphenol) in WISE SoE - Water Quality: Aggregated data table is 'ug/L'
status: valid
status modified: 2019-10-03
accepted date: 2019-10-03
in scheme: Definition of correct units for the observed determinands in the given WISE SoE DD tables
has determinand: CAS 1806-26-4
has uom: ug.L-1
has table: WISE-SoE WaterQuality.AggregatedData

WISE-SoE_WaterQuality.AggregatedData - CAS_18181-70-9 - ug/L
type: Concept
notation: WISE-SoE_WaterQuality.AggregatedData - CAS_18181-70-9 - ug/L
definition: The unit of measure for 'CAS_18181-70-9' (Iodofenphos) in WISE SoE - Water Quality: Aggregated data table is 'ug/L'
status: valid
status modified: 2019-10-03
accepted date: 2019-10-03
in scheme: Definition of correct units for the observed determinands in the given WISE SoE DD tables
has determinand: CAS 18181-70-9
has uom: ug.L-1
has table: WISE-SoE WaterQuality.AggregatedData

WISE-SoE_WaterQuality.AggregatedData - CAS_18181-80-1 - ug/L
type: Concept
notation: WISE-SoE_WaterQuality.AggregatedData - CAS_18181-80-1 - ug/L
definition: The unit of measure for 'CAS_18181-80-1' (Bromopropylate) in WISE SoE - Water Quality: Aggregated data table is 'ug/L'
status: valid
status modified: 2019-10-03
accepted date: 2019-10-03
in scheme: Definition of correct units for the observed determinands in the given WISE SoE DD tables
has determinand: CAS 18181-80-1
has uom: ug.L-1
has table: WISE-SoE WaterQuality.AggregatedData

WISE-SoE_WaterQuality.AggregatedData - CAS_182346-21-0 - ug/L
type: Concept
notation: WISE-SoE_WaterQuality.AggregatedData - CAS_182346-21-0 - ug/L
definition: The unit of measure for 'CAS_182346-21-0' (BDE 85 (2,2’,3,4,4’-pentabromodiphenyl ether)) in WISE SoE - Water Quality: Aggregated data table is 'ug/L'
status: valid
status modified: 2019-10-03
accepted date: 2019-10-03
in scheme: Definition of correct units for the observed determinands in the given WISE SoE DD tables
has determinand: CAS 182346-21-0
has uom: ug.L-1
has table: WISE-SoE WaterQuality.AggregatedData

WISE-SoE_WaterQuality.AggregatedData - CAS_1825-21-4 - ug/L
type: Concept
notation: WISE-SoE_WaterQuality.AggregatedData - CAS_1825-21-4 - ug/L
definition: The unit of measure for 'CAS_1825-21-4' (Pentachloroanisole) in WISE SoE - Water Quality: Aggregated data table is 'ug/L'
status: valid
status modified: 2019-10-03
accepted date: 2019-10-03
in scheme: Definition of correct units for the observed determinands in the given WISE SoE DD tables
has determinand: CAS 1825-21-4
has uom: ug.L-1
has table: WISE-SoE WaterQuality.AggregatedData

WISE-SoE_WaterQuality.AggregatedData - CAS_182636-13-1 - ug/L
type: Concept
notation: WISE-SoE_WaterQuality.AggregatedData - CAS_182636-13-1 - ug/L
definition: The unit of measure for 'CAS_182636-13-1' (Imazamox) in WISE SoE - Water Quality: Aggregated data table is 'ug/L'
status: valid
status modified: 2019-10-03
accepted date: 2019-10-03
in scheme: Definition of correct units for the observed determinands in the given WISE SoE DD tables
has determinand: CAS 182636-13-1
has uom: ug.L-1
has table: WISE-SoE WaterQuality.AggregatedData

WISE-SoE_WaterQuality.AggregatedData - CAS_182677-30-1 - ug/L
type: Concept
notation: WISE-SoE_WaterQuality.AggregatedData - CAS_182677-30-1 - ug/L
definition: The unit of measure for 'CAS_182677-30-1' (BDE 138 (2,2’,3,4,4’,5’-hexabromodiphenyl ether)) in WISE SoE - Water Quality: Aggregated data table is 'ug/L'
status: valid
status modified: 2019-10-03
accepted date: 2019-10-03
in scheme: Definition of correct units for the observed determinands in the given WISE SoE DD tables
has determinand: CAS 182677-30-1
has uom: ug.L-1
has table: WISE-SoE WaterQuality.AggregatedData

WISE-SoE_WaterQuality.AggregatedData - CAS_1836-75-5 - ug/L
type: Concept
notation: WISE-SoE_WaterQuality.AggregatedData - CAS_1836-75-5 - ug/L
definition: The unit of measure for 'CAS_1836-75-5' (Nitrophen) in WISE SoE - Water Quality: Aggregated data table is 'ug/L'
status: valid
status modified: 2019-10-03
accepted date: 2019-10-03
in scheme: Definition of correct units for the observed determinands in the given WISE SoE DD tables
has determinand: CAS 1836-75-5
has uom: ug.L-1
has table: WISE-SoE WaterQuality.AggregatedData

WISE-SoE_WaterQuality.AggregatedData - CAS_185119-76-0 - ug/L
type: Concept
notation: WISE-SoE_WaterQuality.AggregatedData - CAS_185119-76-0 - ug/L
definition: The unit of measure for 'CAS_185119-76-0' (Iodosulfuron-methyl) in WISE SoE - Water Quality: Aggregated data table is 'ug/L'
status: valid
status modified: 2019-10-03
accepted date: 2019-10-03
in scheme: Definition of correct units for the observed determinands in the given WISE SoE DD tables
has determinand: CAS 185119-76-0
has uom: ug.L-1
has table: WISE-SoE WaterQuality.AggregatedData

WISE-SoE_WaterQuality.AggregatedData - CAS_18540-29-9 - ug/L
type: Concept
notation: WISE-SoE_WaterQuality.AggregatedData - CAS_18540-29-9 - ug/L
definition: The unit of measure for 'CAS_18540-29-9' (Chromium (VI)) in WISE SoE - Water Quality: Aggregated data table is 'ug/L'
status: valid
status modified: 2019-10-03
accepted date: 2019-10-03
in scheme: Definition of correct units for the observed determinands in the given WISE SoE DD tables
has determinand: CAS 18540-29-9
has uom: ug.L-1
has table: WISE-SoE WaterQuality.AggregatedData

WISE-SoE_WaterQuality.AggregatedData - CAS_1861-40-1 - ug/L
type: Concept
notation: WISE-SoE_WaterQuality.AggregatedData - CAS_1861-40-1 - ug/L
definition: The unit of measure for 'CAS_1861-40-1' (Benfluralin) in WISE SoE - Water Quality: Aggregated data table is 'ug/L'
status: valid
status modified: 2019-10-03
accepted date: 2019-10-03
in scheme: Definition of correct units for the observed determinands in the given WISE SoE DD tables
has determinand: CAS 1861-40-1
has uom: ug.L-1
has table: WISE-SoE WaterQuality.AggregatedData

WISE-SoE_WaterQuality.AggregatedData - CAS_18691-97-9 - ug/L
type: Concept
notation: WISE-SoE_WaterQuality.AggregatedData - CAS_18691-97-9 - ug/L
definition: The unit of measure for 'CAS_18691-97-9' (Methabenzthiazuron) in WISE SoE - Water Quality: Aggregated data table is 'ug/L'
status: valid
status modified: 2019-10-03
accepted date: 2019-10-03
in scheme: Definition of correct units for the observed determinands in the given WISE SoE DD tables
has determinand: CAS 18691-97-9
has uom: ug.L-1
has table: WISE-SoE WaterQuality.AggregatedData

WISE-SoE_WaterQuality.AggregatedData - CAS_187022-11-3 - ug/L
type: Concept
notation: WISE-SoE_WaterQuality.AggregatedData - CAS_187022-11-3 - ug/L
definition: The unit of measure for 'CAS_187022-11-3' (Acetochlor ESA) in WISE SoE - Water Quality: Aggregated data table is 'ug/L'
status: valid
status modified: 2019-10-03
accepted date: 2019-10-03
in scheme: Definition of correct units for the observed determinands in the given WISE SoE DD tables
has determinand: CAS 187022-11-3
has uom: ug.L-1
has table: WISE-SoE WaterQuality.AggregatedData

WISE-SoE_WaterQuality.AggregatedData - CAS_18785-72-3 - mg/L
type: Concept
notation: WISE-SoE_WaterQuality.AggregatedData - CAS_18785-72-3 - mg/L
definition: The unit of measure for 'CAS_18785-72-3' (Sulphate) in WISE SoE - Water Quality: Aggregated data table is 'mg/L'
status: valid
status modified: 2019-10-03
accepted date: 2019-10-03
in scheme: Definition of correct units for the observed determinands in the given WISE SoE DD tables
has determinand: CAS 18785-72-3
has uom: mg.L-1
has table: WISE-SoE WaterQuality.AggregatedData

WISE-SoE_WaterQuality.AggregatedData - CAS_188425-85-6 - ug/L
type: Concept
notation: WISE-SoE_WaterQuality.AggregatedData - CAS_188425-85-6 - ug/L
definition: The unit of measure for 'CAS_188425-85-6' (Boscalid) in WISE SoE - Water Quality: Aggregated data table is 'ug/L'
status: valid
status modified: 2019-10-03
accepted date: 2019-10-03
in scheme: Definition of correct units for the observed determinands in the given WISE SoE DD tables
has determinand: CAS 188425-85-6
has uom: ug.L-1
has table: WISE-SoE WaterQuality.AggregatedData

WISE-SoE_WaterQuality.AggregatedData - CAS_189-55-9 - ug/L
type: Concept
notation: WISE-SoE_WaterQuality.AggregatedData - CAS_189-55-9 - ug/L
definition: The unit of measure for 'CAS_189-55-9' (Dibenzo(a,i)pyrene) in WISE SoE - Water Quality: Aggregated data table is 'ug/L'
status: valid
status modified: 2019-10-03
accepted date: 2019-10-03
in scheme: Definition of correct units for the observed determinands in the given WISE SoE DD tables
has determinand: CAS 189-55-9
has uom: ug.L-1
has table: WISE-SoE WaterQuality.AggregatedData

WISE-SoE_WaterQuality.AggregatedData - CAS_189084-64-8 - ug/L
type: Concept
notation: WISE-SoE_WaterQuality.AggregatedData - CAS_189084-64-8 - ug/L
definition: The unit of measure for 'CAS_189084-64-8' (BDE 100 (2,2’,4,4’,6-pentabromodiphenyl ether)) in WISE SoE - Water Quality: Aggregated data table is 'ug/L'
status: valid
status modified: 2019-10-03
accepted date: 2019-10-03
in scheme: Definition of correct units for the observed determinands in the given WISE SoE DD tables
has determinand: CAS 189084-64-8
has uom: ug.L-1
has table: WISE-SoE WaterQuality.AggregatedData

WISE-SoE_WaterQuality.AggregatedData - CAS_1897-45-6 - ug/L
type: Concept
notation: WISE-SoE_WaterQuality.AggregatedData - CAS_1897-45-6 - ug/L
definition: The unit of measure for 'CAS_1897-45-6' (Chlorothalonil) in WISE SoE - Water Quality: Aggregated data table is 'ug/L'
status: valid
status modified: 2019-10-03
accepted date: 2019-10-03
in scheme: Definition of correct units for the observed determinands in the given WISE SoE DD tables
has determinand: CAS 1897-45-6
has uom: ug.L-1
has table: WISE-SoE WaterQuality.AggregatedData

WISE-SoE_WaterQuality.AggregatedData - CAS_191-24-2 - ug/L
type: Concept
notation: WISE-SoE_WaterQuality.AggregatedData - CAS_191-24-2 - ug/L
definition: The unit of measure for 'CAS_191-24-2' (Benzo(g,h,i)perylene) in WISE SoE - Water Quality: Aggregated data table is 'ug/L'
status: valid
status modified: 2019-10-03
accepted date: 2019-10-03
in scheme: Definition of correct units for the observed determinands in the given WISE SoE DD tables
has determinand: CAS 191-24-2
has uom: ug.L-1
has table: WISE-SoE WaterQuality.AggregatedData

WISE-SoE_WaterQuality.AggregatedData - CAS_191-30-0 - ug/L
type: Concept
notation: WISE-SoE_WaterQuality.AggregatedData - CAS_191-30-0 - ug/L
definition: The unit of measure for 'CAS_191-30-0' (Dibenzo(a,l)pyrene) in WISE SoE - Water Quality: Aggregated data table is 'ug/L'
status: valid
status modified: 2019-10-03
accepted date: 2019-10-03
in scheme: Definition of correct units for the observed determinands in the given WISE SoE DD tables
has determinand: CAS 191-30-0
has uom: ug.L-1
has table: WISE-SoE WaterQuality.AggregatedData

WISE-SoE_WaterQuality.AggregatedData - CAS_1912-24-9 - ug/L
type: Concept
notation: WISE-SoE_WaterQuality.AggregatedData - CAS_1912-24-9 - ug/L
definition: The unit of measure for 'CAS_1912-24-9' (Atrazine) in WISE SoE - Water Quality: Aggregated data table is 'ug/L'
status: valid
status modified: 2019-10-03
accepted date: 2019-10-03
in scheme: Definition of correct units for the observed determinands in the given WISE SoE DD tables
has determinand: CAS 1912-24-9
has uom: ug.L-1
has table: WISE-SoE WaterQuality.AggregatedData

WISE-SoE_WaterQuality.AggregatedData - CAS_1912-26-1 - ug/L
type: Concept
notation: WISE-SoE_WaterQuality.AggregatedData - CAS_1912-26-1 - ug/L
definition: The unit of measure for 'CAS_1912-26-1' (Trietazine) in WISE SoE - Water Quality: Aggregated data table is 'ug/L'
status: valid
status modified: 2019-10-03
accepted date: 2019-10-03
in scheme: Definition of correct units for the observed determinands in the given WISE SoE DD tables
has determinand: CAS 1912-26-1
has uom: ug.L-1
has table: WISE-SoE WaterQuality.AggregatedData

WISE-SoE_WaterQuality.AggregatedData - CAS_1918-00-9 - ug/L
type: Concept
notation: WISE-SoE_WaterQuality.AggregatedData - CAS_1918-00-9 - ug/L
definition: The unit of measure for 'CAS_1918-00-9' (Dicamba) in WISE SoE - Water Quality: Aggregated data table is 'ug/L'
status: valid
status modified: 2019-10-03
accepted date: 2019-10-03
in scheme: Definition of correct units for the observed determinands in the given WISE SoE DD tables
has determinand: CAS 1918-00-9
has uom: ug.L-1
has table: WISE-SoE WaterQuality.AggregatedData

WISE-SoE_WaterQuality.AggregatedData - CAS_1918-02-1 - ug/L
type: Concept
notation: WISE-SoE_WaterQuality.AggregatedData - CAS_1918-02-1 - ug/L
definition: The unit of measure for 'CAS_1918-02-1' (Picloram) in WISE SoE - Water Quality: Aggregated data table is 'ug/L'
status: valid
status modified: 2019-10-03
accepted date: 2019-10-03
in scheme: Definition of correct units for the observed determinands in the given WISE SoE DD tables
has determinand: CAS 1918-02-1
has uom: ug.L-1
has table: WISE-SoE WaterQuality.AggregatedData

WISE-SoE_WaterQuality.AggregatedData - CAS_1918-13-4 - ug/L
type: Concept
notation: WISE-SoE_WaterQuality.AggregatedData - CAS_1918-13-4 - ug/L
definition: The unit of measure for 'CAS_1918-13-4' (Chlorthiamid) in WISE SoE - Water Quality: Aggregated data table is 'ug/L'
status: valid
status modified: 2019-10-03
accepted date: 2019-10-03
in scheme: Definition of correct units for the observed determinands in the given WISE SoE DD tables
has determinand: CAS 1918-13-4
has uom: ug.L-1
has table: WISE-SoE WaterQuality.AggregatedData

WISE-SoE_WaterQuality.AggregatedData - CAS_1918-16-7 - ug/L
type: Concept
notation: WISE-SoE_WaterQuality.AggregatedData - CAS_1918-16-7 - ug/L
definition: The unit of measure for 'CAS_1918-16-7' (Propachlor) in WISE SoE - Water Quality: Aggregated data table is 'ug/L'
status: valid
status modified: 2019-10-03
accepted date: 2019-10-03
in scheme: Definition of correct units for the observed determinands in the given WISE SoE DD tables
has determinand: CAS 1918-16-7
has uom: ug.L-1
has table: WISE-SoE WaterQuality.AggregatedData

WISE-SoE_WaterQuality.AggregatedData - CAS_192-65-4 - ug/L
type: Concept
notation: WISE-SoE_WaterQuality.AggregatedData - CAS_192-65-4 - ug/L
definition: The unit of measure for 'CAS_192-65-4' (Dibenzo(a,e)pyrene) in WISE SoE - Water Quality: Aggregated data table is 'ug/L'
status: valid
status modified: 2019-10-03
accepted date: 2019-10-03
in scheme: Definition of correct units for the observed determinands in the given WISE SoE DD tables
has determinand: CAS 192-65-4
has uom: ug.L-1
has table: WISE-SoE WaterQuality.AggregatedData

WISE-SoE_WaterQuality.AggregatedData - CAS_192-97-2 - ug/L
type: Concept
notation: WISE-SoE_WaterQuality.AggregatedData - CAS_192-97-2 - ug/L
definition: The unit of measure for 'CAS_192-97-2' (Benzo[e]pyrene) in WISE SoE - Water Quality: Aggregated data table is 'ug/L'
status: valid
status modified: 2019-10-03
accepted date: 2019-10-03
in scheme: Definition of correct units for the observed determinands in the given WISE SoE DD tables
has determinand: CAS 192-97-2
has uom: ug.L-1
has table: WISE-SoE WaterQuality.AggregatedData

WISE-SoE_WaterQuality.AggregatedData - CAS_193-39-5 - ug/L
type: Concept
notation: WISE-SoE_WaterQuality.AggregatedData - CAS_193-39-5 - ug/L
definition: The unit of measure for 'CAS_193-39-5' (Indeno(1,2,3-cd)pyrene) in WISE SoE - Water Quality: Aggregated data table is 'ug/L'
status: valid
status modified: 2019-10-03
accepted date: 2019-10-03
in scheme: Definition of correct units for the observed determinands in the given WISE SoE DD tables
has determinand: CAS 193-39-5
has uom: ug.L-1
has table: WISE-SoE WaterQuality.AggregatedData

WISE-SoE_WaterQuality.AggregatedData - CAS_19408-74-3 - ug/L
type: Concept
notation: WISE-SoE_WaterQuality.AggregatedData - CAS_19408-74-3 - ug/L
definition: The unit of measure for 'CAS_19408-74-3' (1,2,3,7,8,9-H6CDD) in WISE SoE - Water Quality: Aggregated data table is 'ug/L'
status: valid
status modified: 2019-10-03
accepted date: 2019-10-03
in scheme: Definition of correct units for the observed determinands in the given WISE SoE DD tables
has determinand: CAS 19408-74-3
has uom: ug.L-1
has table: WISE-SoE WaterQuality.AggregatedData

WISE-SoE_WaterQuality.AggregatedData - CAS_194992-44-4 - ug/L
type: Concept
notation: WISE-SoE_WaterQuality.AggregatedData - CAS_194992-44-4 - ug/L
definition: The unit of measure for 'CAS_194992-44-4' (Acetochlor OA) in WISE SoE - Water Quality: Aggregated data table is 'ug/L'
status: valid
status modified: 2019-10-03
accepted date: 2019-10-03
in scheme: Definition of correct units for the observed determinands in the given WISE SoE DD tables
has determinand: CAS 194992-44-4
has uom: ug.L-1
has table: WISE-SoE WaterQuality.AggregatedData

WISE-SoE_WaterQuality.AggregatedData - CAS_19666-30-9 - ug/L
type: Concept
notation: WISE-SoE_WaterQuality.AggregatedData - CAS_19666-30-9 - ug/L
definition: The unit of measure for 'CAS_19666-30-9' (Oxadiazon) in WISE SoE - Water Quality: Aggregated data table is 'ug/L'
status: valid
status modified: 2019-10-03
accepted date: 2019-10-03
in scheme: Definition of correct units for the observed determinands in the given WISE SoE DD tables
has determinand: CAS 19666-30-9
has uom: ug.L-1
has table: WISE-SoE WaterQuality.AggregatedData

WISE-SoE_WaterQuality.AggregatedData - CAS_198-55-0 - ug/L
type: Concept
notation: WISE-SoE_WaterQuality.AggregatedData - CAS_198-55-0 - ug/L
definition: The unit of measure for 'CAS_198-55-0' (Perylene) in WISE SoE - Water Quality: Aggregated data table is 'ug/L'
status: valid
status modified: 2019-10-03
accepted date: 2019-10-03
in scheme: Definition of correct units for the observed determinands in the given WISE SoE DD tables
has determinand: CAS 198-55-0
has uom: ug.L-1
has table: WISE-SoE WaterQuality.AggregatedData

WISE-SoE_WaterQuality.AggregatedData - CAS_1982-47-4 - ug/L
type: Concept
notation: WISE-SoE_WaterQuality.AggregatedData - CAS_1982-47-4 - ug/L
definition: The unit of measure for 'CAS_1982-47-4' (Chloroxuron) in WISE SoE - Water Quality: Aggregated data table is 'ug/L'
status: valid
status modified: 2019-10-03
accepted date: 2019-10-03
in scheme: Definition of correct units for the observed determinands in the given WISE SoE DD tables
has determinand: CAS 1982-47-4
has uom: ug.L-1
has table: WISE-SoE WaterQuality.AggregatedData

WISE-SoE_WaterQuality.AggregatedData - CAS_19937-59-8 - ug/L
type: Concept
notation: WISE-SoE_WaterQuality.AggregatedData - CAS_19937-59-8 - ug/L
definition: The unit of measure for 'CAS_19937-59-8' (Metoxuron) in WISE SoE - Water Quality: Aggregated data table is 'ug/L'
status: valid
status modified: 2019-10-03
accepted date: 2019-10-03
in scheme: Definition of correct units for the observed determinands in the given WISE SoE DD tables
has determinand: CAS 19937-59-8
has uom: ug.L-1
has table: WISE-SoE WaterQuality.AggregatedData

WISE-SoE_WaterQuality.AggregatedData - CAS_2008-58-4 - ug/L
type: Concept
notation: WISE-SoE_WaterQuality.AggregatedData - CAS_2008-58-4 - ug/L
definition: The unit of measure for 'CAS_2008-58-4' (2,6-dichlorobenzamide) in WISE SoE - Water Quality: Aggregated data table is 'ug/L'
status: valid
status modified: 2019-10-03
accepted date: 2019-10-03
in scheme: Definition of correct units for the observed determinands in the given WISE SoE DD tables
has determinand: CAS 2008-58-4
has uom: ug.L-1
has table: WISE-SoE WaterQuality.AggregatedData

WISE-SoE_WaterQuality.AggregatedData - CAS_201668-32-8 - ug/L
type: Concept
notation: WISE-SoE_WaterQuality.AggregatedData - CAS_201668-32-8 - ug/L
definition: The unit of measure for 'CAS_201668-32-8' (Flufenacet ESA) in WISE SoE - Water Quality: Aggregated data table is 'ug/L'
status: valid
status modified: 2019-10-03
accepted date: 2019-10-03
in scheme: Definition of correct units for the observed determinands in the given WISE SoE DD tables
has determinand: CAS 201668-32-8
has uom: ug.L-1
has table: WISE-SoE WaterQuality.AggregatedData

WISE-SoE_WaterQuality.AggregatedData - CAS_2032-65-7 - ug/L
type: Concept
notation: WISE-SoE_WaterQuality.AggregatedData - CAS_2032-65-7 - ug/L
definition: The unit of measure for 'CAS_2032-65-7' (Methiocarb) in WISE SoE - Water Quality: Aggregated data table is 'ug/L'
status: valid
status modified: 2019-10-03
accepted date: 2019-10-03
in scheme: Definition of correct units for the observed determinands in the given WISE SoE DD tables
has determinand: CAS 2032-65-7
has uom: ug.L-1
has table: WISE-SoE WaterQuality.AggregatedData

WISE-SoE_WaterQuality.AggregatedData - CAS_20461-54-5 - ug/L
type: Concept
notation: WISE-SoE_WaterQuality.AggregatedData - CAS_20461-54-5 - ug/L
definition: The unit of measure for 'CAS_20461-54-5' (Iodide) in WISE SoE - Water Quality: Aggregated data table is 'ug/L'
status: valid
status modified: 2019-10-03
accepted date: 2019-10-03
in scheme: Definition of correct units for the observed determinands in the given WISE SoE DD tables
has determinand: CAS 20461-54-5
has uom: ug.L-1
has table: WISE-SoE WaterQuality.AggregatedData

WISE-SoE_WaterQuality.AggregatedData - CAS_205-82-3 - ug/L
type: Concept
notation: WISE-SoE_WaterQuality.AggregatedData - CAS_205-82-3 - ug/L
definition: The unit of measure for 'CAS_205-82-3' (Benzo(j)fluoranthene) in WISE SoE - Water Quality: Aggregated data table is 'ug/L'
status: valid
status modified: 2019-10-03
accepted date: 2019-10-03
in scheme: Definition of correct units for the observed determinands in the given WISE SoE DD tables
has determinand: CAS 205-82-3
has uom: ug.L-1
has table: WISE-SoE WaterQuality.AggregatedData

WISE-SoE_WaterQuality.AggregatedData - CAS_205-99-2 - ug/L
type: Concept
notation: WISE-SoE_WaterQuality.AggregatedData - CAS_205-99-2 - ug/L
definition: The unit of measure for 'CAS_205-99-2' (Benzo(b)fluoranthene) in WISE SoE - Water Quality: Aggregated data table is 'ug/L'
status: valid
status modified: 2019-10-03
accepted date: 2019-10-03
in scheme: Definition of correct units for the observed determinands in the given WISE SoE DD tables
has determinand: CAS 205-99-2
has uom: ug.L-1
has table: WISE-SoE WaterQuality.AggregatedData

WISE-SoE_WaterQuality.AggregatedData - CAS_2051-24-3 - ug/L
type: Concept
notation: WISE-SoE_WaterQuality.AggregatedData - CAS_2051-24-3 - ug/L
definition: The unit of measure for 'CAS_2051-24-3' (PCB 209 (5,5’,6,6’-decachlorobiphenyl)) in WISE SoE - Water Quality: Aggregated data table is 'ug/L'
status: valid
status modified: 2019-10-03
accepted date: 2019-10-03
in scheme: Definition of correct units for the observed determinands in the given WISE SoE DD tables
has determinand: CAS 2051-24-3
has uom: ug.L-1
has table: WISE-SoE WaterQuality.AggregatedData

WISE-SoE_WaterQuality.AggregatedData - CAS_205939-58-8 - ug/L
type: Concept
notation: WISE-SoE_WaterQuality.AggregatedData - CAS_205939-58-8 - ug/L
definition: The unit of measure for 'CAS_205939-58-8' (Dimethenamid ESA) in WISE SoE - Water Quality: Aggregated data table is 'ug/L'
status: valid
status modified: 2019-10-03
accepted date: 2019-10-03
in scheme: Definition of correct units for the observed determinands in the given WISE SoE DD tables
has determinand: CAS 205939-58-8
has uom: ug.L-1
has table: WISE-SoE WaterQuality.AggregatedData

WISE-SoE_WaterQuality.AggregatedData - CAS_206-44-0 - ug/L
type: Concept
notation: WISE-SoE_WaterQuality.AggregatedData - CAS_206-44-0 - ug/L
definition: The unit of measure for 'CAS_206-44-0' (Fluoranthene) in WISE SoE - Water Quality: Aggregated data table is 'ug/L'
status: valid
status modified: 2019-10-03
accepted date: 2019-10-03
in scheme: Definition of correct units for the observed determinands in the given WISE SoE DD tables
has determinand: CAS 206-44-0
has uom: ug.L-1
has table: WISE-SoE WaterQuality.AggregatedData

WISE-SoE_WaterQuality.AggregatedData - CAS_207-08-9 - ug/L
type: Concept
notation: WISE-SoE_WaterQuality.AggregatedData - CAS_207-08-9 - ug/L
definition: The unit of measure for 'CAS_207-08-9' (Benzo(k)fluoranthene) in WISE SoE - Water Quality: Aggregated data table is 'ug/L'
status: valid
status modified: 2019-10-03
accepted date: 2019-10-03
in scheme: Definition of correct units for the observed determinands in the given WISE SoE DD tables
has determinand: CAS 207-08-9
has uom: ug.L-1
has table: WISE-SoE WaterQuality.AggregatedData

WISE-SoE_WaterQuality.AggregatedData - CAS_207122-15-4 - ug/L
type: Concept
notation: WISE-SoE_WaterQuality.AggregatedData - CAS_207122-15-4 - ug/L
definition: The unit of measure for 'CAS_207122-15-4' (BDE 154 (2,2’,4,4’,5,6’-hexabromodiphenyl ether)) in WISE SoE - Water Quality: Aggregated data table is 'ug/L'
status: valid
status modified: 2019-10-03
accepted date: 2019-10-03
in scheme: Definition of correct units for the observed determinands in the given WISE SoE DD tables
has determinand: CAS 207122-15-4
has uom: ug.L-1
has table: WISE-SoE WaterQuality.AggregatedData

WISE-SoE_WaterQuality.AggregatedData - CAS_208-96-8 - ug/L
type: Concept
notation: WISE-SoE_WaterQuality.AggregatedData - CAS_208-96-8 - ug/L
definition: The unit of measure for 'CAS_208-96-8' (Acenaphthylene) in WISE SoE - Water Quality: Aggregated data table is 'ug/L'
status: valid
status modified: 2019-10-03
accepted date: 2019-10-03
in scheme: Definition of correct units for the observed determinands in the given WISE SoE DD tables
has determinand: CAS 208-96-8
has uom: ug.L-1
has table: WISE-SoE WaterQuality.AggregatedData

WISE-SoE_WaterQuality.AggregatedData - CAS_2104-64-5 - ug/L
type: Concept
notation: WISE-SoE_WaterQuality.AggregatedData - CAS_2104-64-5 - ug/L
definition: The unit of measure for 'CAS_2104-64-5' (Ethyl O-(p-nitrophenyl) phenyl phosphonothionate (EPN)) in WISE SoE - Water Quality: Aggregated data table is 'ug/L'
status: valid
status modified: 2019-10-03
accepted date: 2019-10-03
in scheme: Definition of correct units for the observed determinands in the given WISE SoE DD tables
has determinand: CAS 2104-64-5
has uom: ug.L-1
has table: WISE-SoE WaterQuality.AggregatedData

WISE-SoE_WaterQuality.AggregatedData - CAS_2104-96-3 - ug/L
type: Concept
notation: WISE-SoE_WaterQuality.AggregatedData - CAS_2104-96-3 - ug/L
definition: The unit of measure for 'CAS_2104-96-3' (Bromophos) in WISE SoE - Water Quality: Aggregated data table is 'ug/L'
status: valid
status modified: 2019-10-03
accepted date: 2019-10-03
in scheme: Definition of correct units for the observed determinands in the given WISE SoE DD tables
has determinand: CAS 2104-96-3
has uom: ug.L-1
has table: WISE-SoE WaterQuality.AggregatedData

WISE-SoE_WaterQuality.AggregatedData - CAS_21087-64-9 - ug/L
type: Concept
notation: WISE-SoE_WaterQuality.AggregatedData - CAS_21087-64-9 - ug/L
definition: The unit of measure for 'CAS_21087-64-9' (Metribuzin) in WISE SoE - Water Quality: Aggregated data table is 'ug/L'
status: valid
status modified: 2019-10-03
accepted date: 2019-10-03
in scheme: Definition of correct units for the observed determinands in the given WISE SoE DD tables
has determinand: CAS 21087-64-9
has uom: ug.L-1
has table: WISE-SoE WaterQuality.AggregatedData

WISE-SoE_WaterQuality.AggregatedData - CAS_210880-92-5 - ug/L
type: Concept
notation: WISE-SoE_WaterQuality.AggregatedData - CAS_210880-92-5 - ug/L
definition: The unit of measure for 'CAS_210880-92-5' (Clothianidin) in WISE SoE - Water Quality: Aggregated data table is 'ug/L'
status: valid
status modified: 2019-10-03
accepted date: 2019-10-03
in scheme: Definition of correct units for the observed determinands in the given WISE SoE DD tables
has determinand: CAS 210880-92-5
has uom: ug.L-1
has table: WISE-SoE WaterQuality.AggregatedData

WISE-SoE_WaterQuality.AggregatedData - CAS_2163-68-0 - ug/L
type: Concept
notation: WISE-SoE_WaterQuality.AggregatedData - CAS_2163-68-0 - ug/L
definition: The unit of measure for 'CAS_2163-68-0' (Hydroxyatrazine) in WISE SoE - Water Quality: Aggregated data table is 'ug/L'
status: valid
status modified: 2019-10-03
accepted date: 2019-10-03
in scheme: Definition of correct units for the observed determinands in the given WISE SoE DD tables
has determinand: CAS 2163-68-0
has uom: ug.L-1
has table: WISE-SoE WaterQuality.AggregatedData

WISE-SoE_WaterQuality.AggregatedData - CAS_2164-08-1 - ug/L
type: Concept
notation: WISE-SoE_WaterQuality.AggregatedData - CAS_2164-08-1 - ug/L
definition: The unit of measure for 'CAS_2164-08-1' (Lenacil) in WISE SoE - Water Quality: Aggregated data table is 'ug/L'
status: valid
status modified: 2019-10-03
accepted date: 2019-10-03
in scheme: Definition of correct units for the observed determinands in the given WISE SoE DD tables
has determinand: CAS 2164-08-1
has uom: ug.L-1
has table: WISE-SoE WaterQuality.AggregatedData

WISE-SoE_WaterQuality.AggregatedData - CAS_21725-46-2 - ug/L
type: Concept
notation: WISE-SoE_WaterQuality.AggregatedData - CAS_21725-46-2 - ug/L
definition: The unit of measure for 'CAS_21725-46-2' (Cyanazine) in WISE SoE - Water Quality: Aggregated data table is 'ug/L'
status: valid
status modified: 2019-10-03
accepted date: 2019-10-03
in scheme: Definition of correct units for the observed determinands in the given WISE SoE DD tables
has determinand: CAS 21725-46-2
has uom: ug.L-1
has table: WISE-SoE WaterQuality.AggregatedData

WISE-SoE_WaterQuality.AggregatedData - CAS_218-01-9 - ug/L
type: Concept
notation: WISE-SoE_WaterQuality.AggregatedData - CAS_218-01-9 - ug/L
definition: The unit of measure for 'CAS_218-01-9' (Chrysene) in WISE SoE - Water Quality: Aggregated data table is 'ug/L'
status: valid
status modified: 2019-10-03
accepted date: 2019-10-03
in scheme: Definition of correct units for the observed determinands in the given WISE SoE DD tables
has determinand: CAS 218-01-9
has uom: ug.L-1
has table: WISE-SoE WaterQuality.AggregatedData

WISE-SoE_WaterQuality.AggregatedData - CAS_2212-67-1 - ug/L
type: Concept
notation: WISE-SoE_WaterQuality.AggregatedData - CAS_2212-67-1 - ug/L
definition: The unit of measure for 'CAS_2212-67-1' (Molinate) in WISE SoE - Water Quality: Aggregated data table is 'ug/L'
status: valid
status modified: 2019-10-03
accepted date: 2019-10-03
in scheme: Definition of correct units for the observed determinands in the given WISE SoE DD tables
has determinand: CAS 2212-67-1
has uom: ug.L-1
has table: WISE-SoE WaterQuality.AggregatedData

WISE-SoE_WaterQuality.AggregatedData - CAS_22204-53-1 - ug/L
type: Concept
notation: WISE-SoE_WaterQuality.AggregatedData - CAS_22204-53-1 - ug/L
definition: The unit of measure for 'CAS_22204-53-1' (Naproxen) in WISE SoE - Water Quality: Aggregated data table is 'ug/L'
status: valid
status modified: 2019-10-03
accepted date: 2019-10-03
in scheme: Definition of correct units for the observed determinands in the given WISE SoE DD tables
has determinand: CAS 22204-53-1
has uom: ug.L-1
has table: WISE-SoE WaterQuality.AggregatedData

WISE-SoE_WaterQuality.AggregatedData - CAS_22224-92-6 - ug/L
type: Concept
notation: WISE-SoE_WaterQuality.AggregatedData - CAS_22224-92-6 - ug/L
definition: The unit of measure for 'CAS_22224-92-6' (Fenamiphos) in WISE SoE - Water Quality: Aggregated data table is 'ug/L'
status: valid
status modified: 2019-10-03
accepted date: 2019-10-03
in scheme: Definition of correct units for the observed determinands in the given WISE SoE DD tables
has determinand: CAS 22224-92-6
has uom: ug.L-1
has table: WISE-SoE WaterQuality.AggregatedData

WISE-SoE_WaterQuality.AggregatedData - CAS_2227-13-6 - ug/L
type: Concept
notation: WISE-SoE_WaterQuality.AggregatedData - CAS_2227-13-6 - ug/L
definition: The unit of measure for 'CAS_2227-13-6' (Tetrasul) in WISE SoE - Water Quality: Aggregated data table is 'ug/L'
status: valid
status modified: 2019-10-03
accepted date: 2019-10-03
in scheme: Definition of correct units for the observed determinands in the given WISE SoE DD tables
has determinand: CAS 2227-13-6
has uom: ug.L-1
has table: WISE-SoE WaterQuality.AggregatedData

WISE-SoE_WaterQuality.AggregatedData - CAS_2234-13-1 - ug/L
type: Concept
notation: WISE-SoE_WaterQuality.AggregatedData - CAS_2234-13-1 - ug/L
definition: The unit of measure for 'CAS_2234-13-1' (Octachloronaphthalene) in WISE SoE - Water Quality: Aggregated data table is 'ug/L'
status: valid
status modified: 2019-10-03
accepted date: 2019-10-03
in scheme: Definition of correct units for the observed determinands in the given WISE SoE DD tables
has determinand: CAS 2234-13-1
has uom: ug.L-1
has table: WISE-SoE WaterQuality.AggregatedData

WISE-SoE_WaterQuality.AggregatedData - CAS_22781-23-3 - ug/L
type: Concept
notation: WISE-SoE_WaterQuality.AggregatedData - CAS_22781-23-3 - ug/L
definition: The unit of measure for 'CAS_22781-23-3' (Bendiocarb) in WISE SoE - Water Quality: Aggregated data table is 'ug/L'
status: valid
status modified: 2019-10-03
accepted date: 2019-10-03
in scheme: Definition of correct units for the observed determinands in the given WISE SoE DD tables
has determinand: CAS 22781-23-3
has uom: ug.L-1
has table: WISE-SoE WaterQuality.AggregatedData

WISE-SoE_WaterQuality.AggregatedData - CAS_2303-17-5 - ug/L
type: Concept
notation: WISE-SoE_WaterQuality.AggregatedData - CAS_2303-17-5 - ug/L
definition: The unit of measure for 'CAS_2303-17-5' (Tri-allate) in WISE SoE - Water Quality: Aggregated data table is 'ug/L'
status: valid
status modified: 2019-10-03
accepted date: 2019-10-03
in scheme: Definition of correct units for the observed determinands in the given WISE SoE DD tables
has determinand: CAS 2303-17-5
has uom: ug.L-1
has table: WISE-SoE WaterQuality.AggregatedData

WISE-SoE_WaterQuality.AggregatedData - CAS_2310-17-0 - ug/L
type: Concept
notation: WISE-SoE_WaterQuality.AggregatedData - CAS_2310-17-0 - ug/L
definition: The unit of measure for 'CAS_2310-17-0' (Phosalone) in WISE SoE - Water Quality: Aggregated data table is 'ug/L'
status: valid
status modified: 2019-10-03
accepted date: 2019-10-03
in scheme: Definition of correct units for the observed determinands in the given WISE SoE DD tables
has determinand: CAS 2310-17-0
has uom: ug.L-1
has table: WISE-SoE WaterQuality.AggregatedData

WISE-SoE_WaterQuality.AggregatedData - CAS_23103-98-2 - ug/L
type: Concept
notation: WISE-SoE_WaterQuality.AggregatedData - CAS_23103-98-2 - ug/L
definition: The unit of measure for 'CAS_23103-98-2' (Pirimicarb) in WISE SoE - Water Quality: Aggregated data table is 'ug/L'
status: valid
status modified: 2019-10-03
accepted date: 2019-10-03
in scheme: Definition of correct units for the observed determinands in the given WISE SoE DD tables
has determinand: CAS 23103-98-2
has uom: ug.L-1
has table: WISE-SoE WaterQuality.AggregatedData

WISE-SoE_WaterQuality.AggregatedData - CAS_2312-35-8 - ug/L
type: Concept
notation: WISE-SoE_WaterQuality.AggregatedData - CAS_2312-35-8 - ug/L
definition: The unit of measure for 'CAS_2312-35-8' (Propargite) in WISE SoE - Water Quality: Aggregated data table is 'ug/L'
status: valid
status modified: 2019-10-03
accepted date: 2019-10-03
in scheme: Definition of correct units for the observed determinands in the given WISE SoE DD tables
has determinand: CAS 2312-35-8
has uom: ug.L-1
has table: WISE-SoE WaterQuality.AggregatedData

WISE-SoE_WaterQuality.AggregatedData - CAS_23135-22-0 - ug/L
type: Concept
notation: WISE-SoE_WaterQuality.AggregatedData - CAS_23135-22-0 - ug/L
definition: The unit of measure for 'CAS_23135-22-0' (Oxamyl) in WISE SoE - Water Quality: Aggregated data table is 'ug/L'
status: valid
status modified: 2019-10-03
accepted date: 2019-10-03
in scheme: Definition of correct units for the observed determinands in the given WISE SoE DD tables
has determinand: CAS 23135-22-0
has uom: ug.L-1
has table: WISE-SoE WaterQuality.AggregatedData

WISE-SoE_WaterQuality.AggregatedData - CAS_23505-41-1 - ug/L
type: Concept
notation: WISE-SoE_WaterQuality.AggregatedData - CAS_23505-41-1 - ug/L
definition: The unit of measure for 'CAS_23505-41-1' (Pirimiphos-ethyl) in WISE SoE - Water Quality: Aggregated data table is 'ug/L'
status: valid
status modified: 2019-10-03
accepted date: 2019-10-03
in scheme: Definition of correct units for the observed determinands in the given WISE SoE DD tables
has determinand: CAS 23505-41-1
has uom: ug.L-1
has table: WISE-SoE WaterQuality.AggregatedData

WISE-SoE_WaterQuality.AggregatedData - CAS_23560-59-0 - ug/L
type: Concept
notation: WISE-SoE_WaterQuality.AggregatedData - CAS_23560-59-0 - ug/L
definition: The unit of measure for 'CAS_23560-59-0' (Heptenophos) in WISE SoE - Water Quality: Aggregated data table is 'ug/L'
status: valid
status modified: 2019-10-03
accepted date: 2019-10-03
in scheme: Definition of correct units for the observed determinands in the given WISE SoE DD tables
has determinand: CAS 23560-59-0
has uom: ug.L-1
has table: WISE-SoE WaterQuality.AggregatedData

WISE-SoE_WaterQuality.AggregatedData - CAS_23564-05-8 - ug/L
type: Concept
notation: WISE-SoE_WaterQuality.AggregatedData - CAS_23564-05-8 - ug/L
definition: The unit of measure for 'CAS_23564-05-8' (Thiophanate-methyl) in WISE SoE - Water Quality: Aggregated data table is 'ug/L'
status: valid
status modified: 2019-10-03
accepted date: 2019-10-03
in scheme: Definition of correct units for the observed determinands in the given WISE SoE DD tables
has determinand: CAS 23564-05-8
has uom: ug.L-1
has table: WISE-SoE WaterQuality.AggregatedData

WISE-SoE_WaterQuality.AggregatedData - CAS_23593-75-1 - ug/L
type: Concept
notation: WISE-SoE_WaterQuality.AggregatedData - CAS_23593-75-1 - ug/L
definition: The unit of measure for 'CAS_23593-75-1' (Clotrimazole) in WISE SoE - Water Quality: Aggregated data table is 'ug/L'
status: valid
status modified: 2019-10-03
accepted date: 2019-10-03
in scheme: Definition of correct units for the observed determinands in the given WISE SoE DD tables
has determinand: CAS 23593-75-1
has uom: ug.L-1
has table: WISE-SoE WaterQuality.AggregatedData

WISE-SoE_WaterQuality.AggregatedData - CAS_2385-85-5 - ug/L
type: Concept
notation: WISE-SoE_WaterQuality.AggregatedData - CAS_2385-85-5 - ug/L
definition: The unit of measure for 'CAS_2385-85-5' (Mirex) in WISE SoE - Water Quality: Aggregated data table is 'ug/L'
status: valid
status modified: 2019-10-03
accepted date: 2019-10-03
in scheme: Definition of correct units for the observed determinands in the given WISE SoE DD tables
has determinand: CAS 2385-85-5
has uom: ug.L-1
has table: WISE-SoE WaterQuality.AggregatedData

WISE-SoE_WaterQuality.AggregatedData - CAS_23947-60-6 - ug/L
type: Concept
notation: WISE-SoE_WaterQuality.AggregatedData - CAS_23947-60-6 - ug/L
definition: The unit of measure for 'CAS_23947-60-6' (Ethirimol) in WISE SoE - Water Quality: Aggregated data table is 'ug/L'
status: valid
status modified: 2019-10-03
accepted date: 2019-10-03
in scheme: Definition of correct units for the observed determinands in the given WISE SoE DD tables
has determinand: CAS 23947-60-6
has uom: ug.L-1
has table: WISE-SoE WaterQuality.AggregatedData

WISE-SoE_WaterQuality.AggregatedData - CAS_23950-58-5 - ug/L
type: Concept
notation: WISE-SoE_WaterQuality.AggregatedData - CAS_23950-58-5 - ug/L
definition: The unit of measure for 'CAS_23950-58-5' (Propyzamide) in WISE SoE - Water Quality: Aggregated data table is 'ug/L'
status: valid
status modified: 2019-10-03
accepted date: 2019-10-03
in scheme: Definition of correct units for the observed determinands in the given WISE SoE DD tables
has determinand: CAS 23950-58-5
has uom: ug.L-1
has table: WISE-SoE WaterQuality.AggregatedData

WISE-SoE_WaterQuality.AggregatedData - CAS_24017-47-8 - ug/L
type: Concept
notation: WISE-SoE_WaterQuality.AggregatedData - CAS_24017-47-8 - ug/L
definition: The unit of measure for 'CAS_24017-47-8' (Triazophos) in WISE SoE - Water Quality: Aggregated data table is 'ug/L'
status: valid
status modified: 2019-10-03
accepted date: 2019-10-03
in scheme: Definition of correct units for the observed determinands in the given WISE SoE DD tables
has determinand: CAS 24017-47-8
has uom: ug.L-1
has table: WISE-SoE WaterQuality.AggregatedData

WISE-SoE_WaterQuality.AggregatedData - CAS_2440-02-0 - ug/L
type: Concept
notation: WISE-SoE_WaterQuality.AggregatedData - CAS_2440-02-0 - ug/L
definition: The unit of measure for 'CAS_2440-02-0' (Heptachloronorbornene) in WISE SoE - Water Quality: Aggregated data table is 'ug/L'
status: valid
status modified: 2019-10-03
accepted date: 2019-10-03
in scheme: Definition of correct units for the observed determinands in the given WISE SoE DD tables
has determinand: CAS 2440-02-0
has uom: ug.L-1
has table: WISE-SoE WaterQuality.AggregatedData

WISE-SoE_WaterQuality.AggregatedData - CAS_24579-73-5 - ug/L
type: Concept
notation: WISE-SoE_WaterQuality.AggregatedData - CAS_24579-73-5 - ug/L
definition: The unit of measure for 'CAS_24579-73-5' (Propamocarb) in WISE SoE - Water Quality: Aggregated data table is 'ug/L'
status: valid
status modified: 2019-10-03
accepted date: 2019-10-03
in scheme: Definition of correct units for the observed determinands in the given WISE SoE DD tables
has determinand: CAS 24579-73-5
has uom: ug.L-1
has table: WISE-SoE WaterQuality.AggregatedData

WISE-SoE_WaterQuality.AggregatedData - CAS_24959-67-9 - ug/L
type: Concept
notation: WISE-SoE_WaterQuality.AggregatedData - CAS_24959-67-9 - ug/L
definition: The unit of measure for 'CAS_24959-67-9' (Bromide) in WISE SoE - Water Quality: Aggregated data table is 'ug/L'
status: valid
status modified: 2019-10-03
accepted date: 2019-10-03
in scheme: Definition of correct units for the observed determinands in the given WISE SoE DD tables
has determinand: CAS 24959-67-9
has uom: ug.L-1
has table: WISE-SoE WaterQuality.AggregatedData

WISE-SoE_WaterQuality.AggregatedData - CAS_25057-89-0 - ug/L
type: Concept
notation: WISE-SoE_WaterQuality.AggregatedData - CAS_25057-89-0 - ug/L
definition: The unit of measure for 'CAS_25057-89-0' (Bentazone) in WISE SoE - Water Quality: Aggregated data table is 'ug/L'
status: valid
status modified: 2019-10-03
accepted date: 2019-10-03
in scheme: Definition of correct units for the observed determinands in the given WISE SoE DD tables
has determinand: CAS 25057-89-0
has uom: ug.L-1
has table: WISE-SoE WaterQuality.AggregatedData

WISE-SoE_WaterQuality.AggregatedData - CAS_25140-90-3 - ug/L
type: Concept
notation: WISE-SoE_WaterQuality.AggregatedData - CAS_25140-90-3 - ug/L
definition: The unit of measure for 'CAS_25140-90-3' (2-(2,6-dichlorophenoxy)propionic acid (2,6-DCPP)) in WISE SoE - Water Quality: Aggregated data table is 'ug/L'
status: valid
status modified: 2019-10-03
accepted date: 2019-10-03
in scheme: Definition of correct units for the observed determinands in the given WISE SoE DD tables
has determinand: CAS 25140-90-3
has uom: ug.L-1
has table: WISE-SoE WaterQuality.AggregatedData

WISE-SoE_WaterQuality.AggregatedData - CAS_25167-83-3 - ug/L
type: Concept
notation: WISE-SoE_WaterQuality.AggregatedData - CAS_25167-83-3 - ug/L
definition: The unit of measure for 'CAS_25167-83-3' (Tetrachlorophenols) in WISE SoE - Water Quality: Aggregated data table is 'ug/L'
status: valid
status modified: 2019-10-03
accepted date: 2019-10-03
in scheme: Definition of correct units for the observed determinands in the given WISE SoE DD tables
has determinand: CAS 25167-83-3
has uom: ug.L-1
has table: WISE-SoE WaterQuality.AggregatedData

WISE-SoE_WaterQuality.AggregatedData - CAS_2540-82-1 - ug/L
type: Concept
notation: WISE-SoE_WaterQuality.AggregatedData - CAS_2540-82-1 - ug/L
definition: The unit of measure for 'CAS_2540-82-1' (Formothion) in WISE SoE - Water Quality: Aggregated data table is 'ug/L'
status: valid
status modified: 2019-10-03
accepted date: 2019-10-03
in scheme: Definition of correct units for the observed determinands in the given WISE SoE DD tables
has determinand: CAS 2540-82-1
has uom: ug.L-1
has table: WISE-SoE WaterQuality.AggregatedData

WISE-SoE_WaterQuality.AggregatedData - CAS_25637-99-4 - ug/L
type: Concept
notation: WISE-SoE_WaterQuality.AggregatedData - CAS_25637-99-4 - ug/L
definition: The unit of measure for 'CAS_25637-99-4' (1,3,5,7,9,11-hexabromocyclododecane) in WISE SoE - Water Quality: Aggregated data table is 'ug/L'
status: valid
status modified: 2019-10-03
accepted date: 2019-10-03
in scheme: Definition of correct units for the observed determinands in the given WISE SoE DD tables
has determinand: CAS 25637-99-4
has uom: ug.L-1
has table: WISE-SoE WaterQuality.AggregatedData

WISE-SoE_WaterQuality.AggregatedData - CAS_2599-11-3 - ug/L
type: Concept
notation: WISE-SoE_WaterQuality.AggregatedData - CAS_2599-11-3 - ug/L
definition: The unit of measure for 'CAS_2599-11-3' (Hydroxysimazine) in WISE SoE - Water Quality: Aggregated data table is 'ug/L'
status: valid
status modified: 2019-10-03
accepted date: 2019-10-03
in scheme: Definition of correct units for the observed determinands in the given WISE SoE DD tables
has determinand: CAS 2599-11-3
has uom: ug.L-1
has table: WISE-SoE WaterQuality.AggregatedData

WISE-SoE_WaterQuality.AggregatedData - CAS_262-12-4 - ug/L
type: Concept
notation: WISE-SoE_WaterQuality.AggregatedData - CAS_262-12-4 - ug/L
definition: The unit of measure for 'CAS_262-12-4' (Dibenzodioxin) in WISE SoE - Water Quality: Aggregated data table is 'ug/L'
status: valid
status modified: 2019-10-03
accepted date: 2019-10-03
in scheme: Definition of correct units for the observed determinands in the given WISE SoE DD tables
has determinand: CAS 262-12-4
has uom: ug.L-1
has table: WISE-SoE WaterQuality.AggregatedData

WISE-SoE_WaterQuality.AggregatedData - CAS_26225-79-6 - ug/L
type: Concept
notation: WISE-SoE_WaterQuality.AggregatedData - CAS_26225-79-6 - ug/L
definition: The unit of measure for 'CAS_26225-79-6' (Ethofumesate) in WISE SoE - Water Quality: Aggregated data table is 'ug/L'
status: valid
status modified: 2019-10-03
accepted date: 2019-10-03
in scheme: Definition of correct units for the observed determinands in the given WISE SoE DD tables
has determinand: CAS 26225-79-6
has uom: ug.L-1
has table: WISE-SoE WaterQuality.AggregatedData

WISE-SoE_WaterQuality.AggregatedData - CAS_26259-45-0 - ug/L
type: Concept
notation: WISE-SoE_WaterQuality.AggregatedData - CAS_26259-45-0 - ug/L
definition: The unit of measure for 'CAS_26259-45-0' (Secbumeton) in WISE SoE - Water Quality: Aggregated data table is 'ug/L'
status: valid
status modified: 2019-10-03
accepted date: 2019-10-03
in scheme: Definition of correct units for the observed determinands in the given WISE SoE DD tables
has determinand: CAS 26259-45-0
has uom: ug.L-1
has table: WISE-SoE WaterQuality.AggregatedData

WISE-SoE_WaterQuality.AggregatedData - CAS_2642-71-9 - ug/L
type: Concept
notation: WISE-SoE_WaterQuality.AggregatedData - CAS_2642-71-9 - ug/L
definition: The unit of measure for 'CAS_2642-71-9' (Azinphos-ethyl) in WISE SoE - Water Quality: Aggregated data table is 'ug/L'
status: valid
status modified: 2019-10-03
accepted date: 2019-10-03
in scheme: Definition of correct units for the observed determinands in the given WISE SoE DD tables
has determinand: CAS 2642-71-9
has uom: ug.L-1
has table: WISE-SoE WaterQuality.AggregatedData

WISE-SoE_WaterQuality.AggregatedData - CAS_26787-78-0 - ug/L
type: Concept
notation: WISE-SoE_WaterQuality.AggregatedData - CAS_26787-78-0 - ug/L
definition: The unit of measure for 'CAS_26787-78-0' (Amoxicillin) in WISE SoE - Water Quality: Aggregated data table is 'ug/L'
status: valid
status modified: 2019-10-03
accepted date: 2019-10-03
in scheme: Definition of correct units for the observed determinands in the given WISE SoE DD tables
has determinand: CAS 26787-78-0
has uom: ug.L-1
has table: WISE-SoE WaterQuality.AggregatedData

WISE-SoE_WaterQuality.AggregatedData - CAS_2813-95-8 - ug/L
type: Concept
notation: WISE-SoE_WaterQuality.AggregatedData - CAS_2813-95-8 - ug/L
definition: The unit of measure for 'CAS_2813-95-8' (Dinoseb acetate) in WISE SoE - Water Quality: Aggregated data table is 'ug/L'
status: valid
status modified: 2019-10-03
accepted date: 2019-10-03
in scheme: Definition of correct units for the observed determinands in the given WISE SoE DD tables
has determinand: CAS 2813-95-8
has uom: ug.L-1
has table: WISE-SoE WaterQuality.AggregatedData

WISE-SoE_WaterQuality.AggregatedData - CAS_28159-98-0 - ug/L
type: Concept
notation: WISE-SoE_WaterQuality.AggregatedData - CAS_28159-98-0 - ug/L
definition: The unit of measure for 'CAS_28159-98-0' (Cybutryne) in WISE SoE - Water Quality: Aggregated data table is 'ug/L'
status: valid
status modified: 2019-10-03
accepted date: 2019-10-03
in scheme: Definition of correct units for the observed determinands in the given WISE SoE DD tables
has determinand: CAS 28159-98-0
has uom: ug.L-1
has table: WISE-SoE WaterQuality.AggregatedData

WISE-SoE_WaterQuality.AggregatedData - CAS_28249-77-6 - ug/L
type: Concept
notation: WISE-SoE_WaterQuality.AggregatedData - CAS_28249-77-6 - ug/L
definition: The unit of measure for 'CAS_28249-77-6' (Thiobencarb) in WISE SoE - Water Quality: Aggregated data table is 'ug/L'
status: valid
status modified: 2019-10-03
accepted date: 2019-10-03
in scheme: Definition of correct units for the observed determinands in the given WISE SoE DD tables
has determinand: CAS 28249-77-6
has uom: ug.L-1
has table: WISE-SoE WaterQuality.AggregatedData

WISE-SoE_WaterQuality.AggregatedData - CAS_288-88-0 - ug/L
type: Concept
notation: WISE-SoE_WaterQuality.AggregatedData - CAS_288-88-0 - ug/L
definition: The unit of measure for 'CAS_288-88-0' (1H-1,2,4-Triazole) in WISE SoE - Water Quality: Aggregated data table is 'ug/L'
status: valid
status modified: 2019-10-03
accepted date: 2019-10-03
in scheme: Definition of correct units for the observed determinands in the given WISE SoE DD tables
has determinand: CAS 288-88-0
has uom: ug.L-1
has table: WISE-SoE WaterQuality.AggregatedData

WISE-SoE_WaterQuality.AggregatedData - CAS_29122-68-7 - ug/L
type: Concept
notation: WISE-SoE_WaterQuality.AggregatedData - CAS_29122-68-7 - ug/L
definition: The unit of measure for 'CAS_29122-68-7' (Atenolol) in WISE SoE - Water Quality: Aggregated data table is 'ug/L'
status: valid
status modified: 2019-10-03
accepted date: 2019-10-03
in scheme: Definition of correct units for the observed determinands in the given WISE SoE DD tables
has determinand: CAS 29122-68-7
has uom: ug.L-1
has table: WISE-SoE WaterQuality.AggregatedData

WISE-SoE_WaterQuality.AggregatedData - CAS_2921-88-2 - ug/L
type: Concept
notation: WISE-SoE_WaterQuality.AggregatedData - CAS_2921-88-2 - ug/L
definition: The unit of measure for 'CAS_2921-88-2' (Chlorpyrifos) in WISE SoE - Water Quality: Aggregated data table is 'ug/L'
status: valid
status modified: 2019-10-03
accepted date: 2019-10-03
in scheme: Definition of correct units for the observed determinands in the given WISE SoE DD tables
has determinand: CAS 2921-88-2
has uom: ug.L-1
has table: WISE-SoE WaterQuality.AggregatedData

WISE-SoE_WaterQuality.AggregatedData - CAS_29232-93-7 - ug/L
type: Concept
notation: WISE-SoE_WaterQuality.AggregatedData - CAS_29232-93-7 - ug/L
definition: The unit of measure for 'CAS_29232-93-7' (Pirimiphos-methyl) in WISE SoE - Water Quality: Aggregated data table is 'ug/L'
status: valid
status modified: 2019-10-03
accepted date: 2019-10-03
in scheme: Definition of correct units for the observed determinands in the given WISE SoE DD tables
has determinand: CAS 29232-93-7
has uom: ug.L-1
has table: WISE-SoE WaterQuality.AggregatedData

WISE-SoE_WaterQuality.AggregatedData - CAS_294-62-2 - ug/L
type: Concept
notation: WISE-SoE_WaterQuality.AggregatedData - CAS_294-62-2 - ug/L
definition: The unit of measure for 'CAS_294-62-2' (Cyclododecane) in WISE SoE - Water Quality: Aggregated data table is 'ug/L'
status: valid
status modified: 2019-10-03
accepted date: 2019-10-03
in scheme: Definition of correct units for the observed determinands in the given WISE SoE DD tables
has determinand: CAS 294-62-2
has uom: ug.L-1
has table: WISE-SoE WaterQuality.AggregatedData

WISE-SoE_WaterQuality.AggregatedData - CAS_297-78-9 - ug/L
type: Concept
notation: WISE-SoE_WaterQuality.AggregatedData - CAS_297-78-9 - ug/L
definition: The unit of measure for 'CAS_297-78-9' (Isobenzane) in WISE SoE - Water Quality: Aggregated data table is 'ug/L'
status: valid
status modified: 2019-10-03
accepted date: 2019-10-03
in scheme: Definition of correct units for the observed determinands in the given WISE SoE DD tables
has determinand: CAS 297-78-9
has uom: ug.L-1
has table: WISE-SoE WaterQuality.AggregatedData

WISE-SoE_WaterQuality.AggregatedData - CAS_298-00-0 - ug/L
type: Concept
notation: WISE-SoE_WaterQuality.AggregatedData - CAS_298-00-0 - ug/L
definition: The unit of measure for 'CAS_298-00-0' (Parathion-methyl) in WISE SoE - Water Quality: Aggregated data table is 'ug/L'
status: valid
status modified: 2019-10-03
accepted date: 2019-10-03
in scheme: Definition of correct units for the observed determinands in the given WISE SoE DD tables
has determinand: CAS 298-00-0
has uom: ug.L-1
has table: WISE-SoE WaterQuality.AggregatedData

WISE-SoE_WaterQuality.AggregatedData - CAS_298-02-2 - ug/L
type: Concept
notation: WISE-SoE_WaterQuality.AggregatedData - CAS_298-02-2 - ug/L
definition: The unit of measure for 'CAS_298-02-2' (Phorate) in WISE SoE - Water Quality: Aggregated data table is 'ug/L'
status: valid
status modified: 2019-10-03
accepted date: 2019-10-03
in scheme: Definition of correct units for the observed determinands in the given WISE SoE DD tables
has determinand: CAS 298-02-2
has uom: ug.L-1
has table: WISE-SoE WaterQuality.AggregatedData

WISE-SoE_WaterQuality.AggregatedData - CAS_298-03-3 - ug/L
type: Concept
notation: WISE-SoE_WaterQuality.AggregatedData - CAS_298-03-3 - ug/L
definition: The unit of measure for 'CAS_298-03-3' (Demeton-O) in WISE SoE - Water Quality: Aggregated data table is 'ug/L'
status: valid
status modified: 2019-10-03
accepted date: 2019-10-03
in scheme: Definition of correct units for the observed determinands in the given WISE SoE DD tables
has determinand: CAS 298-03-3
has uom: ug.L-1
has table: WISE-SoE WaterQuality.AggregatedData

WISE-SoE_WaterQuality.AggregatedData - CAS_298-04-4 - ug/L
type: Concept
notation: WISE-SoE_WaterQuality.AggregatedData - CAS_298-04-4 - ug/L
definition: The unit of measure for 'CAS_298-04-4' (Disulfoton) in WISE SoE - Water Quality: Aggregated data table is 'ug/L'
status: valid
status modified: 2019-10-03
accepted date: 2019-10-03
in scheme: Definition of correct units for the observed determinands in the given WISE SoE DD tables
has determinand: CAS 298-04-4
has uom: ug.L-1
has table: WISE-SoE WaterQuality.AggregatedData

WISE-SoE_WaterQuality.AggregatedData - CAS_298-46-4 - ug/L
type: Concept
notation: WISE-SoE_WaterQuality.AggregatedData - CAS_298-46-4 - ug/L
definition: The unit of measure for 'CAS_298-46-4' (Carbamazepin) in WISE SoE - Water Quality: Aggregated data table is 'ug/L'
status: valid
status modified: 2019-10-03
accepted date: 2019-10-03
in scheme: Definition of correct units for the observed determinands in the given WISE SoE DD tables
has determinand: CAS 298-46-4
has uom: ug.L-1
has table: WISE-SoE WaterQuality.AggregatedData

WISE-SoE_WaterQuality.AggregatedData - CAS_299-84-3 - ug/L
type: Concept
notation: WISE-SoE_WaterQuality.AggregatedData - CAS_299-84-3 - ug/L
definition: The unit of measure for 'CAS_299-84-3' (Fenchlorphos) in WISE SoE - Water Quality: Aggregated data table is 'ug/L'
status: valid
status modified: 2019-10-03
accepted date: 2019-10-03
in scheme: Definition of correct units for the observed determinands in the given WISE SoE DD tables
has determinand: CAS 299-84-3
has uom: ug.L-1
has table: WISE-SoE WaterQuality.AggregatedData

WISE-SoE_WaterQuality.AggregatedData - CAS_29973-13-5 - ug/L
type: Concept
notation: WISE-SoE_WaterQuality.AggregatedData - CAS_29973-13-5 - ug/L
definition: The unit of measure for 'CAS_29973-13-5' (Ethiofencarb) in WISE SoE - Water Quality: Aggregated data table is 'ug/L'
status: valid
status modified: 2019-10-03
accepted date: 2019-10-03
in scheme: Definition of correct units for the observed determinands in the given WISE SoE DD tables
has determinand: CAS 29973-13-5
has uom: ug.L-1
has table: WISE-SoE WaterQuality.AggregatedData

WISE-SoE_WaterQuality.AggregatedData - CAS_30125-63-4 - ug/L
type: Concept
notation: WISE-SoE_WaterQuality.AggregatedData - CAS_30125-63-4 - ug/L
definition: The unit of measure for 'CAS_30125-63-4' (Desethylterbuthylazine) in WISE SoE - Water Quality: Aggregated data table is 'ug/L'
status: valid
status modified: 2019-10-03
accepted date: 2019-10-03
in scheme: Definition of correct units for the observed determinands in the given WISE SoE DD tables
has determinand: CAS 30125-63-4
has uom: ug.L-1
has table: WISE-SoE WaterQuality.AggregatedData

WISE-SoE_WaterQuality.AggregatedData - CAS_3018-12-0 - ug/L
type: Concept
notation: WISE-SoE_WaterQuality.AggregatedData - CAS_3018-12-0 - ug/L
definition: The unit of measure for 'CAS_3018-12-0' (Dichloroacetonitrile) in WISE SoE - Water Quality: Aggregated data table is 'ug/L'
status: valid
status modified: 2019-10-03
accepted date: 2019-10-03
in scheme: Definition of correct units for the observed determinands in the given WISE SoE DD tables
has determinand: CAS 3018-12-0
has uom: ug.L-1
has table: WISE-SoE WaterQuality.AggregatedData

WISE-SoE_WaterQuality.AggregatedData - CAS_302-17-0 - ug/L
type: Concept
notation: WISE-SoE_WaterQuality.AggregatedData - CAS_302-17-0 - ug/L
definition: The unit of measure for 'CAS_302-17-0' (2,2,2-trichloroethane-1,1-diol) in WISE SoE - Water Quality: Aggregated data table is 'ug/L'
status: valid
status modified: 2019-10-03
accepted date: 2019-10-03
in scheme: Definition of correct units for the observed determinands in the given WISE SoE DD tables
has determinand: CAS 302-17-0
has uom: ug.L-1
has table: WISE-SoE WaterQuality.AggregatedData

WISE-SoE_WaterQuality.AggregatedData - CAS_30560-19-1 - ug/L
type: Concept
notation: WISE-SoE_WaterQuality.AggregatedData - CAS_30560-19-1 - ug/L
definition: The unit of measure for 'CAS_30560-19-1' (Acephate) in WISE SoE - Water Quality: Aggregated data table is 'ug/L'
status: valid
status modified: 2019-10-03
accepted date: 2019-10-03
in scheme: Definition of correct units for the observed determinands in the given WISE SoE DD tables
has determinand: CAS 30560-19-1
has uom: ug.L-1
has table: WISE-SoE WaterQuality.AggregatedData

WISE-SoE_WaterQuality.AggregatedData - CAS_3060-89-7 - ug/L
type: Concept
notation: WISE-SoE_WaterQuality.AggregatedData - CAS_3060-89-7 - ug/L
definition: The unit of measure for 'CAS_3060-89-7' (Metobromuron) in WISE SoE - Water Quality: Aggregated data table is 'ug/L'
status: valid
status modified: 2019-10-03
accepted date: 2019-10-03
in scheme: Definition of correct units for the observed determinands in the given WISE SoE DD tables
has determinand: CAS 3060-89-7
has uom: ug.L-1
has table: WISE-SoE WaterQuality.AggregatedData

WISE-SoE_WaterQuality.AggregatedData - CAS_309-00-2 - ug/L
type: Concept
notation: WISE-SoE_WaterQuality.AggregatedData - CAS_309-00-2 - ug/L
definition: The unit of measure for 'CAS_309-00-2' (Aldrin) in WISE SoE - Water Quality: Aggregated data table is 'ug/L'
status: valid
status modified: 2019-10-03
accepted date: 2019-10-03
in scheme: Definition of correct units for the observed determinands in the given WISE SoE DD tables
has determinand: CAS 309-00-2
has uom: ug.L-1
has table: WISE-SoE WaterQuality.AggregatedData

WISE-SoE_WaterQuality.AggregatedData - CAS_31218-83-4 - ug/L
type: Concept
notation: WISE-SoE_WaterQuality.AggregatedData - CAS_31218-83-4 - ug/L
definition: The unit of measure for 'CAS_31218-83-4' (Propetamphos) in WISE SoE - Water Quality: Aggregated data table is 'ug/L'
status: valid
status modified: 2019-10-03
accepted date: 2019-10-03
in scheme: Definition of correct units for the observed determinands in the given WISE SoE DD tables
has determinand: CAS 31218-83-4
has uom: ug.L-1
has table: WISE-SoE WaterQuality.AggregatedData

WISE-SoE_WaterQuality.AggregatedData - CAS_314-40-9 - ug/L
type: Concept
notation: WISE-SoE_WaterQuality.AggregatedData - CAS_314-40-9 - ug/L
definition: The unit of measure for 'CAS_314-40-9' (Bromacil) in WISE SoE - Water Quality: Aggregated data table is 'ug/L'
status: valid
status modified: 2019-10-03
accepted date: 2019-10-03
in scheme: Definition of correct units for the observed determinands in the given WISE SoE DD tables
has determinand: CAS 314-40-9
has uom: ug.L-1
has table: WISE-SoE WaterQuality.AggregatedData

WISE-SoE_WaterQuality.AggregatedData - CAS_31508-00-6 - ug/L
type: Concept
notation: WISE-SoE_WaterQuality.AggregatedData - CAS_31508-00-6 - ug/L
definition: The unit of measure for 'CAS_31508-00-6' (PCB 118 (2,3’,4,4’,5-pentachlorobiphenyl)) in WISE SoE - Water Quality: Aggregated data table is 'ug/L'
status: valid
status modified: 2019-10-03
accepted date: 2019-10-03
in scheme: Definition of correct units for the observed determinands in the given WISE SoE DD tables
has determinand: CAS 31508-00-6
has uom: ug.L-1
has table: WISE-SoE WaterQuality.AggregatedData

WISE-SoE_WaterQuality.AggregatedData - CAS_319-84-6 - ug/L
type: Concept
notation: WISE-SoE_WaterQuality.AggregatedData - CAS_319-84-6 - ug/L
definition: The unit of measure for 'CAS_319-84-6' (Alpha-HCH) in WISE SoE - Water Quality: Aggregated data table is 'ug/L'
status: valid
status modified: 2019-10-03
accepted date: 2019-10-03
in scheme: Definition of correct units for the observed determinands in the given WISE SoE DD tables
has determinand: CAS 319-84-6
has uom: ug.L-1
has table: WISE-SoE WaterQuality.AggregatedData

WISE-SoE_WaterQuality.AggregatedData - CAS_319-85-7 - ug/L
type: Concept
notation: WISE-SoE_WaterQuality.AggregatedData - CAS_319-85-7 - ug/L
definition: The unit of measure for 'CAS_319-85-7' (Beta-HCH) in WISE SoE - Water Quality: Aggregated data table is 'ug/L'
status: valid
status modified: 2019-10-03
accepted date: 2019-10-03
in scheme: Definition of correct units for the observed determinands in the given WISE SoE DD tables
has determinand: CAS 319-85-7
has uom: ug.L-1
has table: WISE-SoE WaterQuality.AggregatedData

WISE-SoE_WaterQuality.AggregatedData - CAS_319-86-8 - ug/L
type: Concept
notation: WISE-SoE_WaterQuality.AggregatedData - CAS_319-86-8 - ug/L
definition: The unit of measure for 'CAS_319-86-8' (Delta-HCH) in WISE SoE - Water Quality: Aggregated data table is 'ug/L'
status: valid
status modified: 2019-10-03
accepted date: 2019-10-03
in scheme: Definition of correct units for the observed determinands in the given WISE SoE DD tables
has determinand: CAS 319-86-8
has uom: ug.L-1
has table: WISE-SoE WaterQuality.AggregatedData

WISE-SoE_WaterQuality.AggregatedData - CAS_3194-55-6 - ug/L
type: Concept
notation: WISE-SoE_WaterQuality.AggregatedData - CAS_3194-55-6 - ug/L
definition: The unit of measure for 'CAS_3194-55-6' (1,2,5,6,9,10-hexabromocyclododecane) in WISE SoE - Water Quality: Aggregated data table is 'ug/L'
status: valid
status modified: 2019-10-03
accepted date: 2019-10-03
in scheme: Definition of correct units for the observed determinands in the given WISE SoE DD tables
has determinand: CAS 3194-55-6
has uom: ug.L-1
has table: WISE-SoE WaterQuality.AggregatedData

WISE-SoE_WaterQuality.AggregatedData - CAS_32-23-5 - ug/L
type: Concept
notation: WISE-SoE_WaterQuality.AggregatedData - CAS_32-23-5 - ug/L
definition: The unit of measure for 'CAS_32-23-5' (2,4-DEP) in WISE SoE - Water Quality: Aggregated data table is 'ug/L'
status: valid
status modified: 2019-10-03
accepted date: 2019-10-03
in scheme: Definition of correct units for the observed determinands in the given WISE SoE DD tables
has determinand: CAS 32-23-5
has uom: ug.L-1
has table: WISE-SoE WaterQuality.AggregatedData

WISE-SoE_WaterQuality.AggregatedData - CAS_3209-22-1 - ug/L
type: Concept
notation: WISE-SoE_WaterQuality.AggregatedData - CAS_3209-22-1 - ug/L
definition: The unit of measure for 'CAS_3209-22-1' (1,2-Dichloro-3-nitrobenzene) in WISE SoE - Water Quality: Aggregated data table is 'ug/L'
status: valid
status modified: 2019-10-03
accepted date: 2019-10-03
in scheme: Definition of correct units for the observed determinands in the given WISE SoE DD tables
has determinand: CAS 3209-22-1
has uom: ug.L-1
has table: WISE-SoE WaterQuality.AggregatedData

WISE-SoE_WaterQuality.AggregatedData - CAS_32241-08-0 - ug/L
type: Concept
notation: WISE-SoE_WaterQuality.AggregatedData - CAS_32241-08-0 - ug/L
definition: The unit of measure for 'CAS_32241-08-0' (Heptachloronaphthalene) in WISE SoE - Water Quality: Aggregated data table is 'ug/L'
status: valid
status modified: 2019-10-03
accepted date: 2019-10-03
in scheme: Definition of correct units for the observed determinands in the given WISE SoE DD tables
has determinand: CAS 32241-08-0
has uom: ug.L-1
has table: WISE-SoE WaterQuality.AggregatedData

WISE-SoE_WaterQuality.AggregatedData - CAS_3252-43-5 - ug/L
type: Concept
notation: WISE-SoE_WaterQuality.AggregatedData - CAS_3252-43-5 - ug/L
definition: The unit of measure for 'CAS_3252-43-5' (Dibromoacetonitrile) in WISE SoE - Water Quality: Aggregated data table is 'ug/L'
status: valid
status modified: 2019-10-03
accepted date: 2019-10-03
in scheme: Definition of correct units for the observed determinands in the given WISE SoE DD tables
has determinand: CAS 3252-43-5
has uom: ug.L-1
has table: WISE-SoE WaterQuality.AggregatedData

WISE-SoE_WaterQuality.AggregatedData - CAS_32534-81-9 - ug/L
type: Concept
notation: WISE-SoE_WaterQuality.AggregatedData - CAS_32534-81-9 - ug/L
definition: The unit of measure for 'CAS_32534-81-9' (Pentabromodiphenylether) in WISE SoE - Water Quality: Aggregated data table is 'ug/L'
status: valid
status modified: 2019-10-03
accepted date: 2019-10-03
in scheme: Definition of correct units for the observed determinands in the given WISE SoE DD tables
has determinand: CAS 32534-81-9
has uom: ug.L-1
has table: WISE-SoE WaterQuality.AggregatedData

WISE-SoE_WaterQuality.AggregatedData - CAS_32536-52-0 - ug/L
type: Concept
notation: WISE-SoE_WaterQuality.AggregatedData - CAS_32536-52-0 - ug/L
definition: The unit of measure for 'CAS_32536-52-0' (Octabromodiphenyl ether) in WISE SoE - Water Quality: Aggregated data table is 'ug/L'
status: valid
status modified: 2019-10-03
accepted date: 2019-10-03
in scheme: Definition of correct units for the observed determinands in the given WISE SoE DD tables
has determinand: CAS 32536-52-0
has uom: ug.L-1
has table: WISE-SoE WaterQuality.AggregatedData

WISE-SoE_WaterQuality.AggregatedData - CAS_32598-13-3 - ug/L
type: Concept
notation: WISE-SoE_WaterQuality.AggregatedData - CAS_32598-13-3 - ug/L
definition: The unit of measure for 'CAS_32598-13-3' (PCB 77 (3,3’,4,4’-tetrachlorobiphenyl)) in WISE SoE - Water Quality: Aggregated data table is 'ug/L'
status: valid
status modified: 2019-10-03
accepted date: 2019-10-03
in scheme: Definition of correct units for the observed determinands in the given WISE SoE DD tables
has determinand: CAS 32598-13-3
has uom: ug.L-1
has table: WISE-SoE WaterQuality.AggregatedData

WISE-SoE_WaterQuality.AggregatedData - CAS_32598-14-4 - ug/L
type: Concept
notation: WISE-SoE_WaterQuality.AggregatedData - CAS_32598-14-4 - ug/L
definition: The unit of measure for 'CAS_32598-14-4' (PCB 105 (2,3,3’,4,4’-pentachlorobiphenyl)) in WISE SoE - Water Quality: Aggregated data table is 'ug/L'
status: valid
status modified: 2019-10-03
accepted date: 2019-10-03
in scheme: Definition of correct units for the observed determinands in the given WISE SoE DD tables
has determinand: CAS 32598-14-4
has uom: ug.L-1
has table: WISE-SoE WaterQuality.AggregatedData

WISE-SoE_WaterQuality.AggregatedData - CAS_3268-87-9 - ug/L
type: Concept
notation: WISE-SoE_WaterQuality.AggregatedData - CAS_3268-87-9 - ug/L
definition: The unit of measure for 'CAS_3268-87-9' (1,2,3,4,6,7,8,9-O8CDD) in WISE SoE - Water Quality: Aggregated data table is 'ug/L'
status: valid
status modified: 2019-10-03
accepted date: 2019-10-03
in scheme: Definition of correct units for the observed determinands in the given WISE SoE DD tables
has determinand: CAS 3268-87-9
has uom: ug.L-1
has table: WISE-SoE WaterQuality.AggregatedData

WISE-SoE_WaterQuality.AggregatedData - CAS_32774-16-6 - ug/L
type: Concept
notation: WISE-SoE_WaterQuality.AggregatedData - CAS_32774-16-6 - ug/L
definition: The unit of measure for 'CAS_32774-16-6' (PCB 169 (3,3’,4,4’,5,5’-hexachlorobiphenyl)) in WISE SoE - Water Quality: Aggregated data table is 'ug/L'
status: valid
status modified: 2019-10-03
accepted date: 2019-10-03
in scheme: Definition of correct units for the observed determinands in the given WISE SoE DD tables
has determinand: CAS 32774-16-6
has uom: ug.L-1
has table: WISE-SoE WaterQuality.AggregatedData

WISE-SoE_WaterQuality.AggregatedData - CAS_32809-16-8 - ug/L
type: Concept
notation: WISE-SoE_WaterQuality.AggregatedData - CAS_32809-16-8 - ug/L
definition: The unit of measure for 'CAS_32809-16-8' (Procymidone) in WISE SoE - Water Quality: Aggregated data table is 'ug/L'
status: valid
status modified: 2019-10-03
accepted date: 2019-10-03
in scheme: Definition of correct units for the observed determinands in the given WISE SoE DD tables
has determinand: CAS 32809-16-8
has uom: ug.L-1
has table: WISE-SoE WaterQuality.AggregatedData

WISE-SoE_WaterQuality.AggregatedData - CAS_330-54-1 - ug/L
type: Concept
notation: WISE-SoE_WaterQuality.AggregatedData - CAS_330-54-1 - ug/L
definition: The unit of measure for 'CAS_330-54-1' (Diuron) in WISE SoE - Water Quality: Aggregated data table is 'ug/L'
status: valid
status modified: 2019-10-03
accepted date: 2019-10-03
in scheme: Definition of correct units for the observed determinands in the given WISE SoE DD tables
has determinand: CAS 330-54-1
has uom: ug.L-1
has table: WISE-SoE WaterQuality.AggregatedData

WISE-SoE_WaterQuality.AggregatedData - CAS_330-55-2 - ug/L
type: Concept
notation: WISE-SoE_WaterQuality.AggregatedData - CAS_330-55-2 - ug/L
definition: The unit of measure for 'CAS_330-55-2' (Linuron) in WISE SoE - Water Quality: Aggregated data table is 'ug/L'
status: valid
status modified: 2019-10-03
accepted date: 2019-10-03
in scheme: Definition of correct units for the observed determinands in the given WISE SoE DD tables
has determinand: CAS 330-55-2
has uom: ug.L-1
has table: WISE-SoE WaterQuality.AggregatedData

WISE-SoE_WaterQuality.AggregatedData - CAS_3307-39-9 - ug/L
type: Concept
notation: WISE-SoE_WaterQuality.AggregatedData - CAS_3307-39-9 - ug/L
definition: The unit of measure for 'CAS_3307-39-9' (2-(4-chlorophenoxy)propionic acid (4-CPP)) in WISE SoE - Water Quality: Aggregated data table is 'ug/L'
status: valid
status modified: 2019-10-03
accepted date: 2019-10-03
in scheme: Definition of correct units for the observed determinands in the given WISE SoE DD tables
has determinand: CAS 3307-39-9
has uom: ug.L-1
has table: WISE-SoE WaterQuality.AggregatedData

WISE-SoE_WaterQuality.AggregatedData - CAS_33213-65-9 - ug/L
type: Concept
notation: WISE-SoE_WaterQuality.AggregatedData - CAS_33213-65-9 - ug/L
definition: The unit of measure for 'CAS_33213-65-9' (Beta-Endosulfan) in WISE SoE - Water Quality: Aggregated data table is 'ug/L'
status: valid
status modified: 2019-10-03
accepted date: 2019-10-03
in scheme: Definition of correct units for the observed determinands in the given WISE SoE DD tables
has determinand: CAS 33213-65-9
has uom: ug.L-1
has table: WISE-SoE WaterQuality.AggregatedData

WISE-SoE_WaterQuality.AggregatedData - CAS_333-41-5 - ug/L
type: Concept
notation: WISE-SoE_WaterQuality.AggregatedData - CAS_333-41-5 - ug/L
definition: The unit of measure for 'CAS_333-41-5' (Diazinon) in WISE SoE - Water Quality: Aggregated data table is 'ug/L'
status: valid
status modified: 2019-10-03
accepted date: 2019-10-03
in scheme: Definition of correct units for the observed determinands in the given WISE SoE DD tables
has determinand: CAS 333-41-5
has uom: ug.L-1
has table: WISE-SoE WaterQuality.AggregatedData

WISE-SoE_WaterQuality.AggregatedData - CAS_3337-71-1 - ug/L
type: Concept
notation: WISE-SoE_WaterQuality.AggregatedData - CAS_3337-71-1 - ug/L
definition: The unit of measure for 'CAS_3337-71-1' (Asulam) in WISE SoE - Water Quality: Aggregated data table is 'ug/L'
status: valid
status modified: 2019-10-03
accepted date: 2019-10-03
in scheme: Definition of correct units for the observed determinands in the given WISE SoE DD tables
has determinand: CAS 3337-71-1
has uom: ug.L-1
has table: WISE-SoE WaterQuality.AggregatedData

WISE-SoE_WaterQuality.AggregatedData - CAS_335-67-1 - ug/L
type: Concept
notation: WISE-SoE_WaterQuality.AggregatedData - CAS_335-67-1 - ug/L
definition: The unit of measure for 'CAS_335-67-1' (PFOA) in WISE SoE - Water Quality: Aggregated data table is 'ug/L'
status: valid
status modified: 2019-10-03
accepted date: 2019-10-03
in scheme: Definition of correct units for the observed determinands in the given WISE SoE DD tables
has determinand: CAS 335-67-1
has uom: ug.L-1
has table: WISE-SoE WaterQuality.AggregatedData

WISE-SoE_WaterQuality.AggregatedData - CAS_33693-04-8 - ug/L
type: Concept
notation: WISE-SoE_WaterQuality.AggregatedData - CAS_33693-04-8 - ug/L
definition: The unit of measure for 'CAS_33693-04-8' (Terbumeton) in WISE SoE - Water Quality: Aggregated data table is 'ug/L'
status: valid
status modified: 2019-10-03
accepted date: 2019-10-03
in scheme: Definition of correct units for the observed determinands in the given WISE SoE DD tables
has determinand: CAS 33693-04-8
has uom: ug.L-1
has table: WISE-SoE WaterQuality.AggregatedData

WISE-SoE_WaterQuality.AggregatedData - CAS_3380-34-5 - ug/L
type: Concept
notation: WISE-SoE_WaterQuality.AggregatedData - CAS_3380-34-5 - ug/L
definition: The unit of measure for 'CAS_3380-34-5' (Triclosan) in WISE SoE - Water Quality: Aggregated data table is 'ug/L'
status: valid
status modified: 2019-10-03
accepted date: 2019-10-03
in scheme: Definition of correct units for the observed determinands in the given WISE SoE DD tables
has determinand: CAS 3380-34-5
has uom: ug.L-1
has table: WISE-SoE WaterQuality.AggregatedData

WISE-SoE_WaterQuality.AggregatedData - CAS_3397-62-4 - ug/L
type: Concept
notation: WISE-SoE_WaterQuality.AggregatedData - CAS_3397-62-4 - ug/L
definition: The unit of measure for 'CAS_3397-62-4' (Deisopropyldeethylatrazine) in WISE SoE - Water Quality: Aggregated data table is 'ug/L'
status: valid
status modified: 2019-10-03
accepted date: 2019-10-03
in scheme: Definition of correct units for the observed determinands in the given WISE SoE DD tables
has determinand: CAS 3397-62-4
has uom: ug.L-1
has table: WISE-SoE WaterQuality.AggregatedData

WISE-SoE_WaterQuality.AggregatedData - CAS_34123-59-6 - ug/L
type: Concept
notation: WISE-SoE_WaterQuality.AggregatedData - CAS_34123-59-6 - ug/L
definition: The unit of measure for 'CAS_34123-59-6' (Isoproturon) in WISE SoE - Water Quality: Aggregated data table is 'ug/L'
status: valid
status modified: 2019-10-03
accepted date: 2019-10-03
in scheme: Definition of correct units for the observed determinands in the given WISE SoE DD tables
has determinand: CAS 34123-59-6
has uom: ug.L-1
has table: WISE-SoE WaterQuality.AggregatedData

WISE-SoE_WaterQuality.AggregatedData - CAS_3424-82-6 - ug/L
type: Concept
notation: WISE-SoE_WaterQuality.AggregatedData - CAS_3424-82-6 - ug/L
definition: The unit of measure for 'CAS_3424-82-6' (o,p'-DDE) in WISE SoE - Water Quality: Aggregated data table is 'ug/L'
status: valid
status modified: 2019-10-03
accepted date: 2019-10-03
in scheme: Definition of correct units for the observed determinands in the given WISE SoE DD tables
has determinand: CAS 3424-82-6
has uom: ug.L-1
has table: WISE-SoE WaterQuality.AggregatedData

WISE-SoE_WaterQuality.AggregatedData - CAS_34256-82-1 - ug/L
type: Concept
notation: WISE-SoE_WaterQuality.AggregatedData - CAS_34256-82-1 - ug/L
definition: The unit of measure for 'CAS_34256-82-1' (Acetochlor) in WISE SoE - Water Quality: Aggregated data table is 'ug/L'
status: valid
status modified: 2019-10-03
accepted date: 2019-10-03
in scheme: Definition of correct units for the observed determinands in the given WISE SoE DD tables
has determinand: CAS 34256-82-1
has uom: ug.L-1
has table: WISE-SoE WaterQuality.AggregatedData

WISE-SoE_WaterQuality.AggregatedData - CAS_34622-58-7 - ug/L
type: Concept
notation: WISE-SoE_WaterQuality.AggregatedData - CAS_34622-58-7 - ug/L
definition: The unit of measure for 'CAS_34622-58-7' (Orbencarb) in WISE SoE - Water Quality: Aggregated data table is 'ug/L'
status: valid
status modified: 2019-10-03
accepted date: 2019-10-03
in scheme: Definition of correct units for the observed determinands in the given WISE SoE DD tables
has determinand: CAS 34622-58-7
has uom: ug.L-1
has table: WISE-SoE WaterQuality.AggregatedData

WISE-SoE_WaterQuality.AggregatedData - CAS_35045-02-4 - ug/L
type: Concept
notation: WISE-SoE_WaterQuality.AggregatedData - CAS_35045-02-4 - ug/L
definition: The unit of measure for 'CAS_35045-02-4' (Metribuzin-DA) in WISE SoE - Water Quality: Aggregated data table is 'ug/L'
status: valid
status modified: 2019-10-03
accepted date: 2019-10-03
in scheme: Definition of correct units for the observed determinands in the given WISE SoE DD tables
has determinand: CAS 35045-02-4
has uom: ug.L-1
has table: WISE-SoE WaterQuality.AggregatedData

WISE-SoE_WaterQuality.AggregatedData - CAS_35065-27-1 - ug/L
type: Concept
notation: WISE-SoE_WaterQuality.AggregatedData - CAS_35065-27-1 - ug/L
definition: The unit of measure for 'CAS_35065-27-1' (PCB 153 (2,2’,4,4’,5,5’-hexachlorobiphenyl)) in WISE SoE - Water Quality: Aggregated data table is 'ug/L'
status: valid
status modified: 2019-10-03
accepted date: 2019-10-03
in scheme: Definition of correct units for the observed determinands in the given WISE SoE DD tables
has determinand: CAS 35065-27-1
has uom: ug.L-1
has table: WISE-SoE WaterQuality.AggregatedData

WISE-SoE_WaterQuality.AggregatedData - CAS_35065-28-2 - ug/L
type: Concept
notation: WISE-SoE_WaterQuality.AggregatedData - CAS_35065-28-2 - ug/L
definition: The unit of measure for 'CAS_35065-28-2' (PCB 138 (2,2’,3,4,4’,5’-hexachlorobiphenyl)) in WISE SoE - Water Quality: Aggregated data table is 'ug/L'
status: valid
status modified: 2019-10-03
accepted date: 2019-10-03
in scheme: Definition of correct units for the observed determinands in the given WISE SoE DD tables
has determinand: CAS 35065-28-2
has uom: ug.L-1
has table: WISE-SoE WaterQuality.AggregatedData

WISE-SoE_WaterQuality.AggregatedData - CAS_35065-29-3 - ug/L
type: Concept
notation: WISE-SoE_WaterQuality.AggregatedData - CAS_35065-29-3 - ug/L
definition: The unit of measure for 'CAS_35065-29-3' (PCB 180 (2,2’,3,4,4’,5,5’-heptachlorobiphenyl)) in WISE SoE - Water Quality: Aggregated data table is 'ug/L'
status: valid
status modified: 2019-10-03
accepted date: 2019-10-03
in scheme: Definition of correct units for the observed determinands in the given WISE SoE DD tables
has determinand: CAS 35065-29-3
has uom: ug.L-1
has table: WISE-SoE WaterQuality.AggregatedData

WISE-SoE_WaterQuality.AggregatedData - CAS_35065-30-6 - ug/L
type: Concept
notation: WISE-SoE_WaterQuality.AggregatedData - CAS_35065-30-6 - ug/L
definition: The unit of measure for 'CAS_35065-30-6' (PCB 170 (1,2,3,4-tetrachloro-5-(2,3,4-trichlorophenyl)benzene)) in WISE SoE - Water Quality: Aggregated data table is 'ug/L'
status: valid
status modified: 2019-10-03
accepted date: 2019-10-03
in scheme: Definition of correct units for the observed determinands in the given WISE SoE DD tables
has determinand: CAS 35065-30-6
has uom: ug.L-1
has table: WISE-SoE WaterQuality.AggregatedData

WISE-SoE_WaterQuality.AggregatedData - CAS_35367-38-5 - ug/L
type: Concept
notation: WISE-SoE_WaterQuality.AggregatedData - CAS_35367-38-5 - ug/L
definition: The unit of measure for 'CAS_35367-38-5' (Diflubenzuron) in WISE SoE - Water Quality: Aggregated data table is 'ug/L'
status: valid
status modified: 2019-10-03
accepted date: 2019-10-03
in scheme: Definition of correct units for the observed determinands in the given WISE SoE DD tables
has determinand: CAS 35367-38-5
has uom: ug.L-1
has table: WISE-SoE WaterQuality.AggregatedData

WISE-SoE_WaterQuality.AggregatedData - CAS_35554-44-0 - ug/L
type: Concept
notation: WISE-SoE_WaterQuality.AggregatedData - CAS_35554-44-0 - ug/L
definition: The unit of measure for 'CAS_35554-44-0' (Imazalil) in WISE SoE - Water Quality: Aggregated data table is 'ug/L'
status: valid
status modified: 2019-10-03
accepted date: 2019-10-03
in scheme: Definition of correct units for the observed determinands in the given WISE SoE DD tables
has determinand: CAS 35554-44-0
has uom: ug.L-1
has table: WISE-SoE WaterQuality.AggregatedData

WISE-SoE_WaterQuality.AggregatedData - CAS_35693-99-3 - ug/L
type: Concept
notation: WISE-SoE_WaterQuality.AggregatedData - CAS_35693-99-3 - ug/L
definition: The unit of measure for 'CAS_35693-99-3' (PCB 52 (2,2’,5,5’-tetrachlorobiphenyl)) in WISE SoE - Water Quality: Aggregated data table is 'ug/L'
status: valid
status modified: 2019-10-03
accepted date: 2019-10-03
in scheme: Definition of correct units for the observed determinands in the given WISE SoE DD tables
has determinand: CAS 35693-99-3
has uom: ug.L-1
has table: WISE-SoE WaterQuality.AggregatedData

WISE-SoE_WaterQuality.AggregatedData - CAS_35694-08-7 - ug/L
type: Concept
notation: WISE-SoE_WaterQuality.AggregatedData - CAS_35694-08-7 - ug/L
definition: The unit of measure for 'CAS_35694-08-7' (PCB 194 (1,2,3,4-tetrachloro-5-(2,3,4,5-tetrachlorophenyl)benzene)) in WISE SoE - Water Quality: Aggregated data table is 'ug/L'
status: valid
status modified: 2019-10-03
accepted date: 2019-10-03
in scheme: Definition of correct units for the observed determinands in the given WISE SoE DD tables
has determinand: CAS 35694-08-7
has uom: ug.L-1
has table: WISE-SoE WaterQuality.AggregatedData

WISE-SoE_WaterQuality.AggregatedData - CAS_35822-46-9 - ug/L
type: Concept
notation: WISE-SoE_WaterQuality.AggregatedData - CAS_35822-46-9 - ug/L
definition: The unit of measure for 'CAS_35822-46-9' (1,2,3,4,6,7,8-H7CDD) in WISE SoE - Water Quality: Aggregated data table is 'ug/L'
status: valid
status modified: 2019-10-03
accepted date: 2019-10-03
in scheme: Definition of correct units for the observed determinands in the given WISE SoE DD tables
has determinand: CAS 35822-46-9
has uom: ug.L-1
has table: WISE-SoE WaterQuality.AggregatedData

WISE-SoE_WaterQuality.AggregatedData - CAS_36065-30-2 - ug/L
type: Concept
notation: WISE-SoE_WaterQuality.AggregatedData - CAS_36065-30-2 - ug/L
definition: The unit of measure for 'CAS_36065-30-2' (2,4,6-tribromophenyl 2-methyl-2,3-dibromopropy ether) in WISE SoE - Water Quality: Aggregated data table is 'ug/L'
status: valid
status modified: 2019-10-03
accepted date: 2019-10-03
in scheme: Definition of correct units for the observed determinands in the given WISE SoE DD tables
has determinand: CAS 36065-30-2
has uom: ug.L-1
has table: WISE-SoE WaterQuality.AggregatedData

WISE-SoE_WaterQuality.AggregatedData - CAS_36355-01-8 - ug/L
type: Concept
notation: WISE-SoE_WaterQuality.AggregatedData - CAS_36355-01-8 - ug/L
definition: The unit of measure for 'CAS_36355-01-8' (Hexabromobiphenyl) in WISE SoE - Water Quality: Aggregated data table is 'ug/L'
status: valid
status modified: 2019-10-03
accepted date: 2019-10-03
in scheme: Definition of correct units for the observed determinands in the given WISE SoE DD tables
has determinand: CAS 36355-01-8
has uom: ug.L-1
has table: WISE-SoE WaterQuality.AggregatedData

WISE-SoE_WaterQuality.AggregatedData - CAS_36483-60-0 - ug/L
type: Concept
notation: WISE-SoE_WaterQuality.AggregatedData - CAS_36483-60-0 - ug/L
definition: The unit of measure for 'CAS_36483-60-0' (Hexabromodiphenylether) in WISE SoE - Water Quality: Aggregated data table is 'ug/L'
status: valid
status modified: 2019-10-03
accepted date: 2019-10-03
in scheme: Definition of correct units for the observed determinands in the given WISE SoE DD tables
has determinand: CAS 36483-60-0
has uom: ug.L-1
has table: WISE-SoE WaterQuality.AggregatedData

WISE-SoE_WaterQuality.AggregatedData - CAS_36643-28-4 - ug/L
type: Concept
notation: WISE-SoE_WaterQuality.AggregatedData - CAS_36643-28-4 - ug/L
definition: The unit of measure for 'CAS_36643-28-4' (Tributyltin-cation) in WISE SoE - Water Quality: Aggregated data table is 'ug/L'
status: valid
status modified: 2019-10-03
accepted date: 2019-10-03
in scheme: Definition of correct units for the observed determinands in the given WISE SoE DD tables
has determinand: CAS 36643-28-4
has uom: ug.L-1
has table: WISE-SoE WaterQuality.AggregatedData

WISE-SoE_WaterQuality.AggregatedData - CAS_36734-19-7 - ug/L
type: Concept
notation: WISE-SoE_WaterQuality.AggregatedData - CAS_36734-19-7 - ug/L
definition: The unit of measure for 'CAS_36734-19-7' (Iprodione) in WISE SoE - Water Quality: Aggregated data table is 'ug/L'
status: valid
status modified: 2019-10-03
accepted date: 2019-10-03
in scheme: Definition of correct units for the observed determinands in the given WISE SoE DD tables
has determinand: CAS 36734-19-7
has uom: ug.L-1
has table: WISE-SoE WaterQuality.AggregatedData

WISE-SoE_WaterQuality.AggregatedData - CAS_36756-79-3 - ug/L
type: Concept
notation: WISE-SoE_WaterQuality.AggregatedData - CAS_36756-79-3 - ug/L
definition: The unit of measure for 'CAS_36756-79-3' (Tiocarbazil) in WISE SoE - Water Quality: Aggregated data table is 'ug/L'
status: valid
status modified: 2019-10-03
accepted date: 2019-10-03
in scheme: Definition of correct units for the observed determinands in the given WISE SoE DD tables
has determinand: CAS 36756-79-3
has uom: ug.L-1
has table: WISE-SoE WaterQuality.AggregatedData

WISE-SoE_WaterQuality.AggregatedData - CAS_37350-58-6 - ug/L
type: Concept
notation: WISE-SoE_WaterQuality.AggregatedData - CAS_37350-58-6 - ug/L
definition: The unit of measure for 'CAS_37350-58-6' (Metoprolol) in WISE SoE - Water Quality: Aggregated data table is 'ug/L'
status: valid
status modified: 2019-10-03
accepted date: 2019-10-03
in scheme: Definition of correct units for the observed determinands in the given WISE SoE DD tables
has determinand: CAS 37350-58-6
has uom: ug.L-1
has table: WISE-SoE WaterQuality.AggregatedData

WISE-SoE_WaterQuality.AggregatedData - CAS_3766-60-7 - ug/L
type: Concept
notation: WISE-SoE_WaterQuality.AggregatedData - CAS_3766-60-7 - ug/L
definition: The unit of measure for 'CAS_3766-60-7' (Buturon) in WISE SoE - Water Quality: Aggregated data table is 'ug/L'
status: valid
status modified: 2019-10-03
accepted date: 2019-10-03
in scheme: Definition of correct units for the observed determinands in the given WISE SoE DD tables
has determinand: CAS 3766-60-7
has uom: ug.L-1
has table: WISE-SoE WaterQuality.AggregatedData

WISE-SoE_WaterQuality.AggregatedData - CAS_37680-73-2 - ug/L
type: Concept
notation: WISE-SoE_WaterQuality.AggregatedData - CAS_37680-73-2 - ug/L
definition: The unit of measure for 'CAS_37680-73-2' (PCB 101 (2,2’,4,5,5’-pentachlorobiphenyl)) in WISE SoE - Water Quality: Aggregated data table is 'ug/L'
status: valid
status modified: 2019-10-03
accepted date: 2019-10-03
in scheme: Definition of correct units for the observed determinands in the given WISE SoE DD tables
has determinand: CAS 37680-73-2
has uom: ug.L-1
has table: WISE-SoE WaterQuality.AggregatedData

WISE-SoE_WaterQuality.AggregatedData - CAS_380412-59-9 - ug/L
type: Concept
notation: WISE-SoE_WaterQuality.AggregatedData - CAS_380412-59-9 - ug/L
definition: The unit of measure for 'CAS_380412-59-9' (Dimethenamid OA) in WISE SoE - Water Quality: Aggregated data table is 'ug/L'
status: valid
status modified: 2019-10-03
accepted date: 2019-10-03
in scheme: Definition of correct units for the observed determinands in the given WISE SoE DD tables
has determinand: CAS 380412-59-9
has uom: ug.L-1
has table: WISE-SoE WaterQuality.AggregatedData

WISE-SoE_WaterQuality.AggregatedData - CAS_3812-32-6 - ug/L
type: Concept
notation: WISE-SoE_WaterQuality.AggregatedData - CAS_3812-32-6 - ug/L
definition: The unit of measure for 'CAS_3812-32-6' (Carbonate) in WISE SoE - Water Quality: Aggregated data table is 'ug/L'
status: valid
status modified: 2019-10-03
accepted date: 2019-10-03
in scheme: Definition of correct units for the observed determinands in the given WISE SoE DD tables
has determinand: CAS 3812-32-6
has uom: ug.L-1
has table: WISE-SoE WaterQuality.AggregatedData

WISE-SoE_WaterQuality.AggregatedData - CAS_3813-05-6 - ug/L
type: Concept
notation: WISE-SoE_WaterQuality.AggregatedData - CAS_3813-05-6 - ug/L
definition: The unit of measure for 'CAS_3813-05-6' (Benazolin) in WISE SoE - Water Quality: Aggregated data table is 'ug/L'
status: valid
status modified: 2019-10-03
accepted date: 2019-10-03
in scheme: Definition of correct units for the observed determinands in the given WISE SoE DD tables
has determinand: CAS 3813-05-6
has uom: ug.L-1
has table: WISE-SoE WaterQuality.AggregatedData

WISE-SoE_WaterQuality.AggregatedData - CAS_38260-54-7 - ug/L
type: Concept
notation: WISE-SoE_WaterQuality.AggregatedData - CAS_38260-54-7 - ug/L
definition: The unit of measure for 'CAS_38260-54-7' (Phosphorothioic acid) in WISE SoE - Water Quality: Aggregated data table is 'ug/L'
status: valid
status modified: 2019-10-03
accepted date: 2019-10-03
in scheme: Definition of correct units for the observed determinands in the given WISE SoE DD tables
has determinand: CAS 38260-54-7
has uom: ug.L-1
has table: WISE-SoE WaterQuality.AggregatedData

WISE-SoE_WaterQuality.AggregatedData - CAS_38379-99-6 - ug/L
type: Concept
notation: WISE-SoE_WaterQuality.AggregatedData - CAS_38379-99-6 - ug/L
definition: The unit of measure for 'CAS_38379-99-6' (PCB 95 (2,2',3,5',6-Pentachlorobiphenyl)) in WISE SoE - Water Quality: Aggregated data table is 'ug/L'
status: valid
status modified: 2019-10-03
accepted date: 2019-10-03
in scheme: Definition of correct units for the observed determinands in the given WISE SoE DD tables
has determinand: CAS 38379-99-6
has uom: ug.L-1
has table: WISE-SoE WaterQuality.AggregatedData

WISE-SoE_WaterQuality.AggregatedData - CAS_38380-01-7 - ug/L
type: Concept
notation: WISE-SoE_WaterQuality.AggregatedData - CAS_38380-01-7 - ug/L
definition: The unit of measure for 'CAS_38380-01-7' (PCB 99 (2,2',4,4',5-Pentachlorobiphenyl)) in WISE SoE - Water Quality: Aggregated data table is 'ug/L'
status: valid
status modified: 2019-10-03
accepted date: 2019-10-03
in scheme: Definition of correct units for the observed determinands in the given WISE SoE DD tables
has determinand: CAS 38380-01-7
has uom: ug.L-1
has table: WISE-SoE WaterQuality.AggregatedData

WISE-SoE_WaterQuality.AggregatedData - CAS_38380-03-9 - ug/L
type: Concept
notation: WISE-SoE_WaterQuality.AggregatedData - CAS_38380-03-9 - ug/L
definition: The unit of measure for 'CAS_38380-03-9' (PCB 110 (2,3,3',4',6-Pentachlorobiphenyl)) in WISE SoE - Water Quality: Aggregated data table is 'ug/L'
status: valid
status modified: 2019-10-03
accepted date: 2019-10-03
in scheme: Definition of correct units for the observed determinands in the given WISE SoE DD tables
has determinand: CAS 38380-03-9
has uom: ug.L-1
has table: WISE-SoE WaterQuality.AggregatedData

WISE-SoE_WaterQuality.AggregatedData - CAS_38380-04-0 - ug/L
type: Concept
notation: WISE-SoE_WaterQuality.AggregatedData - CAS_38380-04-0 - ug/L
definition: The unit of measure for 'CAS_38380-04-0' (PCB 149 (2,2',3,4',5',6-Hexachlorobiphenyl)) in WISE SoE - Water Quality: Aggregated data table is 'ug/L'
status: valid
status modified: 2019-10-03
accepted date: 2019-10-03
in scheme: Definition of correct units for the observed determinands in the given WISE SoE DD tables
has determinand: CAS 38380-04-0
has uom: ug.L-1
has table: WISE-SoE WaterQuality.AggregatedData

WISE-SoE_WaterQuality.AggregatedData - CAS_38380-08-4 - ug/L
type: Concept
notation: WISE-SoE_WaterQuality.AggregatedData - CAS_38380-08-4 - ug/L
definition: The unit of measure for 'CAS_38380-08-4' (PCB 156 (2,3,3’,4,4’,5-hexachlorobiphenyl)) in WISE SoE - Water Quality: Aggregated data table is 'ug/L'
status: valid
status modified: 2019-10-03
accepted date: 2019-10-03
in scheme: Definition of correct units for the observed determinands in the given WISE SoE DD tables
has determinand: CAS 38380-08-4
has uom: ug.L-1
has table: WISE-SoE WaterQuality.AggregatedData

WISE-SoE_WaterQuality.AggregatedData - CAS_38939-88-7 - ug/L
type: Concept
notation: WISE-SoE_WaterQuality.AggregatedData - CAS_38939-88-7 - ug/L
definition: The unit of measure for 'CAS_38939-88-7' (3-chloro-4-nitrotoluene) in WISE SoE - Water Quality: Aggregated data table is 'ug/L'
status: valid
status modified: 2019-10-03
accepted date: 2019-10-03
in scheme: Definition of correct units for the observed determinands in the given WISE SoE DD tables
has determinand: CAS 38939-88-7
has uom: ug.L-1
has table: WISE-SoE WaterQuality.AggregatedData

WISE-SoE_WaterQuality.AggregatedData - CAS_39001-02-0 - ug/L
type: Concept
notation: WISE-SoE_WaterQuality.AggregatedData - CAS_39001-02-0 - ug/L
definition: The unit of measure for 'CAS_39001-02-0' (1,2,3,4,6,7,8,9-O8CDF) in WISE SoE - Water Quality: Aggregated data table is 'ug/L'
status: valid
status modified: 2019-10-03
accepted date: 2019-10-03
in scheme: Definition of correct units for the observed determinands in the given WISE SoE DD tables
has determinand: CAS 39001-02-0
has uom: ug.L-1
has table: WISE-SoE WaterQuality.AggregatedData

WISE-SoE_WaterQuality.AggregatedData - CAS_39227-28-6 - ug/L
type: Concept
notation: WISE-SoE_WaterQuality.AggregatedData - CAS_39227-28-6 - ug/L
definition: The unit of measure for 'CAS_39227-28-6' (1,2,3,4,7,8-H6CDD) in WISE SoE - Water Quality: Aggregated data table is 'ug/L'
status: valid
status modified: 2019-10-03
accepted date: 2019-10-03
in scheme: Definition of correct units for the observed determinands in the given WISE SoE DD tables
has determinand: CAS 39227-28-6
has uom: ug.L-1
has table: WISE-SoE WaterQuality.AggregatedData

WISE-SoE_WaterQuality.AggregatedData - CAS_39635-31-9 - ug/L
type: Concept
notation: WISE-SoE_WaterQuality.AggregatedData - CAS_39635-31-9 - ug/L
definition: The unit of measure for 'CAS_39635-31-9' (PCB 189 (1,2,3,4-tetrachloro-5-(3,4,5-trichlorophenyl)benzene)) in WISE SoE - Water Quality: Aggregated data table is 'ug/L'
status: valid
status modified: 2019-10-03
accepted date: 2019-10-03
in scheme: Definition of correct units for the observed determinands in the given WISE SoE DD tables
has determinand: CAS 39635-31-9
has uom: ug.L-1
has table: WISE-SoE WaterQuality.AggregatedData

WISE-SoE_WaterQuality.AggregatedData - CAS_39765-80-5 - ug/L
type: Concept
notation: WISE-SoE_WaterQuality.AggregatedData - CAS_39765-80-5 - ug/L
definition: The unit of measure for 'CAS_39765-80-5' (trans-Nonachlor) in WISE SoE - Water Quality: Aggregated data table is 'ug/L'
status: valid
status modified: 2019-10-03
accepted date: 2019-10-03
in scheme: Definition of correct units for the observed determinands in the given WISE SoE DD tables
has determinand: CAS 39765-80-5
has uom: ug.L-1
has table: WISE-SoE WaterQuality.AggregatedData

WISE-SoE_WaterQuality.AggregatedData - CAS_3984-14-3 - ug/L
type: Concept
notation: WISE-SoE_WaterQuality.AggregatedData - CAS_3984-14-3 - ug/L
definition: The unit of measure for 'CAS_3984-14-3' (N,N-dimethylsulfamide) in WISE SoE - Water Quality: Aggregated data table is 'ug/L'
status: valid
status modified: 2019-10-03
accepted date: 2019-10-03
in scheme: Definition of correct units for the observed determinands in the given WISE SoE DD tables
has determinand: CAS 3984-14-3
has uom: ug.L-1
has table: WISE-SoE WaterQuality.AggregatedData

WISE-SoE_WaterQuality.AggregatedData - CAS_40088-47-9 - ug/L
type: Concept
notation: WISE-SoE_WaterQuality.AggregatedData - CAS_40088-47-9 - ug/L
definition: The unit of measure for 'CAS_40088-47-9' (Tetrabromodiphenylether) in WISE SoE - Water Quality: Aggregated data table is 'ug/L'
status: valid
status modified: 2019-10-03
accepted date: 2019-10-03
in scheme: Definition of correct units for the observed determinands in the given WISE SoE DD tables
has determinand: CAS 40088-47-9
has uom: ug.L-1
has table: WISE-SoE WaterQuality.AggregatedData

WISE-SoE_WaterQuality.AggregatedData - CAS_40321-76-4 - ug/L
type: Concept
notation: WISE-SoE_WaterQuality.AggregatedData - CAS_40321-76-4 - ug/L
definition: The unit of measure for 'CAS_40321-76-4' (1,2,3,7,8-P5CDD) in WISE SoE - Water Quality: Aggregated data table is 'ug/L'
status: valid
status modified: 2019-10-03
accepted date: 2019-10-03
in scheme: Definition of correct units for the observed determinands in the given WISE SoE DD tables
has determinand: CAS 40321-76-4
has uom: ug.L-1
has table: WISE-SoE WaterQuality.AggregatedData

WISE-SoE_WaterQuality.AggregatedData - CAS_40487-42-1 - ug/L
type: Concept
notation: WISE-SoE_WaterQuality.AggregatedData - CAS_40487-42-1 - ug/L
definition: The unit of measure for 'CAS_40487-42-1' (Pendimethalin) in WISE SoE - Water Quality: Aggregated data table is 'ug/L'
status: valid
status modified: 2019-10-03
accepted date: 2019-10-03
in scheme: Definition of correct units for the observed determinands in the given WISE SoE DD tables
has determinand: CAS 40487-42-1
has uom: ug.L-1
has table: WISE-SoE WaterQuality.AggregatedData

WISE-SoE_WaterQuality.AggregatedData - CAS_41318-75-6 - ug/L
type: Concept
notation: WISE-SoE_WaterQuality.AggregatedData - CAS_41318-75-6 - ug/L
definition: The unit of measure for 'CAS_41318-75-6' (BDE 28 (2,4,4'-tribromodiphenyl ether)) in WISE SoE - Water Quality: Aggregated data table is 'ug/L'
status: valid
status modified: 2019-10-03
accepted date: 2019-10-03
in scheme: Definition of correct units for the observed determinands in the given WISE SoE DD tables
has determinand: CAS 41318-75-6
has uom: ug.L-1
has table: WISE-SoE WaterQuality.AggregatedData

WISE-SoE_WaterQuality.AggregatedData - CAS_41394-05-2 - ug/L
type: Concept
notation: WISE-SoE_WaterQuality.AggregatedData - CAS_41394-05-2 - ug/L
definition: The unit of measure for 'CAS_41394-05-2' (Metamitron) in WISE SoE - Water Quality: Aggregated data table is 'ug/L'
status: valid
status modified: 2019-10-03
accepted date: 2019-10-03
in scheme: Definition of correct units for the observed determinands in the given WISE SoE DD tables
has determinand: CAS 41394-05-2
has uom: ug.L-1
has table: WISE-SoE WaterQuality.AggregatedData

WISE-SoE_WaterQuality.AggregatedData - CAS_41464-42-0 - ug/L
type: Concept
notation: WISE-SoE_WaterQuality.AggregatedData - CAS_41464-42-0 - ug/L
definition: The unit of measure for 'CAS_41464-42-0' (PCB 72 (2,3',5,5'-Tetrachlorobiphenyl)) in WISE SoE - Water Quality: Aggregated data table is 'ug/L'
status: valid
status modified: 2019-10-03
accepted date: 2019-10-03
in scheme: Definition of correct units for the observed determinands in the given WISE SoE DD tables
has determinand: CAS 41464-42-0
has uom: ug.L-1
has table: WISE-SoE WaterQuality.AggregatedData

WISE-SoE_WaterQuality.AggregatedData - CAS_41483-43-6 - ug/L
type: Concept
notation: WISE-SoE_WaterQuality.AggregatedData - CAS_41483-43-6 - ug/L
definition: The unit of measure for 'CAS_41483-43-6' (Bupirimate) in WISE SoE - Water Quality: Aggregated data table is 'ug/L'
status: valid
status modified: 2019-10-03
accepted date: 2019-10-03
in scheme: Definition of correct units for the observed determinands in the given WISE SoE DD tables
has determinand: CAS 41483-43-6
has uom: ug.L-1
has table: WISE-SoE WaterQuality.AggregatedData

WISE-SoE_WaterQuality.AggregatedData - CAS_41859-67-0 - ug/L
type: Concept
notation: WISE-SoE_WaterQuality.AggregatedData - CAS_41859-67-0 - ug/L
definition: The unit of measure for 'CAS_41859-67-0' (Bezafibrate) in WISE SoE - Water Quality: Aggregated data table is 'ug/L'
status: valid
status modified: 2019-10-03
accepted date: 2019-10-03
in scheme: Definition of correct units for the observed determinands in the given WISE SoE DD tables
has determinand: CAS 41859-67-0
has uom: ug.L-1
has table: WISE-SoE WaterQuality.AggregatedData

WISE-SoE_WaterQuality.AggregatedData - CAS_4234-79-1 - ug/L
type: Concept
notation: WISE-SoE_WaterQuality.AggregatedData - CAS_4234-79-1 - ug/L
definition: The unit of measure for 'CAS_4234-79-1' (Kelevan) in WISE SoE - Water Quality: Aggregated data table is 'ug/L'
status: valid
status modified: 2019-10-03
accepted date: 2019-10-03
in scheme: Definition of correct units for the observed determinands in the given WISE SoE DD tables
has determinand: CAS 4234-79-1
has uom: ug.L-1
has table: WISE-SoE WaterQuality.AggregatedData

WISE-SoE_WaterQuality.AggregatedData - CAS_4245-76-5 - ug/L
type: Concept
notation: WISE-SoE_WaterQuality.AggregatedData - CAS_4245-76-5 - ug/L
definition: The unit of measure for 'CAS_4245-76-5' (N-methyl-N'-nitroguanidine) in WISE SoE - Water Quality: Aggregated data table is 'ug/L'
status: valid
status modified: 2019-10-03
accepted date: 2019-10-03
in scheme: Definition of correct units for the observed determinands in the given WISE SoE DD tables
has determinand: CAS 4245-76-5
has uom: ug.L-1
has table: WISE-SoE WaterQuality.AggregatedData

WISE-SoE_WaterQuality.AggregatedData - CAS_42576-02-3 - ug/L
type: Concept
notation: WISE-SoE_WaterQuality.AggregatedData - CAS_42576-02-3 - ug/L
definition: The unit of measure for 'CAS_42576-02-3' (Bifenox) in WISE SoE - Water Quality: Aggregated data table is 'ug/L'
status: valid
status modified: 2019-10-03
accepted date: 2019-10-03
in scheme: Definition of correct units for the observed determinands in the given WISE SoE DD tables
has determinand: CAS 42576-02-3
has uom: ug.L-1
has table: WISE-SoE WaterQuality.AggregatedData

WISE-SoE_WaterQuality.AggregatedData - CAS_42874-03-3 - ug/L
type: Concept
notation: WISE-SoE_WaterQuality.AggregatedData - CAS_42874-03-3 - ug/L
definition: The unit of measure for 'CAS_42874-03-3' (CAS_42874-03-3 - Oxyfluorfen) in WISE SoE - Water Quality: Aggregated data table is 'ug/L'
status: valid
status modified: 2019-10-03
accepted date: 2019-10-03
in scheme: Definition of correct units for the observed determinands in the given WISE SoE DD tables
has determinand: CAS 42874-03-3
has uom: ug.L-1
has table: WISE-SoE WaterQuality.AggregatedData

WISE-SoE_WaterQuality.AggregatedData - CAS_43121-43-3 - ug/L
type: Concept
notation: WISE-SoE_WaterQuality.AggregatedData - CAS_43121-43-3 - ug/L
definition: The unit of measure for 'CAS_43121-43-3' (Triadimefon) in WISE SoE - Water Quality: Aggregated data table is 'ug/L'
status: valid
status modified: 2019-10-03
accepted date: 2019-10-03
in scheme: Definition of correct units for the observed determinands in the given WISE SoE DD tables
has determinand: CAS 43121-43-3
has uom: ug.L-1
has table: WISE-SoE WaterQuality.AggregatedData

WISE-SoE_WaterQuality.AggregatedData - CAS_4636-83-3 - ug/L
type: Concept
notation: WISE-SoE_WaterQuality.AggregatedData - CAS_4636-83-3 - ug/L
definition: The unit of measure for 'CAS_4636-83-3' (Morfamquat) in WISE SoE - Water Quality: Aggregated data table is 'ug/L'
status: valid
status modified: 2019-10-03
accepted date: 2019-10-03
in scheme: Definition of correct units for the observed determinands in the given WISE SoE DD tables
has determinand: CAS 4636-83-3
has uom: ug.L-1
has table: WISE-SoE WaterQuality.AggregatedData

WISE-SoE_WaterQuality.AggregatedData - CAS_465-73-6 - ug/L
type: Concept
notation: WISE-SoE_WaterQuality.AggregatedData - CAS_465-73-6 - ug/L
definition: The unit of measure for 'CAS_465-73-6' (Isodrin) in WISE SoE - Water Quality: Aggregated data table is 'ug/L'
status: valid
status modified: 2019-10-03
accepted date: 2019-10-03
in scheme: Definition of correct units for the observed determinands in the given WISE SoE DD tables
has determinand: CAS 465-73-6
has uom: ug.L-1
has table: WISE-SoE WaterQuality.AggregatedData

WISE-SoE_WaterQuality.AggregatedData - CAS_470-90-6 - ug/L
type: Concept
notation: WISE-SoE_WaterQuality.AggregatedData - CAS_470-90-6 - ug/L
definition: The unit of measure for 'CAS_470-90-6' (Chlorfenvinphos) in WISE SoE - Water Quality: Aggregated data table is 'ug/L'
status: valid
status modified: 2019-10-03
accepted date: 2019-10-03
in scheme: Definition of correct units for the observed determinands in the given WISE SoE DD tables
has determinand: CAS 470-90-6
has uom: ug.L-1
has table: WISE-SoE WaterQuality.AggregatedData

WISE-SoE_WaterQuality.AggregatedData - CAS_4901-51-3 - ug/L
type: Concept
notation: WISE-SoE_WaterQuality.AggregatedData - CAS_4901-51-3 - ug/L
definition: The unit of measure for 'CAS_4901-51-3' (2,3,4,5-tetrachlorophenol) in WISE SoE - Water Quality: Aggregated data table is 'ug/L'
status: valid
status modified: 2019-10-03
accepted date: 2019-10-03
in scheme: Definition of correct units for the observed determinands in the given WISE SoE DD tables
has determinand: CAS 4901-51-3
has uom: ug.L-1
has table: WISE-SoE WaterQuality.AggregatedData

WISE-SoE_WaterQuality.AggregatedData - CAS_4904-61-4 - ug/L
type: Concept
notation: WISE-SoE_WaterQuality.AggregatedData - CAS_4904-61-4 - ug/L
definition: The unit of measure for 'CAS_4904-61-4' (1,5,9-cyclododecatriene) in WISE SoE - Water Quality: Aggregated data table is 'ug/L'
status: valid
status modified: 2019-10-03
accepted date: 2019-10-03
in scheme: Definition of correct units for the observed determinands in the given WISE SoE DD tables
has determinand: CAS 4904-61-4
has uom: ug.L-1
has table: WISE-SoE WaterQuality.AggregatedData

WISE-SoE_WaterQuality.AggregatedData - CAS_50-00-0 - ug/L
type: Concept
notation: WISE-SoE_WaterQuality.AggregatedData - CAS_50-00-0 - ug/L
definition: The unit of measure for 'CAS_50-00-0' (Formaldehyde) in WISE SoE - Water Quality: Aggregated data table is 'ug/L'
status: valid
status modified: 2019-10-03
accepted date: 2019-10-03
in scheme: Definition of correct units for the observed determinands in the given WISE SoE DD tables
has determinand: CAS 50-00-0
has uom: ug.L-1
has table: WISE-SoE WaterQuality.AggregatedData

WISE-SoE_WaterQuality.AggregatedData - CAS_50-28-2 - ug/L
type: Concept
notation: WISE-SoE_WaterQuality.AggregatedData - CAS_50-28-2 - ug/L
definition: The unit of measure for 'CAS_50-28-2' (17beta-estradiol (E2)) in WISE SoE - Water Quality: Aggregated data table is 'ug/L'
status: valid
status modified: 2019-10-03
accepted date: 2019-10-03
in scheme: Definition of correct units for the observed determinands in the given WISE SoE DD tables
has determinand: CAS 50-28-2
has uom: ug.L-1
has table: WISE-SoE WaterQuality.AggregatedData

WISE-SoE_WaterQuality.AggregatedData - CAS_50-29-3 - ug/L
type: Concept
notation: WISE-SoE_WaterQuality.AggregatedData - CAS_50-29-3 - ug/L
definition: The unit of measure for 'CAS_50-29-3' (DDT, p,p') in WISE SoE - Water Quality: Aggregated data table is 'ug/L'
status: valid
status modified: 2019-10-03
accepted date: 2019-10-03
in scheme: Definition of correct units for the observed determinands in the given WISE SoE DD tables
has determinand: CAS 50-29-3
has uom: ug.L-1
has table: WISE-SoE WaterQuality.AggregatedData

WISE-SoE_WaterQuality.AggregatedData - CAS_50-30-6 - ug/L
type: Concept
notation: WISE-SoE_WaterQuality.AggregatedData - CAS_50-30-6 - ug/L
definition: The unit of measure for 'CAS_50-30-6' (2,6-dichlorobenzoic acid) in WISE SoE - Water Quality: Aggregated data table is 'ug/L'
status: valid
status modified: 2019-10-03
accepted date: 2019-10-03
in scheme: Definition of correct units for the observed determinands in the given WISE SoE DD tables
has determinand: CAS 50-30-6
has uom: ug.L-1
has table: WISE-SoE WaterQuality.AggregatedData

WISE-SoE_WaterQuality.AggregatedData - CAS_50-31-7 - ug/L
type: Concept
notation: WISE-SoE_WaterQuality.AggregatedData - CAS_50-31-7 - ug/L
definition: The unit of measure for 'CAS_50-31-7' (2,3,6-trichlorobenzoic acid) in WISE SoE - Water Quality: Aggregated data table is 'ug/L'
status: valid
status modified: 2019-10-03
accepted date: 2019-10-03
in scheme: Definition of correct units for the observed determinands in the given WISE SoE DD tables
has determinand: CAS 50-31-7
has uom: ug.L-1
has table: WISE-SoE WaterQuality.AggregatedData

WISE-SoE_WaterQuality.AggregatedData - CAS_50-32-8 - ug/L
type: Concept
notation: WISE-SoE_WaterQuality.AggregatedData - CAS_50-32-8 - ug/L
definition: The unit of measure for 'CAS_50-32-8' (Benzo(a)pyrene) in WISE SoE - Water Quality: Aggregated data table is 'ug/L'
status: valid
status modified: 2019-10-03
accepted date: 2019-10-03
in scheme: Definition of correct units for the observed determinands in the given WISE SoE DD tables
has determinand: CAS 50-32-8
has uom: ug.L-1
has table: WISE-SoE WaterQuality.AggregatedData

WISE-SoE_WaterQuality.AggregatedData - CAS_50471-44-8 - ug/L
type: Concept
notation: WISE-SoE_WaterQuality.AggregatedData - CAS_50471-44-8 - ug/L
definition: The unit of measure for 'CAS_50471-44-8' (Vinclozolin) in WISE SoE - Water Quality: Aggregated data table is 'ug/L'
status: valid
status modified: 2019-10-03
accepted date: 2019-10-03
in scheme: Definition of correct units for the observed determinands in the given WISE SoE DD tables
has determinand: CAS 50471-44-8
has uom: ug.L-1
has table: WISE-SoE WaterQuality.AggregatedData

WISE-SoE_WaterQuality.AggregatedData - CAS_50563-36-5 - ug/L
type: Concept
notation: WISE-SoE_WaterQuality.AggregatedData - CAS_50563-36-5 - ug/L
definition: The unit of measure for 'CAS_50563-36-5' (Dimethachlor) in WISE SoE - Water Quality: Aggregated data table is 'ug/L'
status: valid
status modified: 2019-10-03
accepted date: 2019-10-03
in scheme: Definition of correct units for the observed determinands in the given WISE SoE DD tables
has determinand: CAS 50563-36-5
has uom: ug.L-1
has table: WISE-SoE WaterQuality.AggregatedData

WISE-SoE_WaterQuality.AggregatedData - CAS_506-77-4 - ug/L
type: Concept
notation: WISE-SoE_WaterQuality.AggregatedData - CAS_506-77-4 - ug/L
definition: The unit of measure for 'CAS_506-77-4' (Cyanogen chloride) in WISE SoE - Water Quality: Aggregated data table is 'ug/L'
status: valid
status modified: 2019-10-03
accepted date: 2019-10-03
in scheme: Definition of correct units for the observed determinands in the given WISE SoE DD tables
has determinand: CAS 506-77-4
has uom: ug.L-1
has table: WISE-SoE WaterQuality.AggregatedData

WISE-SoE_WaterQuality.AggregatedData - CAS_51000-52-3 - ug/L
type: Concept
notation: WISE-SoE_WaterQuality.AggregatedData - CAS_51000-52-3 - ug/L
definition: The unit of measure for 'CAS_51000-52-3' (Vinyl neodecanoate) in WISE SoE - Water Quality: Aggregated data table is 'ug/L'
status: valid
status modified: 2019-10-03
accepted date: 2019-10-03
in scheme: Definition of correct units for the observed determinands in the given WISE SoE DD tables
has determinand: CAS 51000-52-3
has uom: ug.L-1
has table: WISE-SoE WaterQuality.AggregatedData

WISE-SoE_WaterQuality.AggregatedData - CAS_5103-71-9 - ug/L
type: Concept
notation: WISE-SoE_WaterQuality.AggregatedData - CAS_5103-71-9 - ug/L
definition: The unit of measure for 'CAS_5103-71-9' (Alpha-Chlordan) in WISE SoE - Water Quality: Aggregated data table is 'ug/L'
status: valid
status modified: 2019-10-03
accepted date: 2019-10-03
in scheme: Definition of correct units for the observed determinands in the given WISE SoE DD tables
has determinand: CAS 5103-71-9
has uom: ug.L-1
has table: WISE-SoE WaterQuality.AggregatedData

WISE-SoE_WaterQuality.AggregatedData - CAS_5103-74-2 - ug/L
type: Concept
notation: WISE-SoE_WaterQuality.AggregatedData - CAS_5103-74-2 - ug/L
definition: The unit of measure for 'CAS_5103-74-2' (Trans-chlordane) in WISE SoE - Water Quality: Aggregated data table is 'ug/L'
status: valid
status modified: 2019-10-03
accepted date: 2019-10-03
in scheme: Definition of correct units for the observed determinands in the given WISE SoE DD tables
has determinand: CAS 5103-74-2
has uom: ug.L-1
has table: WISE-SoE WaterQuality.AggregatedData

WISE-SoE_WaterQuality.AggregatedData - CAS_512-04-9 - ug/L
type: Concept
notation: WISE-SoE_WaterQuality.AggregatedData - CAS_512-04-9 - ug/L
definition: The unit of measure for 'CAS_512-04-9' (Diosgenin) in WISE SoE - Water Quality: Aggregated data table is 'ug/L'
status: valid
status modified: 2019-10-03
accepted date: 2019-10-03
in scheme: Definition of correct units for the observed determinands in the given WISE SoE DD tables
has determinand: CAS 512-04-9
has uom: ug.L-1
has table: WISE-SoE WaterQuality.AggregatedData

WISE-SoE_WaterQuality.AggregatedData - CAS_51207-31-9 - ug/L
type: Concept
notation: WISE-SoE_WaterQuality.AggregatedData - CAS_51207-31-9 - ug/L
definition: The unit of measure for 'CAS_51207-31-9' (2,3,7,8-T4CDF) in WISE SoE - Water Quality: Aggregated data table is 'ug/L'
status: valid
status modified: 2019-10-03
accepted date: 2019-10-03
in scheme: Definition of correct units for the observed determinands in the given WISE SoE DD tables
has determinand: CAS 51207-31-9
has uom: ug.L-1
has table: WISE-SoE WaterQuality.AggregatedData

WISE-SoE_WaterQuality.AggregatedData - CAS_51218-45-2 - ug/L
type: Concept
notation: WISE-SoE_WaterQuality.AggregatedData - CAS_51218-45-2 - ug/L
definition: The unit of measure for 'CAS_51218-45-2' (Metolachlor) in WISE SoE - Water Quality: Aggregated data table is 'ug/L'
status: valid
status modified: 2019-10-03
accepted date: 2019-10-03
in scheme: Definition of correct units for the observed determinands in the given WISE SoE DD tables
has determinand: CAS 51218-45-2
has uom: ug.L-1
has table: WISE-SoE WaterQuality.AggregatedData

WISE-SoE_WaterQuality.AggregatedData - CAS_51235-04-2 - ug/L
type: Concept
notation: WISE-SoE_WaterQuality.AggregatedData - CAS_51235-04-2 - ug/L
definition: The unit of measure for 'CAS_51235-04-2' (Hexazinone) in WISE SoE - Water Quality: Aggregated data table is 'ug/L'
status: valid
status modified: 2019-10-03
accepted date: 2019-10-03
in scheme: Definition of correct units for the observed determinands in the given WISE SoE DD tables
has determinand: CAS 51235-04-2
has uom: ug.L-1
has table: WISE-SoE WaterQuality.AggregatedData

WISE-SoE_WaterQuality.AggregatedData - CAS_51908-16-8 - ug/L
type: Concept
notation: WISE-SoE_WaterQuality.AggregatedData - CAS_51908-16-8 - ug/L
definition: The unit of measure for 'CAS_51908-16-8' (PCB 146 (2,2',3,4',5,5'-Hexachlorobiphenyl)) in WISE SoE - Water Quality: Aggregated data table is 'ug/L'
status: valid
status modified: 2019-10-03
accepted date: 2019-10-03
in scheme: Definition of correct units for the observed determinands in the given WISE SoE DD tables
has determinand: CAS 51908-16-8
has uom: ug.L-1
has table: WISE-SoE WaterQuality.AggregatedData

WISE-SoE_WaterQuality.AggregatedData - CAS_52-51-7 - ug/L
type: Concept
notation: WISE-SoE_WaterQuality.AggregatedData - CAS_52-51-7 - ug/L
definition: The unit of measure for 'CAS_52-51-7' (Bronopol) in WISE SoE - Water Quality: Aggregated data table is 'ug/L'
status: valid
status modified: 2019-10-03
accepted date: 2019-10-03
in scheme: Definition of correct units for the observed determinands in the given WISE SoE DD tables
has determinand: CAS 52-51-7
has uom: ug.L-1
has table: WISE-SoE WaterQuality.AggregatedData

WISE-SoE_WaterQuality.AggregatedData - CAS_52-68-6 - ug/L
type: Concept
notation: WISE-SoE_WaterQuality.AggregatedData - CAS_52-68-6 - ug/L
definition: The unit of measure for 'CAS_52-68-6' (Trichlorfon) in WISE SoE - Water Quality: Aggregated data table is 'ug/L'
status: valid
status modified: 2019-10-03
accepted date: 2019-10-03
in scheme: Definition of correct units for the observed determinands in the given WISE SoE DD tables
has determinand: CAS 52-68-6
has uom: ug.L-1
has table: WISE-SoE WaterQuality.AggregatedData

WISE-SoE_WaterQuality.AggregatedData - CAS_52236-30-3 - ug/L
type: Concept
notation: WISE-SoE_WaterQuality.AggregatedData - CAS_52236-30-3 - ug/L
definition: The unit of measure for 'CAS_52236-30-3' (Desamino-diketo-metribuzin) in WISE SoE - Water Quality: Aggregated data table is 'ug/L'
status: valid
status modified: 2019-10-03
accepted date: 2019-10-03
in scheme: Definition of correct units for the observed determinands in the given WISE SoE DD tables
has determinand: CAS 52236-30-3
has uom: ug.L-1
has table: WISE-SoE WaterQuality.AggregatedData

WISE-SoE_WaterQuality.AggregatedData - CAS_52315-07-8 - ug/L
type: Concept
notation: WISE-SoE_WaterQuality.AggregatedData - CAS_52315-07-8 - ug/L
definition: The unit of measure for 'CAS_52315-07-8' (Cypermethrin) in WISE SoE - Water Quality: Aggregated data table is 'ug/L'
status: valid
status modified: 2019-10-03
accepted date: 2019-10-03
in scheme: Definition of correct units for the observed determinands in the given WISE SoE DD tables
has determinand: CAS 52315-07-8
has uom: ug.L-1
has table: WISE-SoE WaterQuality.AggregatedData

WISE-SoE_WaterQuality.AggregatedData - CAS_525-66-6 - ug/L
type: Concept
notation: WISE-SoE_WaterQuality.AggregatedData - CAS_525-66-6 - ug/L
definition: The unit of measure for 'CAS_525-66-6' (Propranolol) in WISE SoE - Water Quality: Aggregated data table is 'ug/L'
status: valid
status modified: 2019-10-03
accepted date: 2019-10-03
in scheme: Definition of correct units for the observed determinands in the given WISE SoE DD tables
has determinand: CAS 525-66-6
has uom: ug.L-1
has table: WISE-SoE WaterQuality.AggregatedData

WISE-SoE_WaterQuality.AggregatedData - CAS_526-75-0 - ug/L
type: Concept
notation: WISE-SoE_WaterQuality.AggregatedData - CAS_526-75-0 - ug/L
definition: The unit of measure for 'CAS_526-75-0' (2,3-dimethyl-phenol) in WISE SoE - Water Quality: Aggregated data table is 'ug/L'
status: valid
status modified: 2019-10-03
accepted date: 2019-10-03
in scheme: Definition of correct units for the observed determinands in the given WISE SoE DD tables
has determinand: CAS 526-75-0
has uom: ug.L-1
has table: WISE-SoE WaterQuality.AggregatedData

WISE-SoE_WaterQuality.AggregatedData - CAS_52645-53-1 - ug/L
type: Concept
notation: WISE-SoE_WaterQuality.AggregatedData - CAS_52645-53-1 - ug/L
definition: The unit of measure for 'CAS_52645-53-1' (Permethrin-cis+trans) in WISE SoE - Water Quality: Aggregated data table is 'ug/L'
status: valid
status modified: 2019-10-03
accepted date: 2019-10-03
in scheme: Definition of correct units for the observed determinands in the given WISE SoE DD tables
has determinand: CAS 52645-53-1
has uom: ug.L-1
has table: WISE-SoE WaterQuality.AggregatedData

WISE-SoE_WaterQuality.AggregatedData - CAS_52663-63-5 - ug/L
type: Concept
notation: WISE-SoE_WaterQuality.AggregatedData - CAS_52663-63-5 - ug/L
definition: The unit of measure for 'CAS_52663-63-5' (PCB 151 (2,2',3,5,5',6-Hexachlorobiphenyl)) in WISE SoE - Water Quality: Aggregated data table is 'ug/L'
status: valid
status modified: 2019-10-03
accepted date: 2019-10-03
in scheme: Definition of correct units for the observed determinands in the given WISE SoE DD tables
has determinand: CAS 52663-63-5
has uom: ug.L-1
has table: WISE-SoE WaterQuality.AggregatedData

WISE-SoE_WaterQuality.AggregatedData - CAS_52663-68-0 - ug/L
type: Concept
notation: WISE-SoE_WaterQuality.AggregatedData - CAS_52663-68-0 - ug/L
definition: The unit of measure for 'CAS_52663-68-0' (PCB 187 (2,2',3,4',5,5',6-Heptachlorobiphenyl)) in WISE SoE - Water Quality: Aggregated data table is 'ug/L'
status: valid
status modified: 2019-10-03
accepted date: 2019-10-03
in scheme: Definition of correct units for the observed determinands in the given WISE SoE DD tables
has determinand: CAS 52663-68-0
has uom: ug.L-1
has table: WISE-SoE WaterQuality.AggregatedData

WISE-SoE_WaterQuality.AggregatedData - CAS_52663-69-1 - ug/L
type: Concept
notation: WISE-SoE_WaterQuality.AggregatedData - CAS_52663-69-1 - ug/L
definition: The unit of measure for 'CAS_52663-69-1' (PCB 183 (82,2',3,4,4',5',6-Heptachloro-1,1'-biphenyl)) in WISE SoE - Water Quality: Aggregated data table is 'ug/L'
status: valid
status modified: 2019-10-03
accepted date: 2019-10-03
in scheme: Definition of correct units for the observed determinands in the given WISE SoE DD tables
has determinand: CAS 52663-69-1
has uom: ug.L-1
has table: WISE-SoE WaterQuality.AggregatedData

WISE-SoE_WaterQuality.AggregatedData - CAS_52663-70-4 - ug/L
type: Concept
notation: WISE-SoE_WaterQuality.AggregatedData - CAS_52663-70-4 - ug/L
definition: The unit of measure for 'CAS_52663-70-4' (PCB 177 (3,3',4',5,6-Heptachlorobiphenyl)) in WISE SoE - Water Quality: Aggregated data table is 'ug/L'
status: valid
status modified: 2019-10-03
accepted date: 2019-10-03
in scheme: Definition of correct units for the observed determinands in the given WISE SoE DD tables
has determinand: CAS 52663-70-4
has uom: ug.L-1
has table: WISE-SoE WaterQuality.AggregatedData

WISE-SoE_WaterQuality.AggregatedData - CAS_52663-72-6 - ug/L
type: Concept
notation: WISE-SoE_WaterQuality.AggregatedData - CAS_52663-72-6 - ug/L
definition: The unit of measure for 'CAS_52663-72-6' (PCB 167 (1,2,3-trichloro-5-(2,4,5-trichlorophenyl)benzene)) in WISE SoE - Water Quality: Aggregated data table is 'ug/L'
status: valid
status modified: 2019-10-03
accepted date: 2019-10-03
in scheme: Definition of correct units for the observed determinands in the given WISE SoE DD tables
has determinand: CAS 52663-72-6
has uom: ug.L-1
has table: WISE-SoE WaterQuality.AggregatedData

WISE-SoE_WaterQuality.AggregatedData - CAS_52888-80-9 - ug/L
type: Concept
notation: WISE-SoE_WaterQuality.AggregatedData - CAS_52888-80-9 - ug/L
definition: The unit of measure for 'CAS_52888-80-9' (Prosulfocarb) in WISE SoE - Water Quality: Aggregated data table is 'ug/L'
status: valid
status modified: 2019-10-03
accepted date: 2019-10-03
in scheme: Definition of correct units for the observed determinands in the given WISE SoE DD tables
has determinand: CAS 52888-80-9
has uom: ug.L-1
has table: WISE-SoE WaterQuality.AggregatedData

WISE-SoE_WaterQuality.AggregatedData - CAS_52918-63-5 - ug/L
type: Concept
notation: WISE-SoE_WaterQuality.AggregatedData - CAS_52918-63-5 - ug/L
definition: The unit of measure for 'CAS_52918-63-5' (Deltamethrin) in WISE SoE - Water Quality: Aggregated data table is 'ug/L'
status: valid
status modified: 2019-10-03
accepted date: 2019-10-03
in scheme: Definition of correct units for the observed determinands in the given WISE SoE DD tables
has determinand: CAS 52918-63-5
has uom: ug.L-1
has table: WISE-SoE WaterQuality.AggregatedData

WISE-SoE_WaterQuality.AggregatedData - CAS_53-16-7 - ug/L
type: Concept
notation: WISE-SoE_WaterQuality.AggregatedData - CAS_53-16-7 - ug/L
definition: The unit of measure for 'CAS_53-16-7' (Estrone (E1)) in WISE SoE - Water Quality: Aggregated data table is 'ug/L'
status: valid
status modified: 2019-10-03
accepted date: 2019-10-03
in scheme: Definition of correct units for the observed determinands in the given WISE SoE DD tables
has determinand: CAS 53-16-7
has uom: ug.L-1
has table: WISE-SoE WaterQuality.AggregatedData

WISE-SoE_WaterQuality.AggregatedData - CAS_53-19-0 - ug/L
type: Concept
notation: WISE-SoE_WaterQuality.AggregatedData - CAS_53-19-0 - ug/L
definition: The unit of measure for 'CAS_53-19-0' (o,p'-DDD) in WISE SoE - Water Quality: Aggregated data table is 'ug/L'
status: valid
status modified: 2019-10-03
accepted date: 2019-10-03
in scheme: Definition of correct units for the observed determinands in the given WISE SoE DD tables
has determinand: CAS 53-19-0
has uom: ug.L-1
has table: WISE-SoE WaterQuality.AggregatedData

WISE-SoE_WaterQuality.AggregatedData - CAS_53-70-3 - ug/L
type: Concept
notation: WISE-SoE_WaterQuality.AggregatedData - CAS_53-70-3 - ug/L
definition: The unit of measure for 'CAS_53-70-3' (Dibenzo(a,h)anthracene) in WISE SoE - Water Quality: Aggregated data table is 'ug/L'
status: valid
status modified: 2019-10-03
accepted date: 2019-10-03
in scheme: Definition of correct units for the observed determinands in the given WISE SoE DD tables
has determinand: CAS 53-70-3
has uom: ug.L-1
has table: WISE-SoE WaterQuality.AggregatedData

WISE-SoE_WaterQuality.AggregatedData - CAS_53112-28-0 - ug/L
type: Concept
notation: WISE-SoE_WaterQuality.AggregatedData - CAS_53112-28-0 - ug/L
definition: The unit of measure for 'CAS_53112-28-0' (Pyrimethanil) in WISE SoE - Water Quality: Aggregated data table is 'ug/L'
status: valid
status modified: 2019-10-03
accepted date: 2019-10-03
in scheme: Definition of correct units for the observed determinands in the given WISE SoE DD tables
has determinand: CAS 53112-28-0
has uom: ug.L-1
has table: WISE-SoE WaterQuality.AggregatedData

WISE-SoE_WaterQuality.AggregatedData - CAS_534-52-1 - ug/L
type: Concept
notation: WISE-SoE_WaterQuality.AggregatedData - CAS_534-52-1 - ug/L
definition: The unit of measure for 'CAS_534-52-1' (Dinitro-o-cresol (DNOC)) in WISE SoE - Water Quality: Aggregated data table is 'ug/L'
status: valid
status modified: 2019-10-03
accepted date: 2019-10-03
in scheme: Definition of correct units for the observed determinands in the given WISE SoE DD tables
has determinand: CAS 534-52-1
has uom: ug.L-1
has table: WISE-SoE WaterQuality.AggregatedData

WISE-SoE_WaterQuality.AggregatedData - CAS_5367-28-2 - ug/L
type: Concept
notation: WISE-SoE_WaterQuality.AggregatedData - CAS_5367-28-2 - ug/L
definition: The unit of measure for 'CAS_5367-28-2' (3-chloro-6-nitrotoluene) in WISE SoE - Water Quality: Aggregated data table is 'ug/L'
status: valid
status modified: 2019-10-03
accepted date: 2019-10-03
in scheme: Definition of correct units for the observed determinands in the given WISE SoE DD tables
has determinand: CAS 5367-28-2
has uom: ug.L-1
has table: WISE-SoE WaterQuality.AggregatedData

WISE-SoE_WaterQuality.AggregatedData - CAS_540-59-0 - ug/L
type: Concept
notation: WISE-SoE_WaterQuality.AggregatedData - CAS_540-59-0 - ug/L
definition: The unit of measure for 'CAS_540-59-0' (1,2-dichloroethene) in WISE SoE - Water Quality: Aggregated data table is 'ug/L'
status: valid
status modified: 2019-10-03
accepted date: 2019-10-03
in scheme: Definition of correct units for the observed determinands in the given WISE SoE DD tables
has determinand: CAS 540-59-0
has uom: ug.L-1
has table: WISE-SoE WaterQuality.AggregatedData

WISE-SoE_WaterQuality.AggregatedData - CAS_541-73-1 - ug/L
type: Concept
notation: WISE-SoE_WaterQuality.AggregatedData - CAS_541-73-1 - ug/L
definition: The unit of measure for 'CAS_541-73-1' (1,3-dichlorobenzene) in WISE SoE - Water Quality: Aggregated data table is 'ug/L'
status: valid
status modified: 2019-10-03
accepted date: 2019-10-03
in scheme: Definition of correct units for the observed determinands in the given WISE SoE DD tables
has determinand: CAS 541-73-1
has uom: ug.L-1
has table: WISE-SoE WaterQuality.AggregatedData

WISE-SoE_WaterQuality.AggregatedData - CAS_542-75-6 - ug/L
type: Concept
notation: WISE-SoE_WaterQuality.AggregatedData - CAS_542-75-6 - ug/L
definition: The unit of measure for 'CAS_542-75-6' (1,3-dichloropropene) in WISE SoE - Water Quality: Aggregated data table is 'ug/L'
status: valid
status modified: 2019-10-03
accepted date: 2019-10-03
in scheme: Definition of correct units for the observed determinands in the given WISE SoE DD tables
has determinand: CAS 542-75-6
has uom: ug.L-1
has table: WISE-SoE WaterQuality.AggregatedData

WISE-SoE_WaterQuality.AggregatedData - CAS_5436-43-1 - ug/L
type: Concept
notation: WISE-SoE_WaterQuality.AggregatedData - CAS_5436-43-1 - ug/L
definition: The unit of measure for 'CAS_5436-43-1' (BDE 47 (2,2’,4,4’-tetrabromodiphenyl ether)) in WISE SoE - Water Quality: Aggregated data table is 'ug/L'
status: valid
status modified: 2019-10-03
accepted date: 2019-10-03
in scheme: Definition of correct units for the observed determinands in the given WISE SoE DD tables
has determinand: CAS 5436-43-1
has uom: ug.L-1
has table: WISE-SoE WaterQuality.AggregatedData

WISE-SoE_WaterQuality.AggregatedData - CAS_5466-77-3 - ug/L
type: Concept
notation: WISE-SoE_WaterQuality.AggregatedData - CAS_5466-77-3 - ug/L
definition: The unit of measure for 'CAS_5466-77-3' (2-Ethylhexyl 4-methoxycinnamate) in WISE SoE - Water Quality: Aggregated data table is 'ug/L'
status: valid
status modified: 2019-10-03
accepted date: 2019-10-03
in scheme: Definition of correct units for the observed determinands in the given WISE SoE DD tables
has determinand: CAS 5466-77-3
has uom: ug.L-1
has table: WISE-SoE WaterQuality.AggregatedData

WISE-SoE_WaterQuality.AggregatedData - CAS_54910-89-3 - ug/L
type: Concept
notation: WISE-SoE_WaterQuality.AggregatedData - CAS_54910-89-3 - ug/L
definition: The unit of measure for 'CAS_54910-89-3' (Fluoxetine) in WISE SoE - Water Quality: Aggregated data table is 'ug/L'
status: valid
status modified: 2019-10-03
accepted date: 2019-10-03
in scheme: Definition of correct units for the observed determinands in the given WISE SoE DD tables
has determinand: CAS 54910-89-3
has uom: ug.L-1
has table: WISE-SoE WaterQuality.AggregatedData

WISE-SoE_WaterQuality.AggregatedData - CAS_55-38-9 - ug/L
type: Concept
notation: WISE-SoE_WaterQuality.AggregatedData - CAS_55-38-9 - ug/L
definition: The unit of measure for 'CAS_55-38-9' (Fenthion) in WISE SoE - Water Quality: Aggregated data table is 'ug/L'
status: valid
status modified: 2019-10-03
accepted date: 2019-10-03
in scheme: Definition of correct units for the observed determinands in the given WISE SoE DD tables
has determinand: CAS 55-38-9
has uom: ug.L-1
has table: WISE-SoE WaterQuality.AggregatedData

WISE-SoE_WaterQuality.AggregatedData - CAS_55179-31-2 - ug/L
type: Concept
notation: WISE-SoE_WaterQuality.AggregatedData - CAS_55179-31-2 - ug/L
definition: The unit of measure for 'CAS_55179-31-2' (Bitertanol) in WISE SoE - Water Quality: Aggregated data table is 'ug/L'
status: valid
status modified: 2019-10-03
accepted date: 2019-10-03
in scheme: Definition of correct units for the observed determinands in the given WISE SoE DD tables
has determinand: CAS 55179-31-2
has uom: ug.L-1
has table: WISE-SoE WaterQuality.AggregatedData

WISE-SoE_WaterQuality.AggregatedData - CAS_55219-65-3 - ug/L
type: Concept
notation: WISE-SoE_WaterQuality.AggregatedData - CAS_55219-65-3 - ug/L
definition: The unit of measure for 'CAS_55219-65-3' (Triadimenol) in WISE SoE - Water Quality: Aggregated data table is 'ug/L'
status: valid
status modified: 2019-10-03
accepted date: 2019-10-03
in scheme: Definition of correct units for the observed determinands in the given WISE SoE DD tables
has determinand: CAS 55219-65-3
has uom: ug.L-1
has table: WISE-SoE WaterQuality.AggregatedData

WISE-SoE_WaterQuality.AggregatedData - CAS_55335-06-3 - ug/L
type: Concept
notation: WISE-SoE_WaterQuality.AggregatedData - CAS_55335-06-3 - ug/L
definition: The unit of measure for 'CAS_55335-06-3' (Triclopyr) in WISE SoE - Water Quality: Aggregated data table is 'ug/L'
status: valid
status modified: 2019-10-03
accepted date: 2019-10-03
in scheme: Definition of correct units for the observed determinands in the given WISE SoE DD tables
has determinand: CAS 55335-06-3
has uom: ug.L-1
has table: WISE-SoE WaterQuality.AggregatedData

WISE-SoE_WaterQuality.AggregatedData - CAS_554-00-7 - ug/L
type: Concept
notation: WISE-SoE_WaterQuality.AggregatedData - CAS_554-00-7 - ug/L
definition: The unit of measure for 'CAS_554-00-7' (2,4-dichloroaniline) in WISE SoE - Water Quality: Aggregated data table is 'ug/L'
status: valid
status modified: 2019-10-03
accepted date: 2019-10-03
in scheme: Definition of correct units for the observed determinands in the given WISE SoE DD tables
has determinand: CAS 554-00-7
has uom: ug.L-1
has table: WISE-SoE WaterQuality.AggregatedData

WISE-SoE_WaterQuality.AggregatedData - CAS_555-37-3 - ug/L
type: Concept
notation: WISE-SoE_WaterQuality.AggregatedData - CAS_555-37-3 - ug/L
definition: The unit of measure for 'CAS_555-37-3' (Neburon) in WISE SoE - Water Quality: Aggregated data table is 'ug/L'
status: valid
status modified: 2019-10-03
accepted date: 2019-10-03
in scheme: Definition of correct units for the observed determinands in the given WISE SoE DD tables
has determinand: CAS 555-37-3
has uom: ug.L-1
has table: WISE-SoE WaterQuality.AggregatedData

WISE-SoE_WaterQuality.AggregatedData - CAS_55512-33-9 - ug/L
type: Concept
notation: WISE-SoE_WaterQuality.AggregatedData - CAS_55512-33-9 - ug/L
definition: The unit of measure for 'CAS_55512-33-9' (Pyridate) in WISE SoE - Water Quality: Aggregated data table is 'ug/L'
status: valid
status modified: 2019-10-03
accepted date: 2019-10-03
in scheme: Definition of correct units for the observed determinands in the given WISE SoE DD tables
has determinand: CAS 55512-33-9
has uom: ug.L-1
has table: WISE-SoE WaterQuality.AggregatedData

WISE-SoE_WaterQuality.AggregatedData - CAS_55525-54-7 - ug/L
type: Concept
notation: WISE-SoE_WaterQuality.AggregatedData - CAS_55525-54-7 - ug/L
definition: The unit of measure for 'CAS_55525-54-7' (3,3’-(ureylenedimethylene)bis(3,5,5’- trimethylcyclohexyl) diisocyanate) in WISE SoE - Water Quality: Aggregated data table is 'ug/L'
status: valid
status modified: 2019-10-03
accepted date: 2019-10-03
in scheme: Definition of correct units for the observed determinands in the given WISE SoE DD tables
has determinand: CAS 55525-54-7
has uom: ug.L-1
has table: WISE-SoE WaterQuality.AggregatedData

WISE-SoE_WaterQuality.AggregatedData - CAS_556-88-7 - ug/L
type: Concept
notation: WISE-SoE_WaterQuality.AggregatedData - CAS_556-88-7 - ug/L
definition: The unit of measure for 'CAS_556-88-7' (Nitroguanidine) in WISE SoE - Water Quality: Aggregated data table is 'ug/L'
status: valid
status modified: 2019-10-03
accepted date: 2019-10-03
in scheme: Definition of correct units for the observed determinands in the given WISE SoE DD tables
has determinand: CAS 556-88-7
has uom: ug.L-1
has table: WISE-SoE WaterQuality.AggregatedData

WISE-SoE_WaterQuality.AggregatedData - CAS_55673-89-7 - ug/L
type: Concept
notation: WISE-SoE_WaterQuality.AggregatedData - CAS_55673-89-7 - ug/L
definition: The unit of measure for 'CAS_55673-89-7' (1,2,3,4,7,8,9-H7CDF) in WISE SoE - Water Quality: Aggregated data table is 'ug/L'
status: valid
status modified: 2019-10-03
accepted date: 2019-10-03
in scheme: Definition of correct units for the observed determinands in the given WISE SoE DD tables
has determinand: CAS 55673-89-7
has uom: ug.L-1
has table: WISE-SoE WaterQuality.AggregatedData

WISE-SoE_WaterQuality.AggregatedData - CAS_5598-13-0 - ug/L
type: Concept
notation: WISE-SoE_WaterQuality.AggregatedData - CAS_5598-13-0 - ug/L
definition: The unit of measure for 'CAS_5598-13-0' (Chlorpyrifos-methyl) in WISE SoE - Water Quality: Aggregated data table is 'ug/L'
status: valid
status modified: 2019-10-03
accepted date: 2019-10-03
in scheme: Definition of correct units for the observed determinands in the given WISE SoE DD tables
has determinand: CAS 5598-13-0
has uom: ug.L-1
has table: WISE-SoE WaterQuality.AggregatedData

WISE-SoE_WaterQuality.AggregatedData - CAS_56-23-5 - ug/L
type: Concept
notation: WISE-SoE_WaterQuality.AggregatedData - CAS_56-23-5 - ug/L
definition: The unit of measure for 'CAS_56-23-5' (Carbon tetrachloride) in WISE SoE - Water Quality: Aggregated data table is 'ug/L'
status: valid
status modified: 2019-10-03
accepted date: 2019-10-03
in scheme: Definition of correct units for the observed determinands in the given WISE SoE DD tables
has determinand: CAS 56-23-5
has uom: ug.L-1
has table: WISE-SoE WaterQuality.AggregatedData

WISE-SoE_WaterQuality.AggregatedData - CAS_56-38-2 - ug/L
type: Concept
notation: WISE-SoE_WaterQuality.AggregatedData - CAS_56-38-2 - ug/L
definition: The unit of measure for 'CAS_56-38-2' (Parathion) in WISE SoE - Water Quality: Aggregated data table is 'ug/L'
status: valid
status modified: 2019-10-03
accepted date: 2019-10-03
in scheme: Definition of correct units for the observed determinands in the given WISE SoE DD tables
has determinand: CAS 56-38-2
has uom: ug.L-1
has table: WISE-SoE WaterQuality.AggregatedData

WISE-SoE_WaterQuality.AggregatedData - CAS_56-55-3 - ug/L
type: Concept
notation: WISE-SoE_WaterQuality.AggregatedData - CAS_56-55-3 - ug/L
definition: The unit of measure for 'CAS_56-55-3' (Benzo(a)anthracene) in WISE SoE - Water Quality: Aggregated data table is 'ug/L'
status: valid
status modified: 2019-10-03
accepted date: 2019-10-03
in scheme: Definition of correct units for the observed determinands in the given WISE SoE DD tables
has determinand: CAS 56-55-3
has uom: ug.L-1
has table: WISE-SoE WaterQuality.AggregatedData

WISE-SoE_WaterQuality.AggregatedData - CAS_56-72-4 - ug/L
type: Concept
notation: WISE-SoE_WaterQuality.AggregatedData - CAS_56-72-4 - ug/L
definition: The unit of measure for 'CAS_56-72-4' (Coumaphos) in WISE SoE - Water Quality: Aggregated data table is 'ug/L'
status: valid
status modified: 2019-10-03
accepted date: 2019-10-03
in scheme: Definition of correct units for the observed determinands in the given WISE SoE DD tables
has determinand: CAS 56-72-4
has uom: ug.L-1
has table: WISE-SoE WaterQuality.AggregatedData

WISE-SoE_WaterQuality.AggregatedData - CAS_563-12-2 - ug/L
type: Concept
notation: WISE-SoE_WaterQuality.AggregatedData - CAS_563-12-2 - ug/L
definition: The unit of measure for 'CAS_563-12-2' (Ethion) in WISE SoE - Water Quality: Aggregated data table is 'ug/L'
status: valid
status modified: 2019-10-03
accepted date: 2019-10-03
in scheme: Definition of correct units for the observed determinands in the given WISE SoE DD tables
has determinand: CAS 563-12-2
has uom: ug.L-1
has table: WISE-SoE WaterQuality.AggregatedData

WISE-SoE_WaterQuality.AggregatedData - CAS_563-58-6 - ug/L
type: Concept
notation: WISE-SoE_WaterQuality.AggregatedData - CAS_563-58-6 - ug/L
definition: The unit of measure for 'CAS_563-58-6' (1,1-dichloropropene) in WISE SoE - Water Quality: Aggregated data table is 'ug/L'
status: valid
status modified: 2019-10-03
accepted date: 2019-10-03
in scheme: Definition of correct units for the observed determinands in the given WISE SoE DD tables
has determinand: CAS 563-58-6
has uom: ug.L-1
has table: WISE-SoE WaterQuality.AggregatedData

WISE-SoE_WaterQuality.AggregatedData - CAS_56507-37-0 - ug/L
type: Concept
notation: WISE-SoE_WaterQuality.AggregatedData - CAS_56507-37-0 - ug/L
definition: The unit of measure for 'CAS_56507-37-0' (Diketo-metribuzin) in WISE SoE - Water Quality: Aggregated data table is 'ug/L'
status: valid
status modified: 2019-10-03
accepted date: 2019-10-03
in scheme: Definition of correct units for the observed determinands in the given WISE SoE DD tables
has determinand: CAS 56507-37-0
has uom: ug.L-1
has table: WISE-SoE WaterQuality.AggregatedData

WISE-SoE_WaterQuality.AggregatedData - CAS_57-12-5 - ug/L
type: Concept
notation: WISE-SoE_WaterQuality.AggregatedData - CAS_57-12-5 - ug/L
definition: The unit of measure for 'CAS_57-12-5' (Free cyanide) in WISE SoE - Water Quality: Aggregated data table is 'ug/L'
status: valid
status modified: 2019-10-03
accepted date: 2019-10-03
in scheme: Definition of correct units for the observed determinands in the given WISE SoE DD tables
has determinand: CAS 57-12-5
has uom: ug.L-1
has table: WISE-SoE WaterQuality.AggregatedData

WISE-SoE_WaterQuality.AggregatedData - CAS_57-63-6 - ug/L
type: Concept
notation: WISE-SoE_WaterQuality.AggregatedData - CAS_57-63-6 - ug/L
definition: The unit of measure for 'CAS_57-63-6' (17alpha-ethinylestradiol (EE2)) in WISE SoE - Water Quality: Aggregated data table is 'ug/L'
status: valid
status modified: 2019-10-03
accepted date: 2019-10-03
in scheme: Definition of correct units for the observed determinands in the given WISE SoE DD tables
has determinand: CAS 57-63-6
has uom: ug.L-1
has table: WISE-SoE WaterQuality.AggregatedData

WISE-SoE_WaterQuality.AggregatedData - CAS_57-74-9 - ug/L
type: Concept
notation: WISE-SoE_WaterQuality.AggregatedData - CAS_57-74-9 - ug/L
definition: The unit of measure for 'CAS_57-74-9' (Chlordane) in WISE SoE - Water Quality: Aggregated data table is 'ug/L'
status: valid
status modified: 2019-10-03
accepted date: 2019-10-03
in scheme: Definition of correct units for the observed determinands in the given WISE SoE DD tables
has determinand: CAS 57-74-9
has uom: ug.L-1
has table: WISE-SoE WaterQuality.AggregatedData

WISE-SoE_WaterQuality.AggregatedData - CAS_57018-04-9 - ug/L
type: Concept
notation: WISE-SoE_WaterQuality.AggregatedData - CAS_57018-04-9 - ug/L
definition: The unit of measure for 'CAS_57018-04-9' (Tolclofos methyl) in WISE SoE - Water Quality: Aggregated data table is 'ug/L'
status: valid
status modified: 2019-10-03
accepted date: 2019-10-03
in scheme: Definition of correct units for the observed determinands in the given WISE SoE DD tables
has determinand: CAS 57018-04-9
has uom: ug.L-1
has table: WISE-SoE WaterQuality.AggregatedData

WISE-SoE_WaterQuality.AggregatedData - CAS_57117-31-4 - ug/L
type: Concept
notation: WISE-SoE_WaterQuality.AggregatedData - CAS_57117-31-4 - ug/L
definition: The unit of measure for 'CAS_57117-31-4' (2,3,4,7,8-P5CDF) in WISE SoE - Water Quality: Aggregated data table is 'ug/L'
status: valid
status modified: 2019-10-03
accepted date: 2019-10-03
in scheme: Definition of correct units for the observed determinands in the given WISE SoE DD tables
has determinand: CAS 57117-31-4
has uom: ug.L-1
has table: WISE-SoE WaterQuality.AggregatedData

WISE-SoE_WaterQuality.AggregatedData - CAS_57117-41-6 - ug/L
type: Concept
notation: WISE-SoE_WaterQuality.AggregatedData - CAS_57117-41-6 - ug/L
definition: The unit of measure for 'CAS_57117-41-6' (1,2,3,7,8-P5CDF) in WISE SoE - Water Quality: Aggregated data table is 'ug/L'
status: valid
status modified: 2019-10-03
accepted date: 2019-10-03
in scheme: Definition of correct units for the observed determinands in the given WISE SoE DD tables
has determinand: CAS 57117-41-6
has uom: ug.L-1
has table: WISE-SoE WaterQuality.AggregatedData

WISE-SoE_WaterQuality.AggregatedData - CAS_57117-44-9 - ug/L
type: Concept
notation: WISE-SoE_WaterQuality.AggregatedData - CAS_57117-44-9 - ug/L
definition: The unit of measure for 'CAS_57117-44-9' (1,2,3,6,7,8-H6CDF) in WISE SoE - Water Quality: Aggregated data table is 'ug/L'
status: valid
status modified: 2019-10-03
accepted date: 2019-10-03
in scheme: Definition of correct units for the observed determinands in the given WISE SoE DD tables
has determinand: CAS 57117-44-9
has uom: ug.L-1
has table: WISE-SoE WaterQuality.AggregatedData

WISE-SoE_WaterQuality.AggregatedData - CAS_57465-28-8 - ug/L
type: Concept
notation: WISE-SoE_WaterQuality.AggregatedData - CAS_57465-28-8 - ug/L
definition: The unit of measure for 'CAS_57465-28-8' (PCB 126 (3,3’,4,4’,5-pentachlorobiphenyl)) in WISE SoE - Water Quality: Aggregated data table is 'ug/L'
status: valid
status modified: 2019-10-03
accepted date: 2019-10-03
in scheme: Definition of correct units for the observed determinands in the given WISE SoE DD tables
has determinand: CAS 57465-28-8
has uom: ug.L-1
has table: WISE-SoE WaterQuality.AggregatedData

WISE-SoE_WaterQuality.AggregatedData - CAS_576-26-1 - ug/L
type: Concept
notation: WISE-SoE_WaterQuality.AggregatedData - CAS_576-26-1 - ug/L
definition: The unit of measure for 'CAS_576-26-1' (2,6-dimethyl-phenol) in WISE SoE - Water Quality: Aggregated data table is 'ug/L'
status: valid
status modified: 2019-10-03
accepted date: 2019-10-03
in scheme: Definition of correct units for the observed determinands in the given WISE SoE DD tables
has determinand: CAS 576-26-1
has uom: ug.L-1
has table: WISE-SoE WaterQuality.AggregatedData

WISE-SoE_WaterQuality.AggregatedData - CAS_57646-30-7 - ug/L
type: Concept
notation: WISE-SoE_WaterQuality.AggregatedData - CAS_57646-30-7 - ug/L
definition: The unit of measure for 'CAS_57646-30-7' (Furalaxyl) in WISE SoE - Water Quality: Aggregated data table is 'ug/L'
status: valid
status modified: 2019-10-03
accepted date: 2019-10-03
in scheme: Definition of correct units for the observed determinands in the given WISE SoE DD tables
has determinand: CAS 57646-30-7
has uom: ug.L-1
has table: WISE-SoE WaterQuality.AggregatedData

WISE-SoE_WaterQuality.AggregatedData - CAS_57653-85-7 - ug/L
type: Concept
notation: WISE-SoE_WaterQuality.AggregatedData - CAS_57653-85-7 - ug/L
definition: The unit of measure for 'CAS_57653-85-7' (1,2,3,6,7,8-H6CDD) in WISE SoE - Water Quality: Aggregated data table is 'ug/L'
status: valid
status modified: 2019-10-03
accepted date: 2019-10-03
in scheme: Definition of correct units for the observed determinands in the given WISE SoE DD tables
has determinand: CAS 57653-85-7
has uom: ug.L-1
has table: WISE-SoE WaterQuality.AggregatedData

WISE-SoE_WaterQuality.AggregatedData - CAS_57837-19-1 - ug/L
type: Concept
notation: WISE-SoE_WaterQuality.AggregatedData - CAS_57837-19-1 - ug/L
definition: The unit of measure for 'CAS_57837-19-1' (Metalaxyl) in WISE SoE - Water Quality: Aggregated data table is 'ug/L'
status: valid
status modified: 2019-10-03
accepted date: 2019-10-03
in scheme: Definition of correct units for the observed determinands in the given WISE SoE DD tables
has determinand: CAS 57837-19-1
has uom: ug.L-1
has table: WISE-SoE WaterQuality.AggregatedData

WISE-SoE_WaterQuality.AggregatedData - CAS_57966-95-7 - ug/L
type: Concept
notation: WISE-SoE_WaterQuality.AggregatedData - CAS_57966-95-7 - ug/L
definition: The unit of measure for 'CAS_57966-95-7' (Cymoxanil) in WISE SoE - Water Quality: Aggregated data table is 'ug/L'
status: valid
status modified: 2019-10-03
accepted date: 2019-10-03
in scheme: Definition of correct units for the observed determinands in the given WISE SoE DD tables
has determinand: CAS 57966-95-7
has uom: ug.L-1
has table: WISE-SoE WaterQuality.AggregatedData

WISE-SoE_WaterQuality.AggregatedData - CAS_58-08-2 - ug/L
type: Concept
notation: WISE-SoE_WaterQuality.AggregatedData - CAS_58-08-2 - ug/L
definition: The unit of measure for 'CAS_58-08-2' (Caffeine) in WISE SoE - Water Quality: Aggregated data table is 'ug/L'
status: valid
status modified: 2019-10-03
accepted date: 2019-10-03
in scheme: Definition of correct units for the observed determinands in the given WISE SoE DD tables
has determinand: CAS 58-08-2
has uom: ug.L-1
has table: WISE-SoE WaterQuality.AggregatedData

WISE-SoE_WaterQuality.AggregatedData - CAS_58-89-9 - ug/L
type: Concept
notation: WISE-SoE_WaterQuality.AggregatedData - CAS_58-89-9 - ug/L
definition: The unit of measure for 'CAS_58-89-9' (Gamma-HCH (Lindane)) in WISE SoE - Water Quality: Aggregated data table is 'ug/L'
status: valid
status modified: 2019-10-03
accepted date: 2019-10-03
in scheme: Definition of correct units for the observed determinands in the given WISE SoE DD tables
has determinand: CAS 58-89-9
has uom: ug.L-1
has table: WISE-SoE WaterQuality.AggregatedData

WISE-SoE_WaterQuality.AggregatedData - CAS_58-90-2 - ug/L
type: Concept
notation: WISE-SoE_WaterQuality.AggregatedData - CAS_58-90-2 - ug/L
definition: The unit of measure for 'CAS_58-90-2' (2,3,4,6-tetrachlorophenol) in WISE SoE - Water Quality: Aggregated data table is 'ug/L'
status: valid
status modified: 2019-10-03
accepted date: 2019-10-03
in scheme: Definition of correct units for the observed determinands in the given WISE SoE DD tables
has determinand: CAS 58-90-2
has uom: ug.L-1
has table: WISE-SoE WaterQuality.AggregatedData

WISE-SoE_WaterQuality.AggregatedData - CAS_59-50-7 - ug/L
type: Concept
notation: WISE-SoE_WaterQuality.AggregatedData - CAS_59-50-7 - ug/L
definition: The unit of measure for 'CAS_59-50-7' (3-methyl-4-chlorophenol) in WISE SoE - Water Quality: Aggregated data table is 'ug/L'
status: valid
status modified: 2019-10-03
accepted date: 2019-10-03
in scheme: Definition of correct units for the observed determinands in the given WISE SoE DD tables
has determinand: CAS 59-50-7
has uom: ug.L-1
has table: WISE-SoE WaterQuality.AggregatedData

WISE-SoE_WaterQuality.AggregatedData - CAS_5915-41-3 - ug/L
type: Concept
notation: WISE-SoE_WaterQuality.AggregatedData - CAS_5915-41-3 - ug/L
definition: The unit of measure for 'CAS_5915-41-3' (Terbuthylazine) in WISE SoE - Water Quality: Aggregated data table is 'ug/L'
status: valid
status modified: 2019-10-03
accepted date: 2019-10-03
in scheme: Definition of correct units for the observed determinands in the given WISE SoE DD tables
has determinand: CAS 5915-41-3
has uom: ug.L-1
has table: WISE-SoE WaterQuality.AggregatedData

WISE-SoE_WaterQuality.AggregatedData - CAS_594-20-7 - ug/L
type: Concept
notation: WISE-SoE_WaterQuality.AggregatedData - CAS_594-20-7 - ug/L
definition: The unit of measure for 'CAS_594-20-7' (2,2-dichloropropane) in WISE SoE - Water Quality: Aggregated data table is 'ug/L'
status: valid
status modified: 2019-10-03
accepted date: 2019-10-03
in scheme: Definition of correct units for the observed determinands in the given WISE SoE DD tables
has determinand: CAS 594-20-7
has uom: ug.L-1
has table: WISE-SoE WaterQuality.AggregatedData

WISE-SoE_WaterQuality.AggregatedData - CAS_59473-04-0 - ug/L
type: Concept
notation: WISE-SoE_WaterQuality.AggregatedData - CAS_59473-04-0 - ug/L
definition: The unit of measure for 'CAS_59473-04-0' (AOX) in WISE SoE - Water Quality: Aggregated data table is 'ug/L'
status: valid
status modified: 2019-10-03
accepted date: 2019-10-03
in scheme: Definition of correct units for the observed determinands in the given WISE SoE DD tables
has determinand: CAS 59473-04-0
has uom: ug.L-1
has table: WISE-SoE WaterQuality.AggregatedData

WISE-SoE_WaterQuality.AggregatedData - CAS_60-00-4 - ug/L
type: Concept
notation: WISE-SoE_WaterQuality.AggregatedData - CAS_60-00-4 - ug/L
definition: The unit of measure for 'CAS_60-00-4' (EDTA) in WISE SoE - Water Quality: Aggregated data table is 'ug/L'
status: valid
status modified: 2019-10-03
accepted date: 2019-10-03
in scheme: Definition of correct units for the observed determinands in the given WISE SoE DD tables
has determinand: CAS 60-00-4
has uom: ug.L-1
has table: WISE-SoE WaterQuality.AggregatedData

WISE-SoE_WaterQuality.AggregatedData - CAS_60-51-5 - ug/L
type: Concept
notation: WISE-SoE_WaterQuality.AggregatedData - CAS_60-51-5 - ug/L
definition: The unit of measure for 'CAS_60-51-5' (Dimethoate) in WISE SoE - Water Quality: Aggregated data table is 'ug/L'
status: valid
status modified: 2019-10-03
accepted date: 2019-10-03
in scheme: Definition of correct units for the observed determinands in the given WISE SoE DD tables
has determinand: CAS 60-51-5
has uom: ug.L-1
has table: WISE-SoE WaterQuality.AggregatedData

WISE-SoE_WaterQuality.AggregatedData - CAS_60-57-1 - ug/L
type: Concept
notation: WISE-SoE_WaterQuality.AggregatedData - CAS_60-57-1 - ug/L
definition: The unit of measure for 'CAS_60-57-1' (Dieldrin) in WISE SoE - Water Quality: Aggregated data table is 'ug/L'
status: valid
status modified: 2019-10-03
accepted date: 2019-10-03
in scheme: Definition of correct units for the observed determinands in the given WISE SoE DD tables
has determinand: CAS 60-57-1
has uom: ug.L-1
has table: WISE-SoE WaterQuality.AggregatedData

WISE-SoE_WaterQuality.AggregatedData - CAS_60145-21-3 - ug/L
type: Concept
notation: WISE-SoE_WaterQuality.AggregatedData - CAS_60145-21-3 - ug/L
definition: The unit of measure for 'CAS_60145-21-3' (PCB 103 (2,2',4,5',6-pentachlorobiphenyl)) in WISE SoE - Water Quality: Aggregated data table is 'ug/L'
status: valid
status modified: 2019-10-03
accepted date: 2019-10-03
in scheme: Definition of correct units for the observed determinands in the given WISE SoE DD tables
has determinand: CAS 60145-21-3
has uom: ug.L-1
has table: WISE-SoE WaterQuality.AggregatedData

WISE-SoE_WaterQuality.AggregatedData - CAS_60168-88-9 - ug/L
type: Concept
notation: WISE-SoE_WaterQuality.AggregatedData - CAS_60168-88-9 - ug/L
definition: The unit of measure for 'CAS_60168-88-9' (Fenarimol) in WISE SoE - Water Quality: Aggregated data table is 'ug/L'
status: valid
status modified: 2019-10-03
accepted date: 2019-10-03
in scheme: Definition of correct units for the observed determinands in the given WISE SoE DD tables
has determinand: CAS 60168-88-9
has uom: ug.L-1
has table: WISE-SoE WaterQuality.AggregatedData

WISE-SoE_WaterQuality.AggregatedData - CAS_60207-90-1 - ug/L
type: Concept
notation: WISE-SoE_WaterQuality.AggregatedData - CAS_60207-90-1 - ug/L
definition: The unit of measure for 'CAS_60207-90-1' (Propiconazole) in WISE SoE - Water Quality: Aggregated data table is 'ug/L'
status: valid
status modified: 2019-10-03
accepted date: 2019-10-03
in scheme: Definition of correct units for the observed determinands in the given WISE SoE DD tables
has determinand: CAS 60207-90-1
has uom: ug.L-1
has table: WISE-SoE WaterQuality.AggregatedData

WISE-SoE_WaterQuality.AggregatedData - CAS_603-35-0 - ug/L
type: Concept
notation: WISE-SoE_WaterQuality.AggregatedData - CAS_603-35-0 - ug/L
definition: The unit of measure for 'CAS_603-35-0' (Triphenyl phosphine) in WISE SoE - Water Quality: Aggregated data table is 'ug/L'
status: valid
status modified: 2019-10-03
accepted date: 2019-10-03
in scheme: Definition of correct units for the observed determinands in the given WISE SoE DD tables
has determinand: CAS 603-35-0
has uom: ug.L-1
has table: WISE-SoE WaterQuality.AggregatedData

WISE-SoE_WaterQuality.AggregatedData - CAS_60348-60-9 - ug/L
type: Concept
notation: WISE-SoE_WaterQuality.AggregatedData - CAS_60348-60-9 - ug/L
definition: The unit of measure for 'CAS_60348-60-9' (BDE 99 (2,2’,4,4’,5-pentabromodiphenyl ether)) in WISE SoE - Water Quality: Aggregated data table is 'ug/L'
status: valid
status modified: 2019-10-03
accepted date: 2019-10-03
in scheme: Definition of correct units for the observed determinands in the given WISE SoE DD tables
has determinand: CAS 60348-60-9
has uom: ug.L-1
has table: WISE-SoE WaterQuality.AggregatedData

WISE-SoE_WaterQuality.AggregatedData - CAS_608-27-5 - ug/L
type: Concept
notation: WISE-SoE_WaterQuality.AggregatedData - CAS_608-27-5 - ug/L
definition: The unit of measure for 'CAS_608-27-5' (2,3-Dichloroaniline) in WISE SoE - Water Quality: Aggregated data table is 'ug/L'
status: valid
status modified: 2019-10-03
accepted date: 2019-10-03
in scheme: Definition of correct units for the observed determinands in the given WISE SoE DD tables
has determinand: CAS 608-27-5
has uom: ug.L-1
has table: WISE-SoE WaterQuality.AggregatedData

WISE-SoE_WaterQuality.AggregatedData - CAS_608-31-1 - ug/L
type: Concept
notation: WISE-SoE_WaterQuality.AggregatedData - CAS_608-31-1 - ug/L
definition: The unit of measure for 'CAS_608-31-1' (2,6-Dichloroaniline) in WISE SoE - Water Quality: Aggregated data table is 'ug/L'
status: valid
status modified: 2019-10-03
accepted date: 2019-10-03
in scheme: Definition of correct units for the observed determinands in the given WISE SoE DD tables
has determinand: CAS 608-31-1
has uom: ug.L-1
has table: WISE-SoE WaterQuality.AggregatedData

WISE-SoE_WaterQuality.AggregatedData - CAS_608-73-1 - ug/L
type: Concept
notation: WISE-SoE_WaterQuality.AggregatedData - CAS_608-73-1 - ug/L
definition: The unit of measure for 'CAS_608-73-1' (Hexachlorocyclohexane) in WISE SoE - Water Quality: Aggregated data table is 'ug/L'
status: valid
status modified: 2019-10-03
accepted date: 2019-10-03
in scheme: Definition of correct units for the observed determinands in the given WISE SoE DD tables
has determinand: CAS 608-73-1
has uom: ug.L-1
has table: WISE-SoE WaterQuality.AggregatedData

WISE-SoE_WaterQuality.AggregatedData - CAS_608-93-5 - ug/L
type: Concept
notation: WISE-SoE_WaterQuality.AggregatedData - CAS_608-93-5 - ug/L
definition: The unit of measure for 'CAS_608-93-5' (Pentachlorobenzene) in WISE SoE - Water Quality: Aggregated data table is 'ug/L'
status: valid
status modified: 2019-10-03
accepted date: 2019-10-03
in scheme: Definition of correct units for the observed determinands in the given WISE SoE DD tables
has determinand: CAS 608-93-5
has uom: ug.L-1
has table: WISE-SoE WaterQuality.AggregatedData

WISE-SoE_WaterQuality.AggregatedData - CAS_60851-34-5 - ug/L
type: Concept
notation: WISE-SoE_WaterQuality.AggregatedData - CAS_60851-34-5 - ug/L
definition: The unit of measure for 'CAS_60851-34-5' (2,3,4,6,7,8-H6CDF) in WISE SoE - Water Quality: Aggregated data table is 'ug/L'
status: valid
status modified: 2019-10-03
accepted date: 2019-10-03
in scheme: Definition of correct units for the observed determinands in the given WISE SoE DD tables
has determinand: CAS 60851-34-5
has uom: ug.L-1
has table: WISE-SoE WaterQuality.AggregatedData

WISE-SoE_WaterQuality.AggregatedData - CAS_609-19-8 - ug/L
type: Concept
notation: WISE-SoE_WaterQuality.AggregatedData - CAS_609-19-8 - ug/L
definition: The unit of measure for 'CAS_609-19-8' (3,4,5-Trichlorophenol) in WISE SoE - Water Quality: Aggregated data table is 'ug/L'
status: valid
status modified: 2019-10-03
accepted date: 2019-10-03
in scheme: Definition of correct units for the observed determinands in the given WISE SoE DD tables
has determinand: CAS 609-19-8
has uom: ug.L-1
has table: WISE-SoE WaterQuality.AggregatedData

WISE-SoE_WaterQuality.AggregatedData - CAS_6108-10-7 - ug/L
type: Concept
notation: WISE-SoE_WaterQuality.AggregatedData - CAS_6108-10-7 - ug/L
definition: The unit of measure for 'CAS_6108-10-7' (Epsilon-HCH) in WISE SoE - Water Quality: Aggregated data table is 'ug/L'
status: valid
status modified: 2019-10-03
accepted date: 2019-10-03
in scheme: Definition of correct units for the observed determinands in the given WISE SoE DD tables
has determinand: CAS 6108-10-7
has uom: ug.L-1
has table: WISE-SoE WaterQuality.AggregatedData

WISE-SoE_WaterQuality.AggregatedData - CAS_611-06-3 - ug/L
type: Concept
notation: WISE-SoE_WaterQuality.AggregatedData - CAS_611-06-3 - ug/L
definition: The unit of measure for 'CAS_611-06-3' (2,4-Dichloro-1-nitrobenzene) in WISE SoE - Water Quality: Aggregated data table is 'ug/L'
status: valid
status modified: 2019-10-03
accepted date: 2019-10-03
in scheme: Definition of correct units for the observed determinands in the given WISE SoE DD tables
has determinand: CAS 611-06-3
has uom: ug.L-1
has table: WISE-SoE WaterQuality.AggregatedData

WISE-SoE_WaterQuality.AggregatedData - CAS_615-65-6 - ug/L
type: Concept
notation: WISE-SoE_WaterQuality.AggregatedData - CAS_615-65-6 - ug/L
definition: The unit of measure for 'CAS_615-65-6' (2-Chloro-4-methylaniline) in WISE SoE - Water Quality: Aggregated data table is 'ug/L'
status: valid
status modified: 2019-10-03
accepted date: 2019-10-03
in scheme: Definition of correct units for the observed determinands in the given WISE SoE DD tables
has determinand: CAS 615-65-6
has uom: ug.L-1
has table: WISE-SoE WaterQuality.AggregatedData

WISE-SoE_WaterQuality.AggregatedData - CAS_6164-98-3 - ug/L
type: Concept
notation: WISE-SoE_WaterQuality.AggregatedData - CAS_6164-98-3 - ug/L
definition: The unit of measure for 'CAS_6164-98-3' (Chlordimeform) in WISE SoE - Water Quality: Aggregated data table is 'ug/L'
status: valid
status modified: 2019-10-03
accepted date: 2019-10-03
in scheme: Definition of correct units for the observed determinands in the given WISE SoE DD tables
has determinand: CAS 6164-98-3
has uom: ug.L-1
has table: WISE-SoE WaterQuality.AggregatedData

WISE-SoE_WaterQuality.AggregatedData - CAS_6190-65-4 - ug/L
type: Concept
notation: WISE-SoE_WaterQuality.AggregatedData - CAS_6190-65-4 - ug/L
definition: The unit of measure for 'CAS_6190-65-4' (Desethylatrazine) in WISE SoE - Water Quality: Aggregated data table is 'ug/L'
status: valid
status modified: 2019-10-03
accepted date: 2019-10-03
in scheme: Definition of correct units for the observed determinands in the given WISE SoE DD tables
has determinand: CAS 6190-65-4
has uom: ug.L-1
has table: WISE-SoE WaterQuality.AggregatedData

WISE-SoE_WaterQuality.AggregatedData - CAS_62-53-3 - ug/L
type: Concept
notation: WISE-SoE_WaterQuality.AggregatedData - CAS_62-53-3 - ug/L
definition: The unit of measure for 'CAS_62-53-3' (Aniline) in WISE SoE - Water Quality: Aggregated data table is 'ug/L'
status: valid
status modified: 2019-10-03
accepted date: 2019-10-03
in scheme: Definition of correct units for the observed determinands in the given WISE SoE DD tables
has determinand: CAS 62-53-3
has uom: ug.L-1
has table: WISE-SoE WaterQuality.AggregatedData

WISE-SoE_WaterQuality.AggregatedData - CAS_62-73-7 - ug/L
type: Concept
notation: WISE-SoE_WaterQuality.AggregatedData - CAS_62-73-7 - ug/L
definition: The unit of measure for 'CAS_62-73-7' (Dichlorvos) in WISE SoE - Water Quality: Aggregated data table is 'ug/L'
status: valid
status modified: 2019-10-03
accepted date: 2019-10-03
in scheme: Definition of correct units for the observed determinands in the given WISE SoE DD tables
has determinand: CAS 62-73-7
has uom: ug.L-1
has table: WISE-SoE WaterQuality.AggregatedData

WISE-SoE_WaterQuality.AggregatedData - CAS_626-43-7 - ug/L
type: Concept
notation: WISE-SoE_WaterQuality.AggregatedData - CAS_626-43-7 - ug/L
definition: The unit of measure for 'CAS_626-43-7' (3,5-Dichloroaniline) in WISE SoE - Water Quality: Aggregated data table is 'ug/L'
status: valid
status modified: 2019-10-03
accepted date: 2019-10-03
in scheme: Definition of correct units for the observed determinands in the given WISE SoE DD tables
has determinand: CAS 626-43-7
has uom: ug.L-1
has table: WISE-SoE WaterQuality.AggregatedData

WISE-SoE_WaterQuality.AggregatedData - CAS_63-25-2 - ug/L
type: Concept
notation: WISE-SoE_WaterQuality.AggregatedData - CAS_63-25-2 - ug/L
definition: The unit of measure for 'CAS_63-25-2' (Carbaryl) in WISE SoE - Water Quality: Aggregated data table is 'ug/L'
status: valid
status modified: 2019-10-03
accepted date: 2019-10-03
in scheme: Definition of correct units for the observed determinands in the given WISE SoE DD tables
has determinand: CAS 63-25-2
has uom: ug.L-1
has table: WISE-SoE WaterQuality.AggregatedData

WISE-SoE_WaterQuality.AggregatedData - CAS_630-20-6 - ug/L
type: Concept
notation: WISE-SoE_WaterQuality.AggregatedData - CAS_630-20-6 - ug/L
definition: The unit of measure for 'CAS_630-20-6' (1,1,1,2-tetrachloroethane) in WISE SoE - Water Quality: Aggregated data table is 'ug/L'
status: valid
status modified: 2019-10-03
accepted date: 2019-10-03
in scheme: Definition of correct units for the observed determinands in the given WISE SoE DD tables
has determinand: CAS 630-20-6
has uom: ug.L-1
has table: WISE-SoE WaterQuality.AggregatedData

WISE-SoE_WaterQuality.AggregatedData - CAS_6339-19-1 - ug/L
type: Concept
notation: WISE-SoE_WaterQuality.AggregatedData - CAS_6339-19-1 - ug/L
definition: The unit of measure for 'CAS_6339-19-1' (Chloridazon desphenyl) in WISE SoE - Water Quality: Aggregated data table is 'ug/L'
status: valid
status modified: 2019-10-03
accepted date: 2019-10-03
in scheme: Definition of correct units for the observed determinands in the given WISE SoE DD tables
has determinand: CAS 6339-19-1
has uom: ug.L-1
has table: WISE-SoE WaterQuality.AggregatedData

WISE-SoE_WaterQuality.AggregatedData - CAS_64743-03-9 - ug/L
type: Concept
notation: WISE-SoE_WaterQuality.AggregatedData - CAS_64743-03-9 - ug/L
definition: The unit of measure for 'CAS_64743-03-9' (Phenols) in WISE SoE - Water Quality: Aggregated data table is 'ug/L'
status: valid
status modified: 2019-10-03
accepted date: 2019-10-03
in scheme: Definition of correct units for the observed determinands in the given WISE SoE DD tables
has determinand: CAS 64743-03-9
has uom: ug.L-1
has table: WISE-SoE WaterQuality.AggregatedData

WISE-SoE_WaterQuality.AggregatedData - CAS_64902-72-3 - ug/L
type: Concept
notation: WISE-SoE_WaterQuality.AggregatedData - CAS_64902-72-3 - ug/L
definition: The unit of measure for 'CAS_64902-72-3' (Chlorsulfuron) in WISE SoE - Water Quality: Aggregated data table is 'ug/L'
status: valid
status modified: 2019-10-03
accepted date: 2019-10-03
in scheme: Definition of correct units for the observed determinands in the given WISE SoE DD tables
has determinand: CAS 64902-72-3
has uom: ug.L-1
has table: WISE-SoE WaterQuality.AggregatedData

WISE-SoE_WaterQuality.AggregatedData - CAS_65510-44-3 - ug/L
type: Concept
notation: WISE-SoE_WaterQuality.AggregatedData - CAS_65510-44-3 - ug/L
definition: The unit of measure for 'CAS_65510-44-3' (PCB 123 (1,2,3-trichloro-5-(2,4-dichlorophenyl)benzene)) in WISE SoE - Water Quality: Aggregated data table is 'ug/L'
status: valid
status modified: 2019-10-03
accepted date: 2019-10-03
in scheme: Definition of correct units for the observed determinands in the given WISE SoE DD tables
has determinand: CAS 65510-44-3
has uom: ug.L-1
has table: WISE-SoE WaterQuality.AggregatedData

WISE-SoE_WaterQuality.AggregatedData - CAS_66215-27-8 - ug/L
type: Concept
notation: WISE-SoE_WaterQuality.AggregatedData - CAS_66215-27-8 - ug/L
definition: The unit of measure for 'CAS_66215-27-8' (Cyromazine) in WISE SoE - Water Quality: Aggregated data table is 'ug/L'
status: valid
status modified: 2019-10-03
accepted date: 2019-10-03
in scheme: Definition of correct units for the observed determinands in the given WISE SoE DD tables
has determinand: CAS 66215-27-8
has uom: ug.L-1
has table: WISE-SoE WaterQuality.AggregatedData

WISE-SoE_WaterQuality.AggregatedData - CAS_66246-88-6 - ug/L
type: Concept
notation: WISE-SoE_WaterQuality.AggregatedData - CAS_66246-88-6 - ug/L
definition: The unit of measure for 'CAS_66246-88-6' (Penconazole) in WISE SoE - Water Quality: Aggregated data table is 'ug/L'
status: valid
status modified: 2019-10-03
accepted date: 2019-10-03
in scheme: Definition of correct units for the observed determinands in the given WISE SoE DD tables
has determinand: CAS 66246-88-6
has uom: ug.L-1
has table: WISE-SoE WaterQuality.AggregatedData

WISE-SoE_WaterQuality.AggregatedData - CAS_66753-07-9 - ug/L
type: Concept
notation: WISE-SoE_WaterQuality.AggregatedData - CAS_66753-07-9 - ug/L
definition: The unit of measure for 'CAS_66753-07-9' (Hydroxyterbuthylazine) in WISE SoE - Water Quality: Aggregated data table is 'ug/L'
status: valid
status modified: 2019-10-03
accepted date: 2019-10-03
in scheme: Definition of correct units for the observed determinands in the given WISE SoE DD tables
has determinand: CAS 66753-07-9
has uom: ug.L-1
has table: WISE-SoE WaterQuality.AggregatedData

WISE-SoE_WaterQuality.AggregatedData - CAS_67-66-3 - ug/L
type: Concept
notation: WISE-SoE_WaterQuality.AggregatedData - CAS_67-66-3 - ug/L
definition: The unit of measure for 'CAS_67-66-3' (Trichloromethane) in WISE SoE - Water Quality: Aggregated data table is 'ug/L'
status: valid
status modified: 2019-10-03
accepted date: 2019-10-03
in scheme: Definition of correct units for the observed determinands in the given WISE SoE DD tables
has determinand: CAS 67-66-3
has uom: ug.L-1
has table: WISE-SoE WaterQuality.AggregatedData

WISE-SoE_WaterQuality.AggregatedData - CAS_67-72-1 - ug/L
type: Concept
notation: WISE-SoE_WaterQuality.AggregatedData - CAS_67-72-1 - ug/L
definition: The unit of measure for 'CAS_67-72-1' (Hexachloroethane) in WISE SoE - Water Quality: Aggregated data table is 'ug/L'
status: valid
status modified: 2019-10-03
accepted date: 2019-10-03
in scheme: Definition of correct units for the observed determinands in the given WISE SoE DD tables
has determinand: CAS 67-72-1
has uom: ug.L-1
has table: WISE-SoE WaterQuality.AggregatedData

WISE-SoE_WaterQuality.AggregatedData - CAS_67129-08-2 - ug/L
type: Concept
notation: WISE-SoE_WaterQuality.AggregatedData - CAS_67129-08-2 - ug/L
definition: The unit of measure for 'CAS_67129-08-2' (Metazachlor) in WISE SoE - Water Quality: Aggregated data table is 'ug/L'
status: valid
status modified: 2019-10-03
accepted date: 2019-10-03
in scheme: Definition of correct units for the observed determinands in the given WISE SoE DD tables
has determinand: CAS 67129-08-2
has uom: ug.L-1
has table: WISE-SoE WaterQuality.AggregatedData

WISE-SoE_WaterQuality.AggregatedData - CAS_67562-39-4 - ug/L
type: Concept
notation: WISE-SoE_WaterQuality.AggregatedData - CAS_67562-39-4 - ug/L
definition: The unit of measure for 'CAS_67562-39-4' (1,2,3,4,6,7,8-H7CDF) in WISE SoE - Water Quality: Aggregated data table is 'ug/L'
status: valid
status modified: 2019-10-03
accepted date: 2019-10-03
in scheme: Definition of correct units for the observed determinands in the given WISE SoE DD tables
has determinand: CAS 67562-39-4
has uom: ug.L-1
has table: WISE-SoE WaterQuality.AggregatedData

WISE-SoE_WaterQuality.AggregatedData - CAS_67564-91-4 - ug/L
type: Concept
notation: WISE-SoE_WaterQuality.AggregatedData - CAS_67564-91-4 - ug/L
definition: The unit of measure for 'CAS_67564-91-4' (Fenpropimorph) in WISE SoE - Water Quality: Aggregated data table is 'ug/L'
status: valid
status modified: 2019-10-03
accepted date: 2019-10-03
in scheme: Definition of correct units for the observed determinands in the given WISE SoE DD tables
has determinand: CAS 67564-91-4
has uom: ug.L-1
has table: WISE-SoE WaterQuality.AggregatedData

WISE-SoE_WaterQuality.AggregatedData - CAS_67747-09-5 - ug/L
type: Concept
notation: WISE-SoE_WaterQuality.AggregatedData - CAS_67747-09-5 - ug/L
definition: The unit of measure for 'CAS_67747-09-5' (Prochloraz) in WISE SoE - Water Quality: Aggregated data table is 'ug/L'
status: valid
status modified: 2019-10-03
accepted date: 2019-10-03
in scheme: Definition of correct units for the observed determinands in the given WISE SoE DD tables
has determinand: CAS 67747-09-5
has uom: ug.L-1
has table: WISE-SoE WaterQuality.AggregatedData

WISE-SoE_WaterQuality.AggregatedData - CAS_68631-49-2 - ug/L
type: Concept
notation: WISE-SoE_WaterQuality.AggregatedData - CAS_68631-49-2 - ug/L
definition: The unit of measure for 'CAS_68631-49-2' (BDE 153 (2,2’,4,4’,5,5’-hexabromodiphenyl ether)) in WISE SoE - Water Quality: Aggregated data table is 'ug/L'
status: valid
status modified: 2019-10-03
accepted date: 2019-10-03
in scheme: Definition of correct units for the observed determinands in the given WISE SoE DD tables
has determinand: CAS 68631-49-2
has uom: ug.L-1
has table: WISE-SoE WaterQuality.AggregatedData

WISE-SoE_WaterQuality.AggregatedData - CAS_68928-80-3 - ug/L
type: Concept
notation: WISE-SoE_WaterQuality.AggregatedData - CAS_68928-80-3 - ug/L
definition: The unit of measure for 'CAS_68928-80-3' (BDE 183 (Heptabromodiphenylether)) in WISE SoE - Water Quality: Aggregated data table is 'ug/L'
status: valid
status modified: 2019-10-03
accepted date: 2019-10-03
in scheme: Definition of correct units for the observed determinands in the given WISE SoE DD tables
has determinand: CAS 68928-80-3
has uom: ug.L-1
has table: WISE-SoE WaterQuality.AggregatedData

WISE-SoE_WaterQuality.AggregatedData - CAS_69327-76-0 - ug/L
type: Concept
notation: WISE-SoE_WaterQuality.AggregatedData - CAS_69327-76-0 - ug/L
definition: The unit of measure for 'CAS_69327-76-0' (Buprofezin) in WISE SoE - Water Quality: Aggregated data table is 'ug/L'
status: valid
status modified: 2019-10-03
accepted date: 2019-10-03
in scheme: Definition of correct units for the observed determinands in the given WISE SoE DD tables
has determinand: CAS 69327-76-0
has uom: ug.L-1
has table: WISE-SoE WaterQuality.AggregatedData

WISE-SoE_WaterQuality.AggregatedData - CAS_69377-81-7 - ug/L
type: Concept
notation: WISE-SoE_WaterQuality.AggregatedData - CAS_69377-81-7 - ug/L
definition: The unit of measure for 'CAS_69377-81-7' (Fluroxypyr) in WISE SoE - Water Quality: Aggregated data table is 'ug/L'
status: valid
status modified: 2019-10-03
accepted date: 2019-10-03
in scheme: Definition of correct units for the observed determinands in the given WISE SoE DD tables
has determinand: CAS 69377-81-7
has uom: ug.L-1
has table: WISE-SoE WaterQuality.AggregatedData

WISE-SoE_WaterQuality.AggregatedData - CAS_69782-90-7 - ug/L
type: Concept
notation: WISE-SoE_WaterQuality.AggregatedData - CAS_69782-90-7 - ug/L
definition: The unit of measure for 'CAS_69782-90-7' (PCB 157 (2,3,3’,4,4’,5’-hexachlorobiphenyl)) in WISE SoE - Water Quality: Aggregated data table is 'ug/L'
status: valid
status modified: 2019-10-03
accepted date: 2019-10-03
in scheme: Definition of correct units for the observed determinands in the given WISE SoE DD tables
has determinand: CAS 69782-90-7
has uom: ug.L-1
has table: WISE-SoE WaterQuality.AggregatedData

WISE-SoE_WaterQuality.AggregatedData - CAS_7012-37-5 - ug/L
type: Concept
notation: WISE-SoE_WaterQuality.AggregatedData - CAS_7012-37-5 - ug/L
definition: The unit of measure for 'CAS_7012-37-5' (PCB 28 (2,4,4’-trichlorobiphenyl)) in WISE SoE - Water Quality: Aggregated data table is 'ug/L'
status: valid
status modified: 2019-10-03
accepted date: 2019-10-03
in scheme: Definition of correct units for the observed determinands in the given WISE SoE DD tables
has determinand: CAS 7012-37-5
has uom: ug.L-1
has table: WISE-SoE WaterQuality.AggregatedData

WISE-SoE_WaterQuality.AggregatedData - CAS_70124-77-5 - ug/L
type: Concept
notation: WISE-SoE_WaterQuality.AggregatedData - CAS_70124-77-5 - ug/L
definition: The unit of measure for 'CAS_70124-77-5' (Flucythrinate) in WISE SoE - Water Quality: Aggregated data table is 'ug/L'
status: valid
status modified: 2019-10-03
accepted date: 2019-10-03
in scheme: Definition of correct units for the observed determinands in the given WISE SoE DD tables
has determinand: CAS 70124-77-5
has uom: ug.L-1
has table: WISE-SoE WaterQuality.AggregatedData

WISE-SoE_WaterQuality.AggregatedData - CAS_70362-41-3 - ug/L
type: Concept
notation: WISE-SoE_WaterQuality.AggregatedData - CAS_70362-41-3 - ug/L
definition: The unit of measure for 'CAS_70362-41-3' (PCB 106 (2,3,3',4,5'-pentachlorobiphenyl)) in WISE SoE - Water Quality: Aggregated data table is 'ug/L'
status: valid
status modified: 2019-10-03
accepted date: 2019-10-03
in scheme: Definition of correct units for the observed determinands in the given WISE SoE DD tables
has determinand: CAS 70362-41-3
has uom: ug.L-1
has table: WISE-SoE WaterQuality.AggregatedData

WISE-SoE_WaterQuality.AggregatedData - CAS_70362-50-4 - ug/L
type: Concept
notation: WISE-SoE_WaterQuality.AggregatedData - CAS_70362-50-4 - ug/L
definition: The unit of measure for 'CAS_70362-50-4' (PCB 81 (3,4,4',5-tetrachlorobiphenyl)) in WISE SoE - Water Quality: Aggregated data table is 'ug/L'
status: valid
status modified: 2019-10-03
accepted date: 2019-10-03
in scheme: Definition of correct units for the observed determinands in the given WISE SoE DD tables
has determinand: CAS 70362-50-4
has uom: ug.L-1
has table: WISE-SoE WaterQuality.AggregatedData

WISE-SoE_WaterQuality.AggregatedData - CAS_70630-17-0 - ug/L
type: Concept
notation: WISE-SoE_WaterQuality.AggregatedData - CAS_70630-17-0 - ug/L
definition: The unit of measure for 'CAS_70630-17-0' (Metalaxyl-M) in WISE SoE - Water Quality: Aggregated data table is 'ug/L'
status: valid
status modified: 2019-10-03
accepted date: 2019-10-03
in scheme: Definition of correct units for the observed determinands in the given WISE SoE DD tables
has determinand: CAS 70630-17-0
has uom: ug.L-1
has table: WISE-SoE WaterQuality.AggregatedData

WISE-SoE_WaterQuality.AggregatedData - CAS_70648-26-9 - ug/L
type: Concept
notation: WISE-SoE_WaterQuality.AggregatedData - CAS_70648-26-9 - ug/L
definition: The unit of measure for 'CAS_70648-26-9' (1,2,3,4,7,8-H6CDF) in WISE SoE - Water Quality: Aggregated data table is 'ug/L'
status: valid
status modified: 2019-10-03
accepted date: 2019-10-03
in scheme: Definition of correct units for the observed determinands in the given WISE SoE DD tables
has determinand: CAS 70648-26-9
has uom: ug.L-1
has table: WISE-SoE WaterQuality.AggregatedData

WISE-SoE_WaterQuality.AggregatedData - CAS_70776-03-3 - ug/L
type: Concept
notation: WISE-SoE_WaterQuality.AggregatedData - CAS_70776-03-3 - ug/L
definition: The unit of measure for 'CAS_70776-03-3' (Naphthalene, chloro derivatives) in WISE SoE - Water Quality: Aggregated data table is 'ug/L'
status: valid
status modified: 2019-10-03
accepted date: 2019-10-03
in scheme: Definition of correct units for the observed determinands in the given WISE SoE DD tables
has determinand: CAS 70776-03-3
has uom: ug.L-1
has table: WISE-SoE WaterQuality.AggregatedData

WISE-SoE_WaterQuality.AggregatedData - CAS_7085-19-0 - ug/L
type: Concept
notation: WISE-SoE_WaterQuality.AggregatedData - CAS_7085-19-0 - ug/L
definition: The unit of measure for 'CAS_7085-19-0' (Mecoprop) in WISE SoE - Water Quality: Aggregated data table is 'ug/L'
status: valid
status modified: 2019-10-03
accepted date: 2019-10-03
in scheme: Definition of correct units for the observed determinands in the given WISE SoE DD tables
has determinand: CAS 7085-19-0
has uom: ug.L-1
has table: WISE-SoE WaterQuality.AggregatedData

WISE-SoE_WaterQuality.AggregatedData - CAS_709-98-8 - ug/L
type: Concept
notation: WISE-SoE_WaterQuality.AggregatedData - CAS_709-98-8 - ug/L
definition: The unit of measure for 'CAS_709-98-8' (Propanil) in WISE SoE - Water Quality: Aggregated data table is 'ug/L'
status: valid
status modified: 2019-10-03
accepted date: 2019-10-03
in scheme: Definition of correct units for the observed determinands in the given WISE SoE DD tables
has determinand: CAS 709-98-8
has uom: ug.L-1
has table: WISE-SoE WaterQuality.AggregatedData

WISE-SoE_WaterQuality.AggregatedData - CAS_71-43-2 - ug/L
type: Concept
notation: WISE-SoE_WaterQuality.AggregatedData - CAS_71-43-2 - ug/L
definition: The unit of measure for 'CAS_71-43-2' (Benzene) in WISE SoE - Water Quality: Aggregated data table is 'ug/L'
status: valid
status modified: 2019-10-03
accepted date: 2019-10-03
in scheme: Definition of correct units for the observed determinands in the given WISE SoE DD tables
has determinand: CAS 71-43-2
has uom: ug.L-1
has table: WISE-SoE WaterQuality.AggregatedData

WISE-SoE_WaterQuality.AggregatedData - CAS_71-52-3 - mg/L
type: Concept
notation: WISE-SoE_WaterQuality.AggregatedData - CAS_71-52-3 - mg/L
definition: The unit of measure for 'CAS_71-52-3' (Hydrogen Carbonate (Bicarbonate) HCO3) in WISE SoE - Water Quality: Aggregated data table is 'mg/L'
status: valid
status modified: 2019-10-03
accepted date: 2019-10-03
in scheme: Definition of correct units for the observed determinands in the given WISE SoE DD tables
has determinand: CAS 71-52-3
has uom: mg.L-1
has table: WISE-SoE WaterQuality.AggregatedData

WISE-SoE_WaterQuality.AggregatedData - CAS_71-55-6 - ug/L
type: Concept
notation: WISE-SoE_WaterQuality.AggregatedData - CAS_71-55-6 - ug/L
definition: The unit of measure for 'CAS_71-55-6' (1,1,1-trichloroethane) in WISE SoE - Water Quality: Aggregated data table is 'ug/L'
status: valid
status modified: 2019-10-03
accepted date: 2019-10-03
in scheme: Definition of correct units for the observed determinands in the given WISE SoE DD tables
has determinand: CAS 71-55-6
has uom: ug.L-1
has table: WISE-SoE WaterQuality.AggregatedData

WISE-SoE_WaterQuality.AggregatedData - CAS_71626-11-4 - ug/L
type: Concept
notation: WISE-SoE_WaterQuality.AggregatedData - CAS_71626-11-4 - ug/L
definition: The unit of measure for 'CAS_71626-11-4' (Benalaxyl) in WISE SoE - Water Quality: Aggregated data table is 'ug/L'
status: valid
status modified: 2019-10-03
accepted date: 2019-10-03
in scheme: Definition of correct units for the observed determinands in the given WISE SoE DD tables
has determinand: CAS 71626-11-4
has uom: ug.L-1
has table: WISE-SoE WaterQuality.AggregatedData

WISE-SoE_WaterQuality.AggregatedData - CAS_72-20-8 - ug/L
type: Concept
notation: WISE-SoE_WaterQuality.AggregatedData - CAS_72-20-8 - ug/L
definition: The unit of measure for 'CAS_72-20-8' (Endrin) in WISE SoE - Water Quality: Aggregated data table is 'ug/L'
status: valid
status modified: 2019-10-03
accepted date: 2019-10-03
in scheme: Definition of correct units for the observed determinands in the given WISE SoE DD tables
has determinand: CAS 72-20-8
has uom: ug.L-1
has table: WISE-SoE WaterQuality.AggregatedData

WISE-SoE_WaterQuality.AggregatedData - CAS_72-43-5 - ug/L
type: Concept
notation: WISE-SoE_WaterQuality.AggregatedData - CAS_72-43-5 - ug/L
definition: The unit of measure for 'CAS_72-43-5' (Methoxychlor) in WISE SoE - Water Quality: Aggregated data table is 'ug/L'
status: valid
status modified: 2019-10-03
accepted date: 2019-10-03
in scheme: Definition of correct units for the observed determinands in the given WISE SoE DD tables
has determinand: CAS 72-43-5
has uom: ug.L-1
has table: WISE-SoE WaterQuality.AggregatedData

WISE-SoE_WaterQuality.AggregatedData - CAS_72-54-8 - ug/L
type: Concept
notation: WISE-SoE_WaterQuality.AggregatedData - CAS_72-54-8 - ug/L
definition: The unit of measure for 'CAS_72-54-8' (p,p'-DDD) in WISE SoE - Water Quality: Aggregated data table is 'ug/L'
status: valid
status modified: 2019-10-03
accepted date: 2019-10-03
in scheme: Definition of correct units for the observed determinands in the given WISE SoE DD tables
has determinand: CAS 72-54-8
has uom: ug.L-1
has table: WISE-SoE WaterQuality.AggregatedData

WISE-SoE_WaterQuality.AggregatedData - CAS_72-55-9 - ug/L
type: Concept
notation: WISE-SoE_WaterQuality.AggregatedData - CAS_72-55-9 - ug/L
definition: The unit of measure for 'CAS_72-55-9' (p,p'-DDE) in WISE SoE - Water Quality: Aggregated data table is 'ug/L'
status: valid
status modified: 2019-10-03
accepted date: 2019-10-03
in scheme: Definition of correct units for the observed determinands in the given WISE SoE DD tables
has determinand: CAS 72-55-9
has uom: ug.L-1
has table: WISE-SoE WaterQuality.AggregatedData

WISE-SoE_WaterQuality.AggregatedData - CAS_72178-02-0 - ug/L
type: Concept
notation: WISE-SoE_WaterQuality.AggregatedData - CAS_72178-02-0 - ug/L
definition: The unit of measure for 'CAS_72178-02-0' (Fomesafen) in WISE SoE - Water Quality: Aggregated data table is 'ug/L'
status: valid
status modified: 2019-10-03
accepted date: 2019-10-03
in scheme: Definition of correct units for the observed determinands in the given WISE SoE DD tables
has determinand: CAS 72178-02-0
has uom: ug.L-1
has table: WISE-SoE WaterQuality.AggregatedData

WISE-SoE_WaterQuality.AggregatedData - CAS_723-46-6 - ug/L
type: Concept
notation: WISE-SoE_WaterQuality.AggregatedData - CAS_723-46-6 - ug/L
definition: The unit of measure for 'CAS_723-46-6' (Sulfamethoxazol) in WISE SoE - Water Quality: Aggregated data table is 'ug/L'
status: valid
status modified: 2019-10-03
accepted date: 2019-10-03
in scheme: Definition of correct units for the observed determinands in the given WISE SoE DD tables
has determinand: CAS 723-46-6
has uom: ug.L-1
has table: WISE-SoE WaterQuality.AggregatedData

WISE-SoE_WaterQuality.AggregatedData - CAS_7286-69-3 - ug/L
type: Concept
notation: WISE-SoE_WaterQuality.AggregatedData - CAS_7286-69-3 - ug/L
definition: The unit of measure for 'CAS_7286-69-3' (Sebuthylazine) in WISE SoE - Water Quality: Aggregated data table is 'ug/L'
status: valid
status modified: 2019-10-03
accepted date: 2019-10-03
in scheme: Definition of correct units for the observed determinands in the given WISE SoE DD tables
has determinand: CAS 7286-69-3
has uom: ug.L-1
has table: WISE-SoE WaterQuality.AggregatedData

WISE-SoE_WaterQuality.AggregatedData - CAS_7287-19-6 - ug/L
type: Concept
notation: WISE-SoE_WaterQuality.AggregatedData - CAS_7287-19-6 - ug/L
definition: The unit of measure for 'CAS_7287-19-6' (Prometryn) in WISE SoE - Water Quality: Aggregated data table is 'ug/L'
status: valid
status modified: 2019-10-03
accepted date: 2019-10-03
in scheme: Definition of correct units for the observed determinands in the given WISE SoE DD tables
has determinand: CAS 7287-19-6
has uom: ug.L-1
has table: WISE-SoE WaterQuality.AggregatedData

WISE-SoE_WaterQuality.AggregatedData - CAS_72918-21-9 - ug/L
type: Concept
notation: WISE-SoE_WaterQuality.AggregatedData - CAS_72918-21-9 - ug/L
definition: The unit of measure for 'CAS_72918-21-9' (1,2,3,7,8,9-H6CDF) in WISE SoE - Water Quality: Aggregated data table is 'ug/L'
status: valid
status modified: 2019-10-03
accepted date: 2019-10-03
in scheme: Definition of correct units for the observed determinands in the given WISE SoE DD tables
has determinand: CAS 72918-21-9
has uom: ug.L-1
has table: WISE-SoE WaterQuality.AggregatedData

WISE-SoE_WaterQuality.AggregatedData - CAS_731-27-1 - ug/L
type: Concept
notation: WISE-SoE_WaterQuality.AggregatedData - CAS_731-27-1 - ug/L
definition: The unit of measure for 'CAS_731-27-1' (Tolylfluanid) in WISE SoE - Water Quality: Aggregated data table is 'ug/L'
status: valid
status modified: 2019-10-03
accepted date: 2019-10-03
in scheme: Definition of correct units for the observed determinands in the given WISE SoE DD tables
has determinand: CAS 731-27-1
has uom: ug.L-1
has table: WISE-SoE WaterQuality.AggregatedData

WISE-SoE_WaterQuality.AggregatedData - CAS_732-11-6 - ug/L
type: Concept
notation: WISE-SoE_WaterQuality.AggregatedData - CAS_732-11-6 - ug/L
definition: The unit of measure for 'CAS_732-11-6' (Fosmet) in WISE SoE - Water Quality: Aggregated data table is 'ug/L'
status: valid
status modified: 2019-10-03
accepted date: 2019-10-03
in scheme: Definition of correct units for the observed determinands in the given WISE SoE DD tables
has determinand: CAS 732-11-6
has uom: ug.L-1
has table: WISE-SoE WaterQuality.AggregatedData

WISE-SoE_WaterQuality.AggregatedData - CAS_732-26-3 - ug/L
type: Concept
notation: WISE-SoE_WaterQuality.AggregatedData - CAS_732-26-3 - ug/L
definition: The unit of measure for 'CAS_732-26-3' (2,4,6-tri-tert-butylphenol) in WISE SoE - Water Quality: Aggregated data table is 'ug/L'
status: valid
status modified: 2019-10-03
accepted date: 2019-10-03
in scheme: Definition of correct units for the observed determinands in the given WISE SoE DD tables
has determinand: CAS 732-26-3
has uom: ug.L-1
has table: WISE-SoE WaterQuality.AggregatedData

WISE-SoE_WaterQuality.AggregatedData - CAS_738-70-5 - ug/L
type: Concept
notation: WISE-SoE_WaterQuality.AggregatedData - CAS_738-70-5 - ug/L
definition: The unit of measure for 'CAS_738-70-5' (Trimethoprim) in WISE SoE - Water Quality: Aggregated data table is 'ug/L'
status: valid
status modified: 2019-10-03
accepted date: 2019-10-03
in scheme: Definition of correct units for the observed determinands in the given WISE SoE DD tables
has determinand: CAS 738-70-5
has uom: ug.L-1
has table: WISE-SoE WaterQuality.AggregatedData

WISE-SoE_WaterQuality.AggregatedData - CAS_74-83-9 - ug/L
type: Concept
notation: WISE-SoE_WaterQuality.AggregatedData - CAS_74-83-9 - ug/L
definition: The unit of measure for 'CAS_74-83-9' (Bromomethane) in WISE SoE - Water Quality: Aggregated data table is 'ug/L'
status: valid
status modified: 2019-10-03
accepted date: 2019-10-03
in scheme: Definition of correct units for the observed determinands in the given WISE SoE DD tables
has determinand: CAS 74-83-9
has uom: ug.L-1
has table: WISE-SoE WaterQuality.AggregatedData

WISE-SoE_WaterQuality.AggregatedData - CAS_74-87-3 - ug/L
type: Concept
notation: WISE-SoE_WaterQuality.AggregatedData - CAS_74-87-3 - ug/L
definition: The unit of measure for 'CAS_74-87-3' (Methyl chloride) in WISE SoE - Water Quality: Aggregated data table is 'ug/L'
status: valid
status modified: 2019-10-03
accepted date: 2019-10-03
in scheme: Definition of correct units for the observed determinands in the given WISE SoE DD tables
has determinand: CAS 74-87-3
has uom: ug.L-1
has table: WISE-SoE WaterQuality.AggregatedData

WISE-SoE_WaterQuality.AggregatedData - CAS_74-90-8 - ug/L
type: Concept
notation: WISE-SoE_WaterQuality.AggregatedData - CAS_74-90-8 - ug/L
definition: The unit of measure for 'CAS_74-90-8' (Hydrogen cyanide) in WISE SoE - Water Quality: Aggregated data table is 'ug/L'
status: valid
status modified: 2019-10-03
accepted date: 2019-10-03
in scheme: Definition of correct units for the observed determinands in the given WISE SoE DD tables
has determinand: CAS 74-90-8
has uom: ug.L-1
has table: WISE-SoE WaterQuality.AggregatedData

WISE-SoE_WaterQuality.AggregatedData - CAS_74-95-3 - ug/L
type: Concept
notation: WISE-SoE_WaterQuality.AggregatedData - CAS_74-95-3 - ug/L
definition: The unit of measure for 'CAS_74-95-3' (Dibromomethane) in WISE SoE - Water Quality: Aggregated data table is 'ug/L'
status: valid
status modified: 2019-10-03
accepted date: 2019-10-03
in scheme: Definition of correct units for the observed determinands in the given WISE SoE DD tables
has determinand: CAS 74-95-3
has uom: ug.L-1
has table: WISE-SoE WaterQuality.AggregatedData

WISE-SoE_WaterQuality.AggregatedData - CAS_74-97-5 - ug/L
type: Concept
notation: WISE-SoE_WaterQuality.AggregatedData - CAS_74-97-5 - ug/L
definition: The unit of measure for 'CAS_74-97-5' (Bromochloromethane) in WISE SoE - Water Quality: Aggregated data table is 'ug/L'
status: valid
status modified: 2019-10-03
accepted date: 2019-10-03
in scheme: Definition of correct units for the observed determinands in the given WISE SoE DD tables
has determinand: CAS 74-97-5
has uom: ug.L-1
has table: WISE-SoE WaterQuality.AggregatedData

WISE-SoE_WaterQuality.AggregatedData - CAS_74070-46-5 - ug/L
type: Concept
notation: WISE-SoE_WaterQuality.AggregatedData - CAS_74070-46-5 - ug/L
definition: The unit of measure for 'CAS_74070-46-5' (Aclonifen) in WISE SoE - Water Quality: Aggregated data table is 'ug/L'
status: valid
status modified: 2019-10-03
accepted date: 2019-10-03
in scheme: Definition of correct units for the observed determinands in the given WISE SoE DD tables
has determinand: CAS 74070-46-5
has uom: ug.L-1
has table: WISE-SoE WaterQuality.AggregatedData

WISE-SoE_WaterQuality.AggregatedData - CAS_74223-64-6 - ug/L
type: Concept
notation: WISE-SoE_WaterQuality.AggregatedData - CAS_74223-64-6 - ug/L
definition: The unit of measure for 'CAS_74223-64-6' (Metsulfuronmethyl) in WISE SoE - Water Quality: Aggregated data table is 'ug/L'
status: valid
status modified: 2019-10-03
accepted date: 2019-10-03
in scheme: Definition of correct units for the observed determinands in the given WISE SoE DD tables
has determinand: CAS 74223-64-6
has uom: ug.L-1
has table: WISE-SoE WaterQuality.AggregatedData

WISE-SoE_WaterQuality.AggregatedData - CAS_7429-90-5 - ug/L
type: Concept
notation: WISE-SoE_WaterQuality.AggregatedData - CAS_7429-90-5 - ug/L
definition: The unit of measure for 'CAS_7429-90-5' (Aluminium and its compounds) in WISE SoE - Water Quality: Aggregated data table is 'ug/L'
status: valid
status modified: 2019-10-03
accepted date: 2019-10-03
in scheme: Definition of correct units for the observed determinands in the given WISE SoE DD tables
has determinand: CAS 7429-90-5
has uom: ug.L-1
has table: WISE-SoE WaterQuality.AggregatedData

WISE-SoE_WaterQuality.AggregatedData - CAS_7439-89-6 - ug/L
type: Concept
notation: WISE-SoE_WaterQuality.AggregatedData - CAS_7439-89-6 - ug/L
definition: The unit of measure for 'CAS_7439-89-6' (Iron and its compounds) in WISE SoE - Water Quality: Aggregated data table is 'ug/L'
status: valid
status modified: 2019-10-03
accepted date: 2019-10-03
in scheme: Definition of correct units for the observed determinands in the given WISE SoE DD tables
has determinand: CAS 7439-89-6
has uom: ug.L-1
has table: WISE-SoE WaterQuality.AggregatedData

WISE-SoE_WaterQuality.AggregatedData - CAS_7439-92-1 - ug/L
type: Concept
notation: WISE-SoE_WaterQuality.AggregatedData - CAS_7439-92-1 - ug/L
definition: The unit of measure for 'CAS_7439-92-1' (Lead and its compounds) in WISE SoE - Water Quality: Aggregated data table is 'ug/L'
status: valid
status modified: 2019-10-03
accepted date: 2019-10-03
in scheme: Definition of correct units for the observed determinands in the given WISE SoE DD tables
has determinand: CAS 7439-92-1
has uom: ug.L-1
has table: WISE-SoE WaterQuality.AggregatedData

WISE-SoE_WaterQuality.AggregatedData - CAS_7439-93-2 - ug/L
type: Concept
notation: WISE-SoE_WaterQuality.AggregatedData - CAS_7439-93-2 - ug/L
definition: The unit of measure for 'CAS_7439-93-2' (Lithium) in WISE SoE - Water Quality: Aggregated data table is 'ug/L'
status: valid
status modified: 2019-10-03
accepted date: 2019-10-03
in scheme: Definition of correct units for the observed determinands in the given WISE SoE DD tables
has determinand: CAS 7439-93-2
has uom: ug.L-1
has table: WISE-SoE WaterQuality.AggregatedData

WISE-SoE_WaterQuality.AggregatedData - CAS_7439-95-4 - mg/L
type: Concept
notation: WISE-SoE_WaterQuality.AggregatedData - CAS_7439-95-4 - mg/L
definition: The unit of measure for 'CAS_7439-95-4' (Magnesium) in WISE SoE - Water Quality: Aggregated data table is 'mg/L'
status: valid
status modified: 2019-10-03
accepted date: 2019-10-03
in scheme: Definition of correct units for the observed determinands in the given WISE SoE DD tables
has determinand: CAS 7439-95-4
has uom: mg.L-1
has table: WISE-SoE WaterQuality.AggregatedData

WISE-SoE_WaterQuality.AggregatedData - CAS_7439-96-5 - ug/L
type: Concept
notation: WISE-SoE_WaterQuality.AggregatedData - CAS_7439-96-5 - ug/L
definition: The unit of measure for 'CAS_7439-96-5' (Manganese and its compounds) in WISE SoE - Water Quality: Aggregated data table is 'ug/L'
status: valid
status modified: 2019-10-03
accepted date: 2019-10-03
in scheme: Definition of correct units for the observed determinands in the given WISE SoE DD tables
has determinand: CAS 7439-96-5
has uom: ug.L-1
has table: WISE-SoE WaterQuality.AggregatedData

WISE-SoE_WaterQuality.AggregatedData - CAS_7439-97-6 - ug/L
type: Concept
notation: WISE-SoE_WaterQuality.AggregatedData - CAS_7439-97-6 - ug/L
definition: The unit of measure for 'CAS_7439-97-6' (Mercury and its compounds) in WISE SoE - Water Quality: Aggregated data table is 'ug/L'
status: valid
status modified: 2019-10-03
accepted date: 2019-10-03
in scheme: Definition of correct units for the observed determinands in the given WISE SoE DD tables
has determinand: CAS 7439-97-6
has uom: ug.L-1
has table: WISE-SoE WaterQuality.AggregatedData

WISE-SoE_WaterQuality.AggregatedData - CAS_7439-98-7 - ug/L
type: Concept
notation: WISE-SoE_WaterQuality.AggregatedData - CAS_7439-98-7 - ug/L
definition: The unit of measure for 'CAS_7439-98-7' (Molybdenum and its compounds) in WISE SoE - Water Quality: Aggregated data table is 'ug/L'
status: valid
status modified: 2019-10-03
accepted date: 2019-10-03
in scheme: Definition of correct units for the observed determinands in the given WISE SoE DD tables
has determinand: CAS 7439-98-7
has uom: ug.L-1
has table: WISE-SoE WaterQuality.AggregatedData

WISE-SoE_WaterQuality.AggregatedData - CAS_7440-02-0 - ug/L
type: Concept
notation: WISE-SoE_WaterQuality.AggregatedData - CAS_7440-02-0 - ug/L
definition: The unit of measure for 'CAS_7440-02-0' (Nickel and its compounds) in WISE SoE - Water Quality: Aggregated data table is 'ug/L'
status: valid
status modified: 2019-10-03
accepted date: 2019-10-03
in scheme: Definition of correct units for the observed determinands in the given WISE SoE DD tables
has determinand: CAS 7440-02-0
has uom: ug.L-1
has table: WISE-SoE WaterQuality.AggregatedData

WISE-SoE_WaterQuality.AggregatedData - CAS_7440-09-7 - mg/L
type: Concept
notation: WISE-SoE_WaterQuality.AggregatedData - CAS_7440-09-7 - mg/L
definition: The unit of measure for 'CAS_7440-09-7' (Potassium) in WISE SoE - Water Quality: Aggregated data table is 'mg/L'
status: valid
status modified: 2019-10-03
accepted date: 2019-10-03
in scheme: Definition of correct units for the observed determinands in the given WISE SoE DD tables
has determinand: CAS 7440-09-7
has uom: mg.L-1
has table: WISE-SoE WaterQuality.AggregatedData

WISE-SoE_WaterQuality.AggregatedData - CAS_7440-21-3 - ug/L
type: Concept
notation: WISE-SoE_WaterQuality.AggregatedData - CAS_7440-21-3 - ug/L
definition: The unit of measure for 'CAS_7440-21-3' (Silicon) in WISE SoE - Water Quality: Aggregated data table is 'ug/L'
status: valid
status modified: 2019-10-03
accepted date: 2019-10-03
in scheme: Definition of correct units for the observed determinands in the given WISE SoE DD tables
has determinand: CAS 7440-21-3
has uom: ug.L-1
has table: WISE-SoE WaterQuality.AggregatedData

WISE-SoE_WaterQuality.AggregatedData - CAS_7440-22-4 - ug/L
type: Concept
notation: WISE-SoE_WaterQuality.AggregatedData - CAS_7440-22-4 - ug/L
definition: The unit of measure for 'CAS_7440-22-4' (Silver) in WISE SoE - Water Quality: Aggregated data table is 'ug/L'
status: valid
status modified: 2019-10-03
accepted date: 2019-10-03
in scheme: Definition of correct units for the observed determinands in the given WISE SoE DD tables
has determinand: CAS 7440-22-4
has uom: ug.L-1
has table: WISE-SoE WaterQuality.AggregatedData

WISE-SoE_WaterQuality.AggregatedData - CAS_7440-23-5 - mg/L
type: Concept
notation: WISE-SoE_WaterQuality.AggregatedData - CAS_7440-23-5 - mg/L
definition: The unit of measure for 'CAS_7440-23-5' (Sodium) in WISE SoE - Water Quality: Aggregated data table is 'mg/L'
status: valid
status modified: 2019-10-03
accepted date: 2019-10-03
in scheme: Definition of correct units for the observed determinands in the given WISE SoE DD tables
has determinand: CAS 7440-23-5
has uom: mg.L-1
has table: WISE-SoE WaterQuality.AggregatedData

WISE-SoE_WaterQuality.AggregatedData - CAS_7440-24-6 - ug/L
type: Concept
notation: WISE-SoE_WaterQuality.AggregatedData - CAS_7440-24-6 - ug/L
definition: The unit of measure for 'CAS_7440-24-6' (Strontium) in WISE SoE - Water Quality: Aggregated data table is 'ug/L'
status: valid
status modified: 2019-10-03
accepted date: 2019-10-03
in scheme: Definition of correct units for the observed determinands in the given WISE SoE DD tables
has determinand: CAS 7440-24-6
has uom: ug.L-1
has table: WISE-SoE WaterQuality.AggregatedData

WISE-SoE_WaterQuality.AggregatedData - CAS_7440-28-0 - ug/L
type: Concept
notation: WISE-SoE_WaterQuality.AggregatedData - CAS_7440-28-0 - ug/L
definition: The unit of measure for 'CAS_7440-28-0' (Thallium) in WISE SoE - Water Quality: Aggregated data table is 'ug/L'
status: valid
status modified: 2019-10-03
accepted date: 2019-10-03
in scheme: Definition of correct units for the observed determinands in the given WISE SoE DD tables
has determinand: CAS 7440-28-0
has uom: ug.L-1
has table: WISE-SoE WaterQuality.AggregatedData

WISE-SoE_WaterQuality.AggregatedData - CAS_7440-31-5 - ug/L
type: Concept
notation: WISE-SoE_WaterQuality.AggregatedData - CAS_7440-31-5 - ug/L
definition: The unit of measure for 'CAS_7440-31-5' (Tin and its compounds) in WISE SoE - Water Quality: Aggregated data table is 'ug/L'
status: valid
status modified: 2019-10-03
accepted date: 2019-10-03
in scheme: Definition of correct units for the observed determinands in the given WISE SoE DD tables
has determinand: CAS 7440-31-5
has uom: ug.L-1
has table: WISE-SoE WaterQuality.AggregatedData

WISE-SoE_WaterQuality.AggregatedData - CAS_7440-32-6 - ug/L
type: Concept
notation: WISE-SoE_WaterQuality.AggregatedData - CAS_7440-32-6 - ug/L
definition: The unit of measure for 'CAS_7440-32-6' (Titanium) in WISE SoE - Water Quality: Aggregated data table is 'ug/L'
status: valid
status modified: 2019-10-03
accepted date: 2019-10-03
in scheme: Definition of correct units for the observed determinands in the given WISE SoE DD tables
has determinand: CAS 7440-32-6
has uom: ug.L-1
has table: WISE-SoE WaterQuality.AggregatedData

WISE-SoE_WaterQuality.AggregatedData - CAS_7440-33-7 - ug/L
type: Concept
notation: WISE-SoE_WaterQuality.AggregatedData - CAS_7440-33-7 - ug/L
definition: The unit of measure for 'CAS_7440-33-7' (Tungsten and its compounds) in WISE SoE - Water Quality: Aggregated data table is 'ug/L'
status: valid
status modified: 2019-10-03
accepted date: 2019-10-03
in scheme: Definition of correct units for the observed determinands in the given WISE SoE DD tables
has determinand: CAS 7440-33-7
has uom: ug.L-1
has table: WISE-SoE WaterQuality.AggregatedData

WISE-SoE_WaterQuality.AggregatedData - CAS_7440-36-0 - ug/L
type: Concept
notation: WISE-SoE_WaterQuality.AggregatedData - CAS_7440-36-0 - ug/L
definition: The unit of measure for 'CAS_7440-36-0' (Antimony) in WISE SoE - Water Quality: Aggregated data table is 'ug/L'
status: valid
status modified: 2019-10-03
accepted date: 2019-10-03
in scheme: Definition of correct units for the observed determinands in the given WISE SoE DD tables
has determinand: CAS 7440-36-0
has uom: ug.L-1
has table: WISE-SoE WaterQuality.AggregatedData

WISE-SoE_WaterQuality.AggregatedData - CAS_7440-38-2 - ug/L
type: Concept
notation: WISE-SoE_WaterQuality.AggregatedData - CAS_7440-38-2 - ug/L
definition: The unit of measure for 'CAS_7440-38-2' (Arsenic and its compounds) in WISE SoE - Water Quality: Aggregated data table is 'ug/L'
status: valid
status modified: 2019-10-03
accepted date: 2019-10-03
in scheme: Definition of correct units for the observed determinands in the given WISE SoE DD tables
has determinand: CAS 7440-38-2
has uom: ug.L-1
has table: WISE-SoE WaterQuality.AggregatedData

WISE-SoE_WaterQuality.AggregatedData - CAS_7440-39-3 - ug/L
type: Concept
notation: WISE-SoE_WaterQuality.AggregatedData - CAS_7440-39-3 - ug/L
definition: The unit of measure for 'CAS_7440-39-3' (Barium) in WISE SoE - Water Quality: Aggregated data table is 'ug/L'
status: valid
status modified: 2019-10-03
accepted date: 2019-10-03
in scheme: Definition of correct units for the observed determinands in the given WISE SoE DD tables
has determinand: CAS 7440-39-3
has uom: ug.L-1
has table: WISE-SoE WaterQuality.AggregatedData

WISE-SoE_WaterQuality.AggregatedData - CAS_7440-41-7 - ug/L
type: Concept
notation: WISE-SoE_WaterQuality.AggregatedData - CAS_7440-41-7 - ug/L
definition: The unit of measure for 'CAS_7440-41-7' (Beryllium) in WISE SoE - Water Quality: Aggregated data table is 'ug/L'
status: valid
status modified: 2019-10-03
accepted date: 2019-10-03
in scheme: Definition of correct units for the observed determinands in the given WISE SoE DD tables
has determinand: CAS 7440-41-7
has uom: ug.L-1
has table: WISE-SoE WaterQuality.AggregatedData

WISE-SoE_WaterQuality.AggregatedData - CAS_7440-42-8 - ug/L
type: Concept
notation: WISE-SoE_WaterQuality.AggregatedData - CAS_7440-42-8 - ug/L
definition: The unit of measure for 'CAS_7440-42-8' (Boron) in WISE SoE - Water Quality: Aggregated data table is 'ug/L'
status: valid
status modified: 2019-10-03
accepted date: 2019-10-03
in scheme: Definition of correct units for the observed determinands in the given WISE SoE DD tables
has determinand: CAS 7440-42-8
has uom: ug.L-1
has table: WISE-SoE WaterQuality.AggregatedData

WISE-SoE_WaterQuality.AggregatedData - CAS_7440-43-9 - ug/L
type: Concept
notation: WISE-SoE_WaterQuality.AggregatedData - CAS_7440-43-9 - ug/L
definition: The unit of measure for 'CAS_7440-43-9' (Cadmium and its compounds) in WISE SoE - Water Quality: Aggregated data table is 'ug/L'
status: valid
status modified: 2019-10-03
accepted date: 2019-10-03
in scheme: Definition of correct units for the observed determinands in the given WISE SoE DD tables
has determinand: CAS 7440-43-9
has uom: ug.L-1
has table: WISE-SoE WaterQuality.AggregatedData

WISE-SoE_WaterQuality.AggregatedData - CAS_7440-47-3 - ug/L
type: Concept
notation: WISE-SoE_WaterQuality.AggregatedData - CAS_7440-47-3 - ug/L
definition: The unit of measure for 'CAS_7440-47-3' (Chromium and its compounds) in WISE SoE - Water Quality: Aggregated data table is 'ug/L'
status: valid
status modified: 2019-10-03
accepted date: 2019-10-03
in scheme: Definition of correct units for the observed determinands in the given WISE SoE DD tables
has determinand: CAS 7440-47-3
has uom: ug.L-1
has table: WISE-SoE WaterQuality.AggregatedData

WISE-SoE_WaterQuality.AggregatedData - CAS_7440-48-4 - ug/L
type: Concept
notation: WISE-SoE_WaterQuality.AggregatedData - CAS_7440-48-4 - ug/L
definition: The unit of measure for 'CAS_7440-48-4' (Cobalt and its compounds) in WISE SoE - Water Quality: Aggregated data table is 'ug/L'
status: valid
status modified: 2019-10-03
accepted date: 2019-10-03
in scheme: Definition of correct units for the observed determinands in the given WISE SoE DD tables
has determinand: CAS 7440-48-4
has uom: ug.L-1
has table: WISE-SoE WaterQuality.AggregatedData

WISE-SoE_WaterQuality.AggregatedData - CAS_7440-50-8 - ug/L
type: Concept
notation: WISE-SoE_WaterQuality.AggregatedData - CAS_7440-50-8 - ug/L
definition: The unit of measure for 'CAS_7440-50-8' (Copper and its compounds) in WISE SoE - Water Quality: Aggregated data table is 'ug/L'
status: valid
status modified: 2019-10-03
accepted date: 2019-10-03
in scheme: Definition of correct units for the observed determinands in the given WISE SoE DD tables
has determinand: CAS 7440-50-8
has uom: ug.L-1
has table: WISE-SoE WaterQuality.AggregatedData

WISE-SoE_WaterQuality.AggregatedData - CAS_7440-61-1 - ug/L
type: Concept
notation: WISE-SoE_WaterQuality.AggregatedData - CAS_7440-61-1 - ug/L
definition: The unit of measure for 'CAS_7440-61-1' (Uranium) in WISE SoE - Water Quality: Aggregated data table is 'ug/L'
status: valid
status modified: 2019-10-03
accepted date: 2019-10-03
in scheme: Definition of correct units for the observed determinands in the given WISE SoE DD tables
has determinand: CAS 7440-61-1
has uom: ug.L-1
has table: WISE-SoE WaterQuality.AggregatedData

WISE-SoE_WaterQuality.AggregatedData - CAS_7440-62-2 - ug/L
type: Concept
notation: WISE-SoE_WaterQuality.AggregatedData - CAS_7440-62-2 - ug/L
definition: The unit of measure for 'CAS_7440-62-2' (Vanadium and its compounds) in WISE SoE - Water Quality: Aggregated data table is 'ug/L'
status: valid
status modified: 2019-10-03
accepted date: 2019-10-03
in scheme: Definition of correct units for the observed determinands in the given WISE SoE DD tables
has determinand: CAS 7440-62-2
has uom: ug.L-1
has table: WISE-SoE WaterQuality.AggregatedData

WISE-SoE_WaterQuality.AggregatedData - CAS_7440-66-6 - ug/L
type: Concept
notation: WISE-SoE_WaterQuality.AggregatedData - CAS_7440-66-6 - ug/L
definition: The unit of measure for 'CAS_7440-66-6' (Zinc and its compounds) in WISE SoE - Water Quality: Aggregated data table is 'ug/L'
status: valid
status modified: 2019-10-03
accepted date: 2019-10-03
in scheme: Definition of correct units for the observed determinands in the given WISE SoE DD tables
has determinand: CAS 7440-66-6
has uom: ug.L-1
has table: WISE-SoE WaterQuality.AggregatedData

WISE-SoE_WaterQuality.AggregatedData - CAS_7440-70-2 - mg/L
type: Concept
notation: WISE-SoE_WaterQuality.AggregatedData - CAS_7440-70-2 - mg/L
definition: The unit of measure for 'CAS_7440-70-2' (Calcium) in WISE SoE - Water Quality: Aggregated data table is 'mg/L'
status: valid
status modified: 2019-10-03
accepted date: 2019-10-03
in scheme: Definition of correct units for the observed determinands in the given WISE SoE DD tables
has determinand: CAS 7440-70-2
has uom: mg.L-1
has table: WISE-SoE WaterQuality.AggregatedData

WISE-SoE_WaterQuality.AggregatedData - CAS_74472-37-0 - ug/L
type: Concept
notation: WISE-SoE_WaterQuality.AggregatedData - CAS_74472-37-0 - ug/L
definition: The unit of measure for 'CAS_74472-37-0' (PCB 114 (2,3,4,4',5-pentachlorobiphenyl)) in WISE SoE - Water Quality: Aggregated data table is 'ug/L'
status: valid
status modified: 2019-10-03
accepted date: 2019-10-03
in scheme: Definition of correct units for the observed determinands in the given WISE SoE DD tables
has determinand: CAS 74472-37-0
has uom: ug.L-1
has table: WISE-SoE WaterQuality.AggregatedData

WISE-SoE_WaterQuality.AggregatedData - CAS_75-01-4 - ug/L
type: Concept
notation: WISE-SoE_WaterQuality.AggregatedData - CAS_75-01-4 - ug/L
definition: The unit of measure for 'CAS_75-01-4' (Chloroethene (vinylchloride)) in WISE SoE - Water Quality: Aggregated data table is 'ug/L'
status: valid
status modified: 2019-10-03
accepted date: 2019-10-03
in scheme: Definition of correct units for the observed determinands in the given WISE SoE DD tables
has determinand: CAS 75-01-4
has uom: ug.L-1
has table: WISE-SoE WaterQuality.AggregatedData

WISE-SoE_WaterQuality.AggregatedData - CAS_75-09-2 - ug/L
type: Concept
notation: WISE-SoE_WaterQuality.AggregatedData - CAS_75-09-2 - ug/L
definition: The unit of measure for 'CAS_75-09-2' (Dichloromethane) in WISE SoE - Water Quality: Aggregated data table is 'ug/L'
status: valid
status modified: 2019-10-03
accepted date: 2019-10-03
in scheme: Definition of correct units for the observed determinands in the given WISE SoE DD tables
has determinand: CAS 75-09-2
has uom: ug.L-1
has table: WISE-SoE WaterQuality.AggregatedData

WISE-SoE_WaterQuality.AggregatedData - CAS_75-21-8 - ug/L
type: Concept
notation: WISE-SoE_WaterQuality.AggregatedData - CAS_75-21-8 - ug/L
definition: The unit of measure for 'CAS_75-21-8' (Ethylene oxide) in WISE SoE - Water Quality: Aggregated data table is 'ug/L'
status: valid
status modified: 2019-10-03
accepted date: 2019-10-03
in scheme: Definition of correct units for the observed determinands in the given WISE SoE DD tables
has determinand: CAS 75-21-8
has uom: ug.L-1
has table: WISE-SoE WaterQuality.AggregatedData

WISE-SoE_WaterQuality.AggregatedData - CAS_75-25-2 - ug/L
type: Concept
notation: WISE-SoE_WaterQuality.AggregatedData - CAS_75-25-2 - ug/L
definition: The unit of measure for 'CAS_75-25-2' (Bromoform) in WISE SoE - Water Quality: Aggregated data table is 'ug/L'
status: valid
status modified: 2019-10-03
accepted date: 2019-10-03
in scheme: Definition of correct units for the observed determinands in the given WISE SoE DD tables
has determinand: CAS 75-25-2
has uom: ug.L-1
has table: WISE-SoE WaterQuality.AggregatedData

WISE-SoE_WaterQuality.AggregatedData - CAS_75-27-4 - ug/L
type: Concept
notation: WISE-SoE_WaterQuality.AggregatedData - CAS_75-27-4 - ug/L
definition: The unit of measure for 'CAS_75-27-4' (Bromodichloromethane) in WISE SoE - Water Quality: Aggregated data table is 'ug/L'
status: valid
status modified: 2019-10-03
accepted date: 2019-10-03
in scheme: Definition of correct units for the observed determinands in the given WISE SoE DD tables
has determinand: CAS 75-27-4
has uom: ug.L-1
has table: WISE-SoE WaterQuality.AggregatedData

WISE-SoE_WaterQuality.AggregatedData - CAS_75-34-3 - ug/L
type: Concept
notation: WISE-SoE_WaterQuality.AggregatedData - CAS_75-34-3 - ug/L
definition: The unit of measure for 'CAS_75-34-3' (1,1-dichloroethane) in WISE SoE - Water Quality: Aggregated data table is 'ug/L'
status: valid
status modified: 2019-10-03
accepted date: 2019-10-03
in scheme: Definition of correct units for the observed determinands in the given WISE SoE DD tables
has determinand: CAS 75-34-3
has uom: ug.L-1
has table: WISE-SoE WaterQuality.AggregatedData

WISE-SoE_WaterQuality.AggregatedData - CAS_75-35-4 - ug/L
type: Concept
notation: WISE-SoE_WaterQuality.AggregatedData - CAS_75-35-4 - ug/L
definition: The unit of measure for 'CAS_75-35-4' (1,1-dichloroethene) in WISE SoE - Water Quality: Aggregated data table is 'ug/L'
status: valid
status modified: 2019-10-03
accepted date: 2019-10-03
in scheme: Definition of correct units for the observed determinands in the given WISE SoE DD tables
has determinand: CAS 75-35-4
has uom: ug.L-1
has table: WISE-SoE WaterQuality.AggregatedData

WISE-SoE_WaterQuality.AggregatedData - CAS_75-69-4 - ug/L
type: Concept
notation: WISE-SoE_WaterQuality.AggregatedData - CAS_75-69-4 - ug/L
definition: The unit of measure for 'CAS_75-69-4' (Trichlorofluoromethane) in WISE SoE - Water Quality: Aggregated data table is 'ug/L'
status: valid
status modified: 2019-10-03
accepted date: 2019-10-03
in scheme: Definition of correct units for the observed determinands in the given WISE SoE DD tables
has determinand: CAS 75-69-4
has uom: ug.L-1
has table: WISE-SoE WaterQuality.AggregatedData

WISE-SoE_WaterQuality.AggregatedData - CAS_75-71-8 - ug/L
type: Concept
notation: WISE-SoE_WaterQuality.AggregatedData - CAS_75-71-8 - ug/L
definition: The unit of measure for 'CAS_75-71-8' (Dichlorodifluoromethane) in WISE SoE - Water Quality: Aggregated data table is 'ug/L'
status: valid
status modified: 2019-10-03
accepted date: 2019-10-03
in scheme: Definition of correct units for the observed determinands in the given WISE SoE DD tables
has determinand: CAS 75-71-8
has uom: ug.L-1
has table: WISE-SoE WaterQuality.AggregatedData

WISE-SoE_WaterQuality.AggregatedData - CAS_75-99-0 - ug/L
type: Concept
notation: WISE-SoE_WaterQuality.AggregatedData - CAS_75-99-0 - ug/L
definition: The unit of measure for 'CAS_75-99-0' (Dalapon) in WISE SoE - Water Quality: Aggregated data table is 'ug/L'
status: valid
status modified: 2019-10-03
accepted date: 2019-10-03
in scheme: Definition of correct units for the observed determinands in the given WISE SoE DD tables
has determinand: CAS 75-99-0
has uom: ug.L-1
has table: WISE-SoE WaterQuality.AggregatedData

WISE-SoE_WaterQuality.AggregatedData - CAS_76-03-9 - ug/L
type: Concept
notation: WISE-SoE_WaterQuality.AggregatedData - CAS_76-03-9 - ug/L
definition: The unit of measure for 'CAS_76-03-9' (Trichloroacetic acid) in WISE SoE - Water Quality: Aggregated data table is 'ug/L'
status: valid
status modified: 2019-10-03
accepted date: 2019-10-03
in scheme: Definition of correct units for the observed determinands in the given WISE SoE DD tables
has determinand: CAS 76-03-9
has uom: ug.L-1
has table: WISE-SoE WaterQuality.AggregatedData

WISE-SoE_WaterQuality.AggregatedData - CAS_76-13-1 - ug/L
type: Concept
notation: WISE-SoE_WaterQuality.AggregatedData - CAS_76-13-1 - ug/L
definition: The unit of measure for 'CAS_76-13-1' (1,1,2-trichlorotrifluoroethane) in WISE SoE - Water Quality: Aggregated data table is 'ug/L'
status: valid
status modified: 2019-10-03
accepted date: 2019-10-03
in scheme: Definition of correct units for the observed determinands in the given WISE SoE DD tables
has determinand: CAS 76-13-1
has uom: ug.L-1
has table: WISE-SoE WaterQuality.AggregatedData

WISE-SoE_WaterQuality.AggregatedData - CAS_76-44-8 - ug/L
type: Concept
notation: WISE-SoE_WaterQuality.AggregatedData - CAS_76-44-8 - ug/L
definition: The unit of measure for 'CAS_76-44-8' (Heptachlor) in WISE SoE - Water Quality: Aggregated data table is 'ug/L'
status: valid
status modified: 2019-10-03
accepted date: 2019-10-03
in scheme: Definition of correct units for the observed determinands in the given WISE SoE DD tables
has determinand: CAS 76-44-8
has uom: ug.L-1
has table: WISE-SoE WaterQuality.AggregatedData

WISE-SoE_WaterQuality.AggregatedData - CAS_76578-12-6 - ug/L
type: Concept
notation: WISE-SoE_WaterQuality.AggregatedData - CAS_76578-12-6 - ug/L
definition: The unit of measure for 'CAS_76578-12-6' (Quizalofop) in WISE SoE - Water Quality: Aggregated data table is 'ug/L'
status: valid
status modified: 2019-10-03
accepted date: 2019-10-03
in scheme: Definition of correct units for the observed determinands in the given WISE SoE DD tables
has determinand: CAS 76578-12-6
has uom: ug.L-1
has table: WISE-SoE WaterQuality.AggregatedData

WISE-SoE_WaterQuality.AggregatedData - CAS_7664-41-7 - ug/L
type: Concept
notation: WISE-SoE_WaterQuality.AggregatedData - CAS_7664-41-7 - ug/L
definition: The unit of measure for 'CAS_7664-41-7' (Ammonia) in WISE SoE - Water Quality: Aggregated data table is 'ug/L'
status: valid
status modified: 2019-10-03
accepted date: 2019-10-03
in scheme: Definition of correct units for the observed determinands in the given WISE SoE DD tables
has determinand: CAS 7664-41-7
has uom: ug.L-1
has table: WISE-SoE WaterQuality.AggregatedData

WISE-SoE_WaterQuality.AggregatedData - CAS_77-47-4 - ug/L
type: Concept
notation: WISE-SoE_WaterQuality.AggregatedData - CAS_77-47-4 - ug/L
definition: The unit of measure for 'CAS_77-47-4' (Hexachlorocyclopentadiene (HCCP)) in WISE SoE - Water Quality: Aggregated data table is 'ug/L'
status: valid
status modified: 2019-10-03
accepted date: 2019-10-03
in scheme: Definition of correct units for the observed determinands in the given WISE SoE DD tables
has determinand: CAS 77-47-4
has uom: ug.L-1
has table: WISE-SoE WaterQuality.AggregatedData

WISE-SoE_WaterQuality.AggregatedData - CAS_7723-14-0 - mg{P}/L
type: Concept
notation: WISE-SoE_WaterQuality.AggregatedData - CAS_7723-14-0 - mg{P}/L
definition: The unit of measure for 'CAS_7723-14-0' (Total phosphorus) in WISE SoE - Water Quality: Aggregated data table is 'mg{P}/L'
status: valid
status modified: 2019-10-03
accepted date: 2019-10-03
in scheme: Definition of correct units for the observed determinands in the given WISE SoE DD tables
has determinand: CAS 7723-14-0
has uom: mg{P}.L-1
has table: WISE-SoE WaterQuality.AggregatedData

WISE-SoE_WaterQuality.AggregatedData - CAS_77238-39-2 - ug/L
type: Concept
notation: WISE-SoE_WaterQuality.AggregatedData - CAS_77238-39-2 - ug/L
definition: The unit of measure for 'CAS_77238-39-2' (Microcystin) in WISE SoE - Water Quality: Aggregated data table is 'ug/L'
status: valid
status modified: 2019-10-03
accepted date: 2019-10-03
in scheme: Definition of correct units for the observed determinands in the given WISE SoE DD tables
has determinand: CAS 77238-39-2
has uom: ug.L-1
has table: WISE-SoE WaterQuality.AggregatedData

WISE-SoE_WaterQuality.AggregatedData - CAS_77732-09-3 - ug/L
type: Concept
notation: WISE-SoE_WaterQuality.AggregatedData - CAS_77732-09-3 - ug/L
definition: The unit of measure for 'CAS_77732-09-3' (Oxadixyl) in WISE SoE - Water Quality: Aggregated data table is 'ug/L'
status: valid
status modified: 2019-10-03
accepted date: 2019-10-03
in scheme: Definition of correct units for the observed determinands in the given WISE SoE DD tables
has determinand: CAS 77732-09-3
has uom: ug.L-1
has table: WISE-SoE WaterQuality.AggregatedData

WISE-SoE_WaterQuality.AggregatedData - CAS_7782-41-4 - ug/L
type: Concept
notation: WISE-SoE_WaterQuality.AggregatedData - CAS_7782-41-4 - ug/L
definition: The unit of measure for 'CAS_7782-41-4' (Fluorine) in WISE SoE - Water Quality: Aggregated data table is 'ug/L'
status: valid
status modified: 2019-10-03
accepted date: 2019-10-03
in scheme: Definition of correct units for the observed determinands in the given WISE SoE DD tables
has determinand: CAS 7782-41-4
has uom: ug.L-1
has table: WISE-SoE WaterQuality.AggregatedData

WISE-SoE_WaterQuality.AggregatedData - CAS_7782-49-2 - ug/L
type: Concept
notation: WISE-SoE_WaterQuality.AggregatedData - CAS_7782-49-2 - ug/L
definition: The unit of measure for 'CAS_7782-49-2' (Selenium and its compounds) in WISE SoE - Water Quality: Aggregated data table is 'ug/L'
status: valid
status modified: 2019-10-03
accepted date: 2019-10-03
in scheme: Definition of correct units for the observed determinands in the given WISE SoE DD tables
has determinand: CAS 7782-49-2
has uom: ug.L-1
has table: WISE-SoE WaterQuality.AggregatedData

WISE-SoE_WaterQuality.AggregatedData - CAS_7783-06-4 - mg{S}/L
type: Concept
notation: WISE-SoE_WaterQuality.AggregatedData - CAS_7783-06-4 - mg{S}/L
definition: The unit of measure for 'CAS_7783-06-4' (Hydrogen sulphide) in WISE SoE - Water Quality: Aggregated data table is 'mg{S}/L'
status: valid
status modified: 2019-10-03
accepted date: 2019-10-03
in scheme: Definition of correct units for the observed determinands in the given WISE SoE DD tables
has determinand: CAS 7783-06-4
has uom: mg{S}.L-1
has table: WISE-SoE WaterQuality.AggregatedData

WISE-SoE_WaterQuality.AggregatedData - CAS_7786-34-7 - ug/L
type: Concept
notation: WISE-SoE_WaterQuality.AggregatedData - CAS_7786-34-7 - ug/L
definition: The unit of measure for 'CAS_7786-34-7' (Mevinphos) in WISE SoE - Water Quality: Aggregated data table is 'ug/L'
status: valid
status modified: 2019-10-03
accepted date: 2019-10-03
in scheme: Definition of correct units for the observed determinands in the given WISE SoE DD tables
has determinand: CAS 7786-34-7
has uom: ug.L-1
has table: WISE-SoE WaterQuality.AggregatedData

WISE-SoE_WaterQuality.AggregatedData - CAS_7790-93-4 - ug/L
type: Concept
notation: WISE-SoE_WaterQuality.AggregatedData - CAS_7790-93-4 - ug/L
definition: The unit of measure for 'CAS_7790-93-4' (Chloric acid) in WISE SoE - Water Quality: Aggregated data table is 'ug/L'
status: valid
status modified: 2019-10-03
accepted date: 2019-10-03
in scheme: Definition of correct units for the observed determinands in the given WISE SoE DD tables
has determinand: CAS 7790-93-4
has uom: ug.L-1
has table: WISE-SoE WaterQuality.AggregatedData

WISE-SoE_WaterQuality.AggregatedData - CAS_78-87-5 - ug/L
type: Concept
notation: WISE-SoE_WaterQuality.AggregatedData - CAS_78-87-5 - ug/L
definition: The unit of measure for 'CAS_78-87-5' (1,2-dichloropropane) in WISE SoE - Water Quality: Aggregated data table is 'ug/L'
status: valid
status modified: 2019-10-03
accepted date: 2019-10-03
in scheme: Definition of correct units for the observed determinands in the given WISE SoE DD tables
has determinand: CAS 78-87-5
has uom: ug.L-1
has table: WISE-SoE WaterQuality.AggregatedData

WISE-SoE_WaterQuality.AggregatedData - CAS_78-88-6 - ug/L
type: Concept
notation: WISE-SoE_WaterQuality.AggregatedData - CAS_78-88-6 - ug/L
definition: The unit of measure for 'CAS_78-88-6' (2,3-dichloropropene) in WISE SoE - Water Quality: Aggregated data table is 'ug/L'
status: valid
status modified: 2019-10-03
accepted date: 2019-10-03
in scheme: Definition of correct units for the observed determinands in the given WISE SoE DD tables
has determinand: CAS 78-88-6
has uom: ug.L-1
has table: WISE-SoE WaterQuality.AggregatedData

WISE-SoE_WaterQuality.AggregatedData - CAS_786-19-6 - ug/L
type: Concept
notation: WISE-SoE_WaterQuality.AggregatedData - CAS_786-19-6 - ug/L
definition: The unit of measure for 'CAS_786-19-6' (Carbophenothion) in WISE SoE - Water Quality: Aggregated data table is 'ug/L'
status: valid
status modified: 2019-10-03
accepted date: 2019-10-03
in scheme: Definition of correct units for the observed determinands in the given WISE SoE DD tables
has determinand: CAS 786-19-6
has uom: ug.L-1
has table: WISE-SoE WaterQuality.AggregatedData

WISE-SoE_WaterQuality.AggregatedData - CAS_789-02-6 - ug/L
type: Concept
notation: WISE-SoE_WaterQuality.AggregatedData - CAS_789-02-6 - ug/L
definition: The unit of measure for 'CAS_789-02-6' (DDT, o,p') in WISE SoE - Water Quality: Aggregated data table is 'ug/L'
status: valid
status modified: 2019-10-03
accepted date: 2019-10-03
in scheme: Definition of correct units for the observed determinands in the given WISE SoE DD tables
has determinand: CAS 789-02-6
has uom: ug.L-1
has table: WISE-SoE WaterQuality.AggregatedData

WISE-SoE_WaterQuality.AggregatedData - CAS_79-00-5 - ug/L
type: Concept
notation: WISE-SoE_WaterQuality.AggregatedData - CAS_79-00-5 - ug/L
definition: The unit of measure for 'CAS_79-00-5' (1,1,2-trichloroethane) in WISE SoE - Water Quality: Aggregated data table is 'ug/L'
status: valid
status modified: 2019-10-03
accepted date: 2019-10-03
in scheme: Definition of correct units for the observed determinands in the given WISE SoE DD tables
has determinand: CAS 79-00-5
has uom: ug.L-1
has table: WISE-SoE WaterQuality.AggregatedData

WISE-SoE_WaterQuality.AggregatedData - CAS_79-01-6 - ug/L
type: Concept
notation: WISE-SoE_WaterQuality.AggregatedData - CAS_79-01-6 - ug/L
definition: The unit of measure for 'CAS_79-01-6' (Trichloroethylene) in WISE SoE - Water Quality: Aggregated data table is 'ug/L'
status: valid
status modified: 2019-10-03
accepted date: 2019-10-03
in scheme: Definition of correct units for the observed determinands in the given WISE SoE DD tables
has determinand: CAS 79-01-6
has uom: ug.L-1
has table: WISE-SoE WaterQuality.AggregatedData

WISE-SoE_WaterQuality.AggregatedData - CAS_79-06-1 - ug/L
type: Concept
notation: WISE-SoE_WaterQuality.AggregatedData - CAS_79-06-1 - ug/L
definition: The unit of measure for 'CAS_79-06-1' (Acrylamide) in WISE SoE - Water Quality: Aggregated data table is 'ug/L'
status: valid
status modified: 2019-10-03
accepted date: 2019-10-03
in scheme: Definition of correct units for the observed determinands in the given WISE SoE DD tables
has determinand: CAS 79-06-1
has uom: ug.L-1
has table: WISE-SoE WaterQuality.AggregatedData

WISE-SoE_WaterQuality.AggregatedData - CAS_79-11-8 - ug/L
type: Concept
notation: WISE-SoE_WaterQuality.AggregatedData - CAS_79-11-8 - ug/L
definition: The unit of measure for 'CAS_79-11-8' (Chloroacetic acid) in WISE SoE - Water Quality: Aggregated data table is 'ug/L'
status: valid
status modified: 2019-10-03
accepted date: 2019-10-03
in scheme: Definition of correct units for the observed determinands in the given WISE SoE DD tables
has determinand: CAS 79-11-8
has uom: ug.L-1
has table: WISE-SoE WaterQuality.AggregatedData

WISE-SoE_WaterQuality.AggregatedData - CAS_79-34-5 - ug/L
type: Concept
notation: WISE-SoE_WaterQuality.AggregatedData - CAS_79-34-5 - ug/L
definition: The unit of measure for 'CAS_79-34-5' (1,1,2,2-tetrachloroethane) in WISE SoE - Water Quality: Aggregated data table is 'ug/L'
status: valid
status modified: 2019-10-03
accepted date: 2019-10-03
in scheme: Definition of correct units for the observed determinands in the given WISE SoE DD tables
has determinand: CAS 79-34-5
has uom: ug.L-1
has table: WISE-SoE WaterQuality.AggregatedData

WISE-SoE_WaterQuality.AggregatedData - CAS_79-43-6 - ug/L
type: Concept
notation: WISE-SoE_WaterQuality.AggregatedData - CAS_79-43-6 - ug/L
definition: The unit of measure for 'CAS_79-43-6' (Dichloroacetic acid) in WISE SoE - Water Quality: Aggregated data table is 'ug/L'
status: valid
status modified: 2019-10-03
accepted date: 2019-10-03
in scheme: Definition of correct units for the observed determinands in the given WISE SoE DD tables
has determinand: CAS 79-43-6
has uom: ug.L-1
has table: WISE-SoE WaterQuality.AggregatedData

WISE-SoE_WaterQuality.AggregatedData - CAS_79-57-2 - ug/L
type: Concept
notation: WISE-SoE_WaterQuality.AggregatedData - CAS_79-57-2 - ug/L
definition: The unit of measure for 'CAS_79-57-2' (Oxytetracycline) in WISE SoE - Water Quality: Aggregated data table is 'ug/L'
status: valid
status modified: 2019-10-03
accepted date: 2019-10-03
in scheme: Definition of correct units for the observed determinands in the given WISE SoE DD tables
has determinand: CAS 79-57-2
has uom: ug.L-1
has table: WISE-SoE WaterQuality.AggregatedData

WISE-SoE_WaterQuality.AggregatedData - CAS_79-94-7 - ug/L
type: Concept
notation: WISE-SoE_WaterQuality.AggregatedData - CAS_79-94-7 - ug/L
definition: The unit of measure for 'CAS_79-94-7' (Tetrabromobisphenol A (TBBP-A)) in WISE SoE - Water Quality: Aggregated data table is 'ug/L'
status: valid
status modified: 2019-10-03
accepted date: 2019-10-03
in scheme: Definition of correct units for the observed determinands in the given WISE SoE DD tables
has determinand: CAS 79-94-7
has uom: ug.L-1
has table: WISE-SoE WaterQuality.AggregatedData

WISE-SoE_WaterQuality.AggregatedData - CAS_79241-46-6 - ug/L
type: Concept
notation: WISE-SoE_WaterQuality.AggregatedData - CAS_79241-46-6 - ug/L
definition: The unit of measure for 'CAS_79241-46-6' (Fluazifop-P-butyl) in WISE SoE - Water Quality: Aggregated data table is 'ug/L'
status: valid
status modified: 2019-10-03
accepted date: 2019-10-03
in scheme: Definition of correct units for the observed determinands in the given WISE SoE DD tables
has determinand: CAS 79241-46-6
has uom: ug.L-1
has table: WISE-SoE WaterQuality.AggregatedData

WISE-SoE_WaterQuality.AggregatedData - CAS_79277-27-3 - ug/L
type: Concept
notation: WISE-SoE_WaterQuality.AggregatedData - CAS_79277-27-3 - ug/L
definition: The unit of measure for 'CAS_79277-27-3' (Thifensulfuron-methyl) in WISE SoE - Water Quality: Aggregated data table is 'ug/L'
status: valid
status modified: 2019-10-03
accepted date: 2019-10-03
in scheme: Definition of correct units for the observed determinands in the given WISE SoE DD tables
has determinand: CAS 79277-27-3
has uom: ug.L-1
has table: WISE-SoE WaterQuality.AggregatedData

WISE-SoE_WaterQuality.AggregatedData - CAS_793-24-8 - ug/L
type: Concept
notation: WISE-SoE_WaterQuality.AggregatedData - CAS_793-24-8 - ug/L
definition: The unit of measure for 'CAS_793-24-8' (4-(dimethylbutylamino) diphenylamin (6PPD)) in WISE SoE - Water Quality: Aggregated data table is 'ug/L'
status: valid
status modified: 2019-10-03
accepted date: 2019-10-03
in scheme: Definition of correct units for the observed determinands in the given WISE SoE DD tables
has determinand: CAS 793-24-8
has uom: ug.L-1
has table: WISE-SoE WaterQuality.AggregatedData

WISE-SoE_WaterQuality.AggregatedData - CAS_80-05-7 - ug/L
type: Concept
notation: WISE-SoE_WaterQuality.AggregatedData - CAS_80-05-7 - ug/L
definition: The unit of measure for 'CAS_80-05-7' (Bisphenol A) in WISE SoE - Water Quality: Aggregated data table is 'ug/L'
status: valid
status modified: 2019-10-03
accepted date: 2019-10-03
in scheme: Definition of correct units for the observed determinands in the given WISE SoE DD tables
has determinand: CAS 80-05-7
has uom: ug.L-1
has table: WISE-SoE WaterQuality.AggregatedData

WISE-SoE_WaterQuality.AggregatedData - CAS_8001-35-2 - ug/L
type: Concept
notation: WISE-SoE_WaterQuality.AggregatedData - CAS_8001-35-2 - ug/L
definition: The unit of measure for 'CAS_8001-35-2' (Toxaphene) in WISE SoE - Water Quality: Aggregated data table is 'ug/L'
status: valid
status modified: 2019-10-03
accepted date: 2019-10-03
in scheme: Definition of correct units for the observed determinands in the given WISE SoE DD tables
has determinand: CAS 8001-35-2
has uom: ug.L-1
has table: WISE-SoE WaterQuality.AggregatedData

WISE-SoE_WaterQuality.AggregatedData - CAS_8065-48-3 - ug/L
type: Concept
notation: WISE-SoE_WaterQuality.AggregatedData - CAS_8065-48-3 - ug/L
definition: The unit of measure for 'CAS_8065-48-3' (Demeton-O and Demeton-S (mixture)) in WISE SoE - Water Quality: Aggregated data table is 'ug/L'
status: valid
status modified: 2019-10-03
accepted date: 2019-10-03
in scheme: Definition of correct units for the observed determinands in the given WISE SoE DD tables
has determinand: CAS 8065-48-3
has uom: ug.L-1
has table: WISE-SoE WaterQuality.AggregatedData

WISE-SoE_WaterQuality.AggregatedData - CAS_80844-07-1 - ug/L
type: Concept
notation: WISE-SoE_WaterQuality.AggregatedData - CAS_80844-07-1 - ug/L
definition: The unit of measure for 'CAS_80844-07-1' (Etofenprox) in WISE SoE - Water Quality: Aggregated data table is 'ug/L'
status: valid
status modified: 2019-10-03
accepted date: 2019-10-03
in scheme: Definition of correct units for the observed determinands in the given WISE SoE DD tables
has determinand: CAS 80844-07-1
has uom: ug.L-1
has table: WISE-SoE WaterQuality.AggregatedData

WISE-SoE_WaterQuality.AggregatedData - CAS_81-15-2 - ug/L
type: Concept
notation: WISE-SoE_WaterQuality.AggregatedData - CAS_81-15-2 - ug/L
definition: The unit of measure for 'CAS_81-15-2' (Musk xylene) in WISE SoE - Water Quality: Aggregated data table is 'ug/L'
status: valid
status modified: 2019-10-03
accepted date: 2019-10-03
in scheme: Definition of correct units for the observed determinands in the given WISE SoE DD tables
has determinand: CAS 81-15-2
has uom: ug.L-1
has table: WISE-SoE WaterQuality.AggregatedData

WISE-SoE_WaterQuality.AggregatedData - CAS_81103-11-9 - ug/L
type: Concept
notation: WISE-SoE_WaterQuality.AggregatedData - CAS_81103-11-9 - ug/L
definition: The unit of measure for 'CAS_81103-11-9' (Clarithromycin) in WISE SoE - Water Quality: Aggregated data table is 'ug/L'
status: valid
status modified: 2019-10-03
accepted date: 2019-10-03
in scheme: Definition of correct units for the observed determinands in the given WISE SoE DD tables
has determinand: CAS 81103-11-9
has uom: ug.L-1
has table: WISE-SoE WaterQuality.AggregatedData

WISE-SoE_WaterQuality.AggregatedData - CAS_81406-37-3 - ug/L
type: Concept
notation: WISE-SoE_WaterQuality.AggregatedData - CAS_81406-37-3 - ug/L
definition: The unit of measure for 'CAS_81406-37-3' (Fluroxypyr-meptyl) in WISE SoE - Water Quality: Aggregated data table is 'ug/L'
status: valid
status modified: 2019-10-03
accepted date: 2019-10-03
in scheme: Definition of correct units for the observed determinands in the given WISE SoE DD tables
has determinand: CAS 81406-37-3
has uom: ug.L-1
has table: WISE-SoE WaterQuality.AggregatedData

WISE-SoE_WaterQuality.AggregatedData - CAS_81777-89-1 - ug/L
type: Concept
notation: WISE-SoE_WaterQuality.AggregatedData - CAS_81777-89-1 - ug/L
definition: The unit of measure for 'CAS_81777-89-1' (Clomazone) in WISE SoE - Water Quality: Aggregated data table is 'ug/L'
status: valid
status modified: 2019-10-03
accepted date: 2019-10-03
in scheme: Definition of correct units for the observed determinands in the given WISE SoE DD tables
has determinand: CAS 81777-89-1
has uom: ug.L-1
has table: WISE-SoE WaterQuality.AggregatedData

WISE-SoE_WaterQuality.AggregatedData - CAS_82-68-8 - ug/L
type: Concept
notation: WISE-SoE_WaterQuality.AggregatedData - CAS_82-68-8 - ug/L
definition: The unit of measure for 'CAS_82-68-8' (Quintozene) in WISE SoE - Water Quality: Aggregated data table is 'ug/L'
status: valid
status modified: 2019-10-03
accepted date: 2019-10-03
in scheme: Definition of correct units for the observed determinands in the given WISE SoE DD tables
has determinand: CAS 82-68-8
has uom: ug.L-1
has table: WISE-SoE WaterQuality.AggregatedData

WISE-SoE_WaterQuality.AggregatedData - CAS_82097-50-5 - ug/L
type: Concept
notation: WISE-SoE_WaterQuality.AggregatedData - CAS_82097-50-5 - ug/L
definition: The unit of measure for 'CAS_82097-50-5' (Triasulfuron) in WISE SoE - Water Quality: Aggregated data table is 'ug/L'
status: valid
status modified: 2019-10-03
accepted date: 2019-10-03
in scheme: Definition of correct units for the observed determinands in the given WISE SoE DD tables
has determinand: CAS 82097-50-5
has uom: ug.L-1
has table: WISE-SoE WaterQuality.AggregatedData

WISE-SoE_WaterQuality.AggregatedData - CAS_82558-50-7 - ug/L
type: Concept
notation: WISE-SoE_WaterQuality.AggregatedData - CAS_82558-50-7 - ug/L
definition: The unit of measure for 'CAS_82558-50-7' (Benzamide) in WISE SoE - Water Quality: Aggregated data table is 'ug/L'
status: valid
status modified: 2019-10-03
accepted date: 2019-10-03
in scheme: Definition of correct units for the observed determinands in the given WISE SoE DD tables
has determinand: CAS 82558-50-7
has uom: ug.L-1
has table: WISE-SoE WaterQuality.AggregatedData

WISE-SoE_WaterQuality.AggregatedData - CAS_83-32-9 - ug/L
type: Concept
notation: WISE-SoE_WaterQuality.AggregatedData - CAS_83-32-9 - ug/L
definition: The unit of measure for 'CAS_83-32-9' (Acenaphthene) in WISE SoE - Water Quality: Aggregated data table is 'ug/L'
status: valid
status modified: 2019-10-03
accepted date: 2019-10-03
in scheme: Definition of correct units for the observed determinands in the given WISE SoE DD tables
has determinand: CAS 83-32-9
has uom: ug.L-1
has table: WISE-SoE WaterQuality.AggregatedData

WISE-SoE_WaterQuality.AggregatedData - CAS_83-42-1 - ug/L
type: Concept
notation: WISE-SoE_WaterQuality.AggregatedData - CAS_83-42-1 - ug/L
definition: The unit of measure for 'CAS_83-42-1' (2-chloro-6-nitrotoluene) in WISE SoE - Water Quality: Aggregated data table is 'ug/L'
status: valid
status modified: 2019-10-03
accepted date: 2019-10-03
in scheme: Definition of correct units for the observed determinands in the given WISE SoE DD tables
has determinand: CAS 83-42-1
has uom: ug.L-1
has table: WISE-SoE WaterQuality.AggregatedData

WISE-SoE_WaterQuality.AggregatedData - CAS_83055-99-6 - ug/L
type: Concept
notation: WISE-SoE_WaterQuality.AggregatedData - CAS_83055-99-6 - ug/L
definition: The unit of measure for 'CAS_83055-99-6' (Bensulfuron-methyl) in WISE SoE - Water Quality: Aggregated data table is 'ug/L'
status: valid
status modified: 2019-10-03
accepted date: 2019-10-03
in scheme: Definition of correct units for the observed determinands in the given WISE SoE DD tables
has determinand: CAS 83055-99-6
has uom: ug.L-1
has table: WISE-SoE WaterQuality.AggregatedData

WISE-SoE_WaterQuality.AggregatedData - CAS_83164-33-4 - ug/L
type: Concept
notation: WISE-SoE_WaterQuality.AggregatedData - CAS_83164-33-4 - ug/L
definition: The unit of measure for 'CAS_83164-33-4' (Diflufenican) in WISE SoE - Water Quality: Aggregated data table is 'ug/L'
status: valid
status modified: 2019-10-03
accepted date: 2019-10-03
in scheme: Definition of correct units for the observed determinands in the given WISE SoE DD tables
has determinand: CAS 83164-33-4
has uom: ug.L-1
has table: WISE-SoE WaterQuality.AggregatedData

WISE-SoE_WaterQuality.AggregatedData - CAS_834-12-8 - ug/L
type: Concept
notation: WISE-SoE_WaterQuality.AggregatedData - CAS_834-12-8 - ug/L
definition: The unit of measure for 'CAS_834-12-8' (Ametryn) in WISE SoE - Water Quality: Aggregated data table is 'ug/L'
status: valid
status modified: 2019-10-03
accepted date: 2019-10-03
in scheme: Definition of correct units for the observed determinands in the given WISE SoE DD tables
has determinand: CAS 834-12-8
has uom: ug.L-1
has table: WISE-SoE WaterQuality.AggregatedData

WISE-SoE_WaterQuality.AggregatedData - CAS_83905-01-5 - ug/L
type: Concept
notation: WISE-SoE_WaterQuality.AggregatedData - CAS_83905-01-5 - ug/L
definition: The unit of measure for 'CAS_83905-01-5' (Azitromycin) in WISE SoE - Water Quality: Aggregated data table is 'ug/L'
status: valid
status modified: 2019-10-03
accepted date: 2019-10-03
in scheme: Definition of correct units for the observed determinands in the given WISE SoE DD tables
has determinand: CAS 83905-01-5
has uom: ug.L-1
has table: WISE-SoE WaterQuality.AggregatedData

WISE-SoE_WaterQuality.AggregatedData - CAS_84-66-2 - ug/L
type: Concept
notation: WISE-SoE_WaterQuality.AggregatedData - CAS_84-66-2 - ug/L
definition: The unit of measure for 'CAS_84-66-2' (Di-ethyl phthalate) in WISE SoE - Water Quality: Aggregated data table is 'ug/L'
status: valid
status modified: 2019-10-03
accepted date: 2019-10-03
in scheme: Definition of correct units for the observed determinands in the given WISE SoE DD tables
has determinand: CAS 84-66-2
has uom: ug.L-1
has table: WISE-SoE WaterQuality.AggregatedData

WISE-SoE_WaterQuality.AggregatedData - CAS_84-69-5 - ug/L
type: Concept
notation: WISE-SoE_WaterQuality.AggregatedData - CAS_84-69-5 - ug/L
definition: The unit of measure for 'CAS_84-69-5' (Di-iso-butyl phthalate) in WISE SoE - Water Quality: Aggregated data table is 'ug/L'
status: valid
status modified: 2019-10-03
accepted date: 2019-10-03
in scheme: Definition of correct units for the observed determinands in the given WISE SoE DD tables
has determinand: CAS 84-69-5
has uom: ug.L-1
has table: WISE-SoE WaterQuality.AggregatedData

WISE-SoE_WaterQuality.AggregatedData - CAS_84-74-2 - ug/L
type: Concept
notation: WISE-SoE_WaterQuality.AggregatedData - CAS_84-74-2 - ug/L
definition: The unit of measure for 'CAS_84-74-2' (Dibutylphthalate) in WISE SoE - Water Quality: Aggregated data table is 'ug/L'
status: valid
status modified: 2019-10-03
accepted date: 2019-10-03
in scheme: Definition of correct units for the observed determinands in the given WISE SoE DD tables
has determinand: CAS 84-74-2
has uom: ug.L-1
has table: WISE-SoE WaterQuality.AggregatedData

WISE-SoE_WaterQuality.AggregatedData - CAS_84852-15-3 - ug/L
type: Concept
notation: WISE-SoE_WaterQuality.AggregatedData - CAS_84852-15-3 - ug/L
definition: The unit of measure for 'CAS_84852-15-3' (4-nonylphenol, branched) in WISE SoE - Water Quality: Aggregated data table is 'ug/L'
status: valid
status modified: 2019-10-03
accepted date: 2019-10-03
in scheme: Definition of correct units for the observed determinands in the given WISE SoE DD tables
has determinand: CAS 84852-15-3
has uom: ug.L-1
has table: WISE-SoE WaterQuality.AggregatedData

WISE-SoE_WaterQuality.AggregatedData - CAS_85-01-8 - ug/L
type: Concept
notation: WISE-SoE_WaterQuality.AggregatedData - CAS_85-01-8 - ug/L
definition: The unit of measure for 'CAS_85-01-8' (Phenanthrene) in WISE SoE - Water Quality: Aggregated data table is 'ug/L'
status: valid
status modified: 2019-10-03
accepted date: 2019-10-03
in scheme: Definition of correct units for the observed determinands in the given WISE SoE DD tables
has determinand: CAS 85-01-8
has uom: ug.L-1
has table: WISE-SoE WaterQuality.AggregatedData

WISE-SoE_WaterQuality.AggregatedData - CAS_85-22-3 - ug/L
type: Concept
notation: WISE-SoE_WaterQuality.AggregatedData - CAS_85-22-3 - ug/L
definition: The unit of measure for 'CAS_85-22-3' (Pentabromoethylbenzene) in WISE SoE - Water Quality: Aggregated data table is 'ug/L'
status: valid
status modified: 2019-10-03
accepted date: 2019-10-03
in scheme: Definition of correct units for the observed determinands in the given WISE SoE DD tables
has determinand: CAS 85-22-3
has uom: ug.L-1
has table: WISE-SoE WaterQuality.AggregatedData

WISE-SoE_WaterQuality.AggregatedData - CAS_85-68-7 - ug/L
type: Concept
notation: WISE-SoE_WaterQuality.AggregatedData - CAS_85-68-7 - ug/L
definition: The unit of measure for 'CAS_85-68-7' (Butyl benzyl phthalate (BBP)) in WISE SoE - Water Quality: Aggregated data table is 'ug/L'
status: valid
status modified: 2019-10-03
accepted date: 2019-10-03
in scheme: Definition of correct units for the observed determinands in the given WISE SoE DD tables
has determinand: CAS 85-68-7
has uom: ug.L-1
has table: WISE-SoE WaterQuality.AggregatedData

WISE-SoE_WaterQuality.AggregatedData - CAS_85509-19-9 - ug/L
type: Concept
notation: WISE-SoE_WaterQuality.AggregatedData - CAS_85509-19-9 - ug/L
definition: The unit of measure for 'CAS_85509-19-9' (Flusilazole) in WISE SoE - Water Quality: Aggregated data table is 'ug/L'
status: valid
status modified: 2019-10-03
accepted date: 2019-10-03
in scheme: Definition of correct units for the observed determinands in the given WISE SoE DD tables
has determinand: CAS 85509-19-9
has uom: ug.L-1
has table: WISE-SoE WaterQuality.AggregatedData

WISE-SoE_WaterQuality.AggregatedData - CAS_85535-84-8 - ug/L
type: Concept
notation: WISE-SoE_WaterQuality.AggregatedData - CAS_85535-84-8 - ug/L
definition: The unit of measure for 'CAS_85535-84-8' (Chloroalkanes C10-13) in WISE SoE - Water Quality: Aggregated data table is 'ug/L'
status: valid
status modified: 2019-10-03
accepted date: 2019-10-03
in scheme: Definition of correct units for the observed determinands in the given WISE SoE DD tables
has determinand: CAS 85535-84-8
has uom: ug.L-1
has table: WISE-SoE WaterQuality.AggregatedData

WISE-SoE_WaterQuality.AggregatedData - CAS_85535-85-9 - ug/L
type: Concept
notation: WISE-SoE_WaterQuality.AggregatedData - CAS_85535-85-9 - ug/L
definition: The unit of measure for 'CAS_85535-85-9' (Chloroalkanes C14-17,MCCP) in WISE SoE - Water Quality: Aggregated data table is 'ug/L'
status: valid
status modified: 2019-10-03
accepted date: 2019-10-03
in scheme: Definition of correct units for the observed determinands in the given WISE SoE DD tables
has determinand: CAS 85535-85-9
has uom: ug.L-1
has table: WISE-SoE WaterQuality.AggregatedData

WISE-SoE_WaterQuality.AggregatedData - CAS_85721-33-1 - ug/L
type: Concept
notation: WISE-SoE_WaterQuality.AggregatedData - CAS_85721-33-1 - ug/L
definition: The unit of measure for 'CAS_85721-33-1' (Ciprofloxacin) in WISE SoE - Water Quality: Aggregated data table is 'ug/L'
status: valid
status modified: 2019-10-03
accepted date: 2019-10-03
in scheme: Definition of correct units for the observed determinands in the given WISE SoE DD tables
has determinand: CAS 85721-33-1
has uom: ug.L-1
has table: WISE-SoE WaterQuality.AggregatedData

WISE-SoE_WaterQuality.AggregatedData - CAS_86-50-0 - ug/L
type: Concept
notation: WISE-SoE_WaterQuality.AggregatedData - CAS_86-50-0 - ug/L
definition: The unit of measure for 'CAS_86-50-0' (Azinphos-methyl) in WISE SoE - Water Quality: Aggregated data table is 'ug/L'
status: valid
status modified: 2019-10-03
accepted date: 2019-10-03
in scheme: Definition of correct units for the observed determinands in the given WISE SoE DD tables
has determinand: CAS 86-50-0
has uom: ug.L-1
has table: WISE-SoE WaterQuality.AggregatedData

WISE-SoE_WaterQuality.AggregatedData - CAS_86-73-7 - ug/L
type: Concept
notation: WISE-SoE_WaterQuality.AggregatedData - CAS_86-73-7 - ug/L
definition: The unit of measure for 'CAS_86-73-7' (Fluorene) in WISE SoE - Water Quality: Aggregated data table is 'ug/L'
status: valid
status modified: 2019-10-03
accepted date: 2019-10-03
in scheme: Definition of correct units for the observed determinands in the given WISE SoE DD tables
has determinand: CAS 86-73-7
has uom: ug.L-1
has table: WISE-SoE WaterQuality.AggregatedData

WISE-SoE_WaterQuality.AggregatedData - CAS_86209-51-0 - ug/L
type: Concept
notation: WISE-SoE_WaterQuality.AggregatedData - CAS_86209-51-0 - ug/L
definition: The unit of measure for 'CAS_86209-51-0' (Primisulfuron-methyl) in WISE SoE - Water Quality: Aggregated data table is 'ug/L'
status: valid
status modified: 2019-10-03
accepted date: 2019-10-03
in scheme: Definition of correct units for the observed determinands in the given WISE SoE DD tables
has determinand: CAS 86209-51-0
has uom: ug.L-1
has table: WISE-SoE WaterQuality.AggregatedData

WISE-SoE_WaterQuality.AggregatedData - CAS_87-60-5 - ug/L
type: Concept
notation: WISE-SoE_WaterQuality.AggregatedData - CAS_87-60-5 - ug/L
definition: The unit of measure for 'CAS_87-60-5' (3-chloro-o-toluidine) in WISE SoE - Water Quality: Aggregated data table is 'ug/L'
status: valid
status modified: 2019-10-03
accepted date: 2019-10-03
in scheme: Definition of correct units for the observed determinands in the given WISE SoE DD tables
has determinand: CAS 87-60-5
has uom: ug.L-1
has table: WISE-SoE WaterQuality.AggregatedData

WISE-SoE_WaterQuality.AggregatedData - CAS_87-61-6 - ug/L
type: Concept
notation: WISE-SoE_WaterQuality.AggregatedData - CAS_87-61-6 - ug/L
definition: The unit of measure for 'CAS_87-61-6' (1,2,3-trichlorobenzene) in WISE SoE - Water Quality: Aggregated data table is 'ug/L'
status: valid
status modified: 2019-10-03
accepted date: 2019-10-03
in scheme: Definition of correct units for the observed determinands in the given WISE SoE DD tables
has determinand: CAS 87-61-6
has uom: ug.L-1
has table: WISE-SoE WaterQuality.AggregatedData

WISE-SoE_WaterQuality.AggregatedData - CAS_87-65-0 - ug/L
type: Concept
notation: WISE-SoE_WaterQuality.AggregatedData - CAS_87-65-0 - ug/L
definition: The unit of measure for 'CAS_87-65-0' (2,6-dichlorophenol) in WISE SoE - Water Quality: Aggregated data table is 'ug/L'
status: valid
status modified: 2019-10-03
accepted date: 2019-10-03
in scheme: Definition of correct units for the observed determinands in the given WISE SoE DD tables
has determinand: CAS 87-65-0
has uom: ug.L-1
has table: WISE-SoE WaterQuality.AggregatedData

WISE-SoE_WaterQuality.AggregatedData - CAS_87-68-3 - ug/L
type: Concept
notation: WISE-SoE_WaterQuality.AggregatedData - CAS_87-68-3 - ug/L
definition: The unit of measure for 'CAS_87-68-3' (Hexachlorobutadiene) in WISE SoE - Water Quality: Aggregated data table is 'ug/L'
status: valid
status modified: 2019-10-03
accepted date: 2019-10-03
in scheme: Definition of correct units for the observed determinands in the given WISE SoE DD tables
has determinand: CAS 87-68-3
has uom: ug.L-1
has table: WISE-SoE WaterQuality.AggregatedData

WISE-SoE_WaterQuality.AggregatedData - CAS_87-86-5 - ug/L
type: Concept
notation: WISE-SoE_WaterQuality.AggregatedData - CAS_87-86-5 - ug/L
definition: The unit of measure for 'CAS_87-86-5' (Pentachlorophenol) in WISE SoE - Water Quality: Aggregated data table is 'ug/L'
status: valid
status modified: 2019-10-03
accepted date: 2019-10-03
in scheme: Definition of correct units for the observed determinands in the given WISE SoE DD tables
has determinand: CAS 87-86-5
has uom: ug.L-1
has table: WISE-SoE WaterQuality.AggregatedData

WISE-SoE_WaterQuality.AggregatedData - CAS_87674-68-8 - ug/L
type: Concept
notation: WISE-SoE_WaterQuality.AggregatedData - CAS_87674-68-8 - ug/L
definition: The unit of measure for 'CAS_87674-68-8' (Dimethenamid) in WISE SoE - Water Quality: Aggregated data table is 'ug/L'
status: valid
status modified: 2019-10-03
accepted date: 2019-10-03
in scheme: Definition of correct units for the observed determinands in the given WISE SoE DD tables
has determinand: CAS 87674-68-8
has uom: ug.L-1
has table: WISE-SoE WaterQuality.AggregatedData

WISE-SoE_WaterQuality.AggregatedData - CAS_87820-88-0 - ug/L
type: Concept
notation: WISE-SoE_WaterQuality.AggregatedData - CAS_87820-88-0 - ug/L
definition: The unit of measure for 'CAS_87820-88-0' (Tralkoxydim) in WISE SoE - Water Quality: Aggregated data table is 'ug/L'
status: valid
status modified: 2019-10-03
accepted date: 2019-10-03
in scheme: Definition of correct units for the observed determinands in the given WISE SoE DD tables
has determinand: CAS 87820-88-0
has uom: ug.L-1
has table: WISE-SoE WaterQuality.AggregatedData

WISE-SoE_WaterQuality.AggregatedData - CAS_88-06-2 - ug/L
type: Concept
notation: WISE-SoE_WaterQuality.AggregatedData - CAS_88-06-2 - ug/L
definition: The unit of measure for 'CAS_88-06-2' (2,4,6-trichlorophenol) in WISE SoE - Water Quality: Aggregated data table is 'ug/L'
status: valid
status modified: 2019-10-03
accepted date: 2019-10-03
in scheme: Definition of correct units for the observed determinands in the given WISE SoE DD tables
has determinand: CAS 88-06-2
has uom: ug.L-1
has table: WISE-SoE WaterQuality.AggregatedData

WISE-SoE_WaterQuality.AggregatedData - CAS_88-73-3 - ug/L
type: Concept
notation: WISE-SoE_WaterQuality.AggregatedData - CAS_88-73-3 - ug/L
definition: The unit of measure for 'CAS_88-73-3' (1-chloro-2-nitrobenzene) in WISE SoE - Water Quality: Aggregated data table is 'ug/L'
status: valid
status modified: 2019-10-03
accepted date: 2019-10-03
in scheme: Definition of correct units for the observed determinands in the given WISE SoE DD tables
has determinand: CAS 88-73-3
has uom: ug.L-1
has table: WISE-SoE WaterQuality.AggregatedData

WISE-SoE_WaterQuality.AggregatedData - CAS_88-85-7 - ug/L
type: Concept
notation: WISE-SoE_WaterQuality.AggregatedData - CAS_88-85-7 - ug/L
definition: The unit of measure for 'CAS_88-85-7' (Dinoseb) in WISE SoE - Water Quality: Aggregated data table is 'ug/L'
status: valid
status modified: 2019-10-03
accepted date: 2019-10-03
in scheme: Definition of correct units for the observed determinands in the given WISE SoE DD tables
has determinand: CAS 88-85-7
has uom: ug.L-1
has table: WISE-SoE WaterQuality.AggregatedData

WISE-SoE_WaterQuality.AggregatedData - CAS_886-50-0 - ug/L
type: Concept
notation: WISE-SoE_WaterQuality.AggregatedData - CAS_886-50-0 - ug/L
definition: The unit of measure for 'CAS_886-50-0' (Terbutryn) in WISE SoE - Water Quality: Aggregated data table is 'ug/L'
status: valid
status modified: 2019-10-03
accepted date: 2019-10-03
in scheme: Definition of correct units for the observed determinands in the given WISE SoE DD tables
has determinand: CAS 886-50-0
has uom: ug.L-1
has table: WISE-SoE WaterQuality.AggregatedData

WISE-SoE_WaterQuality.AggregatedData - CAS_88671-89-0 - ug/L
type: Concept
notation: WISE-SoE_WaterQuality.AggregatedData - CAS_88671-89-0 - ug/L
definition: The unit of measure for 'CAS_88671-89-0' (Myclobutanil) in WISE SoE - Water Quality: Aggregated data table is 'ug/L'
status: valid
status modified: 2019-10-03
accepted date: 2019-10-03
in scheme: Definition of correct units for the observed determinands in the given WISE SoE DD tables
has determinand: CAS 88671-89-0
has uom: ug.L-1
has table: WISE-SoE WaterQuality.AggregatedData

WISE-SoE_WaterQuality.AggregatedData - CAS_89-21-4 - ug/L
type: Concept
notation: WISE-SoE_WaterQuality.AggregatedData - CAS_89-21-4 - ug/L
definition: The unit of measure for 'CAS_89-21-4' (4-chloro-2-nitroanisole) in WISE SoE - Water Quality: Aggregated data table is 'ug/L'
status: valid
status modified: 2019-10-03
accepted date: 2019-10-03
in scheme: Definition of correct units for the observed determinands in the given WISE SoE DD tables
has determinand: CAS 89-21-4
has uom: ug.L-1
has table: WISE-SoE WaterQuality.AggregatedData

WISE-SoE_WaterQuality.AggregatedData - CAS_89-59-8 - ug/L
type: Concept
notation: WISE-SoE_WaterQuality.AggregatedData - CAS_89-59-8 - ug/L
definition: The unit of measure for 'CAS_89-59-8' (4-Chloro-2-nitrotoluene) in WISE SoE - Water Quality: Aggregated data table is 'ug/L'
status: valid
status modified: 2019-10-03
accepted date: 2019-10-03
in scheme: Definition of correct units for the observed determinands in the given WISE SoE DD tables
has determinand: CAS 89-59-8
has uom: ug.L-1
has table: WISE-SoE WaterQuality.AggregatedData

WISE-SoE_WaterQuality.AggregatedData - CAS_89-60-1 - ug/L
type: Concept
notation: WISE-SoE_WaterQuality.AggregatedData - CAS_89-60-1 - ug/L
definition: The unit of measure for 'CAS_89-60-1' (4-chloro-3-nitrotoluene) in WISE SoE - Water Quality: Aggregated data table is 'ug/L'
status: valid
status modified: 2019-10-03
accepted date: 2019-10-03
in scheme: Definition of correct units for the observed determinands in the given WISE SoE DD tables
has determinand: CAS 89-60-1
has uom: ug.L-1
has table: WISE-SoE WaterQuality.AggregatedData

WISE-SoE_WaterQuality.AggregatedData - CAS_89-61-2 - ug/L
type: Concept
notation: WISE-SoE_WaterQuality.AggregatedData - CAS_89-61-2 - ug/L
definition: The unit of measure for 'CAS_89-61-2' (1,4-dichloro-2-nitrobenzene) in WISE SoE - Water Quality: Aggregated data table is 'ug/L'
status: valid
status modified: 2019-10-03
accepted date: 2019-10-03
in scheme: Definition of correct units for the observed determinands in the given WISE SoE DD tables
has determinand: CAS 89-61-2
has uom: ug.L-1
has table: WISE-SoE WaterQuality.AggregatedData

WISE-SoE_WaterQuality.AggregatedData - CAS_89-63-4 - ug/L
type: Concept
notation: WISE-SoE_WaterQuality.AggregatedData - CAS_89-63-4 - ug/L
definition: The unit of measure for 'CAS_89-63-4' (4-chloro-2-nitroaniline) in WISE SoE - Water Quality: Aggregated data table is 'ug/L'
status: valid
status modified: 2019-10-03
accepted date: 2019-10-03
in scheme: Definition of correct units for the observed determinands in the given WISE SoE DD tables
has determinand: CAS 89-63-4
has uom: ug.L-1
has table: WISE-SoE WaterQuality.AggregatedData

WISE-SoE_WaterQuality.AggregatedData - CAS_90-12-0 - ug/L
type: Concept
notation: WISE-SoE_WaterQuality.AggregatedData - CAS_90-12-0 - ug/L
definition: The unit of measure for 'CAS_90-12-0' (1-methylnaphthalene) in WISE SoE - Water Quality: Aggregated data table is 'ug/L'
status: valid
status modified: 2019-10-03
accepted date: 2019-10-03
in scheme: Definition of correct units for the observed determinands in the given WISE SoE DD tables
has determinand: CAS 90-12-0
has uom: ug.L-1
has table: WISE-SoE WaterQuality.AggregatedData

WISE-SoE_WaterQuality.AggregatedData - CAS_90-13-1 - ug/L
type: Concept
notation: WISE-SoE_WaterQuality.AggregatedData - CAS_90-13-1 - ug/L
definition: The unit of measure for 'CAS_90-13-1' (1-Chloronaphthalene) in WISE SoE - Water Quality: Aggregated data table is 'ug/L'
status: valid
status modified: 2019-10-03
accepted date: 2019-10-03
in scheme: Definition of correct units for the observed determinands in the given WISE SoE DD tables
has determinand: CAS 90-13-1
has uom: ug.L-1
has table: WISE-SoE WaterQuality.AggregatedData

WISE-SoE_WaterQuality.AggregatedData - CAS_9016-45-9 - ug/L
type: Concept
notation: WISE-SoE_WaterQuality.AggregatedData - CAS_9016-45-9 - ug/L
definition: The unit of measure for 'CAS_9016-45-9' (Nonylphenol ethoxylate) in WISE SoE - Water Quality: Aggregated data table is 'ug/L'
status: valid
status modified: 2019-10-03
accepted date: 2019-10-03
in scheme: Definition of correct units for the observed determinands in the given WISE SoE DD tables
has determinand: CAS 9016-45-9
has uom: ug.L-1
has table: WISE-SoE WaterQuality.AggregatedData

WISE-SoE_WaterQuality.AggregatedData - CAS_91-20-3 - ug/L
type: Concept
notation: WISE-SoE_WaterQuality.AggregatedData - CAS_91-20-3 - ug/L
definition: The unit of measure for 'CAS_91-20-3' (Naphthalene) in WISE SoE - Water Quality: Aggregated data table is 'ug/L'
status: valid
status modified: 2019-10-03
accepted date: 2019-10-03
in scheme: Definition of correct units for the observed determinands in the given WISE SoE DD tables
has determinand: CAS 91-20-3
has uom: ug.L-1
has table: WISE-SoE WaterQuality.AggregatedData

WISE-SoE_WaterQuality.AggregatedData - CAS_91-57-6 - ug/L
type: Concept
notation: WISE-SoE_WaterQuality.AggregatedData - CAS_91-57-6 - ug/L
definition: The unit of measure for 'CAS_91-57-6' (2-methylnaphthalene) in WISE SoE - Water Quality: Aggregated data table is 'ug/L'
status: valid
status modified: 2019-10-03
accepted date: 2019-10-03
in scheme: Definition of correct units for the observed determinands in the given WISE SoE DD tables
has determinand: CAS 91-57-6
has uom: ug.L-1
has table: WISE-SoE WaterQuality.AggregatedData

WISE-SoE_WaterQuality.AggregatedData - CAS_91-94-1 - ug/L
type: Concept
notation: WISE-SoE_WaterQuality.AggregatedData - CAS_91-94-1 - ug/L
definition: The unit of measure for 'CAS_91-94-1' (3,3'-dichlorobenzidine) in WISE SoE - Water Quality: Aggregated data table is 'ug/L'
status: valid
status modified: 2019-10-03
accepted date: 2019-10-03
in scheme: Definition of correct units for the observed determinands in the given WISE SoE DD tables
has determinand: CAS 91-94-1
has uom: ug.L-1
has table: WISE-SoE WaterQuality.AggregatedData

WISE-SoE_WaterQuality.AggregatedData - CAS_919-86-8 - ug/L
type: Concept
notation: WISE-SoE_WaterQuality.AggregatedData - CAS_919-86-8 - ug/L
definition: The unit of measure for 'CAS_919-86-8' (Demeton-S-methyl) in WISE SoE - Water Quality: Aggregated data table is 'ug/L'
status: valid
status modified: 2019-10-03
accepted date: 2019-10-03
in scheme: Definition of correct units for the observed determinands in the given WISE SoE DD tables
has determinand: CAS 919-86-8
has uom: ug.L-1
has table: WISE-SoE WaterQuality.AggregatedData

WISE-SoE_WaterQuality.AggregatedData - CAS_92-52-4 - ug/L
type: Concept
notation: WISE-SoE_WaterQuality.AggregatedData - CAS_92-52-4 - ug/L
definition: The unit of measure for 'CAS_92-52-4' (Biphenyl) in WISE SoE - Water Quality: Aggregated data table is 'ug/L'
status: valid
status modified: 2019-10-03
accepted date: 2019-10-03
in scheme: Definition of correct units for the observed determinands in the given WISE SoE DD tables
has determinand: CAS 92-52-4
has uom: ug.L-1
has table: WISE-SoE WaterQuality.AggregatedData

WISE-SoE_WaterQuality.AggregatedData - CAS_92-87-5 - ug/L
type: Concept
notation: WISE-SoE_WaterQuality.AggregatedData - CAS_92-87-5 - ug/L
definition: The unit of measure for 'CAS_92-87-5' (Benzidine) in WISE SoE - Water Quality: Aggregated data table is 'ug/L'
status: valid
status modified: 2019-10-03
accepted date: 2019-10-03
in scheme: Definition of correct units for the observed determinands in the given WISE SoE DD tables
has determinand: CAS 92-87-5
has uom: ug.L-1
has table: WISE-SoE WaterQuality.AggregatedData

WISE-SoE_WaterQuality.AggregatedData - CAS_93-65-2 - ug/L
type: Concept
notation: WISE-SoE_WaterQuality.AggregatedData - CAS_93-65-2 - ug/L
definition: The unit of measure for 'CAS_93-65-2' (Mecoprop) in WISE SoE - Water Quality: Aggregated data table is 'ug/L'
status: valid
status modified: 2019-10-03
accepted date: 2019-10-03
in scheme: Definition of correct units for the observed determinands in the given WISE SoE DD tables
has determinand: CAS 93-65-2
has uom: ug.L-1
has table: WISE-SoE WaterQuality.AggregatedData

WISE-SoE_WaterQuality.AggregatedData - CAS_93-72-1 - ug/L
type: Concept
notation: WISE-SoE_WaterQuality.AggregatedData - CAS_93-72-1 - ug/L
definition: The unit of measure for 'CAS_93-72-1' (Fenoprop) in WISE SoE - Water Quality: Aggregated data table is 'ug/L'
status: valid
status modified: 2019-10-03
accepted date: 2019-10-03
in scheme: Definition of correct units for the observed determinands in the given WISE SoE DD tables
has determinand: CAS 93-72-1
has uom: ug.L-1
has table: WISE-SoE WaterQuality.AggregatedData

WISE-SoE_WaterQuality.AggregatedData - CAS_93-76-5 - ug/L
type: Concept
notation: WISE-SoE_WaterQuality.AggregatedData - CAS_93-76-5 - ug/L
definition: The unit of measure for 'CAS_93-76-5' (2,4,5-T) in WISE SoE - Water Quality: Aggregated data table is 'ug/L'
status: valid
status modified: 2019-10-03
accepted date: 2019-10-03
in scheme: Definition of correct units for the observed determinands in the given WISE SoE DD tables
has determinand: CAS 93-76-5
has uom: ug.L-1
has table: WISE-SoE WaterQuality.AggregatedData

WISE-SoE_WaterQuality.AggregatedData - CAS_933-75-5 - ug/L
type: Concept
notation: WISE-SoE_WaterQuality.AggregatedData - CAS_933-75-5 - ug/L
definition: The unit of measure for 'CAS_933-75-5' (2,3,6-Trichlorophenol) in WISE SoE - Water Quality: Aggregated data table is 'ug/L'
status: valid
status modified: 2019-10-03
accepted date: 2019-10-03
in scheme: Definition of correct units for the observed determinands in the given WISE SoE DD tables
has determinand: CAS 933-75-5
has uom: ug.L-1
has table: WISE-SoE WaterQuality.AggregatedData

WISE-SoE_WaterQuality.AggregatedData - CAS_933-78-8 - ug/L
type: Concept
notation: WISE-SoE_WaterQuality.AggregatedData - CAS_933-78-8 - ug/L
definition: The unit of measure for 'CAS_933-78-8' (2,3,5-trichlorophenol) in WISE SoE - Water Quality: Aggregated data table is 'ug/L'
status: valid
status modified: 2019-10-03
accepted date: 2019-10-03
in scheme: Definition of correct units for the observed determinands in the given WISE SoE DD tables
has determinand: CAS 933-78-8
has uom: ug.L-1
has table: WISE-SoE WaterQuality.AggregatedData

WISE-SoE_WaterQuality.AggregatedData - CAS_94-74-6 - ug/L
type: Concept
notation: WISE-SoE_WaterQuality.AggregatedData - CAS_94-74-6 - ug/L
definition: The unit of measure for 'CAS_94-74-6' (MCPA) in WISE SoE - Water Quality: Aggregated data table is 'ug/L'
status: valid
status modified: 2019-10-03
accepted date: 2019-10-03
in scheme: Definition of correct units for the observed determinands in the given WISE SoE DD tables
has determinand: CAS 94-74-6
has uom: ug.L-1
has table: WISE-SoE WaterQuality.AggregatedData

WISE-SoE_WaterQuality.AggregatedData - CAS_94-75-7 - ug/L
type: Concept
notation: WISE-SoE_WaterQuality.AggregatedData - CAS_94-75-7 - ug/L
definition: The unit of measure for 'CAS_94-75-7' (2,4-dichlorophenoxyacetic acid, 2-4 D) in WISE SoE - Water Quality: Aggregated data table is 'ug/L'
status: valid
status modified: 2019-10-03
accepted date: 2019-10-03
in scheme: Definition of correct units for the observed determinands in the given WISE SoE DD tables
has determinand: CAS 94-75-7
has uom: ug.L-1
has table: WISE-SoE WaterQuality.AggregatedData

WISE-SoE_WaterQuality.AggregatedData - CAS_94-81-5 - ug/L
type: Concept
notation: WISE-SoE_WaterQuality.AggregatedData - CAS_94-81-5 - ug/L
definition: The unit of measure for 'CAS_94-81-5' (MCPB) in WISE SoE - Water Quality: Aggregated data table is 'ug/L'
status: valid
status modified: 2019-10-03
accepted date: 2019-10-03
in scheme: Definition of correct units for the observed determinands in the given WISE SoE DD tables
has determinand: CAS 94-81-5
has uom: ug.L-1
has table: WISE-SoE WaterQuality.AggregatedData

WISE-SoE_WaterQuality.AggregatedData - CAS_94-82-6 - ug/L
type: Concept
notation: WISE-SoE_WaterQuality.AggregatedData - CAS_94-82-6 - ug/L
definition: The unit of measure for 'CAS_94-82-6' (2,4-DB) in WISE SoE - Water Quality: Aggregated data table is 'ug/L'
status: valid
status modified: 2019-10-03
accepted date: 2019-10-03
in scheme: Definition of correct units for the observed determinands in the given WISE SoE DD tables
has determinand: CAS 94-82-6
has uom: ug.L-1
has table: WISE-SoE WaterQuality.AggregatedData

WISE-SoE_WaterQuality.AggregatedData - CAS_94125-34-5 - ug/L
type: Concept
notation: WISE-SoE_WaterQuality.AggregatedData - CAS_94125-34-5 - ug/L
definition: The unit of measure for 'CAS_94125-34-5' (Prosulfuron) in WISE SoE - Water Quality: Aggregated data table is 'ug/L'
status: valid
status modified: 2019-10-03
accepted date: 2019-10-03
in scheme: Definition of correct units for the observed determinands in the given WISE SoE DD tables
has determinand: CAS 94125-34-5
has uom: ug.L-1
has table: WISE-SoE WaterQuality.AggregatedData

WISE-SoE_WaterQuality.AggregatedData - CAS_944-22-9 - ug/L
type: Concept
notation: WISE-SoE_WaterQuality.AggregatedData - CAS_944-22-9 - ug/L
definition: The unit of measure for 'CAS_944-22-9' (Fonofos) in WISE SoE - Water Quality: Aggregated data table is 'ug/L'
status: valid
status modified: 2019-10-03
accepted date: 2019-10-03
in scheme: Definition of correct units for the observed determinands in the given WISE SoE DD tables
has determinand: CAS 944-22-9
has uom: ug.L-1
has table: WISE-SoE WaterQuality.AggregatedData

WISE-SoE_WaterQuality.AggregatedData - CAS_95-14-7 - ug/L
type: Concept
notation: WISE-SoE_WaterQuality.AggregatedData - CAS_95-14-7 - ug/L
definition: The unit of measure for 'CAS_95-14-7' (Benzotriazol) in WISE SoE - Water Quality: Aggregated data table is 'ug/L'
status: valid
status modified: 2019-10-03
accepted date: 2019-10-03
in scheme: Definition of correct units for the observed determinands in the given WISE SoE DD tables
has determinand: CAS 95-14-7
has uom: ug.L-1
has table: WISE-SoE WaterQuality.AggregatedData

WISE-SoE_WaterQuality.AggregatedData - CAS_95-16-9 - ug/L
type: Concept
notation: WISE-SoE_WaterQuality.AggregatedData - CAS_95-16-9 - ug/L
definition: The unit of measure for 'CAS_95-16-9' (Benzosulfonazole) in WISE SoE - Water Quality: Aggregated data table is 'ug/L'
status: valid
status modified: 2019-10-03
accepted date: 2019-10-03
in scheme: Definition of correct units for the observed determinands in the given WISE SoE DD tables
has determinand: CAS 95-16-9
has uom: ug.L-1
has table: WISE-SoE WaterQuality.AggregatedData

WISE-SoE_WaterQuality.AggregatedData - CAS_95-47-6 - ug/L
type: Concept
notation: WISE-SoE_WaterQuality.AggregatedData - CAS_95-47-6 - ug/L
definition: The unit of measure for 'CAS_95-47-6' (O-xylene) in WISE SoE - Water Quality: Aggregated data table is 'ug/L'
status: valid
status modified: 2019-10-03
accepted date: 2019-10-03
in scheme: Definition of correct units for the observed determinands in the given WISE SoE DD tables
has determinand: CAS 95-47-6
has uom: ug.L-1
has table: WISE-SoE WaterQuality.AggregatedData

WISE-SoE_WaterQuality.AggregatedData - CAS_95-48-7 - ug/L
type: Concept
notation: WISE-SoE_WaterQuality.AggregatedData - CAS_95-48-7 - ug/L
definition: The unit of measure for 'CAS_95-48-7' (2-methyl-phenol) in WISE SoE - Water Quality: Aggregated data table is 'ug/L'
status: valid
status modified: 2019-10-03
accepted date: 2019-10-03
in scheme: Definition of correct units for the observed determinands in the given WISE SoE DD tables
has determinand: CAS 95-48-7
has uom: ug.L-1
has table: WISE-SoE WaterQuality.AggregatedData

WISE-SoE_WaterQuality.AggregatedData - CAS_95-49-8 - ug/L
type: Concept
notation: WISE-SoE_WaterQuality.AggregatedData - CAS_95-49-8 - ug/L
definition: The unit of measure for 'CAS_95-49-8' (2-chlorotoluene) in WISE SoE - Water Quality: Aggregated data table is 'ug/L'
status: valid
status modified: 2019-10-03
accepted date: 2019-10-03
in scheme: Definition of correct units for the observed determinands in the given WISE SoE DD tables
has determinand: CAS 95-49-8
has uom: ug.L-1
has table: WISE-SoE WaterQuality.AggregatedData

WISE-SoE_WaterQuality.AggregatedData - CAS_95-50-1 - ug/L
type: Concept
notation: WISE-SoE_WaterQuality.AggregatedData - CAS_95-50-1 - ug/L
definition: The unit of measure for 'CAS_95-50-1' (1,2-dichlorobenzene) in WISE SoE - Water Quality: Aggregated data table is 'ug/L'
status: valid
status modified: 2019-10-03
accepted date: 2019-10-03
in scheme: Definition of correct units for the observed determinands in the given WISE SoE DD tables
has determinand: CAS 95-50-1
has uom: ug.L-1
has table: WISE-SoE WaterQuality.AggregatedData

WISE-SoE_WaterQuality.AggregatedData - CAS_95-51-2 - ug/L
type: Concept
notation: WISE-SoE_WaterQuality.AggregatedData - CAS_95-51-2 - ug/L
definition: The unit of measure for 'CAS_95-51-2' (2-chloroaniline) in WISE SoE - Water Quality: Aggregated data table is 'ug/L'
status: valid
status modified: 2019-10-03
accepted date: 2019-10-03
in scheme: Definition of correct units for the observed determinands in the given WISE SoE DD tables
has determinand: CAS 95-51-2
has uom: ug.L-1
has table: WISE-SoE WaterQuality.AggregatedData

WISE-SoE_WaterQuality.AggregatedData - CAS_95-57-8 - ug/L
type: Concept
notation: WISE-SoE_WaterQuality.AggregatedData - CAS_95-57-8 - ug/L
definition: The unit of measure for 'CAS_95-57-8' (2-chlorophenol) in WISE SoE - Water Quality: Aggregated data table is 'ug/L'
status: valid
status modified: 2019-10-03
accepted date: 2019-10-03
in scheme: Definition of correct units for the observed determinands in the given WISE SoE DD tables
has determinand: CAS 95-57-8
has uom: ug.L-1
has table: WISE-SoE WaterQuality.AggregatedData

WISE-SoE_WaterQuality.AggregatedData - CAS_95-63-6 - ug/L
type: Concept
notation: WISE-SoE_WaterQuality.AggregatedData - CAS_95-63-6 - ug/L
definition: The unit of measure for 'CAS_95-63-6' (1,2,4-trimethylbenzene) in WISE SoE - Water Quality: Aggregated data table is 'ug/L'
status: valid
status modified: 2019-10-03
accepted date: 2019-10-03
in scheme: Definition of correct units for the observed determinands in the given WISE SoE DD tables
has determinand: CAS 95-63-6
has uom: ug.L-1
has table: WISE-SoE WaterQuality.AggregatedData

WISE-SoE_WaterQuality.AggregatedData - CAS_95-65-8 - ug/L
type: Concept
notation: WISE-SoE_WaterQuality.AggregatedData - CAS_95-65-8 - ug/L
definition: The unit of measure for 'CAS_95-65-8' (3,4-dimethyl-phenol) in WISE SoE - Water Quality: Aggregated data table is 'ug/L'
status: valid
status modified: 2019-10-03
accepted date: 2019-10-03
in scheme: Definition of correct units for the observed determinands in the given WISE SoE DD tables
has determinand: CAS 95-65-8
has uom: ug.L-1
has table: WISE-SoE WaterQuality.AggregatedData

WISE-SoE_WaterQuality.AggregatedData - CAS_95-74-9 - ug/L
type: Concept
notation: WISE-SoE_WaterQuality.AggregatedData - CAS_95-74-9 - ug/L
definition: The unit of measure for 'CAS_95-74-9' (3-chloro-p-toluidine) in WISE SoE - Water Quality: Aggregated data table is 'ug/L'
status: valid
status modified: 2019-10-03
accepted date: 2019-10-03
in scheme: Definition of correct units for the observed determinands in the given WISE SoE DD tables
has determinand: CAS 95-74-9
has uom: ug.L-1
has table: WISE-SoE WaterQuality.AggregatedData

WISE-SoE_WaterQuality.AggregatedData - CAS_95-76-1 - ug/L
type: Concept
notation: WISE-SoE_WaterQuality.AggregatedData - CAS_95-76-1 - ug/L
definition: The unit of measure for 'CAS_95-76-1' (3,4-dichloroaniline) in WISE SoE - Water Quality: Aggregated data table is 'ug/L'
status: valid
status modified: 2019-10-03
accepted date: 2019-10-03
in scheme: Definition of correct units for the observed determinands in the given WISE SoE DD tables
has determinand: CAS 95-76-1
has uom: ug.L-1
has table: WISE-SoE WaterQuality.AggregatedData

WISE-SoE_WaterQuality.AggregatedData - CAS_95-79-4 - ug/L
type: Concept
notation: WISE-SoE_WaterQuality.AggregatedData - CAS_95-79-4 - ug/L
definition: The unit of measure for 'CAS_95-79-4' (5-chloro-o-toluidine) in WISE SoE - Water Quality: Aggregated data table is 'ug/L'
status: valid
status modified: 2019-10-03
accepted date: 2019-10-03
in scheme: Definition of correct units for the observed determinands in the given WISE SoE DD tables
has determinand: CAS 95-79-4
has uom: ug.L-1
has table: WISE-SoE WaterQuality.AggregatedData

WISE-SoE_WaterQuality.AggregatedData - CAS_95-82-9 - ug/L
type: Concept
notation: WISE-SoE_WaterQuality.AggregatedData - CAS_95-82-9 - ug/L
definition: The unit of measure for 'CAS_95-82-9' (2,5-dichloroaniline) in WISE SoE - Water Quality: Aggregated data table is 'ug/L'
status: valid
status modified: 2019-10-03
accepted date: 2019-10-03
in scheme: Definition of correct units for the observed determinands in the given WISE SoE DD tables
has determinand: CAS 95-82-9
has uom: ug.L-1
has table: WISE-SoE WaterQuality.AggregatedData

WISE-SoE_WaterQuality.AggregatedData - CAS_95-85-2 - ug/L
type: Concept
notation: WISE-SoE_WaterQuality.AggregatedData - CAS_95-85-2 - ug/L
definition: The unit of measure for 'CAS_95-85-2' (2-amino-4-chlorophenol) in WISE SoE - Water Quality: Aggregated data table is 'ug/L'
status: valid
status modified: 2019-10-03
accepted date: 2019-10-03
in scheme: Definition of correct units for the observed determinands in the given WISE SoE DD tables
has determinand: CAS 95-85-2
has uom: ug.L-1
has table: WISE-SoE WaterQuality.AggregatedData

WISE-SoE_WaterQuality.AggregatedData - CAS_95-87-4 - ug/L
type: Concept
notation: WISE-SoE_WaterQuality.AggregatedData - CAS_95-87-4 - ug/L
definition: The unit of measure for 'CAS_95-87-4' (2,5-dimethylphenol) in WISE SoE - Water Quality: Aggregated data table is 'ug/L'
status: valid
status modified: 2019-10-03
accepted date: 2019-10-03
in scheme: Definition of correct units for the observed determinands in the given WISE SoE DD tables
has determinand: CAS 95-87-4
has uom: ug.L-1
has table: WISE-SoE WaterQuality.AggregatedData

WISE-SoE_WaterQuality.AggregatedData - CAS_95-94-3 - ug/L
type: Concept
notation: WISE-SoE_WaterQuality.AggregatedData - CAS_95-94-3 - ug/L
definition: The unit of measure for 'CAS_95-94-3' (1,2,4,5-tetrachlorobenzene) in WISE SoE - Water Quality: Aggregated data table is 'ug/L'
status: valid
status modified: 2019-10-03
accepted date: 2019-10-03
in scheme: Definition of correct units for the observed determinands in the given WISE SoE DD tables
has determinand: CAS 95-94-3
has uom: ug.L-1
has table: WISE-SoE WaterQuality.AggregatedData

WISE-SoE_WaterQuality.AggregatedData - CAS_95-95-4 - ug/L
type: Concept
notation: WISE-SoE_WaterQuality.AggregatedData - CAS_95-95-4 - ug/L
definition: The unit of measure for 'CAS_95-95-4' (2,4,5-trichlorophenol) in WISE SoE - Water Quality: Aggregated data table is 'ug/L'
status: valid
status modified: 2019-10-03
accepted date: 2019-10-03
in scheme: Definition of correct units for the observed determinands in the given WISE SoE DD tables
has determinand: CAS 95-95-4
has uom: ug.L-1
has table: WISE-SoE WaterQuality.AggregatedData

WISE-SoE_WaterQuality.AggregatedData - CAS_950-37-8 - ug/L
type: Concept
notation: WISE-SoE_WaterQuality.AggregatedData - CAS_950-37-8 - ug/L
definition: The unit of measure for 'CAS_950-37-8' (Methidathion) in WISE SoE - Water Quality: Aggregated data table is 'ug/L'
status: valid
status modified: 2019-10-03
accepted date: 2019-10-03
in scheme: Definition of correct units for the observed determinands in the given WISE SoE DD tables
has determinand: CAS 950-37-8
has uom: ug.L-1
has table: WISE-SoE WaterQuality.AggregatedData

WISE-SoE_WaterQuality.AggregatedData - CAS_95465-99-9 - ug/L
type: Concept
notation: WISE-SoE_WaterQuality.AggregatedData - CAS_95465-99-9 - ug/L
definition: The unit of measure for 'CAS_95465-99-9' (Cadusafos) in WISE SoE - Water Quality: Aggregated data table is 'ug/L'
status: valid
status modified: 2019-10-03
accepted date: 2019-10-03
in scheme: Definition of correct units for the observed determinands in the given WISE SoE DD tables
has determinand: CAS 95465-99-9
has uom: ug.L-1
has table: WISE-SoE WaterQuality.AggregatedData

WISE-SoE_WaterQuality.AggregatedData - CAS_95617-09-7 - ug/L
type: Concept
notation: WISE-SoE_WaterQuality.AggregatedData - CAS_95617-09-7 - ug/L
definition: The unit of measure for 'CAS_95617-09-7' (Fenoxaprop) in WISE SoE - Water Quality: Aggregated data table is 'ug/L'
status: valid
status modified: 2019-10-03
accepted date: 2019-10-03
in scheme: Definition of correct units for the observed determinands in the given WISE SoE DD tables
has determinand: CAS 95617-09-7
has uom: ug.L-1
has table: WISE-SoE WaterQuality.AggregatedData

WISE-SoE_WaterQuality.AggregatedData - CAS_959-98-8 - ug/L
type: Concept
notation: WISE-SoE_WaterQuality.AggregatedData - CAS_959-98-8 - ug/L
definition: The unit of measure for 'CAS_959-98-8' (Alpha-Endosulfan) in WISE SoE - Water Quality: Aggregated data table is 'ug/L'
status: valid
status modified: 2019-10-03
accepted date: 2019-10-03
in scheme: Definition of correct units for the observed determinands in the given WISE SoE DD tables
has determinand: CAS 959-98-8
has uom: ug.L-1
has table: WISE-SoE WaterQuality.AggregatedData

WISE-SoE_WaterQuality.AggregatedData - CAS_96-12-8 - ug/L
type: Concept
notation: WISE-SoE_WaterQuality.AggregatedData - CAS_96-12-8 - ug/L
definition: The unit of measure for 'CAS_96-12-8' (1,2-dibromo-3-chloropropane) in WISE SoE - Water Quality: Aggregated data table is 'ug/L'
status: valid
status modified: 2019-10-03
accepted date: 2019-10-03
in scheme: Definition of correct units for the observed determinands in the given WISE SoE DD tables
has determinand: CAS 96-12-8
has uom: ug.L-1
has table: WISE-SoE WaterQuality.AggregatedData

WISE-SoE_WaterQuality.AggregatedData - CAS_96-18-4 - ug/L
type: Concept
notation: WISE-SoE_WaterQuality.AggregatedData - CAS_96-18-4 - ug/L
definition: The unit of measure for 'CAS_96-18-4' (1,2,3-trichloropropane) in WISE SoE - Water Quality: Aggregated data table is 'ug/L'
status: valid
status modified: 2019-10-03
accepted date: 2019-10-03
in scheme: Definition of correct units for the observed determinands in the given WISE SoE DD tables
has determinand: CAS 96-18-4
has uom: ug.L-1
has table: WISE-SoE WaterQuality.AggregatedData

WISE-SoE_WaterQuality.AggregatedData - CAS_96-23-1 - ug/L
type: Concept
notation: WISE-SoE_WaterQuality.AggregatedData - CAS_96-23-1 - ug/L
definition: The unit of measure for 'CAS_96-23-1' (1,3-dichloropropan-2-ol) in WISE SoE - Water Quality: Aggregated data table is 'ug/L'
status: valid
status modified: 2019-10-03
accepted date: 2019-10-03
in scheme: Definition of correct units for the observed determinands in the given WISE SoE DD tables
has determinand: CAS 96-23-1
has uom: ug.L-1
has table: WISE-SoE WaterQuality.AggregatedData

WISE-SoE_WaterQuality.AggregatedData - CAS_96-45-7 - ug/L
type: Concept
notation: WISE-SoE_WaterQuality.AggregatedData - CAS_96-45-7 - ug/L
definition: The unit of measure for 'CAS_96-45-7' (Ethylenethiourea (ETU)) in WISE SoE - Water Quality: Aggregated data table is 'ug/L'
status: valid
status modified: 2019-10-03
accepted date: 2019-10-03
in scheme: Definition of correct units for the observed determinands in the given WISE SoE DD tables
has determinand: CAS 96-45-7
has uom: ug.L-1
has table: WISE-SoE WaterQuality.AggregatedData

WISE-SoE_WaterQuality.AggregatedData - CAS_96489-71-3 - ug/L
type: Concept
notation: WISE-SoE_WaterQuality.AggregatedData - CAS_96489-71-3 - ug/L
definition: The unit of measure for 'CAS_96489-71-3' (Pyridaben) in WISE SoE - Water Quality: Aggregated data table is 'ug/L'
status: valid
status modified: 2019-10-03
accepted date: 2019-10-03
in scheme: Definition of correct units for the observed determinands in the given WISE SoE DD tables
has determinand: CAS 96489-71-3
has uom: ug.L-1
has table: WISE-SoE WaterQuality.AggregatedData

WISE-SoE_WaterQuality.AggregatedData - CAS_97-00-7 - ug/L
type: Concept
notation: WISE-SoE_WaterQuality.AggregatedData - CAS_97-00-7 - ug/L
definition: The unit of measure for 'CAS_97-00-7' (1-chloro-2,4-dinitrobenzene) in WISE SoE - Water Quality: Aggregated data table is 'ug/L'
status: valid
status modified: 2019-10-03
accepted date: 2019-10-03
in scheme: Definition of correct units for the observed determinands in the given WISE SoE DD tables
has determinand: CAS 97-00-7
has uom: ug.L-1
has table: WISE-SoE WaterQuality.AggregatedData

WISE-SoE_WaterQuality.AggregatedData - CAS_98-06-6 - ug/L
type: Concept
notation: WISE-SoE_WaterQuality.AggregatedData - CAS_98-06-6 - ug/L
definition: The unit of measure for 'CAS_98-06-6' (tert-butylbenzene) in WISE SoE - Water Quality: Aggregated data table is 'ug/L'
status: valid
status modified: 2019-10-03
accepted date: 2019-10-03
in scheme: Definition of correct units for the observed determinands in the given WISE SoE DD tables
has determinand: CAS 98-06-6
has uom: ug.L-1
has table: WISE-SoE WaterQuality.AggregatedData

WISE-SoE_WaterQuality.AggregatedData - CAS_98-51-1 - ug/L
type: Concept
notation: WISE-SoE_WaterQuality.AggregatedData - CAS_98-51-1 - ug/L
definition: The unit of measure for 'CAS_98-51-1' (4-tert-butyltoluene) in WISE SoE - Water Quality: Aggregated data table is 'ug/L'
status: valid
status modified: 2019-10-03
accepted date: 2019-10-03
in scheme: Definition of correct units for the observed determinands in the given WISE SoE DD tables
has determinand: CAS 98-51-1
has uom: ug.L-1
has table: WISE-SoE WaterQuality.AggregatedData

WISE-SoE_WaterQuality.AggregatedData - CAS_98-82-8 - ug/L
type: Concept
notation: WISE-SoE_WaterQuality.AggregatedData - CAS_98-82-8 - ug/L
definition: The unit of measure for 'CAS_98-82-8' (Isopropylbenzene) in WISE SoE - Water Quality: Aggregated data table is 'ug/L'
status: valid
status modified: 2019-10-03
accepted date: 2019-10-03
in scheme: Definition of correct units for the observed determinands in the given WISE SoE DD tables
has determinand: CAS 98-82-8
has uom: ug.L-1
has table: WISE-SoE WaterQuality.AggregatedData

WISE-SoE_WaterQuality.AggregatedData - CAS_98-87-3 - ug/L
type: Concept
notation: WISE-SoE_WaterQuality.AggregatedData - CAS_98-87-3 - ug/L
definition: The unit of measure for 'CAS_98-87-3' (a,a-dichlorotoluene) in WISE SoE - Water Quality: Aggregated data table is 'ug/L'
status: valid
status modified: 2019-10-03
accepted date: 2019-10-03
in scheme: Definition of correct units for the observed determinands in the given WISE SoE DD tables
has determinand: CAS 98-87-3
has uom: ug.L-1
has table: WISE-SoE WaterQuality.AggregatedData

WISE-SoE_WaterQuality.AggregatedData - CAS_98-95-3 - ug/L
type: Concept
notation: WISE-SoE_WaterQuality.AggregatedData - CAS_98-95-3 - ug/L
definition: The unit of measure for 'CAS_98-95-3' (Nitrobenzene) in WISE SoE - Water Quality: Aggregated data table is 'ug/L'
status: valid
status modified: 2019-10-03
accepted date: 2019-10-03
in scheme: Definition of correct units for the observed determinands in the given WISE SoE DD tables
has determinand: CAS 98-95-3
has uom: ug.L-1
has table: WISE-SoE WaterQuality.AggregatedData

WISE-SoE_WaterQuality.AggregatedData - CAS_99-30-9 - ug/L
type: Concept
notation: WISE-SoE_WaterQuality.AggregatedData - CAS_99-30-9 - ug/L
definition: The unit of measure for 'CAS_99-30-9' (Dicloran) in WISE SoE - Water Quality: Aggregated data table is 'ug/L'
status: valid
status modified: 2019-10-03
accepted date: 2019-10-03
in scheme: Definition of correct units for the observed determinands in the given WISE SoE DD tables
has determinand: CAS 99-30-9
has uom: ug.L-1
has table: WISE-SoE WaterQuality.AggregatedData

WISE-SoE_WaterQuality.AggregatedData - CAS_99-54-7 - ug/L
type: Concept
notation: WISE-SoE_WaterQuality.AggregatedData - CAS_99-54-7 - ug/L
definition: The unit of measure for 'CAS_99-54-7' (1,2-Dichloro-4-nitrobenzene) in WISE SoE - Water Quality: Aggregated data table is 'ug/L'
status: valid
status modified: 2019-10-03
accepted date: 2019-10-03
in scheme: Definition of correct units for the observed determinands in the given WISE SoE DD tables
has determinand: CAS 99-54-7
has uom: ug.L-1
has table: WISE-SoE WaterQuality.AggregatedData

WISE-SoE_WaterQuality.AggregatedData - CAS_99-87-6 - ug/L
type: Concept
notation: WISE-SoE_WaterQuality.AggregatedData - CAS_99-87-6 - ug/L
definition: The unit of measure for 'CAS_99-87-6' (4-isopropyltoluene) in WISE SoE - Water Quality: Aggregated data table is 'ug/L'
status: valid
status modified: 2019-10-03
accepted date: 2019-10-03
in scheme: Definition of correct units for the observed determinands in the given WISE SoE DD tables
has determinand: CAS 99-87-6
has uom: ug.L-1
has table: WISE-SoE WaterQuality.AggregatedData

WISE-SoE_WaterQuality.AggregatedData - CAS_99105-77-8 - ug/L
type: Concept
notation: WISE-SoE_WaterQuality.AggregatedData - CAS_99105-77-8 - ug/L
definition: The unit of measure for 'CAS_99105-77-8' (Sulcotrione) in WISE SoE - Water Quality: Aggregated data table is 'ug/L'
status: valid
status modified: 2019-10-03
accepted date: 2019-10-03
in scheme: Definition of correct units for the observed determinands in the given WISE SoE DD tables
has determinand: CAS 99105-77-8
has uom: ug.L-1
has table: WISE-SoE WaterQuality.AggregatedData

WISE-SoE_WaterQuality.AggregatedData - CAS_994-05-8 - ug/L
type: Concept
notation: WISE-SoE_WaterQuality.AggregatedData - CAS_994-05-8 - ug/L
definition: The unit of measure for 'CAS_994-05-8' (TAME) in WISE SoE - Water Quality: Aggregated data table is 'ug/L'
status: valid
status modified: 2019-10-03
accepted date: 2019-10-03
in scheme: Definition of correct units for the observed determinands in the given WISE SoE DD tables
has determinand: CAS 994-05-8
has uom: ug.L-1
has table: WISE-SoE WaterQuality.AggregatedData

WISE-SoE_WaterQuality.AggregatedData - CAS_999-81-5 - ug/L
type: Concept
notation: WISE-SoE_WaterQuality.AggregatedData - CAS_999-81-5 - ug/L
definition: The unit of measure for 'CAS_999-81-5' (Chlormequat chloride) in WISE SoE - Water Quality: Aggregated data table is 'ug/L'
status: valid
status modified: 2019-10-03
accepted date: 2019-10-03
in scheme: Definition of correct units for the observed determinands in the given WISE SoE DD tables
has determinand: CAS 999-81-5
has uom: ug.L-1
has table: WISE-SoE WaterQuality.AggregatedData

WISE-SoE_WaterQuality.AggregatedData - EEA_00-00-0 - ug/L
type: Concept
notation: WISE-SoE_WaterQuality.AggregatedData - EEA_00-00-0 - ug/L
definition: The unit of measure for 'EEA_00-00-0' (Other chemical parameter) in WISE SoE - Water Quality: Aggregated data table is 'ug/L'
status: valid
status modified: 2019-10-03
accepted date: 2019-10-03
in scheme: Definition of correct units for the observed determinands in the given WISE SoE DD tables
has determinand: EEA 00-00-0
has uom: ug.L-1
has table: WISE-SoE WaterQuality.AggregatedData

WISE-SoE_WaterQuality.AggregatedData - EEA_11-05-2 - mg/L
type: Concept
notation: WISE-SoE_WaterQuality.AggregatedData - EEA_11-05-2 - mg/L
definition: The unit of measure for 'EEA_11-05-2' (Total phytoplankton biomass) in WISE SoE - Water Quality: Aggregated data table is 'mg/L'
status: valid
status modified: 2019-10-03
accepted date: 2019-10-03
in scheme: Definition of correct units for the observed determinands in the given WISE SoE DD tables
has determinand: EEA 11-05-2
has uom: mg.L-1
has table: WISE-SoE WaterQuality.AggregatedData

WISE-SoE_WaterQuality.AggregatedData - EEA_123-07-9 - {presence}
type: Concept
notation: WISE-SoE_WaterQuality.AggregatedData - EEA_123-07-9 - {presence}
definition: The unit of measure for 'EEA_123-07-9' (Isoetides presence) in WISE SoE - Water Quality: Aggregated data table is '{presence}'
status: valid
status modified: 2019-10-03
accepted date: 2019-10-03
in scheme: Definition of correct units for the observed determinands in the given WISE SoE DD tables
has determinand: EEA 123-07-9
has uom: {presence}
has table: WISE-SoE WaterQuality.AggregatedData

WISE-SoE_WaterQuality.AggregatedData - EEA_31-01-6 - mg{CaCO3}/L
type: Concept
notation: WISE-SoE_WaterQuality.AggregatedData - EEA_31-01-6 - mg{CaCO3}/L
definition: The unit of measure for 'EEA_31-01-6' (Hardness) in WISE SoE - Water Quality: Aggregated data table is 'mg{CaCO3}/L'
status: valid
status modified: 2019-10-03
accepted date: 2019-10-03
in scheme: Definition of correct units for the observed determinands in the given WISE SoE DD tables
has determinand: EEA 31-01-6
has uom: mg{CaCO3}.L-1
has table: WISE-SoE WaterQuality.AggregatedData

WISE-SoE_WaterQuality.AggregatedData - EEA_31-02-7 - mg/L
type: Concept
notation: WISE-SoE_WaterQuality.AggregatedData - EEA_31-02-7 - mg/L
definition: The unit of measure for 'EEA_31-02-7' (Total suspended solids) in WISE SoE - Water Quality: Aggregated data table is 'mg/L'
status: valid
status modified: 2019-10-03
accepted date: 2019-10-03
in scheme: Definition of correct units for the observed determinands in the given WISE SoE DD tables
has determinand: EEA 31-02-7
has uom: mg.L-1
has table: WISE-SoE WaterQuality.AggregatedData

WISE-SoE_WaterQuality.AggregatedData - EEA_31-03-8 - mg/L
type: Concept
notation: WISE-SoE_WaterQuality.AggregatedData - EEA_31-03-8 - mg/L
definition: The unit of measure for 'EEA_31-03-8' (Total dissolved solids) in WISE SoE - Water Quality: Aggregated data table is 'mg/L'
status: valid
status modified: 2019-10-03
accepted date: 2019-10-03
in scheme: Definition of correct units for the observed determinands in the given WISE SoE DD tables
has determinand: EEA 31-03-8
has uom: mg.L-1
has table: WISE-SoE WaterQuality.AggregatedData

WISE-SoE_WaterQuality.AggregatedData - EEA_3111-01-1 - m
type: Concept
notation: WISE-SoE_WaterQuality.AggregatedData - EEA_3111-01-1 - m
definition: The unit of measure for 'EEA_3111-01-1' (Secchi depth) in WISE SoE - Water Quality: Aggregated data table is 'm'
status: valid
status modified: 2019-10-03
accepted date: 2019-10-03
in scheme: Definition of correct units for the observed determinands in the given WISE SoE DD tables
has determinand: EEA 3111-01-1
has uom: http://dd.eionet.europa.eu/vocabulary/wise/uom/m
has table: WISE-SoE WaterQuality.AggregatedData

WISE-SoE_WaterQuality.AggregatedData - EEA_3121-01-5 - Cel
type: Concept
notation: WISE-SoE_WaterQuality.AggregatedData - EEA_3121-01-5 - Cel
definition: The unit of measure for 'EEA_3121-01-5' (Water temperature) in WISE SoE - Water Quality: Aggregated data table is 'Cel'
status: valid
status modified: 2019-10-03
accepted date: 2019-10-03
in scheme: Definition of correct units for the observed determinands in the given WISE SoE DD tables
has determinand: EEA 3121-01-5
has uom: Cel
has table: WISE-SoE WaterQuality.AggregatedData

WISE-SoE_WaterQuality.AggregatedData - EEA_3131-01-9 - %
type: Concept
notation: WISE-SoE_WaterQuality.AggregatedData - EEA_3131-01-9 - %
definition: The unit of measure for 'EEA_3131-01-9' (Oxygen saturation) in WISE SoE - Water Quality: Aggregated data table is '%'
status: valid
status modified: 2019-10-03
accepted date: 2019-10-03
in scheme: Definition of correct units for the observed determinands in the given WISE SoE DD tables
has determinand: EEA 3131-01-9
has uom: percent
has table: WISE-SoE WaterQuality.AggregatedData

WISE-SoE_WaterQuality.AggregatedData - EEA_3132-01-2 - mg/L
type: Concept
notation: WISE-SoE_WaterQuality.AggregatedData - EEA_3132-01-2 - mg/L
definition: The unit of measure for 'EEA_3132-01-2' (Dissolved oxygen) in WISE SoE - Water Quality: Aggregated data table is 'mg/L'
status: valid
status modified: 2019-10-03
accepted date: 2019-10-03
in scheme: Definition of correct units for the observed determinands in the given WISE SoE DD tables
has determinand: EEA 3132-01-2
has uom: mg.L-1
has table: WISE-SoE WaterQuality.AggregatedData

WISE-SoE_WaterQuality.AggregatedData - EEA_3133-01-5 - mg{O2}/L
type: Concept
notation: WISE-SoE_WaterQuality.AggregatedData - EEA_3133-01-5 - mg{O2}/L
definition: The unit of measure for 'EEA_3133-01-5' (BOD5) in WISE SoE - Water Quality: Aggregated data table is 'mg{O2}/L'
status: valid
status modified: 2019-10-03
accepted date: 2019-10-03
in scheme: Definition of correct units for the observed determinands in the given WISE SoE DD tables
has determinand: EEA 3133-01-5
has uom: mg{O2}.L-1
has table: WISE-SoE WaterQuality.AggregatedData

WISE-SoE_WaterQuality.AggregatedData - EEA_3133-02-6 - mg{O2}/L
type: Concept
notation: WISE-SoE_WaterQuality.AggregatedData - EEA_3133-02-6 - mg{O2}/L
definition: The unit of measure for 'EEA_3133-02-6' (BOD7) in WISE SoE - Water Quality: Aggregated data table is 'mg{O2}/L'
status: valid
status modified: 2019-10-03
accepted date: 2019-10-03
in scheme: Definition of correct units for the observed determinands in the given WISE SoE DD tables
has determinand: EEA 3133-02-6
has uom: mg{O2}.L-1
has table: WISE-SoE WaterQuality.AggregatedData

WISE-SoE_WaterQuality.AggregatedData - EEA_3133-03-7 - mg{O2}/L
type: Concept
notation: WISE-SoE_WaterQuality.AggregatedData - EEA_3133-03-7 - mg{O2}/L
definition: The unit of measure for 'EEA_3133-03-7' (CODCr) in WISE SoE - Water Quality: Aggregated data table is 'mg{O2}/L'
status: valid
status modified: 2019-10-03
accepted date: 2019-10-03
in scheme: Definition of correct units for the observed determinands in the given WISE SoE DD tables
has determinand: EEA 3133-03-7
has uom: mg{O2}.L-1
has table: WISE-SoE WaterQuality.AggregatedData

WISE-SoE_WaterQuality.AggregatedData - EEA_3133-04-8 - mg{O2}/L
type: Concept
notation: WISE-SoE_WaterQuality.AggregatedData - EEA_3133-04-8 - mg{O2}/L
definition: The unit of measure for 'EEA_3133-04-8' (CODMn) in WISE SoE - Water Quality: Aggregated data table is 'mg{O2}/L'
status: valid
status modified: 2019-10-03
accepted date: 2019-10-03
in scheme: Definition of correct units for the observed determinands in the given WISE SoE DD tables
has determinand: EEA 3133-04-8
has uom: mg{O2}.L-1
has table: WISE-SoE WaterQuality.AggregatedData

WISE-SoE_WaterQuality.AggregatedData - EEA_3133-05-9 - mg{C}/L
type: Concept
notation: WISE-SoE_WaterQuality.AggregatedData - EEA_3133-05-9 - mg{C}/L
definition: The unit of measure for 'EEA_3133-05-9' (Dissolved organic carbon (DOC)) in WISE SoE - Water Quality: Aggregated data table is 'mg{C}/L'
status: valid
status modified: 2019-10-03
accepted date: 2019-10-03
in scheme: Definition of correct units for the observed determinands in the given WISE SoE DD tables
has determinand: EEA 3133-05-9
has uom: mg{C}.L-1
has table: WISE-SoE WaterQuality.AggregatedData

WISE-SoE_WaterQuality.AggregatedData - EEA_3133-06-0 - mg{C}/L
type: Concept
notation: WISE-SoE_WaterQuality.AggregatedData - EEA_3133-06-0 - mg{C}/L
definition: The unit of measure for 'EEA_3133-06-0' (Total organic carbon (TOC)) in WISE SoE - Water Quality: Aggregated data table is 'mg{C}/L'
status: valid
status modified: 2019-10-03
accepted date: 2019-10-03
in scheme: Definition of correct units for the observed determinands in the given WISE SoE DD tables
has determinand: EEA 3133-06-0
has uom: mg{C}.L-1
has table: WISE-SoE WaterQuality.AggregatedData

WISE-SoE_WaterQuality.AggregatedData - EEA_3141-01-3 - {PSU}
type: Concept
notation: WISE-SoE_WaterQuality.AggregatedData - EEA_3141-01-3 - {PSU}
definition: The unit of measure for 'EEA_3141-01-3' (Salinity) in WISE SoE - Water Quality: Aggregated data table is '{PSU}'
status: valid
status modified: 2019-10-03
accepted date: 2019-10-03
in scheme: Definition of correct units for the observed determinands in the given WISE SoE DD tables
has determinand: EEA 3141-01-3
has uom: {PSU}
has table: WISE-SoE WaterQuality.AggregatedData

WISE-SoE_WaterQuality.AggregatedData - EEA_3142-01-6 - uS/cm
type: Concept
notation: WISE-SoE_WaterQuality.AggregatedData - EEA_3142-01-6 - uS/cm
definition: The unit of measure for 'EEA_3142-01-6' (Electrical conductivity) in WISE SoE - Water Quality: Aggregated data table is 'uS/cm'
status: valid
status modified: 2019-10-03
accepted date: 2019-10-03
in scheme: Definition of correct units for the observed determinands in the given WISE SoE DD tables
has determinand: EEA 3142-01-6
has uom: uS.cm-1
has table: WISE-SoE WaterQuality.AggregatedData

WISE-SoE_WaterQuality.AggregatedData - EEA_3142-02-7 - mg/L
type: Concept
notation: WISE-SoE_WaterQuality.AggregatedData - EEA_3142-02-7 - mg/L
definition: The unit of measure for 'EEA_3142-02-7' (Chlorine Cl-) in WISE SoE - Water Quality: Aggregated data table is 'mg/L'
status: valid
status modified: 2019-10-03
accepted date: 2019-10-03
in scheme: Definition of correct units for the observed determinands in the given WISE SoE DD tables
has determinand: EEA 3142-02-7
has uom: mg.L-1
has table: WISE-SoE WaterQuality.AggregatedData

WISE-SoE_WaterQuality.AggregatedData - EEA_3151-01-7 - mmol/L
type: Concept
notation: WISE-SoE_WaterQuality.AggregatedData - EEA_3151-01-7 - mmol/L
definition: The unit of measure for 'EEA_3151-01-7' (Acid neutralizing capacity) in WISE SoE - Water Quality: Aggregated data table is 'mmol/L'
status: valid
status modified: 2019-10-03
accepted date: 2019-10-03
in scheme: Definition of correct units for the observed determinands in the given WISE SoE DD tables
has determinand: EEA 3151-01-7
has uom: mmol.L-1
has table: WISE-SoE WaterQuality.AggregatedData

WISE-SoE_WaterQuality.AggregatedData - EEA_3152-01-0 - [pH]
type: Concept
notation: WISE-SoE_WaterQuality.AggregatedData - EEA_3152-01-0 - [pH]
definition: The unit of measure for 'EEA_3152-01-0' (pH) in WISE SoE - Water Quality: Aggregated data table is '[pH]'
status: valid
status modified: 2019-10-03
accepted date: 2019-10-03
in scheme: Definition of correct units for the observed determinands in the given WISE SoE DD tables
has determinand: EEA 3152-01-0
has uom: [pH]
has table: WISE-SoE WaterQuality.AggregatedData

WISE-SoE_WaterQuality.AggregatedData - EEA_3153-01-3 - mmol/L
type: Concept
notation: WISE-SoE_WaterQuality.AggregatedData - EEA_3153-01-3 - mmol/L
definition: The unit of measure for 'EEA_3153-01-3' (Acid neutralizing capacity to pH 4.5) in WISE SoE - Water Quality: Aggregated data table is 'mmol/L'
status: valid
status modified: 2019-10-03
accepted date: 2019-10-03
in scheme: Definition of correct units for the observed determinands in the given WISE SoE DD tables
has determinand: EEA 3153-01-3
has uom: mmol.L-1
has table: WISE-SoE WaterQuality.AggregatedData

WISE-SoE_WaterQuality.AggregatedData - EEA_3153-02-4 - mg/L
type: Concept
notation: WISE-SoE_WaterQuality.AggregatedData - EEA_3153-02-4 - mg/L
definition: The unit of measure for 'EEA_3153-02-4' (Alkalinity) in WISE SoE - Water Quality: Aggregated data table is 'mg/L'
status: valid
status modified: 2019-10-03
accepted date: 2019-10-03
in scheme: Definition of correct units for the observed determinands in the given WISE SoE DD tables
has determinand: EEA 3153-02-4
has uom: mg.L-1
has table: WISE-SoE WaterQuality.AggregatedData

WISE-SoE_WaterQuality.AggregatedData - EEA_3161-01-1 - mg{N}/L
type: Concept
notation: WISE-SoE_WaterQuality.AggregatedData - EEA_3161-01-1 - mg{N}/L
definition: The unit of measure for 'EEA_3161-01-1' (Kjeldahl nitrogen) in WISE SoE - Water Quality: Aggregated data table is 'mg{N}/L'
status: valid
status modified: 2019-10-03
accepted date: 2019-10-03
in scheme: Definition of correct units for the observed determinands in the given WISE SoE DD tables
has determinand: EEA 3161-01-1
has uom: mg{N}.L-1
has table: WISE-SoE WaterQuality.AggregatedData

WISE-SoE_WaterQuality.AggregatedData - EEA_3161-02-2 - mg{N}/L
type: Concept
notation: WISE-SoE_WaterQuality.AggregatedData - EEA_3161-02-2 - mg{N}/L
definition: The unit of measure for 'EEA_3161-02-2' (Total oxidised nitrogen) in WISE SoE - Water Quality: Aggregated data table is 'mg{N}/L'
status: valid
status modified: 2019-10-03
accepted date: 2019-10-03
in scheme: Definition of correct units for the observed determinands in the given WISE SoE DD tables
has determinand: EEA 3161-02-2
has uom: mg{N}.L-1
has table: WISE-SoE WaterQuality.AggregatedData

WISE-SoE_WaterQuality.AggregatedData - EEA_3161-03-3 - mg{N}/L
type: Concept
notation: WISE-SoE_WaterQuality.AggregatedData - EEA_3161-03-3 - mg{N}/L
definition: The unit of measure for 'EEA_3161-03-3' (Total organic nitrogen) in WISE SoE - Water Quality: Aggregated data table is 'mg{N}/L'
status: valid
status modified: 2019-10-03
accepted date: 2019-10-03
in scheme: Definition of correct units for the observed determinands in the given WISE SoE DD tables
has determinand: EEA 3161-03-3
has uom: mg{N}.L-1
has table: WISE-SoE WaterQuality.AggregatedData

WISE-SoE_WaterQuality.AggregatedData - EEA_3161-04-4 - mg{N}/L
type: Concept
notation: WISE-SoE_WaterQuality.AggregatedData - EEA_3161-04-4 - mg{N}/L
definition: The unit of measure for 'EEA_3161-04-4' (Particulate organic nitrogen) in WISE SoE - Water Quality: Aggregated data table is 'mg{N}/L'
status: valid
status modified: 2019-10-03
accepted date: 2019-10-03
in scheme: Definition of correct units for the observed determinands in the given WISE SoE DD tables
has determinand: EEA 3161-04-4
has uom: mg{N}.L-1
has table: WISE-SoE WaterQuality.AggregatedData

WISE-SoE_WaterQuality.AggregatedData - EEA_3161-05-5 - mg{N}/L
type: Concept
notation: WISE-SoE_WaterQuality.AggregatedData - EEA_3161-05-5 - mg{N}/L
definition: The unit of measure for 'EEA_3161-05-5' (Total inorganic nitrogen) in WISE SoE - Water Quality: Aggregated data table is 'mg{N}/L'
status: valid
status modified: 2019-10-03
accepted date: 2019-10-03
in scheme: Definition of correct units for the observed determinands in the given WISE SoE DD tables
has determinand: EEA 3161-05-5
has uom: mg{N}.L-1
has table: WISE-SoE WaterQuality.AggregatedData

WISE-SoE_WaterQuality.AggregatedData - EEA_31613-01-1 - mg{NH3}/L
type: Concept
notation: WISE-SoE_WaterQuality.AggregatedData - EEA_31613-01-1 - mg{NH3}/L
definition: The unit of measure for 'EEA_31613-01-1' (Non-ionised ammonia) in WISE SoE - Water Quality: Aggregated data table is 'mg{NH3}/L'
status: valid
status modified: 2019-10-03
accepted date: 2019-10-03
in scheme: Definition of correct units for the observed determinands in the given WISE SoE DD tables
has determinand: EEA 31613-01-1
has uom: mg{NH3}.L-1
has table: WISE-SoE WaterQuality.AggregatedData

WISE-SoE_WaterQuality.AggregatedData - EEA_31615-01-7 - mg{N}/L
type: Concept
notation: WISE-SoE_WaterQuality.AggregatedData - EEA_31615-01-7 - mg{N}/L
definition: The unit of measure for 'EEA_31615-01-7' (Total nitrogen) in WISE SoE - Water Quality: Aggregated data table is 'mg{N}/L'
status: valid
status modified: 2019-10-03
accepted date: 2019-10-03
in scheme: Definition of correct units for the observed determinands in the given WISE SoE DD tables
has determinand: EEA 31615-01-7
has uom: mg{N}.L-1
has table: WISE-SoE WaterQuality.AggregatedData

WISE-SoE_WaterQuality.AggregatedData - EEA_3163-01-7 - mg{Si}/L
type: Concept
notation: WISE-SoE_WaterQuality.AggregatedData - EEA_3163-01-7 - mg{Si}/L
definition: The unit of measure for 'EEA_3163-01-7' (Silicate) in WISE SoE - Water Quality: Aggregated data table is 'mg{Si}/L'
status: valid
status modified: 2019-10-03
accepted date: 2019-10-03
in scheme: Definition of correct units for the observed determinands in the given WISE SoE DD tables
has determinand: EEA 3163-01-7
has uom: mg{Si}.L-1
has table: WISE-SoE WaterQuality.AggregatedData

WISE-SoE_WaterQuality.AggregatedData - EEA_3164-01-0 - ug/L
type: Concept
notation: WISE-SoE_WaterQuality.AggregatedData - EEA_3164-01-0 - ug/L
definition: The unit of measure for 'EEA_3164-01-0' (Chlorophyll a) in WISE SoE - Water Quality: Aggregated data table is 'ug/L'
status: valid
status modified: 2019-10-03
accepted date: 2019-10-03
in scheme: Definition of correct units for the observed determinands in the given WISE SoE DD tables
has determinand: EEA 3164-01-0
has uom: ug.L-1
has table: WISE-SoE WaterQuality.AggregatedData

WISE-SoE_WaterQuality.AggregatedData - EEA_3164-07-6 - {massRatio}
type: Concept
notation: WISE-SoE_WaterQuality.AggregatedData - EEA_3164-07-6 - {massRatio}
definition: The unit of measure for 'EEA_3164-07-6' (Total nitrogen to total phosphorus ratio) in WISE SoE - Water Quality: Aggregated data table is '{massRatio}'
status: valid
status modified: 2019-10-03
accepted date: 2019-10-03
in scheme: Definition of correct units for the observed determinands in the given WISE SoE DD tables
has determinand: EEA 3164-07-6
has uom: {massRatio}
has table: WISE-SoE WaterQuality.AggregatedData

WISE-SoE_WaterQuality.AggregatedData - EEA_3164-08-7 - {massRatio}
type: Concept
notation: WISE-SoE_WaterQuality.AggregatedData - EEA_3164-08-7 - {massRatio}
definition: The unit of measure for 'EEA_3164-08-7' (Nitrate to orthophosphate ratio) in WISE SoE - Water Quality: Aggregated data table is '{massRatio}'
status: valid
status modified: 2019-10-03
accepted date: 2019-10-03
in scheme: Definition of correct units for the observed determinands in the given WISE SoE DD tables
has determinand: EEA 3164-08-7
has uom: {massRatio}
has table: WISE-SoE WaterQuality.AggregatedData

WISE-SoE_WaterQuality.AggregatedData - EEA_32-02-0 - ug/L
type: Concept
notation: WISE-SoE_WaterQuality.AggregatedData - EEA_32-02-0 - ug/L
definition: The unit of measure for 'EEA_32-02-0' (Total cyclodiene pesticides (aldrin + dieldrin + endrin + isodrin)) in WISE SoE - Water Quality: Aggregated data table is 'ug/L'
status: valid
status modified: 2019-10-03
accepted date: 2019-10-03
in scheme: Definition of correct units for the observed determinands in the given WISE SoE DD tables
has determinand: EEA 32-02-0
has uom: ug.L-1
has table: WISE-SoE WaterQuality.AggregatedData

WISE-SoE_WaterQuality.AggregatedData - EEA_32-03-1 - ug/L
type: Concept
notation: WISE-SoE_WaterQuality.AggregatedData - EEA_32-03-1 - ug/L
definition: The unit of measure for 'EEA_32-03-1' (Total DDT (DDT, p,p' + DDT, o,p' + DDE, p,p' + DDD, p,p')) in WISE SoE - Water Quality: Aggregated data table is 'ug/L'
status: valid
status modified: 2019-10-03
accepted date: 2019-10-03
in scheme: Definition of correct units for the observed determinands in the given WISE SoE DD tables
has determinand: EEA 32-03-1
has uom: ug.L-1
has table: WISE-SoE WaterQuality.AggregatedData

WISE-SoE_WaterQuality.AggregatedData - EEA_32-04-2 - ug/L
type: Concept
notation: WISE-SoE_WaterQuality.AggregatedData - EEA_32-04-2 - ug/L
definition: The unit of measure for 'EEA_32-04-2' (Brominated diphenylethers (congener numbers 28, 47, 99, 100, 153 and 154)) in WISE SoE - Water Quality: Aggregated data table is 'ug/L'
status: valid
status modified: 2019-10-03
accepted date: 2019-10-03
in scheme: Definition of correct units for the observed determinands in the given WISE SoE DD tables
has determinand: EEA 32-04-2
has uom: ug.L-1
has table: WISE-SoE WaterQuality.AggregatedData

WISE-SoE_WaterQuality.AggregatedData - EEA_32-23-5 - ug/L
type: Concept
notation: WISE-SoE_WaterQuality.AggregatedData - EEA_32-23-5 - ug/L
definition: The unit of measure for 'EEA_32-23-5' (Total Benzo(b)fluor-anthene (CAS_205-99-2) + Benzo(k)fluor-anthene (CAS_207-08-9)) in WISE SoE - Water Quality: Aggregated data table is 'ug/L'
status: valid
status modified: 2019-10-03
accepted date: 2019-10-03
in scheme: Definition of correct units for the observed determinands in the given WISE SoE DD tables
has determinand: EEA 32-23-5
has uom: ug.L-1
has table: WISE-SoE WaterQuality.AggregatedData

WISE-SoE_WaterQuality.AggregatedData - EEA_32-24-6 - ug/L
type: Concept
notation: WISE-SoE_WaterQuality.AggregatedData - EEA_32-24-6 - ug/L
definition: The unit of measure for 'EEA_32-24-6' (Total Benzo(g,h,i)perylene (CAS_191-24-2) + Indeno(1,2,3-cd)pyrene (CAS_193-39-5)) in WISE SoE - Water Quality: Aggregated data table is 'ug/L'
status: valid
status modified: 2019-10-03
accepted date: 2019-10-03
in scheme: Definition of correct units for the observed determinands in the given WISE SoE DD tables
has determinand: EEA 32-24-6
has uom: ug.L-1
has table: WISE-SoE WaterQuality.AggregatedData

WISE-SoE_WaterQuality.AggregatedData - EEA_32-26-8 - ug/L
type: Concept
notation: WISE-SoE_WaterQuality.AggregatedData - EEA_32-26-8 - ug/L
definition: The unit of measure for 'EEA_32-26-8' (Pesticides - aggregated) in WISE SoE - Water Quality: Aggregated data table is 'ug/L'
status: valid
status modified: 2019-10-03
accepted date: 2019-10-03
in scheme: Definition of correct units for the observed determinands in the given WISE SoE DD tables
has determinand: EEA 32-26-8
has uom: ug.L-1
has table: WISE-SoE WaterQuality.AggregatedData

WISE-SoE_WaterQuality.AggregatedData - EEA_33-01-2 - ug/L
type: Concept
notation: WISE-SoE_WaterQuality.AggregatedData - EEA_33-01-2 - ug/L
definition: The unit of measure for 'EEA_33-01-2' (Alkalised benzene) in WISE SoE - Water Quality: Aggregated data table is 'ug/L'
status: valid
status modified: 2019-10-03
accepted date: 2019-10-03
in scheme: Definition of correct units for the observed determinands in the given WISE SoE DD tables
has determinand: EEA 33-01-2
has uom: ug.L-1
has table: WISE-SoE WaterQuality.AggregatedData

WISE-SoE_WaterQuality.AggregatedData - EEA_33-02-3 - ug/L
type: Concept
notation: WISE-SoE_WaterQuality.AggregatedData - EEA_33-02-3 - ug/L
definition: The unit of measure for 'EEA_33-02-3' (Benzol) in WISE SoE - Water Quality: Aggregated data table is 'ug/L'
status: valid
status modified: 2019-10-03
accepted date: 2019-10-03
in scheme: Definition of correct units for the observed determinands in the given WISE SoE DD tables
has determinand: EEA 33-02-3
has uom: ug.L-1
has table: WISE-SoE WaterQuality.AggregatedData

WISE-SoE_WaterQuality.AggregatedData - EEA_33-04-5 - ug/L
type: Concept
notation: WISE-SoE_WaterQuality.AggregatedData - EEA_33-04-5 - ug/L
definition: The unit of measure for 'EEA_33-04-5' (Brominated flame retardants) in WISE SoE - Water Quality: Aggregated data table is 'ug/L'
status: valid
status modified: 2019-10-03
accepted date: 2019-10-03
in scheme: Definition of correct units for the observed determinands in the given WISE SoE DD tables
has determinand: EEA 33-04-5
has uom: ug.L-1
has table: WISE-SoE WaterQuality.AggregatedData

WISE-SoE_WaterQuality.AggregatedData - EEA_33-05-6 - ug/L
type: Concept
notation: WISE-SoE_WaterQuality.AggregatedData - EEA_33-05-6 - ug/L
definition: The unit of measure for 'EEA_33-05-6' (BTEX) in WISE SoE - Water Quality: Aggregated data table is 'ug/L'
status: valid
status modified: 2019-10-03
accepted date: 2019-10-03
in scheme: Definition of correct units for the observed determinands in the given WISE SoE DD tables
has determinand: EEA 33-05-6
has uom: ug.L-1
has table: WISE-SoE WaterQuality.AggregatedData

WISE-SoE_WaterQuality.AggregatedData - EEA_33-06-7 - ug/L
type: Concept
notation: WISE-SoE_WaterQuality.AggregatedData - EEA_33-06-7 - ug/L
definition: The unit of measure for 'EEA_33-06-7' (Chlorinated benzene) in WISE SoE - Water Quality: Aggregated data table is 'ug/L'
status: valid
status modified: 2019-10-03
accepted date: 2019-10-03
in scheme: Definition of correct units for the observed determinands in the given WISE SoE DD tables
has determinand: EEA 33-06-7
has uom: ug.L-1
has table: WISE-SoE WaterQuality.AggregatedData

WISE-SoE_WaterQuality.AggregatedData - EEA_33-07-8 - ug/L
type: Concept
notation: WISE-SoE_WaterQuality.AggregatedData - EEA_33-07-8 - ug/L
definition: The unit of measure for 'EEA_33-07-8' (Chlorinated phenol) in WISE SoE - Water Quality: Aggregated data table is 'ug/L'
status: valid
status modified: 2019-10-03
accepted date: 2019-10-03
in scheme: Definition of correct units for the observed determinands in the given WISE SoE DD tables
has determinand: EEA 33-07-8
has uom: ug.L-1
has table: WISE-SoE WaterQuality.AggregatedData

WISE-SoE_WaterQuality.AggregatedData - EEA_33-08-9 - ug/L
type: Concept
notation: WISE-SoE_WaterQuality.AggregatedData - EEA_33-08-9 - ug/L
definition: The unit of measure for 'EEA_33-08-9' (Chromium (III)) in WISE SoE - Water Quality: Aggregated data table is 'ug/L'
status: valid
status modified: 2019-10-03
accepted date: 2019-10-03
in scheme: Definition of correct units for the observed determinands in the given WISE SoE DD tables
has determinand: EEA 33-08-9
has uom: ug.L-1
has table: WISE-SoE WaterQuality.AggregatedData

WISE-SoE_WaterQuality.AggregatedData - EEA_33-09-0 - ug/L
type: Concept
notation: WISE-SoE_WaterQuality.AggregatedData - EEA_33-09-0 - ug/L
definition: The unit of measure for 'EEA_33-09-0' (Detergents) in WISE SoE - Water Quality: Aggregated data table is 'ug/L'
status: valid
status modified: 2019-10-03
accepted date: 2019-10-03
in scheme: Definition of correct units for the observed determinands in the given WISE SoE DD tables
has determinand: EEA 33-09-0
has uom: ug.L-1
has table: WISE-SoE WaterQuality.AggregatedData

WISE-SoE_WaterQuality.AggregatedData - EEA_33-10-3 - ug/L
type: Concept
notation: WISE-SoE_WaterQuality.AggregatedData - EEA_33-10-3 - ug/L
definition: The unit of measure for 'EEA_33-10-3' (Dichlorobenzene) in WISE SoE - Water Quality: Aggregated data table is 'ug/L'
status: valid
status modified: 2019-10-03
accepted date: 2019-10-03
in scheme: Definition of correct units for the observed determinands in the given WISE SoE DD tables
has determinand: EEA 33-10-3
has uom: ug.L-1
has table: WISE-SoE WaterQuality.AggregatedData

WISE-SoE_WaterQuality.AggregatedData - EEA_33-11-4 - ug/L
type: Concept
notation: WISE-SoE_WaterQuality.AggregatedData - EEA_33-11-4 - ug/L
definition: The unit of measure for 'EEA_33-11-4' (Dichlorophenol) in WISE SoE - Water Quality: Aggregated data table is 'ug/L'
status: valid
status modified: 2019-10-03
accepted date: 2019-10-03
in scheme: Definition of correct units for the observed determinands in the given WISE SoE DD tables
has determinand: EEA 33-11-4
has uom: ug.L-1
has table: WISE-SoE WaterQuality.AggregatedData

WISE-SoE_WaterQuality.AggregatedData - EEA_33-13-6 - ug/L
type: Concept
notation: WISE-SoE_WaterQuality.AggregatedData - EEA_33-13-6 - ug/L
definition: The unit of measure for 'EEA_33-13-6' (DOX) in WISE SoE - Water Quality: Aggregated data table is 'ug/L'
status: valid
status modified: 2019-10-03
accepted date: 2019-10-03
in scheme: Definition of correct units for the observed determinands in the given WISE SoE DD tables
has determinand: EEA 33-13-6
has uom: ug.L-1
has table: WISE-SoE WaterQuality.AggregatedData

WISE-SoE_WaterQuality.AggregatedData - EEA_33-14-7 - ug/L
type: Concept
notation: WISE-SoE_WaterQuality.AggregatedData - EEA_33-14-7 - ug/L
definition: The unit of measure for 'EEA_33-14-7' (Extractable organically bound chlorine) in WISE SoE - Water Quality: Aggregated data table is 'ug/L'
status: valid
status modified: 2019-10-03
accepted date: 2019-10-03
in scheme: Definition of correct units for the observed determinands in the given WISE SoE DD tables
has determinand: EEA 33-14-7
has uom: ug.L-1
has table: WISE-SoE WaterQuality.AggregatedData

WISE-SoE_WaterQuality.AggregatedData - EEA_33-15-8 - ug/L
type: Concept
notation: WISE-SoE_WaterQuality.AggregatedData - EEA_33-15-8 - ug/L
definition: The unit of measure for 'EEA_33-15-8' (Halogenated organic compounds) in WISE SoE - Water Quality: Aggregated data table is 'ug/L'
status: valid
status modified: 2019-10-03
accepted date: 2019-10-03
in scheme: Definition of correct units for the observed determinands in the given WISE SoE DD tables
has determinand: EEA 33-15-8
has uom: ug.L-1
has table: WISE-SoE WaterQuality.AggregatedData

WISE-SoE_WaterQuality.AggregatedData - EEA_33-17-0 - ug/L
type: Concept
notation: WISE-SoE_WaterQuality.AggregatedData - EEA_33-17-0 - ug/L
definition: The unit of measure for 'EEA_33-17-0' (Hydrocarbons) in WISE SoE - Water Quality: Aggregated data table is 'ug/L'
status: valid
status modified: 2019-10-03
accepted date: 2019-10-03
in scheme: Definition of correct units for the observed determinands in the given WISE SoE DD tables
has determinand: EEA 33-17-0
has uom: ug.L-1
has table: WISE-SoE WaterQuality.AggregatedData

WISE-SoE_WaterQuality.AggregatedData - EEA_33-18-1 - ug/L
type: Concept
notation: WISE-SoE_WaterQuality.AggregatedData - EEA_33-18-1 - ug/L
definition: The unit of measure for 'EEA_33-18-1' (Meta xylene + para xylene) in WISE SoE - Water Quality: Aggregated data table is 'ug/L'
status: valid
status modified: 2019-10-03
accepted date: 2019-10-03
in scheme: Definition of correct units for the observed determinands in the given WISE SoE DD tables
has determinand: EEA 33-18-1
has uom: ug.L-1
has table: WISE-SoE WaterQuality.AggregatedData

WISE-SoE_WaterQuality.AggregatedData - EEA_33-19-2 - ug/L
type: Concept
notation: WISE-SoE_WaterQuality.AggregatedData - EEA_33-19-2 - ug/L
definition: The unit of measure for 'EEA_33-19-2' (Mono basic phenols) in WISE SoE - Water Quality: Aggregated data table is 'ug/L'
status: valid
status modified: 2019-10-03
accepted date: 2019-10-03
in scheme: Definition of correct units for the observed determinands in the given WISE SoE DD tables
has determinand: EEA 33-19-2
has uom: ug.L-1
has table: WISE-SoE WaterQuality.AggregatedData

WISE-SoE_WaterQuality.AggregatedData - EEA_33-20-5 - ug/L
type: Concept
notation: WISE-SoE_WaterQuality.AggregatedData - EEA_33-20-5 - ug/L
definition: The unit of measure for 'EEA_33-20-5' (Monochlorophenols) in WISE SoE - Water Quality: Aggregated data table is 'ug/L'
status: valid
status modified: 2019-10-03
accepted date: 2019-10-03
in scheme: Definition of correct units for the observed determinands in the given WISE SoE DD tables
has determinand: EEA 33-20-5
has uom: ug.L-1
has table: WISE-SoE WaterQuality.AggregatedData

WISE-SoE_WaterQuality.AggregatedData - EEA_33-21-6 - ug/L
type: Concept
notation: WISE-SoE_WaterQuality.AggregatedData - EEA_33-21-6 - ug/L
definition: The unit of measure for 'EEA_33-21-6' (Nitrobenzene) in WISE SoE - Water Quality: Aggregated data table is 'ug/L'
status: valid
status modified: 2019-10-03
accepted date: 2019-10-03
in scheme: Definition of correct units for the observed determinands in the given WISE SoE DD tables
has determinand: EEA 33-21-6
has uom: ug.L-1
has table: WISE-SoE WaterQuality.AggregatedData

WISE-SoE_WaterQuality.AggregatedData - EEA_33-22-7 - ug/L
type: Concept
notation: WISE-SoE_WaterQuality.AggregatedData - EEA_33-22-7 - ug/L
definition: The unit of measure for 'EEA_33-22-7' (Oil fractions (C10-40)) in WISE SoE - Water Quality: Aggregated data table is 'ug/L'
status: valid
status modified: 2019-10-03
accepted date: 2019-10-03
in scheme: Definition of correct units for the observed determinands in the given WISE SoE DD tables
has determinand: EEA 33-22-7
has uom: ug.L-1
has table: WISE-SoE WaterQuality.AggregatedData

WISE-SoE_WaterQuality.AggregatedData - EEA_33-23-8 - ug/L
type: Concept
notation: WISE-SoE_WaterQuality.AggregatedData - EEA_33-23-8 - ug/L
definition: The unit of measure for 'EEA_33-23-8' (Petroleum hydrocarbons) in WISE SoE - Water Quality: Aggregated data table is 'ug/L'
status: valid
status modified: 2019-10-03
accepted date: 2019-10-03
in scheme: Definition of correct units for the observed determinands in the given WISE SoE DD tables
has determinand: EEA 33-23-8
has uom: ug.L-1
has table: WISE-SoE WaterQuality.AggregatedData

WISE-SoE_WaterQuality.AggregatedData - EEA_33-24-9 - ug/L
type: Concept
notation: WISE-SoE_WaterQuality.AggregatedData - EEA_33-24-9 - ug/L
definition: The unit of measure for 'EEA_33-24-9' (Petroleum products) in WISE SoE - Water Quality: Aggregated data table is 'ug/L'
status: valid
status modified: 2019-10-03
accepted date: 2019-10-03
in scheme: Definition of correct units for the observed determinands in the given WISE SoE DD tables
has determinand: EEA 33-24-9
has uom: ug.L-1
has table: WISE-SoE WaterQuality.AggregatedData

WISE-SoE_WaterQuality.AggregatedData - EEA_33-26-1 - ug/L
type: Concept
notation: WISE-SoE_WaterQuality.AggregatedData - EEA_33-26-1 - ug/L
definition: The unit of measure for 'EEA_33-26-1' (Polychlorinated dibenzodioxins (PCDD)) in WISE SoE - Water Quality: Aggregated data table is 'ug/L'
status: valid
status modified: 2019-10-03
accepted date: 2019-10-03
in scheme: Definition of correct units for the observed determinands in the given WISE SoE DD tables
has determinand: EEA 33-26-1
has uom: ug.L-1
has table: WISE-SoE WaterQuality.AggregatedData

WISE-SoE_WaterQuality.AggregatedData - EEA_33-28-3 - ug/L
type: Concept
notation: WISE-SoE_WaterQuality.AggregatedData - EEA_33-28-3 - ug/L
definition: The unit of measure for 'EEA_33-28-3' (Surfactants (anionic and nonionic)) in WISE SoE - Water Quality: Aggregated data table is 'ug/L'
status: valid
status modified: 2019-10-03
accepted date: 2019-10-03
in scheme: Definition of correct units for the observed determinands in the given WISE SoE DD tables
has determinand: EEA 33-28-3
has uom: ug.L-1
has table: WISE-SoE WaterQuality.AggregatedData

WISE-SoE_WaterQuality.AggregatedData - EEA_33-29-4 - ug/L
type: Concept
notation: WISE-SoE_WaterQuality.AggregatedData - EEA_33-29-4 - ug/L
definition: The unit of measure for 'EEA_33-29-4' (Surfactants (anionic)) in WISE SoE - Water Quality: Aggregated data table is 'ug/L'
status: valid
status modified: 2019-10-03
accepted date: 2019-10-03
in scheme: Definition of correct units for the observed determinands in the given WISE SoE DD tables
has determinand: EEA 33-29-4
has uom: ug.L-1
has table: WISE-SoE WaterQuality.AggregatedData

WISE-SoE_WaterQuality.AggregatedData - EEA_33-31-8 - ug/L
type: Concept
notation: WISE-SoE_WaterQuality.AggregatedData - EEA_33-31-8 - ug/L
definition: The unit of measure for 'EEA_33-31-8' (Total chrysene + triphenylene) in WISE SoE - Water Quality: Aggregated data table is 'ug/L'
status: valid
status modified: 2019-10-03
accepted date: 2019-10-03
in scheme: Definition of correct units for the observed determinands in the given WISE SoE DD tables
has determinand: EEA 33-31-8
has uom: ug.L-1
has table: WISE-SoE WaterQuality.AggregatedData

WISE-SoE_WaterQuality.AggregatedData - EEA_33-32-9 - ug/L
type: Concept
notation: WISE-SoE_WaterQuality.AggregatedData - EEA_33-32-9 - ug/L
definition: The unit of measure for 'EEA_33-32-9' (Total DDD (DDD, o,p' + DDD, p,p')) in WISE SoE - Water Quality: Aggregated data table is 'ug/L'
status: valid
status modified: 2019-10-03
accepted date: 2019-10-03
in scheme: Definition of correct units for the observed determinands in the given WISE SoE DD tables
has determinand: EEA 33-32-9
has uom: ug.L-1
has table: WISE-SoE WaterQuality.AggregatedData

WISE-SoE_WaterQuality.AggregatedData - EEA_33-36-3 - ug/L
type: Concept
notation: WISE-SoE_WaterQuality.AggregatedData - EEA_33-36-3 - ug/L
definition: The unit of measure for 'EEA_33-36-3' (Total hydrocarbons) in WISE SoE - Water Quality: Aggregated data table is 'ug/L'
status: valid
status modified: 2019-10-03
accepted date: 2019-10-03
in scheme: Definition of correct units for the observed determinands in the given WISE SoE DD tables
has determinand: EEA 33-36-3
has uom: ug.L-1
has table: WISE-SoE WaterQuality.AggregatedData

WISE-SoE_WaterQuality.AggregatedData - EEA_33-38-5 - ug/L
type: Concept
notation: WISE-SoE_WaterQuality.AggregatedData - EEA_33-38-5 - ug/L
definition: The unit of measure for 'EEA_33-38-5' (Polychlorinated biphenyls (7 PCB: 28,52,101,118,138,153,180)) in WISE SoE - Water Quality: Aggregated data table is 'ug/L'
status: valid
status modified: 2019-10-03
accepted date: 2019-10-03
in scheme: Definition of correct units for the observed determinands in the given WISE SoE DD tables
has determinand: EEA 33-38-5
has uom: ug.L-1
has table: WISE-SoE WaterQuality.AggregatedData

WISE-SoE_WaterQuality.AggregatedData - EEA_33-40-9 - ug/L
type: Concept
notation: WISE-SoE_WaterQuality.AggregatedData - EEA_33-40-9 - ug/L
definition: The unit of measure for 'EEA_33-40-9' (Total dioxins and furans (PCDD + PCDF)) in WISE SoE - Water Quality: Aggregated data table is 'ug/L'
status: valid
status modified: 2019-10-03
accepted date: 2019-10-03
in scheme: Definition of correct units for the observed determinands in the given WISE SoE DD tables
has determinand: EEA 33-40-9
has uom: ug.L-1
has table: WISE-SoE WaterQuality.AggregatedData

WISE-SoE_WaterQuality.AggregatedData - EEA_33-41-0 - ug/L
type: Concept
notation: WISE-SoE_WaterQuality.AggregatedData - EEA_33-41-0 - ug/L
definition: The unit of measure for 'EEA_33-41-0' (Total tri-, tetra- and pentachlorophenol) in WISE SoE - Water Quality: Aggregated data table is 'ug/L'
status: valid
status modified: 2019-10-03
accepted date: 2019-10-03
in scheme: Definition of correct units for the observed determinands in the given WISE SoE DD tables
has determinand: EEA 33-41-0
has uom: ug.L-1
has table: WISE-SoE WaterQuality.AggregatedData

WISE-SoE_WaterQuality.AggregatedData - EEA_33-42-1 - ug/L
type: Concept
notation: WISE-SoE_WaterQuality.AggregatedData - EEA_33-42-1 - ug/L
definition: The unit of measure for 'EEA_33-42-1' (Total trichloroethylene + tetrachloroethylene) in WISE SoE - Water Quality: Aggregated data table is 'ug/L'
status: valid
status modified: 2019-10-03
accepted date: 2019-10-03
in scheme: Definition of correct units for the observed determinands in the given WISE SoE DD tables
has determinand: EEA 33-42-1
has uom: ug.L-1
has table: WISE-SoE WaterQuality.AggregatedData

WISE-SoE_WaterQuality.AggregatedData - EEA_33-43-2 - ug/L
type: Concept
notation: WISE-SoE_WaterQuality.AggregatedData - EEA_33-43-2 - ug/L
definition: The unit of measure for 'EEA_33-43-2' (Total trihalomethanes) in WISE SoE - Water Quality: Aggregated data table is 'ug/L'
status: valid
status modified: 2019-10-03
accepted date: 2019-10-03
in scheme: Definition of correct units for the observed determinands in the given WISE SoE DD tables
has determinand: EEA 33-43-2
has uom: ug.L-1
has table: WISE-SoE WaterQuality.AggregatedData

WISE-SoE_WaterQuality.AggregatedData - EEA_33-44-3 - ug/L
type: Concept
notation: WISE-SoE_WaterQuality.AggregatedData - EEA_33-44-3 - ug/L
definition: The unit of measure for 'EEA_33-44-3' (Total highly volatile halogenated hydrocarbons) in WISE SoE - Water Quality: Aggregated data table is 'ug/L'
status: valid
status modified: 2019-10-03
accepted date: 2019-10-03
in scheme: Definition of correct units for the observed determinands in the given WISE SoE DD tables
has determinand: EEA 33-44-3
has uom: ug.L-1
has table: WISE-SoE WaterQuality.AggregatedData

WISE-SoE_WaterQuality.AggregatedData - EEA_33-45-4 - ug/L
type: Concept
notation: WISE-SoE_WaterQuality.AggregatedData - EEA_33-45-4 - ug/L
definition: The unit of measure for 'EEA_33-45-4' (Volatile halogenated hydrocarbons (VHH)) in WISE SoE - Water Quality: Aggregated data table is 'ug/L'
status: valid
status modified: 2019-10-03
accepted date: 2019-10-03
in scheme: Definition of correct units for the observed determinands in the given WISE SoE DD tables
has determinand: EEA 33-45-4
has uom: ug.L-1
has table: WISE-SoE WaterQuality.AggregatedData

WISE-SoE_WaterQuality.AggregatedData - EEA_33-46-5 - ug/L
type: Concept
notation: WISE-SoE_WaterQuality.AggregatedData - EEA_33-46-5 - ug/L
definition: The unit of measure for 'EEA_33-46-5' (Volatile organic halogens (VOX)) in WISE SoE - Water Quality: Aggregated data table is 'ug/L'
status: valid
status modified: 2019-10-03
accepted date: 2019-10-03
in scheme: Definition of correct units for the observed determinands in the given WISE SoE DD tables
has determinand: EEA 33-46-5
has uom: ug.L-1
has table: WISE-SoE WaterQuality.AggregatedData

WISE-SoE_WaterQuality.AggregatedData - EEA_33-50-1 - ug/L
type: Concept
notation: WISE-SoE_WaterQuality.AggregatedData - EEA_33-50-1 - ug/L
definition: The unit of measure for 'EEA_33-50-1' (Heptachlor and heptachlor epoxide) in WISE SoE - Water Quality: Aggregated data table is 'ug/L'
status: valid
status modified: 2019-10-03
accepted date: 2019-10-03
in scheme: Definition of correct units for the observed determinands in the given WISE SoE DD tables
has determinand: EEA 33-50-1
has uom: ug.L-1
has table: WISE-SoE WaterQuality.AggregatedData

WISE-SoE_WaterQuality.AggregatedData - EEA_33-51-2 - ug/L
type: Concept
notation: WISE-SoE_WaterQuality.AggregatedData - EEA_33-51-2 - ug/L
definition: The unit of measure for 'EEA_33-51-2' (Total macrolide antibiotics (erythromycin + clarithromycin + azithromycin)) in WISE SoE - Water Quality: Aggregated data table is 'ug/L'
status: valid
status modified: 2019-10-03
accepted date: 2019-10-03
in scheme: Definition of correct units for the observed determinands in the given WISE SoE DD tables
has determinand: EEA 33-51-2
has uom: ug.L-1
has table: WISE-SoE WaterQuality.AggregatedData

WISE-SoE_WaterQuality.AggregatedData - EEA_33-52-3 - ug/L
type: Concept
notation: WISE-SoE_WaterQuality.AggregatedData - EEA_33-52-3 - ug/L
definition: The unit of measure for 'EEA_33-52-3' (Total neonicotinoid insecticides (imidacloprid + thiacloprid + thiamethoxam + clothianidin + acetamiprid)) in WISE SoE - Water Quality: Aggregated data table is 'ug/L'
status: valid
status modified: 2019-10-03
accepted date: 2019-10-03
in scheme: Definition of correct units for the observed determinands in the given WISE SoE DD tables
has determinand: EEA 33-52-3
has uom: ug.L-1
has table: WISE-SoE WaterQuality.AggregatedData

WISE-SoE_WaterQuality.AggregatedData - EEA_33-53-4 - ug/L
type: Concept
notation: WISE-SoE_WaterQuality.AggregatedData - EEA_33-53-4 - ug/L
definition: The unit of measure for 'EEA_33-53-4' (Total Estrone (E1) + 17beta-estradiol (E2)) in WISE SoE - Water Quality: Aggregated data table is 'ug/L'
status: valid
status modified: 2019-10-03
accepted date: 2019-10-03
in scheme: Definition of correct units for the observed determinands in the given WISE SoE DD tables
has determinand: EEA 33-53-4
has uom: ug.L-1
has table: WISE-SoE WaterQuality.AggregatedData

WISE-SoE_WaterQuality.AggregatedData - EEA_33-54-5 - ug/L
type: Concept
notation: WISE-SoE_WaterQuality.AggregatedData - EEA_33-54-5 - ug/L
definition: The unit of measure for 'EEA_33-54-5' (Dioxin-like polychlorinated biphenyls (12 PCB-DLs: 77,81,105,114,118,123,126,156,157,167,169,189)) in WISE SoE - Water Quality: Aggregated data table is 'ug/L'
status: valid
status modified: 2019-10-03
accepted date: 2019-10-03
in scheme: Definition of correct units for the observed determinands in the given WISE SoE DD tables
has determinand: EEA 33-54-5
has uom: ug.L-1
has table: WISE-SoE WaterQuality.AggregatedData

WISE-SoE_WaterQuality.AggregatedData - EEA_33-55-6 - ug/L
type: Concept
notation: WISE-SoE_WaterQuality.AggregatedData - EEA_33-55-6 - ug/L
definition: The unit of measure for 'EEA_33-55-6' (Octylphenols (CAS 1806-26-4) including isomer 4-(1,1',3,3'-tetramethylbutyl)-phenol (CAS 140-66-9)) in WISE SoE - Water Quality: Aggregated data table is 'ug/L'
status: valid
status modified: 2019-10-03
accepted date: 2019-10-03
in scheme: Definition of correct units for the observed determinands in the given WISE SoE DD tables
has determinand: EEA 33-55-6
has uom: ug.L-1
has table: WISE-SoE WaterQuality.AggregatedData

WISE-SoE_WaterQuality.AggregatedData - EEA_33-56-7 - ug/L
type: Concept
notation: WISE-SoE_WaterQuality.AggregatedData - EEA_33-56-7 - ug/L
definition: The unit of measure for 'EEA_33-56-7' (Total PAHs (Benzo(a)pyrene, Benzo(b)fluoranthene, Benzo(k)fluoranthene, Benzo(ghi)perylene, Indeno(1,2,3-cd)pyrene)) in WISE SoE - Water Quality: Aggregated data table is 'ug/L'
status: valid
status modified: 2019-10-03
accepted date: 2019-10-03
in scheme: Definition of correct units for the observed determinands in the given WISE SoE DD tables
has determinand: EEA 33-56-7
has uom: ug.L-1
has table: WISE-SoE WaterQuality.AggregatedData

WISE-SoE_WaterQuality.AggregatedData - EEA_33-57-8 - ug/L
type: Concept
notation: WISE-SoE_WaterQuality.AggregatedData - EEA_33-57-8 - ug/L
definition: The unit of measure for 'EEA_33-57-8' (Hexabromocyclododecanes (HBCDD)) in WISE SoE - Water Quality: Aggregated data table is 'ug/L'
status: valid
status modified: 2019-10-03
accepted date: 2019-10-03
in scheme: Definition of correct units for the observed determinands in the given WISE SoE DD tables
has determinand: EEA 33-57-8
has uom: ug.L-1
has table: WISE-SoE WaterQuality.AggregatedData

WISE-SoE_WaterQuality.AggregatedData - EEA_33-58-9 - ug/L
type: Concept
notation: WISE-SoE_WaterQuality.AggregatedData - EEA_33-58-9 - ug/L
definition: The unit of measure for 'EEA_33-58-9' (Dioxins and dioxin-like compounds (7 PCDDs + 10 PCDFs + 12 PCB-DLs)) in WISE SoE - Water Quality: Aggregated data table is 'ug/L'
status: valid
status modified: 2019-10-03
accepted date: 2019-10-03
in scheme: Definition of correct units for the observed determinands in the given WISE SoE DD tables
has determinand: EEA 33-58-9
has uom: ug.L-1
has table: WISE-SoE WaterQuality.AggregatedData

WISE-SoE_WaterQuality.AggregatedData - EEA_33-59-0 - ug/L
type: Concept
notation: WISE-SoE_WaterQuality.AggregatedData - EEA_33-59-0 - ug/L
definition: The unit of measure for 'EEA_33-59-0' (Nonylphenol and nonylphenol ethoxylates (NP + NPEs)) in WISE SoE - Water Quality: Aggregated data table is 'ug/L'
status: valid
status modified: 2019-10-03
accepted date: 2019-10-03
in scheme: Definition of correct units for the observed determinands in the given WISE SoE DD tables
has determinand: EEA 33-59-0
has uom: ug.L-1
has table: WISE-SoE WaterQuality.AggregatedData

WISE-SoE_WaterQuality.AggregatedData - EEA_33-60-3 - ug/L
type: Concept
notation: WISE-SoE_WaterQuality.AggregatedData - EEA_33-60-3 - ug/L
definition: The unit of measure for 'EEA_33-60-3' (Organotin compounds (as total Sn)) in WISE SoE - Water Quality: Aggregated data table is 'ug/L'
status: valid
status modified: 2019-10-03
accepted date: 2019-10-03
in scheme: Definition of correct units for the observed determinands in the given WISE SoE DD tables
has determinand: EEA 33-60-3
has uom: ug.L-1
has table: WISE-SoE WaterQuality.AggregatedData

WISE-SoE_WaterQuality.AggregatedData - EEA_33-61-4 - ug/L
type: Concept
notation: WISE-SoE_WaterQuality.AggregatedData - EEA_33-61-4 - ug/L
definition: The unit of measure for 'EEA_33-61-4' (Triphenyltin and compounds) in WISE SoE - Water Quality: Aggregated data table is 'ug/L'
status: valid
status modified: 2019-10-03
accepted date: 2019-10-03
in scheme: Definition of correct units for the observed determinands in the given WISE SoE DD tables
has determinand: EEA 33-61-4
has uom: ug.L-1
has table: WISE-SoE WaterQuality.AggregatedData

WISE-SoE_WaterQuality.AggregatedData - EEA_33-62-5 - ug/L
type: Concept
notation: WISE-SoE_WaterQuality.AggregatedData - EEA_33-62-5 - ug/L
definition: The unit of measure for 'EEA_33-62-5' (Total PAHs (4 PAHs: Benzo(a)pyrene, Benzo(b)fluoranthene, Benzo(k)fluoranthene, Indeno(1,2,3-cd)pyrene)) in WISE SoE - Water Quality: Aggregated data table is 'ug/L'
status: valid
status modified: 2019-10-03
accepted date: 2019-10-03
in scheme: Definition of correct units for the observed determinands in the given WISE SoE DD tables
has determinand: EEA 33-62-5
has uom: ug.L-1
has table: WISE-SoE WaterQuality.AggregatedData

WISE-SoE_WaterQuality.AggregatedData - EEA_33-63-6 - ug/L
type: Concept
notation: WISE-SoE_WaterQuality.AggregatedData - EEA_33-63-6 - ug/L
definition: The unit of measure for 'EEA_33-63-6' (Total brominated diphenylethers (penta-BDE + octa-BDE + deca-BDE)) in WISE SoE - Water Quality: Aggregated data table is 'ug/L'
status: valid
status modified: 2019-10-03
accepted date: 2019-10-03
in scheme: Definition of correct units for the observed determinands in the given WISE SoE DD tables
has determinand: EEA 33-63-6
has uom: ug.L-1
has table: WISE-SoE WaterQuality.AggregatedData

WISE-SoE_WaterQuality.AggregatedData - EEA_33-64-7 - ug/L
type: Concept
notation: WISE-SoE_WaterQuality.AggregatedData - EEA_33-64-7 - ug/L
definition: The unit of measure for 'EEA_33-64-7' (Total cyanide) in WISE SoE - Water Quality: Aggregated data table is 'ug/L'
status: valid
status modified: 2019-10-03
accepted date: 2019-10-03
in scheme: Definition of correct units for the observed determinands in the given WISE SoE DD tables
has determinand: EEA 33-64-7
has uom: ug.L-1
has table: WISE-SoE WaterQuality.AggregatedData

WISE-SoE_WaterQuality.AggregatedData - EEA_33-65-8 - ug/L
type: Concept
notation: WISE-SoE_WaterQuality.AggregatedData - EEA_33-65-8 - ug/L
definition: The unit of measure for 'EEA_33-65-8' (Oxydemeton-methyl) in WISE SoE - Water Quality: Aggregated data table is 'ug/L'
status: valid
status modified: 2019-10-03
accepted date: 2019-10-03
in scheme: Definition of correct units for the observed determinands in the given WISE SoE DD tables
has determinand: EEA 33-65-8
has uom: ug.L-1
has table: WISE-SoE WaterQuality.AggregatedData

WISE-SoE_WaterQuality.AggregatedData - EEA_34-01-5 - ug/L
type: Concept
notation: WISE-SoE_WaterQuality.AggregatedData - EEA_34-01-5 - ug/L
definition: The unit of measure for 'EEA_34-01-5' (Pesticides (Active substances in pesticides, including their relevant metabolites, degradation and reaction products)) in WISE SoE - Water Quality: Aggregated data table is 'ug/L'
status: valid
status modified: 2019-10-03
accepted date: 2019-10-03
in scheme: Definition of correct units for the observed determinands in the given WISE SoE DD tables
has determinand: EEA 34-01-5
has uom: ug.L-1
has table: WISE-SoE WaterQuality.AggregatedData

WISE-SoE_WaterQuality.AggregatedDataByWaterBody - CAS_14797-55-8 - mg{NO3}/L
type: Concept
notation: WISE-SoE_WaterQuality.AggregatedDataByWaterBody - CAS_14797-55-8 - mg{NO3}/L
definition: The unit of measure for 'CAS_14797-55-8' (Nitrate) in WISE SoE - Water Quality: Aggregated data by water body table is 'mg{NO3}/L'
status: valid
status modified: 2019-10-03
accepted date: 2019-10-03
in scheme: Definition of correct units for the observed determinands in the given WISE SoE DD tables
has determinand: CAS 14797-55-8
has uom: mg{NO3}.L-1
has table: WISE-SoE WaterQuality.AggregatedDataByWaterBody

WISE-SoE_WaterQuality.AggregatedDataByWaterBody - CAS_14797-65-0 - mg{NO2}/L
type: Concept
notation: WISE-SoE_WaterQuality.AggregatedDataByWaterBody - CAS_14797-65-0 - mg{NO2}/L
definition: The unit of measure for 'CAS_14797-65-0' (Nitrite) in WISE SoE - Water Quality: Aggregated data by water body table is 'mg{NO2}/L'
status: valid
status modified: 2019-10-03
accepted date: 2019-10-03
in scheme: Definition of correct units for the observed determinands in the given WISE SoE DD tables
has determinand: CAS 14797-65-0
has uom: mg{NO2}.L-1
has table: WISE-SoE WaterQuality.AggregatedDataByWaterBody

WISE-SoE_WaterQuality.AggregatedDataByWaterBody - CAS_14798-03-9 - mg{NH4}/L
type: Concept
notation: WISE-SoE_WaterQuality.AggregatedDataByWaterBody - CAS_14798-03-9 - mg{NH4}/L
definition: The unit of measure for 'CAS_14798-03-9' (Ammonium) in WISE SoE - Water Quality: Aggregated data by water body table is 'mg{NH4}/L'
status: valid
status modified: 2019-10-03
accepted date: 2019-10-03
in scheme: Definition of correct units for the observed determinands in the given WISE SoE DD tables
has determinand: CAS 14798-03-9
has uom: mg{NH4}.L-1
has table: WISE-SoE WaterQuality.AggregatedDataByWaterBody

WISE-SoE_WaterQuality.AggregatedDataByWaterBody - EEA_3132-01-2 - mg/L
type: Concept
notation: WISE-SoE_WaterQuality.AggregatedDataByWaterBody - EEA_3132-01-2 - mg/L
definition: The unit of measure for 'EEA_3132-01-2' (Dissolved oxygen) in WISE SoE - Water Quality: Aggregated data by water body table is 'mg/L'
status: valid
status modified: 2019-10-03
accepted date: 2019-10-03
in scheme: Definition of correct units for the observed determinands in the given WISE SoE DD tables
has determinand: EEA 3132-01-2
has uom: mg.L-1
has table: WISE-SoE WaterQuality.AggregatedDataByWaterBody

WISE-SoE_WaterQuality.DisaggregatedData - CAS_100-00-5 - ug/L
type: Concept
notation: WISE-SoE_WaterQuality.DisaggregatedData - CAS_100-00-5 - ug/L
definition: The unit of measure for 'CAS_100-00-5' (1-chloro-4-nitrobenzene) in WISE SoE - Water Quality: Disaggregated data table is 'ug/L'
status: valid
status modified: 2019-10-03
accepted date: 2019-10-03
in scheme: Definition of correct units for the observed determinands in the given WISE SoE DD tables
has determinand: CAS 100-00-5
has uom: ug.L-1
has table: WISE-SoE WaterQuality.DisaggregatedData

WISE-SoE_WaterQuality.DisaggregatedData - CAS_100-02-7 - ug/L
type: Concept
notation: WISE-SoE_WaterQuality.DisaggregatedData - CAS_100-02-7 - ug/L
definition: The unit of measure for 'CAS_100-02-7' (Nitrophenol) in WISE SoE - Water Quality: Disaggregated data table is 'ug/L'
status: valid
status modified: 2019-10-03
accepted date: 2019-10-03
in scheme: Definition of correct units for the observed determinands in the given WISE SoE DD tables
has determinand: CAS 100-02-7
has uom: ug.L-1
has table: WISE-SoE WaterQuality.DisaggregatedData

WISE-SoE_WaterQuality.DisaggregatedData - CAS_100-41-4 - ug/L
type: Concept
notation: WISE-SoE_WaterQuality.DisaggregatedData - CAS_100-41-4 - ug/L
definition: The unit of measure for 'CAS_100-41-4' (Ethylbenzene) in WISE SoE - Water Quality: Disaggregated data table is 'ug/L'
status: valid
status modified: 2019-10-03
accepted date: 2019-10-03
in scheme: Definition of correct units for the observed determinands in the given WISE SoE DD tables
has determinand: CAS 100-41-4
has uom: ug.L-1
has table: WISE-SoE WaterQuality.DisaggregatedData

WISE-SoE_WaterQuality.DisaggregatedData - CAS_100-42-5 - ug/L
type: Concept
notation: WISE-SoE_WaterQuality.DisaggregatedData - CAS_100-42-5 - ug/L
definition: The unit of measure for 'CAS_100-42-5' (Styrene) in WISE SoE - Water Quality: Disaggregated data table is 'ug/L'
status: valid
status modified: 2019-10-03
accepted date: 2019-10-03
in scheme: Definition of correct units for the observed determinands in the given WISE SoE DD tables
has determinand: CAS 100-42-5
has uom: ug.L-1
has table: WISE-SoE WaterQuality.DisaggregatedData

WISE-SoE_WaterQuality.DisaggregatedData - CAS_100-44-7 - ug/L
type: Concept
notation: WISE-SoE_WaterQuality.DisaggregatedData - CAS_100-44-7 - ug/L
definition: The unit of measure for 'CAS_100-44-7' (Benzyl chloride) in WISE SoE - Water Quality: Disaggregated data table is 'ug/L'
status: valid
status modified: 2019-10-03
accepted date: 2019-10-03
in scheme: Definition of correct units for the observed determinands in the given WISE SoE DD tables
has determinand: CAS 100-44-7
has uom: ug.L-1
has table: WISE-SoE WaterQuality.DisaggregatedData

WISE-SoE_WaterQuality.DisaggregatedData - CAS_1002-53-5 - ug/L
type: Concept
notation: WISE-SoE_WaterQuality.DisaggregatedData - CAS_1002-53-5 - ug/L
definition: The unit of measure for 'CAS_1002-53-5' (Dibutyltin) in WISE SoE - Water Quality: Disaggregated data table is 'ug/L'
status: valid
status modified: 2019-10-03
accepted date: 2019-10-03
in scheme: Definition of correct units for the observed determinands in the given WISE SoE DD tables
has determinand: CAS 1002-53-5
has uom: ug.L-1
has table: WISE-SoE WaterQuality.DisaggregatedData

WISE-SoE_WaterQuality.DisaggregatedData - CAS_10028-17-8 - ug/L
type: Concept
notation: WISE-SoE_WaterQuality.DisaggregatedData - CAS_10028-17-8 - ug/L
definition: The unit of measure for 'CAS_10028-17-8' (Tritium) in WISE SoE - Water Quality: Disaggregated data table is 'ug/L'
status: valid
status modified: 2019-10-03
accepted date: 2019-10-03
in scheme: Definition of correct units for the observed determinands in the given WISE SoE DD tables
has determinand: CAS 10028-17-8
has uom: ug.L-1
has table: WISE-SoE WaterQuality.DisaggregatedData

WISE-SoE_WaterQuality.DisaggregatedData - CAS_10061-01-5 - ug/L
type: Concept
notation: WISE-SoE_WaterQuality.DisaggregatedData - CAS_10061-01-5 - ug/L
definition: The unit of measure for 'CAS_10061-01-5' (cis-1,3-dichloropropene) in WISE SoE - Water Quality: Disaggregated data table is 'ug/L'
status: valid
status modified: 2019-10-03
accepted date: 2019-10-03
in scheme: Definition of correct units for the observed determinands in the given WISE SoE DD tables
has determinand: CAS 10061-01-5
has uom: ug.L-1
has table: WISE-SoE WaterQuality.DisaggregatedData

WISE-SoE_WaterQuality.DisaggregatedData - CAS_10061-02-6 - ug/L
type: Concept
notation: WISE-SoE_WaterQuality.DisaggregatedData - CAS_10061-02-6 - ug/L
definition: The unit of measure for 'CAS_10061-02-6' (trans-1,3-dichloropropene) in WISE SoE - Water Quality: Disaggregated data table is 'ug/L'
status: valid
status modified: 2019-10-03
accepted date: 2019-10-03
in scheme: Definition of correct units for the observed determinands in the given WISE SoE DD tables
has determinand: CAS 10061-02-6
has uom: ug.L-1
has table: WISE-SoE WaterQuality.DisaggregatedData

WISE-SoE_WaterQuality.DisaggregatedData - CAS_100646-51-3 - ug/L
type: Concept
notation: WISE-SoE_WaterQuality.DisaggregatedData - CAS_100646-51-3 - ug/L
definition: The unit of measure for 'CAS_100646-51-3' (Quizalofop-P-ethyl) in WISE SoE - Water Quality: Disaggregated data table is 'ug/L'
status: valid
status modified: 2019-10-03
accepted date: 2019-10-03
in scheme: Definition of correct units for the observed determinands in the given WISE SoE DD tables
has determinand: CAS 100646-51-3
has uom: ug.L-1
has table: WISE-SoE WaterQuality.DisaggregatedData

WISE-SoE_WaterQuality.DisaggregatedData - CAS_1007-28-9 - ug/L
type: Concept
notation: WISE-SoE_WaterQuality.DisaggregatedData - CAS_1007-28-9 - ug/L
definition: The unit of measure for 'CAS_1007-28-9' (Desisopropylatrazine) in WISE SoE - Water Quality: Disaggregated data table is 'ug/L'
status: valid
status modified: 2019-10-03
accepted date: 2019-10-03
in scheme: Definition of correct units for the observed determinands in the given WISE SoE DD tables
has determinand: CAS 1007-28-9
has uom: ug.L-1
has table: WISE-SoE WaterQuality.DisaggregatedData

WISE-SoE_WaterQuality.DisaggregatedData - CAS_101-21-3 - ug/L
type: Concept
notation: WISE-SoE_WaterQuality.DisaggregatedData - CAS_101-21-3 - ug/L
definition: The unit of measure for 'CAS_101-21-3' (Chlorpropham) in WISE SoE - Water Quality: Disaggregated data table is 'ug/L'
status: valid
status modified: 2019-10-03
accepted date: 2019-10-03
in scheme: Definition of correct units for the observed determinands in the given WISE SoE DD tables
has determinand: CAS 101-21-3
has uom: ug.L-1
has table: WISE-SoE WaterQuality.DisaggregatedData

WISE-SoE_WaterQuality.DisaggregatedData - CAS_101-42-8 - ug/L
type: Concept
notation: WISE-SoE_WaterQuality.DisaggregatedData - CAS_101-42-8 - ug/L
definition: The unit of measure for 'CAS_101-42-8' (Fenuron) in WISE SoE - Water Quality: Disaggregated data table is 'ug/L'
status: valid
status modified: 2019-10-03
accepted date: 2019-10-03
in scheme: Definition of correct units for the observed determinands in the given WISE SoE DD tables
has determinand: CAS 101-42-8
has uom: ug.L-1
has table: WISE-SoE WaterQuality.DisaggregatedData

WISE-SoE_WaterQuality.DisaggregatedData - CAS_101-55-3 - ug/L
type: Concept
notation: WISE-SoE_WaterQuality.DisaggregatedData - CAS_101-55-3 - ug/L
definition: The unit of measure for 'CAS_101-55-3' (4-bromophenyl phenyl ether) in WISE SoE - Water Quality: Disaggregated data table is 'ug/L'
status: valid
status modified: 2019-10-03
accepted date: 2019-10-03
in scheme: Definition of correct units for the observed determinands in the given WISE SoE DD tables
has determinand: CAS 101-55-3
has uom: ug.L-1
has table: WISE-SoE WaterQuality.DisaggregatedData

WISE-SoE_WaterQuality.DisaggregatedData - CAS_101205-02-1 - ug/L
type: Concept
notation: WISE-SoE_WaterQuality.DisaggregatedData - CAS_101205-02-1 - ug/L
definition: The unit of measure for 'CAS_101205-02-1' (Cycloxydim) in WISE SoE - Water Quality: Disaggregated data table is 'ug/L'
status: valid
status modified: 2019-10-03
accepted date: 2019-10-03
in scheme: Definition of correct units for the observed determinands in the given WISE SoE DD tables
has determinand: CAS 101205-02-1
has uom: ug.L-1
has table: WISE-SoE WaterQuality.DisaggregatedData

WISE-SoE_WaterQuality.DisaggregatedData - CAS_1014-69-3 - ug/L
type: Concept
notation: WISE-SoE_WaterQuality.DisaggregatedData - CAS_1014-69-3 - ug/L
definition: The unit of measure for 'CAS_1014-69-3' (Desmetryn) in WISE SoE - Water Quality: Disaggregated data table is 'ug/L'
status: valid
status modified: 2019-10-03
accepted date: 2019-10-03
in scheme: Definition of correct units for the observed determinands in the given WISE SoE DD tables
has determinand: CAS 1014-69-3
has uom: ug.L-1
has table: WISE-SoE WaterQuality.DisaggregatedData

WISE-SoE_WaterQuality.DisaggregatedData - CAS_1024-57-3 - ug/L
type: Concept
notation: WISE-SoE_WaterQuality.DisaggregatedData - CAS_1024-57-3 - ug/L
definition: The unit of measure for 'CAS_1024-57-3' (Heptachlor epoxide) in WISE SoE - Water Quality: Disaggregated data table is 'ug/L'
status: valid
status modified: 2019-10-03
accepted date: 2019-10-03
in scheme: Definition of correct units for the observed determinands in the given WISE SoE DD tables
has determinand: CAS 1024-57-3
has uom: ug.L-1
has table: WISE-SoE WaterQuality.DisaggregatedData

WISE-SoE_WaterQuality.DisaggregatedData - CAS_10265-92-6 - ug/L
type: Concept
notation: WISE-SoE_WaterQuality.DisaggregatedData - CAS_10265-92-6 - ug/L
definition: The unit of measure for 'CAS_10265-92-6' (Methamidophos) in WISE SoE - Water Quality: Disaggregated data table is 'ug/L'
status: valid
status modified: 2019-10-03
accepted date: 2019-10-03
in scheme: Definition of correct units for the observed determinands in the given WISE SoE DD tables
has determinand: CAS 10265-92-6
has uom: ug.L-1
has table: WISE-SoE WaterQuality.DisaggregatedData

WISE-SoE_WaterQuality.DisaggregatedData - CAS_103-65-1 - ug/L
type: Concept
notation: WISE-SoE_WaterQuality.DisaggregatedData - CAS_103-65-1 - ug/L
definition: The unit of measure for 'CAS_103-65-1' (n-propylbenzene) in WISE SoE - Water Quality: Disaggregated data table is 'ug/L'
status: valid
status modified: 2019-10-03
accepted date: 2019-10-03
in scheme: Definition of correct units for the observed determinands in the given WISE SoE DD tables
has determinand: CAS 103-65-1
has uom: ug.L-1
has table: WISE-SoE WaterQuality.DisaggregatedData

WISE-SoE_WaterQuality.DisaggregatedData - CAS_1031-07-8 - ug/L
type: Concept
notation: WISE-SoE_WaterQuality.DisaggregatedData - CAS_1031-07-8 - ug/L
definition: The unit of measure for 'CAS_1031-07-8' (Endosulfan sulfate) in WISE SoE - Water Quality: Disaggregated data table is 'ug/L'
status: valid
status modified: 2019-10-03
accepted date: 2019-10-03
in scheme: Definition of correct units for the observed determinands in the given WISE SoE DD tables
has determinand: CAS 1031-07-8
has uom: ug.L-1
has table: WISE-SoE WaterQuality.DisaggregatedData

WISE-SoE_WaterQuality.DisaggregatedData - CAS_104-40-5 - ug/L
type: Concept
notation: WISE-SoE_WaterQuality.DisaggregatedData - CAS_104-40-5 - ug/L
definition: The unit of measure for 'CAS_104-40-5' (4-nonylphenol) in WISE SoE - Water Quality: Disaggregated data table is 'ug/L'
status: valid
status modified: 2019-10-03
accepted date: 2019-10-03
in scheme: Definition of correct units for the observed determinands in the given WISE SoE DD tables
has determinand: CAS 104-40-5
has uom: ug.L-1
has table: WISE-SoE WaterQuality.DisaggregatedData

WISE-SoE_WaterQuality.DisaggregatedData - CAS_104-51-8 - ug/L
type: Concept
notation: WISE-SoE_WaterQuality.DisaggregatedData - CAS_104-51-8 - ug/L
definition: The unit of measure for 'CAS_104-51-8' (n-butylbenzene) in WISE SoE - Water Quality: Disaggregated data table is 'ug/L'
status: valid
status modified: 2019-10-03
accepted date: 2019-10-03
in scheme: Definition of correct units for the observed determinands in the given WISE SoE DD tables
has determinand: CAS 104-51-8
has uom: ug.L-1
has table: WISE-SoE WaterQuality.DisaggregatedData

WISE-SoE_WaterQuality.DisaggregatedData - CAS_104206-82-8 - ug/L
type: Concept
notation: WISE-SoE_WaterQuality.DisaggregatedData - CAS_104206-82-8 - ug/L
definition: The unit of measure for 'CAS_104206-82-8' (Mesotrione) in WISE SoE - Water Quality: Disaggregated data table is 'ug/L'
status: valid
status modified: 2019-10-03
accepted date: 2019-10-03
in scheme: Definition of correct units for the observed determinands in the given WISE SoE DD tables
has determinand: CAS 104206-82-8
has uom: ug.L-1
has table: WISE-SoE WaterQuality.DisaggregatedData

WISE-SoE_WaterQuality.DisaggregatedData - CAS_105-67-9 - ug/L
type: Concept
notation: WISE-SoE_WaterQuality.DisaggregatedData - CAS_105-67-9 - ug/L
definition: The unit of measure for 'CAS_105-67-9' (2,4-dimethyl-phenol) in WISE SoE - Water Quality: Disaggregated data table is 'ug/L'
status: valid
status modified: 2019-10-03
accepted date: 2019-10-03
in scheme: Definition of correct units for the observed determinands in the given WISE SoE DD tables
has determinand: CAS 105-67-9
has uom: ug.L-1
has table: WISE-SoE WaterQuality.DisaggregatedData

WISE-SoE_WaterQuality.DisaggregatedData - CAS_105827-78-9 - ug/L
type: Concept
notation: WISE-SoE_WaterQuality.DisaggregatedData - CAS_105827-78-9 - ug/L
definition: The unit of measure for 'CAS_105827-78-9' (Imidacloprid (Watch list only alternative code)) in WISE SoE - Water Quality: Disaggregated data table is 'ug/L'
status: valid
status modified: 2019-10-03
accepted date: 2019-10-03
in scheme: Definition of correct units for the observed determinands in the given WISE SoE DD tables
has determinand: CAS 105827-78-9
has uom: ug.L-1
has table: WISE-SoE WaterQuality.DisaggregatedData

WISE-SoE_WaterQuality.DisaggregatedData - CAS_10599-90-3 - ug/L
type: Concept
notation: WISE-SoE_WaterQuality.DisaggregatedData - CAS_10599-90-3 - ug/L
definition: The unit of measure for 'CAS_10599-90-3' (Chloramide) in WISE SoE - Water Quality: Disaggregated data table is 'ug/L'
status: valid
status modified: 2019-10-03
accepted date: 2019-10-03
in scheme: Definition of correct units for the observed determinands in the given WISE SoE DD tables
has determinand: CAS 10599-90-3
has uom: ug.L-1
has table: WISE-SoE WaterQuality.DisaggregatedData

WISE-SoE_WaterQuality.DisaggregatedData - CAS_106-42-3 - ug/L
type: Concept
notation: WISE-SoE_WaterQuality.DisaggregatedData - CAS_106-42-3 - ug/L
definition: The unit of measure for 'CAS_106-42-3' (P-xylene) in WISE SoE - Water Quality: Disaggregated data table is 'ug/L'
status: valid
status modified: 2019-10-03
accepted date: 2019-10-03
in scheme: Definition of correct units for the observed determinands in the given WISE SoE DD tables
has determinand: CAS 106-42-3
has uom: ug.L-1
has table: WISE-SoE WaterQuality.DisaggregatedData

WISE-SoE_WaterQuality.DisaggregatedData - CAS_106-43-4 - ug/L
type: Concept
notation: WISE-SoE_WaterQuality.DisaggregatedData - CAS_106-43-4 - ug/L
definition: The unit of measure for 'CAS_106-43-4' (4-chlorotoluene) in WISE SoE - Water Quality: Disaggregated data table is 'ug/L'
status: valid
status modified: 2019-10-03
accepted date: 2019-10-03
in scheme: Definition of correct units for the observed determinands in the given WISE SoE DD tables
has determinand: CAS 106-43-4
has uom: ug.L-1
has table: WISE-SoE WaterQuality.DisaggregatedData

WISE-SoE_WaterQuality.DisaggregatedData - CAS_106-44-5 - ug/L
type: Concept
notation: WISE-SoE_WaterQuality.DisaggregatedData - CAS_106-44-5 - ug/L
definition: The unit of measure for 'CAS_106-44-5' (4-methyl-phenol) in WISE SoE - Water Quality: Disaggregated data table is 'ug/L'
status: valid
status modified: 2019-10-03
accepted date: 2019-10-03
in scheme: Definition of correct units for the observed determinands in the given WISE SoE DD tables
has determinand: CAS 106-44-5
has uom: ug.L-1
has table: WISE-SoE WaterQuality.DisaggregatedData

WISE-SoE_WaterQuality.DisaggregatedData - CAS_106-46-7 - ug/L
type: Concept
notation: WISE-SoE_WaterQuality.DisaggregatedData - CAS_106-46-7 - ug/L
definition: The unit of measure for 'CAS_106-46-7' (1,4-dichlorobenzene) in WISE SoE - Water Quality: Disaggregated data table is 'ug/L'
status: valid
status modified: 2019-10-03
accepted date: 2019-10-03
in scheme: Definition of correct units for the observed determinands in the given WISE SoE DD tables
has determinand: CAS 106-46-7
has uom: ug.L-1
has table: WISE-SoE WaterQuality.DisaggregatedData

WISE-SoE_WaterQuality.DisaggregatedData - CAS_106-47-8 - ug/L
type: Concept
notation: WISE-SoE_WaterQuality.DisaggregatedData - CAS_106-47-8 - ug/L
definition: The unit of measure for 'CAS_106-47-8' (4-chloroaniline) in WISE SoE - Water Quality: Disaggregated data table is 'ug/L'
status: valid
status modified: 2019-10-03
accepted date: 2019-10-03
in scheme: Definition of correct units for the observed determinands in the given WISE SoE DD tables
has determinand: CAS 106-47-8
has uom: ug.L-1
has table: WISE-SoE WaterQuality.DisaggregatedData

WISE-SoE_WaterQuality.DisaggregatedData - CAS_106-48-9 - ug/L
type: Concept
notation: WISE-SoE_WaterQuality.DisaggregatedData - CAS_106-48-9 - ug/L
definition: The unit of measure for 'CAS_106-48-9' (4-chlorophenol) in WISE SoE - Water Quality: Disaggregated data table is 'ug/L'
status: valid
status modified: 2019-10-03
accepted date: 2019-10-03
in scheme: Definition of correct units for the observed determinands in the given WISE SoE DD tables
has determinand: CAS 106-48-9
has uom: ug.L-1
has table: WISE-SoE WaterQuality.DisaggregatedData

WISE-SoE_WaterQuality.DisaggregatedData - CAS_106-89-8 - ug/L
type: Concept
notation: WISE-SoE_WaterQuality.DisaggregatedData - CAS_106-89-8 - ug/L
definition: The unit of measure for 'CAS_106-89-8' (Epichlorohydrin) in WISE SoE - Water Quality: Disaggregated data table is 'ug/L'
status: valid
status modified: 2019-10-03
accepted date: 2019-10-03
in scheme: Definition of correct units for the observed determinands in the given WISE SoE DD tables
has determinand: CAS 106-89-8
has uom: ug.L-1
has table: WISE-SoE WaterQuality.DisaggregatedData

WISE-SoE_WaterQuality.DisaggregatedData - CAS_106-93-4 - ug/L
type: Concept
notation: WISE-SoE_WaterQuality.DisaggregatedData - CAS_106-93-4 - ug/L
definition: The unit of measure for 'CAS_106-93-4' (1,2-dibromoethane) in WISE SoE - Water Quality: Disaggregated data table is 'ug/L'
status: valid
status modified: 2019-10-03
accepted date: 2019-10-03
in scheme: Definition of correct units for the observed determinands in the given WISE SoE DD tables
has determinand: CAS 106-93-4
has uom: ug.L-1
has table: WISE-SoE WaterQuality.DisaggregatedData

WISE-SoE_WaterQuality.DisaggregatedData - CAS_10605-21-7 - ug/L
type: Concept
notation: WISE-SoE_WaterQuality.DisaggregatedData - CAS_10605-21-7 - ug/L
definition: The unit of measure for 'CAS_10605-21-7' (Carbendazim) in WISE SoE - Water Quality: Disaggregated data table is 'ug/L'
status: valid
status modified: 2019-10-03
accepted date: 2019-10-03
in scheme: Definition of correct units for the observed determinands in the given WISE SoE DD tables
has determinand: CAS 10605-21-7
has uom: ug.L-1
has table: WISE-SoE WaterQuality.DisaggregatedData

WISE-SoE_WaterQuality.DisaggregatedData - CAS_1066-51-9 - ug/L
type: Concept
notation: WISE-SoE_WaterQuality.DisaggregatedData - CAS_1066-51-9 - ug/L
definition: The unit of measure for 'CAS_1066-51-9' (Aminomethylphosphonic acid (AMPA)) in WISE SoE - Water Quality: Disaggregated data table is 'ug/L'
status: valid
status modified: 2019-10-03
accepted date: 2019-10-03
in scheme: Definition of correct units for the observed determinands in the given WISE SoE DD tables
has determinand: CAS 1066-51-9
has uom: ug.L-1
has table: WISE-SoE WaterQuality.DisaggregatedData

WISE-SoE_WaterQuality.DisaggregatedData - CAS_106700-29-2 - ug/L
type: Concept
notation: WISE-SoE_WaterQuality.DisaggregatedData - CAS_106700-29-2 - ug/L
definition: The unit of measure for 'CAS_106700-29-2' (Pethoxamid) in WISE SoE - Water Quality: Disaggregated data table is 'ug/L'
status: valid
status modified: 2019-10-03
accepted date: 2019-10-03
in scheme: Definition of correct units for the observed determinands in the given WISE SoE DD tables
has determinand: CAS 106700-29-2
has uom: ug.L-1
has table: WISE-SoE WaterQuality.DisaggregatedData

WISE-SoE_WaterQuality.DisaggregatedData - CAS_107-05-1 - ug/L
type: Concept
notation: WISE-SoE_WaterQuality.DisaggregatedData - CAS_107-05-1 - ug/L
definition: The unit of measure for 'CAS_107-05-1' (3-chloropropene) in WISE SoE - Water Quality: Disaggregated data table is 'ug/L'
status: valid
status modified: 2019-10-03
accepted date: 2019-10-03
in scheme: Definition of correct units for the observed determinands in the given WISE SoE DD tables
has determinand: CAS 107-05-1
has uom: ug.L-1
has table: WISE-SoE WaterQuality.DisaggregatedData

WISE-SoE_WaterQuality.DisaggregatedData - CAS_107-06-2 - ug/L
type: Concept
notation: WISE-SoE_WaterQuality.DisaggregatedData - CAS_107-06-2 - ug/L
definition: The unit of measure for 'CAS_107-06-2' (1,2-dichloroethane) in WISE SoE - Water Quality: Disaggregated data table is 'ug/L'
status: valid
status modified: 2019-10-03
accepted date: 2019-10-03
in scheme: Definition of correct units for the observed determinands in the given WISE SoE DD tables
has determinand: CAS 107-06-2
has uom: ug.L-1
has table: WISE-SoE WaterQuality.DisaggregatedData

WISE-SoE_WaterQuality.DisaggregatedData - CAS_107-07-3 - ug/L
type: Concept
notation: WISE-SoE_WaterQuality.DisaggregatedData - CAS_107-07-3 - ug/L
definition: The unit of measure for 'CAS_107-07-3' (2-Chloroethanol) in WISE SoE - Water Quality: Disaggregated data table is 'ug/L'
status: valid
status modified: 2019-10-03
accepted date: 2019-10-03
in scheme: Definition of correct units for the observed determinands in the given WISE SoE DD tables
has determinand: CAS 107-07-3
has uom: ug.L-1
has table: WISE-SoE WaterQuality.DisaggregatedData

WISE-SoE_WaterQuality.DisaggregatedData - CAS_107-13-1 - ug/L
type: Concept
notation: WISE-SoE_WaterQuality.DisaggregatedData - CAS_107-13-1 - ug/L
definition: The unit of measure for 'CAS_107-13-1' (Acrylonitrile) in WISE SoE - Water Quality: Disaggregated data table is 'ug/L'
status: valid
status modified: 2019-10-03
accepted date: 2019-10-03
in scheme: Definition of correct units for the observed determinands in the given WISE SoE DD tables
has determinand: CAS 107-13-1
has uom: ug.L-1
has table: WISE-SoE WaterQuality.DisaggregatedData

WISE-SoE_WaterQuality.DisaggregatedData - CAS_107-46-0 - ug/L
type: Concept
notation: WISE-SoE_WaterQuality.DisaggregatedData - CAS_107-46-0 - ug/L
definition: The unit of measure for 'CAS_107-46-0' (Hexamethyldisiloxane (HMDS)) in WISE SoE - Water Quality: Disaggregated data table is 'ug/L'
status: valid
status modified: 2019-10-03
accepted date: 2019-10-03
in scheme: Definition of correct units for the observed determinands in the given WISE SoE DD tables
has determinand: CAS 107-46-0
has uom: ug.L-1
has table: WISE-SoE WaterQuality.DisaggregatedData

WISE-SoE_WaterQuality.DisaggregatedData - CAS_1070-78-6 - ug/L
type: Concept
notation: WISE-SoE_WaterQuality.DisaggregatedData - CAS_1070-78-6 - ug/L
definition: The unit of measure for 'CAS_1070-78-6' (1,1,1,3-tetrachloropropane) in WISE SoE - Water Quality: Disaggregated data table is 'ug/L'
status: valid
status modified: 2019-10-03
accepted date: 2019-10-03
in scheme: Definition of correct units for the observed determinands in the given WISE SoE DD tables
has determinand: CAS 1070-78-6
has uom: ug.L-1
has table: WISE-SoE WaterQuality.DisaggregatedData

WISE-SoE_WaterQuality.DisaggregatedData - CAS_1071-83-6 - ug/L
type: Concept
notation: WISE-SoE_WaterQuality.DisaggregatedData - CAS_1071-83-6 - ug/L
definition: The unit of measure for 'CAS_1071-83-6' (Glyphosate) in WISE SoE - Water Quality: Disaggregated data table is 'ug/L'
status: valid
status modified: 2019-10-03
accepted date: 2019-10-03
in scheme: Definition of correct units for the observed determinands in the given WISE SoE DD tables
has determinand: CAS 1071-83-6
has uom: ug.L-1
has table: WISE-SoE WaterQuality.DisaggregatedData

WISE-SoE_WaterQuality.DisaggregatedData - CAS_107534-96-3 - ug/L
type: Concept
notation: WISE-SoE_WaterQuality.DisaggregatedData - CAS_107534-96-3 - ug/L
definition: The unit of measure for 'CAS_107534-96-3' (Tebuconazole) in WISE SoE - Water Quality: Disaggregated data table is 'ug/L'
status: valid
status modified: 2019-10-03
accepted date: 2019-10-03
in scheme: Definition of correct units for the observed determinands in the given WISE SoE DD tables
has determinand: CAS 107534-96-3
has uom: ug.L-1
has table: WISE-SoE WaterQuality.DisaggregatedData

WISE-SoE_WaterQuality.DisaggregatedData - CAS_108-38-3 - ug/L
type: Concept
notation: WISE-SoE_WaterQuality.DisaggregatedData - CAS_108-38-3 - ug/L
definition: The unit of measure for 'CAS_108-38-3' (M-xylene) in WISE SoE - Water Quality: Disaggregated data table is 'ug/L'
status: valid
status modified: 2019-10-03
accepted date: 2019-10-03
in scheme: Definition of correct units for the observed determinands in the given WISE SoE DD tables
has determinand: CAS 108-38-3
has uom: ug.L-1
has table: WISE-SoE WaterQuality.DisaggregatedData

WISE-SoE_WaterQuality.DisaggregatedData - CAS_108-41-8 - ug/L
type: Concept
notation: WISE-SoE_WaterQuality.DisaggregatedData - CAS_108-41-8 - ug/L
definition: The unit of measure for 'CAS_108-41-8' (3-chlorotoluene) in WISE SoE - Water Quality: Disaggregated data table is 'ug/L'
status: valid
status modified: 2019-10-03
accepted date: 2019-10-03
in scheme: Definition of correct units for the observed determinands in the given WISE SoE DD tables
has determinand: CAS 108-41-8
has uom: ug.L-1
has table: WISE-SoE WaterQuality.DisaggregatedData

WISE-SoE_WaterQuality.DisaggregatedData - CAS_108-42-9 - ug/L
type: Concept
notation: WISE-SoE_WaterQuality.DisaggregatedData - CAS_108-42-9 - ug/L
definition: The unit of measure for 'CAS_108-42-9' (3-chloroaniline) in WISE SoE - Water Quality: Disaggregated data table is 'ug/L'
status: valid
status modified: 2019-10-03
accepted date: 2019-10-03
in scheme: Definition of correct units for the observed determinands in the given WISE SoE DD tables
has determinand: CAS 108-42-9
has uom: ug.L-1
has table: WISE-SoE WaterQuality.DisaggregatedData

WISE-SoE_WaterQuality.DisaggregatedData - CAS_108-43-0 - ug/L
type: Concept
notation: WISE-SoE_WaterQuality.DisaggregatedData - CAS_108-43-0 - ug/L
definition: The unit of measure for 'CAS_108-43-0' (3-chlorophenol) in WISE SoE - Water Quality: Disaggregated data table is 'ug/L'
status: valid
status modified: 2019-10-03
accepted date: 2019-10-03
in scheme: Definition of correct units for the observed determinands in the given WISE SoE DD tables
has determinand: CAS 108-43-0
has uom: ug.L-1
has table: WISE-SoE WaterQuality.DisaggregatedData

WISE-SoE_WaterQuality.DisaggregatedData - CAS_108-60-1 - ug/L
type: Concept
notation: WISE-SoE_WaterQuality.DisaggregatedData - CAS_108-60-1 - ug/L
definition: The unit of measure for 'CAS_108-60-1' (Bis(2-chloro-1-methylethyl) ether) in WISE SoE - Water Quality: Disaggregated data table is 'ug/L'
status: valid
status modified: 2019-10-03
accepted date: 2019-10-03
in scheme: Definition of correct units for the observed determinands in the given WISE SoE DD tables
has determinand: CAS 108-60-1
has uom: ug.L-1
has table: WISE-SoE WaterQuality.DisaggregatedData

WISE-SoE_WaterQuality.DisaggregatedData - CAS_108-67-8 - ug/L
type: Concept
notation: WISE-SoE_WaterQuality.DisaggregatedData - CAS_108-67-8 - ug/L
definition: The unit of measure for 'CAS_108-67-8' (1,3,5-trimethylbenzene) in WISE SoE - Water Quality: Disaggregated data table is 'ug/L'
status: valid
status modified: 2019-10-03
accepted date: 2019-10-03
in scheme: Definition of correct units for the observed determinands in the given WISE SoE DD tables
has determinand: CAS 108-67-8
has uom: ug.L-1
has table: WISE-SoE WaterQuality.DisaggregatedData

WISE-SoE_WaterQuality.DisaggregatedData - CAS_108-68-9 - ug/L
type: Concept
notation: WISE-SoE_WaterQuality.DisaggregatedData - CAS_108-68-9 - ug/L
definition: The unit of measure for 'CAS_108-68-9' (3,5-dimethyl-phenol) in WISE SoE - Water Quality: Disaggregated data table is 'ug/L'
status: valid
status modified: 2019-10-03
accepted date: 2019-10-03
in scheme: Definition of correct units for the observed determinands in the given WISE SoE DD tables
has determinand: CAS 108-68-9
has uom: ug.L-1
has table: WISE-SoE WaterQuality.DisaggregatedData

WISE-SoE_WaterQuality.DisaggregatedData - CAS_108-70-3 - ug/L
type: Concept
notation: WISE-SoE_WaterQuality.DisaggregatedData - CAS_108-70-3 - ug/L
definition: The unit of measure for 'CAS_108-70-3' (1,3,5-trichlorobenzene) in WISE SoE - Water Quality: Disaggregated data table is 'ug/L'
status: valid
status modified: 2019-10-03
accepted date: 2019-10-03
in scheme: Definition of correct units for the observed determinands in the given WISE SoE DD tables
has determinand: CAS 108-70-3
has uom: ug.L-1
has table: WISE-SoE WaterQuality.DisaggregatedData

WISE-SoE_WaterQuality.DisaggregatedData - CAS_108-86-1 - ug/L
type: Concept
notation: WISE-SoE_WaterQuality.DisaggregatedData - CAS_108-86-1 - ug/L
definition: The unit of measure for 'CAS_108-86-1' (Bromobenzene) in WISE SoE - Water Quality: Disaggregated data table is 'ug/L'
status: valid
status modified: 2019-10-03
accepted date: 2019-10-03
in scheme: Definition of correct units for the observed determinands in the given WISE SoE DD tables
has determinand: CAS 108-86-1
has uom: ug.L-1
has table: WISE-SoE WaterQuality.DisaggregatedData

WISE-SoE_WaterQuality.DisaggregatedData - CAS_108-88-3 - ug/L
type: Concept
notation: WISE-SoE_WaterQuality.DisaggregatedData - CAS_108-88-3 - ug/L
definition: The unit of measure for 'CAS_108-88-3' (Toluene) in WISE SoE - Water Quality: Disaggregated data table is 'ug/L'
status: valid
status modified: 2019-10-03
accepted date: 2019-10-03
in scheme: Definition of correct units for the observed determinands in the given WISE SoE DD tables
has determinand: CAS 108-88-3
has uom: ug.L-1
has table: WISE-SoE WaterQuality.DisaggregatedData

WISE-SoE_WaterQuality.DisaggregatedData - CAS_108-90-7 - ug/L
type: Concept
notation: WISE-SoE_WaterQuality.DisaggregatedData - CAS_108-90-7 - ug/L
definition: The unit of measure for 'CAS_108-90-7' (Chlorobenzene) in WISE SoE - Water Quality: Disaggregated data table is 'ug/L'
status: valid
status modified: 2019-10-03
accepted date: 2019-10-03
in scheme: Definition of correct units for the observed determinands in the given WISE SoE DD tables
has determinand: CAS 108-90-7
has uom: ug.L-1
has table: WISE-SoE WaterQuality.DisaggregatedData

WISE-SoE_WaterQuality.DisaggregatedData - CAS_108-95-2 - ug/L
type: Concept
notation: WISE-SoE_WaterQuality.DisaggregatedData - CAS_108-95-2 - ug/L
definition: The unit of measure for 'CAS_108-95-2' (Phenol) in WISE SoE - Water Quality: Disaggregated data table is 'ug/L'
status: valid
status modified: 2019-10-03
accepted date: 2019-10-03
in scheme: Definition of correct units for the observed determinands in the given WISE SoE DD tables
has determinand: CAS 108-95-2
has uom: ug.L-1
has table: WISE-SoE WaterQuality.DisaggregatedData

WISE-SoE_WaterQuality.DisaggregatedData - CAS_109-89-7 - ug/L
type: Concept
notation: WISE-SoE_WaterQuality.DisaggregatedData - CAS_109-89-7 - ug/L
definition: The unit of measure for 'CAS_109-89-7' (Diethylamine) in WISE SoE - Water Quality: Disaggregated data table is 'ug/L'
status: valid
status modified: 2019-10-03
accepted date: 2019-10-03
in scheme: Definition of correct units for the observed determinands in the given WISE SoE DD tables
has determinand: CAS 109-89-7
has uom: ug.L-1
has table: WISE-SoE WaterQuality.DisaggregatedData

WISE-SoE_WaterQuality.DisaggregatedData - CAS_110488-70-5 - ug/L
type: Concept
notation: WISE-SoE_WaterQuality.DisaggregatedData - CAS_110488-70-5 - ug/L
definition: The unit of measure for 'CAS_110488-70-5' (Dimethomorph) in WISE SoE - Water Quality: Disaggregated data table is 'ug/L'
status: valid
status modified: 2019-10-03
accepted date: 2019-10-03
in scheme: Definition of correct units for the observed determinands in the given WISE SoE DD tables
has determinand: CAS 110488-70-5
has uom: ug.L-1
has table: WISE-SoE WaterQuality.DisaggregatedData

WISE-SoE_WaterQuality.DisaggregatedData - CAS_1113-02-6 - ug/L
type: Concept
notation: WISE-SoE_WaterQuality.DisaggregatedData - CAS_1113-02-6 - ug/L
definition: The unit of measure for 'CAS_1113-02-6' (Omethoate) in WISE SoE - Water Quality: Disaggregated data table is 'ug/L'
status: valid
status modified: 2019-10-03
accepted date: 2019-10-03
in scheme: Definition of correct units for the observed determinands in the given WISE SoE DD tables
has determinand: CAS 1113-02-6
has uom: ug.L-1
has table: WISE-SoE WaterQuality.DisaggregatedData

WISE-SoE_WaterQuality.DisaggregatedData - CAS_111988-49-9 - ug/L
type: Concept
notation: WISE-SoE_WaterQuality.DisaggregatedData - CAS_111988-49-9 - ug/L
definition: The unit of measure for 'CAS_111988-49-9' (Thiacloprid) in WISE SoE - Water Quality: Disaggregated data table is 'ug/L'
status: valid
status modified: 2019-10-03
accepted date: 2019-10-03
in scheme: Definition of correct units for the observed determinands in the given WISE SoE DD tables
has determinand: CAS 111988-49-9
has uom: ug.L-1
has table: WISE-SoE WaterQuality.DisaggregatedData

WISE-SoE_WaterQuality.DisaggregatedData - CAS_111991-09-4 - ug/L
type: Concept
notation: WISE-SoE_WaterQuality.DisaggregatedData - CAS_111991-09-4 - ug/L
definition: The unit of measure for 'CAS_111991-09-4' (Nicosulfuron) in WISE SoE - Water Quality: Disaggregated data table is 'ug/L'
status: valid
status modified: 2019-10-03
accepted date: 2019-10-03
in scheme: Definition of correct units for the observed determinands in the given WISE SoE DD tables
has determinand: CAS 111991-09-4
has uom: ug.L-1
has table: WISE-SoE WaterQuality.DisaggregatedData

WISE-SoE_WaterQuality.DisaggregatedData - CAS_112410-23-8 - ug/L
type: Concept
notation: WISE-SoE_WaterQuality.DisaggregatedData - CAS_112410-23-8 - ug/L
definition: The unit of measure for 'CAS_112410-23-8' (Tebufenozide) in WISE SoE - Water Quality: Disaggregated data table is 'ug/L'
status: valid
status modified: 2019-10-03
accepted date: 2019-10-03
in scheme: Definition of correct units for the observed determinands in the given WISE SoE DD tables
has determinand: CAS 112410-23-8
has uom: ug.L-1
has table: WISE-SoE WaterQuality.DisaggregatedData

WISE-SoE_WaterQuality.DisaggregatedData - CAS_113096-99-4 - ug/L
type: Concept
notation: WISE-SoE_WaterQuality.DisaggregatedData - CAS_113096-99-4 - ug/L
definition: The unit of measure for 'CAS_113096-99-4' (Cyproconazole) in WISE SoE - Water Quality: Disaggregated data table is 'ug/L'
status: valid
status modified: 2019-10-03
accepted date: 2019-10-03
in scheme: Definition of correct units for the observed determinands in the given WISE SoE DD tables
has determinand: CAS 113096-99-4
has uom: ug.L-1
has table: WISE-SoE WaterQuality.DisaggregatedData

WISE-SoE_WaterQuality.DisaggregatedData - CAS_114-07-8 - ug/L
type: Concept
notation: WISE-SoE_WaterQuality.DisaggregatedData - CAS_114-07-8 - ug/L
definition: The unit of measure for 'CAS_114-07-8' (Erythromycin) in WISE SoE - Water Quality: Disaggregated data table is 'ug/L'
status: valid
status modified: 2019-10-03
accepted date: 2019-10-03
in scheme: Definition of correct units for the observed determinands in the given WISE SoE DD tables
has determinand: CAS 114-07-8
has uom: ug.L-1
has table: WISE-SoE WaterQuality.DisaggregatedData

WISE-SoE_WaterQuality.DisaggregatedData - CAS_114-26-1 - ug/L
type: Concept
notation: WISE-SoE_WaterQuality.DisaggregatedData - CAS_114-26-1 - ug/L
definition: The unit of measure for 'CAS_114-26-1' (Propoxur) in WISE SoE - Water Quality: Disaggregated data table is 'ug/L'
status: valid
status modified: 2019-10-03
accepted date: 2019-10-03
in scheme: Definition of correct units for the observed determinands in the given WISE SoE DD tables
has determinand: CAS 114-26-1
has uom: ug.L-1
has table: WISE-SoE WaterQuality.DisaggregatedData

WISE-SoE_WaterQuality.DisaggregatedData - CAS_115-29-7 - ug/L
type: Concept
notation: WISE-SoE_WaterQuality.DisaggregatedData - CAS_115-29-7 - ug/L
definition: The unit of measure for 'CAS_115-29-7' (Endosulfan) in WISE SoE - Water Quality: Disaggregated data table is 'ug/L'
status: valid
status modified: 2019-10-03
accepted date: 2019-10-03
in scheme: Definition of correct units for the observed determinands in the given WISE SoE DD tables
has determinand: CAS 115-29-7
has uom: ug.L-1
has table: WISE-SoE WaterQuality.DisaggregatedData

WISE-SoE_WaterQuality.DisaggregatedData - CAS_115-32-2 - ug/L
type: Concept
notation: WISE-SoE_WaterQuality.DisaggregatedData - CAS_115-32-2 - ug/L
definition: The unit of measure for 'CAS_115-32-2' (Dicofol) in WISE SoE - Water Quality: Disaggregated data table is 'ug/L'
status: valid
status modified: 2019-10-03
accepted date: 2019-10-03
in scheme: Definition of correct units for the observed determinands in the given WISE SoE DD tables
has determinand: CAS 115-32-2
has uom: ug.L-1
has table: WISE-SoE WaterQuality.DisaggregatedData

WISE-SoE_WaterQuality.DisaggregatedData - CAS_116-06-3 - ug/L
type: Concept
notation: WISE-SoE_WaterQuality.DisaggregatedData - CAS_116-06-3 - ug/L
definition: The unit of measure for 'CAS_116-06-3' (Aldicarb) in WISE SoE - Water Quality: Disaggregated data table is 'ug/L'
status: valid
status modified: 2019-10-03
accepted date: 2019-10-03
in scheme: Definition of correct units for the observed determinands in the given WISE SoE DD tables
has determinand: CAS 116-06-3
has uom: ug.L-1
has table: WISE-SoE WaterQuality.DisaggregatedData

WISE-SoE_WaterQuality.DisaggregatedData - CAS_116-29-0 - ug/L
type: Concept
notation: WISE-SoE_WaterQuality.DisaggregatedData - CAS_116-29-0 - ug/L
definition: The unit of measure for 'CAS_116-29-0' (Teradifon) in WISE SoE - Water Quality: Disaggregated data table is 'ug/L'
status: valid
status modified: 2019-10-03
accepted date: 2019-10-03
in scheme: Definition of correct units for the observed determinands in the given WISE SoE DD tables
has determinand: CAS 116-29-0
has uom: ug.L-1
has table: WISE-SoE WaterQuality.DisaggregatedData

WISE-SoE_WaterQuality.DisaggregatedData - CAS_1163-19-5 - ug/L
type: Concept
notation: WISE-SoE_WaterQuality.DisaggregatedData - CAS_1163-19-5 - ug/L
definition: The unit of measure for 'CAS_1163-19-5' (Bis(pentabromophenyl) ether) in WISE SoE - Water Quality: Disaggregated data table is 'ug/L'
status: valid
status modified: 2019-10-03
accepted date: 2019-10-03
in scheme: Definition of correct units for the observed determinands in the given WISE SoE DD tables
has determinand: CAS 1163-19-5
has uom: ug.L-1
has table: WISE-SoE WaterQuality.DisaggregatedData

WISE-SoE_WaterQuality.DisaggregatedData - CAS_117-81-7 - ug/L
type: Concept
notation: WISE-SoE_WaterQuality.DisaggregatedData - CAS_117-81-7 - ug/L
definition: The unit of measure for 'CAS_117-81-7' (Di(2-ethylhexyl)phthalate (DEHP)) in WISE SoE - Water Quality: Disaggregated data table is 'ug/L'
status: valid
status modified: 2019-10-03
accepted date: 2019-10-03
in scheme: Definition of correct units for the observed determinands in the given WISE SoE DD tables
has determinand: CAS 117-81-7
has uom: ug.L-1
has table: WISE-SoE WaterQuality.DisaggregatedData

WISE-SoE_WaterQuality.DisaggregatedData - CAS_118-74-1 - ug/L
type: Concept
notation: WISE-SoE_WaterQuality.DisaggregatedData - CAS_118-74-1 - ug/L
definition: The unit of measure for 'CAS_118-74-1' (Hexachlorobenzene) in WISE SoE - Water Quality: Disaggregated data table is 'ug/L'
status: valid
status modified: 2019-10-03
accepted date: 2019-10-03
in scheme: Definition of correct units for the observed determinands in the given WISE SoE DD tables
has determinand: CAS 118-74-1
has uom: ug.L-1
has table: WISE-SoE WaterQuality.DisaggregatedData

WISE-SoE_WaterQuality.DisaggregatedData - CAS_118-96-7 - ug/L
type: Concept
notation: WISE-SoE_WaterQuality.DisaggregatedData - CAS_118-96-7 - ug/L
definition: The unit of measure for 'CAS_118-96-7' (2,4,6-trinitrotoluene) in WISE SoE - Water Quality: Disaggregated data table is 'ug/L'
status: valid
status modified: 2019-10-03
accepted date: 2019-10-03
in scheme: Definition of correct units for the observed determinands in the given WISE SoE DD tables
has determinand: CAS 118-96-7
has uom: ug.L-1
has table: WISE-SoE WaterQuality.DisaggregatedData

WISE-SoE_WaterQuality.DisaggregatedData - CAS_118134-30-8 - ug/L
type: Concept
notation: WISE-SoE_WaterQuality.DisaggregatedData - CAS_118134-30-8 - ug/L
definition: The unit of measure for 'CAS_118134-30-8' (Spiroxamine) in WISE SoE - Water Quality: Disaggregated data table is 'ug/L'
status: valid
status modified: 2019-10-03
accepted date: 2019-10-03
in scheme: Definition of correct units for the observed determinands in the given WISE SoE DD tables
has determinand: CAS 118134-30-8
has uom: ug.L-1
has table: WISE-SoE WaterQuality.DisaggregatedData

WISE-SoE_WaterQuality.DisaggregatedData - CAS_1194-65-6 - ug/L
type: Concept
notation: WISE-SoE_WaterQuality.DisaggregatedData - CAS_1194-65-6 - ug/L
definition: The unit of measure for 'CAS_1194-65-6' (Dichlobenil) in WISE SoE - Water Quality: Disaggregated data table is 'ug/L'
status: valid
status modified: 2019-10-03
accepted date: 2019-10-03
in scheme: Definition of correct units for the observed determinands in the given WISE SoE DD tables
has determinand: CAS 1194-65-6
has uom: ug.L-1
has table: WISE-SoE WaterQuality.DisaggregatedData

WISE-SoE_WaterQuality.DisaggregatedData - CAS_120-12-7 - ug/L
type: Concept
notation: WISE-SoE_WaterQuality.DisaggregatedData - CAS_120-12-7 - ug/L
definition: The unit of measure for 'CAS_120-12-7' (Anthracene) in WISE SoE - Water Quality: Disaggregated data table is 'ug/L'
status: valid
status modified: 2019-10-03
accepted date: 2019-10-03
in scheme: Definition of correct units for the observed determinands in the given WISE SoE DD tables
has determinand: CAS 120-12-7
has uom: ug.L-1
has table: WISE-SoE WaterQuality.DisaggregatedData

WISE-SoE_WaterQuality.DisaggregatedData - CAS_120-36-5 - ug/L
type: Concept
notation: WISE-SoE_WaterQuality.DisaggregatedData - CAS_120-36-5 - ug/L
definition: The unit of measure for 'CAS_120-36-5' (Dichlorprop (2,4-DP)) in WISE SoE - Water Quality: Disaggregated data table is 'ug/L'
status: valid
status modified: 2019-10-03
accepted date: 2019-10-03
in scheme: Definition of correct units for the observed determinands in the given WISE SoE DD tables
has determinand: CAS 120-36-5
has uom: ug.L-1
has table: WISE-SoE WaterQuality.DisaggregatedData

WISE-SoE_WaterQuality.DisaggregatedData - CAS_120-82-1 - ug/L
type: Concept
notation: WISE-SoE_WaterQuality.DisaggregatedData - CAS_120-82-1 - ug/L
definition: The unit of measure for 'CAS_120-82-1' (1,2,4-trichlorobenzene) in WISE SoE - Water Quality: Disaggregated data table is 'ug/L'
status: valid
status modified: 2019-10-03
accepted date: 2019-10-03
in scheme: Definition of correct units for the observed determinands in the given WISE SoE DD tables
has determinand: CAS 120-82-1
has uom: ug.L-1
has table: WISE-SoE WaterQuality.DisaggregatedData

WISE-SoE_WaterQuality.DisaggregatedData - CAS_120-83-2 - ug/L
type: Concept
notation: WISE-SoE_WaterQuality.DisaggregatedData - CAS_120-83-2 - ug/L
definition: The unit of measure for 'CAS_120-83-2' (2,4-dichlorophenol) in WISE SoE - Water Quality: Disaggregated data table is 'ug/L'
status: valid
status modified: 2019-10-03
accepted date: 2019-10-03
in scheme: Definition of correct units for the observed determinands in the given WISE SoE DD tables
has determinand: CAS 120-83-2
has uom: ug.L-1
has table: WISE-SoE WaterQuality.DisaggregatedData

WISE-SoE_WaterQuality.DisaggregatedData - CAS_12002-48-1 - ug/L
type: Concept
notation: WISE-SoE_WaterQuality.DisaggregatedData - CAS_12002-48-1 - ug/L
definition: The unit of measure for 'CAS_12002-48-1' (Trichlorobenzenes (all isomers)) in WISE SoE - Water Quality: Disaggregated data table is 'ug/L'
status: valid
status modified: 2019-10-03
accepted date: 2019-10-03
in scheme: Definition of correct units for the observed determinands in the given WISE SoE DD tables
has determinand: CAS 12002-48-1
has uom: ug.L-1
has table: WISE-SoE WaterQuality.DisaggregatedData

WISE-SoE_WaterQuality.DisaggregatedData - CAS_120923-37-7 - ug/L
type: Concept
notation: WISE-SoE_WaterQuality.DisaggregatedData - CAS_120923-37-7 - ug/L
definition: The unit of measure for 'CAS_120923-37-7' (Amidosulfuron) in WISE SoE - Water Quality: Disaggregated data table is 'ug/L'
status: valid
status modified: 2019-10-03
accepted date: 2019-10-03
in scheme: Definition of correct units for the observed determinands in the given WISE SoE DD tables
has determinand: CAS 120923-37-7
has uom: ug.L-1
has table: WISE-SoE WaterQuality.DisaggregatedData

WISE-SoE_WaterQuality.DisaggregatedData - CAS_120928-09-8 - ug/L
type: Concept
notation: WISE-SoE_WaterQuality.DisaggregatedData - CAS_120928-09-8 - ug/L
definition: The unit of measure for 'CAS_120928-09-8' (Fenazaquin) in WISE SoE - Water Quality: Disaggregated data table is 'ug/L'
status: valid
status modified: 2019-10-03
accepted date: 2019-10-03
in scheme: Definition of correct units for the observed determinands in the given WISE SoE DD tables
has determinand: CAS 120928-09-8
has uom: ug.L-1
has table: WISE-SoE WaterQuality.DisaggregatedData

WISE-SoE_WaterQuality.DisaggregatedData - CAS_121-14-2 - ug/L
type: Concept
notation: WISE-SoE_WaterQuality.DisaggregatedData - CAS_121-14-2 - ug/L
definition: The unit of measure for 'CAS_121-14-2' (2,4-dinitrotoluene) in WISE SoE - Water Quality: Disaggregated data table is 'ug/L'
status: valid
status modified: 2019-10-03
accepted date: 2019-10-03
in scheme: Definition of correct units for the observed determinands in the given WISE SoE DD tables
has determinand: CAS 121-14-2
has uom: ug.L-1
has table: WISE-SoE WaterQuality.DisaggregatedData

WISE-SoE_WaterQuality.DisaggregatedData - CAS_121-73-3 - ug/L
type: Concept
notation: WISE-SoE_WaterQuality.DisaggregatedData - CAS_121-73-3 - ug/L
definition: The unit of measure for 'CAS_121-73-3' (1-chloro-3-nitrobenzene) in WISE SoE - Water Quality: Disaggregated data table is 'ug/L'
status: valid
status modified: 2019-10-03
accepted date: 2019-10-03
in scheme: Definition of correct units for the observed determinands in the given WISE SoE DD tables
has determinand: CAS 121-73-3
has uom: ug.L-1
has table: WISE-SoE WaterQuality.DisaggregatedData

WISE-SoE_WaterQuality.DisaggregatedData - CAS_121-75-5 - ug/L
type: Concept
notation: WISE-SoE_WaterQuality.DisaggregatedData - CAS_121-75-5 - ug/L
definition: The unit of measure for 'CAS_121-75-5' (Malathion) in WISE SoE - Water Quality: Disaggregated data table is 'ug/L'
status: valid
status modified: 2019-10-03
accepted date: 2019-10-03
in scheme: Definition of correct units for the observed determinands in the given WISE SoE DD tables
has determinand: CAS 121-75-5
has uom: ug.L-1
has table: WISE-SoE WaterQuality.DisaggregatedData

WISE-SoE_WaterQuality.DisaggregatedData - CAS_121-86-8 - ug/L
type: Concept
notation: WISE-SoE_WaterQuality.DisaggregatedData - CAS_121-86-8 - ug/L
definition: The unit of measure for 'CAS_121-86-8' (2-chloro-4-nitrotoluene) in WISE SoE - Water Quality: Disaggregated data table is 'ug/L'
status: valid
status modified: 2019-10-03
accepted date: 2019-10-03
in scheme: Definition of correct units for the observed determinands in the given WISE SoE DD tables
has determinand: CAS 121-86-8
has uom: ug.L-1
has table: WISE-SoE WaterQuality.DisaggregatedData

WISE-SoE_WaterQuality.DisaggregatedData - CAS_121552-61-2 - ug/L
type: Concept
notation: WISE-SoE_WaterQuality.DisaggregatedData - CAS_121552-61-2 - ug/L
definition: The unit of measure for 'CAS_121552-61-2' (Cyprodinil) in WISE SoE - Water Quality: Disaggregated data table is 'ug/L'
status: valid
status modified: 2019-10-03
accepted date: 2019-10-03
in scheme: Definition of correct units for the observed determinands in the given WISE SoE DD tables
has determinand: CAS 121552-61-2
has uom: ug.L-1
has table: WISE-SoE WaterQuality.DisaggregatedData

WISE-SoE_WaterQuality.DisaggregatedData - CAS_121776-33-8 - ug/L
type: Concept
notation: WISE-SoE_WaterQuality.DisaggregatedData - CAS_121776-33-8 - ug/L
definition: The unit of measure for 'CAS_121776-33-8' (Furilazole) in WISE SoE - Water Quality: Disaggregated data table is 'ug/L'
status: valid
status modified: 2019-10-03
accepted date: 2019-10-03
in scheme: Definition of correct units for the observed determinands in the given WISE SoE DD tables
has determinand: CAS 121776-33-8
has uom: ug.L-1
has table: WISE-SoE WaterQuality.DisaggregatedData

WISE-SoE_WaterQuality.DisaggregatedData - CAS_122-14-5 - ug/L
type: Concept
notation: WISE-SoE_WaterQuality.DisaggregatedData - CAS_122-14-5 - ug/L
definition: The unit of measure for 'CAS_122-14-5' (Fenitrothion) in WISE SoE - Water Quality: Disaggregated data table is 'ug/L'
status: valid
status modified: 2019-10-03
accepted date: 2019-10-03
in scheme: Definition of correct units for the observed determinands in the given WISE SoE DD tables
has determinand: CAS 122-14-5
has uom: ug.L-1
has table: WISE-SoE WaterQuality.DisaggregatedData

WISE-SoE_WaterQuality.DisaggregatedData - CAS_122-34-9 - ug/L
type: Concept
notation: WISE-SoE_WaterQuality.DisaggregatedData - CAS_122-34-9 - ug/L
definition: The unit of measure for 'CAS_122-34-9' (Simazine) in WISE SoE - Water Quality: Disaggregated data table is 'ug/L'
status: valid
status modified: 2019-10-03
accepted date: 2019-10-03
in scheme: Definition of correct units for the observed determinands in the given WISE SoE DD tables
has determinand: CAS 122-34-9
has uom: ug.L-1
has table: WISE-SoE WaterQuality.DisaggregatedData

WISE-SoE_WaterQuality.DisaggregatedData - CAS_122-39-4 - ug/L
type: Concept
notation: WISE-SoE_WaterQuality.DisaggregatedData - CAS_122-39-4 - ug/L
definition: The unit of measure for 'CAS_122-39-4' (Diphenylamine) in WISE SoE - Water Quality: Disaggregated data table is 'ug/L'
status: valid
status modified: 2019-10-03
accepted date: 2019-10-03
in scheme: Definition of correct units for the observed determinands in the given WISE SoE DD tables
has determinand: CAS 122-39-4
has uom: ug.L-1
has table: WISE-SoE WaterQuality.DisaggregatedData

WISE-SoE_WaterQuality.DisaggregatedData - CAS_122-88-3 - ug/L
type: Concept
notation: WISE-SoE_WaterQuality.DisaggregatedData - CAS_122-88-3 - ug/L
definition: The unit of measure for 'CAS_122-88-3' (4-Chlorophenoxyacetic acid (CPA 4)) in WISE SoE - Water Quality: Disaggregated data table is 'ug/L'
status: valid
status modified: 2019-10-03
accepted date: 2019-10-03
in scheme: Definition of correct units for the observed determinands in the given WISE SoE DD tables
has determinand: CAS 122-88-3
has uom: ug.L-1
has table: WISE-SoE WaterQuality.DisaggregatedData

WISE-SoE_WaterQuality.DisaggregatedData - CAS_122931-48-0 - ug/L
type: Concept
notation: WISE-SoE_WaterQuality.DisaggregatedData - CAS_122931-48-0 - ug/L
definition: The unit of measure for 'CAS_122931-48-0' (Rimsulfuron) in WISE SoE - Water Quality: Disaggregated data table is 'ug/L'
status: valid
status modified: 2019-10-03
accepted date: 2019-10-03
in scheme: Definition of correct units for the observed determinands in the given WISE SoE DD tables
has determinand: CAS 122931-48-0
has uom: ug.L-1
has table: WISE-SoE WaterQuality.DisaggregatedData

WISE-SoE_WaterQuality.DisaggregatedData - CAS_123-33-1 - ug/L
type: Concept
notation: WISE-SoE_WaterQuality.DisaggregatedData - CAS_123-33-1 - ug/L
definition: The unit of measure for 'CAS_123-33-1' (Maleinhydrazid) in WISE SoE - Water Quality: Disaggregated data table is 'ug/L'
status: valid
status modified: 2019-10-03
accepted date: 2019-10-03
in scheme: Definition of correct units for the observed determinands in the given WISE SoE DD tables
has determinand: CAS 123-33-1
has uom: ug.L-1
has table: WISE-SoE WaterQuality.DisaggregatedData

WISE-SoE_WaterQuality.DisaggregatedData - CAS_123-91-1 - ug/L
type: Concept
notation: WISE-SoE_WaterQuality.DisaggregatedData - CAS_123-91-1 - ug/L
definition: The unit of measure for 'CAS_123-91-1' (1,4-dioxane) in WISE SoE - Water Quality: Disaggregated data table is 'ug/L'
status: valid
status modified: 2019-10-03
accepted date: 2019-10-03
in scheme: Definition of correct units for the observed determinands in the given WISE SoE DD tables
has determinand: CAS 123-91-1
has uom: ug.L-1
has table: WISE-SoE WaterQuality.DisaggregatedData

WISE-SoE_WaterQuality.DisaggregatedData - CAS_1231244-60-2 - ug/L
type: Concept
notation: WISE-SoE_WaterQuality.DisaggregatedData - CAS_1231244-60-2 - ug/L
definition: The unit of measure for 'CAS_1231244-60-2' (Metazachlor OA) in WISE SoE - Water Quality: Disaggregated data table is 'ug/L'
status: valid
status modified: 2019-10-03
accepted date: 2019-10-03
in scheme: Definition of correct units for the observed determinands in the given WISE SoE DD tables
has determinand: CAS 1231244-60-2
has uom: ug.L-1
has table: WISE-SoE WaterQuality.DisaggregatedData

WISE-SoE_WaterQuality.DisaggregatedData - CAS_124-40-3 - ug/L
type: Concept
notation: WISE-SoE_WaterQuality.DisaggregatedData - CAS_124-40-3 - ug/L
definition: The unit of measure for 'CAS_124-40-3' (Dimethylamine) in WISE SoE - Water Quality: Disaggregated data table is 'ug/L'
status: valid
status modified: 2019-10-03
accepted date: 2019-10-03
in scheme: Definition of correct units for the observed determinands in the given WISE SoE DD tables
has determinand: CAS 124-40-3
has uom: ug.L-1
has table: WISE-SoE WaterQuality.DisaggregatedData

WISE-SoE_WaterQuality.DisaggregatedData - CAS_124-48-1 - ug/L
type: Concept
notation: WISE-SoE_WaterQuality.DisaggregatedData - CAS_124-48-1 - ug/L
definition: The unit of measure for 'CAS_124-48-1' (Dibromochlorometane) in WISE SoE - Water Quality: Disaggregated data table is 'ug/L'
status: valid
status modified: 2019-10-03
accepted date: 2019-10-03
in scheme: Definition of correct units for the observed determinands in the given WISE SoE DD tables
has determinand: CAS 124-48-1
has uom: ug.L-1
has table: WISE-SoE WaterQuality.DisaggregatedData

WISE-SoE_WaterQuality.DisaggregatedData - CAS_124495-18-7 - ug/L
type: Concept
notation: WISE-SoE_WaterQuality.DisaggregatedData - CAS_124495-18-7 - ug/L
definition: The unit of measure for 'CAS_124495-18-7' (Quinoxyfen) in WISE SoE - Water Quality: Disaggregated data table is 'ug/L'
status: valid
status modified: 2019-10-03
accepted date: 2019-10-03
in scheme: Definition of correct units for the observed determinands in the given WISE SoE DD tables
has determinand: CAS 124495-18-7
has uom: ug.L-1
has table: WISE-SoE WaterQuality.DisaggregatedData

WISE-SoE_WaterQuality.DisaggregatedData - CAS_126-73-8 - ug/L
type: Concept
notation: WISE-SoE_WaterQuality.DisaggregatedData - CAS_126-73-8 - ug/L
definition: The unit of measure for 'CAS_126-73-8' (Tributyl phosphate) in WISE SoE - Water Quality: Disaggregated data table is 'ug/L'
status: valid
status modified: 2019-10-03
accepted date: 2019-10-03
in scheme: Definition of correct units for the observed determinands in the given WISE SoE DD tables
has determinand: CAS 126-73-8
has uom: ug.L-1
has table: WISE-SoE WaterQuality.DisaggregatedData

WISE-SoE_WaterQuality.DisaggregatedData - CAS_126-75-0 - ug/L
type: Concept
notation: WISE-SoE_WaterQuality.DisaggregatedData - CAS_126-75-0 - ug/L
definition: The unit of measure for 'CAS_126-75-0' (Demeton-S) in WISE SoE - Water Quality: Disaggregated data table is 'ug/L'
status: valid
status modified: 2019-10-03
accepted date: 2019-10-03
in scheme: Definition of correct units for the observed determinands in the given WISE SoE DD tables
has determinand: CAS 126-75-0
has uom: ug.L-1
has table: WISE-SoE WaterQuality.DisaggregatedData

WISE-SoE_WaterQuality.DisaggregatedData - CAS_126-99-8 - ug/L
type: Concept
notation: WISE-SoE_WaterQuality.DisaggregatedData - CAS_126-99-8 - ug/L
definition: The unit of measure for 'CAS_126-99-8' (2-Chloro-1,3-butadiene) in WISE SoE - Water Quality: Disaggregated data table is 'ug/L'
status: valid
status modified: 2019-10-03
accepted date: 2019-10-03
in scheme: Definition of correct units for the observed determinands in the given WISE SoE DD tables
has determinand: CAS 126-99-8
has uom: ug.L-1
has table: WISE-SoE WaterQuality.DisaggregatedData

WISE-SoE_WaterQuality.DisaggregatedData - CAS_126535-15-7 - ug/L
type: Concept
notation: WISE-SoE_WaterQuality.DisaggregatedData - CAS_126535-15-7 - ug/L
definition: The unit of measure for 'CAS_126535-15-7' (Triflusulfuron-methyl) in WISE SoE - Water Quality: Disaggregated data table is 'ug/L'
status: valid
status modified: 2019-10-03
accepted date: 2019-10-03
in scheme: Definition of correct units for the observed determinands in the given WISE SoE DD tables
has determinand: CAS 126535-15-7
has uom: ug.L-1
has table: WISE-SoE WaterQuality.DisaggregatedData

WISE-SoE_WaterQuality.DisaggregatedData - CAS_126833-17-8 - ug/L
type: Concept
notation: WISE-SoE_WaterQuality.DisaggregatedData - CAS_126833-17-8 - ug/L
definition: The unit of measure for 'CAS_126833-17-8' (Fenhexamid) in WISE SoE - Water Quality: Disaggregated data table is 'ug/L'
status: valid
status modified: 2019-10-03
accepted date: 2019-10-03
in scheme: Definition of correct units for the observed determinands in the given WISE SoE DD tables
has determinand: CAS 126833-17-8
has uom: ug.L-1
has table: WISE-SoE WaterQuality.DisaggregatedData

WISE-SoE_WaterQuality.DisaggregatedData - CAS_127-18-4 - ug/L
type: Concept
notation: WISE-SoE_WaterQuality.DisaggregatedData - CAS_127-18-4 - ug/L
definition: The unit of measure for 'CAS_127-18-4' (Tetrachloroethylene) in WISE SoE - Water Quality: Disaggregated data table is 'ug/L'
status: valid
status modified: 2019-10-03
accepted date: 2019-10-03
in scheme: Definition of correct units for the observed determinands in the given WISE SoE DD tables
has determinand: CAS 127-18-4
has uom: ug.L-1
has table: WISE-SoE WaterQuality.DisaggregatedData

WISE-SoE_WaterQuality.DisaggregatedData - CAS_12767-79-2 - ug/L
type: Concept
notation: WISE-SoE_WaterQuality.DisaggregatedData - CAS_12767-79-2 - ug/L
definition: The unit of measure for 'CAS_12767-79-2' (Aroclor) in WISE SoE - Water Quality: Disaggregated data table is 'ug/L'
status: valid
status modified: 2019-10-03
accepted date: 2019-10-03
in scheme: Definition of correct units for the observed determinands in the given WISE SoE DD tables
has determinand: CAS 12767-79-2
has uom: ug.L-1
has table: WISE-SoE WaterQuality.DisaggregatedData

WISE-SoE_WaterQuality.DisaggregatedData - CAS_128-37-0 - ug/L
type: Concept
notation: WISE-SoE_WaterQuality.DisaggregatedData - CAS_128-37-0 - ug/L
definition: The unit of measure for 'CAS_128-37-0' (2,6-Ditert-butyl-4-methylphenol) in WISE SoE - Water Quality: Disaggregated data table is 'ug/L'
status: valid
status modified: 2019-10-03
accepted date: 2019-10-03
in scheme: Definition of correct units for the observed determinands in the given WISE SoE DD tables
has determinand: CAS 128-37-0
has uom: ug.L-1
has table: WISE-SoE WaterQuality.DisaggregatedData

WISE-SoE_WaterQuality.DisaggregatedData - CAS_129-00-0 - ug/L
type: Concept
notation: WISE-SoE_WaterQuality.DisaggregatedData - CAS_129-00-0 - ug/L
definition: The unit of measure for 'CAS_129-00-0' (Pyrene) in WISE SoE - Water Quality: Disaggregated data table is 'ug/L'
status: valid
status modified: 2019-10-03
accepted date: 2019-10-03
in scheme: Definition of correct units for the observed determinands in the given WISE SoE DD tables
has determinand: CAS 129-00-0
has uom: ug.L-1
has table: WISE-SoE WaterQuality.DisaggregatedData

WISE-SoE_WaterQuality.DisaggregatedData - CAS_13071-79-9 - ug/L
type: Concept
notation: WISE-SoE_WaterQuality.DisaggregatedData - CAS_13071-79-9 - ug/L
definition: The unit of measure for 'CAS_13071-79-9' (Terbufos) in WISE SoE - Water Quality: Disaggregated data table is 'ug/L'
status: valid
status modified: 2019-10-03
accepted date: 2019-10-03
in scheme: Definition of correct units for the observed determinands in the given WISE SoE DD tables
has determinand: CAS 13071-79-9
has uom: ug.L-1
has table: WISE-SoE WaterQuality.DisaggregatedData

WISE-SoE_WaterQuality.DisaggregatedData - CAS_131-11-3 - ug/L
type: Concept
notation: WISE-SoE_WaterQuality.DisaggregatedData - CAS_131-11-3 - ug/L
definition: The unit of measure for 'CAS_131-11-3' (Dimethyl phthalate) in WISE SoE - Water Quality: Disaggregated data table is 'ug/L'
status: valid
status modified: 2019-10-03
accepted date: 2019-10-03
in scheme: Definition of correct units for the observed determinands in the given WISE SoE DD tables
has determinand: CAS 131-11-3
has uom: ug.L-1
has table: WISE-SoE WaterQuality.DisaggregatedData

WISE-SoE_WaterQuality.DisaggregatedData - CAS_131-16-8 - ug/L
type: Concept
notation: WISE-SoE_WaterQuality.DisaggregatedData - CAS_131-16-8 - ug/L
definition: The unit of measure for 'CAS_131-16-8' (Dipropyl phthalate) in WISE SoE - Water Quality: Disaggregated data table is 'ug/L'
status: valid
status modified: 2019-10-03
accepted date: 2019-10-03
in scheme: Definition of correct units for the observed determinands in the given WISE SoE DD tables
has determinand: CAS 131-16-8
has uom: ug.L-1
has table: WISE-SoE WaterQuality.DisaggregatedData

WISE-SoE_WaterQuality.DisaggregatedData - CAS_131-18-0 - ug/L
type: Concept
notation: WISE-SoE_WaterQuality.DisaggregatedData - CAS_131-18-0 - ug/L
definition: The unit of measure for 'CAS_131-18-0' (Dipentyl phthalate) in WISE SoE - Water Quality: Disaggregated data table is 'ug/L'
status: valid
status modified: 2019-10-03
accepted date: 2019-10-03
in scheme: Definition of correct units for the observed determinands in the given WISE SoE DD tables
has determinand: CAS 131-18-0
has uom: ug.L-1
has table: WISE-SoE WaterQuality.DisaggregatedData

WISE-SoE_WaterQuality.DisaggregatedData - CAS_131341-86-1 - ug/L
type: Concept
notation: WISE-SoE_WaterQuality.DisaggregatedData - CAS_131341-86-1 - ug/L
definition: The unit of measure for 'CAS_131341-86-1' (Fludioxonil) in WISE SoE - Water Quality: Disaggregated data table is 'ug/L'
status: valid
status modified: 2019-10-03
accepted date: 2019-10-03
in scheme: Definition of correct units for the observed determinands in the given WISE SoE DD tables
has determinand: CAS 131341-86-1
has uom: ug.L-1
has table: WISE-SoE WaterQuality.DisaggregatedData

WISE-SoE_WaterQuality.DisaggregatedData - CAS_131860-33-8 - ug/L
type: Concept
notation: WISE-SoE_WaterQuality.DisaggregatedData - CAS_131860-33-8 - ug/L
definition: The unit of measure for 'CAS_131860-33-8' (Azoxystrobin) in WISE SoE - Water Quality: Disaggregated data table is 'ug/L'
status: valid
status modified: 2019-10-03
accepted date: 2019-10-03
in scheme: Definition of correct units for the observed determinands in the given WISE SoE DD tables
has determinand: CAS 131860-33-8
has uom: ug.L-1
has table: WISE-SoE WaterQuality.DisaggregatedData

WISE-SoE_WaterQuality.DisaggregatedData - CAS_13194-48-4 - ug/L
type: Concept
notation: WISE-SoE_WaterQuality.DisaggregatedData - CAS_13194-48-4 - ug/L
definition: The unit of measure for 'CAS_13194-48-4' (Ethoprophos) in WISE SoE - Water Quality: Disaggregated data table is 'ug/L'
status: valid
status modified: 2019-10-03
accepted date: 2019-10-03
in scheme: Definition of correct units for the observed determinands in the given WISE SoE DD tables
has determinand: CAS 13194-48-4
has uom: ug.L-1
has table: WISE-SoE WaterQuality.DisaggregatedData

WISE-SoE_WaterQuality.DisaggregatedData - CAS_1321-64-8 - ug/L
type: Concept
notation: WISE-SoE_WaterQuality.DisaggregatedData - CAS_1321-64-8 - ug/L
definition: The unit of measure for 'CAS_1321-64-8' (Pentachloronaphthalene) in WISE SoE - Water Quality: Disaggregated data table is 'ug/L'
status: valid
status modified: 2019-10-03
accepted date: 2019-10-03
in scheme: Definition of correct units for the observed determinands in the given WISE SoE DD tables
has determinand: CAS 1321-64-8
has uom: ug.L-1
has table: WISE-SoE WaterQuality.DisaggregatedData

WISE-SoE_WaterQuality.DisaggregatedData - CAS_1321-65-9 - ug/L
type: Concept
notation: WISE-SoE_WaterQuality.DisaggregatedData - CAS_1321-65-9 - ug/L
definition: The unit of measure for 'CAS_1321-65-9' (Trichloronaphthalene) in WISE SoE - Water Quality: Disaggregated data table is 'ug/L'
status: valid
status modified: 2019-10-03
accepted date: 2019-10-03
in scheme: Definition of correct units for the observed determinands in the given WISE SoE DD tables
has determinand: CAS 1321-65-9
has uom: ug.L-1
has table: WISE-SoE WaterQuality.DisaggregatedData

WISE-SoE_WaterQuality.DisaggregatedData - CAS_133-06-2 - ug/L
type: Concept
notation: WISE-SoE_WaterQuality.DisaggregatedData - CAS_133-06-2 - ug/L
definition: The unit of measure for 'CAS_133-06-2' (Captan) in WISE SoE - Water Quality: Disaggregated data table is 'ug/L'
status: valid
status modified: 2019-10-03
accepted date: 2019-10-03
in scheme: Definition of correct units for the observed determinands in the given WISE SoE DD tables
has determinand: CAS 133-06-2
has uom: ug.L-1
has table: WISE-SoE WaterQuality.DisaggregatedData

WISE-SoE_WaterQuality.DisaggregatedData - CAS_133-07-3 - ug/L
type: Concept
notation: WISE-SoE_WaterQuality.DisaggregatedData - CAS_133-07-3 - ug/L
definition: The unit of measure for 'CAS_133-07-3' (Folpet) in WISE SoE - Water Quality: Disaggregated data table is 'ug/L'
status: valid
status modified: 2019-10-03
accepted date: 2019-10-03
in scheme: Definition of correct units for the observed determinands in the given WISE SoE DD tables
has determinand: CAS 133-07-3
has uom: ug.L-1
has table: WISE-SoE WaterQuality.DisaggregatedData

WISE-SoE_WaterQuality.DisaggregatedData - CAS_133-53-9 - ug/L
type: Concept
notation: WISE-SoE_WaterQuality.DisaggregatedData - CAS_133-53-9 - ug/L
definition: The unit of measure for 'CAS_133-53-9' (2,4-dichloro-3,5-dimethylphenol) in WISE SoE - Water Quality: Disaggregated data table is 'ug/L'
status: valid
status modified: 2019-10-03
accepted date: 2019-10-03
in scheme: Definition of correct units for the observed determinands in the given WISE SoE DD tables
has determinand: CAS 133-53-9
has uom: ug.L-1
has table: WISE-SoE WaterQuality.DisaggregatedData

WISE-SoE_WaterQuality.DisaggregatedData - CAS_1330-20-7 - ug/L
type: Concept
notation: WISE-SoE_WaterQuality.DisaggregatedData - CAS_1330-20-7 - ug/L
definition: The unit of measure for 'CAS_1330-20-7' (Xylene) in WISE SoE - Water Quality: Disaggregated data table is 'ug/L'
status: valid
status modified: 2019-10-03
accepted date: 2019-10-03
in scheme: Definition of correct units for the observed determinands in the given WISE SoE DD tables
has determinand: CAS 1330-20-7
has uom: ug.L-1
has table: WISE-SoE WaterQuality.DisaggregatedData

WISE-SoE_WaterQuality.DisaggregatedData - CAS_1332-21-4 - ug/L
type: Concept
notation: WISE-SoE_WaterQuality.DisaggregatedData - CAS_1332-21-4 - ug/L
definition: The unit of measure for 'CAS_1332-21-4' (Asbestos) in WISE SoE - Water Quality: Disaggregated data table is 'ug/L'
status: valid
status modified: 2019-10-03
accepted date: 2019-10-03
in scheme: Definition of correct units for the observed determinands in the given WISE SoE DD tables
has determinand: CAS 1332-21-4
has uom: ug.L-1
has table: WISE-SoE WaterQuality.DisaggregatedData

WISE-SoE_WaterQuality.DisaggregatedData - CAS_1333-82-0 - ug/L
type: Concept
notation: WISE-SoE_WaterQuality.DisaggregatedData - CAS_1333-82-0 - ug/L
definition: The unit of measure for 'CAS_1333-82-0' (Chromium trioxide (CrO3)) in WISE SoE - Water Quality: Disaggregated data table is 'ug/L'
status: valid
status modified: 2019-10-03
accepted date: 2019-10-03
in scheme: Definition of correct units for the observed determinands in the given WISE SoE DD tables
has determinand: CAS 1333-82-0
has uom: ug.L-1
has table: WISE-SoE WaterQuality.DisaggregatedData

WISE-SoE_WaterQuality.DisaggregatedData - CAS_1335-87-1 - ug/L
type: Concept
notation: WISE-SoE_WaterQuality.DisaggregatedData - CAS_1335-87-1 - ug/L
definition: The unit of measure for 'CAS_1335-87-1' (Hexachloronaphthalene) in WISE SoE - Water Quality: Disaggregated data table is 'ug/L'
status: valid
status modified: 2019-10-03
accepted date: 2019-10-03
in scheme: Definition of correct units for the observed determinands in the given WISE SoE DD tables
has determinand: CAS 1335-87-1
has uom: ug.L-1
has table: WISE-SoE WaterQuality.DisaggregatedData

WISE-SoE_WaterQuality.DisaggregatedData - CAS_1335-88-2 - ug/L
type: Concept
notation: WISE-SoE_WaterQuality.DisaggregatedData - CAS_1335-88-2 - ug/L
definition: The unit of measure for 'CAS_1335-88-2' (Tetrachloronaphthalene) in WISE SoE - Water Quality: Disaggregated data table is 'ug/L'
status: valid
status modified: 2019-10-03
accepted date: 2019-10-03
in scheme: Definition of correct units for the observed determinands in the given WISE SoE DD tables
has determinand: CAS 1335-88-2
has uom: ug.L-1
has table: WISE-SoE WaterQuality.DisaggregatedData

WISE-SoE_WaterQuality.DisaggregatedData - CAS_13351-73-0 - ug/L
type: Concept
notation: WISE-SoE_WaterQuality.DisaggregatedData - CAS_13351-73-0 - ug/L
definition: The unit of measure for 'CAS_13351-73-0' (Tolyltriazole) in WISE SoE - Water Quality: Disaggregated data table is 'ug/L'
status: valid
status modified: 2019-10-03
accepted date: 2019-10-03
in scheme: Definition of correct units for the observed determinands in the given WISE SoE DD tables
has determinand: CAS 13351-73-0
has uom: ug.L-1
has table: WISE-SoE WaterQuality.DisaggregatedData

WISE-SoE_WaterQuality.DisaggregatedData - CAS_13356-08-6 - ug/L
type: Concept
notation: WISE-SoE_WaterQuality.DisaggregatedData - CAS_13356-08-6 - ug/L
definition: The unit of measure for 'CAS_13356-08-6' (Fenbutatin oxide) in WISE SoE - Water Quality: Disaggregated data table is 'ug/L'
status: valid
status modified: 2019-10-03
accepted date: 2019-10-03
in scheme: Definition of correct units for the observed determinands in the given WISE SoE DD tables
has determinand: CAS 13356-08-6
has uom: ug.L-1
has table: WISE-SoE WaterQuality.DisaggregatedData

WISE-SoE_WaterQuality.DisaggregatedData - CAS_1336-36-3 - ug/L
type: Concept
notation: WISE-SoE_WaterQuality.DisaggregatedData - CAS_1336-36-3 - ug/L
definition: The unit of measure for 'CAS_1336-36-3' (Polychlorinated biphenyls) in WISE SoE - Water Quality: Disaggregated data table is 'ug/L'
status: valid
status modified: 2019-10-03
accepted date: 2019-10-03
in scheme: Definition of correct units for the observed determinands in the given WISE SoE DD tables
has determinand: CAS 1336-36-3
has uom: ug.L-1
has table: WISE-SoE WaterQuality.DisaggregatedData

WISE-SoE_WaterQuality.DisaggregatedData - CAS_13360-45-7 - ug/L
type: Concept
notation: WISE-SoE_WaterQuality.DisaggregatedData - CAS_13360-45-7 - ug/L
definition: The unit of measure for 'CAS_13360-45-7' (Chlorbromuron) in WISE SoE - Water Quality: Disaggregated data table is 'ug/L'
status: valid
status modified: 2019-10-03
accepted date: 2019-10-03
in scheme: Definition of correct units for the observed determinands in the given WISE SoE DD tables
has determinand: CAS 13360-45-7
has uom: ug.L-1
has table: WISE-SoE WaterQuality.DisaggregatedData

WISE-SoE_WaterQuality.DisaggregatedData - CAS_133855-98-8 - ug/L
type: Concept
notation: WISE-SoE_WaterQuality.DisaggregatedData - CAS_133855-98-8 - ug/L
definition: The unit of measure for 'CAS_133855-98-8' (Epoxiconazole) in WISE SoE - Water Quality: Disaggregated data table is 'ug/L'
status: valid
status modified: 2019-10-03
accepted date: 2019-10-03
in scheme: Definition of correct units for the observed determinands in the given WISE SoE DD tables
has determinand: CAS 133855-98-8
has uom: ug.L-1
has table: WISE-SoE WaterQuality.DisaggregatedData

WISE-SoE_WaterQuality.DisaggregatedData - CAS_134-62-3 - ug/L
type: Concept
notation: WISE-SoE_WaterQuality.DisaggregatedData - CAS_134-62-3 - ug/L
definition: The unit of measure for 'CAS_134-62-3' (Diethyltoluamide (DEET)) in WISE SoE - Water Quality: Disaggregated data table is 'ug/L'
status: valid
status modified: 2019-10-03
accepted date: 2019-10-03
in scheme: Definition of correct units for the observed determinands in the given WISE SoE DD tables
has determinand: CAS 134-62-3
has uom: ug.L-1
has table: WISE-SoE WaterQuality.DisaggregatedData

WISE-SoE_WaterQuality.DisaggregatedData - CAS_134098-61-6 - ug/L
type: Concept
notation: WISE-SoE_WaterQuality.DisaggregatedData - CAS_134098-61-6 - ug/L
definition: The unit of measure for 'CAS_134098-61-6' (Fenpyroximate) in WISE SoE - Water Quality: Disaggregated data table is 'ug/L'
status: valid
status modified: 2019-10-03
accepted date: 2019-10-03
in scheme: Definition of correct units for the observed determinands in the given WISE SoE DD tables
has determinand: CAS 134098-61-6
has uom: ug.L-1
has table: WISE-SoE WaterQuality.DisaggregatedData

WISE-SoE_WaterQuality.DisaggregatedData - CAS_134237-50-6 - ug/L
type: Concept
notation: WISE-SoE_WaterQuality.DisaggregatedData - CAS_134237-50-6 - ug/L
definition: The unit of measure for 'CAS_134237-50-6' (alpha-Hexabromocyclododecane) in WISE SoE - Water Quality: Disaggregated data table is 'ug/L'
status: valid
status modified: 2019-10-03
accepted date: 2019-10-03
in scheme: Definition of correct units for the observed determinands in the given WISE SoE DD tables
has determinand: CAS 134237-50-6
has uom: ug.L-1
has table: WISE-SoE WaterQuality.DisaggregatedData

WISE-SoE_WaterQuality.DisaggregatedData - CAS_134237-51-7 - ug/L
type: Concept
notation: WISE-SoE_WaterQuality.DisaggregatedData - CAS_134237-51-7 - ug/L
definition: The unit of measure for 'CAS_134237-51-7' (beta-Hexabromocyclododecane) in WISE SoE - Water Quality: Disaggregated data table is 'ug/L'
status: valid
status modified: 2019-10-03
accepted date: 2019-10-03
in scheme: Definition of correct units for the observed determinands in the given WISE SoE DD tables
has determinand: CAS 134237-51-7
has uom: ug.L-1
has table: WISE-SoE WaterQuality.DisaggregatedData

WISE-SoE_WaterQuality.DisaggregatedData - CAS_134237-52-8 - ug/L
type: Concept
notation: WISE-SoE_WaterQuality.DisaggregatedData - CAS_134237-52-8 - ug/L
definition: The unit of measure for 'CAS_134237-52-8' (gamma-Hexabromocyclododecane) in WISE SoE - Water Quality: Disaggregated data table is 'ug/L'
status: valid
status modified: 2019-10-03
accepted date: 2019-10-03
in scheme: Definition of correct units for the observed determinands in the given WISE SoE DD tables
has determinand: CAS 134237-52-8
has uom: ug.L-1
has table: WISE-SoE WaterQuality.DisaggregatedData

WISE-SoE_WaterQuality.DisaggregatedData - CAS_13457-18-6 - ug/L
type: Concept
notation: WISE-SoE_WaterQuality.DisaggregatedData - CAS_13457-18-6 - ug/L
definition: The unit of measure for 'CAS_13457-18-6' (Pyrazophos) in WISE SoE - Water Quality: Disaggregated data table is 'ug/L'
status: valid
status modified: 2019-10-03
accepted date: 2019-10-03
in scheme: Definition of correct units for the observed determinands in the given WISE SoE DD tables
has determinand: CAS 13457-18-6
has uom: ug.L-1
has table: WISE-SoE WaterQuality.DisaggregatedData

WISE-SoE_WaterQuality.DisaggregatedData - CAS_135-19-3 - ug/L
type: Concept
notation: WISE-SoE_WaterQuality.DisaggregatedData - CAS_135-19-3 - ug/L
definition: The unit of measure for 'CAS_135-19-3' (2-naphthol) in WISE SoE - Water Quality: Disaggregated data table is 'ug/L'
status: valid
status modified: 2019-10-03
accepted date: 2019-10-03
in scheme: Definition of correct units for the observed determinands in the given WISE SoE DD tables
has determinand: CAS 135-19-3
has uom: ug.L-1
has table: WISE-SoE WaterQuality.DisaggregatedData

WISE-SoE_WaterQuality.DisaggregatedData - CAS_135-98-8 - ug/L
type: Concept
notation: WISE-SoE_WaterQuality.DisaggregatedData - CAS_135-98-8 - ug/L
definition: The unit of measure for 'CAS_135-98-8' (sec-butylbenzene) in WISE SoE - Water Quality: Disaggregated data table is 'ug/L'
status: valid
status modified: 2019-10-03
accepted date: 2019-10-03
in scheme: Definition of correct units for the observed determinands in the given WISE SoE DD tables
has determinand: CAS 135-98-8
has uom: ug.L-1
has table: WISE-SoE WaterQuality.DisaggregatedData

WISE-SoE_WaterQuality.DisaggregatedData - CAS_135410-20-7 - ug/L
type: Concept
notation: WISE-SoE_WaterQuality.DisaggregatedData - CAS_135410-20-7 - ug/L
definition: The unit of measure for 'CAS_135410-20-7' (Ethanimidamide) in WISE SoE - Water Quality: Disaggregated data table is 'ug/L'
status: valid
status modified: 2019-10-03
accepted date: 2019-10-03
in scheme: Definition of correct units for the observed determinands in the given WISE SoE DD tables
has determinand: CAS 135410-20-7
has uom: ug.L-1
has table: WISE-SoE WaterQuality.DisaggregatedData

WISE-SoE_WaterQuality.DisaggregatedData - CAS_136-85-6 - ug/L
type: Concept
notation: WISE-SoE_WaterQuality.DisaggregatedData - CAS_136-85-6 - ug/L
definition: The unit of measure for 'CAS_136-85-6' (Methylbenzotriazol) in WISE SoE - Water Quality: Disaggregated data table is 'ug/L'
status: valid
status modified: 2019-10-03
accepted date: 2019-10-03
in scheme: Definition of correct units for the observed determinands in the given WISE SoE DD tables
has determinand: CAS 136-85-6
has uom: ug.L-1
has table: WISE-SoE WaterQuality.DisaggregatedData

WISE-SoE_WaterQuality.DisaggregatedData - CAS_136426-54-5 - ug/L
type: Concept
notation: WISE-SoE_WaterQuality.DisaggregatedData - CAS_136426-54-5 - ug/L
definition: The unit of measure for 'CAS_136426-54-5' (Fluquinconazole) in WISE SoE - Water Quality: Disaggregated data table is 'ug/L'
status: valid
status modified: 2019-10-03
accepted date: 2019-10-03
in scheme: Definition of correct units for the observed determinands in the given WISE SoE DD tables
has determinand: CAS 136426-54-5
has uom: ug.L-1
has table: WISE-SoE WaterQuality.DisaggregatedData

WISE-SoE_WaterQuality.DisaggregatedData - CAS_136677-10-6 - ug/L
type: Concept
notation: WISE-SoE_WaterQuality.DisaggregatedData - CAS_136677-10-6 - ug/L
definition: The unit of measure for 'CAS_136677-10-6' (Polychlorinated dibenzofurans (10 PCDFs)) in WISE SoE - Water Quality: Disaggregated data table is 'ug/L'
status: valid
status modified: 2019-10-03
accepted date: 2019-10-03
in scheme: Definition of correct units for the observed determinands in the given WISE SoE DD tables
has determinand: CAS 136677-10-6
has uom: ug.L-1
has table: WISE-SoE WaterQuality.DisaggregatedData

WISE-SoE_WaterQuality.DisaggregatedData - CAS_13684-56-5 - ug/L
type: Concept
notation: WISE-SoE_WaterQuality.DisaggregatedData - CAS_13684-56-5 - ug/L
definition: The unit of measure for 'CAS_13684-56-5' (Desmedipham) in WISE SoE - Water Quality: Disaggregated data table is 'ug/L'
status: valid
status modified: 2019-10-03
accepted date: 2019-10-03
in scheme: Definition of correct units for the observed determinands in the given WISE SoE DD tables
has determinand: CAS 13684-56-5
has uom: ug.L-1
has table: WISE-SoE WaterQuality.DisaggregatedData

WISE-SoE_WaterQuality.DisaggregatedData - CAS_137-26-8 - ug/L
type: Concept
notation: WISE-SoE_WaterQuality.DisaggregatedData - CAS_137-26-8 - ug/L
definition: The unit of measure for 'CAS_137-26-8' (Thiram) in WISE SoE - Water Quality: Disaggregated data table is 'ug/L'
status: valid
status modified: 2019-10-03
accepted date: 2019-10-03
in scheme: Definition of correct units for the observed determinands in the given WISE SoE DD tables
has determinand: CAS 137-26-8
has uom: ug.L-1
has table: WISE-SoE WaterQuality.DisaggregatedData

WISE-SoE_WaterQuality.DisaggregatedData - CAS_137-30-4 - ug/L
type: Concept
notation: WISE-SoE_WaterQuality.DisaggregatedData - CAS_137-30-4 - ug/L
definition: The unit of measure for 'CAS_137-30-4' (Ziram) in WISE SoE - Water Quality: Disaggregated data table is 'ug/L'
status: valid
status modified: 2019-10-03
accepted date: 2019-10-03
in scheme: Definition of correct units for the observed determinands in the given WISE SoE DD tables
has determinand: CAS 137-30-4
has uom: ug.L-1
has table: WISE-SoE WaterQuality.DisaggregatedData

WISE-SoE_WaterQuality.DisaggregatedData - CAS_137641-05-5 - ug/L
type: Concept
notation: WISE-SoE_WaterQuality.DisaggregatedData - CAS_137641-05-5 - ug/L
definition: The unit of measure for 'CAS_137641-05-5' (Picolinafen) in WISE SoE - Water Quality: Disaggregated data table is 'ug/L'
status: valid
status modified: 2019-10-03
accepted date: 2019-10-03
in scheme: Definition of correct units for the observed determinands in the given WISE SoE DD tables
has determinand: CAS 137641-05-5
has uom: ug.L-1
has table: WISE-SoE WaterQuality.DisaggregatedData

WISE-SoE_WaterQuality.DisaggregatedData - CAS_138261-41-3 - ug/L
type: Concept
notation: WISE-SoE_WaterQuality.DisaggregatedData - CAS_138261-41-3 - ug/L
definition: The unit of measure for 'CAS_138261-41-3' (Imidacloprid) in WISE SoE - Water Quality: Disaggregated data table is 'ug/L'
status: valid
status modified: 2019-10-03
accepted date: 2019-10-03
in scheme: Definition of correct units for the observed determinands in the given WISE SoE DD tables
has determinand: CAS 138261-41-3
has uom: ug.L-1
has table: WISE-SoE WaterQuality.DisaggregatedData

WISE-SoE_WaterQuality.DisaggregatedData - CAS_139-13-9 - ug/L
type: Concept
notation: WISE-SoE_WaterQuality.DisaggregatedData - CAS_139-13-9 - ug/L
definition: The unit of measure for 'CAS_139-13-9' (NTA) in WISE SoE - Water Quality: Disaggregated data table is 'ug/L'
status: valid
status modified: 2019-10-03
accepted date: 2019-10-03
in scheme: Definition of correct units for the observed determinands in the given WISE SoE DD tables
has determinand: CAS 139-13-9
has uom: ug.L-1
has table: WISE-SoE WaterQuality.DisaggregatedData

WISE-SoE_WaterQuality.DisaggregatedData - CAS_139-40-2 - ug/L
type: Concept
notation: WISE-SoE_WaterQuality.DisaggregatedData - CAS_139-40-2 - ug/L
definition: The unit of measure for 'CAS_139-40-2' (Propazine) in WISE SoE - Water Quality: Disaggregated data table is 'ug/L'
status: valid
status modified: 2019-10-03
accepted date: 2019-10-03
in scheme: Definition of correct units for the observed determinands in the given WISE SoE DD tables
has determinand: CAS 139-40-2
has uom: ug.L-1
has table: WISE-SoE WaterQuality.DisaggregatedData

WISE-SoE_WaterQuality.DisaggregatedData - CAS_139528-85-1 - ug/L
type: Concept
notation: WISE-SoE_WaterQuality.DisaggregatedData - CAS_139528-85-1 - ug/L
definition: The unit of measure for 'CAS_139528-85-1' (Metosulam) in WISE SoE - Water Quality: Disaggregated data table is 'ug/L'
status: valid
status modified: 2019-10-03
accepted date: 2019-10-03
in scheme: Definition of correct units for the observed determinands in the given WISE SoE DD tables
has determinand: CAS 139528-85-1
has uom: ug.L-1
has table: WISE-SoE WaterQuality.DisaggregatedData

WISE-SoE_WaterQuality.DisaggregatedData - CAS_139968-49-3 - ug/L
type: Concept
notation: WISE-SoE_WaterQuality.DisaggregatedData - CAS_139968-49-3 - ug/L
definition: The unit of measure for 'CAS_139968-49-3' (Metaflumizone) in WISE SoE - Water Quality: Disaggregated data table is 'ug/L'
status: valid
status modified: 2019-10-03
accepted date: 2019-10-03
in scheme: Definition of correct units for the observed determinands in the given WISE SoE DD tables
has determinand: CAS 139968-49-3
has uom: ug.L-1
has table: WISE-SoE WaterQuality.DisaggregatedData

WISE-SoE_WaterQuality.DisaggregatedData - CAS_140-57-8 - ug/L
type: Concept
notation: WISE-SoE_WaterQuality.DisaggregatedData - CAS_140-57-8 - ug/L
definition: The unit of measure for 'CAS_140-57-8' (Aramite) in WISE SoE - Water Quality: Disaggregated data table is 'ug/L'
status: valid
status modified: 2019-10-03
accepted date: 2019-10-03
in scheme: Definition of correct units for the observed determinands in the given WISE SoE DD tables
has determinand: CAS 140-57-8
has uom: ug.L-1
has table: WISE-SoE WaterQuality.DisaggregatedData

WISE-SoE_WaterQuality.DisaggregatedData - CAS_140-66-9 - ug/L
type: Concept
notation: WISE-SoE_WaterQuality.DisaggregatedData - CAS_140-66-9 - ug/L
definition: The unit of measure for 'CAS_140-66-9' (Octylphenol (4-(1,1',3,3'-tetramethylbutyl)-phenol)) in WISE SoE - Water Quality: Disaggregated data table is 'ug/L'
status: valid
status modified: 2019-10-03
accepted date: 2019-10-03
in scheme: Definition of correct units for the observed determinands in the given WISE SoE DD tables
has determinand: CAS 140-66-9
has uom: ug.L-1
has table: WISE-SoE WaterQuality.DisaggregatedData

WISE-SoE_WaterQuality.DisaggregatedData - CAS_140923-17-7 - ug/L
type: Concept
notation: WISE-SoE_WaterQuality.DisaggregatedData - CAS_140923-17-7 - ug/L
definition: The unit of measure for 'CAS_140923-17-7' (Iprovalicarb) in WISE SoE - Water Quality: Disaggregated data table is 'ug/L'
status: valid
status modified: 2019-10-03
accepted date: 2019-10-03
in scheme: Definition of correct units for the observed determinands in the given WISE SoE DD tables
has determinand: CAS 140923-17-7
has uom: ug.L-1
has table: WISE-SoE WaterQuality.DisaggregatedData

WISE-SoE_WaterQuality.DisaggregatedData - CAS_141112-29-0 - ug/L
type: Concept
notation: WISE-SoE_WaterQuality.DisaggregatedData - CAS_141112-29-0 - ug/L
definition: The unit of measure for 'CAS_141112-29-0' (Isoxaflutole) in WISE SoE - Water Quality: Disaggregated data table is 'ug/L'
status: valid
status modified: 2019-10-03
accepted date: 2019-10-03
in scheme: Definition of correct units for the observed determinands in the given WISE SoE DD tables
has determinand: CAS 141112-29-0
has uom: ug.L-1
has table: WISE-SoE WaterQuality.DisaggregatedData

WISE-SoE_WaterQuality.DisaggregatedData - CAS_141517-21-7 - ug/L
type: Concept
notation: WISE-SoE_WaterQuality.DisaggregatedData - CAS_141517-21-7 - ug/L
definition: The unit of measure for 'CAS_141517-21-7' (Trifloxystrobin) in WISE SoE - Water Quality: Disaggregated data table is 'ug/L'
status: valid
status modified: 2019-10-03
accepted date: 2019-10-03
in scheme: Definition of correct units for the observed determinands in the given WISE SoE DD tables
has determinand: CAS 141517-21-7
has uom: ug.L-1
has table: WISE-SoE WaterQuality.DisaggregatedData

WISE-SoE_WaterQuality.DisaggregatedData - CAS_141776-32-1 - ug/L
type: Concept
notation: WISE-SoE_WaterQuality.DisaggregatedData - CAS_141776-32-1 - ug/L
definition: The unit of measure for 'CAS_141776-32-1' (Sulfosulfuron) in WISE SoE - Water Quality: Disaggregated data table is 'ug/L'
status: valid
status modified: 2019-10-03
accepted date: 2019-10-03
in scheme: Definition of correct units for the observed determinands in the given WISE SoE DD tables
has determinand: CAS 141776-32-1
has uom: ug.L-1
has table: WISE-SoE WaterQuality.DisaggregatedData

WISE-SoE_WaterQuality.DisaggregatedData - CAS_1418095-02-9 - ug/L
type: Concept
notation: WISE-SoE_WaterQuality.DisaggregatedData - CAS_1418095-02-9 - ug/L
definition: The unit of measure for 'CAS_1418095-02-9' (Chlorothalonil ESA (VIS-01)) in WISE SoE - Water Quality: Disaggregated data table is 'ug/L'
status: valid
status modified: 2019-10-03
accepted date: 2019-10-03
in scheme: Definition of correct units for the observed determinands in the given WISE SoE DD tables
has determinand: CAS 1418095-02-9
has uom: ug.L-1
has table: WISE-SoE WaterQuality.DisaggregatedData

WISE-SoE_WaterQuality.DisaggregatedData - CAS_142-28-9 - ug/L
type: Concept
notation: WISE-SoE_WaterQuality.DisaggregatedData - CAS_142-28-9 - ug/L
definition: The unit of measure for 'CAS_142-28-9' (1,3-dichloropropane) in WISE SoE - Water Quality: Disaggregated data table is 'ug/L'
status: valid
status modified: 2019-10-03
accepted date: 2019-10-03
in scheme: Definition of correct units for the observed determinands in the given WISE SoE DD tables
has determinand: CAS 142-28-9
has uom: ug.L-1
has table: WISE-SoE WaterQuality.DisaggregatedData

WISE-SoE_WaterQuality.DisaggregatedData - CAS_142363-53-9 - ug/L
type: Concept
notation: WISE-SoE_WaterQuality.DisaggregatedData - CAS_142363-53-9 - ug/L
definition: The unit of measure for 'CAS_142363-53-9' (Alachlor ESA) in WISE SoE - Water Quality: Disaggregated data table is 'ug/L'
status: valid
status modified: 2019-10-03
accepted date: 2019-10-03
in scheme: Definition of correct units for the observed determinands in the given WISE SoE DD tables
has determinand: CAS 142363-53-9
has uom: ug.L-1
has table: WISE-SoE WaterQuality.DisaggregatedData

WISE-SoE_WaterQuality.DisaggregatedData - CAS_142459-58-3 - ug/L
type: Concept
notation: WISE-SoE_WaterQuality.DisaggregatedData - CAS_142459-58-3 - ug/L
definition: The unit of measure for 'CAS_142459-58-3' (Flufenacet) in WISE SoE - Water Quality: Disaggregated data table is 'ug/L'
status: valid
status modified: 2019-10-03
accepted date: 2019-10-03
in scheme: Definition of correct units for the observed determinands in the given WISE SoE DD tables
has determinand: CAS 142459-58-3
has uom: ug.L-1
has table: WISE-SoE WaterQuality.DisaggregatedData

WISE-SoE_WaterQuality.DisaggregatedData - CAS_14265-44-2 - mg{P}/L
type: Concept
notation: WISE-SoE_WaterQuality.DisaggregatedData - CAS_14265-44-2 - mg{P}/L
definition: The unit of measure for 'CAS_14265-44-2' (Phosphate) in WISE SoE - Water Quality: Disaggregated data table is 'mg{P}/L'
status: valid
status modified: 2019-10-03
accepted date: 2019-10-03
in scheme: Definition of correct units for the observed determinands in the given WISE SoE DD tables
has determinand: CAS 14265-44-2
has uom: mg{P}.L-1
has table: WISE-SoE WaterQuality.DisaggregatedData

WISE-SoE_WaterQuality.DisaggregatedData - CAS_143-50-0 - ug/L
type: Concept
notation: WISE-SoE_WaterQuality.DisaggregatedData - CAS_143-50-0 - ug/L
definition: The unit of measure for 'CAS_143-50-0' (Chlordecone (Kepone)) in WISE SoE - Water Quality: Disaggregated data table is 'ug/L'
status: valid
status modified: 2019-10-03
accepted date: 2019-10-03
in scheme: Definition of correct units for the observed determinands in the given WISE SoE DD tables
has determinand: CAS 143-50-0
has uom: ug.L-1
has table: WISE-SoE WaterQuality.DisaggregatedData

WISE-SoE_WaterQuality.DisaggregatedData - CAS_143390-89-0 - ug/L
type: Concept
notation: WISE-SoE_WaterQuality.DisaggregatedData - CAS_143390-89-0 - ug/L
definition: The unit of measure for 'CAS_143390-89-0' (Kresoxim-methyl) in WISE SoE - Water Quality: Disaggregated data table is 'ug/L'
status: valid
status modified: 2019-10-03
accepted date: 2019-10-03
in scheme: Definition of correct units for the observed determinands in the given WISE SoE DD tables
has determinand: CAS 143390-89-0
has uom: ug.L-1
has table: WISE-SoE WaterQuality.DisaggregatedData

WISE-SoE_WaterQuality.DisaggregatedData - CAS_144-49-0 - ug/L
type: Concept
notation: WISE-SoE_WaterQuality.DisaggregatedData - CAS_144-49-0 - ug/L
definition: The unit of measure for 'CAS_144-49-0' (Fluoroacetic acid) in WISE SoE - Water Quality: Disaggregated data table is 'ug/L'
status: valid
status modified: 2019-10-03
accepted date: 2019-10-03
in scheme: Definition of correct units for the observed determinands in the given WISE SoE DD tables
has determinand: CAS 144-49-0
has uom: ug.L-1
has table: WISE-SoE WaterQuality.DisaggregatedData

WISE-SoE_WaterQuality.DisaggregatedData - CAS_1461-25-2 - ug/L
type: Concept
notation: WISE-SoE_WaterQuality.DisaggregatedData - CAS_1461-25-2 - ug/L
definition: The unit of measure for 'CAS_1461-25-2' (Tetrabutyltin) in WISE SoE - Water Quality: Disaggregated data table is 'ug/L'
status: valid
status modified: 2019-10-03
accepted date: 2019-10-03
in scheme: Definition of correct units for the observed determinands in the given WISE SoE DD tables
has determinand: CAS 1461-25-2
has uom: ug.L-1
has table: WISE-SoE WaterQuality.DisaggregatedData

WISE-SoE_WaterQuality.DisaggregatedData - CAS_14797-55-8 - mg{NO3}/L
type: Concept
notation: WISE-SoE_WaterQuality.DisaggregatedData - CAS_14797-55-8 - mg{NO3}/L
definition: The unit of measure for 'CAS_14797-55-8' (Nitrate) in WISE SoE - Water Quality: Disaggregated data table is 'mg{NO3}/L'
status: valid
status modified: 2019-10-03
accepted date: 2019-10-03
in scheme: Definition of correct units for the observed determinands in the given WISE SoE DD tables
has determinand: CAS 14797-55-8
has uom: mg{NO3}.L-1
has table: WISE-SoE WaterQuality.DisaggregatedData

WISE-SoE_WaterQuality.DisaggregatedData - CAS_14797-65-0 - mg{NO2}/L
type: Concept
notation: WISE-SoE_WaterQuality.DisaggregatedData - CAS_14797-65-0 - mg{NO2}/L
definition: The unit of measure for 'CAS_14797-65-0' (Nitrite) in WISE SoE - Water Quality: Disaggregated data table is 'mg{NO2}/L'
status: valid
status modified: 2019-10-03
accepted date: 2019-10-03
in scheme: Definition of correct units for the observed determinands in the given WISE SoE DD tables
has determinand: CAS 14797-65-0
has uom: mg{NO2}.L-1
has table: WISE-SoE WaterQuality.DisaggregatedData

WISE-SoE_WaterQuality.DisaggregatedData - CAS_14798-03-9 - mg{NH4}/L
type: Concept
notation: WISE-SoE_WaterQuality.DisaggregatedData - CAS_14798-03-9 - mg{NH4}/L
definition: The unit of measure for 'CAS_14798-03-9' (Ammonium) in WISE SoE - Water Quality: Disaggregated data table is 'mg{NH4}/L'
status: valid
status modified: 2019-10-03
accepted date: 2019-10-03
in scheme: Definition of correct units for the observed determinands in the given WISE SoE DD tables
has determinand: CAS 14798-03-9
has uom: mg{NH4}.L-1
has table: WISE-SoE WaterQuality.DisaggregatedData

WISE-SoE_WaterQuality.DisaggregatedData - CAS_14816-18-3 - ug/L
type: Concept
notation: WISE-SoE_WaterQuality.DisaggregatedData - CAS_14816-18-3 - ug/L
definition: The unit of measure for 'CAS_14816-18-3' (Phoxim) in WISE SoE - Water Quality: Disaggregated data table is 'ug/L'
status: valid
status modified: 2019-10-03
accepted date: 2019-10-03
in scheme: Definition of correct units for the observed determinands in the given WISE SoE DD tables
has determinand: CAS 14816-18-3
has uom: ug.L-1
has table: WISE-SoE WaterQuality.DisaggregatedData

WISE-SoE_WaterQuality.DisaggregatedData - CAS_14866-68-3 - ug/L
type: Concept
notation: WISE-SoE_WaterQuality.DisaggregatedData - CAS_14866-68-3 - ug/L
definition: The unit of measure for 'CAS_14866-68-3' (Chlorates) in WISE SoE - Water Quality: Disaggregated data table is 'ug/L'
status: valid
status modified: 2019-10-03
accepted date: 2019-10-03
in scheme: Definition of correct units for the observed determinands in the given WISE SoE DD tables
has determinand: CAS 14866-68-3
has uom: ug.L-1
has table: WISE-SoE WaterQuality.DisaggregatedData

WISE-SoE_WaterQuality.DisaggregatedData - CAS_14998-27-7 - ug/L
type: Concept
notation: WISE-SoE_WaterQuality.DisaggregatedData - CAS_14998-27-7 - ug/L
definition: The unit of measure for 'CAS_14998-27-7' (Chlorite) in WISE SoE - Water Quality: Disaggregated data table is 'ug/L'
status: valid
status modified: 2019-10-03
accepted date: 2019-10-03
in scheme: Definition of correct units for the observed determinands in the given WISE SoE DD tables
has determinand: CAS 14998-27-7
has uom: ug.L-1
has table: WISE-SoE WaterQuality.DisaggregatedData

WISE-SoE_WaterQuality.DisaggregatedData - CAS_150-68-5 - ug/L
type: Concept
notation: WISE-SoE_WaterQuality.DisaggregatedData - CAS_150-68-5 - ug/L
definition: The unit of measure for 'CAS_150-68-5' (Monuron) in WISE SoE - Water Quality: Disaggregated data table is 'ug/L'
status: valid
status modified: 2019-10-03
accepted date: 2019-10-03
in scheme: Definition of correct units for the observed determinands in the given WISE SoE DD tables
has determinand: CAS 150-68-5
has uom: ug.L-1
has table: WISE-SoE WaterQuality.DisaggregatedData

WISE-SoE_WaterQuality.DisaggregatedData - CAS_151-21-3 - ug/L
type: Concept
notation: WISE-SoE_WaterQuality.DisaggregatedData - CAS_151-21-3 - ug/L
definition: The unit of measure for 'CAS_151-21-3' (Sodium dodecyl sulfate) in WISE SoE - Water Quality: Disaggregated data table is 'ug/L'
status: valid
status modified: 2019-10-03
accepted date: 2019-10-03
in scheme: Definition of correct units for the observed determinands in the given WISE SoE DD tables
has determinand: CAS 151-21-3
has uom: ug.L-1
has table: WISE-SoE WaterQuality.DisaggregatedData

WISE-SoE_WaterQuality.DisaggregatedData - CAS_15165-67-0 - ug/L
type: Concept
notation: WISE-SoE_WaterQuality.DisaggregatedData - CAS_15165-67-0 - ug/L
definition: The unit of measure for 'CAS_15165-67-0' (Dichlorprop-P) in WISE SoE - Water Quality: Disaggregated data table is 'ug/L'
status: valid
status modified: 2019-10-03
accepted date: 2019-10-03
in scheme: Definition of correct units for the observed determinands in the given WISE SoE DD tables
has determinand: CAS 15165-67-0
has uom: ug.L-1
has table: WISE-SoE WaterQuality.DisaggregatedData

WISE-SoE_WaterQuality.DisaggregatedData - CAS_152019-73-3 - ug/L
type: Concept
notation: WISE-SoE_WaterQuality.DisaggregatedData - CAS_152019-73-3 - ug/L
definition: The unit of measure for 'CAS_152019-73-3' (Metolachlor OA) in WISE SoE - Water Quality: Disaggregated data table is 'ug/L'
status: valid
status modified: 2019-10-03
accepted date: 2019-10-03
in scheme: Definition of correct units for the observed determinands in the given WISE SoE DD tables
has determinand: CAS 152019-73-3
has uom: ug.L-1
has table: WISE-SoE WaterQuality.DisaggregatedData

WISE-SoE_WaterQuality.DisaggregatedData - CAS_15299-99-7 - ug/L
type: Concept
notation: WISE-SoE_WaterQuality.DisaggregatedData - CAS_15299-99-7 - ug/L
definition: The unit of measure for 'CAS_15299-99-7' (Napropamide) in WISE SoE - Water Quality: Disaggregated data table is 'ug/L'
status: valid
status modified: 2019-10-03
accepted date: 2019-10-03
in scheme: Definition of correct units for the observed determinands in the given WISE SoE DD tables
has determinand: CAS 15299-99-7
has uom: ug.L-1
has table: WISE-SoE WaterQuality.DisaggregatedData

WISE-SoE_WaterQuality.DisaggregatedData - CAS_15307-79-6 - ug/L
type: Concept
notation: WISE-SoE_WaterQuality.DisaggregatedData - CAS_15307-79-6 - ug/L
definition: The unit of measure for 'CAS_15307-79-6' (Diclofenac sodium) in WISE SoE - Water Quality: Disaggregated data table is 'ug/L'
status: valid
status modified: 2019-10-03
accepted date: 2019-10-03
in scheme: Definition of correct units for the observed determinands in the given WISE SoE DD tables
has determinand: CAS 15307-79-6
has uom: ug.L-1
has table: WISE-SoE WaterQuality.DisaggregatedData

WISE-SoE_WaterQuality.DisaggregatedData - CAS_15307-86-5 - ug/L
type: Concept
notation: WISE-SoE_WaterQuality.DisaggregatedData - CAS_15307-86-5 - ug/L
definition: The unit of measure for 'CAS_15307-86-5' (Diclofenac) in WISE SoE - Water Quality: Disaggregated data table is 'ug/L'
status: valid
status modified: 2019-10-03
accepted date: 2019-10-03
in scheme: Definition of correct units for the observed determinands in the given WISE SoE DD tables
has determinand: CAS 15307-86-5
has uom: ug.L-1
has table: WISE-SoE WaterQuality.DisaggregatedData

WISE-SoE_WaterQuality.DisaggregatedData - CAS_153719-23-4 - ug/L
type: Concept
notation: WISE-SoE_WaterQuality.DisaggregatedData - CAS_153719-23-4 - ug/L
definition: The unit of measure for 'CAS_153719-23-4' (Thiamethoxam) in WISE SoE - Water Quality: Disaggregated data table is 'ug/L'
status: valid
status modified: 2019-10-03
accepted date: 2019-10-03
in scheme: Definition of correct units for the observed determinands in the given WISE SoE DD tables
has determinand: CAS 153719-23-4
has uom: ug.L-1
has table: WISE-SoE WaterQuality.DisaggregatedData

WISE-SoE_WaterQuality.DisaggregatedData - CAS_15541-45-4 - ug/L
type: Concept
notation: WISE-SoE_WaterQuality.DisaggregatedData - CAS_15541-45-4 - ug/L
definition: The unit of measure for 'CAS_15541-45-4' (Bromate) in WISE SoE - Water Quality: Disaggregated data table is 'ug/L'
status: valid
status modified: 2019-10-03
accepted date: 2019-10-03
in scheme: Definition of correct units for the observed determinands in the given WISE SoE DD tables
has determinand: CAS 15541-45-4
has uom: ug.L-1
has table: WISE-SoE WaterQuality.DisaggregatedData

WISE-SoE_WaterQuality.DisaggregatedData - CAS_15545-48-9 - ug/L
type: Concept
notation: WISE-SoE_WaterQuality.DisaggregatedData - CAS_15545-48-9 - ug/L
definition: The unit of measure for 'CAS_15545-48-9' (Chlortoluron) in WISE SoE - Water Quality: Disaggregated data table is 'ug/L'
status: valid
status modified: 2019-10-03
accepted date: 2019-10-03
in scheme: Definition of correct units for the observed determinands in the given WISE SoE DD tables
has determinand: CAS 15545-48-9
has uom: ug.L-1
has table: WISE-SoE WaterQuality.DisaggregatedData

WISE-SoE_WaterQuality.DisaggregatedData - CAS_156-59-2 - ug/L
type: Concept
notation: WISE-SoE_WaterQuality.DisaggregatedData - CAS_156-59-2 - ug/L
definition: The unit of measure for 'CAS_156-59-2' (cis-1,2-dichloroethene) in WISE SoE - Water Quality: Disaggregated data table is 'ug/L'
status: valid
status modified: 2019-10-03
accepted date: 2019-10-03
in scheme: Definition of correct units for the observed determinands in the given WISE SoE DD tables
has determinand: CAS 156-59-2
has uom: ug.L-1
has table: WISE-SoE WaterQuality.DisaggregatedData

WISE-SoE_WaterQuality.DisaggregatedData - CAS_156-60-5 - ug/L
type: Concept
notation: WISE-SoE_WaterQuality.DisaggregatedData - CAS_156-60-5 - ug/L
definition: The unit of measure for 'CAS_156-60-5' (trans-1,2-dichloroethene) in WISE SoE - Water Quality: Disaggregated data table is 'ug/L'
status: valid
status modified: 2019-10-03
accepted date: 2019-10-03
in scheme: Definition of correct units for the observed determinands in the given WISE SoE DD tables
has determinand: CAS 156-60-5
has uom: ug.L-1
has table: WISE-SoE WaterQuality.DisaggregatedData

WISE-SoE_WaterQuality.DisaggregatedData - CAS_1563-66-2 - ug/L
type: Concept
notation: WISE-SoE_WaterQuality.DisaggregatedData - CAS_1563-66-2 - ug/L
definition: The unit of measure for 'CAS_1563-66-2' (Carbofuran) in WISE SoE - Water Quality: Disaggregated data table is 'ug/L'
status: valid
status modified: 2019-10-03
accepted date: 2019-10-03
in scheme: Definition of correct units for the observed determinands in the given WISE SoE DD tables
has determinand: CAS 1563-66-2
has uom: ug.L-1
has table: WISE-SoE WaterQuality.DisaggregatedData

WISE-SoE_WaterQuality.DisaggregatedData - CAS_15687-27-1 - ug/L
type: Concept
notation: WISE-SoE_WaterQuality.DisaggregatedData - CAS_15687-27-1 - ug/L
definition: The unit of measure for 'CAS_15687-27-1' (Ibuprofen) in WISE SoE - Water Quality: Disaggregated data table is 'ug/L'
status: valid
status modified: 2019-10-03
accepted date: 2019-10-03
in scheme: Definition of correct units for the observed determinands in the given WISE SoE DD tables
has determinand: CAS 15687-27-1
has uom: ug.L-1
has table: WISE-SoE WaterQuality.DisaggregatedData

WISE-SoE_WaterQuality.DisaggregatedData - CAS_1570-64-5 - ug/L
type: Concept
notation: WISE-SoE_WaterQuality.DisaggregatedData - CAS_1570-64-5 - ug/L
definition: The unit of measure for 'CAS_1570-64-5' (4-chloro-2-methylphenol) in WISE SoE - Water Quality: Disaggregated data table is 'ug/L'
status: valid
status modified: 2019-10-03
accepted date: 2019-10-03
in scheme: Definition of correct units for the observed determinands in the given WISE SoE DD tables
has determinand: CAS 1570-64-5
has uom: ug.L-1
has table: WISE-SoE WaterQuality.DisaggregatedData

WISE-SoE_WaterQuality.DisaggregatedData - CAS_1570-65-6 - ug/L
type: Concept
notation: WISE-SoE_WaterQuality.DisaggregatedData - CAS_1570-65-6 - ug/L
definition: The unit of measure for 'CAS_1570-65-6' (4,6-dichloro-2-methylphenol) in WISE SoE - Water Quality: Disaggregated data table is 'ug/L'
status: valid
status modified: 2019-10-03
accepted date: 2019-10-03
in scheme: Definition of correct units for the observed determinands in the given WISE SoE DD tables
has determinand: CAS 1570-65-6
has uom: ug.L-1
has table: WISE-SoE WaterQuality.DisaggregatedData

WISE-SoE_WaterQuality.DisaggregatedData - CAS_1582-09-8 - ug/L
type: Concept
notation: WISE-SoE_WaterQuality.DisaggregatedData - CAS_1582-09-8 - ug/L
definition: The unit of measure for 'CAS_1582-09-8' (Trifluralin) in WISE SoE - Water Quality: Disaggregated data table is 'ug/L'
status: valid
status modified: 2019-10-03
accepted date: 2019-10-03
in scheme: Definition of correct units for the observed determinands in the given WISE SoE DD tables
has determinand: CAS 1582-09-8
has uom: ug.L-1
has table: WISE-SoE WaterQuality.DisaggregatedData

WISE-SoE_WaterQuality.DisaggregatedData - CAS_15950-66-0 - ug/L
type: Concept
notation: WISE-SoE_WaterQuality.DisaggregatedData - CAS_15950-66-0 - ug/L
definition: The unit of measure for 'CAS_15950-66-0' (2,3,4-Trichlorophenol) in WISE SoE - Water Quality: Disaggregated data table is 'ug/L'
status: valid
status modified: 2019-10-03
accepted date: 2019-10-03
in scheme: Definition of correct units for the observed determinands in the given WISE SoE DD tables
has determinand: CAS 15950-66-0
has uom: ug.L-1
has table: WISE-SoE WaterQuality.DisaggregatedData

WISE-SoE_WaterQuality.DisaggregatedData - CAS_15972-60-8 - ug/L
type: Concept
notation: WISE-SoE_WaterQuality.DisaggregatedData - CAS_15972-60-8 - ug/L
definition: The unit of measure for 'CAS_15972-60-8' (Alachlor) in WISE SoE - Water Quality: Disaggregated data table is 'ug/L'
status: valid
status modified: 2019-10-03
accepted date: 2019-10-03
in scheme: Definition of correct units for the observed determinands in the given WISE SoE DD tables
has determinand: CAS 15972-60-8
has uom: ug.L-1
has table: WISE-SoE WaterQuality.DisaggregatedData

WISE-SoE_WaterQuality.DisaggregatedData - CAS_160430-64-8 - ug/L
type: Concept
notation: WISE-SoE_WaterQuality.DisaggregatedData - CAS_160430-64-8 - ug/L
definition: The unit of measure for 'CAS_160430-64-8' (Acetamiprid) in WISE SoE - Water Quality: Disaggregated data table is 'ug/L'
status: valid
status modified: 2019-10-03
accepted date: 2019-10-03
in scheme: Definition of correct units for the observed determinands in the given WISE SoE DD tables
has determinand: CAS 160430-64-8
has uom: ug.L-1
has table: WISE-SoE WaterQuality.DisaggregatedData

WISE-SoE_WaterQuality.DisaggregatedData - CAS_1610-18-0 - ug/L
type: Concept
notation: WISE-SoE_WaterQuality.DisaggregatedData - CAS_1610-18-0 - ug/L
definition: The unit of measure for 'CAS_1610-18-0' (Prometon) in WISE SoE - Water Quality: Disaggregated data table is 'ug/L'
status: valid
status modified: 2019-10-03
accepted date: 2019-10-03
in scheme: Definition of correct units for the observed determinands in the given WISE SoE DD tables
has determinand: CAS 1610-18-0
has uom: ug.L-1
has table: WISE-SoE WaterQuality.DisaggregatedData

WISE-SoE_WaterQuality.DisaggregatedData - CAS_16118-49-3 - ug/L
type: Concept
notation: WISE-SoE_WaterQuality.DisaggregatedData - CAS_16118-49-3 - ug/L
definition: The unit of measure for 'CAS_16118-49-3' (Carbetamide) in WISE SoE - Water Quality: Disaggregated data table is 'ug/L'
status: valid
status modified: 2019-10-03
accepted date: 2019-10-03
in scheme: Definition of correct units for the observed determinands in the given WISE SoE DD tables
has determinand: CAS 16118-49-3
has uom: ug.L-1
has table: WISE-SoE WaterQuality.DisaggregatedData

WISE-SoE_WaterQuality.DisaggregatedData - CAS_1634-04-4 - ug/L
type: Concept
notation: WISE-SoE_WaterQuality.DisaggregatedData - CAS_1634-04-4 - ug/L
definition: The unit of measure for 'CAS_1634-04-4' (MTBE) in WISE SoE - Water Quality: Disaggregated data table is 'ug/L'
status: valid
status modified: 2019-10-03
accepted date: 2019-10-03
in scheme: Definition of correct units for the observed determinands in the given WISE SoE DD tables
has determinand: CAS 1634-04-4
has uom: ug.L-1
has table: WISE-SoE WaterQuality.DisaggregatedData

WISE-SoE_WaterQuality.DisaggregatedData - CAS_1646-87-3 - ug/L
type: Concept
notation: WISE-SoE_WaterQuality.DisaggregatedData - CAS_1646-87-3 - ug/L
definition: The unit of measure for 'CAS_1646-87-3' (Aldicarb sulfoxide) in WISE SoE - Water Quality: Disaggregated data table is 'ug/L'
status: valid
status modified: 2019-10-03
accepted date: 2019-10-03
in scheme: Definition of correct units for the observed determinands in the given WISE SoE DD tables
has determinand: CAS 1646-87-3
has uom: ug.L-1
has table: WISE-SoE WaterQuality.DisaggregatedData

WISE-SoE_WaterQuality.DisaggregatedData - CAS_1646-88-4 - ug/L
type: Concept
notation: WISE-SoE_WaterQuality.DisaggregatedData - CAS_1646-88-4 - ug/L
definition: The unit of measure for 'CAS_1646-88-4' (Aldoxycarb) in WISE SoE - Water Quality: Disaggregated data table is 'ug/L'
status: valid
status modified: 2019-10-03
accepted date: 2019-10-03
in scheme: Definition of correct units for the observed determinands in the given WISE SoE DD tables
has determinand: CAS 1646-88-4
has uom: ug.L-1
has table: WISE-SoE WaterQuality.DisaggregatedData

WISE-SoE_WaterQuality.DisaggregatedData - CAS_16478-18-5 - ug/L
type: Concept
notation: WISE-SoE_WaterQuality.DisaggregatedData - CAS_16478-18-5 - ug/L
definition: The unit of measure for 'CAS_16478-18-5' (Pentachloroiodobenzene) in WISE SoE - Water Quality: Disaggregated data table is 'ug/L'
status: valid
status modified: 2019-10-03
accepted date: 2019-10-03
in scheme: Definition of correct units for the observed determinands in the given WISE SoE DD tables
has determinand: CAS 16478-18-5
has uom: ug.L-1
has table: WISE-SoE WaterQuality.DisaggregatedData

WISE-SoE_WaterQuality.DisaggregatedData - CAS_16484-77-8 - ug/L
type: Concept
notation: WISE-SoE_WaterQuality.DisaggregatedData - CAS_16484-77-8 - ug/L
definition: The unit of measure for 'CAS_16484-77-8' (Mecoprop-P (MCPP-P)) in WISE SoE - Water Quality: Disaggregated data table is 'ug/L'
status: valid
status modified: 2019-10-03
accepted date: 2019-10-03
in scheme: Definition of correct units for the observed determinands in the given WISE SoE DD tables
has determinand: CAS 16484-77-8
has uom: ug.L-1
has table: WISE-SoE WaterQuality.DisaggregatedData

WISE-SoE_WaterQuality.DisaggregatedData - CAS_16655-82-6 - ug/L
type: Concept
notation: WISE-SoE_WaterQuality.DisaggregatedData - CAS_16655-82-6 - ug/L
definition: The unit of measure for 'CAS_16655-82-6' (3-hydroxycarbofuran) in WISE SoE - Water Quality: Disaggregated data table is 'ug/L'
status: valid
status modified: 2019-10-03
accepted date: 2019-10-03
in scheme: Definition of correct units for the observed determinands in the given WISE SoE DD tables
has determinand: CAS 16655-82-6
has uom: ug.L-1
has table: WISE-SoE WaterQuality.DisaggregatedData

WISE-SoE_WaterQuality.DisaggregatedData - CAS_16672-87-0 - ug/L
type: Concept
notation: WISE-SoE_WaterQuality.DisaggregatedData - CAS_16672-87-0 - ug/L
definition: The unit of measure for 'CAS_16672-87-0' (2-chloroethylphosphonic acid) in WISE SoE - Water Quality: Disaggregated data table is 'ug/L'
status: valid
status modified: 2019-10-03
accepted date: 2019-10-03
in scheme: Definition of correct units for the observed determinands in the given WISE SoE DD tables
has determinand: CAS 16672-87-0
has uom: ug.L-1
has table: WISE-SoE WaterQuality.DisaggregatedData

WISE-SoE_WaterQuality.DisaggregatedData - CAS_1668-54-8 - ug/L
type: Concept
notation: WISE-SoE_WaterQuality.DisaggregatedData - CAS_1668-54-8 - ug/L
definition: The unit of measure for 'CAS_1668-54-8' (2-methyl-4-amino-6-methoxy-s-triazine) in WISE SoE - Water Quality: Disaggregated data table is 'ug/L'
status: valid
status modified: 2019-10-03
accepted date: 2019-10-03
in scheme: Definition of correct units for the observed determinands in the given WISE SoE DD tables
has determinand: CAS 1668-54-8
has uom: ug.L-1
has table: WISE-SoE WaterQuality.DisaggregatedData

WISE-SoE_WaterQuality.DisaggregatedData - CAS_16752-77-5 - ug/L
type: Concept
notation: WISE-SoE_WaterQuality.DisaggregatedData - CAS_16752-77-5 - ug/L
definition: The unit of measure for 'CAS_16752-77-5' (Methomyl) in WISE SoE - Water Quality: Disaggregated data table is 'ug/L'
status: valid
status modified: 2019-10-03
accepted date: 2019-10-03
in scheme: Definition of correct units for the observed determinands in the given WISE SoE DD tables
has determinand: CAS 16752-77-5
has uom: ug.L-1
has table: WISE-SoE WaterQuality.DisaggregatedData

WISE-SoE_WaterQuality.DisaggregatedData - CAS_16887-00-6 - mg/L
type: Concept
notation: WISE-SoE_WaterQuality.DisaggregatedData - CAS_16887-00-6 - mg/L
definition: The unit of measure for 'CAS_16887-00-6' (Chloride) in WISE SoE - Water Quality: Disaggregated data table is 'mg/L'
status: valid
status modified: 2019-10-03
accepted date: 2019-10-03
in scheme: Definition of correct units for the observed determinands in the given WISE SoE DD tables
has determinand: CAS 16887-00-6
has uom: mg.L-1
has table: WISE-SoE WaterQuality.DisaggregatedData

WISE-SoE_WaterQuality.DisaggregatedData - CAS_1689-83-4 - ug/L
type: Concept
notation: WISE-SoE_WaterQuality.DisaggregatedData - CAS_1689-83-4 - ug/L
definition: The unit of measure for 'CAS_1689-83-4' (Ioxynil) in WISE SoE - Water Quality: Disaggregated data table is 'ug/L'
status: valid
status modified: 2019-10-03
accepted date: 2019-10-03
in scheme: Definition of correct units for the observed determinands in the given WISE SoE DD tables
has determinand: CAS 1689-83-4
has uom: ug.L-1
has table: WISE-SoE WaterQuality.DisaggregatedData

WISE-SoE_WaterQuality.DisaggregatedData - CAS_1689-84-5 - ug/L
type: Concept
notation: WISE-SoE_WaterQuality.DisaggregatedData - CAS_1689-84-5 - ug/L
definition: The unit of measure for 'CAS_1689-84-5' (Bromoxynil) in WISE SoE - Water Quality: Disaggregated data table is 'ug/L'
status: valid
status modified: 2019-10-03
accepted date: 2019-10-03
in scheme: Definition of correct units for the observed determinands in the given WISE SoE DD tables
has determinand: CAS 1689-84-5
has uom: ug.L-1
has table: WISE-SoE WaterQuality.DisaggregatedData

WISE-SoE_WaterQuality.DisaggregatedData - CAS_1689-99-2 - ug/L
type: Concept
notation: WISE-SoE_WaterQuality.DisaggregatedData - CAS_1689-99-2 - ug/L
definition: The unit of measure for 'CAS_1689-99-2' (Bromoxynil octanoate) in WISE SoE - Water Quality: Disaggregated data table is 'ug/L'
status: valid
status modified: 2019-10-03
accepted date: 2019-10-03
in scheme: Definition of correct units for the observed determinands in the given WISE SoE DD tables
has determinand: CAS 1689-99-2
has uom: ug.L-1
has table: WISE-SoE WaterQuality.DisaggregatedData

WISE-SoE_WaterQuality.DisaggregatedData - CAS_1698-60-8 - ug/L
type: Concept
notation: WISE-SoE_WaterQuality.DisaggregatedData - CAS_1698-60-8 - ug/L
definition: The unit of measure for 'CAS_1698-60-8' (Chloridazon) in WISE SoE - Water Quality: Disaggregated data table is 'ug/L'
status: valid
status modified: 2019-10-03
accepted date: 2019-10-03
in scheme: Definition of correct units for the observed determinands in the given WISE SoE DD tables
has determinand: CAS 1698-60-8
has uom: ug.L-1
has table: WISE-SoE WaterQuality.DisaggregatedData

WISE-SoE_WaterQuality.DisaggregatedData - CAS_16984-48-8 - ug/L
type: Concept
notation: WISE-SoE_WaterQuality.DisaggregatedData - CAS_16984-48-8 - ug/L
definition: The unit of measure for 'CAS_16984-48-8' (Fluoride) in WISE SoE - Water Quality: Disaggregated data table is 'ug/L'
status: valid
status modified: 2019-10-03
accepted date: 2019-10-03
in scheme: Definition of correct units for the observed determinands in the given WISE SoE DD tables
has determinand: CAS 16984-48-8
has uom: ug.L-1
has table: WISE-SoE WaterQuality.DisaggregatedData

WISE-SoE_WaterQuality.DisaggregatedData - CAS_1702-17-6 - ug/L
type: Concept
notation: WISE-SoE_WaterQuality.DisaggregatedData - CAS_1702-17-6 - ug/L
definition: The unit of measure for 'CAS_1702-17-6' (Clopyralid) in WISE SoE - Water Quality: Disaggregated data table is 'ug/L'
status: valid
status modified: 2019-10-03
accepted date: 2019-10-03
in scheme: Definition of correct units for the observed determinands in the given WISE SoE DD tables
has determinand: CAS 1702-17-6
has uom: ug.L-1
has table: WISE-SoE WaterQuality.DisaggregatedData

WISE-SoE_WaterQuality.DisaggregatedData - CAS_17040-19-6 - ug/L
type: Concept
notation: WISE-SoE_WaterQuality.DisaggregatedData - CAS_17040-19-6 - ug/L
definition: The unit of measure for 'CAS_17040-19-6' (Demeton-S-methylsulfon) in WISE SoE - Water Quality: Disaggregated data table is 'ug/L'
status: valid
status modified: 2019-10-03
accepted date: 2019-10-03
in scheme: Definition of correct units for the observed determinands in the given WISE SoE DD tables
has determinand: CAS 17040-19-6
has uom: ug.L-1
has table: WISE-SoE WaterQuality.DisaggregatedData

WISE-SoE_WaterQuality.DisaggregatedData - CAS_171118-09-5 - ug/L
type: Concept
notation: WISE-SoE_WaterQuality.DisaggregatedData - CAS_171118-09-5 - ug/L
definition: The unit of measure for 'CAS_171118-09-5' (Metolachlor ESA) in WISE SoE - Water Quality: Disaggregated data table is 'ug/L'
status: valid
status modified: 2019-10-03
accepted date: 2019-10-03
in scheme: Definition of correct units for the observed determinands in the given WISE SoE DD tables
has determinand: CAS 171118-09-5
has uom: ug.L-1
has table: WISE-SoE WaterQuality.DisaggregatedData

WISE-SoE_WaterQuality.DisaggregatedData - CAS_171262-17-2 - ug/L
type: Concept
notation: WISE-SoE_WaterQuality.DisaggregatedData - CAS_171262-17-2 - ug/L
definition: The unit of measure for 'CAS_171262-17-2' (Alachlor OA) in WISE SoE - Water Quality: Disaggregated data table is 'ug/L'
status: valid
status modified: 2019-10-03
accepted date: 2019-10-03
in scheme: Definition of correct units for the observed determinands in the given WISE SoE DD tables
has determinand: CAS 171262-17-2
has uom: ug.L-1
has table: WISE-SoE WaterQuality.DisaggregatedData

WISE-SoE_WaterQuality.DisaggregatedData - CAS_17254-80-7 - ug/L
type: Concept
notation: WISE-SoE_WaterQuality.DisaggregatedData - CAS_17254-80-7 - ug/L
definition: The unit of measure for 'CAS_17254-80-7' (Chloridazon methyl desphenyl) in WISE SoE - Water Quality: Disaggregated data table is 'ug/L'
status: valid
status modified: 2019-10-03
accepted date: 2019-10-03
in scheme: Definition of correct units for the observed determinands in the given WISE SoE DD tables
has determinand: CAS 17254-80-7
has uom: ug.L-1
has table: WISE-SoE WaterQuality.DisaggregatedData

WISE-SoE_WaterQuality.DisaggregatedData - CAS_172960-62-2 - ug/L
type: Concept
notation: WISE-SoE_WaterQuality.DisaggregatedData - CAS_172960-62-2 - ug/L
definition: The unit of measure for 'CAS_172960-62-2' (Metazachlor ESA) in WISE SoE - Water Quality: Disaggregated data table is 'ug/L'
status: valid
status modified: 2019-10-03
accepted date: 2019-10-03
in scheme: Definition of correct units for the observed determinands in the given WISE SoE DD tables
has determinand: CAS 172960-62-2
has uom: ug.L-1
has table: WISE-SoE WaterQuality.DisaggregatedData

WISE-SoE_WaterQuality.DisaggregatedData - CAS_1746-01-6 - ug/L
type: Concept
notation: WISE-SoE_WaterQuality.DisaggregatedData - CAS_1746-01-6 - ug/L
definition: The unit of measure for 'CAS_1746-01-6' (TCDD (2,3,7,8-tetrachlorodibenzo-p-dioxin)) in WISE SoE - Water Quality: Disaggregated data table is 'ug/L'
status: valid
status modified: 2019-10-03
accepted date: 2019-10-03
in scheme: Definition of correct units for the observed determinands in the given WISE SoE DD tables
has determinand: CAS 1746-01-6
has uom: ug.L-1
has table: WISE-SoE WaterQuality.DisaggregatedData

WISE-SoE_WaterQuality.DisaggregatedData - CAS_1746-81-2 - ug/L
type: Concept
notation: WISE-SoE_WaterQuality.DisaggregatedData - CAS_1746-81-2 - ug/L
definition: The unit of measure for 'CAS_1746-81-2' (Monolinuron) in WISE SoE - Water Quality: Disaggregated data table is 'ug/L'
status: valid
status modified: 2019-10-03
accepted date: 2019-10-03
in scheme: Definition of correct units for the observed determinands in the given WISE SoE DD tables
has determinand: CAS 1746-81-2
has uom: ug.L-1
has table: WISE-SoE WaterQuality.DisaggregatedData

WISE-SoE_WaterQuality.DisaggregatedData - CAS_175013-18-0 - ug/L
type: Concept
notation: WISE-SoE_WaterQuality.DisaggregatedData - CAS_175013-18-0 - ug/L
definition: The unit of measure for 'CAS_175013-18-0' (Carbamic acid) in WISE SoE - Water Quality: Disaggregated data table is 'ug/L'
status: valid
status modified: 2019-10-03
accepted date: 2019-10-03
in scheme: Definition of correct units for the observed determinands in the given WISE SoE DD tables
has determinand: CAS 175013-18-0
has uom: ug.L-1
has table: WISE-SoE WaterQuality.DisaggregatedData

WISE-SoE_WaterQuality.DisaggregatedData - CAS_1763-23-1 - ug/L
type: Concept
notation: WISE-SoE_WaterQuality.DisaggregatedData - CAS_1763-23-1 - ug/L
definition: The unit of measure for 'CAS_1763-23-1' (Perfluorooctane sulfonic acid (PFOS) and its derivatives) in WISE SoE - Water Quality: Disaggregated data table is 'ug/L'
status: valid
status modified: 2019-10-03
accepted date: 2019-10-03
in scheme: Definition of correct units for the observed determinands in the given WISE SoE DD tables
has determinand: CAS 1763-23-1
has uom: ug.L-1
has table: WISE-SoE WaterQuality.DisaggregatedData

WISE-SoE_WaterQuality.DisaggregatedData - CAS_1806-26-4 - ug/L
type: Concept
notation: WISE-SoE_WaterQuality.DisaggregatedData - CAS_1806-26-4 - ug/L
definition: The unit of measure for 'CAS_1806-26-4' (Octylphenol) in WISE SoE - Water Quality: Disaggregated data table is 'ug/L'
status: valid
status modified: 2019-10-03
accepted date: 2019-10-03
in scheme: Definition of correct units for the observed determinands in the given WISE SoE DD tables
has determinand: CAS 1806-26-4
has uom: ug.L-1
has table: WISE-SoE WaterQuality.DisaggregatedData

WISE-SoE_WaterQuality.DisaggregatedData - CAS_18181-70-9 - ug/L
type: Concept
notation: WISE-SoE_WaterQuality.DisaggregatedData - CAS_18181-70-9 - ug/L
definition: The unit of measure for 'CAS_18181-70-9' (Iodofenphos) in WISE SoE - Water Quality: Disaggregated data table is 'ug/L'
status: valid
status modified: 2019-10-03
accepted date: 2019-10-03
in scheme: Definition of correct units for the observed determinands in the given WISE SoE DD tables
has determinand: CAS 18181-70-9
has uom: ug.L-1
has table: WISE-SoE WaterQuality.DisaggregatedData

WISE-SoE_WaterQuality.DisaggregatedData - CAS_18181-80-1 - ug/L
type: Concept
notation: WISE-SoE_WaterQuality.DisaggregatedData - CAS_18181-80-1 - ug/L
definition: The unit of measure for 'CAS_18181-80-1' (Bromopropylate) in WISE SoE - Water Quality: Disaggregated data table is 'ug/L'
status: valid
status modified: 2019-10-03
accepted date: 2019-10-03
in scheme: Definition of correct units for the observed determinands in the given WISE SoE DD tables
has determinand: CAS 18181-80-1
has uom: ug.L-1
has table: WISE-SoE WaterQuality.DisaggregatedData

WISE-SoE_WaterQuality.DisaggregatedData - CAS_182346-21-0 - ug/L
type: Concept
notation: WISE-SoE_WaterQuality.DisaggregatedData - CAS_182346-21-0 - ug/L
definition: The unit of measure for 'CAS_182346-21-0' (BDE 85 (2,2’,3,4,4’-pentabromodiphenyl ether)) in WISE SoE - Water Quality: Disaggregated data table is 'ug/L'
status: valid
status modified: 2019-10-03
accepted date: 2019-10-03
in scheme: Definition of correct units for the observed determinands in the given WISE SoE DD tables
has determinand: CAS 182346-21-0
has uom: ug.L-1
has table: WISE-SoE WaterQuality.DisaggregatedData

WISE-SoE_WaterQuality.DisaggregatedData - CAS_1825-21-4 - ug/L
type: Concept
notation: WISE-SoE_WaterQuality.DisaggregatedData - CAS_1825-21-4 - ug/L
definition: The unit of measure for 'CAS_1825-21-4' (Pentachloroanisole) in WISE SoE - Water Quality: Disaggregated data table is 'ug/L'
status: valid
status modified: 2019-10-03
accepted date: 2019-10-03
in scheme: Definition of correct units for the observed determinands in the given WISE SoE DD tables
has determinand: CAS 1825-21-4
has uom: ug.L-1
has table: WISE-SoE WaterQuality.DisaggregatedData

WISE-SoE_WaterQuality.DisaggregatedData - CAS_182636-13-1 - ug/L
type: Concept
notation: WISE-SoE_WaterQuality.DisaggregatedData - CAS_182636-13-1 - ug/L
definition: The unit of measure for 'CAS_182636-13-1' (Imazamox) in WISE SoE - Water Quality: Disaggregated data table is 'ug/L'
status: valid
status modified: 2019-10-03
accepted date: 2019-10-03
in scheme: Definition of correct units for the observed determinands in the given WISE SoE DD tables
has determinand: CAS 182636-13-1
has uom: ug.L-1
has table: WISE-SoE WaterQuality.DisaggregatedData

WISE-SoE_WaterQuality.DisaggregatedData - CAS_182677-30-1 - ug/L
type: Concept
notation: WISE-SoE_WaterQuality.DisaggregatedData - CAS_182677-30-1 - ug/L
definition: The unit of measure for 'CAS_182677-30-1' (BDE 138 (2,2’,3,4,4’,5’-hexabromodiphenyl ether)) in WISE SoE - Water Quality: Disaggregated data table is 'ug/L'
status: valid
status modified: 2019-10-03
accepted date: 2019-10-03
in scheme: Definition of correct units for the observed determinands in the given WISE SoE DD tables
has determinand: CAS 182677-30-1
has uom: ug.L-1
has table: WISE-SoE WaterQuality.DisaggregatedData

WISE-SoE_WaterQuality.DisaggregatedData - CAS_1836-75-5 - ug/L
type: Concept
notation: WISE-SoE_WaterQuality.DisaggregatedData - CAS_1836-75-5 - ug/L
definition: The unit of measure for 'CAS_1836-75-5' (Nitrophen) in WISE SoE - Water Quality: Disaggregated data table is 'ug/L'
status: valid
status modified: 2019-10-03
accepted date: 2019-10-03
in scheme: Definition of correct units for the observed determinands in the given WISE SoE DD tables
has determinand: CAS 1836-75-5
has uom: ug.L-1
has table: WISE-SoE WaterQuality.DisaggregatedData

WISE-SoE_WaterQuality.DisaggregatedData - CAS_185119-76-0 - ug/L
type: Concept
notation: WISE-SoE_WaterQuality.DisaggregatedData - CAS_185119-76-0 - ug/L
definition: The unit of measure for 'CAS_185119-76-0' (Iodosulfuron-methyl) in WISE SoE - Water Quality: Disaggregated data table is 'ug/L'
status: valid
status modified: 2019-10-03
accepted date: 2019-10-03
in scheme: Definition of correct units for the observed determinands in the given WISE SoE DD tables
has determinand: CAS 185119-76-0
has uom: ug.L-1
has table: WISE-SoE WaterQuality.DisaggregatedData

WISE-SoE_WaterQuality.DisaggregatedData - CAS_18540-29-9 - ug/L
type: Concept
notation: WISE-SoE_WaterQuality.DisaggregatedData - CAS_18540-29-9 - ug/L
definition: The unit of measure for 'CAS_18540-29-9' (Chromium (VI)) in WISE SoE - Water Quality: Disaggregated data table is 'ug/L'
status: valid
status modified: 2019-10-03
accepted date: 2019-10-03
in scheme: Definition of correct units for the observed determinands in the given WISE SoE DD tables
has determinand: CAS 18540-29-9
has uom: ug.L-1
has table: WISE-SoE WaterQuality.DisaggregatedData

WISE-SoE_WaterQuality.DisaggregatedData - CAS_1861-40-1 - ug/L
type: Concept
notation: WISE-SoE_WaterQuality.DisaggregatedData - CAS_1861-40-1 - ug/L
definition: The unit of measure for 'CAS_1861-40-1' (Benfluralin) in WISE SoE - Water Quality: Disaggregated data table is 'ug/L'
status: valid
status modified: 2019-10-03
accepted date: 2019-10-03
in scheme: Definition of correct units for the observed determinands in the given WISE SoE DD tables
has determinand: CAS 1861-40-1
has uom: ug.L-1
has table: WISE-SoE WaterQuality.DisaggregatedData

WISE-SoE_WaterQuality.DisaggregatedData - CAS_18691-97-9 - ug/L
type: Concept
notation: WISE-SoE_WaterQuality.DisaggregatedData - CAS_18691-97-9 - ug/L
definition: The unit of measure for 'CAS_18691-97-9' (Methabenzthiazuron) in WISE SoE - Water Quality: Disaggregated data table is 'ug/L'
status: valid
status modified: 2019-10-03
accepted date: 2019-10-03
in scheme: Definition of correct units for the observed determinands in the given WISE SoE DD tables
has determinand: CAS 18691-97-9
has uom: ug.L-1
has table: WISE-SoE WaterQuality.DisaggregatedData

WISE-SoE_WaterQuality.DisaggregatedData - CAS_187022-11-3 - ug/L
type: Concept
notation: WISE-SoE_WaterQuality.DisaggregatedData - CAS_187022-11-3 - ug/L
definition: The unit of measure for 'CAS_187022-11-3' (Acetochlor ESA) in WISE SoE - Water Quality: Disaggregated data table is 'ug/L'
status: valid
status modified: 2019-10-03
accepted date: 2019-10-03
in scheme: Definition of correct units for the observed determinands in the given WISE SoE DD tables
has determinand: CAS 187022-11-3
has uom: ug.L-1
has table: WISE-SoE WaterQuality.DisaggregatedData

WISE-SoE_WaterQuality.DisaggregatedData - CAS_18785-72-3 - mg/L
type: Concept
notation: WISE-SoE_WaterQuality.DisaggregatedData - CAS_18785-72-3 - mg/L
definition: The unit of measure for 'CAS_18785-72-3' (Sulphate) in WISE SoE - Water Quality: Disaggregated data table is 'mg/L'
status: valid
status modified: 2019-10-03
accepted date: 2019-10-03
in scheme: Definition of correct units for the observed determinands in the given WISE SoE DD tables
has determinand: CAS 18785-72-3
has uom: mg.L-1
has table: WISE-SoE WaterQuality.DisaggregatedData

WISE-SoE_WaterQuality.DisaggregatedData - CAS_188425-85-6 - ug/L
type: Concept
notation: WISE-SoE_WaterQuality.DisaggregatedData - CAS_188425-85-6 - ug/L
definition: The unit of measure for 'CAS_188425-85-6' (Boscalid) in WISE SoE - Water Quality: Disaggregated data table is 'ug/L'
status: valid
status modified: 2019-10-03
accepted date: 2019-10-03
in scheme: Definition of correct units for the observed determinands in the given WISE SoE DD tables
has determinand: CAS 188425-85-6
has uom: ug.L-1
has table: WISE-SoE WaterQuality.DisaggregatedData

WISE-SoE_WaterQuality.DisaggregatedData - CAS_189-55-9 - ug/L
type: Concept
notation: WISE-SoE_WaterQuality.DisaggregatedData - CAS_189-55-9 - ug/L
definition: The unit of measure for 'CAS_189-55-9' (Dibenzo(a,i)pyrene) in WISE SoE - Water Quality: Disaggregated data table is 'ug/L'
status: valid
status modified: 2019-10-03
accepted date: 2019-10-03
in scheme: Definition of correct units for the observed determinands in the given WISE SoE DD tables
has determinand: CAS 189-55-9
has uom: ug.L-1
has table: WISE-SoE WaterQuality.DisaggregatedData

WISE-SoE_WaterQuality.DisaggregatedData - CAS_189084-64-8 - ug/L
type: Concept
notation: WISE-SoE_WaterQuality.DisaggregatedData - CAS_189084-64-8 - ug/L
definition: The unit of measure for 'CAS_189084-64-8' (BDE 100 (2,2’,4,4’,6-pentabromodiphenyl ether)) in WISE SoE - Water Quality: Disaggregated data table is 'ug/L'
status: valid
status modified: 2019-10-03
accepted date: 2019-10-03
in scheme: Definition of correct units for the observed determinands in the given WISE SoE DD tables
has determinand: CAS 189084-64-8
has uom: ug.L-1
has table: WISE-SoE WaterQuality.DisaggregatedData

WISE-SoE_WaterQuality.DisaggregatedData - CAS_1897-45-6 - ug/L
type: Concept
notation: WISE-SoE_WaterQuality.DisaggregatedData - CAS_1897-45-6 - ug/L
definition: The unit of measure for 'CAS_1897-45-6' (Chlorothalonil) in WISE SoE - Water Quality: Disaggregated data table is 'ug/L'
status: valid
status modified: 2019-10-03
accepted date: 2019-10-03
in scheme: Definition of correct units for the observed determinands in the given WISE SoE DD tables
has determinand: CAS 1897-45-6
has uom: ug.L-1
has table: WISE-SoE WaterQuality.DisaggregatedData

WISE-SoE_WaterQuality.DisaggregatedData - CAS_191-24-2 - ug/L
type: Concept
notation: WISE-SoE_WaterQuality.DisaggregatedData - CAS_191-24-2 - ug/L
definition: The unit of measure for 'CAS_191-24-2' (Benzo(g,h,i)perylene) in WISE SoE - Water Quality: Disaggregated data table is 'ug/L'
status: valid
status modified: 2019-10-03
accepted date: 2019-10-03
in scheme: Definition of correct units for the observed determinands in the given WISE SoE DD tables
has determinand: CAS 191-24-2
has uom: ug.L-1
has table: WISE-SoE WaterQuality.DisaggregatedData

WISE-SoE_WaterQuality.DisaggregatedData - CAS_191-30-0 - ug/L
type: Concept
notation: WISE-SoE_WaterQuality.DisaggregatedData - CAS_191-30-0 - ug/L
definition: The unit of measure for 'CAS_191-30-0' (Dibenzo(a,l)pyrene) in WISE SoE - Water Quality: Disaggregated data table is 'ug/L'
status: valid
status modified: 2019-10-03
accepted date: 2019-10-03
in scheme: Definition of correct units for the observed determinands in the given WISE SoE DD tables
has determinand: CAS 191-30-0
has uom: ug.L-1
has table: WISE-SoE WaterQuality.DisaggregatedData

WISE-SoE_WaterQuality.DisaggregatedData - CAS_1912-24-9 - ug/L
type: Concept
notation: WISE-SoE_WaterQuality.DisaggregatedData - CAS_1912-24-9 - ug/L
definition: The unit of measure for 'CAS_1912-24-9' (Atrazine) in WISE SoE - Water Quality: Disaggregated data table is 'ug/L'
status: valid
status modified: 2019-10-03
accepted date: 2019-10-03
in scheme: Definition of correct units for the observed determinands in the given WISE SoE DD tables
has determinand: CAS 1912-24-9
has uom: ug.L-1
has table: WISE-SoE WaterQuality.DisaggregatedData

WISE-SoE_WaterQuality.DisaggregatedData - CAS_1912-26-1 - ug/L
type: Concept
notation: WISE-SoE_WaterQuality.DisaggregatedData - CAS_1912-26-1 - ug/L
definition: The unit of measure for 'CAS_1912-26-1' (Trietazine) in WISE SoE - Water Quality: Disaggregated data table is 'ug/L'
status: valid
status modified: 2019-10-03
accepted date: 2019-10-03
in scheme: Definition of correct units for the observed determinands in the given WISE SoE DD tables
has determinand: CAS 1912-26-1
has uom: ug.L-1
has table: WISE-SoE WaterQuality.DisaggregatedData

WISE-SoE_WaterQuality.DisaggregatedData - CAS_1918-00-9 - ug/L
type: Concept
notation: WISE-SoE_WaterQuality.DisaggregatedData - CAS_1918-00-9 - ug/L
definition: The unit of measure for 'CAS_1918-00-9' (Dicamba) in WISE SoE - Water Quality: Disaggregated data table is 'ug/L'
status: valid
status modified: 2019-10-03
accepted date: 2019-10-03
in scheme: Definition of correct units for the observed determinands in the given WISE SoE DD tables
has determinand: CAS 1918-00-9
has uom: ug.L-1
has table: WISE-SoE WaterQuality.DisaggregatedData

WISE-SoE_WaterQuality.DisaggregatedData - CAS_1918-02-1 - ug/L
type: Concept
notation: WISE-SoE_WaterQuality.DisaggregatedData - CAS_1918-02-1 - ug/L
definition: The unit of measure for 'CAS_1918-02-1' (Picloram) in WISE SoE - Water Quality: Disaggregated data table is 'ug/L'
status: valid
status modified: 2019-10-03
accepted date: 2019-10-03
in scheme: Definition of correct units for the observed determinands in the given WISE SoE DD tables
has determinand: CAS 1918-02-1
has uom: ug.L-1
has table: WISE-SoE WaterQuality.DisaggregatedData

WISE-SoE_WaterQuality.DisaggregatedData - CAS_1918-13-4 - ug/L
type: Concept
notation: WISE-SoE_WaterQuality.DisaggregatedData - CAS_1918-13-4 - ug/L
definition: The unit of measure for 'CAS_1918-13-4' (Chlorthiamid) in WISE SoE - Water Quality: Disaggregated data table is 'ug/L'
status: valid
status modified: 2019-10-03
accepted date: 2019-10-03
in scheme: Definition of correct units for the observed determinands in the given WISE SoE DD tables
has determinand: CAS 1918-13-4
has uom: ug.L-1
has table: WISE-SoE WaterQuality.DisaggregatedData

WISE-SoE_WaterQuality.DisaggregatedData - CAS_1918-16-7 - ug/L
type: Concept
notation: WISE-SoE_WaterQuality.DisaggregatedData - CAS_1918-16-7 - ug/L
definition: The unit of measure for 'CAS_1918-16-7' (Propachlor) in WISE SoE - Water Quality: Disaggregated data table is 'ug/L'
status: valid
status modified: 2019-10-03
accepted date: 2019-10-03
in scheme: Definition of correct units for the observed determinands in the given WISE SoE DD tables
has determinand: CAS 1918-16-7
has uom: ug.L-1
has table: WISE-SoE WaterQuality.DisaggregatedData

WISE-SoE_WaterQuality.DisaggregatedData - CAS_192-65-4 - ug/L
type: Concept
notation: WISE-SoE_WaterQuality.DisaggregatedData - CAS_192-65-4 - ug/L
definition: The unit of measure for 'CAS_192-65-4' (Dibenzo(a,e)pyrene) in WISE SoE - Water Quality: Disaggregated data table is 'ug/L'
status: valid
status modified: 2019-10-03
accepted date: 2019-10-03
in scheme: Definition of correct units for the observed determinands in the given WISE SoE DD tables
has determinand: CAS 192-65-4
has uom: ug.L-1
has table: WISE-SoE WaterQuality.DisaggregatedData

WISE-SoE_WaterQuality.DisaggregatedData - CAS_192-97-2 - ug/L
type: Concept
notation: WISE-SoE_WaterQuality.DisaggregatedData - CAS_192-97-2 - ug/L
definition: The unit of measure for 'CAS_192-97-2' (Benzo[e]pyrene) in WISE SoE - Water Quality: Disaggregated data table is 'ug/L'
status: valid
status modified: 2019-10-03
accepted date: 2019-10-03
in scheme: Definition of correct units for the observed determinands in the given WISE SoE DD tables
has determinand: CAS 192-97-2
has uom: ug.L-1
has table: WISE-SoE WaterQuality.DisaggregatedData

WISE-SoE_WaterQuality.DisaggregatedData - CAS_193-39-5 - ug/L
type: Concept
notation: WISE-SoE_WaterQuality.DisaggregatedData - CAS_193-39-5 - ug/L
definition: The unit of measure for 'CAS_193-39-5' (Indeno(1,2,3-cd)pyrene) in WISE SoE - Water Quality: Disaggregated data table is 'ug/L'
status: valid
status modified: 2019-10-03
accepted date: 2019-10-03
in scheme: Definition of correct units for the observed determinands in the given WISE SoE DD tables
has determinand: CAS 193-39-5
has uom: ug.L-1
has table: WISE-SoE WaterQuality.DisaggregatedData

WISE-SoE_WaterQuality.DisaggregatedData - CAS_19408-74-3 - ug/L
type: Concept
notation: WISE-SoE_WaterQuality.DisaggregatedData - CAS_19408-74-3 - ug/L
definition: The unit of measure for 'CAS_19408-74-3' (1,2,3,7,8,9-H6CDD) in WISE SoE - Water Quality: Disaggregated data table is 'ug/L'
status: valid
status modified: 2019-10-03
accepted date: 2019-10-03
in scheme: Definition of correct units for the observed determinands in the given WISE SoE DD tables
has determinand: CAS 19408-74-3
has uom: ug.L-1
has table: WISE-SoE WaterQuality.DisaggregatedData

WISE-SoE_WaterQuality.DisaggregatedData - CAS_194992-44-4 - ug/L
type: Concept
notation: WISE-SoE_WaterQuality.DisaggregatedData - CAS_194992-44-4 - ug/L
definition: The unit of measure for 'CAS_194992-44-4' (Acetochlor OA) in WISE SoE - Water Quality: Disaggregated data table is 'ug/L'
status: valid
status modified: 2019-10-03
accepted date: 2019-10-03
in scheme: Definition of correct units for the observed determinands in the given WISE SoE DD tables
has determinand: CAS 194992-44-4
has uom: ug.L-1
has table: WISE-SoE WaterQuality.DisaggregatedData

WISE-SoE_WaterQuality.DisaggregatedData - CAS_19666-30-9 - ug/L
type: Concept
notation: WISE-SoE_WaterQuality.DisaggregatedData - CAS_19666-30-9 - ug/L
definition: The unit of measure for 'CAS_19666-30-9' (Oxadiazon) in WISE SoE - Water Quality: Disaggregated data table is 'ug/L'
status: valid
status modified: 2019-10-03
accepted date: 2019-10-03
in scheme: Definition of correct units for the observed determinands in the given WISE SoE DD tables
has determinand: CAS 19666-30-9
has uom: ug.L-1
has table: WISE-SoE WaterQuality.DisaggregatedData

WISE-SoE_WaterQuality.DisaggregatedData - CAS_198-55-0 - ug/L
type: Concept
notation: WISE-SoE_WaterQuality.DisaggregatedData - CAS_198-55-0 - ug/L
definition: The unit of measure for 'CAS_198-55-0' (Perylene) in WISE SoE - Water Quality: Disaggregated data table is 'ug/L'
status: valid
status modified: 2019-10-03
accepted date: 2019-10-03
in scheme: Definition of correct units for the observed determinands in the given WISE SoE DD tables
has determinand: CAS 198-55-0
has uom: ug.L-1
has table: WISE-SoE WaterQuality.DisaggregatedData

WISE-SoE_WaterQuality.DisaggregatedData - CAS_1982-47-4 - ug/L
type: Concept
notation: WISE-SoE_WaterQuality.DisaggregatedData - CAS_1982-47-4 - ug/L
definition: The unit of measure for 'CAS_1982-47-4' (Chloroxuron) in WISE SoE - Water Quality: Disaggregated data table is 'ug/L'
status: valid
status modified: 2019-10-03
accepted date: 2019-10-03
in scheme: Definition of correct units for the observed determinands in the given WISE SoE DD tables
has determinand: CAS 1982-47-4
has uom: ug.L-1
has table: WISE-SoE WaterQuality.DisaggregatedData

WISE-SoE_WaterQuality.DisaggregatedData - CAS_19937-59-8 - ug/L
type: Concept
notation: WISE-SoE_WaterQuality.DisaggregatedData - CAS_19937-59-8 - ug/L
definition: The unit of measure for 'CAS_19937-59-8' (Metoxuron) in WISE SoE - Water Quality: Disaggregated data table is 'ug/L'
status: valid
status modified: 2019-10-03
accepted date: 2019-10-03
in scheme: Definition of correct units for the observed determinands in the given WISE SoE DD tables
has determinand: CAS 19937-59-8
has uom: ug.L-1
has table: WISE-SoE WaterQuality.DisaggregatedData

WISE-SoE_WaterQuality.DisaggregatedData - CAS_2008-58-4 - ug/L
type: Concept
notation: WISE-SoE_WaterQuality.DisaggregatedData - CAS_2008-58-4 - ug/L
definition: The unit of measure for 'CAS_2008-58-4' (2,6-dichlorobenzamide) in WISE SoE - Water Quality: Disaggregated data table is 'ug/L'
status: valid
status modified: 2019-10-03
accepted date: 2019-10-03
in scheme: Definition of correct units for the observed determinands in the given WISE SoE DD tables
has determinand: CAS 2008-58-4
has uom: ug.L-1
has table: WISE-SoE WaterQuality.DisaggregatedData

WISE-SoE_WaterQuality.DisaggregatedData - CAS_201668-32-8 - ug/L
type: Concept
notation: WISE-SoE_WaterQuality.DisaggregatedData - CAS_201668-32-8 - ug/L
definition: The unit of measure for 'CAS_201668-32-8' (Flufenacet ESA) in WISE SoE - Water Quality: Disaggregated data table is 'ug/L'
status: valid
status modified: 2019-10-03
accepted date: 2019-10-03
in scheme: Definition of correct units for the observed determinands in the given WISE SoE DD tables
has determinand: CAS 201668-32-8
has uom: ug.L-1
has table: WISE-SoE WaterQuality.DisaggregatedData

WISE-SoE_WaterQuality.DisaggregatedData - CAS_2032-65-7 - ug/L
type: Concept
notation: WISE-SoE_WaterQuality.DisaggregatedData - CAS_2032-65-7 - ug/L
definition: The unit of measure for 'CAS_2032-65-7' (Methiocarb) in WISE SoE - Water Quality: Disaggregated data table is 'ug/L'
status: valid
status modified: 2019-10-03
accepted date: 2019-10-03
in scheme: Definition of correct units for the observed determinands in the given WISE SoE DD tables
has determinand: CAS 2032-65-7
has uom: ug.L-1
has table: WISE-SoE WaterQuality.DisaggregatedData

WISE-SoE_WaterQuality.DisaggregatedData - CAS_20461-54-5 - ug/L
type: Concept
notation: WISE-SoE_WaterQuality.DisaggregatedData - CAS_20461-54-5 - ug/L
definition: The unit of measure for 'CAS_20461-54-5' (Iodide) in WISE SoE - Water Quality: Disaggregated data table is 'ug/L'
status: valid
status modified: 2019-10-03
accepted date: 2019-10-03
in scheme: Definition of correct units for the observed determinands in the given WISE SoE DD tables
has determinand: CAS 20461-54-5
has uom: ug.L-1
has table: WISE-SoE WaterQuality.DisaggregatedData

WISE-SoE_WaterQuality.DisaggregatedData - CAS_205-82-3 - ug/L
type: Concept
notation: WISE-SoE_WaterQuality.DisaggregatedData - CAS_205-82-3 - ug/L
definition: The unit of measure for 'CAS_205-82-3' (Benzo(j)fluoranthene) in WISE SoE - Water Quality: Disaggregated data table is 'ug/L'
status: valid
status modified: 2019-10-03
accepted date: 2019-10-03
in scheme: Definition of correct units for the observed determinands in the given WISE SoE DD tables
has determinand: CAS 205-82-3
has uom: ug.L-1
has table: WISE-SoE WaterQuality.DisaggregatedData

WISE-SoE_WaterQuality.DisaggregatedData - CAS_205-99-2 - ug/L
type: Concept
notation: WISE-SoE_WaterQuality.DisaggregatedData - CAS_205-99-2 - ug/L
definition: The unit of measure for 'CAS_205-99-2' (Benzo(b)fluoranthene) in WISE SoE - Water Quality: Disaggregated data table is 'ug/L'
status: valid
status modified: 2019-10-03
accepted date: 2019-10-03
in scheme: Definition of correct units for the observed determinands in the given WISE SoE DD tables
has determinand: CAS 205-99-2
has uom: ug.L-1
has table: WISE-SoE WaterQuality.DisaggregatedData

WISE-SoE_WaterQuality.DisaggregatedData - CAS_2051-24-3 - ug/L
type: Concept
notation: WISE-SoE_WaterQuality.DisaggregatedData - CAS_2051-24-3 - ug/L
definition: The unit of measure for 'CAS_2051-24-3' (PCB 209 (5,5’,6,6’-decachlorobiphenyl)) in WISE SoE - Water Quality: Disaggregated data table is 'ug/L'
status: valid
status modified: 2019-10-03
accepted date: 2019-10-03
in scheme: Definition of correct units for the observed determinands in the given WISE SoE DD tables
has determinand: CAS 2051-24-3
has uom: ug.L-1
has table: WISE-SoE WaterQuality.DisaggregatedData

WISE-SoE_WaterQuality.DisaggregatedData - CAS_205939-58-8 - ug/L
type: Concept
notation: WISE-SoE_WaterQuality.DisaggregatedData - CAS_205939-58-8 - ug/L
definition: The unit of measure for 'CAS_205939-58-8' (Dimethenamid ESA) in WISE SoE - Water Quality: Disaggregated data table is 'ug/L'
status: valid
status modified: 2019-10-03
accepted date: 2019-10-03
in scheme: Definition of correct units for the observed determinands in the given WISE SoE DD tables
has determinand: CAS 205939-58-8
has uom: ug.L-1
has table: WISE-SoE WaterQuality.DisaggregatedData

WISE-SoE_WaterQuality.DisaggregatedData - CAS_206-44-0 - ug/L
type: Concept
notation: WISE-SoE_WaterQuality.DisaggregatedData - CAS_206-44-0 - ug/L
definition: The unit of measure for 'CAS_206-44-0' (Fluoranthene) in WISE SoE - Water Quality: Disaggregated data table is 'ug/L'
status: valid
status modified: 2019-10-03
accepted date: 2019-10-03
in scheme: Definition of correct units for the observed determinands in the given WISE SoE DD tables
has determinand: CAS 206-44-0
has uom: ug.L-1
has table: WISE-SoE WaterQuality.DisaggregatedData

WISE-SoE_WaterQuality.DisaggregatedData - CAS_207-08-9 - ug/L
type: Concept
notation: WISE-SoE_WaterQuality.DisaggregatedData - CAS_207-08-9 - ug/L
definition: The unit of measure for 'CAS_207-08-9' (Benzo(k)fluoranthene) in WISE SoE - Water Quality: Disaggregated data table is 'ug/L'
status: valid
status modified: 2019-10-03
accepted date: 2019-10-03
in scheme: Definition of correct units for the observed determinands in the given WISE SoE DD tables
has determinand: CAS 207-08-9
has uom: ug.L-1
has table: WISE-SoE WaterQuality.DisaggregatedData

WISE-SoE_WaterQuality.DisaggregatedData - CAS_207122-15-4 - ug/L
type: Concept
notation: WISE-SoE_WaterQuality.DisaggregatedData - CAS_207122-15-4 - ug/L
definition: The unit of measure for 'CAS_207122-15-4' (BDE 154 (2,2’,4,4’,5,6’-hexabromodiphenyl ether)) in WISE SoE - Water Quality: Disaggregated data table is 'ug/L'
status: valid
status modified: 2019-10-03
accepted date: 2019-10-03
in scheme: Definition of correct units for the observed determinands in the given WISE SoE DD tables
has determinand: CAS 207122-15-4
has uom: ug.L-1
has table: WISE-SoE WaterQuality.DisaggregatedData

WISE-SoE_WaterQuality.DisaggregatedData - CAS_208-96-8 - ug/L
type: Concept
notation: WISE-SoE_WaterQuality.DisaggregatedData - CAS_208-96-8 - ug/L
definition: The unit of measure for 'CAS_208-96-8' (Acenaphthylene) in WISE SoE - Water Quality: Disaggregated data table is 'ug/L'
status: valid
status modified: 2019-10-03
accepted date: 2019-10-03
in scheme: Definition of correct units for the observed determinands in the given WISE SoE DD tables
has determinand: CAS 208-96-8
has uom: ug.L-1
has table: WISE-SoE WaterQuality.DisaggregatedData

WISE-SoE_WaterQuality.DisaggregatedData - CAS_2104-64-5 - ug/L
type: Concept
notation: WISE-SoE_WaterQuality.DisaggregatedData - CAS_2104-64-5 - ug/L
definition: The unit of measure for 'CAS_2104-64-5' (Ethyl O-(p-nitrophenyl) phenyl phosphonothionate (EPN)) in WISE SoE - Water Quality: Disaggregated data table is 'ug/L'
status: valid
status modified: 2019-10-03
accepted date: 2019-10-03
in scheme: Definition of correct units for the observed determinands in the given WISE SoE DD tables
has determinand: CAS 2104-64-5
has uom: ug.L-1
has table: WISE-SoE WaterQuality.DisaggregatedData

WISE-SoE_WaterQuality.DisaggregatedData - CAS_2104-96-3 - ug/L
type: Concept
notation: WISE-SoE_WaterQuality.DisaggregatedData - CAS_2104-96-3 - ug/L
definition: The unit of measure for 'CAS_2104-96-3' (Bromophos) in WISE SoE - Water Quality: Disaggregated data table is 'ug/L'
status: valid
status modified: 2019-10-03
accepted date: 2019-10-03
in scheme: Definition of correct units for the observed determinands in the given WISE SoE DD tables
has determinand: CAS 2104-96-3
has uom: ug.L-1
has table: WISE-SoE WaterQuality.DisaggregatedData

WISE-SoE_WaterQuality.DisaggregatedData - CAS_21087-64-9 - ug/L
type: Concept
notation: WISE-SoE_WaterQuality.DisaggregatedData - CAS_21087-64-9 - ug/L
definition: The unit of measure for 'CAS_21087-64-9' (Metribuzin) in WISE SoE - Water Quality: Disaggregated data table is 'ug/L'
status: valid
status modified: 2019-10-03
accepted date: 2019-10-03
in scheme: Definition of correct units for the observed determinands in the given WISE SoE DD tables
has determinand: CAS 21087-64-9
has uom: ug.L-1
has table: WISE-SoE WaterQuality.DisaggregatedData

WISE-SoE_WaterQuality.DisaggregatedData - CAS_210880-92-5 - ug/L
type: Concept
notation: WISE-SoE_WaterQuality.DisaggregatedData - CAS_210880-92-5 - ug/L
definition: The unit of measure for 'CAS_210880-92-5' (Clothianidin) in WISE SoE - Water Quality: Disaggregated data table is 'ug/L'
status: valid
status modified: 2019-10-03
accepted date: 2019-10-03
in scheme: Definition of correct units for the observed determinands in the given WISE SoE DD tables
has determinand: CAS 210880-92-5
has uom: ug.L-1
has table: WISE-SoE WaterQuality.DisaggregatedData

WISE-SoE_WaterQuality.DisaggregatedData - CAS_2163-68-0 - ug/L
type: Concept
notation: WISE-SoE_WaterQuality.DisaggregatedData - CAS_2163-68-0 - ug/L
definition: The unit of measure for 'CAS_2163-68-0' (Hydroxyatrazine) in WISE SoE - Water Quality: Disaggregated data table is 'ug/L'
status: valid
status modified: 2019-10-03
accepted date: 2019-10-03
in scheme: Definition of correct units for the observed determinands in the given WISE SoE DD tables
has determinand: CAS 2163-68-0
has uom: ug.L-1
has table: WISE-SoE WaterQuality.DisaggregatedData

WISE-SoE_WaterQuality.DisaggregatedData - CAS_2164-08-1 - ug/L
type: Concept
notation: WISE-SoE_WaterQuality.DisaggregatedData - CAS_2164-08-1 - ug/L
definition: The unit of measure for 'CAS_2164-08-1' (Lenacil) in WISE SoE - Water Quality: Disaggregated data table is 'ug/L'
status: valid
status modified: 2019-10-03
accepted date: 2019-10-03
in scheme: Definition of correct units for the observed determinands in the given WISE SoE DD tables
has determinand: CAS 2164-08-1
has uom: ug.L-1
has table: WISE-SoE WaterQuality.DisaggregatedData

WISE-SoE_WaterQuality.DisaggregatedData - CAS_21725-46-2 - ug/L
type: Concept
notation: WISE-SoE_WaterQuality.DisaggregatedData - CAS_21725-46-2 - ug/L
definition: The unit of measure for 'CAS_21725-46-2' (Cyanazine) in WISE SoE - Water Quality: Disaggregated data table is 'ug/L'
status: valid
status modified: 2019-10-03
accepted date: 2019-10-03
in scheme: Definition of correct units for the observed determinands in the given WISE SoE DD tables
has determinand: CAS 21725-46-2
has uom: ug.L-1
has table: WISE-SoE WaterQuality.DisaggregatedData

WISE-SoE_WaterQuality.DisaggregatedData - CAS_218-01-9 - ug/L
type: Concept
notation: WISE-SoE_WaterQuality.DisaggregatedData - CAS_218-01-9 - ug/L
definition: The unit of measure for 'CAS_218-01-9' (Chrysene) in WISE SoE - Water Quality: Disaggregated data table is 'ug/L'
status: valid
status modified: 2019-10-03
accepted date: 2019-10-03
in scheme: Definition of correct units for the observed determinands in the given WISE SoE DD tables
has determinand: CAS 218-01-9
has uom: ug.L-1
has table: WISE-SoE WaterQuality.DisaggregatedData

WISE-SoE_WaterQuality.DisaggregatedData - CAS_2212-67-1 - ug/L
type: Concept
notation: WISE-SoE_WaterQuality.DisaggregatedData - CAS_2212-67-1 - ug/L
definition: The unit of measure for 'CAS_2212-67-1' (Molinate) in WISE SoE - Water Quality: Disaggregated data table is 'ug/L'
status: valid
status modified: 2019-10-03
accepted date: 2019-10-03
in scheme: Definition of correct units for the observed determinands in the given WISE SoE DD tables
has determinand: CAS 2212-67-1
has uom: ug.L-1
has table: WISE-SoE WaterQuality.DisaggregatedData

WISE-SoE_WaterQuality.DisaggregatedData - CAS_22204-53-1 - ug/L
type: Concept
notation: WISE-SoE_WaterQuality.DisaggregatedData - CAS_22204-53-1 - ug/L
definition: The unit of measure for 'CAS_22204-53-1' (Naproxen) in WISE SoE - Water Quality: Disaggregated data table is 'ug/L'
status: valid
status modified: 2019-10-03
accepted date: 2019-10-03
in scheme: Definition of correct units for the observed determinands in the given WISE SoE DD tables
has determinand: CAS 22204-53-1
has uom: ug.L-1
has table: WISE-SoE WaterQuality.DisaggregatedData

WISE-SoE_WaterQuality.DisaggregatedData - CAS_22224-92-6 - ug/L
type: Concept
notation: WISE-SoE_WaterQuality.DisaggregatedData - CAS_22224-92-6 - ug/L
definition: The unit of measure for 'CAS_22224-92-6' (Fenamiphos) in WISE SoE - Water Quality: Disaggregated data table is 'ug/L'
status: valid
status modified: 2019-10-03
accepted date: 2019-10-03
in scheme: Definition of correct units for the observed determinands in the given WISE SoE DD tables
has determinand: CAS 22224-92-6
has uom: ug.L-1
has table: WISE-SoE WaterQuality.DisaggregatedData

WISE-SoE_WaterQuality.DisaggregatedData - CAS_2227-13-6 - ug/L
type: Concept
notation: WISE-SoE_WaterQuality.DisaggregatedData - CAS_2227-13-6 - ug/L
definition: The unit of measure for 'CAS_2227-13-6' (Tetrasul) in WISE SoE - Water Quality: Disaggregated data table is 'ug/L'
status: valid
status modified: 2019-10-03
accepted date: 2019-10-03
in scheme: Definition of correct units for the observed determinands in the given WISE SoE DD tables
has determinand: CAS 2227-13-6
has uom: ug.L-1
has table: WISE-SoE WaterQuality.DisaggregatedData

WISE-SoE_WaterQuality.DisaggregatedData - CAS_2234-13-1 - ug/L
type: Concept
notation: WISE-SoE_WaterQuality.DisaggregatedData - CAS_2234-13-1 - ug/L
definition: The unit of measure for 'CAS_2234-13-1' (Octachloronaphthalene) in WISE SoE - Water Quality: Disaggregated data table is 'ug/L'
status: valid
status modified: 2019-10-03
accepted date: 2019-10-03
in scheme: Definition of correct units for the observed determinands in the given WISE SoE DD tables
has determinand: CAS 2234-13-1
has uom: ug.L-1
has table: WISE-SoE WaterQuality.DisaggregatedData

WISE-SoE_WaterQuality.DisaggregatedData - CAS_22781-23-3 - ug/L
type: Concept
notation: WISE-SoE_WaterQuality.DisaggregatedData - CAS_22781-23-3 - ug/L
definition: The unit of measure for 'CAS_22781-23-3' (Bendiocarb) in WISE SoE - Water Quality: Disaggregated data table is 'ug/L'
status: valid
status modified: 2019-10-03
accepted date: 2019-10-03
in scheme: Definition of correct units for the observed determinands in the given WISE SoE DD tables
has determinand: CAS 22781-23-3
has uom: ug.L-1
has table: WISE-SoE WaterQuality.DisaggregatedData

WISE-SoE_WaterQuality.DisaggregatedData - CAS_2303-17-5 - ug/L
type: Concept
notation: WISE-SoE_WaterQuality.DisaggregatedData - CAS_2303-17-5 - ug/L
definition: The unit of measure for 'CAS_2303-17-5' (Tri-allate) in WISE SoE - Water Quality: Disaggregated data table is 'ug/L'
status: valid
status modified: 2019-10-03
accepted date: 2019-10-03
in scheme: Definition of correct units for the observed determinands in the given WISE SoE DD tables
has determinand: CAS 2303-17-5
has uom: ug.L-1
has table: WISE-SoE WaterQuality.DisaggregatedData

WISE-SoE_WaterQuality.DisaggregatedData - CAS_2310-17-0 - ug/L
type: Concept
notation: WISE-SoE_WaterQuality.DisaggregatedData - CAS_2310-17-0 - ug/L
definition: The unit of measure for 'CAS_2310-17-0' (Phosalone) in WISE SoE - Water Quality: Disaggregated data table is 'ug/L'
status: valid
status modified: 2019-10-03
accepted date: 2019-10-03
in scheme: Definition of correct units for the observed determinands in the given WISE SoE DD tables
has determinand: CAS 2310-17-0
has uom: ug.L-1
has table: WISE-SoE WaterQuality.DisaggregatedData

WISE-SoE_WaterQuality.DisaggregatedData - CAS_23103-98-2 - ug/L
type: Concept
notation: WISE-SoE_WaterQuality.DisaggregatedData - CAS_23103-98-2 - ug/L
definition: The unit of measure for 'CAS_23103-98-2' (Pirimicarb) in WISE SoE - Water Quality: Disaggregated data table is 'ug/L'
status: valid
status modified: 2019-10-03
accepted date: 2019-10-03
in scheme: Definition of correct units for the observed determinands in the given WISE SoE DD tables
has determinand: CAS 23103-98-2
has uom: ug.L-1
has table: WISE-SoE WaterQuality.DisaggregatedData

WISE-SoE_WaterQuality.DisaggregatedData - CAS_2312-35-8 - ug/L
type: Concept
notation: WISE-SoE_WaterQuality.DisaggregatedData - CAS_2312-35-8 - ug/L
definition: The unit of measure for 'CAS_2312-35-8' (Propargite) in WISE SoE - Water Quality: Disaggregated data table is 'ug/L'
status: valid
status modified: 2019-10-03
accepted date: 2019-10-03
in scheme: Definition of correct units for the observed determinands in the given WISE SoE DD tables
has determinand: CAS 2312-35-8
has uom: ug.L-1
has table: WISE-SoE WaterQuality.DisaggregatedData

WISE-SoE_WaterQuality.DisaggregatedData - CAS_23135-22-0 - ug/L
type: Concept
notation: WISE-SoE_WaterQuality.DisaggregatedData - CAS_23135-22-0 - ug/L
definition: The unit of measure for 'CAS_23135-22-0' (Oxamyl) in WISE SoE - Water Quality: Disaggregated data table is 'ug/L'
status: valid
status modified: 2019-10-03
accepted date: 2019-10-03
in scheme: Definition of correct units for the observed determinands in the given WISE SoE DD tables
has determinand: CAS 23135-22-0
has uom: ug.L-1
has table: WISE-SoE WaterQuality.DisaggregatedData

WISE-SoE_WaterQuality.DisaggregatedData - CAS_23505-41-1 - ug/L
type: Concept
notation: WISE-SoE_WaterQuality.DisaggregatedData - CAS_23505-41-1 - ug/L
definition: The unit of measure for 'CAS_23505-41-1' (Pirimiphos-ethyl) in WISE SoE - Water Quality: Disaggregated data table is 'ug/L'
status: valid
status modified: 2019-10-03
accepted date: 2019-10-03
in scheme: Definition of correct units for the observed determinands in the given WISE SoE DD tables
has determinand: CAS 23505-41-1
has uom: ug.L-1
has table: WISE-SoE WaterQuality.DisaggregatedData

WISE-SoE_WaterQuality.DisaggregatedData - CAS_23560-59-0 - ug/L
type: Concept
notation: WISE-SoE_WaterQuality.DisaggregatedData - CAS_23560-59-0 - ug/L
definition: The unit of measure for 'CAS_23560-59-0' (Heptenophos) in WISE SoE - Water Quality: Disaggregated data table is 'ug/L'
status: valid
status modified: 2019-10-03
accepted date: 2019-10-03
in scheme: Definition of correct units for the observed determinands in the given WISE SoE DD tables
has determinand: CAS 23560-59-0
has uom: ug.L-1
has table: WISE-SoE WaterQuality.DisaggregatedData

WISE-SoE_WaterQuality.DisaggregatedData - CAS_23564-05-8 - ug/L
type: Concept
notation: WISE-SoE_WaterQuality.DisaggregatedData - CAS_23564-05-8 - ug/L
definition: The unit of measure for 'CAS_23564-05-8' (Thiophanate-methyl) in WISE SoE - Water Quality: Disaggregated data table is 'ug/L'
status: valid
status modified: 2019-10-03
accepted date: 2019-10-03
in scheme: Definition of correct units for the observed determinands in the given WISE SoE DD tables
has determinand: CAS 23564-05-8
has uom: ug.L-1
has table: WISE-SoE WaterQuality.DisaggregatedData

WISE-SoE_WaterQuality.DisaggregatedData - CAS_23593-75-1 - ug/L
type: Concept
notation: WISE-SoE_WaterQuality.DisaggregatedData - CAS_23593-75-1 - ug/L
definition: The unit of measure for 'CAS_23593-75-1' (Clotrimazole) in WISE SoE - Water Quality: Disaggregated data table is 'ug/L'
status: valid
status modified: 2019-10-03
accepted date: 2019-10-03
in scheme: Definition of correct units for the observed determinands in the given WISE SoE DD tables
has determinand: CAS 23593-75-1
has uom: ug.L-1
has table: WISE-SoE WaterQuality.DisaggregatedData

WISE-SoE_WaterQuality.DisaggregatedData - CAS_2385-85-5 - ug/L
type: Concept
notation: WISE-SoE_WaterQuality.DisaggregatedData - CAS_2385-85-5 - ug/L
definition: The unit of measure for 'CAS_2385-85-5' (Mirex) in WISE SoE - Water Quality: Disaggregated data table is 'ug/L'
status: valid
status modified: 2019-10-03
accepted date: 2019-10-03
in scheme: Definition of correct units for the observed determinands in the given WISE SoE DD tables
has determinand: CAS 2385-85-5
has uom: ug.L-1
has table: WISE-SoE WaterQuality.DisaggregatedData

WISE-SoE_WaterQuality.DisaggregatedData - CAS_23947-60-6 - ug/L
type: Concept
notation: WISE-SoE_WaterQuality.DisaggregatedData - CAS_23947-60-6 - ug/L
definition: The unit of measure for 'CAS_23947-60-6' (Ethirimol) in WISE SoE - Water Quality: Disaggregated data table is 'ug/L'
status: valid
status modified: 2019-10-03
accepted date: 2019-10-03
in scheme: Definition of correct units for the observed determinands in the given WISE SoE DD tables
has determinand: CAS 23947-60-6
has uom: ug.L-1
has table: WISE-SoE WaterQuality.DisaggregatedData

WISE-SoE_WaterQuality.DisaggregatedData - CAS_23950-58-5 - ug/L
type: Concept
notation: WISE-SoE_WaterQuality.DisaggregatedData - CAS_23950-58-5 - ug/L
definition: The unit of measure for 'CAS_23950-58-5' (Propyzamide) in WISE SoE - Water Quality: Disaggregated data table is 'ug/L'
status: valid
status modified: 2019-10-03
accepted date: 2019-10-03
in scheme: Definition of correct units for the observed determinands in the given WISE SoE DD tables
has determinand: CAS 23950-58-5
has uom: ug.L-1
has table: WISE-SoE WaterQuality.DisaggregatedData

WISE-SoE_WaterQuality.DisaggregatedData - CAS_24017-47-8 - ug/L
type: Concept
notation: WISE-SoE_WaterQuality.DisaggregatedData - CAS_24017-47-8 - ug/L
definition: The unit of measure for 'CAS_24017-47-8' (Triazophos) in WISE SoE - Water Quality: Disaggregated data table is 'ug/L'
status: valid
status modified: 2019-10-03
accepted date: 2019-10-03
in scheme: Definition of correct units for the observed determinands in the given WISE SoE DD tables
has determinand: CAS 24017-47-8
has uom: ug.L-1
has table: WISE-SoE WaterQuality.DisaggregatedData

WISE-SoE_WaterQuality.DisaggregatedData - CAS_2440-02-0 - ug/L
type: Concept
notation: WISE-SoE_WaterQuality.DisaggregatedData - CAS_2440-02-0 - ug/L
definition: The unit of measure for 'CAS_2440-02-0' (Heptachloronorbornene) in WISE SoE - Water Quality: Disaggregated data table is 'ug/L'
status: valid
status modified: 2019-10-03
accepted date: 2019-10-03
in scheme: Definition of correct units for the observed determinands in the given WISE SoE DD tables
has determinand: CAS 2440-02-0
has uom: ug.L-1
has table: WISE-SoE WaterQuality.DisaggregatedData

WISE-SoE_WaterQuality.DisaggregatedData - CAS_24579-73-5 - ug/L
type: Concept
notation: WISE-SoE_WaterQuality.DisaggregatedData - CAS_24579-73-5 - ug/L
definition: The unit of measure for 'CAS_24579-73-5' (Propamocarb) in WISE SoE - Water Quality: Disaggregated data table is 'ug/L'
status: valid
status modified: 2019-10-03
accepted date: 2019-10-03
in scheme: Definition of correct units for the observed determinands in the given WISE SoE DD tables
has determinand: CAS 24579-73-5
has uom: ug.L-1
has table: WISE-SoE WaterQuality.DisaggregatedData

WISE-SoE_WaterQuality.DisaggregatedData - CAS_24959-67-9 - ug/L
type: Concept
notation: WISE-SoE_WaterQuality.DisaggregatedData - CAS_24959-67-9 - ug/L
definition: The unit of measure for 'CAS_24959-67-9' (Bromide) in WISE SoE - Water Quality: Disaggregated data table is 'ug/L'
status: valid
status modified: 2019-10-03
accepted date: 2019-10-03
in scheme: Definition of correct units for the observed determinands in the given WISE SoE DD tables
has determinand: CAS 24959-67-9
has uom: ug.L-1
has table: WISE-SoE WaterQuality.DisaggregatedData

WISE-SoE_WaterQuality.DisaggregatedData - CAS_25057-89-0 - ug/L
type: Concept
notation: WISE-SoE_WaterQuality.DisaggregatedData - CAS_25057-89-0 - ug/L
definition: The unit of measure for 'CAS_25057-89-0' (Bentazone) in WISE SoE - Water Quality: Disaggregated data table is 'ug/L'
status: valid
status modified: 2019-10-03
accepted date: 2019-10-03
in scheme: Definition of correct units for the observed determinands in the given WISE SoE DD tables
has determinand: CAS 25057-89-0
has uom: ug.L-1
has table: WISE-SoE WaterQuality.DisaggregatedData

WISE-SoE_WaterQuality.DisaggregatedData - CAS_25140-90-3 - ug/L
type: Concept
notation: WISE-SoE_WaterQuality.DisaggregatedData - CAS_25140-90-3 - ug/L
definition: The unit of measure for 'CAS_25140-90-3' (2-(2,6-dichlorophenoxy)propionic acid (2,6-DCPP)) in WISE SoE - Water Quality: Disaggregated data table is 'ug/L'
status: valid
status modified: 2019-10-03
accepted date: 2019-10-03
in scheme: Definition of correct units for the observed determinands in the given WISE SoE DD tables
has determinand: CAS 25140-90-3
has uom: ug.L-1
has table: WISE-SoE WaterQuality.DisaggregatedData

WISE-SoE_WaterQuality.DisaggregatedData - CAS_25167-83-3 - ug/L
type: Concept
notation: WISE-SoE_WaterQuality.DisaggregatedData - CAS_25167-83-3 - ug/L
definition: The unit of measure for 'CAS_25167-83-3' (Tetrachlorophenols) in WISE SoE - Water Quality: Disaggregated data table is 'ug/L'
status: valid
status modified: 2019-10-03
accepted date: 2019-10-03
in scheme: Definition of correct units for the observed determinands in the given WISE SoE DD tables
has determinand: CAS 25167-83-3
has uom: ug.L-1
has table: WISE-SoE WaterQuality.DisaggregatedData

WISE-SoE_WaterQuality.DisaggregatedData - CAS_2540-82-1 - ug/L
type: Concept
notation: WISE-SoE_WaterQuality.DisaggregatedData - CAS_2540-82-1 - ug/L
definition: The unit of measure for 'CAS_2540-82-1' (Formothion) in WISE SoE - Water Quality: Disaggregated data table is 'ug/L'
status: valid
status modified: 2019-10-03
accepted date: 2019-10-03
in scheme: Definition of correct units for the observed determinands in the given WISE SoE DD tables
has determinand: CAS 2540-82-1
has uom: ug.L-1
has table: WISE-SoE WaterQuality.DisaggregatedData

WISE-SoE_WaterQuality.DisaggregatedData - CAS_25637-99-4 - ug/L
type: Concept
notation: WISE-SoE_WaterQuality.DisaggregatedData - CAS_25637-99-4 - ug/L
definition: The unit of measure for 'CAS_25637-99-4' (1,3,5,7,9,11-hexabromocyclododecane) in WISE SoE - Water Quality: Disaggregated data table is 'ug/L'
status: valid
status modified: 2019-10-03
accepted date: 2019-10-03
in scheme: Definition of correct units for the observed determinands in the given WISE SoE DD tables
has determinand: CAS 25637-99-4
has uom: ug.L-1
has table: WISE-SoE WaterQuality.DisaggregatedData

WISE-SoE_WaterQuality.DisaggregatedData - CAS_2599-11-3 - ug/L
type: Concept
notation: WISE-SoE_WaterQuality.DisaggregatedData - CAS_2599-11-3 - ug/L
definition: The unit of measure for 'CAS_2599-11-3' (Hydroxysimazine) in WISE SoE - Water Quality: Disaggregated data table is 'ug/L'
status: valid
status modified: 2019-10-03
accepted date: 2019-10-03
in scheme: Definition of correct units for the observed determinands in the given WISE SoE DD tables
has determinand: CAS 2599-11-3
has uom: ug.L-1
has table: WISE-SoE WaterQuality.DisaggregatedData

WISE-SoE_WaterQuality.DisaggregatedData - CAS_262-12-4 - ug/L
type: Concept
notation: WISE-SoE_WaterQuality.DisaggregatedData - CAS_262-12-4 - ug/L
definition: The unit of measure for 'CAS_262-12-4' (Dibenzodioxin) in WISE SoE - Water Quality: Disaggregated data table is 'ug/L'
status: valid
status modified: 2019-10-03
accepted date: 2019-10-03
in scheme: Definition of correct units for the observed determinands in the given WISE SoE DD tables
has determinand: CAS 262-12-4
has uom: ug.L-1
has table: WISE-SoE WaterQuality.DisaggregatedData

WISE-SoE_WaterQuality.DisaggregatedData - CAS_26225-79-6 - ug/L
type: Concept
notation: WISE-SoE_WaterQuality.DisaggregatedData - CAS_26225-79-6 - ug/L
definition: The unit of measure for 'CAS_26225-79-6' (Ethofumesate) in WISE SoE - Water Quality: Disaggregated data table is 'ug/L'
status: valid
status modified: 2019-10-03
accepted date: 2019-10-03
in scheme: Definition of correct units for the observed determinands in the given WISE SoE DD tables
has determinand: CAS 26225-79-6
has uom: ug.L-1
has table: WISE-SoE WaterQuality.DisaggregatedData

WISE-SoE_WaterQuality.DisaggregatedData - CAS_26259-45-0 - ug/L
type: Concept
notation: WISE-SoE_WaterQuality.DisaggregatedData - CAS_26259-45-0 - ug/L
definition: The unit of measure for 'CAS_26259-45-0' (Secbumeton) in WISE SoE - Water Quality: Disaggregated data table is 'ug/L'
status: valid
status modified: 2019-10-03
accepted date: 2019-10-03
in scheme: Definition of correct units for the observed determinands in the given WISE SoE DD tables
has determinand: CAS 26259-45-0
has uom: ug.L-1
has table: WISE-SoE WaterQuality.DisaggregatedData

WISE-SoE_WaterQuality.DisaggregatedData - CAS_2642-71-9 - ug/L
type: Concept
notation: WISE-SoE_WaterQuality.DisaggregatedData - CAS_2642-71-9 - ug/L
definition: The unit of measure for 'CAS_2642-71-9' (Azinphos-ethyl) in WISE SoE - Water Quality: Disaggregated data table is 'ug/L'
status: valid
status modified: 2019-10-03
accepted date: 2019-10-03
in scheme: Definition of correct units for the observed determinands in the given WISE SoE DD tables
has determinand: CAS 2642-71-9
has uom: ug.L-1
has table: WISE-SoE WaterQuality.DisaggregatedData

WISE-SoE_WaterQuality.DisaggregatedData - CAS_26787-78-0 - ug/L
type: Concept
notation: WISE-SoE_WaterQuality.DisaggregatedData - CAS_26787-78-0 - ug/L
definition: The unit of measure for 'CAS_26787-78-0' (Amoxicillin) in WISE SoE - Water Quality: Disaggregated data table is 'ug/L'
status: valid
status modified: 2019-10-03
accepted date: 2019-10-03
in scheme: Definition of correct units for the observed determinands in the given WISE SoE DD tables
has determinand: CAS 26787-78-0
has uom: ug.L-1
has table: WISE-SoE WaterQuality.DisaggregatedData

WISE-SoE_WaterQuality.DisaggregatedData - CAS_2813-95-8 - ug/L
type: Concept
notation: WISE-SoE_WaterQuality.DisaggregatedData - CAS_2813-95-8 - ug/L
definition: The unit of measure for 'CAS_2813-95-8' (Dinoseb acetate) in WISE SoE - Water Quality: Disaggregated data table is 'ug/L'
status: valid
status modified: 2019-10-03
accepted date: 2019-10-03
in scheme: Definition of correct units for the observed determinands in the given WISE SoE DD tables
has determinand: CAS 2813-95-8
has uom: ug.L-1
has table: WISE-SoE WaterQuality.DisaggregatedData

WISE-SoE_WaterQuality.DisaggregatedData - CAS_28159-98-0 - ug/L
type: Concept
notation: WISE-SoE_WaterQuality.DisaggregatedData - CAS_28159-98-0 - ug/L
definition: The unit of measure for 'CAS_28159-98-0' (Cybutryne) in WISE SoE - Water Quality: Disaggregated data table is 'ug/L'
status: valid
status modified: 2019-10-03
accepted date: 2019-10-03
in scheme: Definition of correct units for the observed determinands in the given WISE SoE DD tables
has determinand: CAS 28159-98-0
has uom: ug.L-1
has table: WISE-SoE WaterQuality.DisaggregatedData

WISE-SoE_WaterQuality.DisaggregatedData - CAS_28249-77-6 - ug/L
type: Concept
notation: WISE-SoE_WaterQuality.DisaggregatedData - CAS_28249-77-6 - ug/L
definition: The unit of measure for 'CAS_28249-77-6' (Thiobencarb) in WISE SoE - Water Quality: Disaggregated data table is 'ug/L'
status: valid
status modified: 2019-10-03
accepted date: 2019-10-03
in scheme: Definition of correct units for the observed determinands in the given WISE SoE DD tables
has determinand: CAS 28249-77-6
has uom: ug.L-1
has table: WISE-SoE WaterQuality.DisaggregatedData

WISE-SoE_WaterQuality.DisaggregatedData - CAS_288-88-0 - ug/L
type: Concept
notation: WISE-SoE_WaterQuality.DisaggregatedData - CAS_288-88-0 - ug/L
definition: The unit of measure for 'CAS_288-88-0' (1H-1,2,4-Triazole) in WISE SoE - Water Quality: Disaggregated data table is 'ug/L'
status: valid
status modified: 2019-10-03
accepted date: 2019-10-03
in scheme: Definition of correct units for the observed determinands in the given WISE SoE DD tables
has determinand: CAS 288-88-0
has uom: ug.L-1
has table: WISE-SoE WaterQuality.DisaggregatedData

WISE-SoE_WaterQuality.DisaggregatedData - CAS_29122-68-7 - ug/L
type: Concept
notation: WISE-SoE_WaterQuality.DisaggregatedData - CAS_29122-68-7 - ug/L
definition: The unit of measure for 'CAS_29122-68-7' (Atenolol) in WISE SoE - Water Quality: Disaggregated data table is 'ug/L'
status: valid
status modified: 2019-10-03
accepted date: 2019-10-03
in scheme: Definition of correct units for the observed determinands in the given WISE SoE DD tables
has determinand: CAS 29122-68-7
has uom: ug.L-1
has table: WISE-SoE WaterQuality.DisaggregatedData

WISE-SoE_WaterQuality.DisaggregatedData - CAS_2921-88-2 - ug/L
type: Concept
notation: WISE-SoE_WaterQuality.DisaggregatedData - CAS_2921-88-2 - ug/L
definition: The unit of measure for 'CAS_2921-88-2' (Chlorpyrifos) in WISE SoE - Water Quality: Disaggregated data table is 'ug/L'
status: valid
status modified: 2019-10-03
accepted date: 2019-10-03
in scheme: Definition of correct units for the observed determinands in the given WISE SoE DD tables
has determinand: CAS 2921-88-2
has uom: ug.L-1
has table: WISE-SoE WaterQuality.DisaggregatedData

WISE-SoE_WaterQuality.DisaggregatedData - CAS_29232-93-7 - ug/L
type: Concept
notation: WISE-SoE_WaterQuality.DisaggregatedData - CAS_29232-93-7 - ug/L
definition: The unit of measure for 'CAS_29232-93-7' (Pirimiphos-methyl) in WISE SoE - Water Quality: Disaggregated data table is 'ug/L'
status: valid
status modified: 2019-10-03
accepted date: 2019-10-03
in scheme: Definition of correct units for the observed determinands in the given WISE SoE DD tables
has determinand: CAS 29232-93-7
has uom: ug.L-1
has table: WISE-SoE WaterQuality.DisaggregatedData

WISE-SoE_WaterQuality.DisaggregatedData - CAS_294-62-2 - ug/L
type: Concept
notation: WISE-SoE_WaterQuality.DisaggregatedData - CAS_294-62-2 - ug/L
definition: The unit of measure for 'CAS_294-62-2' (Cyclododecane) in WISE SoE - Water Quality: Disaggregated data table is 'ug/L'
status: valid
status modified: 2019-10-03
accepted date: 2019-10-03
in scheme: Definition of correct units for the observed determinands in the given WISE SoE DD tables
has determinand: CAS 294-62-2
has uom: ug.L-1
has table: WISE-SoE WaterQuality.DisaggregatedData

WISE-SoE_WaterQuality.DisaggregatedData - CAS_297-78-9 - ug/L
type: Concept
notation: WISE-SoE_WaterQuality.DisaggregatedData - CAS_297-78-9 - ug/L
definition: The unit of measure for 'CAS_297-78-9' (Isobenzane) in WISE SoE - Water Quality: Disaggregated data table is 'ug/L'
status: valid
status modified: 2019-10-03
accepted date: 2019-10-03
in scheme: Definition of correct units for the observed determinands in the given WISE SoE DD tables
has determinand: CAS 297-78-9
has uom: ug.L-1
has table: WISE-SoE WaterQuality.DisaggregatedData

WISE-SoE_WaterQuality.DisaggregatedData - CAS_298-00-0 - ug/L
type: Concept
notation: WISE-SoE_WaterQuality.DisaggregatedData - CAS_298-00-0 - ug/L
definition: The unit of measure for 'CAS_298-00-0' (Parathion-methyl) in WISE SoE - Water Quality: Disaggregated data table is 'ug/L'
status: valid
status modified: 2019-10-03
accepted date: 2019-10-03
in scheme: Definition of correct units for the observed determinands in the given WISE SoE DD tables
has determinand: CAS 298-00-0
has uom: ug.L-1
has table: WISE-SoE WaterQuality.DisaggregatedData

WISE-SoE_WaterQuality.DisaggregatedData - CAS_298-02-2 - ug/L
type: Concept
notation: WISE-SoE_WaterQuality.DisaggregatedData - CAS_298-02-2 - ug/L
definition: The unit of measure for 'CAS_298-02-2' (Phorate) in WISE SoE - Water Quality: Disaggregated data table is 'ug/L'
status: valid
status modified: 2019-10-03
accepted date: 2019-10-03
in scheme: Definition of correct units for the observed determinands in the given WISE SoE DD tables
has determinand: CAS 298-02-2
has uom: ug.L-1
has table: WISE-SoE WaterQuality.DisaggregatedData

WISE-SoE_WaterQuality.DisaggregatedData - CAS_298-03-3 - ug/L
type: Concept
notation: WISE-SoE_WaterQuality.DisaggregatedData - CAS_298-03-3 - ug/L
definition: The unit of measure for 'CAS_298-03-3' (Demeton-O) in WISE SoE - Water Quality: Disaggregated data table is 'ug/L'
status: valid
status modified: 2019-10-03
accepted date: 2019-10-03
in scheme: Definition of correct units for the observed determinands in the given WISE SoE DD tables
has determinand: CAS 298-03-3
has uom: ug.L-1
has table: WISE-SoE WaterQuality.DisaggregatedData

WISE-SoE_WaterQuality.DisaggregatedData - CAS_298-04-4 - ug/L
type: Concept
notation: WISE-SoE_WaterQuality.DisaggregatedData - CAS_298-04-4 - ug/L
definition: The unit of measure for 'CAS_298-04-4' (Disulfoton) in WISE SoE - Water Quality: Disaggregated data table is 'ug/L'
status: valid
status modified: 2019-10-03
accepted date: 2019-10-03
in scheme: Definition of correct units for the observed determinands in the given WISE SoE DD tables
has determinand: CAS 298-04-4
has uom: ug.L-1
has table: WISE-SoE WaterQuality.DisaggregatedData

WISE-SoE_WaterQuality.DisaggregatedData - CAS_298-46-4 - ug/L
type: Concept
notation: WISE-SoE_WaterQuality.DisaggregatedData - CAS_298-46-4 - ug/L
definition: The unit of measure for 'CAS_298-46-4' (Carbamazepin) in WISE SoE - Water Quality: Disaggregated data table is 'ug/L'
status: valid
status modified: 2019-10-03
accepted date: 2019-10-03
in scheme: Definition of correct units for the observed determinands in the given WISE SoE DD tables
has determinand: CAS 298-46-4
has uom: ug.L-1
has table: WISE-SoE WaterQuality.DisaggregatedData

WISE-SoE_WaterQuality.DisaggregatedData - CAS_299-84-3 - ug/L
type: Concept
notation: WISE-SoE_WaterQuality.DisaggregatedData - CAS_299-84-3 - ug/L
definition: The unit of measure for 'CAS_299-84-3' (Fenchlorphos) in WISE SoE - Water Quality: Disaggregated data table is 'ug/L'
status: valid
status modified: 2019-10-03
accepted date: 2019-10-03
in scheme: Definition of correct units for the observed determinands in the given WISE SoE DD tables
has determinand: CAS 299-84-3
has uom: ug.L-1
has table: WISE-SoE WaterQuality.DisaggregatedData

WISE-SoE_WaterQuality.DisaggregatedData - CAS_29973-13-5 - ug/L
type: Concept
notation: WISE-SoE_WaterQuality.DisaggregatedData - CAS_29973-13-5 - ug/L
definition: The unit of measure for 'CAS_29973-13-5' (Ethiofencarb) in WISE SoE - Water Quality: Disaggregated data table is 'ug/L'
status: valid
status modified: 2019-10-03
accepted date: 2019-10-03
in scheme: Definition of correct units for the observed determinands in the given WISE SoE DD tables
has determinand: CAS 29973-13-5
has uom: ug.L-1
has table: WISE-SoE WaterQuality.DisaggregatedData

WISE-SoE_WaterQuality.DisaggregatedData - CAS_30125-63-4 - ug/L
type: Concept
notation: WISE-SoE_WaterQuality.DisaggregatedData - CAS_30125-63-4 - ug/L
definition: The unit of measure for 'CAS_30125-63-4' (Desethylterbuthylazine) in WISE SoE - Water Quality: Disaggregated data table is 'ug/L'
status: valid
status modified: 2019-10-03
accepted date: 2019-10-03
in scheme: Definition of correct units for the observed determinands in the given WISE SoE DD tables
has determinand: CAS 30125-63-4
has uom: ug.L-1
has table: WISE-SoE WaterQuality.DisaggregatedData

WISE-SoE_WaterQuality.DisaggregatedData - CAS_3018-12-0 - ug/L
type: Concept
notation: WISE-SoE_WaterQuality.DisaggregatedData - CAS_3018-12-0 - ug/L
definition: The unit of measure for 'CAS_3018-12-0' (Dichloroacetonitrile) in WISE SoE - Water Quality: Disaggregated data table is 'ug/L'
status: valid
status modified: 2019-10-03
accepted date: 2019-10-03
in scheme: Definition of correct units for the observed determinands in the given WISE SoE DD tables
has determinand: CAS 3018-12-0
has uom: ug.L-1
has table: WISE-SoE WaterQuality.DisaggregatedData

WISE-SoE_WaterQuality.DisaggregatedData - CAS_302-17-0 - ug/L
type: Concept
notation: WISE-SoE_WaterQuality.DisaggregatedData - CAS_302-17-0 - ug/L
definition: The unit of measure for 'CAS_302-17-0' (2,2,2-trichloroethane-1,1-diol) in WISE SoE - Water Quality: Disaggregated data table is 'ug/L'
status: valid
status modified: 2019-10-03
accepted date: 2019-10-03
in scheme: Definition of correct units for the observed determinands in the given WISE SoE DD tables
has determinand: CAS 302-17-0
has uom: ug.L-1
has table: WISE-SoE WaterQuality.DisaggregatedData

WISE-SoE_WaterQuality.DisaggregatedData - CAS_30560-19-1 - ug/L
type: Concept
notation: WISE-SoE_WaterQuality.DisaggregatedData - CAS_30560-19-1 - ug/L
definition: The unit of measure for 'CAS_30560-19-1' (Acephate) in WISE SoE - Water Quality: Disaggregated data table is 'ug/L'
status: valid
status modified: 2019-10-03
accepted date: 2019-10-03
in scheme: Definition of correct units for the observed determinands in the given WISE SoE DD tables
has determinand: CAS 30560-19-1
has uom: ug.L-1
has table: WISE-SoE WaterQuality.DisaggregatedData

WISE-SoE_WaterQuality.DisaggregatedData - CAS_3060-89-7 - ug/L
type: Concept
notation: WISE-SoE_WaterQuality.DisaggregatedData - CAS_3060-89-7 - ug/L
definition: The unit of measure for 'CAS_3060-89-7' (Metobromuron) in WISE SoE - Water Quality: Disaggregated data table is 'ug/L'
status: valid
status modified: 2019-10-03
accepted date: 2019-10-03
in scheme: Definition of correct units for the observed determinands in the given WISE SoE DD tables
has determinand: CAS 3060-89-7
has uom: ug.L-1
has table: WISE-SoE WaterQuality.DisaggregatedData

WISE-SoE_WaterQuality.DisaggregatedData - CAS_309-00-2 - ug/L
type: Concept
notation: WISE-SoE_WaterQuality.DisaggregatedData - CAS_309-00-2 - ug/L
definition: The unit of measure for 'CAS_309-00-2' (Aldrin) in WISE SoE - Water Quality: Disaggregated data table is 'ug/L'
status: valid
status modified: 2019-10-03
accepted date: 2019-10-03
in scheme: Definition of correct units for the observed determinands in the given WISE SoE DD tables
has determinand: CAS 309-00-2
has uom: ug.L-1
has table: WISE-SoE WaterQuality.DisaggregatedData

WISE-SoE_WaterQuality.DisaggregatedData - CAS_31218-83-4 - ug/L
type: Concept
notation: WISE-SoE_WaterQuality.DisaggregatedData - CAS_31218-83-4 - ug/L
definition: The unit of measure for 'CAS_31218-83-4' (Propetamphos) in WISE SoE - Water Quality: Disaggregated data table is 'ug/L'
status: valid
status modified: 2019-10-03
accepted date: 2019-10-03
in scheme: Definition of correct units for the observed determinands in the given WISE SoE DD tables
has determinand: CAS 31218-83-4
has uom: ug.L-1
has table: WISE-SoE WaterQuality.DisaggregatedData

WISE-SoE_WaterQuality.DisaggregatedData - CAS_314-40-9 - ug/L
type: Concept
notation: WISE-SoE_WaterQuality.DisaggregatedData - CAS_314-40-9 - ug/L
definition: The unit of measure for 'CAS_314-40-9' (Bromacil) in WISE SoE - Water Quality: Disaggregated data table is 'ug/L'
status: valid
status modified: 2019-10-03
accepted date: 2019-10-03
in scheme: Definition of correct units for the observed determinands in the given WISE SoE DD tables
has determinand: CAS 314-40-9
has uom: ug.L-1
has table: WISE-SoE WaterQuality.DisaggregatedData

WISE-SoE_WaterQuality.DisaggregatedData - CAS_31508-00-6 - ug/L
type: Concept
notation: WISE-SoE_WaterQuality.DisaggregatedData - CAS_31508-00-6 - ug/L
definition: The unit of measure for 'CAS_31508-00-6' (PCB 118 (2,3’,4,4’,5-pentachlorobiphenyl)) in WISE SoE - Water Quality: Disaggregated data table is 'ug/L'
status: valid
status modified: 2019-10-03
accepted date: 2019-10-03
in scheme: Definition of correct units for the observed determinands in the given WISE SoE DD tables
has determinand: CAS 31508-00-6
has uom: ug.L-1
has table: WISE-SoE WaterQuality.DisaggregatedData

WISE-SoE_WaterQuality.DisaggregatedData - CAS_319-84-6 - ug/L
type: Concept
notation: WISE-SoE_WaterQuality.DisaggregatedData - CAS_319-84-6 - ug/L
definition: The unit of measure for 'CAS_319-84-6' (Alpha-HCH) in WISE SoE - Water Quality: Disaggregated data table is 'ug/L'
status: valid
status modified: 2019-10-03
accepted date: 2019-10-03
in scheme: Definition of correct units for the observed determinands in the given WISE SoE DD tables
has determinand: CAS 319-84-6
has uom: ug.L-1
has table: WISE-SoE WaterQuality.DisaggregatedData

WISE-SoE_WaterQuality.DisaggregatedData - CAS_319-85-7 - ug/L
type: Concept
notation: WISE-SoE_WaterQuality.DisaggregatedData - CAS_319-85-7 - ug/L
definition: The unit of measure for 'CAS_319-85-7' (Beta-HCH) in WISE SoE - Water Quality: Disaggregated data table is 'ug/L'
status: valid
status modified: 2019-10-03
accepted date: 2019-10-03
in scheme: Definition of correct units for the observed determinands in the given WISE SoE DD tables
has determinand: CAS 319-85-7
has uom: ug.L-1
has table: WISE-SoE WaterQuality.DisaggregatedData

WISE-SoE_WaterQuality.DisaggregatedData - CAS_319-86-8 - ug/L
type: Concept
notation: WISE-SoE_WaterQuality.DisaggregatedData - CAS_319-86-8 - ug/L
definition: The unit of measure for 'CAS_319-86-8' (Delta-HCH) in WISE SoE - Water Quality: Disaggregated data table is 'ug/L'
status: valid
status modified: 2019-10-03
accepted date: 2019-10-03
in scheme: Definition of correct units for the observed determinands in the given WISE SoE DD tables
has determinand: CAS 319-86-8
has uom: ug.L-1
has table: WISE-SoE WaterQuality.DisaggregatedData

WISE-SoE_WaterQuality.DisaggregatedData - CAS_3194-55-6 - ug/L
type: Concept
notation: WISE-SoE_WaterQuality.DisaggregatedData - CAS_3194-55-6 - ug/L
definition: The unit of measure for 'CAS_3194-55-6' (1,2,5,6,9,10-hexabromocyclododecane) in WISE SoE - Water Quality: Disaggregated data table is 'ug/L'
status: valid
status modified: 2019-10-03
accepted date: 2019-10-03
in scheme: Definition of correct units for the observed determinands in the given WISE SoE DD tables
has determinand: CAS 3194-55-6
has uom: ug.L-1
has table: WISE-SoE WaterQuality.DisaggregatedData

WISE-SoE_WaterQuality.DisaggregatedData - CAS_32-23-5 - ug/L
type: Concept
notation: WISE-SoE_WaterQuality.DisaggregatedData - CAS_32-23-5 - ug/L
definition: The unit of measure for 'CAS_32-23-5' (2,4-DEP) in WISE SoE - Water Quality: Disaggregated data table is 'ug/L'
status: valid
status modified: 2019-10-03
accepted date: 2019-10-03
in scheme: Definition of correct units for the observed determinands in the given WISE SoE DD tables
has determinand: CAS 32-23-5
has uom: ug.L-1
has table: WISE-SoE WaterQuality.DisaggregatedData

WISE-SoE_WaterQuality.DisaggregatedData - CAS_3209-22-1 - ug/L
type: Concept
notation: WISE-SoE_WaterQuality.DisaggregatedData - CAS_3209-22-1 - ug/L
definition: The unit of measure for 'CAS_3209-22-1' (1,2-Dichloro-3-nitrobenzene) in WISE SoE - Water Quality: Disaggregated data table is 'ug/L'
status: valid
status modified: 2019-10-03
accepted date: 2019-10-03
in scheme: Definition of correct units for the observed determinands in the given WISE SoE DD tables
has determinand: CAS 3209-22-1
has uom: ug.L-1
has table: WISE-SoE WaterQuality.DisaggregatedData

WISE-SoE_WaterQuality.DisaggregatedData - CAS_32241-08-0 - ug/L
type: Concept
notation: WISE-SoE_WaterQuality.DisaggregatedData - CAS_32241-08-0 - ug/L
definition: The unit of measure for 'CAS_32241-08-0' (Heptachloronaphthalene) in WISE SoE - Water Quality: Disaggregated data table is 'ug/L'
status: valid
status modified: 2019-10-03
accepted date: 2019-10-03
in scheme: Definition of correct units for the observed determinands in the given WISE SoE DD tables
has determinand: CAS 32241-08-0
has uom: ug.L-1
has table: WISE-SoE WaterQuality.DisaggregatedData

WISE-SoE_WaterQuality.DisaggregatedData - CAS_3252-43-5 - ug/L
type: Concept
notation: WISE-SoE_WaterQuality.DisaggregatedData - CAS_3252-43-5 - ug/L
definition: The unit of measure for 'CAS_3252-43-5' (Dibromoacetonitrile) in WISE SoE - Water Quality: Disaggregated data table is 'ug/L'
status: valid
status modified: 2019-10-03
accepted date: 2019-10-03
in scheme: Definition of correct units for the observed determinands in the given WISE SoE DD tables
has determinand: CAS 3252-43-5
has uom: ug.L-1
has table: WISE-SoE WaterQuality.DisaggregatedData

WISE-SoE_WaterQuality.DisaggregatedData - CAS_32534-81-9 - ug/L
type: Concept
notation: WISE-SoE_WaterQuality.DisaggregatedData - CAS_32534-81-9 - ug/L
definition: The unit of measure for 'CAS_32534-81-9' (Pentabromodiphenylether) in WISE SoE - Water Quality: Disaggregated data table is 'ug/L'
status: valid
status modified: 2019-10-03
accepted date: 2019-10-03
in scheme: Definition of correct units for the observed determinands in the given WISE SoE DD tables
has determinand: CAS 32534-81-9
has uom: ug.L-1
has table: WISE-SoE WaterQuality.DisaggregatedData

WISE-SoE_WaterQuality.DisaggregatedData - CAS_32536-52-0 - ug/L
type: Concept
notation: WISE-SoE_WaterQuality.DisaggregatedData - CAS_32536-52-0 - ug/L
definition: The unit of measure for 'CAS_32536-52-0' (Octabromodiphenyl ether) in WISE SoE - Water Quality: Disaggregated data table is 'ug/L'
status: valid
status modified: 2019-10-03
accepted date: 2019-10-03
in scheme: Definition of correct units for the observed determinands in the given WISE SoE DD tables
has determinand: CAS 32536-52-0
has uom: ug.L-1
has table: WISE-SoE WaterQuality.DisaggregatedData

WISE-SoE_WaterQuality.DisaggregatedData - CAS_32598-13-3 - ug/L
type: Concept
notation: WISE-SoE_WaterQuality.DisaggregatedData - CAS_32598-13-3 - ug/L
definition: The unit of measure for 'CAS_32598-13-3' (PCB 77 (3,3’,4,4’-tetrachlorobiphenyl)) in WISE SoE - Water Quality: Disaggregated data table is 'ug/L'
status: valid
status modified: 2019-10-03
accepted date: 2019-10-03
in scheme: Definition of correct units for the observed determinands in the given WISE SoE DD tables
has determinand: CAS 32598-13-3
has uom: ug.L-1
has table: WISE-SoE WaterQuality.DisaggregatedData

WISE-SoE_WaterQuality.DisaggregatedData - CAS_32598-14-4 - ug/L
type: Concept
notation: WISE-SoE_WaterQuality.DisaggregatedData - CAS_32598-14-4 - ug/L
definition: The unit of measure for 'CAS_32598-14-4' (PCB 105 (2,3,3’,4,4’-pentachlorobiphenyl)) in WISE SoE - Water Quality: Disaggregated data table is 'ug/L'
status: valid
status modified: 2019-10-03
accepted date: 2019-10-03
in scheme: Definition of correct units for the observed determinands in the given WISE SoE DD tables
has determinand: CAS 32598-14-4
has uom: ug.L-1
has table: WISE-SoE WaterQuality.DisaggregatedData

WISE-SoE_WaterQuality.DisaggregatedData - CAS_3268-87-9 - ug/L
type: Concept
notation: WISE-SoE_WaterQuality.DisaggregatedData - CAS_3268-87-9 - ug/L
definition: The unit of measure for 'CAS_3268-87-9' (1,2,3,4,6,7,8,9-O8CDD) in WISE SoE - Water Quality: Disaggregated data table is 'ug/L'
status: valid
status modified: 2019-10-03
accepted date: 2019-10-03
in scheme: Definition of correct units for the observed determinands in the given WISE SoE DD tables
has determinand: CAS 3268-87-9
has uom: ug.L-1
has table: WISE-SoE WaterQuality.DisaggregatedData

WISE-SoE_WaterQuality.DisaggregatedData - CAS_32774-16-6 - ug/L
type: Concept
notation: WISE-SoE_WaterQuality.DisaggregatedData - CAS_32774-16-6 - ug/L
definition: The unit of measure for 'CAS_32774-16-6' (PCB 169 (3,3’,4,4’,5,5’-hexachlorobiphenyl)) in WISE SoE - Water Quality: Disaggregated data table is 'ug/L'
status: valid
status modified: 2019-10-03
accepted date: 2019-10-03
in scheme: Definition of correct units for the observed determinands in the given WISE SoE DD tables
has determinand: CAS 32774-16-6
has uom: ug.L-1
has table: WISE-SoE WaterQuality.DisaggregatedData

WISE-SoE_WaterQuality.DisaggregatedData - CAS_32809-16-8 - ug/L
type: Concept
notation: WISE-SoE_WaterQuality.DisaggregatedData - CAS_32809-16-8 - ug/L
definition: The unit of measure for 'CAS_32809-16-8' (Procymidone) in WISE SoE - Water Quality: Disaggregated data table is 'ug/L'
status: valid
status modified: 2019-10-03
accepted date: 2019-10-03
in scheme: Definition of correct units for the observed determinands in the given WISE SoE DD tables
has determinand: CAS 32809-16-8
has uom: ug.L-1
has table: WISE-SoE WaterQuality.DisaggregatedData

WISE-SoE_WaterQuality.DisaggregatedData - CAS_330-54-1 - ug/L
type: Concept
notation: WISE-SoE_WaterQuality.DisaggregatedData - CAS_330-54-1 - ug/L
definition: The unit of measure for 'CAS_330-54-1' (Diuron) in WISE SoE - Water Quality: Disaggregated data table is 'ug/L'
status: valid
status modified: 2019-10-03
accepted date: 2019-10-03
in scheme: Definition of correct units for the observed determinands in the given WISE SoE DD tables
has determinand: CAS 330-54-1
has uom: ug.L-1
has table: WISE-SoE WaterQuality.DisaggregatedData

WISE-SoE_WaterQuality.DisaggregatedData - CAS_330-55-2 - ug/L
type: Concept
notation: WISE-SoE_WaterQuality.DisaggregatedData - CAS_330-55-2 - ug/L
definition: The unit of measure for 'CAS_330-55-2' (Linuron) in WISE SoE - Water Quality: Disaggregated data table is 'ug/L'
status: valid
status modified: 2019-10-03
accepted date: 2019-10-03
in scheme: Definition of correct units for the observed determinands in the given WISE SoE DD tables
has determinand: CAS 330-55-2
has uom: ug.L-1
has table: WISE-SoE WaterQuality.DisaggregatedData

WISE-SoE_WaterQuality.DisaggregatedData - CAS_3307-39-9 - ug/L
type: Concept
notation: WISE-SoE_WaterQuality.DisaggregatedData - CAS_3307-39-9 - ug/L
definition: The unit of measure for 'CAS_3307-39-9' (2-(4-chlorophenoxy)propionic acid (4-CPP)) in WISE SoE - Water Quality: Disaggregated data table is 'ug/L'
status: valid
status modified: 2019-10-03
accepted date: 2019-10-03
in scheme: Definition of correct units for the observed determinands in the given WISE SoE DD tables
has determinand: CAS 3307-39-9
has uom: ug.L-1
has table: WISE-SoE WaterQuality.DisaggregatedData

WISE-SoE_WaterQuality.DisaggregatedData - CAS_33213-65-9 - ug/L
type: Concept
notation: WISE-SoE_WaterQuality.DisaggregatedData - CAS_33213-65-9 - ug/L
definition: The unit of measure for 'CAS_33213-65-9' (Beta-Endosulfan) in WISE SoE - Water Quality: Disaggregated data table is 'ug/L'
status: valid
status modified: 2019-10-03
accepted date: 2019-10-03
in scheme: Definition of correct units for the observed determinands in the given WISE SoE DD tables
has determinand: CAS 33213-65-9
has uom: ug.L-1
has table: WISE-SoE WaterQuality.DisaggregatedData

WISE-SoE_WaterQuality.DisaggregatedData - CAS_333-41-5 - ug/L
type: Concept
notation: WISE-SoE_WaterQuality.DisaggregatedData - CAS_333-41-5 - ug/L
definition: The unit of measure for 'CAS_333-41-5' (Diazinon) in WISE SoE - Water Quality: Disaggregated data table is 'ug/L'
status: valid
status modified: 2019-10-03
accepted date: 2019-10-03
in scheme: Definition of correct units for the observed determinands in the given WISE SoE DD tables
has determinand: CAS 333-41-5
has uom: ug.L-1
has table: WISE-SoE WaterQuality.DisaggregatedData

WISE-SoE_WaterQuality.DisaggregatedData - CAS_3337-71-1 - ug/L
type: Concept
notation: WISE-SoE_WaterQuality.DisaggregatedData - CAS_3337-71-1 - ug/L
definition: The unit of measure for 'CAS_3337-71-1' (Asulam) in WISE SoE - Water Quality: Disaggregated data table is 'ug/L'
status: valid
status modified: 2019-10-03
accepted date: 2019-10-03
in scheme: Definition of correct units for the observed determinands in the given WISE SoE DD tables
has determinand: CAS 3337-71-1
has uom: ug.L-1
has table: WISE-SoE WaterQuality.DisaggregatedData

WISE-SoE_WaterQuality.DisaggregatedData - CAS_335-67-1 - ug/L
type: Concept
notation: WISE-SoE_WaterQuality.DisaggregatedData - CAS_335-67-1 - ug/L
definition: The unit of measure for 'CAS_335-67-1' (PFOA) in WISE SoE - Water Quality: Disaggregated data table is 'ug/L'
status: valid
status modified: 2019-10-03
accepted date: 2019-10-03
in scheme: Definition of correct units for the observed determinands in the given WISE SoE DD tables
has determinand: CAS 335-67-1
has uom: ug.L-1
has table: WISE-SoE WaterQuality.DisaggregatedData

WISE-SoE_WaterQuality.DisaggregatedData - CAS_33693-04-8 - ug/L
type: Concept
notation: WISE-SoE_WaterQuality.DisaggregatedData - CAS_33693-04-8 - ug/L
definition: The unit of measure for 'CAS_33693-04-8' (Terbumeton) in WISE SoE - Water Quality: Disaggregated data table is 'ug/L'
status: valid
status modified: 2019-10-03
accepted date: 2019-10-03
in scheme: Definition of correct units for the observed determinands in the given WISE SoE DD tables
has determinand: CAS 33693-04-8
has uom: ug.L-1
has table: WISE-SoE WaterQuality.DisaggregatedData

WISE-SoE_WaterQuality.DisaggregatedData - CAS_3380-34-5 - ug/L
type: Concept
notation: WISE-SoE_WaterQuality.DisaggregatedData - CAS_3380-34-5 - ug/L
definition: The unit of measure for 'CAS_3380-34-5' (Triclosan) in WISE SoE - Water Quality: Disaggregated data table is 'ug/L'
status: valid
status modified: 2019-10-03
accepted date: 2019-10-03
in scheme: Definition of correct units for the observed determinands in the given WISE SoE DD tables
has determinand: CAS 3380-34-5
has uom: ug.L-1
has table: WISE-SoE WaterQuality.DisaggregatedData

WISE-SoE_WaterQuality.DisaggregatedData - CAS_3397-62-4 - ug/L
type: Concept
notation: WISE-SoE_WaterQuality.DisaggregatedData - CAS_3397-62-4 - ug/L
definition: The unit of measure for 'CAS_3397-62-4' (Deisopropyldeethylatrazine) in WISE SoE - Water Quality: Disaggregated data table is 'ug/L'
status: valid
status modified: 2019-10-03
accepted date: 2019-10-03
in scheme: Definition of correct units for the observed determinands in the given WISE SoE DD tables
has determinand: CAS 3397-62-4
has uom: ug.L-1
has table: WISE-SoE WaterQuality.DisaggregatedData

WISE-SoE_WaterQuality.DisaggregatedData - CAS_34123-59-6 - ug/L
type: Concept
notation: WISE-SoE_WaterQuality.DisaggregatedData - CAS_34123-59-6 - ug/L
definition: The unit of measure for 'CAS_34123-59-6' (Isoproturon) in WISE SoE - Water Quality: Disaggregated data table is 'ug/L'
status: valid
status modified: 2019-10-03
accepted date: 2019-10-03
in scheme: Definition of correct units for the observed determinands in the given WISE SoE DD tables
has determinand: CAS 34123-59-6
has uom: ug.L-1
has table: WISE-SoE WaterQuality.DisaggregatedData

WISE-SoE_WaterQuality.DisaggregatedData - CAS_3424-82-6 - ug/L
type: Concept
notation: WISE-SoE_WaterQuality.DisaggregatedData - CAS_3424-82-6 - ug/L
definition: The unit of measure for 'CAS_3424-82-6' (o,p'-DDE) in WISE SoE - Water Quality: Disaggregated data table is 'ug/L'
status: valid
status modified: 2019-10-03
accepted date: 2019-10-03
in scheme: Definition of correct units for the observed determinands in the given WISE SoE DD tables
has determinand: CAS 3424-82-6
has uom: ug.L-1
has table: WISE-SoE WaterQuality.DisaggregatedData

WISE-SoE_WaterQuality.DisaggregatedData - CAS_34256-82-1 - ug/L
type: Concept
notation: WISE-SoE_WaterQuality.DisaggregatedData - CAS_34256-82-1 - ug/L
definition: The unit of measure for 'CAS_34256-82-1' (Acetochlor) in WISE SoE - Water Quality: Disaggregated data table is 'ug/L'
status: valid
status modified: 2019-10-03
accepted date: 2019-10-03
in scheme: Definition of correct units for the observed determinands in the given WISE SoE DD tables
has determinand: CAS 34256-82-1
has uom: ug.L-1
has table: WISE-SoE WaterQuality.DisaggregatedData

WISE-SoE_WaterQuality.DisaggregatedData - CAS_34622-58-7 - ug/L
type: Concept
notation: WISE-SoE_WaterQuality.DisaggregatedData - CAS_34622-58-7 - ug/L
definition: The unit of measure for 'CAS_34622-58-7' (Orbencarb) in WISE SoE - Water Quality: Disaggregated data table is 'ug/L'
status: valid
status modified: 2019-10-03
accepted date: 2019-10-03
in scheme: Definition of correct units for the observed determinands in the given WISE SoE DD tables
has determinand: CAS 34622-58-7
has uom: ug.L-1
has table: WISE-SoE WaterQuality.DisaggregatedData

WISE-SoE_WaterQuality.DisaggregatedData - CAS_35045-02-4 - ug/L
type: Concept
notation: WISE-SoE_WaterQuality.DisaggregatedData - CAS_35045-02-4 - ug/L
definition: The unit of measure for 'CAS_35045-02-4' (Metribuzin-DA) in WISE SoE - Water Quality: Disaggregated data table is 'ug/L'
status: valid
status modified: 2019-10-03
accepted date: 2019-10-03
in scheme: Definition of correct units for the observed determinands in the given WISE SoE DD tables
has determinand: CAS 35045-02-4
has uom: ug.L-1
has table: WISE-SoE WaterQuality.DisaggregatedData

WISE-SoE_WaterQuality.DisaggregatedData - CAS_35065-27-1 - ug/L
type: Concept
notation: WISE-SoE_WaterQuality.DisaggregatedData - CAS_35065-27-1 - ug/L
definition: The unit of measure for 'CAS_35065-27-1' (PCB 153 (2,2’,4,4’,5,5’-hexachlorobiphenyl)) in WISE SoE - Water Quality: Disaggregated data table is 'ug/L'
status: valid
status modified: 2019-10-03
accepted date: 2019-10-03
in scheme: Definition of correct units for the observed determinands in the given WISE SoE DD tables
has determinand: CAS 35065-27-1
has uom: ug.L-1
has table: WISE-SoE WaterQuality.DisaggregatedData

WISE-SoE_WaterQuality.DisaggregatedData - CAS_35065-28-2 - ug/L
type: Concept
notation: WISE-SoE_WaterQuality.DisaggregatedData - CAS_35065-28-2 - ug/L
definition: The unit of measure for 'CAS_35065-28-2' (PCB 138 (2,2’,3,4,4’,5’-hexachlorobiphenyl)) in WISE SoE - Water Quality: Disaggregated data table is 'ug/L'
status: valid
status modified: 2019-10-03
accepted date: 2019-10-03
in scheme: Definition of correct units for the observed determinands in the given WISE SoE DD tables
has determinand: CAS 35065-28-2
has uom: ug.L-1
has table: WISE-SoE WaterQuality.DisaggregatedData

WISE-SoE_WaterQuality.DisaggregatedData - CAS_35065-29-3 - ug/L
type: Concept
notation: WISE-SoE_WaterQuality.DisaggregatedData - CAS_35065-29-3 - ug/L
definition: The unit of measure for 'CAS_35065-29-3' (PCB 180 (2,2’,3,4,4’,5,5’-heptachlorobiphenyl)) in WISE SoE - Water Quality: Disaggregated data table is 'ug/L'
status: valid
status modified: 2019-10-03
accepted date: 2019-10-03
in scheme: Definition of correct units for the observed determinands in the given WISE SoE DD tables
has determinand: CAS 35065-29-3
has uom: ug.L-1
has table: WISE-SoE WaterQuality.DisaggregatedData

WISE-SoE_WaterQuality.DisaggregatedData - CAS_35065-30-6 - ug/L
type: Concept
notation: WISE-SoE_WaterQuality.DisaggregatedData - CAS_35065-30-6 - ug/L
definition: The unit of measure for 'CAS_35065-30-6' (PCB 170 (1,2,3,4-tetrachloro-5-(2,3,4-trichlorophenyl)benzene)) in WISE SoE - Water Quality: Disaggregated data table is 'ug/L'
status: valid
status modified: 2019-10-03
accepted date: 2019-10-03
in scheme: Definition of correct units for the observed determinands in the given WISE SoE DD tables
has determinand: CAS 35065-30-6
has uom: ug.L-1
has table: WISE-SoE WaterQuality.DisaggregatedData

WISE-SoE_WaterQuality.DisaggregatedData - CAS_35367-38-5 - ug/L
type: Concept
notation: WISE-SoE_WaterQuality.DisaggregatedData - CAS_35367-38-5 - ug/L
definition: The unit of measure for 'CAS_35367-38-5' (Diflubenzuron) in WISE SoE - Water Quality: Disaggregated data table is 'ug/L'
status: valid
status modified: 2019-10-03
accepted date: 2019-10-03
in scheme: Definition of correct units for the observed determinands in the given WISE SoE DD tables
has determinand: CAS 35367-38-5
has uom: ug.L-1
has table: WISE-SoE WaterQuality.DisaggregatedData

WISE-SoE_WaterQuality.DisaggregatedData - CAS_35554-44-0 - ug/L
type: Concept
notation: WISE-SoE_WaterQuality.DisaggregatedData - CAS_35554-44-0 - ug/L
definition: The unit of measure for 'CAS_35554-44-0' (Imazalil) in WISE SoE - Water Quality: Disaggregated data table is 'ug/L'
status: valid
status modified: 2019-10-03
accepted date: 2019-10-03
in scheme: Definition of correct units for the observed determinands in the given WISE SoE DD tables
has determinand: CAS 35554-44-0
has uom: ug.L-1
has table: WISE-SoE WaterQuality.DisaggregatedData

WISE-SoE_WaterQuality.DisaggregatedData - CAS_35693-99-3 - ug/L
type: Concept
notation: WISE-SoE_WaterQuality.DisaggregatedData - CAS_35693-99-3 - ug/L
definition: The unit of measure for 'CAS_35693-99-3' (PCB 52 (2,2’,5,5’-tetrachlorobiphenyl)) in WISE SoE - Water Quality: Disaggregated data table is 'ug/L'
status: valid
status modified: 2019-10-03
accepted date: 2019-10-03
in scheme: Definition of correct units for the observed determinands in the given WISE SoE DD tables
has determinand: CAS 35693-99-3
has uom: ug.L-1
has table: WISE-SoE WaterQuality.DisaggregatedData

WISE-SoE_WaterQuality.DisaggregatedData - CAS_35694-08-7 - ug/L
type: Concept
notation: WISE-SoE_WaterQuality.DisaggregatedData - CAS_35694-08-7 - ug/L
definition: The unit of measure for 'CAS_35694-08-7' (PCB 194 (1,2,3,4-tetrachloro-5-(2,3,4,5-tetrachlorophenyl)benzene)) in WISE SoE - Water Quality: Disaggregated data table is 'ug/L'
status: valid
status modified: 2019-10-03
accepted date: 2019-10-03
in scheme: Definition of correct units for the observed determinands in the given WISE SoE DD tables
has determinand: CAS 35694-08-7
has uom: ug.L-1
has table: WISE-SoE WaterQuality.DisaggregatedData

WISE-SoE_WaterQuality.DisaggregatedData - CAS_35822-46-9 - ug/L
type: Concept
notation: WISE-SoE_WaterQuality.DisaggregatedData - CAS_35822-46-9 - ug/L
definition: The unit of measure for 'CAS_35822-46-9' (1,2,3,4,6,7,8-H7CDD) in WISE SoE - Water Quality: Disaggregated data table is 'ug/L'
status: valid
status modified: 2019-10-03
accepted date: 2019-10-03
in scheme: Definition of correct units for the observed determinands in the given WISE SoE DD tables
has determinand: CAS 35822-46-9
has uom: ug.L-1
has table: WISE-SoE WaterQuality.DisaggregatedData

WISE-SoE_WaterQuality.DisaggregatedData - CAS_36065-30-2 - ug/L
type: Concept
notation: WISE-SoE_WaterQuality.DisaggregatedData - CAS_36065-30-2 - ug/L
definition: The unit of measure for 'CAS_36065-30-2' (2,4,6-tribromophenyl 2-methyl-2,3-dibromopropy ether) in WISE SoE - Water Quality: Disaggregated data table is 'ug/L'
status: valid
status modified: 2019-10-03
accepted date: 2019-10-03
in scheme: Definition of correct units for the observed determinands in the given WISE SoE DD tables
has determinand: CAS 36065-30-2
has uom: ug.L-1
has table: WISE-SoE WaterQuality.DisaggregatedData

WISE-SoE_WaterQuality.DisaggregatedData - CAS_36355-01-8 - ug/L
type: Concept
notation: WISE-SoE_WaterQuality.DisaggregatedData - CAS_36355-01-8 - ug/L
definition: The unit of measure for 'CAS_36355-01-8' (Hexabromobiphenyl) in WISE SoE - Water Quality: Disaggregated data table is 'ug/L'
status: valid
status modified: 2019-10-03
accepted date: 2019-10-03
in scheme: Definition of correct units for the observed determinands in the given WISE SoE DD tables
has determinand: CAS 36355-01-8
has uom: ug.L-1
has table: WISE-SoE WaterQuality.DisaggregatedData

WISE-SoE_WaterQuality.DisaggregatedData - CAS_36483-60-0 - ug/L
type: Concept
notation: WISE-SoE_WaterQuality.DisaggregatedData - CAS_36483-60-0 - ug/L
definition: The unit of measure for 'CAS_36483-60-0' (Hexabromodiphenylether) in WISE SoE - Water Quality: Disaggregated data table is 'ug/L'
status: valid
status modified: 2019-10-03
accepted date: 2019-10-03
in scheme: Definition of correct units for the observed determinands in the given WISE SoE DD tables
has determinand: CAS 36483-60-0
has uom: ug.L-1
has table: WISE-SoE WaterQuality.DisaggregatedData

WISE-SoE_WaterQuality.DisaggregatedData - CAS_36643-28-4 - ug/L
type: Concept
notation: WISE-SoE_WaterQuality.DisaggregatedData - CAS_36643-28-4 - ug/L
definition: The unit of measure for 'CAS_36643-28-4' (Tributyltin-cation) in WISE SoE - Water Quality: Disaggregated data table is 'ug/L'
status: valid
status modified: 2019-10-03
accepted date: 2019-10-03
in scheme: Definition of correct units for the observed determinands in the given WISE SoE DD tables
has determinand: CAS 36643-28-4
has uom: ug.L-1
has table: WISE-SoE WaterQuality.DisaggregatedData

WISE-SoE_WaterQuality.DisaggregatedData - CAS_36734-19-7 - ug/L
type: Concept
notation: WISE-SoE_WaterQuality.DisaggregatedData - CAS_36734-19-7 - ug/L
definition: The unit of measure for 'CAS_36734-19-7' (Iprodione) in WISE SoE - Water Quality: Disaggregated data table is 'ug/L'
status: valid
status modified: 2019-10-03
accepted date: 2019-10-03
in scheme: Definition of correct units for the observed determinands in the given WISE SoE DD tables
has determinand: CAS 36734-19-7
has uom: ug.L-1
has table: WISE-SoE WaterQuality.DisaggregatedData

WISE-SoE_WaterQuality.DisaggregatedData - CAS_36756-79-3 - ug/L
type: Concept
notation: WISE-SoE_WaterQuality.DisaggregatedData - CAS_36756-79-3 - ug/L
definition: The unit of measure for 'CAS_36756-79-3' (Tiocarbazil) in WISE SoE - Water Quality: Disaggregated data table is 'ug/L'
status: valid
status modified: 2019-10-03
accepted date: 2019-10-03
in scheme: Definition of correct units for the observed determinands in the given WISE SoE DD tables
has determinand: CAS 36756-79-3
has uom: ug.L-1
has table: WISE-SoE WaterQuality.DisaggregatedData

WISE-SoE_WaterQuality.DisaggregatedData - CAS_37350-58-6 - ug/L
type: Concept
notation: WISE-SoE_WaterQuality.DisaggregatedData - CAS_37350-58-6 - ug/L
definition: The unit of measure for 'CAS_37350-58-6' (Metoprolol) in WISE SoE - Water Quality: Disaggregated data table is 'ug/L'
status: valid
status modified: 2019-10-03
accepted date: 2019-10-03
in scheme: Definition of correct units for the observed determinands in the given WISE SoE DD tables
has determinand: CAS 37350-58-6
has uom: ug.L-1
has table: WISE-SoE WaterQuality.DisaggregatedData

WISE-SoE_WaterQuality.DisaggregatedData - CAS_3766-60-7 - ug/L
type: Concept
notation: WISE-SoE_WaterQuality.DisaggregatedData - CAS_3766-60-7 - ug/L
definition: The unit of measure for 'CAS_3766-60-7' (Buturon) in WISE SoE - Water Quality: Disaggregated data table is 'ug/L'
status: valid
status modified: 2019-10-03
accepted date: 2019-10-03
in scheme: Definition of correct units for the observed determinands in the given WISE SoE DD tables
has determinand: CAS 3766-60-7
has uom: ug.L-1
has table: WISE-SoE WaterQuality.DisaggregatedData

WISE-SoE_WaterQuality.DisaggregatedData - CAS_37680-73-2 - ug/L
type: Concept
notation: WISE-SoE_WaterQuality.DisaggregatedData - CAS_37680-73-2 - ug/L
definition: The unit of measure for 'CAS_37680-73-2' (PCB 101 (2,2’,4,5,5’-pentachlorobiphenyl)) in WISE SoE - Water Quality: Disaggregated data table is 'ug/L'
status: valid
status modified: 2019-10-03
accepted date: 2019-10-03
in scheme: Definition of correct units for the observed determinands in the given WISE SoE DD tables
has determinand: CAS 37680-73-2
has uom: ug.L-1
has table: WISE-SoE WaterQuality.DisaggregatedData

WISE-SoE_WaterQuality.DisaggregatedData - CAS_380412-59-9 - ug/L
type: Concept
notation: WISE-SoE_WaterQuality.DisaggregatedData - CAS_380412-59-9 - ug/L
definition: The unit of measure for 'CAS_380412-59-9' (Dimethenamid OA) in WISE SoE - Water Quality: Disaggregated data table is 'ug/L'
status: valid
status modified: 2019-10-03
accepted date: 2019-10-03
in scheme: Definition of correct units for the observed determinands in the given WISE SoE DD tables
has determinand: CAS 380412-59-9
has uom: ug.L-1
has table: WISE-SoE WaterQuality.DisaggregatedData

WISE-SoE_WaterQuality.DisaggregatedData - CAS_3812-32-6 - ug/L
type: Concept
notation: WISE-SoE_WaterQuality.DisaggregatedData - CAS_3812-32-6 - ug/L
definition: The unit of measure for 'CAS_3812-32-6' (Carbonate) in WISE SoE - Water Quality: Disaggregated data table is 'ug/L'
status: valid
status modified: 2019-10-03
accepted date: 2019-10-03
in scheme: Definition of correct units for the observed determinands in the given WISE SoE DD tables
has determinand: CAS 3812-32-6
has uom: ug.L-1
has table: WISE-SoE WaterQuality.DisaggregatedData

WISE-SoE_WaterQuality.DisaggregatedData - CAS_3813-05-6 - ug/L
type: Concept
notation: WISE-SoE_WaterQuality.DisaggregatedData - CAS_3813-05-6 - ug/L
definition: The unit of measure for 'CAS_3813-05-6' (Benazolin) in WISE SoE - Water Quality: Disaggregated data table is 'ug/L'
status: valid
status modified: 2019-10-03
accepted date: 2019-10-03
in scheme: Definition of correct units for the observed determinands in the given WISE SoE DD tables
has determinand: CAS 3813-05-6
has uom: ug.L-1
has table: WISE-SoE WaterQuality.DisaggregatedData

WISE-SoE_WaterQuality.DisaggregatedData - CAS_38260-54-7 - ug/L
type: Concept
notation: WISE-SoE_WaterQuality.DisaggregatedData - CAS_38260-54-7 - ug/L
definition: The unit of measure for 'CAS_38260-54-7' (Phosphorothioic acid) in WISE SoE - Water Quality: Disaggregated data table is 'ug/L'
status: valid
status modified: 2019-10-03
accepted date: 2019-10-03
in scheme: Definition of correct units for the observed determinands in the given WISE SoE DD tables
has determinand: CAS 38260-54-7
has uom: ug.L-1
has table: WISE-SoE WaterQuality.DisaggregatedData

WISE-SoE_WaterQuality.DisaggregatedData - CAS_38379-99-6 - ug/L
type: Concept
notation: WISE-SoE_WaterQuality.DisaggregatedData - CAS_38379-99-6 - ug/L
definition: The unit of measure for 'CAS_38379-99-6' (PCB 95 (2,2',3,5',6-Pentachlorobiphenyl)) in WISE SoE - Water Quality: Disaggregated data table is 'ug/L'
status: valid
status modified: 2019-10-03
accepted date: 2019-10-03
in scheme: Definition of correct units for the observed determinands in the given WISE SoE DD tables
has determinand: CAS 38379-99-6
has uom: ug.L-1
has table: WISE-SoE WaterQuality.DisaggregatedData

WISE-SoE_WaterQuality.DisaggregatedData - CAS_38380-01-7 - ug/L
type: Concept
notation: WISE-SoE_WaterQuality.DisaggregatedData - CAS_38380-01-7 - ug/L
definition: The unit of measure for 'CAS_38380-01-7' (PCB 99 (2,2',4,4',5-Pentachlorobiphenyl)) in WISE SoE - Water Quality: Disaggregated data table is 'ug/L'
status: valid
status modified: 2019-10-03
accepted date: 2019-10-03
in scheme: Definition of correct units for the observed determinands in the given WISE SoE DD tables
has determinand: CAS 38380-01-7
has uom: ug.L-1
has table: WISE-SoE WaterQuality.DisaggregatedData

WISE-SoE_WaterQuality.DisaggregatedData - CAS_38380-03-9 - ug/L
type: Concept
notation: WISE-SoE_WaterQuality.DisaggregatedData - CAS_38380-03-9 - ug/L
definition: The unit of measure for 'CAS_38380-03-9' (PCB 110 (2,3,3',4',6-Pentachlorobiphenyl)) in WISE SoE - Water Quality: Disaggregated data table is 'ug/L'
status: valid
status modified: 2019-10-03
accepted date: 2019-10-03
in scheme: Definition of correct units for the observed determinands in the given WISE SoE DD tables
has determinand: CAS 38380-03-9
has uom: ug.L-1
has table: WISE-SoE WaterQuality.DisaggregatedData

WISE-SoE_WaterQuality.DisaggregatedData - CAS_38380-04-0 - ug/L
type: Concept
notation: WISE-SoE_WaterQuality.DisaggregatedData - CAS_38380-04-0 - ug/L
definition: The unit of measure for 'CAS_38380-04-0' (PCB 149 (2,2',3,4',5',6-Hexachlorobiphenyl)) in WISE SoE - Water Quality: Disaggregated data table is 'ug/L'
status: valid
status modified: 2019-10-03
accepted date: 2019-10-03
in scheme: Definition of correct units for the observed determinands in the given WISE SoE DD tables
has determinand: CAS 38380-04-0
has uom: ug.L-1
has table: WISE-SoE WaterQuality.DisaggregatedData

WISE-SoE_WaterQuality.DisaggregatedData - CAS_38380-08-4 - ug/L
type: Concept
notation: WISE-SoE_WaterQuality.DisaggregatedData - CAS_38380-08-4 - ug/L
definition: The unit of measure for 'CAS_38380-08-4' (PCB 156 (2,3,3’,4,4’,5-hexachlorobiphenyl)) in WISE SoE - Water Quality: Disaggregated data table is 'ug/L'
status: valid
status modified: 2019-10-03
accepted date: 2019-10-03
in scheme: Definition of correct units for the observed determinands in the given WISE SoE DD tables
has determinand: CAS 38380-08-4
has uom: ug.L-1
has table: WISE-SoE WaterQuality.DisaggregatedData

WISE-SoE_WaterQuality.DisaggregatedData - CAS_38939-88-7 - ug/L
type: Concept
notation: WISE-SoE_WaterQuality.DisaggregatedData - CAS_38939-88-7 - ug/L
definition: The unit of measure for 'CAS_38939-88-7' (3-chloro-4-nitrotoluene) in WISE SoE - Water Quality: Disaggregated data table is 'ug/L'
status: valid
status modified: 2019-10-03
accepted date: 2019-10-03
in scheme: Definition of correct units for the observed determinands in the given WISE SoE DD tables
has determinand: CAS 38939-88-7
has uom: ug.L-1
has table: WISE-SoE WaterQuality.DisaggregatedData

WISE-SoE_WaterQuality.DisaggregatedData - CAS_39001-02-0 - ug/L
type: Concept
notation: WISE-SoE_WaterQuality.DisaggregatedData - CAS_39001-02-0 - ug/L
definition: The unit of measure for 'CAS_39001-02-0' (1,2,3,4,6,7,8,9-O8CDF) in WISE SoE - Water Quality: Disaggregated data table is 'ug/L'
status: valid
status modified: 2019-10-03
accepted date: 2019-10-03
in scheme: Definition of correct units for the observed determinands in the given WISE SoE DD tables
has determinand: CAS 39001-02-0
has uom: ug.L-1
has table: WISE-SoE WaterQuality.DisaggregatedData

WISE-SoE_WaterQuality.DisaggregatedData - CAS_39227-28-6 - ug/L
type: Concept
notation: WISE-SoE_WaterQuality.DisaggregatedData - CAS_39227-28-6 - ug/L
definition: The unit of measure for 'CAS_39227-28-6' (1,2,3,4,7,8-H6CDD) in WISE SoE - Water Quality: Disaggregated data table is 'ug/L'
status: valid
status modified: 2019-10-03
accepted date: 2019-10-03
in scheme: Definition of correct units for the observed determinands in the given WISE SoE DD tables
has determinand: CAS 39227-28-6
has uom: ug.L-1
has table: WISE-SoE WaterQuality.DisaggregatedData

WISE-SoE_WaterQuality.DisaggregatedData - CAS_39635-31-9 - ug/L
type: Concept
notation: WISE-SoE_WaterQuality.DisaggregatedData - CAS_39635-31-9 - ug/L
definition: The unit of measure for 'CAS_39635-31-9' (PCB 189 (1,2,3,4-tetrachloro-5-(3,4,5-trichlorophenyl)benzene)) in WISE SoE - Water Quality: Disaggregated data table is 'ug/L'
status: valid
status modified: 2019-10-03
accepted date: 2019-10-03
in scheme: Definition of correct units for the observed determinands in the given WISE SoE DD tables
has determinand: CAS 39635-31-9
has uom: ug.L-1
has table: WISE-SoE WaterQuality.DisaggregatedData

WISE-SoE_WaterQuality.DisaggregatedData - CAS_39765-80-5 - ug/L
type: Concept
notation: WISE-SoE_WaterQuality.DisaggregatedData - CAS_39765-80-5 - ug/L
definition: The unit of measure for 'CAS_39765-80-5' (trans-Nonachlor) in WISE SoE - Water Quality: Disaggregated data table is 'ug/L'
status: valid
status modified: 2019-10-03
accepted date: 2019-10-03
in scheme: Definition of correct units for the observed determinands in the given WISE SoE DD tables
has determinand: CAS 39765-80-5
has uom: ug.L-1
has table: WISE-SoE WaterQuality.DisaggregatedData

WISE-SoE_WaterQuality.DisaggregatedData - CAS_3984-14-3 - ug/L
type: Concept
notation: WISE-SoE_WaterQuality.DisaggregatedData - CAS_3984-14-3 - ug/L
definition: The unit of measure for 'CAS_3984-14-3' (N,N-dimethylsulfamide) in WISE SoE - Water Quality: Disaggregated data table is 'ug/L'
status: valid
status modified: 2019-10-03
accepted date: 2019-10-03
in scheme: Definition of correct units for the observed determinands in the given WISE SoE DD tables
has determinand: CAS 3984-14-3
has uom: ug.L-1
has table: WISE-SoE WaterQuality.DisaggregatedData

WISE-SoE_WaterQuality.DisaggregatedData - CAS_40088-47-9 - ug/L
type: Concept
notation: WISE-SoE_WaterQuality.DisaggregatedData - CAS_40088-47-9 - ug/L
definition: The unit of measure for 'CAS_40088-47-9' (Tetrabromodiphenylether) in WISE SoE - Water Quality: Disaggregated data table is 'ug/L'
status: valid
status modified: 2019-10-03
accepted date: 2019-10-03
in scheme: Definition of correct units for the observed determinands in the given WISE SoE DD tables
has determinand: CAS 40088-47-9
has uom: ug.L-1
has table: WISE-SoE WaterQuality.DisaggregatedData

WISE-SoE_WaterQuality.DisaggregatedData - CAS_40321-76-4 - ug/L
type: Concept
notation: WISE-SoE_WaterQuality.DisaggregatedData - CAS_40321-76-4 - ug/L
definition: The unit of measure for 'CAS_40321-76-4' (1,2,3,7,8-P5CDD) in WISE SoE - Water Quality: Disaggregated data table is 'ug/L'
status: valid
status modified: 2019-10-03
accepted date: 2019-10-03
in scheme: Definition of correct units for the observed determinands in the given WISE SoE DD tables
has determinand: CAS 40321-76-4
has uom: ug.L-1
has table: WISE-SoE WaterQuality.DisaggregatedData

WISE-SoE_WaterQuality.DisaggregatedData - CAS_40487-42-1 - ug/L
type: Concept
notation: WISE-SoE_WaterQuality.DisaggregatedData - CAS_40487-42-1 - ug/L
definition: The unit of measure for 'CAS_40487-42-1' (Pendimethalin) in WISE SoE - Water Quality: Disaggregated data table is 'ug/L'
status: valid
status modified: 2019-10-03
accepted date: 2019-10-03
in scheme: Definition of correct units for the observed determinands in the given WISE SoE DD tables
has determinand: CAS 40487-42-1
has uom: ug.L-1
has table: WISE-SoE WaterQuality.DisaggregatedData

WISE-SoE_WaterQuality.DisaggregatedData - CAS_41318-75-6 - ug/L
type: Concept
notation: WISE-SoE_WaterQuality.DisaggregatedData - CAS_41318-75-6 - ug/L
definition: The unit of measure for 'CAS_41318-75-6' (BDE 28 (2,4,4'-tribromodiphenyl ether)) in WISE SoE - Water Quality: Disaggregated data table is 'ug/L'
status: valid
status modified: 2019-10-03
accepted date: 2019-10-03
in scheme: Definition of correct units for the observed determinands in the given WISE SoE DD tables
has determinand: CAS 41318-75-6
has uom: ug.L-1
has table: WISE-SoE WaterQuality.DisaggregatedData

WISE-SoE_WaterQuality.DisaggregatedData - CAS_41394-05-2 - ug/L
type: Concept
notation: WISE-SoE_WaterQuality.DisaggregatedData - CAS_41394-05-2 - ug/L
definition: The unit of measure for 'CAS_41394-05-2' (Metamitron) in WISE SoE - Water Quality: Disaggregated data table is 'ug/L'
status: valid
status modified: 2019-10-03
accepted date: 2019-10-03
in scheme: Definition of correct units for the observed determinands in the given WISE SoE DD tables
has determinand: CAS 41394-05-2
has uom: ug.L-1
has table: WISE-SoE WaterQuality.DisaggregatedData

WISE-SoE_WaterQuality.DisaggregatedData - CAS_41464-42-0 - ug/L
type: Concept
notation: WISE-SoE_WaterQuality.DisaggregatedData - CAS_41464-42-0 - ug/L
definition: The unit of measure for 'CAS_41464-42-0' (PCB 72 (2,3',5,5'-Tetrachlorobiphenyl)) in WISE SoE - Water Quality: Disaggregated data table is 'ug/L'
status: valid
status modified: 2019-10-03
accepted date: 2019-10-03
in scheme: Definition of correct units for the observed determinands in the given WISE SoE DD tables
has determinand: CAS 41464-42-0
has uom: ug.L-1
has table: WISE-SoE WaterQuality.DisaggregatedData

WISE-SoE_WaterQuality.DisaggregatedData - CAS_41483-43-6 - ug/L
type: Concept
notation: WISE-SoE_WaterQuality.DisaggregatedData - CAS_41483-43-6 - ug/L
definition: The unit of measure for 'CAS_41483-43-6' (Bupirimate) in WISE SoE - Water Quality: Disaggregated data table is 'ug/L'
status: valid
status modified: 2019-10-03
accepted date: 2019-10-03
in scheme: Definition of correct units for the observed determinands in the given WISE SoE DD tables
has determinand: CAS 41483-43-6
has uom: ug.L-1
has table: WISE-SoE WaterQuality.DisaggregatedData

WISE-SoE_WaterQuality.DisaggregatedData - CAS_41859-67-0 - ug/L
type: Concept
notation: WISE-SoE_WaterQuality.DisaggregatedData - CAS_41859-67-0 - ug/L
definition: The unit of measure for 'CAS_41859-67-0' (Bezafibrate) in WISE SoE - Water Quality: Disaggregated data table is 'ug/L'
status: valid
status modified: 2019-10-03
accepted date: 2019-10-03
in scheme: Definition of correct units for the observed determinands in the given WISE SoE DD tables
has determinand: CAS 41859-67-0
has uom: ug.L-1
has table: WISE-SoE WaterQuality.DisaggregatedData

WISE-SoE_WaterQuality.DisaggregatedData - CAS_4234-79-1 - ug/L
type: Concept
notation: WISE-SoE_WaterQuality.DisaggregatedData - CAS_4234-79-1 - ug/L
definition: The unit of measure for 'CAS_4234-79-1' (Kelevan) in WISE SoE - Water Quality: Disaggregated data table is 'ug/L'
status: valid
status modified: 2019-10-03
accepted date: 2019-10-03
in scheme: Definition of correct units for the observed determinands in the given WISE SoE DD tables
has determinand: CAS 4234-79-1
has uom: ug.L-1
has table: WISE-SoE WaterQuality.DisaggregatedData

WISE-SoE_WaterQuality.DisaggregatedData - CAS_4245-76-5 - ug/L
type: Concept
notation: WISE-SoE_WaterQuality.DisaggregatedData - CAS_4245-76-5 - ug/L
definition: The unit of measure for 'CAS_4245-76-5' (N-methyl-N'-nitroguanidine) in WISE SoE - Water Quality: Disaggregated data table is 'ug/L'
status: valid
status modified: 2019-10-03
accepted date: 2019-10-03
in scheme: Definition of correct units for the observed determinands in the given WISE SoE DD tables
has determinand: CAS 4245-76-5
has uom: ug.L-1
has table: WISE-SoE WaterQuality.DisaggregatedData

WISE-SoE_WaterQuality.DisaggregatedData - CAS_42576-02-3 - ug/L
type: Concept
notation: WISE-SoE_WaterQuality.DisaggregatedData - CAS_42576-02-3 - ug/L
definition: The unit of measure for 'CAS_42576-02-3' (Bifenox) in WISE SoE - Water Quality: Disaggregated data table is 'ug/L'
status: valid
status modified: 2019-10-03
accepted date: 2019-10-03
in scheme: Definition of correct units for the observed determinands in the given WISE SoE DD tables
has determinand: CAS 42576-02-3
has uom: ug.L-1
has table: WISE-SoE WaterQuality.DisaggregatedData

WISE-SoE_WaterQuality.DisaggregatedData - CAS_42874-03-3 - ug/L
type: Concept
notation: WISE-SoE_WaterQuality.DisaggregatedData - CAS_42874-03-3 - ug/L
definition: The unit of measure for 'CAS_42874-03-3' (CAS_42874-03-3 - Oxyfluorfen) in WISE SoE - Water Quality: Disaggregated data table is 'ug/L'
status: valid
status modified: 2019-10-03
accepted date: 2019-10-03
in scheme: Definition of correct units for the observed determinands in the given WISE SoE DD tables
has determinand: CAS 42874-03-3
has uom: ug.L-1
has table: WISE-SoE WaterQuality.DisaggregatedData

WISE-SoE_WaterQuality.DisaggregatedData - CAS_43121-43-3 - ug/L
type: Concept
notation: WISE-SoE_WaterQuality.DisaggregatedData - CAS_43121-43-3 - ug/L
definition: The unit of measure for 'CAS_43121-43-3' (Triadimefon) in WISE SoE - Water Quality: Disaggregated data table is 'ug/L'
status: valid
status modified: 2019-10-03
accepted date: 2019-10-03
in scheme: Definition of correct units for the observed determinands in the given WISE SoE DD tables
has determinand: CAS 43121-43-3
has uom: ug.L-1
has table: WISE-SoE WaterQuality.DisaggregatedData

WISE-SoE_WaterQuality.DisaggregatedData - CAS_4636-83-3 - ug/L
type: Concept
notation: WISE-SoE_WaterQuality.DisaggregatedData - CAS_4636-83-3 - ug/L
definition: The unit of measure for 'CAS_4636-83-3' (Morfamquat) in WISE SoE - Water Quality: Disaggregated data table is 'ug/L'
status: valid
status modified: 2019-10-03
accepted date: 2019-10-03
in scheme: Definition of correct units for the observed determinands in the given WISE SoE DD tables
has determinand: CAS 4636-83-3
has uom: ug.L-1
has table: WISE-SoE WaterQuality.DisaggregatedData

WISE-SoE_WaterQuality.DisaggregatedData - CAS_465-73-6 - ug/L
type: Concept
notation: WISE-SoE_WaterQuality.DisaggregatedData - CAS_465-73-6 - ug/L
definition: The unit of measure for 'CAS_465-73-6' (Isodrin) in WISE SoE - Water Quality: Disaggregated data table is 'ug/L'
status: valid
status modified: 2019-10-03
accepted date: 2019-10-03
in scheme: Definition of correct units for the observed determinands in the given WISE SoE DD tables
has determinand: CAS 465-73-6
has uom: ug.L-1
has table: WISE-SoE WaterQuality.DisaggregatedData

WISE-SoE_WaterQuality.DisaggregatedData - CAS_470-90-6 - ug/L
type: Concept
notation: WISE-SoE_WaterQuality.DisaggregatedData - CAS_470-90-6 - ug/L
definition: The unit of measure for 'CAS_470-90-6' (Chlorfenvinphos) in WISE SoE - Water Quality: Disaggregated data table is 'ug/L'
status: valid
status modified: 2019-10-03
accepted date: 2019-10-03
in scheme: Definition of correct units for the observed determinands in the given WISE SoE DD tables
has determinand: CAS 470-90-6
has uom: ug.L-1
has table: WISE-SoE WaterQuality.DisaggregatedData

WISE-SoE_WaterQuality.DisaggregatedData - CAS_4901-51-3 - ug/L
type: Concept
notation: WISE-SoE_WaterQuality.DisaggregatedData - CAS_4901-51-3 - ug/L
definition: The unit of measure for 'CAS_4901-51-3' (2,3,4,5-tetrachlorophenol) in WISE SoE - Water Quality: Disaggregated data table is 'ug/L'
status: valid
status modified: 2019-10-03
accepted date: 2019-10-03
in scheme: Definition of correct units for the observed determinands in the given WISE SoE DD tables
has determinand: CAS 4901-51-3
has uom: ug.L-1
has table: WISE-SoE WaterQuality.DisaggregatedData

WISE-SoE_WaterQuality.DisaggregatedData - CAS_4904-61-4 - ug/L
type: Concept
notation: WISE-SoE_WaterQuality.DisaggregatedData - CAS_4904-61-4 - ug/L
definition: The unit of measure for 'CAS_4904-61-4' (1,5,9-cyclododecatriene) in WISE SoE - Water Quality: Disaggregated data table is 'ug/L'
status: valid
status modified: 2019-10-03
accepted date: 2019-10-03
in scheme: Definition of correct units for the observed determinands in the given WISE SoE DD tables
has determinand: CAS 4904-61-4
has uom: ug.L-1
has table: WISE-SoE WaterQuality.DisaggregatedData

WISE-SoE_WaterQuality.DisaggregatedData - CAS_50-00-0 - ug/L
type: Concept
notation: WISE-SoE_WaterQuality.DisaggregatedData - CAS_50-00-0 - ug/L
definition: The unit of measure for 'CAS_50-00-0' (Formaldehyde) in WISE SoE - Water Quality: Disaggregated data table is 'ug/L'
status: valid
status modified: 2019-10-03
accepted date: 2019-10-03
in scheme: Definition of correct units for the observed determinands in the given WISE SoE DD tables
has determinand: CAS 50-00-0
has uom: ug.L-1
has table: WISE-SoE WaterQuality.DisaggregatedData

WISE-SoE_WaterQuality.DisaggregatedData - CAS_50-28-2 - ug/L
type: Concept
notation: WISE-SoE_WaterQuality.DisaggregatedData - CAS_50-28-2 - ug/L
definition: The unit of measure for 'CAS_50-28-2' (17beta-estradiol (E2)) in WISE SoE - Water Quality: Disaggregated data table is 'ug/L'
status: valid
status modified: 2019-10-03
accepted date: 2019-10-03
in scheme: Definition of correct units for the observed determinands in the given WISE SoE DD tables
has determinand: CAS 50-28-2
has uom: ug.L-1
has table: WISE-SoE WaterQuality.DisaggregatedData

WISE-SoE_WaterQuality.DisaggregatedData - CAS_50-29-3 - ug/L
type: Concept
notation: WISE-SoE_WaterQuality.DisaggregatedData - CAS_50-29-3 - ug/L
definition: The unit of measure for 'CAS_50-29-3' (DDT, p,p') in WISE SoE - Water Quality: Disaggregated data table is 'ug/L'
status: valid
status modified: 2019-10-03
accepted date: 2019-10-03
in scheme: Definition of correct units for the observed determinands in the given WISE SoE DD tables
has determinand: CAS 50-29-3
has uom: ug.L-1
has table: WISE-SoE WaterQuality.DisaggregatedData

WISE-SoE_WaterQuality.DisaggregatedData - CAS_50-30-6 - ug/L
type: Concept
notation: WISE-SoE_WaterQuality.DisaggregatedData - CAS_50-30-6 - ug/L
definition: The unit of measure for 'CAS_50-30-6' (2,6-dichlorobenzoic acid) in WISE SoE - Water Quality: Disaggregated data table is 'ug/L'
status: valid
status modified: 2019-10-03
accepted date: 2019-10-03
in scheme: Definition of correct units for the observed determinands in the given WISE SoE DD tables
has determinand: CAS 50-30-6
has uom: ug.L-1
has table: WISE-SoE WaterQuality.DisaggregatedData

WISE-SoE_WaterQuality.DisaggregatedData - CAS_50-31-7 - ug/L
type: Concept
notation: WISE-SoE_WaterQuality.DisaggregatedData - CAS_50-31-7 - ug/L
definition: The unit of measure for 'CAS_50-31-7' (2,3,6-trichlorobenzoic acid) in WISE SoE - Water Quality: Disaggregated data table is 'ug/L'
status: valid
status modified: 2019-10-03
accepted date: 2019-10-03
in scheme: Definition of correct units for the observed determinands in the given WISE SoE DD tables
has determinand: CAS 50-31-7
has uom: ug.L-1
has table: WISE-SoE WaterQuality.DisaggregatedData

WISE-SoE_WaterQuality.DisaggregatedData - CAS_50-32-8 - ug/L
type: Concept
notation: WISE-SoE_WaterQuality.DisaggregatedData - CAS_50-32-8 - ug/L
definition: The unit of measure for 'CAS_50-32-8' (Benzo(a)pyrene) in WISE SoE - Water Quality: Disaggregated data table is 'ug/L'
status: valid
status modified: 2019-10-03
accepted date: 2019-10-03
in scheme: Definition of correct units for the observed determinands in the given WISE SoE DD tables
has determinand: CAS 50-32-8
has uom: ug.L-1
has table: WISE-SoE WaterQuality.DisaggregatedData

WISE-SoE_WaterQuality.DisaggregatedData - CAS_50471-44-8 - ug/L
type: Concept
notation: WISE-SoE_WaterQuality.DisaggregatedData - CAS_50471-44-8 - ug/L
definition: The unit of measure for 'CAS_50471-44-8' (Vinclozolin) in WISE SoE - Water Quality: Disaggregated data table is 'ug/L'
status: valid
status modified: 2019-10-03
accepted date: 2019-10-03
in scheme: Definition of correct units for the observed determinands in the given WISE SoE DD tables
has determinand: CAS 50471-44-8
has uom: ug.L-1
has table: WISE-SoE WaterQuality.DisaggregatedData

WISE-SoE_WaterQuality.DisaggregatedData - CAS_50563-36-5 - ug/L
type: Concept
notation: WISE-SoE_WaterQuality.DisaggregatedData - CAS_50563-36-5 - ug/L
definition: The unit of measure for 'CAS_50563-36-5' (Dimethachlor) in WISE SoE - Water Quality: Disaggregated data table is 'ug/L'
status: valid
status modified: 2019-10-03
accepted date: 2019-10-03
in scheme: Definition of correct units for the observed determinands in the given WISE SoE DD tables
has determinand: CAS 50563-36-5
has uom: ug.L-1
has table: WISE-SoE WaterQuality.DisaggregatedData

WISE-SoE_WaterQuality.DisaggregatedData - CAS_506-77-4 - ug/L
type: Concept
notation: WISE-SoE_WaterQuality.DisaggregatedData - CAS_506-77-4 - ug/L
definition: The unit of measure for 'CAS_506-77-4' (Cyanogen chloride) in WISE SoE - Water Quality: Disaggregated data table is 'ug/L'
status: valid
status modified: 2019-10-03
accepted date: 2019-10-03
in scheme: Definition of correct units for the observed determinands in the given WISE SoE DD tables
has determinand: CAS 506-77-4
has uom: ug.L-1
has table: WISE-SoE WaterQuality.DisaggregatedData

WISE-SoE_WaterQuality.DisaggregatedData - CAS_51000-52-3 - ug/L
type: Concept
notation: WISE-SoE_WaterQuality.DisaggregatedData - CAS_51000-52-3 - ug/L
definition: The unit of measure for 'CAS_51000-52-3' (Vinyl neodecanoate) in WISE SoE - Water Quality: Disaggregated data table is 'ug/L'
status: valid
status modified: 2019-10-03
accepted date: 2019-10-03
in scheme: Definition of correct units for the observed determinands in the given WISE SoE DD tables
has determinand: CAS 51000-52-3
has uom: ug.L-1
has table: WISE-SoE WaterQuality.DisaggregatedData

WISE-SoE_WaterQuality.DisaggregatedData - CAS_5103-71-9 - ug/L
type: Concept
notation: WISE-SoE_WaterQuality.DisaggregatedData - CAS_5103-71-9 - ug/L
definition: The unit of measure for 'CAS_5103-71-9' (Alpha-Chlordan) in WISE SoE - Water Quality: Disaggregated data table is 'ug/L'
status: valid
status modified: 2019-10-03
accepted date: 2019-10-03
in scheme: Definition of correct units for the observed determinands in the given WISE SoE DD tables
has determinand: CAS 5103-71-9
has uom: ug.L-1
has table: WISE-SoE WaterQuality.DisaggregatedData

WISE-SoE_WaterQuality.DisaggregatedData - CAS_5103-74-2 - ug/L
type: Concept
notation: WISE-SoE_WaterQuality.DisaggregatedData - CAS_5103-74-2 - ug/L
definition: The unit of measure for 'CAS_5103-74-2' (Trans-chlordane) in WISE SoE - Water Quality: Disaggregated data table is 'ug/L'
status: valid
status modified: 2019-10-03
accepted date: 2019-10-03
in scheme: Definition of correct units for the observed determinands in the given WISE SoE DD tables
has determinand: CAS 5103-74-2
has uom: ug.L-1
has table: WISE-SoE WaterQuality.DisaggregatedData

WISE-SoE_WaterQuality.DisaggregatedData - CAS_512-04-9 - ug/L
type: Concept
notation: WISE-SoE_WaterQuality.DisaggregatedData - CAS_512-04-9 - ug/L
definition: The unit of measure for 'CAS_512-04-9' (Diosgenin) in WISE SoE - Water Quality: Disaggregated data table is 'ug/L'
status: valid
status modified: 2019-10-03
accepted date: 2019-10-03
in scheme: Definition of correct units for the observed determinands in the given WISE SoE DD tables
has determinand: CAS 512-04-9
has uom: ug.L-1
has table: WISE-SoE WaterQuality.DisaggregatedData

WISE-SoE_WaterQuality.DisaggregatedData - CAS_51207-31-9 - ug/L
type: Concept
notation: WISE-SoE_WaterQuality.DisaggregatedData - CAS_51207-31-9 - ug/L
definition: The unit of measure for 'CAS_51207-31-9' (2,3,7,8-T4CDF) in WISE SoE - Water Quality: Disaggregated data table is 'ug/L'
status: valid
status modified: 2019-10-03
accepted date: 2019-10-03
in scheme: Definition of correct units for the observed determinands in the given WISE SoE DD tables
has determinand: CAS 51207-31-9
has uom: ug.L-1
has table: WISE-SoE WaterQuality.DisaggregatedData

WISE-SoE_WaterQuality.DisaggregatedData - CAS_51218-45-2 - ug/L
type: Concept
notation: WISE-SoE_WaterQuality.DisaggregatedData - CAS_51218-45-2 - ug/L
definition: The unit of measure for 'CAS_51218-45-2' (Metolachlor) in WISE SoE - Water Quality: Disaggregated data table is 'ug/L'
status: valid
status modified: 2019-10-03
accepted date: 2019-10-03
in scheme: Definition of correct units for the observed determinands in the given WISE SoE DD tables
has determinand: CAS 51218-45-2
has uom: ug.L-1
has table: WISE-SoE WaterQuality.DisaggregatedData

WISE-SoE_WaterQuality.DisaggregatedData - CAS_51235-04-2 - ug/L
type: Concept
notation: WISE-SoE_WaterQuality.DisaggregatedData - CAS_51235-04-2 - ug/L
definition: The unit of measure for 'CAS_51235-04-2' (Hexazinone) in WISE SoE - Water Quality: Disaggregated data table is 'ug/L'
status: valid
status modified: 2019-10-03
accepted date: 2019-10-03
in scheme: Definition of correct units for the observed determinands in the given WISE SoE DD tables
has determinand: CAS 51235-04-2
has uom: ug.L-1
has table: WISE-SoE WaterQuality.DisaggregatedData

WISE-SoE_WaterQuality.DisaggregatedData - CAS_51908-16-8 - ug/L
type: Concept
notation: WISE-SoE_WaterQuality.DisaggregatedData - CAS_51908-16-8 - ug/L
definition: The unit of measure for 'CAS_51908-16-8' (PCB 146 (2,2',3,4',5,5'-Hexachlorobiphenyl)) in WISE SoE - Water Quality: Disaggregated data table is 'ug/L'
status: valid
status modified: 2019-10-03
accepted date: 2019-10-03
in scheme: Definition of correct units for the observed determinands in the given WISE SoE DD tables
has determinand: CAS 51908-16-8
has uom: ug.L-1
has table: WISE-SoE WaterQuality.DisaggregatedData

WISE-SoE_WaterQuality.DisaggregatedData - CAS_52-51-7 - ug/L
type: Concept
notation: WISE-SoE_WaterQuality.DisaggregatedData - CAS_52-51-7 - ug/L
definition: The unit of measure for 'CAS_52-51-7' (Bronopol) in WISE SoE - Water Quality: Disaggregated data table is 'ug/L'
status: valid
status modified: 2019-10-03
accepted date: 2019-10-03
in scheme: Definition of correct units for the observed determinands in the given WISE SoE DD tables
has determinand: CAS 52-51-7
has uom: ug.L-1
has table: WISE-SoE WaterQuality.DisaggregatedData

WISE-SoE_WaterQuality.DisaggregatedData - CAS_52-68-6 - ug/L
type: Concept
notation: WISE-SoE_WaterQuality.DisaggregatedData - CAS_52-68-6 - ug/L
definition: The unit of measure for 'CAS_52-68-6' (Trichlorfon) in WISE SoE - Water Quality: Disaggregated data table is 'ug/L'
status: valid
status modified: 2019-10-03
accepted date: 2019-10-03
in scheme: Definition of correct units for the observed determinands in the given WISE SoE DD tables
has determinand: CAS 52-68-6
has uom: ug.L-1
has table: WISE-SoE WaterQuality.DisaggregatedData

WISE-SoE_WaterQuality.DisaggregatedData - CAS_52236-30-3 - ug/L
type: Concept
notation: WISE-SoE_WaterQuality.DisaggregatedData - CAS_52236-30-3 - ug/L
definition: The unit of measure for 'CAS_52236-30-3' (Desamino-diketo-metribuzin) in WISE SoE - Water Quality: Disaggregated data table is 'ug/L'
status: valid
status modified: 2019-10-03
accepted date: 2019-10-03
in scheme: Definition of correct units for the observed determinands in the given WISE SoE DD tables
has determinand: CAS 52236-30-3
has uom: ug.L-1
has table: WISE-SoE WaterQuality.DisaggregatedData

WISE-SoE_WaterQuality.DisaggregatedData - CAS_52315-07-8 - ug/L
type: Concept
notation: WISE-SoE_WaterQuality.DisaggregatedData - CAS_52315-07-8 - ug/L
definition: The unit of measure for 'CAS_52315-07-8' (Cypermethrin) in WISE SoE - Water Quality: Disaggregated data table is 'ug/L'
status: valid
status modified: 2019-10-03
accepted date: 2019-10-03
in scheme: Definition of correct units for the observed determinands in the given WISE SoE DD tables
has determinand: CAS 52315-07-8
has uom: ug.L-1
has table: WISE-SoE WaterQuality.DisaggregatedData

WISE-SoE_WaterQuality.DisaggregatedData - CAS_525-66-6 - ug/L
type: Concept
notation: WISE-SoE_WaterQuality.DisaggregatedData - CAS_525-66-6 - ug/L
definition: The unit of measure for 'CAS_525-66-6' (Propranolol) in WISE SoE - Water Quality: Disaggregated data table is 'ug/L'
status: valid
status modified: 2019-10-03
accepted date: 2019-10-03
in scheme: Definition of correct units for the observed determinands in the given WISE SoE DD tables
has determinand: CAS 525-66-6
has uom: ug.L-1
has table: WISE-SoE WaterQuality.DisaggregatedData

WISE-SoE_WaterQuality.DisaggregatedData - CAS_526-75-0 - ug/L
type: Concept
notation: WISE-SoE_WaterQuality.DisaggregatedData - CAS_526-75-0 - ug/L
definition: The unit of measure for 'CAS_526-75-0' (2,3-dimethyl-phenol) in WISE SoE - Water Quality: Disaggregated data table is 'ug/L'
status: valid
status modified: 2019-10-03
accepted date: 2019-10-03
in scheme: Definition of correct units for the observed determinands in the given WISE SoE DD tables
has determinand: CAS 526-75-0
has uom: ug.L-1
has table: WISE-SoE WaterQuality.DisaggregatedData

WISE-SoE_WaterQuality.DisaggregatedData - CAS_52645-53-1 - ug/L
type: Concept
notation: WISE-SoE_WaterQuality.DisaggregatedData - CAS_52645-53-1 - ug/L
definition: The unit of measure for 'CAS_52645-53-1' (Permethrin-cis+trans) in WISE SoE - Water Quality: Disaggregated data table is 'ug/L'
status: valid
status modified: 2019-10-03
accepted date: 2019-10-03
in scheme: Definition of correct units for the observed determinands in the given WISE SoE DD tables
has determinand: CAS 52645-53-1
has uom: ug.L-1
has table: WISE-SoE WaterQuality.DisaggregatedData

WISE-SoE_WaterQuality.DisaggregatedData - CAS_52663-63-5 - ug/L
type: Concept
notation: WISE-SoE_WaterQuality.DisaggregatedData - CAS_52663-63-5 - ug/L
definition: The unit of measure for 'CAS_52663-63-5' (PCB 151 (2,2',3,5,5',6-Hexachlorobiphenyl)) in WISE SoE - Water Quality: Disaggregated data table is 'ug/L'
status: valid
status modified: 2019-10-03
accepted date: 2019-10-03
in scheme: Definition of correct units for the observed determinands in the given WISE SoE DD tables
has determinand: CAS 52663-63-5
has uom: ug.L-1
has table: WISE-SoE WaterQuality.DisaggregatedData

WISE-SoE_WaterQuality.DisaggregatedData - CAS_52663-68-0 - ug/L
type: Concept
notation: WISE-SoE_WaterQuality.DisaggregatedData - CAS_52663-68-0 - ug/L
definition: The unit of measure for 'CAS_52663-68-0' (PCB 187 (2,2',3,4',5,5',6-Heptachlorobiphenyl)) in WISE SoE - Water Quality: Disaggregated data table is 'ug/L'
status: valid
status modified: 2019-10-03
accepted date: 2019-10-03
in scheme: Definition of correct units for the observed determinands in the given WISE SoE DD tables
has determinand: CAS 52663-68-0
has uom: ug.L-1
has table: WISE-SoE WaterQuality.DisaggregatedData

WISE-SoE_WaterQuality.DisaggregatedData - CAS_52663-69-1 - ug/L
type: Concept
notation: WISE-SoE_WaterQuality.DisaggregatedData - CAS_52663-69-1 - ug/L
definition: The unit of measure for 'CAS_52663-69-1' (PCB 183 (82,2',3,4,4',5',6-Heptachloro-1,1'-biphenyl)) in WISE SoE - Water Quality: Disaggregated data table is 'ug/L'
status: valid
status modified: 2019-10-03
accepted date: 2019-10-03
in scheme: Definition of correct units for the observed determinands in the given WISE SoE DD tables
has determinand: CAS 52663-69-1
has uom: ug.L-1
has table: WISE-SoE WaterQuality.DisaggregatedData

WISE-SoE_WaterQuality.DisaggregatedData - CAS_52663-70-4 - ug/L
type: Concept
notation: WISE-SoE_WaterQuality.DisaggregatedData - CAS_52663-70-4 - ug/L
definition: The unit of measure for 'CAS_52663-70-4' (PCB 177 (3,3',4',5,6-Heptachlorobiphenyl)) in WISE SoE - Water Quality: Disaggregated data table is 'ug/L'
status: valid
status modified: 2019-10-03
accepted date: 2019-10-03
in scheme: Definition of correct units for the observed determinands in the given WISE SoE DD tables
has determinand: CAS 52663-70-4
has uom: ug.L-1
has table: WISE-SoE WaterQuality.DisaggregatedData

WISE-SoE_WaterQuality.DisaggregatedData - CAS_52663-72-6 - ug/L
type: Concept
notation: WISE-SoE_WaterQuality.DisaggregatedData - CAS_52663-72-6 - ug/L
definition: The unit of measure for 'CAS_52663-72-6' (PCB 167 (1,2,3-trichloro-5-(2,4,5-trichlorophenyl)benzene)) in WISE SoE - Water Quality: Disaggregated data table is 'ug/L'
status: valid
status modified: 2019-10-03
accepted date: 2019-10-03
in scheme: Definition of correct units for the observed determinands in the given WISE SoE DD tables
has determinand: CAS 52663-72-6
has uom: ug.L-1
has table: WISE-SoE WaterQuality.DisaggregatedData

WISE-SoE_WaterQuality.DisaggregatedData - CAS_52888-80-9 - ug/L
type: Concept
notation: WISE-SoE_WaterQuality.DisaggregatedData - CAS_52888-80-9 - ug/L
definition: The unit of measure for 'CAS_52888-80-9' (Prosulfocarb) in WISE SoE - Water Quality: Disaggregated data table is 'ug/L'
status: valid
status modified: 2019-10-03
accepted date: 2019-10-03
in scheme: Definition of correct units for the observed determinands in the given WISE SoE DD tables
has determinand: CAS 52888-80-9
has uom: ug.L-1
has table: WISE-SoE WaterQuality.DisaggregatedData

WISE-SoE_WaterQuality.DisaggregatedData - CAS_52918-63-5 - ug/L
type: Concept
notation: WISE-SoE_WaterQuality.DisaggregatedData - CAS_52918-63-5 - ug/L
definition: The unit of measure for 'CAS_52918-63-5' (Deltamethrin) in WISE SoE - Water Quality: Disaggregated data table is 'ug/L'
status: valid
status modified: 2019-10-03
accepted date: 2019-10-03
in scheme: Definition of correct units for the observed determinands in the given WISE SoE DD tables
has determinand: CAS 52918-63-5
has uom: ug.L-1
has table: WISE-SoE WaterQuality.DisaggregatedData

WISE-SoE_WaterQuality.DisaggregatedData - CAS_53-16-7 - ug/L
type: Concept
notation: WISE-SoE_WaterQuality.DisaggregatedData - CAS_53-16-7 - ug/L
definition: The unit of measure for 'CAS_53-16-7' (Estrone (E1)) in WISE SoE - Water Quality: Disaggregated data table is 'ug/L'
status: valid
status modified: 2019-10-03
accepted date: 2019-10-03
in scheme: Definition of correct units for the observed determinands in the given WISE SoE DD tables
has determinand: CAS 53-16-7
has uom: ug.L-1
has table: WISE-SoE WaterQuality.DisaggregatedData

WISE-SoE_WaterQuality.DisaggregatedData - CAS_53-19-0 - ug/L
type: Concept
notation: WISE-SoE_WaterQuality.DisaggregatedData - CAS_53-19-0 - ug/L
definition: The unit of measure for 'CAS_53-19-0' (o,p'-DDD) in WISE SoE - Water Quality: Disaggregated data table is 'ug/L'
status: valid
status modified: 2019-10-03
accepted date: 2019-10-03
in scheme: Definition of correct units for the observed determinands in the given WISE SoE DD tables
has determinand: CAS 53-19-0
has uom: ug.L-1
has table: WISE-SoE WaterQuality.DisaggregatedData

WISE-SoE_WaterQuality.DisaggregatedData - CAS_53-70-3 - ug/L
type: Concept
notation: WISE-SoE_WaterQuality.DisaggregatedData - CAS_53-70-3 - ug/L
definition: The unit of measure for 'CAS_53-70-3' (Dibenzo(a,h)anthracene) in WISE SoE - Water Quality: Disaggregated data table is 'ug/L'
status: valid
status modified: 2019-10-03
accepted date: 2019-10-03
in scheme: Definition of correct units for the observed determinands in the given WISE SoE DD tables
has determinand: CAS 53-70-3
has uom: ug.L-1
has table: WISE-SoE WaterQuality.DisaggregatedData

WISE-SoE_WaterQuality.DisaggregatedData - CAS_53112-28-0 - ug/L
type: Concept
notation: WISE-SoE_WaterQuality.DisaggregatedData - CAS_53112-28-0 - ug/L
definition: The unit of measure for 'CAS_53112-28-0' (Pyrimethanil) in WISE SoE - Water Quality: Disaggregated data table is 'ug/L'
status: valid
status modified: 2019-10-03
accepted date: 2019-10-03
in scheme: Definition of correct units for the observed determinands in the given WISE SoE DD tables
has determinand: CAS 53112-28-0
has uom: ug.L-1
has table: WISE-SoE WaterQuality.DisaggregatedData

WISE-SoE_WaterQuality.DisaggregatedData - CAS_534-52-1 - ug/L
type: Concept
notation: WISE-SoE_WaterQuality.DisaggregatedData - CAS_534-52-1 - ug/L
definition: The unit of measure for 'CAS_534-52-1' (Dinitro-o-cresol (DNOC)) in WISE SoE - Water Quality: Disaggregated data table is 'ug/L'
status: valid
status modified: 2019-10-03
accepted date: 2019-10-03
in scheme: Definition of correct units for the observed determinands in the given WISE SoE DD tables
has determinand: CAS 534-52-1
has uom: ug.L-1
has table: WISE-SoE WaterQuality.DisaggregatedData

WISE-SoE_WaterQuality.DisaggregatedData - CAS_5367-28-2 - ug/L
type: Concept
notation: WISE-SoE_WaterQuality.DisaggregatedData - CAS_5367-28-2 - ug/L
definition: The unit of measure for 'CAS_5367-28-2' (3-chloro-6-nitrotoluene) in WISE SoE - Water Quality: Disaggregated data table is 'ug/L'
status: valid
status modified: 2019-10-03
accepted date: 2019-10-03
in scheme: Definition of correct units for the observed determinands in the given WISE SoE DD tables
has determinand: CAS 5367-28-2
has uom: ug.L-1
has table: WISE-SoE WaterQuality.DisaggregatedData

WISE-SoE_WaterQuality.DisaggregatedData - CAS_540-59-0 - ug/L
type: Concept
notation: WISE-SoE_WaterQuality.DisaggregatedData - CAS_540-59-0 - ug/L
definition: The unit of measure for 'CAS_540-59-0' (1,2-dichloroethene) in WISE SoE - Water Quality: Disaggregated data table is 'ug/L'
status: valid
status modified: 2019-10-03
accepted date: 2019-10-03
in scheme: Definition of correct units for the observed determinands in the given WISE SoE DD tables
has determinand: CAS 540-59-0
has uom: ug.L-1
has table: WISE-SoE WaterQuality.DisaggregatedData

WISE-SoE_WaterQuality.DisaggregatedData - CAS_541-73-1 - ug/L
type: Concept
notation: WISE-SoE_WaterQuality.DisaggregatedData - CAS_541-73-1 - ug/L
definition: The unit of measure for 'CAS_541-73-1' (1,3-dichlorobenzene) in WISE SoE - Water Quality: Disaggregated data table is 'ug/L'
status: valid
status modified: 2019-10-03
accepted date: 2019-10-03
in scheme: Definition of correct units for the observed determinands in the given WISE SoE DD tables
has determinand: CAS 541-73-1
has uom: ug.L-1
has table: WISE-SoE WaterQuality.DisaggregatedData

WISE-SoE_WaterQuality.DisaggregatedData - CAS_542-75-6 - ug/L
type: Concept
notation: WISE-SoE_WaterQuality.DisaggregatedData - CAS_542-75-6 - ug/L
definition: The unit of measure for 'CAS_542-75-6' (1,3-dichloropropene) in WISE SoE - Water Quality: Disaggregated data table is 'ug/L'
status: valid
status modified: 2019-10-03
accepted date: 2019-10-03
in scheme: Definition of correct units for the observed determinands in the given WISE SoE DD tables
has determinand: CAS 542-75-6
has uom: ug.L-1
has table: WISE-SoE WaterQuality.DisaggregatedData

WISE-SoE_WaterQuality.DisaggregatedData - CAS_5436-43-1 - ug/L
type: Concept
notation: WISE-SoE_WaterQuality.DisaggregatedData - CAS_5436-43-1 - ug/L
definition: The unit of measure for 'CAS_5436-43-1' (BDE 47 (2,2’,4,4’-tetrabromodiphenyl ether)) in WISE SoE - Water Quality: Disaggregated data table is 'ug/L'
status: valid
status modified: 2019-10-03
accepted date: 2019-10-03
in scheme: Definition of correct units for the observed determinands in the given WISE SoE DD tables
has determinand: CAS 5436-43-1
has uom: ug.L-1
has table: WISE-SoE WaterQuality.DisaggregatedData

WISE-SoE_WaterQuality.DisaggregatedData - CAS_5466-77-3 - ug/L
type: Concept
notation: WISE-SoE_WaterQuality.DisaggregatedData - CAS_5466-77-3 - ug/L
definition: The unit of measure for 'CAS_5466-77-3' (2-Ethylhexyl 4-methoxycinnamate) in WISE SoE - Water Quality: Disaggregated data table is 'ug/L'
status: valid
status modified: 2019-10-03
accepted date: 2019-10-03
in scheme: Definition of correct units for the observed determinands in the given WISE SoE DD tables
has determinand: CAS 5466-77-3
has uom: ug.L-1
has table: WISE-SoE WaterQuality.DisaggregatedData

WISE-SoE_WaterQuality.DisaggregatedData - CAS_54910-89-3 - ug/L
type: Concept
notation: WISE-SoE_WaterQuality.DisaggregatedData - CAS_54910-89-3 - ug/L
definition: The unit of measure for 'CAS_54910-89-3' (Fluoxetine) in WISE SoE - Water Quality: Disaggregated data table is 'ug/L'
status: valid
status modified: 2019-10-03
accepted date: 2019-10-03
in scheme: Definition of correct units for the observed determinands in the given WISE SoE DD tables
has determinand: CAS 54910-89-3
has uom: ug.L-1
has table: WISE-SoE WaterQuality.DisaggregatedData

WISE-SoE_WaterQuality.DisaggregatedData - CAS_55-38-9 - ug/L
type: Concept
notation: WISE-SoE_WaterQuality.DisaggregatedData - CAS_55-38-9 - ug/L
definition: The unit of measure for 'CAS_55-38-9' (Fenthion) in WISE SoE - Water Quality: Disaggregated data table is 'ug/L'
status: valid
status modified: 2019-10-03
accepted date: 2019-10-03
in scheme: Definition of correct units for the observed determinands in the given WISE SoE DD tables
has determinand: CAS 55-38-9
has uom: ug.L-1
has table: WISE-SoE WaterQuality.DisaggregatedData

WISE-SoE_WaterQuality.DisaggregatedData - CAS_55179-31-2 - ug/L
type: Concept
notation: WISE-SoE_WaterQuality.DisaggregatedData - CAS_55179-31-2 - ug/L
definition: The unit of measure for 'CAS_55179-31-2' (Bitertanol) in WISE SoE - Water Quality: Disaggregated data table is 'ug/L'
status: valid
status modified: 2019-10-03
accepted date: 2019-10-03
in scheme: Definition of correct units for the observed determinands in the given WISE SoE DD tables
has determinand: CAS 55179-31-2
has uom: ug.L-1
has table: WISE-SoE WaterQuality.DisaggregatedData

WISE-SoE_WaterQuality.DisaggregatedData - CAS_55219-65-3 - ug/L
type: Concept
notation: WISE-SoE_WaterQuality.DisaggregatedData - CAS_55219-65-3 - ug/L
definition: The unit of measure for 'CAS_55219-65-3' (Triadimenol) in WISE SoE - Water Quality: Disaggregated data table is 'ug/L'
status: valid
status modified: 2019-10-03
accepted date: 2019-10-03
in scheme: Definition of correct units for the observed determinands in the given WISE SoE DD tables
has determinand: CAS 55219-65-3
has uom: ug.L-1
has table: WISE-SoE WaterQuality.DisaggregatedData

WISE-SoE_WaterQuality.DisaggregatedData - CAS_55335-06-3 - ug/L
type: Concept
notation: WISE-SoE_WaterQuality.DisaggregatedData - CAS_55335-06-3 - ug/L
definition: The unit of measure for 'CAS_55335-06-3' (Triclopyr) in WISE SoE - Water Quality: Disaggregated data table is 'ug/L'
status: valid
status modified: 2019-10-03
accepted date: 2019-10-03
in scheme: Definition of correct units for the observed determinands in the given WISE SoE DD tables
has determinand: CAS 55335-06-3
has uom: ug.L-1
has table: WISE-SoE WaterQuality.DisaggregatedData

WISE-SoE_WaterQuality.DisaggregatedData - CAS_554-00-7 - ug/L
type: Concept
notation: WISE-SoE_WaterQuality.DisaggregatedData - CAS_554-00-7 - ug/L
definition: The unit of measure for 'CAS_554-00-7' (2,4-dichloroaniline) in WISE SoE - Water Quality: Disaggregated data table is 'ug/L'
status: valid
status modified: 2019-10-03
accepted date: 2019-10-03
in scheme: Definition of correct units for the observed determinands in the given WISE SoE DD tables
has determinand: CAS 554-00-7
has uom: ug.L-1
has table: WISE-SoE WaterQuality.DisaggregatedData

WISE-SoE_WaterQuality.DisaggregatedData - CAS_555-37-3 - ug/L
type: Concept
notation: WISE-SoE_WaterQuality.DisaggregatedData - CAS_555-37-3 - ug/L
definition: The unit of measure for 'CAS_555-37-3' (Neburon) in WISE SoE - Water Quality: Disaggregated data table is 'ug/L'
status: valid
status modified: 2019-10-03
accepted date: 2019-10-03
in scheme: Definition of correct units for the observed determinands in the given WISE SoE DD tables
has determinand: CAS 555-37-3
has uom: ug.L-1
has table: WISE-SoE WaterQuality.DisaggregatedData

WISE-SoE_WaterQuality.DisaggregatedData - CAS_55512-33-9 - ug/L
type: Concept
notation: WISE-SoE_WaterQuality.DisaggregatedData - CAS_55512-33-9 - ug/L
definition: The unit of measure for 'CAS_55512-33-9' (Pyridate) in WISE SoE - Water Quality: Disaggregated data table is 'ug/L'
status: valid
status modified: 2019-10-03
accepted date: 2019-10-03
in scheme: Definition of correct units for the observed determinands in the given WISE SoE DD tables
has determinand: CAS 55512-33-9
has uom: ug.L-1
has table: WISE-SoE WaterQuality.DisaggregatedData

WISE-SoE_WaterQuality.DisaggregatedData - CAS_55525-54-7 - ug/L
type: Concept
notation: WISE-SoE_WaterQuality.DisaggregatedData - CAS_55525-54-7 - ug/L
definition: The unit of measure for 'CAS_55525-54-7' (3,3’-(ureylenedimethylene)bis(3,5,5’- trimethylcyclohexyl) diisocyanate) in WISE SoE - Water Quality: Disaggregated data table is 'ug/L'
status: valid
status modified: 2019-10-03
accepted date: 2019-10-03
in scheme: Definition of correct units for the observed determinands in the given WISE SoE DD tables
has determinand: CAS 55525-54-7
has uom: ug.L-1
has table: WISE-SoE WaterQuality.DisaggregatedData

WISE-SoE_WaterQuality.DisaggregatedData - CAS_556-88-7 - ug/L
type: Concept
notation: WISE-SoE_WaterQuality.DisaggregatedData - CAS_556-88-7 - ug/L
definition: The unit of measure for 'CAS_556-88-7' (Nitroguanidine) in WISE SoE - Water Quality: Disaggregated data table is 'ug/L'
status: valid
status modified: 2019-10-03
accepted date: 2019-10-03
in scheme: Definition of correct units for the observed determinands in the given WISE SoE DD tables
has determinand: CAS 556-88-7
has uom: ug.L-1
has table: WISE-SoE WaterQuality.DisaggregatedData

WISE-SoE_WaterQuality.DisaggregatedData - CAS_55673-89-7 - ug/L
type: Concept
notation: WISE-SoE_WaterQuality.DisaggregatedData - CAS_55673-89-7 - ug/L
definition: The unit of measure for 'CAS_55673-89-7' (1,2,3,4,7,8,9-H7CDF) in WISE SoE - Water Quality: Disaggregated data table is 'ug/L'
status: valid
status modified: 2019-10-03
accepted date: 2019-10-03
in scheme: Definition of correct units for the observed determinands in the given WISE SoE DD tables
has determinand: CAS 55673-89-7
has uom: ug.L-1
has table: WISE-SoE WaterQuality.DisaggregatedData

WISE-SoE_WaterQuality.DisaggregatedData - CAS_5598-13-0 - ug/L
type: Concept
notation: WISE-SoE_WaterQuality.DisaggregatedData - CAS_5598-13-0 - ug/L
definition: The unit of measure for 'CAS_5598-13-0' (Chlorpyrifos-methyl) in WISE SoE - Water Quality: Disaggregated data table is 'ug/L'
status: valid
status modified: 2019-10-03
accepted date: 2019-10-03
in scheme: Definition of correct units for the observed determinands in the given WISE SoE DD tables
has determinand: CAS 5598-13-0
has uom: ug.L-1
has table: WISE-SoE WaterQuality.DisaggregatedData

WISE-SoE_WaterQuality.DisaggregatedData - CAS_56-23-5 - ug/L
type: Concept
notation: WISE-SoE_WaterQuality.DisaggregatedData - CAS_56-23-5 - ug/L
definition: The unit of measure for 'CAS_56-23-5' (Carbon tetrachloride) in WISE SoE - Water Quality: Disaggregated data table is 'ug/L'
status: valid
status modified: 2019-10-03
accepted date: 2019-10-03
in scheme: Definition of correct units for the observed determinands in the given WISE SoE DD tables
has determinand: CAS 56-23-5
has uom: ug.L-1
has table: WISE-SoE WaterQuality.DisaggregatedData

WISE-SoE_WaterQuality.DisaggregatedData - CAS_56-38-2 - ug/L
type: Concept
notation: WISE-SoE_WaterQuality.DisaggregatedData - CAS_56-38-2 - ug/L
definition: The unit of measure for 'CAS_56-38-2' (Parathion) in WISE SoE - Water Quality: Disaggregated data table is 'ug/L'
status: valid
status modified: 2019-10-03
accepted date: 2019-10-03
in scheme: Definition of correct units for the observed determinands in the given WISE SoE DD tables
has determinand: CAS 56-38-2
has uom: ug.L-1
has table: WISE-SoE WaterQuality.DisaggregatedData

WISE-SoE_WaterQuality.DisaggregatedData - CAS_56-55-3 - ug/L
type: Concept
notation: WISE-SoE_WaterQuality.DisaggregatedData - CAS_56-55-3 - ug/L
definition: The unit of measure for 'CAS_56-55-3' (Benzo(a)anthracene) in WISE SoE - Water Quality: Disaggregated data table is 'ug/L'
status: valid
status modified: 2019-10-03
accepted date: 2019-10-03
in scheme: Definition of correct units for the observed determinands in the given WISE SoE DD tables
has determinand: CAS 56-55-3
has uom: ug.L-1
has table: WISE-SoE WaterQuality.DisaggregatedData

WISE-SoE_WaterQuality.DisaggregatedData - CAS_56-72-4 - ug/L
type: Concept
notation: WISE-SoE_WaterQuality.DisaggregatedData - CAS_56-72-4 - ug/L
definition: The unit of measure for 'CAS_56-72-4' (Coumaphos) in WISE SoE - Water Quality: Disaggregated data table is 'ug/L'
status: valid
status modified: 2019-10-03
accepted date: 2019-10-03
in scheme: Definition of correct units for the observed determinands in the given WISE SoE DD tables
has determinand: CAS 56-72-4
has uom: ug.L-1
has table: WISE-SoE WaterQuality.DisaggregatedData

WISE-SoE_WaterQuality.DisaggregatedData - CAS_563-12-2 - ug/L
type: Concept
notation: WISE-SoE_WaterQuality.DisaggregatedData - CAS_563-12-2 - ug/L
definition: The unit of measure for 'CAS_563-12-2' (Ethion) in WISE SoE - Water Quality: Disaggregated data table is 'ug/L'
status: valid
status modified: 2019-10-03
accepted date: 2019-10-03
in scheme: Definition of correct units for the observed determinands in the given WISE SoE DD tables
has determinand: CAS 563-12-2
has uom: ug.L-1
has table: WISE-SoE WaterQuality.DisaggregatedData

WISE-SoE_WaterQuality.DisaggregatedData - CAS_563-58-6 - ug/L
type: Concept
notation: WISE-SoE_WaterQuality.DisaggregatedData - CAS_563-58-6 - ug/L
definition: The unit of measure for 'CAS_563-58-6' (1,1-dichloropropene) in WISE SoE - Water Quality: Disaggregated data table is 'ug/L'
status: valid
status modified: 2019-10-03
accepted date: 2019-10-03
in scheme: Definition of correct units for the observed determinands in the given WISE SoE DD tables
has determinand: CAS 563-58-6
has uom: ug.L-1
has table: WISE-SoE WaterQuality.DisaggregatedData

WISE-SoE_WaterQuality.DisaggregatedData - CAS_56507-37-0 - ug/L
type: Concept
notation: WISE-SoE_WaterQuality.DisaggregatedData - CAS_56507-37-0 - ug/L
definition: The unit of measure for 'CAS_56507-37-0' (Diketo-metribuzin) in WISE SoE - Water Quality: Disaggregated data table is 'ug/L'
status: valid
status modified: 2019-10-03
accepted date: 2019-10-03
in scheme: Definition of correct units for the observed determinands in the given WISE SoE DD tables
has determinand: CAS 56507-37-0
has uom: ug.L-1
has table: WISE-SoE WaterQuality.DisaggregatedData

WISE-SoE_WaterQuality.DisaggregatedData - CAS_57-12-5 - ug/L
type: Concept
notation: WISE-SoE_WaterQuality.DisaggregatedData - CAS_57-12-5 - ug/L
definition: The unit of measure for 'CAS_57-12-5' (Free cyanide) in WISE SoE - Water Quality: Disaggregated data table is 'ug/L'
status: valid
status modified: 2019-10-03
accepted date: 2019-10-03
in scheme: Definition of correct units for the observed determinands in the given WISE SoE DD tables
has determinand: CAS 57-12-5
has uom: ug.L-1
has table: WISE-SoE WaterQuality.DisaggregatedData

WISE-SoE_WaterQuality.DisaggregatedData - CAS_57-63-6 - ug/L
type: Concept
notation: WISE-SoE_WaterQuality.DisaggregatedData - CAS_57-63-6 - ug/L
definition: The unit of measure for 'CAS_57-63-6' (17alpha-ethinylestradiol (EE2)) in WISE SoE - Water Quality: Disaggregated data table is 'ug/L'
status: valid
status modified: 2019-10-03
accepted date: 2019-10-03
in scheme: Definition of correct units for the observed determinands in the given WISE SoE DD tables
has determinand: CAS 57-63-6
has uom: ug.L-1
has table: WISE-SoE WaterQuality.DisaggregatedData

WISE-SoE_WaterQuality.DisaggregatedData - CAS_57-74-9 - ug/L
type: Concept
notation: WISE-SoE_WaterQuality.DisaggregatedData - CAS_57-74-9 - ug/L
definition: The unit of measure for 'CAS_57-74-9' (Chlordane) in WISE SoE - Water Quality: Disaggregated data table is 'ug/L'
status: valid
status modified: 2019-10-03
accepted date: 2019-10-03
in scheme: Definition of correct units for the observed determinands in the given WISE SoE DD tables
has determinand: CAS 57-74-9
has uom: ug.L-1
has table: WISE-SoE WaterQuality.DisaggregatedData

WISE-SoE_WaterQuality.DisaggregatedData - CAS_57018-04-9 - ug/L
type: Concept
notation: WISE-SoE_WaterQuality.DisaggregatedData - CAS_57018-04-9 - ug/L
definition: The unit of measure for 'CAS_57018-04-9' (Tolclofos methyl) in WISE SoE - Water Quality: Disaggregated data table is 'ug/L'
status: valid
status modified: 2019-10-03
accepted date: 2019-10-03
in scheme: Definition of correct units for the observed determinands in the given WISE SoE DD tables
has determinand: CAS 57018-04-9
has uom: ug.L-1
has table: WISE-SoE WaterQuality.DisaggregatedData

WISE-SoE_WaterQuality.DisaggregatedData - CAS_57117-31-4 - ug/L
type: Concept
notation: WISE-SoE_WaterQuality.DisaggregatedData - CAS_57117-31-4 - ug/L
definition: The unit of measure for 'CAS_57117-31-4' (2,3,4,7,8-P5CDF) in WISE SoE - Water Quality: Disaggregated data table is 'ug/L'
status: valid
status modified: 2019-10-03
accepted date: 2019-10-03
in scheme: Definition of correct units for the observed determinands in the given WISE SoE DD tables
has determinand: CAS 57117-31-4
has uom: ug.L-1
has table: WISE-SoE WaterQuality.DisaggregatedData

WISE-SoE_WaterQuality.DisaggregatedData - CAS_57117-41-6 - ug/L
type: Concept
notation: WISE-SoE_WaterQuality.DisaggregatedData - CAS_57117-41-6 - ug/L
definition: The unit of measure for 'CAS_57117-41-6' (1,2,3,7,8-P5CDF) in WISE SoE - Water Quality: Disaggregated data table is 'ug/L'
status: valid
status modified: 2019-10-03
accepted date: 2019-10-03
in scheme: Definition of correct units for the observed determinands in the given WISE SoE DD tables
has determinand: CAS 57117-41-6
has uom: ug.L-1
has table: WISE-SoE WaterQuality.DisaggregatedData

WISE-SoE_WaterQuality.DisaggregatedData - CAS_57117-44-9 - ug/L
type: Concept
notation: WISE-SoE_WaterQuality.DisaggregatedData - CAS_57117-44-9 - ug/L
definition: The unit of measure for 'CAS_57117-44-9' (1,2,3,6,7,8-H6CDF) in WISE SoE - Water Quality: Disaggregated data table is 'ug/L'
status: valid
status modified: 2019-10-03
accepted date: 2019-10-03
in scheme: Definition of correct units for the observed determinands in the given WISE SoE DD tables
has determinand: CAS 57117-44-9
has uom: ug.L-1
has table: WISE-SoE WaterQuality.DisaggregatedData

WISE-SoE_WaterQuality.DisaggregatedData - CAS_57465-28-8 - ug/L
type: Concept
notation: WISE-SoE_WaterQuality.DisaggregatedData - CAS_57465-28-8 - ug/L
definition: The unit of measure for 'CAS_57465-28-8' (PCB 126 (3,3’,4,4’,5-pentachlorobiphenyl)) in WISE SoE - Water Quality: Disaggregated data table is 'ug/L'
status: valid
status modified: 2019-10-03
accepted date: 2019-10-03
in scheme: Definition of correct units for the observed determinands in the given WISE SoE DD tables
has determinand: CAS 57465-28-8
has uom: ug.L-1
has table: WISE-SoE WaterQuality.DisaggregatedData

WISE-SoE_WaterQuality.DisaggregatedData - CAS_576-26-1 - ug/L
type: Concept
notation: WISE-SoE_WaterQuality.DisaggregatedData - CAS_576-26-1 - ug/L
definition: The unit of measure for 'CAS_576-26-1' (2,6-dimethyl-phenol) in WISE SoE - Water Quality: Disaggregated data table is 'ug/L'
status: valid
status modified: 2019-10-03
accepted date: 2019-10-03
in scheme: Definition of correct units for the observed determinands in the given WISE SoE DD tables
has determinand: CAS 576-26-1
has uom: ug.L-1
has table: WISE-SoE WaterQuality.DisaggregatedData

WISE-SoE_WaterQuality.DisaggregatedData - CAS_57646-30-7 - ug/L
type: Concept
notation: WISE-SoE_WaterQuality.DisaggregatedData - CAS_57646-30-7 - ug/L
definition: The unit of measure for 'CAS_57646-30-7' (Furalaxyl) in WISE SoE - Water Quality: Disaggregated data table is 'ug/L'
status: valid
status modified: 2019-10-03
accepted date: 2019-10-03
in scheme: Definition of correct units for the observed determinands in the given WISE SoE DD tables
has determinand: CAS 57646-30-7
has uom: ug.L-1
has table: WISE-SoE WaterQuality.DisaggregatedData

WISE-SoE_WaterQuality.DisaggregatedData - CAS_57653-85-7 - ug/L
type: Concept
notation: WISE-SoE_WaterQuality.DisaggregatedData - CAS_57653-85-7 - ug/L
definition: The unit of measure for 'CAS_57653-85-7' (1,2,3,6,7,8-H6CDD) in WISE SoE - Water Quality: Disaggregated data table is 'ug/L'
status: valid
status modified: 2019-10-03
accepted date: 2019-10-03
in scheme: Definition of correct units for the observed determinands in the given WISE SoE DD tables
has determinand: CAS 57653-85-7
has uom: ug.L-1
has table: WISE-SoE WaterQuality.DisaggregatedData

WISE-SoE_WaterQuality.DisaggregatedData - CAS_57837-19-1 - ug/L
type: Concept
notation: WISE-SoE_WaterQuality.DisaggregatedData - CAS_57837-19-1 - ug/L
definition: The unit of measure for 'CAS_57837-19-1' (Metalaxyl) in WISE SoE - Water Quality: Disaggregated data table is 'ug/L'
status: valid
status modified: 2019-10-03
accepted date: 2019-10-03
in scheme: Definition of correct units for the observed determinands in the given WISE SoE DD tables
has determinand: CAS 57837-19-1
has uom: ug.L-1
has table: WISE-SoE WaterQuality.DisaggregatedData

WISE-SoE_WaterQuality.DisaggregatedData - CAS_57966-95-7 - ug/L
type: Concept
notation: WISE-SoE_WaterQuality.DisaggregatedData - CAS_57966-95-7 - ug/L
definition: The unit of measure for 'CAS_57966-95-7' (Cymoxanil) in WISE SoE - Water Quality: Disaggregated data table is 'ug/L'
status: valid
status modified: 2019-10-03
accepted date: 2019-10-03
in scheme: Definition of correct units for the observed determinands in the given WISE SoE DD tables
has determinand: CAS 57966-95-7
has uom: ug.L-1
has table: WISE-SoE WaterQuality.DisaggregatedData

WISE-SoE_WaterQuality.DisaggregatedData - CAS_58-08-2 - ug/L
type: Concept
notation: WISE-SoE_WaterQuality.DisaggregatedData - CAS_58-08-2 - ug/L
definition: The unit of measure for 'CAS_58-08-2' (Caffeine) in WISE SoE - Water Quality: Disaggregated data table is 'ug/L'
status: valid
status modified: 2019-10-03
accepted date: 2019-10-03
in scheme: Definition of correct units for the observed determinands in the given WISE SoE DD tables
has determinand: CAS 58-08-2
has uom: ug.L-1
has table: WISE-SoE WaterQuality.DisaggregatedData

WISE-SoE_WaterQuality.DisaggregatedData - CAS_58-89-9 - ug/L
type: Concept
notation: WISE-SoE_WaterQuality.DisaggregatedData - CAS_58-89-9 - ug/L
definition: The unit of measure for 'CAS_58-89-9' (Gamma-HCH (Lindane)) in WISE SoE - Water Quality: Disaggregated data table is 'ug/L'
status: valid
status modified: 2019-10-03
accepted date: 2019-10-03
in scheme: Definition of correct units for the observed determinands in the given WISE SoE DD tables
has determinand: CAS 58-89-9
has uom: ug.L-1
has table: WISE-SoE WaterQuality.DisaggregatedData

WISE-SoE_WaterQuality.DisaggregatedData - CAS_58-90-2 - ug/L
type: Concept
notation: WISE-SoE_WaterQuality.DisaggregatedData - CAS_58-90-2 - ug/L
definition: The unit of measure for 'CAS_58-90-2' (2,3,4,6-tetrachlorophenol) in WISE SoE - Water Quality: Disaggregated data table is 'ug/L'
status: valid
status modified: 2019-10-03
accepted date: 2019-10-03
in scheme: Definition of correct units for the observed determinands in the given WISE SoE DD tables
has determinand: CAS 58-90-2
has uom: ug.L-1
has table: WISE-SoE WaterQuality.DisaggregatedData

WISE-SoE_WaterQuality.DisaggregatedData - CAS_59-50-7 - ug/L
type: Concept
notation: WISE-SoE_WaterQuality.DisaggregatedData - CAS_59-50-7 - ug/L
definition: The unit of measure for 'CAS_59-50-7' (3-methyl-4-chlorophenol) in WISE SoE - Water Quality: Disaggregated data table is 'ug/L'
status: valid
status modified: 2019-10-03
accepted date: 2019-10-03
in scheme: Definition of correct units for the observed determinands in the given WISE SoE DD tables
has determinand: CAS 59-50-7
has uom: ug.L-1
has table: WISE-SoE WaterQuality.DisaggregatedData

WISE-SoE_WaterQuality.DisaggregatedData - CAS_5915-41-3 - ug/L
type: Concept
notation: WISE-SoE_WaterQuality.DisaggregatedData - CAS_5915-41-3 - ug/L
definition: The unit of measure for 'CAS_5915-41-3' (Terbuthylazine) in WISE SoE - Water Quality: Disaggregated data table is 'ug/L'
status: valid
status modified: 2019-10-03
accepted date: 2019-10-03
in scheme: Definition of correct units for the observed determinands in the given WISE SoE DD tables
has determinand: CAS 5915-41-3
has uom: ug.L-1
has table: WISE-SoE WaterQuality.DisaggregatedData

WISE-SoE_WaterQuality.DisaggregatedData - CAS_594-20-7 - ug/L
type: Concept
notation: WISE-SoE_WaterQuality.DisaggregatedData - CAS_594-20-7 - ug/L
definition: The unit of measure for 'CAS_594-20-7' (2,2-dichloropropane) in WISE SoE - Water Quality: Disaggregated data table is 'ug/L'
status: valid
status modified: 2019-10-03
accepted date: 2019-10-03
in scheme: Definition of correct units for the observed determinands in the given WISE SoE DD tables
has determinand: CAS 594-20-7
has uom: ug.L-1
has table: WISE-SoE WaterQuality.DisaggregatedData

WISE-SoE_WaterQuality.DisaggregatedData - CAS_59473-04-0 - ug/L
type: Concept
notation: WISE-SoE_WaterQuality.DisaggregatedData - CAS_59473-04-0 - ug/L
definition: The unit of measure for 'CAS_59473-04-0' (AOX) in WISE SoE - Water Quality: Disaggregated data table is 'ug/L'
status: valid
status modified: 2019-10-03
accepted date: 2019-10-03
in scheme: Definition of correct units for the observed determinands in the given WISE SoE DD tables
has determinand: CAS 59473-04-0
has uom: ug.L-1
has table: WISE-SoE WaterQuality.DisaggregatedData

WISE-SoE_WaterQuality.DisaggregatedData - CAS_60-00-4 - ug/L
type: Concept
notation: WISE-SoE_WaterQuality.DisaggregatedData - CAS_60-00-4 - ug/L
definition: The unit of measure for 'CAS_60-00-4' (EDTA) in WISE SoE - Water Quality: Disaggregated data table is 'ug/L'
status: valid
status modified: 2019-10-03
accepted date: 2019-10-03
in scheme: Definition of correct units for the observed determinands in the given WISE SoE DD tables
has determinand: CAS 60-00-4
has uom: ug.L-1
has table: WISE-SoE WaterQuality.DisaggregatedData

WISE-SoE_WaterQuality.DisaggregatedData - CAS_60-51-5 - ug/L
type: Concept
notation: WISE-SoE_WaterQuality.DisaggregatedData - CAS_60-51-5 - ug/L
definition: The unit of measure for 'CAS_60-51-5' (Dimethoate) in WISE SoE - Water Quality: Disaggregated data table is 'ug/L'
status: valid
status modified: 2019-10-03
accepted date: 2019-10-03
in scheme: Definition of correct units for the observed determinands in the given WISE SoE DD tables
has determinand: CAS 60-51-5
has uom: ug.L-1
has table: WISE-SoE WaterQuality.DisaggregatedData

WISE-SoE_WaterQuality.DisaggregatedData - CAS_60-57-1 - ug/L
type: Concept
notation: WISE-SoE_WaterQuality.DisaggregatedData - CAS_60-57-1 - ug/L
definition: The unit of measure for 'CAS_60-57-1' (Dieldrin) in WISE SoE - Water Quality: Disaggregated data table is 'ug/L'
status: valid
status modified: 2019-10-03
accepted date: 2019-10-03
in scheme: Definition of correct units for the observed determinands in the given WISE SoE DD tables
has determinand: CAS 60-57-1
has uom: ug.L-1
has table: WISE-SoE WaterQuality.DisaggregatedData

WISE-SoE_WaterQuality.DisaggregatedData - CAS_60145-21-3 - ug/L
type: Concept
notation: WISE-SoE_WaterQuality.DisaggregatedData - CAS_60145-21-3 - ug/L
definition: The unit of measure for 'CAS_60145-21-3' (PCB 103 (2,2',4,5',6-pentachlorobiphenyl)) in WISE SoE - Water Quality: Disaggregated data table is 'ug/L'
status: valid
status modified: 2019-10-03
accepted date: 2019-10-03
in scheme: Definition of correct units for the observed determinands in the given WISE SoE DD tables
has determinand: CAS 60145-21-3
has uom: ug.L-1
has table: WISE-SoE WaterQuality.DisaggregatedData

WISE-SoE_WaterQuality.DisaggregatedData - CAS_60168-88-9 - ug/L
type: Concept
notation: WISE-SoE_WaterQuality.DisaggregatedData - CAS_60168-88-9 - ug/L
definition: The unit of measure for 'CAS_60168-88-9' (Fenarimol) in WISE SoE - Water Quality: Disaggregated data table is 'ug/L'
status: valid
status modified: 2019-10-03
accepted date: 2019-10-03
in scheme: Definition of correct units for the observed determinands in the given WISE SoE DD tables
has determinand: CAS 60168-88-9
has uom: ug.L-1
has table: WISE-SoE WaterQuality.DisaggregatedData

WISE-SoE_WaterQuality.DisaggregatedData - CAS_60207-90-1 - ug/L
type: Concept
notation: WISE-SoE_WaterQuality.DisaggregatedData - CAS_60207-90-1 - ug/L
definition: The unit of measure for 'CAS_60207-90-1' (Propiconazole) in WISE SoE - Water Quality: Disaggregated data table is 'ug/L'
status: valid
status modified: 2019-10-03
accepted date: 2019-10-03
in scheme: Definition of correct units for the observed determinands in the given WISE SoE DD tables
has determinand: CAS 60207-90-1
has uom: ug.L-1
has table: WISE-SoE WaterQuality.DisaggregatedData

WISE-SoE_WaterQuality.DisaggregatedData - CAS_603-35-0 - ug/L
type: Concept
notation: WISE-SoE_WaterQuality.DisaggregatedData - CAS_603-35-0 - ug/L
definition: The unit of measure for 'CAS_603-35-0' (Triphenyl phosphine) in WISE SoE - Water Quality: Disaggregated data table is 'ug/L'
status: valid
status modified: 2019-10-03
accepted date: 2019-10-03
in scheme: Definition of correct units for the observed determinands in the given WISE SoE DD tables
has determinand: CAS 603-35-0
has uom: ug.L-1
has table: WISE-SoE WaterQuality.DisaggregatedData

WISE-SoE_WaterQuality.DisaggregatedData - CAS_60348-60-9 - ug/L
type: Concept
notation: WISE-SoE_WaterQuality.DisaggregatedData - CAS_60348-60-9 - ug/L
definition: The unit of measure for 'CAS_60348-60-9' (BDE 99 (2,2’,4,4’,5-pentabromodiphenyl ether)) in WISE SoE - Water Quality: Disaggregated data table is 'ug/L'
status: valid
status modified: 2019-10-03
accepted date: 2019-10-03
in scheme: Definition of correct units for the observed determinands in the given WISE SoE DD tables
has determinand: CAS 60348-60-9
has uom: ug.L-1
has table: WISE-SoE WaterQuality.DisaggregatedData

WISE-SoE_WaterQuality.DisaggregatedData - CAS_608-27-5 - ug/L
type: Concept
notation: WISE-SoE_WaterQuality.DisaggregatedData - CAS_608-27-5 - ug/L
definition: The unit of measure for 'CAS_608-27-5' (2,3-Dichloroaniline) in WISE SoE - Water Quality: Disaggregated data table is 'ug/L'
status: valid
status modified: 2019-10-03
accepted date: 2019-10-03
in scheme: Definition of correct units for the observed determinands in the given WISE SoE DD tables
has determinand: CAS 608-27-5
has uom: ug.L-1
has table: WISE-SoE WaterQuality.DisaggregatedData

WISE-SoE_WaterQuality.DisaggregatedData - CAS_608-31-1 - ug/L
type: Concept
notation: WISE-SoE_WaterQuality.DisaggregatedData - CAS_608-31-1 - ug/L
definition: The unit of measure for 'CAS_608-31-1' (2,6-Dichloroaniline) in WISE SoE - Water Quality: Disaggregated data table is 'ug/L'
status: valid
status modified: 2019-10-03
accepted date: 2019-10-03
in scheme: Definition of correct units for the observed determinands in the given WISE SoE DD tables
has determinand: CAS 608-31-1
has uom: ug.L-1
has table: WISE-SoE WaterQuality.DisaggregatedData

WISE-SoE_WaterQuality.DisaggregatedData - CAS_608-73-1 - ug/L
type: Concept
notation: WISE-SoE_WaterQuality.DisaggregatedData - CAS_608-73-1 - ug/L
definition: The unit of measure for 'CAS_608-73-1' (Hexachlorocyclohexane) in WISE SoE - Water Quality: Disaggregated data table is 'ug/L'
status: valid
status modified: 2019-10-03
accepted date: 2019-10-03
in scheme: Definition of correct units for the observed determinands in the given WISE SoE DD tables
has determinand: CAS 608-73-1
has uom: ug.L-1
has table: WISE-SoE WaterQuality.DisaggregatedData

WISE-SoE_WaterQuality.DisaggregatedData - CAS_608-93-5 - ug/L
type: Concept
notation: WISE-SoE_WaterQuality.DisaggregatedData - CAS_608-93-5 - ug/L
definition: The unit of measure for 'CAS_608-93-5' (Pentachlorobenzene) in WISE SoE - Water Quality: Disaggregated data table is 'ug/L'
status: valid
status modified: 2019-10-03
accepted date: 2019-10-03
in scheme: Definition of correct units for the observed determinands in the given WISE SoE DD tables
has determinand: CAS 608-93-5
has uom: ug.L-1
has table: WISE-SoE WaterQuality.DisaggregatedData

WISE-SoE_WaterQuality.DisaggregatedData - CAS_60851-34-5 - ug/L
type: Concept
notation: WISE-SoE_WaterQuality.DisaggregatedData - CAS_60851-34-5 - ug/L
definition: The unit of measure for 'CAS_60851-34-5' (2,3,4,6,7,8-H6CDF) in WISE SoE - Water Quality: Disaggregated data table is 'ug/L'
status: valid
status modified: 2019-10-03
accepted date: 2019-10-03
in scheme: Definition of correct units for the observed determinands in the given WISE SoE DD tables
has determinand: CAS 60851-34-5
has uom: ug.L-1
has table: WISE-SoE WaterQuality.DisaggregatedData

WISE-SoE_WaterQuality.DisaggregatedData - CAS_609-19-8 - ug/L
type: Concept
notation: WISE-SoE_WaterQuality.DisaggregatedData - CAS_609-19-8 - ug/L
definition: The unit of measure for 'CAS_609-19-8' (3,4,5-Trichlorophenol) in WISE SoE - Water Quality: Disaggregated data table is 'ug/L'
status: valid
status modified: 2019-10-03
accepted date: 2019-10-03
in scheme: Definition of correct units for the observed determinands in the given WISE SoE DD tables
has determinand: CAS 609-19-8
has uom: ug.L-1
has table: WISE-SoE WaterQuality.DisaggregatedData

WISE-SoE_WaterQuality.DisaggregatedData - CAS_6108-10-7 - ug/L
type: Concept
notation: WISE-SoE_WaterQuality.DisaggregatedData - CAS_6108-10-7 - ug/L
definition: The unit of measure for 'CAS_6108-10-7' (Epsilon-HCH) in WISE SoE - Water Quality: Disaggregated data table is 'ug/L'
status: valid
status modified: 2019-10-03
accepted date: 2019-10-03
in scheme: Definition of correct units for the observed determinands in the given WISE SoE DD tables
has determinand: CAS 6108-10-7
has uom: ug.L-1
has table: WISE-SoE WaterQuality.DisaggregatedData

WISE-SoE_WaterQuality.DisaggregatedData - CAS_611-06-3 - ug/L
type: Concept
notation: WISE-SoE_WaterQuality.DisaggregatedData - CAS_611-06-3 - ug/L
definition: The unit of measure for 'CAS_611-06-3' (2,4-Dichloro-1-nitrobenzene) in WISE SoE - Water Quality: Disaggregated data table is 'ug/L'
status: valid
status modified: 2019-10-03
accepted date: 2019-10-03
in scheme: Definition of correct units for the observed determinands in the given WISE SoE DD tables
has determinand: CAS 611-06-3
has uom: ug.L-1
has table: WISE-SoE WaterQuality.DisaggregatedData

WISE-SoE_WaterQuality.DisaggregatedData - CAS_615-65-6 - ug/L
type: Concept
notation: WISE-SoE_WaterQuality.DisaggregatedData - CAS_615-65-6 - ug/L
definition: The unit of measure for 'CAS_615-65-6' (2-Chloro-4-methylaniline) in WISE SoE - Water Quality: Disaggregated data table is 'ug/L'
status: valid
status modified: 2019-10-03
accepted date: 2019-10-03
in scheme: Definition of correct units for the observed determinands in the given WISE SoE DD tables
has determinand: CAS 615-65-6
has uom: ug.L-1
has table: WISE-SoE WaterQuality.DisaggregatedData

WISE-SoE_WaterQuality.DisaggregatedData - CAS_6164-98-3 - ug/L
type: Concept
notation: WISE-SoE_WaterQuality.DisaggregatedData - CAS_6164-98-3 - ug/L
definition: The unit of measure for 'CAS_6164-98-3' (Chlordimeform) in WISE SoE - Water Quality: Disaggregated data table is 'ug/L'
status: valid
status modified: 2019-10-03
accepted date: 2019-10-03
in scheme: Definition of correct units for the observed determinands in the given WISE SoE DD tables
has determinand: CAS 6164-98-3
has uom: ug.L-1
has table: WISE-SoE WaterQuality.DisaggregatedData

WISE-SoE_WaterQuality.DisaggregatedData - CAS_6190-65-4 - ug/L
type: Concept
notation: WISE-SoE_WaterQuality.DisaggregatedData - CAS_6190-65-4 - ug/L
definition: The unit of measure for 'CAS_6190-65-4' (Desethylatrazine) in WISE SoE - Water Quality: Disaggregated data table is 'ug/L'
status: valid
status modified: 2019-10-03
accepted date: 2019-10-03
in scheme: Definition of correct units for the observed determinands in the given WISE SoE DD tables
has determinand: CAS 6190-65-4
has uom: ug.L-1
has table: WISE-SoE WaterQuality.DisaggregatedData

WISE-SoE_WaterQuality.DisaggregatedData - CAS_62-53-3 - ug/L
type: Concept
notation: WISE-SoE_WaterQuality.DisaggregatedData - CAS_62-53-3 - ug/L
definition: The unit of measure for 'CAS_62-53-3' (Aniline) in WISE SoE - Water Quality: Disaggregated data table is 'ug/L'
status: valid
status modified: 2019-10-03
accepted date: 2019-10-03
in scheme: Definition of correct units for the observed determinands in the given WISE SoE DD tables
has determinand: CAS 62-53-3
has uom: ug.L-1
has table: WISE-SoE WaterQuality.DisaggregatedData

WISE-SoE_WaterQuality.DisaggregatedData - CAS_62-73-7 - ug/L
type: Concept
notation: WISE-SoE_WaterQuality.DisaggregatedData - CAS_62-73-7 - ug/L
definition: The unit of measure for 'CAS_62-73-7' (Dichlorvos) in WISE SoE - Water Quality: Disaggregated data table is 'ug/L'
status: valid
status modified: 2019-10-03
accepted date: 2019-10-03
in scheme: Definition of correct units for the observed determinands in the given WISE SoE DD tables
has determinand: CAS 62-73-7
has uom: ug.L-1
has table: WISE-SoE WaterQuality.DisaggregatedData

WISE-SoE_WaterQuality.DisaggregatedData - CAS_626-43-7 - ug/L
type: Concept
notation: WISE-SoE_WaterQuality.DisaggregatedData - CAS_626-43-7 - ug/L
definition: The unit of measure for 'CAS_626-43-7' (3,5-Dichloroaniline) in WISE SoE - Water Quality: Disaggregated data table is 'ug/L'
status: valid
status modified: 2019-10-03
accepted date: 2019-10-03
in scheme: Definition of correct units for the observed determinands in the given WISE SoE DD tables
has determinand: CAS 626-43-7
has uom: ug.L-1
has table: WISE-SoE WaterQuality.DisaggregatedData

WISE-SoE_WaterQuality.DisaggregatedData - CAS_63-25-2 - ug/L
type: Concept
notation: WISE-SoE_WaterQuality.DisaggregatedData - CAS_63-25-2 - ug/L
definition: The unit of measure for 'CAS_63-25-2' (Carbaryl) in WISE SoE - Water Quality: Disaggregated data table is 'ug/L'
status: valid
status modified: 2019-10-03
accepted date: 2019-10-03
in scheme: Definition of correct units for the observed determinands in the given WISE SoE DD tables
has determinand: CAS 63-25-2
has uom: ug.L-1
has table: WISE-SoE WaterQuality.DisaggregatedData

WISE-SoE_WaterQuality.DisaggregatedData - CAS_630-20-6 - ug/L
type: Concept
notation: WISE-SoE_WaterQuality.DisaggregatedData - CAS_630-20-6 - ug/L
definition: The unit of measure for 'CAS_630-20-6' (1,1,1,2-tetrachloroethane) in WISE SoE - Water Quality: Disaggregated data table is 'ug/L'
status: valid
status modified: 2019-10-03
accepted date: 2019-10-03
in scheme: Definition of correct units for the observed determinands in the given WISE SoE DD tables
has determinand: CAS 630-20-6
has uom: ug.L-1
has table: WISE-SoE WaterQuality.DisaggregatedData

WISE-SoE_WaterQuality.DisaggregatedData - CAS_6339-19-1 - ug/L
type: Concept
notation: WISE-SoE_WaterQuality.DisaggregatedData - CAS_6339-19-1 - ug/L
definition: The unit of measure for 'CAS_6339-19-1' (Chloridazon desphenyl) in WISE SoE - Water Quality: Disaggregated data table is 'ug/L'
status: valid
status modified: 2019-10-03
accepted date: 2019-10-03
in scheme: Definition of correct units for the observed determinands in the given WISE SoE DD tables
has determinand: CAS 6339-19-1
has uom: ug.L-1
has table: WISE-SoE WaterQuality.DisaggregatedData

WISE-SoE_WaterQuality.DisaggregatedData - CAS_64743-03-9 - ug/L
type: Concept
notation: WISE-SoE_WaterQuality.DisaggregatedData - CAS_64743-03-9 - ug/L
definition: The unit of measure for 'CAS_64743-03-9' (Phenols) in WISE SoE - Water Quality: Disaggregated data table is 'ug/L'
status: valid
status modified: 2019-10-03
accepted date: 2019-10-03
in scheme: Definition of correct units for the observed determinands in the given WISE SoE DD tables
has determinand: CAS 64743-03-9
has uom: ug.L-1
has table: WISE-SoE WaterQuality.DisaggregatedData

WISE-SoE_WaterQuality.DisaggregatedData - CAS_64902-72-3 - ug/L
type: Concept
notation: WISE-SoE_WaterQuality.DisaggregatedData - CAS_64902-72-3 - ug/L
definition: The unit of measure for 'CAS_64902-72-3' (Chlorsulfuron) in WISE SoE - Water Quality: Disaggregated data table is 'ug/L'
status: valid
status modified: 2019-10-03
accepted date: 2019-10-03
in scheme: Definition of correct units for the observed determinands in the given WISE SoE DD tables
has determinand: CAS 64902-72-3
has uom: ug.L-1
has table: WISE-SoE WaterQuality.DisaggregatedData

WISE-SoE_WaterQuality.DisaggregatedData - CAS_65510-44-3 - ug/L
type: Concept
notation: WISE-SoE_WaterQuality.DisaggregatedData - CAS_65510-44-3 - ug/L
definition: The unit of measure for 'CAS_65510-44-3' (PCB 123 (1,2,3-trichloro-5-(2,4-dichlorophenyl)benzene)) in WISE SoE - Water Quality: Disaggregated data table is 'ug/L'
status: valid
status modified: 2019-10-03
accepted date: 2019-10-03
in scheme: Definition of correct units for the observed determinands in the given WISE SoE DD tables
has determinand: CAS 65510-44-3
has uom: ug.L-1
has table: WISE-SoE WaterQuality.DisaggregatedData

WISE-SoE_WaterQuality.DisaggregatedData - CAS_66215-27-8 - ug/L
type: Concept
notation: WISE-SoE_WaterQuality.DisaggregatedData - CAS_66215-27-8 - ug/L
definition: The unit of measure for 'CAS_66215-27-8' (Cyromazine) in WISE SoE - Water Quality: Disaggregated data table is 'ug/L'
status: valid
status modified: 2019-10-03
accepted date: 2019-10-03
in scheme: Definition of correct units for the observed determinands in the given WISE SoE DD tables
has determinand: CAS 66215-27-8
has uom: ug.L-1
has table: WISE-SoE WaterQuality.DisaggregatedData

WISE-SoE_WaterQuality.DisaggregatedData - CAS_66246-88-6 - ug/L
type: Concept
notation: WISE-SoE_WaterQuality.DisaggregatedData - CAS_66246-88-6 - ug/L
definition: The unit of measure for 'CAS_66246-88-6' (Penconazole) in WISE SoE - Water Quality: Disaggregated data table is 'ug/L'
status: valid
status modified: 2019-10-03
accepted date: 2019-10-03
in scheme: Definition of correct units for the observed determinands in the given WISE SoE DD tables
has determinand: CAS 66246-88-6
has uom: ug.L-1
has table: WISE-SoE WaterQuality.DisaggregatedData

WISE-SoE_WaterQuality.DisaggregatedData - CAS_66753-07-9 - ug/L
type: Concept
notation: WISE-SoE_WaterQuality.DisaggregatedData - CAS_66753-07-9 - ug/L
definition: The unit of measure for 'CAS_66753-07-9' (Hydroxyterbuthylazine) in WISE SoE - Water Quality: Disaggregated data table is 'ug/L'
status: valid
status modified: 2019-10-03
accepted date: 2019-10-03
in scheme: Definition of correct units for the observed determinands in the given WISE SoE DD tables
has determinand: CAS 66753-07-9
has uom: ug.L-1
has table: WISE-SoE WaterQuality.DisaggregatedData

WISE-SoE_WaterQuality.DisaggregatedData - CAS_67-66-3 - ug/L
type: Concept
notation: WISE-SoE_WaterQuality.DisaggregatedData - CAS_67-66-3 - ug/L
definition: The unit of measure for 'CAS_67-66-3' (Trichloromethane) in WISE SoE - Water Quality: Disaggregated data table is 'ug/L'
status: valid
status modified: 2019-10-03
accepted date: 2019-10-03
in scheme: Definition of correct units for the observed determinands in the given WISE SoE DD tables
has determinand: CAS 67-66-3
has uom: ug.L-1
has table: WISE-SoE WaterQuality.DisaggregatedData

WISE-SoE_WaterQuality.DisaggregatedData - CAS_67-72-1 - ug/L
type: Concept
notation: WISE-SoE_WaterQuality.DisaggregatedData - CAS_67-72-1 - ug/L
definition: The unit of measure for 'CAS_67-72-1' (Hexachloroethane) in WISE SoE - Water Quality: Disaggregated data table is 'ug/L'
status: valid
status modified: 2019-10-03
accepted date: 2019-10-03
in scheme: Definition of correct units for the observed determinands in the given WISE SoE DD tables
has determinand: CAS 67-72-1
has uom: ug.L-1
has table: WISE-SoE WaterQuality.DisaggregatedData

WISE-SoE_WaterQuality.DisaggregatedData - CAS_67129-08-2 - ug/L
type: Concept
notation: WISE-SoE_WaterQuality.DisaggregatedData - CAS_67129-08-2 - ug/L
definition: The unit of measure for 'CAS_67129-08-2' (Metazachlor) in WISE SoE - Water Quality: Disaggregated data table is 'ug/L'
status: valid
status modified: 2019-10-03
accepted date: 2019-10-03
in scheme: Definition of correct units for the observed determinands in the given WISE SoE DD tables
has determinand: CAS 67129-08-2
has uom: ug.L-1
has table: WISE-SoE WaterQuality.DisaggregatedData

WISE-SoE_WaterQuality.DisaggregatedData - CAS_67562-39-4 - ug/L
type: Concept
notation: WISE-SoE_WaterQuality.DisaggregatedData - CAS_67562-39-4 - ug/L
definition: The unit of measure for 'CAS_67562-39-4' (1,2,3,4,6,7,8-H7CDF) in WISE SoE - Water Quality: Disaggregated data table is 'ug/L'
status: valid
status modified: 2019-10-03
accepted date: 2019-10-03
in scheme: Definition of correct units for the observed determinands in the given WISE SoE DD tables
has determinand: CAS 67562-39-4
has uom: ug.L-1
has table: WISE-SoE WaterQuality.DisaggregatedData

WISE-SoE_WaterQuality.DisaggregatedData - CAS_67564-91-4 - ug/L
type: Concept
notation: WISE-SoE_WaterQuality.DisaggregatedData - CAS_67564-91-4 - ug/L
definition: The unit of measure for 'CAS_67564-91-4' (Fenpropimorph) in WISE SoE - Water Quality: Disaggregated data table is 'ug/L'
status: valid
status modified: 2019-10-03
accepted date: 2019-10-03
in scheme: Definition of correct units for the observed determinands in the given WISE SoE DD tables
has determinand: CAS 67564-91-4
has uom: ug.L-1
has table: WISE-SoE WaterQuality.DisaggregatedData

WISE-SoE_WaterQuality.DisaggregatedData - CAS_67747-09-5 - ug/L
type: Concept
notation: WISE-SoE_WaterQuality.DisaggregatedData - CAS_67747-09-5 - ug/L
definition: The unit of measure for 'CAS_67747-09-5' (Prochloraz) in WISE SoE - Water Quality: Disaggregated data table is 'ug/L'
status: valid
status modified: 2019-10-03
accepted date: 2019-10-03
in scheme: Definition of correct units for the observed determinands in the given WISE SoE DD tables
has determinand: CAS 67747-09-5
has uom: ug.L-1
has table: WISE-SoE WaterQuality.DisaggregatedData

WISE-SoE_WaterQuality.DisaggregatedData - CAS_68631-49-2 - ug/L
type: Concept
notation: WISE-SoE_WaterQuality.DisaggregatedData - CAS_68631-49-2 - ug/L
definition: The unit of measure for 'CAS_68631-49-2' (BDE 153 (2,2’,4,4’,5,5’-hexabromodiphenyl ether)) in WISE SoE - Water Quality: Disaggregated data table is 'ug/L'
status: valid
status modified: 2019-10-03
accepted date: 2019-10-03
in scheme: Definition of correct units for the observed determinands in the given WISE SoE DD tables
has determinand: CAS 68631-49-2
has uom: ug.L-1
has table: WISE-SoE WaterQuality.DisaggregatedData

WISE-SoE_WaterQuality.DisaggregatedData - CAS_68928-80-3 - ug/L
type: Concept
notation: WISE-SoE_WaterQuality.DisaggregatedData - CAS_68928-80-3 - ug/L
definition: The unit of measure for 'CAS_68928-80-3' (BDE 183 (Heptabromodiphenylether)) in WISE SoE - Water Quality: Disaggregated data table is 'ug/L'
status: valid
status modified: 2019-10-03
accepted date: 2019-10-03
in scheme: Definition of correct units for the observed determinands in the given WISE SoE DD tables
has determinand: CAS 68928-80-3
has uom: ug.L-1
has table: WISE-SoE WaterQuality.DisaggregatedData

WISE-SoE_WaterQuality.DisaggregatedData - CAS_69327-76-0 - ug/L
type: Concept
notation: WISE-SoE_WaterQuality.DisaggregatedData - CAS_69327-76-0 - ug/L
definition: The unit of measure for 'CAS_69327-76-0' (Buprofezin) in WISE SoE - Water Quality: Disaggregated data table is 'ug/L'
status: valid
status modified: 2019-10-03
accepted date: 2019-10-03
in scheme: Definition of correct units for the observed determinands in the given WISE SoE DD tables
has determinand: CAS 69327-76-0
has uom: ug.L-1
has table: WISE-SoE WaterQuality.DisaggregatedData

WISE-SoE_WaterQuality.DisaggregatedData - CAS_69377-81-7 - ug/L
type: Concept
notation: WISE-SoE_WaterQuality.DisaggregatedData - CAS_69377-81-7 - ug/L
definition: The unit of measure for 'CAS_69377-81-7' (Fluroxypyr) in WISE SoE - Water Quality: Disaggregated data table is 'ug/L'
status: valid
status modified: 2019-10-03
accepted date: 2019-10-03
in scheme: Definition of correct units for the observed determinands in the given WISE SoE DD tables
has determinand: CAS 69377-81-7
has uom: ug.L-1
has table: WISE-SoE WaterQuality.DisaggregatedData

WISE-SoE_WaterQuality.DisaggregatedData - CAS_69782-90-7 - ug/L
type: Concept
notation: WISE-SoE_WaterQuality.DisaggregatedData - CAS_69782-90-7 - ug/L
definition: The unit of measure for 'CAS_69782-90-7' (PCB 157 (2,3,3’,4,4’,5’-hexachlorobiphenyl)) in WISE SoE - Water Quality: Disaggregated data table is 'ug/L'
status: valid
status modified: 2019-10-03
accepted date: 2019-10-03
in scheme: Definition of correct units for the observed determinands in the given WISE SoE DD tables
has determinand: CAS 69782-90-7
has uom: ug.L-1
has table: WISE-SoE WaterQuality.DisaggregatedData

WISE-SoE_WaterQuality.DisaggregatedData - CAS_7012-37-5 - ug/L
type: Concept
notation: WISE-SoE_WaterQuality.DisaggregatedData - CAS_7012-37-5 - ug/L
definition: The unit of measure for 'CAS_7012-37-5' (PCB 28 (2,4,4’-trichlorobiphenyl)) in WISE SoE - Water Quality: Disaggregated data table is 'ug/L'
status: valid
status modified: 2019-10-03
accepted date: 2019-10-03
in scheme: Definition of correct units for the observed determinands in the given WISE SoE DD tables
has determinand: CAS 7012-37-5
has uom: ug.L-1
has table: WISE-SoE WaterQuality.DisaggregatedData

WISE-SoE_WaterQuality.DisaggregatedData - CAS_70124-77-5 - ug/L
type: Concept
notation: WISE-SoE_WaterQuality.DisaggregatedData - CAS_70124-77-5 - ug/L
definition: The unit of measure for 'CAS_70124-77-5' (Flucythrinate) in WISE SoE - Water Quality: Disaggregated data table is 'ug/L'
status: valid
status modified: 2019-10-03
accepted date: 2019-10-03
in scheme: Definition of correct units for the observed determinands in the given WISE SoE DD tables
has determinand: CAS 70124-77-5
has uom: ug.L-1
has table: WISE-SoE WaterQuality.DisaggregatedData

WISE-SoE_WaterQuality.DisaggregatedData - CAS_70362-41-3 - ug/L
type: Concept
notation: WISE-SoE_WaterQuality.DisaggregatedData - CAS_70362-41-3 - ug/L
definition: The unit of measure for 'CAS_70362-41-3' (PCB 106 (2,3,3',4,5'-pentachlorobiphenyl)) in WISE SoE - Water Quality: Disaggregated data table is 'ug/L'
status: valid
status modified: 2019-10-03
accepted date: 2019-10-03
in scheme: Definition of correct units for the observed determinands in the given WISE SoE DD tables
has determinand: CAS 70362-41-3
has uom: ug.L-1
has table: WISE-SoE WaterQuality.DisaggregatedData

WISE-SoE_WaterQuality.DisaggregatedData - CAS_70362-50-4 - ug/L
type: Concept
notation: WISE-SoE_WaterQuality.DisaggregatedData - CAS_70362-50-4 - ug/L
definition: The unit of measure for 'CAS_70362-50-4' (PCB 81 (3,4,4',5-tetrachlorobiphenyl)) in WISE SoE - Water Quality: Disaggregated data table is 'ug/L'
status: valid
status modified: 2019-10-03
accepted date: 2019-10-03
in scheme: Definition of correct units for the observed determinands in the given WISE SoE DD tables
has determinand: CAS 70362-50-4
has uom: ug.L-1
has table: WISE-SoE WaterQuality.DisaggregatedData

WISE-SoE_WaterQuality.DisaggregatedData - CAS_70630-17-0 - ug/L
type: Concept
notation: WISE-SoE_WaterQuality.DisaggregatedData - CAS_70630-17-0 - ug/L
definition: The unit of measure for 'CAS_70630-17-0' (Metalaxyl-M) in WISE SoE - Water Quality: Disaggregated data table is 'ug/L'
status: valid
status modified: 2019-10-03
accepted date: 2019-10-03
in scheme: Definition of correct units for the observed determinands in the given WISE SoE DD tables
has determinand: CAS 70630-17-0
has uom: ug.L-1
has table: WISE-SoE WaterQuality.DisaggregatedData

WISE-SoE_WaterQuality.DisaggregatedData - CAS_70648-26-9 - ug/L
type: Concept
notation: WISE-SoE_WaterQuality.DisaggregatedData - CAS_70648-26-9 - ug/L
definition: The unit of measure for 'CAS_70648-26-9' (1,2,3,4,7,8-H6CDF) in WISE SoE - Water Quality: Disaggregated data table is 'ug/L'
status: valid
status modified: 2019-10-03
accepted date: 2019-10-03
in scheme: Definition of correct units for the observed determinands in the given WISE SoE DD tables
has determinand: CAS 70648-26-9
has uom: ug.L-1
has table: WISE-SoE WaterQuality.DisaggregatedData

WISE-SoE_WaterQuality.DisaggregatedData - CAS_70776-03-3 - ug/L
type: Concept
notation: WISE-SoE_WaterQuality.DisaggregatedData - CAS_70776-03-3 - ug/L
definition: The unit of measure for 'CAS_70776-03-3' (Naphthalene, chloro derivatives) in WISE SoE - Water Quality: Disaggregated data table is 'ug/L'
status: valid
status modified: 2019-10-03
accepted date: 2019-10-03
in scheme: Definition of correct units for the observed determinands in the given WISE SoE DD tables
has determinand: CAS 70776-03-3
has uom: ug.L-1
has table: WISE-SoE WaterQuality.DisaggregatedData

WISE-SoE_WaterQuality.DisaggregatedData - CAS_7085-19-0 - ug/L
type: Concept
notation: WISE-SoE_WaterQuality.DisaggregatedData - CAS_7085-19-0 - ug/L
definition: The unit of measure for 'CAS_7085-19-0' (Mecoprop) in WISE SoE - Water Quality: Disaggregated data table is 'ug/L'
status: valid
status modified: 2019-10-03
accepted date: 2019-10-03
in scheme: Definition of correct units for the observed determinands in the given WISE SoE DD tables
has determinand: CAS 7085-19-0
has uom: ug.L-1
has table: WISE-SoE WaterQuality.DisaggregatedData

WISE-SoE_WaterQuality.DisaggregatedData - CAS_709-98-8 - ug/L
type: Concept
notation: WISE-SoE_WaterQuality.DisaggregatedData - CAS_709-98-8 - ug/L
definition: The unit of measure for 'CAS_709-98-8' (Propanil) in WISE SoE - Water Quality: Disaggregated data table is 'ug/L'
status: valid
status modified: 2019-10-03
accepted date: 2019-10-03
in scheme: Definition of correct units for the observed determinands in the given WISE SoE DD tables
has determinand: CAS 709-98-8
has uom: ug.L-1
has table: WISE-SoE WaterQuality.DisaggregatedData

WISE-SoE_WaterQuality.DisaggregatedData - CAS_71-43-2 - ug/L
type: Concept
notation: WISE-SoE_WaterQuality.DisaggregatedData - CAS_71-43-2 - ug/L
definition: The unit of measure for 'CAS_71-43-2' (Benzene) in WISE SoE - Water Quality: Disaggregated data table is 'ug/L'
status: valid
status modified: 2019-10-03
accepted date: 2019-10-03
in scheme: Definition of correct units for the observed determinands in the given WISE SoE DD tables
has determinand: CAS 71-43-2
has uom: ug.L-1
has table: WISE-SoE WaterQuality.DisaggregatedData

WISE-SoE_WaterQuality.DisaggregatedData - CAS_71-52-3 - mg/L
type: Concept
notation: WISE-SoE_WaterQuality.DisaggregatedData - CAS_71-52-3 - mg/L
definition: The unit of measure for 'CAS_71-52-3' (Hydrogen Carbonate (Bicarbonate) HCO3) in WISE SoE - Water Quality: Disaggregated data table is 'mg/L'
status: valid
status modified: 2019-10-03
accepted date: 2019-10-03
in scheme: Definition of correct units for the observed determinands in the given WISE SoE DD tables
has determinand: CAS 71-52-3
has uom: mg.L-1
has table: WISE-SoE WaterQuality.DisaggregatedData

WISE-SoE_WaterQuality.DisaggregatedData - CAS_71-55-6 - ug/L
type: Concept
notation: WISE-SoE_WaterQuality.DisaggregatedData - CAS_71-55-6 - ug/L
definition: The unit of measure for 'CAS_71-55-6' (1,1,1-trichloroethane) in WISE SoE - Water Quality: Disaggregated data table is 'ug/L'
status: valid
status modified: 2019-10-03
accepted date: 2019-10-03
in scheme: Definition of correct units for the observed determinands in the given WISE SoE DD tables
has determinand: CAS 71-55-6
has uom: ug.L-1
has table: WISE-SoE WaterQuality.DisaggregatedData

WISE-SoE_WaterQuality.DisaggregatedData - CAS_71626-11-4 - ug/L
type: Concept
notation: WISE-SoE_WaterQuality.DisaggregatedData - CAS_71626-11-4 - ug/L
definition: The unit of measure for 'CAS_71626-11-4' (Benalaxyl) in WISE SoE - Water Quality: Disaggregated data table is 'ug/L'
status: valid
status modified: 2019-10-03
accepted date: 2019-10-03
in scheme: Definition of correct units for the observed determinands in the given WISE SoE DD tables
has determinand: CAS 71626-11-4
has uom: ug.L-1
has table: WISE-SoE WaterQuality.DisaggregatedData

WISE-SoE_WaterQuality.DisaggregatedData - CAS_72-20-8 - ug/L
type: Concept
notation: WISE-SoE_WaterQuality.DisaggregatedData - CAS_72-20-8 - ug/L
definition: The unit of measure for 'CAS_72-20-8' (Endrin) in WISE SoE - Water Quality: Disaggregated data table is 'ug/L'
status: valid
status modified: 2019-10-03
accepted date: 2019-10-03
in scheme: Definition of correct units for the observed determinands in the given WISE SoE DD tables
has determinand: CAS 72-20-8
has uom: ug.L-1
has table: WISE-SoE WaterQuality.DisaggregatedData

WISE-SoE_WaterQuality.DisaggregatedData - CAS_72-43-5 - ug/L
type: Concept
notation: WISE-SoE_WaterQuality.DisaggregatedData - CAS_72-43-5 - ug/L
definition: The unit of measure for 'CAS_72-43-5' (Methoxychlor) in WISE SoE - Water Quality: Disaggregated data table is 'ug/L'
status: valid
status modified: 2019-10-03
accepted date: 2019-10-03
in scheme: Definition of correct units for the observed determinands in the given WISE SoE DD tables
has determinand: CAS 72-43-5
has uom: ug.L-1
has table: WISE-SoE WaterQuality.DisaggregatedData

WISE-SoE_WaterQuality.DisaggregatedData - CAS_72-54-8 - ug/L
type: Concept
notation: WISE-SoE_WaterQuality.DisaggregatedData - CAS_72-54-8 - ug/L
definition: The unit of measure for 'CAS_72-54-8' (p,p'-DDD) in WISE SoE - Water Quality: Disaggregated data table is 'ug/L'
status: valid
status modified: 2019-10-03
accepted date: 2019-10-03
in scheme: Definition of correct units for the observed determinands in the given WISE SoE DD tables
has determinand: CAS 72-54-8
has uom: ug.L-1
has table: WISE-SoE WaterQuality.DisaggregatedData

WISE-SoE_WaterQuality.DisaggregatedData - CAS_72-55-9 - ug/L
type: Concept
notation: WISE-SoE_WaterQuality.DisaggregatedData - CAS_72-55-9 - ug/L
definition: The unit of measure for 'CAS_72-55-9' (p,p'-DDE) in WISE SoE - Water Quality: Disaggregated data table is 'ug/L'
status: valid
status modified: 2019-10-03
accepted date: 2019-10-03
in scheme: Definition of correct units for the observed determinands in the given WISE SoE DD tables
has determinand: CAS 72-55-9
has uom: ug.L-1
has table: WISE-SoE WaterQuality.DisaggregatedData

WISE-SoE_WaterQuality.DisaggregatedData - CAS_72178-02-0 - ug/L
type: Concept
notation: WISE-SoE_WaterQuality.DisaggregatedData - CAS_72178-02-0 - ug/L
definition: The unit of measure for 'CAS_72178-02-0' (Fomesafen) in WISE SoE - Water Quality: Disaggregated data table is 'ug/L'
status: valid
status modified: 2019-10-03
accepted date: 2019-10-03
in scheme: Definition of correct units for the observed determinands in the given WISE SoE DD tables
has determinand: CAS 72178-02-0
has uom: ug.L-1
has table: WISE-SoE WaterQuality.DisaggregatedData

WISE-SoE_WaterQuality.DisaggregatedData - CAS_723-46-6 - ug/L
type: Concept
notation: WISE-SoE_WaterQuality.DisaggregatedData - CAS_723-46-6 - ug/L
definition: The unit of measure for 'CAS_723-46-6' (Sulfamethoxazol) in WISE SoE - Water Quality: Disaggregated data table is 'ug/L'
status: valid
status modified: 2019-10-03
accepted date: 2019-10-03
in scheme: Definition of correct units for the observed determinands in the given WISE SoE DD tables
has determinand: CAS 723-46-6
has uom: ug.L-1
has table: WISE-SoE WaterQuality.DisaggregatedData

WISE-SoE_WaterQuality.DisaggregatedData - CAS_7286-69-3 - ug/L
type: Concept
notation: WISE-SoE_WaterQuality.DisaggregatedData - CAS_7286-69-3 - ug/L
definition: The unit of measure for 'CAS_7286-69-3' (Sebuthylazine) in WISE SoE - Water Quality: Disaggregated data table is 'ug/L'
status: valid
status modified: 2019-10-03
accepted date: 2019-10-03
in scheme: Definition of correct units for the observed determinands in the given WISE SoE DD tables
has determinand: CAS 7286-69-3
has uom: ug.L-1
has table: WISE-SoE WaterQuality.DisaggregatedData

WISE-SoE_WaterQuality.DisaggregatedData - CAS_7287-19-6 - ug/L
type: Concept
notation: WISE-SoE_WaterQuality.DisaggregatedData - CAS_7287-19-6 - ug/L
definition: The unit of measure for 'CAS_7287-19-6' (Prometryn) in WISE SoE - Water Quality: Disaggregated data table is 'ug/L'
status: valid
status modified: 2019-10-03
accepted date: 2019-10-03
in scheme: Definition of correct units for the observed determinands in the given WISE SoE DD tables
has determinand: CAS 7287-19-6
has uom: ug.L-1
has table: WISE-SoE WaterQuality.DisaggregatedData

WISE-SoE_WaterQuality.DisaggregatedData - CAS_72918-21-9 - ug/L
type: Concept
notation: WISE-SoE_WaterQuality.DisaggregatedData - CAS_72918-21-9 - ug/L
definition: The unit of measure for 'CAS_72918-21-9' (1,2,3,7,8,9-H6CDF) in WISE SoE - Water Quality: Disaggregated data table is 'ug/L'
status: valid
status modified: 2019-10-03
accepted date: 2019-10-03
in scheme: Definition of correct units for the observed determinands in the given WISE SoE DD tables
has determinand: CAS 72918-21-9
has uom: ug.L-1
has table: WISE-SoE WaterQuality.DisaggregatedData

WISE-SoE_WaterQuality.DisaggregatedData - CAS_731-27-1 - ug/L
type: Concept
notation: WISE-SoE_WaterQuality.DisaggregatedData - CAS_731-27-1 - ug/L
definition: The unit of measure for 'CAS_731-27-1' (Tolylfluanid) in WISE SoE - Water Quality: Disaggregated data table is 'ug/L'
status: valid
status modified: 2019-10-03
accepted date: 2019-10-03
in scheme: Definition of correct units for the observed determinands in the given WISE SoE DD tables
has determinand: CAS 731-27-1
has uom: ug.L-1
has table: WISE-SoE WaterQuality.DisaggregatedData

WISE-SoE_WaterQuality.DisaggregatedData - CAS_732-11-6 - ug/L
type: Concept
notation: WISE-SoE_WaterQuality.DisaggregatedData - CAS_732-11-6 - ug/L
definition: The unit of measure for 'CAS_732-11-6' (Fosmet) in WISE SoE - Water Quality: Disaggregated data table is 'ug/L'
status: valid
status modified: 2019-10-03
accepted date: 2019-10-03
in scheme: Definition of correct units for the observed determinands in the given WISE SoE DD tables
has determinand: CAS 732-11-6
has uom: ug.L-1
has table: WISE-SoE WaterQuality.DisaggregatedData

WISE-SoE_WaterQuality.DisaggregatedData - CAS_732-26-3 - ug/L
type: Concept
notation: WISE-SoE_WaterQuality.DisaggregatedData - CAS_732-26-3 - ug/L
definition: The unit of measure for 'CAS_732-26-3' (2,4,6-tri-tert-butylphenol) in WISE SoE - Water Quality: Disaggregated data table is 'ug/L'
status: valid
status modified: 2019-10-03
accepted date: 2019-10-03
in scheme: Definition of correct units for the observed determinands in the given WISE SoE DD tables
has determinand: CAS 732-26-3
has uom: ug.L-1
has table: WISE-SoE WaterQuality.DisaggregatedData

WISE-SoE_WaterQuality.DisaggregatedData - CAS_738-70-5 - ug/L
type: Concept
notation: WISE-SoE_WaterQuality.DisaggregatedData - CAS_738-70-5 - ug/L
definition: The unit of measure for 'CAS_738-70-5' (Trimethoprim) in WISE SoE - Water Quality: Disaggregated data table is 'ug/L'
status: valid
status modified: 2019-10-03
accepted date: 2019-10-03
in scheme: Definition of correct units for the observed determinands in the given WISE SoE DD tables
has determinand: CAS 738-70-5
has uom: ug.L-1
has table: WISE-SoE WaterQuality.DisaggregatedData

WISE-SoE_WaterQuality.DisaggregatedData - CAS_74-83-9 - ug/L
type: Concept
notation: WISE-SoE_WaterQuality.DisaggregatedData - CAS_74-83-9 - ug/L
definition: The unit of measure for 'CAS_74-83-9' (Bromomethane) in WISE SoE - Water Quality: Disaggregated data table is 'ug/L'
status: valid
status modified: 2019-10-03
accepted date: 2019-10-03
in scheme: Definition of correct units for the observed determinands in the given WISE SoE DD tables
has determinand: CAS 74-83-9
has uom: ug.L-1
has table: WISE-SoE WaterQuality.DisaggregatedData

WISE-SoE_WaterQuality.DisaggregatedData - CAS_74-87-3 - ug/L
type: Concept
notation: WISE-SoE_WaterQuality.DisaggregatedData - CAS_74-87-3 - ug/L
definition: The unit of measure for 'CAS_74-87-3' (Methyl chloride) in WISE SoE - Water Quality: Disaggregated data table is 'ug/L'
status: valid
status modified: 2019-10-03
accepted date: 2019-10-03
in scheme: Definition of correct units for the observed determinands in the given WISE SoE DD tables
has determinand: CAS 74-87-3
has uom: ug.L-1
has table: WISE-SoE WaterQuality.DisaggregatedData

WISE-SoE_WaterQuality.DisaggregatedData - CAS_74-90-8 - ug/L
type: Concept
notation: WISE-SoE_WaterQuality.DisaggregatedData - CAS_74-90-8 - ug/L
definition: The unit of measure for 'CAS_74-90-8' (Hydrogen cyanide) in WISE SoE - Water Quality: Disaggregated data table is 'ug/L'
status: valid
status modified: 2019-10-03
accepted date: 2019-10-03
in scheme: Definition of correct units for the observed determinands in the given WISE SoE DD tables
has determinand: CAS 74-90-8
has uom: ug.L-1
has table: WISE-SoE WaterQuality.DisaggregatedData

WISE-SoE_WaterQuality.DisaggregatedData - CAS_74-95-3 - ug/L
type: Concept
notation: WISE-SoE_WaterQuality.DisaggregatedData - CAS_74-95-3 - ug/L
definition: The unit of measure for 'CAS_74-95-3' (Dibromomethane) in WISE SoE - Water Quality: Disaggregated data table is 'ug/L'
status: valid
status modified: 2019-10-03
accepted date: 2019-10-03
in scheme: Definition of correct units for the observed determinands in the given WISE SoE DD tables
has determinand: CAS 74-95-3
has uom: ug.L-1
has table: WISE-SoE WaterQuality.DisaggregatedData

WISE-SoE_WaterQuality.DisaggregatedData - CAS_74-97-5 - ug/L
type: Concept
notation: WISE-SoE_WaterQuality.DisaggregatedData - CAS_74-97-5 - ug/L
definition: The unit of measure for 'CAS_74-97-5' (Bromochloromethane) in WISE SoE - Water Quality: Disaggregated data table is 'ug/L'
status: valid
status modified: 2019-10-03
accepted date: 2019-10-03
in scheme: Definition of correct units for the observed determinands in the given WISE SoE DD tables
has determinand: CAS 74-97-5
has uom: ug.L-1
has table: WISE-SoE WaterQuality.DisaggregatedData

WISE-SoE_WaterQuality.DisaggregatedData - CAS_74070-46-5 - ug/L
type: Concept
notation: WISE-SoE_WaterQuality.DisaggregatedData - CAS_74070-46-5 - ug/L
definition: The unit of measure for 'CAS_74070-46-5' (Aclonifen) in WISE SoE - Water Quality: Disaggregated data table is 'ug/L'
status: valid
status modified: 2019-10-03
accepted date: 2019-10-03
in scheme: Definition of correct units for the observed determinands in the given WISE SoE DD tables
has determinand: CAS 74070-46-5
has uom: ug.L-1
has table: WISE-SoE WaterQuality.DisaggregatedData

WISE-SoE_WaterQuality.DisaggregatedData - CAS_74223-64-6 - ug/L
type: Concept
notation: WISE-SoE_WaterQuality.DisaggregatedData - CAS_74223-64-6 - ug/L
definition: The unit of measure for 'CAS_74223-64-6' (Metsulfuronmethyl) in WISE SoE - Water Quality: Disaggregated data table is 'ug/L'
status: valid
status modified: 2019-10-03
accepted date: 2019-10-03
in scheme: Definition of correct units for the observed determinands in the given WISE SoE DD tables
has determinand: CAS 74223-64-6
has uom: ug.L-1
has table: WISE-SoE WaterQuality.DisaggregatedData

WISE-SoE_WaterQuality.DisaggregatedData - CAS_7429-90-5 - ug/L
type: Concept
notation: WISE-SoE_WaterQuality.DisaggregatedData - CAS_7429-90-5 - ug/L
definition: The unit of measure for 'CAS_7429-90-5' (Aluminium and its compounds) in WISE SoE - Water Quality: Disaggregated data table is 'ug/L'
status: valid
status modified: 2019-10-03
accepted date: 2019-10-03
in scheme: Definition of correct units for the observed determinands in the given WISE SoE DD tables
has determinand: CAS 7429-90-5
has uom: ug.L-1
has table: WISE-SoE WaterQuality.DisaggregatedData

WISE-SoE_WaterQuality.DisaggregatedData - CAS_7439-89-6 - ug/L
type: Concept
notation: WISE-SoE_WaterQuality.DisaggregatedData - CAS_7439-89-6 - ug/L
definition: The unit of measure for 'CAS_7439-89-6' (Iron and its compounds) in WISE SoE - Water Quality: Disaggregated data table is 'ug/L'
status: valid
status modified: 2019-10-03
accepted date: 2019-10-03
in scheme: Definition of correct units for the observed determinands in the given WISE SoE DD tables
has determinand: CAS 7439-89-6
has uom: ug.L-1
has table: WISE-SoE WaterQuality.DisaggregatedData

WISE-SoE_WaterQuality.DisaggregatedData - CAS_7439-92-1 - ug/L
type: Concept
notation: WISE-SoE_WaterQuality.DisaggregatedData - CAS_7439-92-1 - ug/L
definition: The unit of measure for 'CAS_7439-92-1' (Lead and its compounds) in WISE SoE - Water Quality: Disaggregated data table is 'ug/L'
status: valid
status modified: 2019-10-03
accepted date: 2019-10-03
in scheme: Definition of correct units for the observed determinands in the given WISE SoE DD tables
has determinand: CAS 7439-92-1
has uom: ug.L-1
has table: WISE-SoE WaterQuality.DisaggregatedData

WISE-SoE_WaterQuality.DisaggregatedData - CAS_7439-93-2 - ug/L
type: Concept
notation: WISE-SoE_WaterQuality.DisaggregatedData - CAS_7439-93-2 - ug/L
definition: The unit of measure for 'CAS_7439-93-2' (Lithium) in WISE SoE - Water Quality: Disaggregated data table is 'ug/L'
status: valid
status modified: 2019-10-03
accepted date: 2019-10-03
in scheme: Definition of correct units for the observed determinands in the given WISE SoE DD tables
has determinand: CAS 7439-93-2
has uom: ug.L-1
has table: WISE-SoE WaterQuality.DisaggregatedData

WISE-SoE_WaterQuality.DisaggregatedData - CAS_7439-95-4 - mg/L
type: Concept
notation: WISE-SoE_WaterQuality.DisaggregatedData - CAS_7439-95-4 - mg/L
definition: The unit of measure for 'CAS_7439-95-4' (Magnesium) in WISE SoE - Water Quality: Disaggregated data table is 'mg/L'
status: valid
status modified: 2019-10-03
accepted date: 2019-10-03
in scheme: Definition of correct units for the observed determinands in the given WISE SoE DD tables
has determinand: CAS 7439-95-4
has uom: mg.L-1
has table: WISE-SoE WaterQuality.DisaggregatedData

WISE-SoE_WaterQuality.DisaggregatedData - CAS_7439-96-5 - ug/L
type: Concept
notation: WISE-SoE_WaterQuality.DisaggregatedData - CAS_7439-96-5 - ug/L
definition: The unit of measure for 'CAS_7439-96-5' (Manganese and its compounds) in WISE SoE - Water Quality: Disaggregated data table is 'ug/L'
status: valid
status modified: 2019-10-03
accepted date: 2019-10-03
in scheme: Definition of correct units for the observed determinands in the given WISE SoE DD tables
has determinand: CAS 7439-96-5
has uom: ug.L-1
has table: WISE-SoE WaterQuality.DisaggregatedData

WISE-SoE_WaterQuality.DisaggregatedData - CAS_7439-97-6 - ug/L
type: Concept
notation: WISE-SoE_WaterQuality.DisaggregatedData - CAS_7439-97-6 - ug/L
definition: The unit of measure for 'CAS_7439-97-6' (Mercury and its compounds) in WISE SoE - Water Quality: Disaggregated data table is 'ug/L'
status: valid
status modified: 2019-10-03
accepted date: 2019-10-03
in scheme: Definition of correct units for the observed determinands in the given WISE SoE DD tables
has determinand: CAS 7439-97-6
has uom: ug.L-1
has table: WISE-SoE WaterQuality.DisaggregatedData

WISE-SoE_WaterQuality.DisaggregatedData - CAS_7439-98-7 - ug/L
type: Concept
notation: WISE-SoE_WaterQuality.DisaggregatedData - CAS_7439-98-7 - ug/L
definition: The unit of measure for 'CAS_7439-98-7' (Molybdenum and its compounds) in WISE SoE - Water Quality: Disaggregated data table is 'ug/L'
status: valid
status modified: 2019-10-03
accepted date: 2019-10-03
in scheme: Definition of correct units for the observed determinands in the given WISE SoE DD tables
has determinand: CAS 7439-98-7
has uom: ug.L-1
has table: WISE-SoE WaterQuality.DisaggregatedData

WISE-SoE_WaterQuality.DisaggregatedData - CAS_7440-02-0 - ug/L
type: Concept
notation: WISE-SoE_WaterQuality.DisaggregatedData - CAS_7440-02-0 - ug/L
definition: The unit of measure for 'CAS_7440-02-0' (Nickel and its compounds) in WISE SoE - Water Quality: Disaggregated data table is 'ug/L'
status: valid
status modified: 2019-10-03
accepted date: 2019-10-03
in scheme: Definition of correct units for the observed determinands in the given WISE SoE DD tables
has determinand: CAS 7440-02-0
has uom: ug.L-1
has table: WISE-SoE WaterQuality.DisaggregatedData

WISE-SoE_WaterQuality.DisaggregatedData - CAS_7440-09-7 - mg/L
type: Concept
notation: WISE-SoE_WaterQuality.DisaggregatedData - CAS_7440-09-7 - mg/L
definition: The unit of measure for 'CAS_7440-09-7' (Potassium) in WISE SoE - Water Quality: Disaggregated data table is 'mg/L'
status: valid
status modified: 2019-10-03
accepted date: 2019-10-03
in scheme: Definition of correct units for the observed determinands in the given WISE SoE DD tables
has determinand: CAS 7440-09-7
has uom: mg.L-1
has table: WISE-SoE WaterQuality.DisaggregatedData

WISE-SoE_WaterQuality.DisaggregatedData - CAS_7440-21-3 - ug/L
type: Concept
notation: WISE-SoE_WaterQuality.DisaggregatedData - CAS_7440-21-3 - ug/L
definition: The unit of measure for 'CAS_7440-21-3' (Silicon) in WISE SoE - Water Quality: Disaggregated data table is 'ug/L'
status: valid
status modified: 2019-10-03
accepted date: 2019-10-03
in scheme: Definition of correct units for the observed determinands in the given WISE SoE DD tables
has determinand: CAS 7440-21-3
has uom: ug.L-1
has table: WISE-SoE WaterQuality.DisaggregatedData

WISE-SoE_WaterQuality.DisaggregatedData - CAS_7440-22-4 - ug/L
type: Concept
notation: WISE-SoE_WaterQuality.DisaggregatedData - CAS_7440-22-4 - ug/L
definition: The unit of measure for 'CAS_7440-22-4' (Silver) in WISE SoE - Water Quality: Disaggregated data table is 'ug/L'
status: valid
status modified: 2019-10-03
accepted date: 2019-10-03
in scheme: Definition of correct units for the observed determinands in the given WISE SoE DD tables
has determinand: CAS 7440-22-4
has uom: ug.L-1
has table: WISE-SoE WaterQuality.DisaggregatedData

WISE-SoE_WaterQuality.DisaggregatedData - CAS_7440-23-5 - mg/L
type: Concept
notation: WISE-SoE_WaterQuality.DisaggregatedData - CAS_7440-23-5 - mg/L
definition: The unit of measure for 'CAS_7440-23-5' (Sodium) in WISE SoE - Water Quality: Disaggregated data table is 'mg/L'
status: valid
status modified: 2019-10-03
accepted date: 2019-10-03
in scheme: Definition of correct units for the observed determinands in the given WISE SoE DD tables
has determinand: CAS 7440-23-5
has uom: mg.L-1
has table: WISE-SoE WaterQuality.DisaggregatedData

WISE-SoE_WaterQuality.DisaggregatedData - CAS_7440-24-6 - ug/L
type: Concept
notation: WISE-SoE_WaterQuality.DisaggregatedData - CAS_7440-24-6 - ug/L
definition: The unit of measure for 'CAS_7440-24-6' (Strontium) in WISE SoE - Water Quality: Disaggregated data table is 'ug/L'
status: valid
status modified: 2019-10-03
accepted date: 2019-10-03
in scheme: Definition of correct units for the observed determinands in the given WISE SoE DD tables
has determinand: CAS 7440-24-6
has uom: ug.L-1
has table: WISE-SoE WaterQuality.DisaggregatedData

WISE-SoE_WaterQuality.DisaggregatedData - CAS_7440-28-0 - ug/L
type: Concept
notation: WISE-SoE_WaterQuality.DisaggregatedData - CAS_7440-28-0 - ug/L
definition: The unit of measure for 'CAS_7440-28-0' (Thallium) in WISE SoE - Water Quality: Disaggregated data table is 'ug/L'
status: valid
status modified: 2019-10-03
accepted date: 2019-10-03
in scheme: Definition of correct units for the observed determinands in the given WISE SoE DD tables
has determinand: CAS 7440-28-0
has uom: ug.L-1
has table: WISE-SoE WaterQuality.DisaggregatedData

WISE-SoE_WaterQuality.DisaggregatedData - CAS_7440-31-5 - ug/L
type: Concept
notation: WISE-SoE_WaterQuality.DisaggregatedData - CAS_7440-31-5 - ug/L
definition: The unit of measure for 'CAS_7440-31-5' (Tin and its compounds) in WISE SoE - Water Quality: Disaggregated data table is 'ug/L'
status: valid
status modified: 2019-10-03
accepted date: 2019-10-03
in scheme: Definition of correct units for the observed determinands in the given WISE SoE DD tables
has determinand: CAS 7440-31-5
has uom: ug.L-1
has table: WISE-SoE WaterQuality.DisaggregatedData

WISE-SoE_WaterQuality.DisaggregatedData - CAS_7440-32-6 - ug/L
type: Concept
notation: WISE-SoE_WaterQuality.DisaggregatedData - CAS_7440-32-6 - ug/L
definition: The unit of measure for 'CAS_7440-32-6' (Titanium) in WISE SoE - Water Quality: Disaggregated data table is 'ug/L'
status: valid
status modified: 2019-10-03
accepted date: 2019-10-03
in scheme: Definition of correct units for the observed determinands in the given WISE SoE DD tables
has determinand: CAS 7440-32-6
has uom: ug.L-1
has table: WISE-SoE WaterQuality.DisaggregatedData

WISE-SoE_WaterQuality.DisaggregatedData - CAS_7440-33-7 - ug/L
type: Concept
notation: WISE-SoE_WaterQuality.DisaggregatedData - CAS_7440-33-7 - ug/L
definition: The unit of measure for 'CAS_7440-33-7' (Tungsten and its compounds) in WISE SoE - Water Quality: Disaggregated data table is 'ug/L'
status: valid
status modified: 2019-10-03
accepted date: 2019-10-03
in scheme: Definition of correct units for the observed determinands in the given WISE SoE DD tables
has determinand: CAS 7440-33-7
has uom: ug.L-1
has table: WISE-SoE WaterQuality.DisaggregatedData

WISE-SoE_WaterQuality.DisaggregatedData - CAS_7440-36-0 - ug/L
type: Concept
notation: WISE-SoE_WaterQuality.DisaggregatedData - CAS_7440-36-0 - ug/L
definition: The unit of measure for 'CAS_7440-36-0' (Antimony) in WISE SoE - Water Quality: Disaggregated data table is 'ug/L'
status: valid
status modified: 2019-10-03
accepted date: 2019-10-03
in scheme: Definition of correct units for the observed determinands in the given WISE SoE DD tables
has determinand: CAS 7440-36-0
has uom: ug.L-1
has table: WISE-SoE WaterQuality.DisaggregatedData

WISE-SoE_WaterQuality.DisaggregatedData - CAS_7440-38-2 - ug/L
type: Concept
notation: WISE-SoE_WaterQuality.DisaggregatedData - CAS_7440-38-2 - ug/L
definition: The unit of measure for 'CAS_7440-38-2' (Arsenic and its compounds) in WISE SoE - Water Quality: Disaggregated data table is 'ug/L'
status: valid
status modified: 2019-10-03
accepted date: 2019-10-03
in scheme: Definition of correct units for the observed determinands in the given WISE SoE DD tables
has determinand: CAS 7440-38-2
has uom: ug.L-1
has table: WISE-SoE WaterQuality.DisaggregatedData

WISE-SoE_WaterQuality.DisaggregatedData - CAS_7440-39-3 - ug/L
type: Concept
notation: WISE-SoE_WaterQuality.DisaggregatedData - CAS_7440-39-3 - ug/L
definition: The unit of measure for 'CAS_7440-39-3' (Barium) in WISE SoE - Water Quality: Disaggregated data table is 'ug/L'
status: valid
status modified: 2019-10-03
accepted date: 2019-10-03
in scheme: Definition of correct units for the observed determinands in the given WISE SoE DD tables
has determinand: CAS 7440-39-3
has uom: ug.L-1
has table: WISE-SoE WaterQuality.DisaggregatedData

WISE-SoE_WaterQuality.DisaggregatedData - CAS_7440-41-7 - ug/L
type: Concept
notation: WISE-SoE_WaterQuality.DisaggregatedData - CAS_7440-41-7 - ug/L
definition: The unit of measure for 'CAS_7440-41-7' (Beryllium) in WISE SoE - Water Quality: Disaggregated data table is 'ug/L'
status: valid
status modified: 2019-10-03
accepted date: 2019-10-03
in scheme: Definition of correct units for the observed determinands in the given WISE SoE DD tables
has determinand: CAS 7440-41-7
has uom: ug.L-1
has table: WISE-SoE WaterQuality.DisaggregatedData

WISE-SoE_WaterQuality.DisaggregatedData - CAS_7440-42-8 - ug/L
type: Concept
notation: WISE-SoE_WaterQuality.DisaggregatedData - CAS_7440-42-8 - ug/L
definition: The unit of measure for 'CAS_7440-42-8' (Boron) in WISE SoE - Water Quality: Disaggregated data table is 'ug/L'
status: valid
status modified: 2019-10-03
accepted date: 2019-10-03
in scheme: Definition of correct units for the observed determinands in the given WISE SoE DD tables
has determinand: CAS 7440-42-8
has uom: ug.L-1
has table: WISE-SoE WaterQuality.DisaggregatedData

WISE-SoE_WaterQuality.DisaggregatedData - CAS_7440-43-9 - ug/L
type: Concept
notation: WISE-SoE_WaterQuality.DisaggregatedData - CAS_7440-43-9 - ug/L
definition: The unit of measure for 'CAS_7440-43-9' (Cadmium and its compounds) in WISE SoE - Water Quality: Disaggregated data table is 'ug/L'
status: valid
status modified: 2019-10-03
accepted date: 2019-10-03
in scheme: Definition of correct units for the observed determinands in the given WISE SoE DD tables
has determinand: CAS 7440-43-9
has uom: ug.L-1
has table: WISE-SoE WaterQuality.DisaggregatedData

WISE-SoE_WaterQuality.DisaggregatedData - CAS_7440-47-3 - ug/L
type: Concept
notation: WISE-SoE_WaterQuality.DisaggregatedData - CAS_7440-47-3 - ug/L
definition: The unit of measure for 'CAS_7440-47-3' (Chromium and its compounds) in WISE SoE - Water Quality: Disaggregated data table is 'ug/L'
status: valid
status modified: 2019-10-03
accepted date: 2019-10-03
in scheme: Definition of correct units for the observed determinands in the given WISE SoE DD tables
has determinand: CAS 7440-47-3
has uom: ug.L-1
has table: WISE-SoE WaterQuality.DisaggregatedData

WISE-SoE_WaterQuality.DisaggregatedData - CAS_7440-48-4 - ug/L
type: Concept
notation: WISE-SoE_WaterQuality.DisaggregatedData - CAS_7440-48-4 - ug/L
definition: The unit of measure for 'CAS_7440-48-4' (Cobalt and its compounds) in WISE SoE - Water Quality: Disaggregated data table is 'ug/L'
status: valid
status modified: 2019-10-03
accepted date: 2019-10-03
in scheme: Definition of correct units for the observed determinands in the given WISE SoE DD tables
has determinand: CAS 7440-48-4
has uom: ug.L-1
has table: WISE-SoE WaterQuality.DisaggregatedData

WISE-SoE_WaterQuality.DisaggregatedData - CAS_7440-50-8 - ug/L
type: Concept
notation: WISE-SoE_WaterQuality.DisaggregatedData - CAS_7440-50-8 - ug/L
definition: The unit of measure for 'CAS_7440-50-8' (Copper and its compounds) in WISE SoE - Water Quality: Disaggregated data table is 'ug/L'
status: valid
status modified: 2019-10-03
accepted date: 2019-10-03
in scheme: Definition of correct units for the observed determinands in the given WISE SoE DD tables
has determinand: CAS 7440-50-8
has uom: ug.L-1
has table: WISE-SoE WaterQuality.DisaggregatedData

WISE-SoE_WaterQuality.DisaggregatedData - CAS_7440-61-1 - ug/L
type: Concept
notation: WISE-SoE_WaterQuality.DisaggregatedData - CAS_7440-61-1 - ug/L
definition: The unit of measure for 'CAS_7440-61-1' (Uranium) in WISE SoE - Water Quality: Disaggregated data table is 'ug/L'
status: valid
status modified: 2019-10-03
accepted date: 2019-10-03
in scheme: Definition of correct units for the observed determinands in the given WISE SoE DD tables
has determinand: CAS 7440-61-1
has uom: ug.L-1
has table: WISE-SoE WaterQuality.DisaggregatedData

WISE-SoE_WaterQuality.DisaggregatedData - CAS_7440-62-2 - ug/L
type: Concept
notation: WISE-SoE_WaterQuality.DisaggregatedData - CAS_7440-62-2 - ug/L
definition: The unit of measure for 'CAS_7440-62-2' (Vanadium and its compounds) in WISE SoE - Water Quality: Disaggregated data table is 'ug/L'
status: valid
status modified: 2019-10-03
accepted date: 2019-10-03
in scheme: Definition of correct units for the observed determinands in the given WISE SoE DD tables
has determinand: CAS 7440-62-2
has uom: ug.L-1
has table: WISE-SoE WaterQuality.DisaggregatedData

WISE-SoE_WaterQuality.DisaggregatedData - CAS_7440-66-6 - ug/L
type: Concept
notation: WISE-SoE_WaterQuality.DisaggregatedData - CAS_7440-66-6 - ug/L
definition: The unit of measure for 'CAS_7440-66-6' (Zinc and its compounds) in WISE SoE - Water Quality: Disaggregated data table is 'ug/L'
status: valid
status modified: 2019-10-03
accepted date: 2019-10-03
in scheme: Definition of correct units for the observed determinands in the given WISE SoE DD tables
has determinand: CAS 7440-66-6
has uom: ug.L-1
has table: WISE-SoE WaterQuality.DisaggregatedData

WISE-SoE_WaterQuality.DisaggregatedData - CAS_7440-70-2 - mg/L
type: Concept
notation: WISE-SoE_WaterQuality.DisaggregatedData - CAS_7440-70-2 - mg/L
definition: The unit of measure for 'CAS_7440-70-2' (Calcium) in WISE SoE - Water Quality: Disaggregated data table is 'mg/L'
status: valid
status modified: 2019-10-03
accepted date: 2019-10-03
in scheme: Definition of correct units for the observed determinands in the given WISE SoE DD tables
has determinand: CAS 7440-70-2
has uom: mg.L-1
has table: WISE-SoE WaterQuality.DisaggregatedData

WISE-SoE_WaterQuality.DisaggregatedData - CAS_74472-37-0 - ug/L
type: Concept
notation: WISE-SoE_WaterQuality.DisaggregatedData - CAS_74472-37-0 - ug/L
definition: The unit of measure for 'CAS_74472-37-0' (PCB 114 (2,3,4,4',5-pentachlorobiphenyl)) in WISE SoE - Water Quality: Disaggregated data table is 'ug/L'
status: valid
status modified: 2019-10-03
accepted date: 2019-10-03
in scheme: Definition of correct units for the observed determinands in the given WISE SoE DD tables
has determinand: CAS 74472-37-0
has uom: ug.L-1
has table: WISE-SoE WaterQuality.DisaggregatedData

WISE-SoE_WaterQuality.DisaggregatedData - CAS_75-01-4 - ug/L
type: Concept
notation: WISE-SoE_WaterQuality.DisaggregatedData - CAS_75-01-4 - ug/L
definition: The unit of measure for 'CAS_75-01-4' (Chloroethene (vinylchloride)) in WISE SoE - Water Quality: Disaggregated data table is 'ug/L'
status: valid
status modified: 2019-10-03
accepted date: 2019-10-03
in scheme: Definition of correct units for the observed determinands in the given WISE SoE DD tables
has determinand: CAS 75-01-4
has uom: ug.L-1
has table: WISE-SoE WaterQuality.DisaggregatedData

WISE-SoE_WaterQuality.DisaggregatedData - CAS_75-09-2 - ug/L
type: Concept
notation: WISE-SoE_WaterQuality.DisaggregatedData - CAS_75-09-2 - ug/L
definition: The unit of measure for 'CAS_75-09-2' (Dichloromethane) in WISE SoE - Water Quality: Disaggregated data table is 'ug/L'
status: valid
status modified: 2019-10-03
accepted date: 2019-10-03
in scheme: Definition of correct units for the observed determinands in the given WISE SoE DD tables
has determinand: CAS 75-09-2
has uom: ug.L-1
has table: WISE-SoE WaterQuality.DisaggregatedData

WISE-SoE_WaterQuality.DisaggregatedData - CAS_75-21-8 - ug/L
type: Concept
notation: WISE-SoE_WaterQuality.DisaggregatedData - CAS_75-21-8 - ug/L
definition: The unit of measure for 'CAS_75-21-8' (Ethylene oxide) in WISE SoE - Water Quality: Disaggregated data table is 'ug/L'
status: valid
status modified: 2019-10-03
accepted date: 2019-10-03
in scheme: Definition of correct units for the observed determinands in the given WISE SoE DD tables
has determinand: CAS 75-21-8
has uom: ug.L-1
has table: WISE-SoE WaterQuality.DisaggregatedData

WISE-SoE_WaterQuality.DisaggregatedData - CAS_75-25-2 - ug/L
type: Concept
notation: WISE-SoE_WaterQuality.DisaggregatedData - CAS_75-25-2 - ug/L
definition: The unit of measure for 'CAS_75-25-2' (Bromoform) in WISE SoE - Water Quality: Disaggregated data table is 'ug/L'
status: valid
status modified: 2019-10-03
accepted date: 2019-10-03
in scheme: Definition of correct units for the observed determinands in the given WISE SoE DD tables
has determinand: CAS 75-25-2
has uom: ug.L-1
has table: WISE-SoE WaterQuality.DisaggregatedData

WISE-SoE_WaterQuality.DisaggregatedData - CAS_75-27-4 - ug/L
type: Concept
notation: WISE-SoE_WaterQuality.DisaggregatedData - CAS_75-27-4 - ug/L
definition: The unit of measure for 'CAS_75-27-4' (Bromodichloromethane) in WISE SoE - Water Quality: Disaggregated data table is 'ug/L'
status: valid
status modified: 2019-10-03
accepted date: 2019-10-03
in scheme: Definition of correct units for the observed determinands in the given WISE SoE DD tables
has determinand: CAS 75-27-4
has uom: ug.L-1
has table: WISE-SoE WaterQuality.DisaggregatedData

WISE-SoE_WaterQuality.DisaggregatedData - CAS_75-34-3 - ug/L
type: Concept
notation: WISE-SoE_WaterQuality.DisaggregatedData - CAS_75-34-3 - ug/L
definition: The unit of measure for 'CAS_75-34-3' (1,1-dichloroethane) in WISE SoE - Water Quality: Disaggregated data table is 'ug/L'
status: valid
status modified: 2019-10-03
accepted date: 2019-10-03
in scheme: Definition of correct units for the observed determinands in the given WISE SoE DD tables
has determinand: CAS 75-34-3
has uom: ug.L-1
has table: WISE-SoE WaterQuality.DisaggregatedData

WISE-SoE_WaterQuality.DisaggregatedData - CAS_75-35-4 - ug/L
type: Concept
notation: WISE-SoE_WaterQuality.DisaggregatedData - CAS_75-35-4 - ug/L
definition: The unit of measure for 'CAS_75-35-4' (1,1-dichloroethene) in WISE SoE - Water Quality: Disaggregated data table is 'ug/L'
status: valid
status modified: 2019-10-03
accepted date: 2019-10-03
in scheme: Definition of correct units for the observed determinands in the given WISE SoE DD tables
has determinand: CAS 75-35-4
has uom: ug.L-1
has table: WISE-SoE WaterQuality.DisaggregatedData

WISE-SoE_WaterQuality.DisaggregatedData - CAS_75-69-4 - ug/L
type: Concept
notation: WISE-SoE_WaterQuality.DisaggregatedData - CAS_75-69-4 - ug/L
definition: The unit of measure for 'CAS_75-69-4' (Trichlorofluoromethane) in WISE SoE - Water Quality: Disaggregated data table is 'ug/L'
status: valid
status modified: 2019-10-03
accepted date: 2019-10-03
in scheme: Definition of correct units for the observed determinands in the given WISE SoE DD tables
has determinand: CAS 75-69-4
has uom: ug.L-1
has table: WISE-SoE WaterQuality.DisaggregatedData

WISE-SoE_WaterQuality.DisaggregatedData - CAS_75-71-8 - ug/L
type: Concept
notation: WISE-SoE_WaterQuality.DisaggregatedData - CAS_75-71-8 - ug/L
definition: The unit of measure for 'CAS_75-71-8' (Dichlorodifluoromethane) in WISE SoE - Water Quality: Disaggregated data table is 'ug/L'
status: valid
status modified: 2019-10-03
accepted date: 2019-10-03
in scheme: Definition of correct units for the observed determinands in the given WISE SoE DD tables
has determinand: CAS 75-71-8
has uom: ug.L-1
has table: WISE-SoE WaterQuality.DisaggregatedData

WISE-SoE_WaterQuality.DisaggregatedData - CAS_75-99-0 - ug/L
type: Concept
notation: WISE-SoE_WaterQuality.DisaggregatedData - CAS_75-99-0 - ug/L
definition: The unit of measure for 'CAS_75-99-0' (Dalapon) in WISE SoE - Water Quality: Disaggregated data table is 'ug/L'
status: valid
status modified: 2019-10-03
accepted date: 2019-10-03
in scheme: Definition of correct units for the observed determinands in the given WISE SoE DD tables
has determinand: CAS 75-99-0
has uom: ug.L-1
has table: WISE-SoE WaterQuality.DisaggregatedData

WISE-SoE_WaterQuality.DisaggregatedData - CAS_76-03-9 - ug/L
type: Concept
notation: WISE-SoE_WaterQuality.DisaggregatedData - CAS_76-03-9 - ug/L
definition: The unit of measure for 'CAS_76-03-9' (Trichloroacetic acid) in WISE SoE - Water Quality: Disaggregated data table is 'ug/L'
status: valid
status modified: 2019-10-03
accepted date: 2019-10-03
in scheme: Definition of correct units for the observed determinands in the given WISE SoE DD tables
has determinand: CAS 76-03-9
has uom: ug.L-1
has table: WISE-SoE WaterQuality.DisaggregatedData

WISE-SoE_WaterQuality.DisaggregatedData - CAS_76-13-1 - ug/L
type: Concept
notation: WISE-SoE_WaterQuality.DisaggregatedData - CAS_76-13-1 - ug/L
definition: The unit of measure for 'CAS_76-13-1' (1,1,2-trichlorotrifluoroethane) in WISE SoE - Water Quality: Disaggregated data table is 'ug/L'
status: valid
status modified: 2019-10-03
accepted date: 2019-10-03
in scheme: Definition of correct units for the observed determinands in the given WISE SoE DD tables
has determinand: CAS 76-13-1
has uom: ug.L-1
has table: WISE-SoE WaterQuality.DisaggregatedData

WISE-SoE_WaterQuality.DisaggregatedData - CAS_76-44-8 - ug/L
type: Concept
notation: WISE-SoE_WaterQuality.DisaggregatedData - CAS_76-44-8 - ug/L
definition: The unit of measure for 'CAS_76-44-8' (Heptachlor) in WISE SoE - Water Quality: Disaggregated data table is 'ug/L'
status: valid
status modified: 2019-10-03
accepted date: 2019-10-03
in scheme: Definition of correct units for the observed determinands in the given WISE SoE DD tables
has determinand: CAS 76-44-8
has uom: ug.L-1
has table: WISE-SoE WaterQuality.DisaggregatedData

WISE-SoE_WaterQuality.DisaggregatedData - CAS_76578-12-6 - ug/L
type: Concept
notation: WISE-SoE_WaterQuality.DisaggregatedData - CAS_76578-12-6 - ug/L
definition: The unit of measure for 'CAS_76578-12-6' (Quizalofop) in WISE SoE - Water Quality: Disaggregated data table is 'ug/L'
status: valid
status modified: 2019-10-03
accepted date: 2019-10-03
in scheme: Definition of correct units for the observed determinands in the given WISE SoE DD tables
has determinand: CAS 76578-12-6
has uom: ug.L-1
has table: WISE-SoE WaterQuality.DisaggregatedData

WISE-SoE_WaterQuality.DisaggregatedData - CAS_7664-41-7 - ug/L
type: Concept
notation: WISE-SoE_WaterQuality.DisaggregatedData - CAS_7664-41-7 - ug/L
definition: The unit of measure for 'CAS_7664-41-7' (Ammonia) in WISE SoE - Water Quality: Disaggregated data table is 'ug/L'
status: valid
status modified: 2019-10-03
accepted date: 2019-10-03
in scheme: Definition of correct units for the observed determinands in the given WISE SoE DD tables
has determinand: CAS 7664-41-7
has uom: ug.L-1
has table: WISE-SoE WaterQuality.DisaggregatedData

WISE-SoE_WaterQuality.DisaggregatedData - CAS_77-47-4 - ug/L
type: Concept
notation: WISE-SoE_WaterQuality.DisaggregatedData - CAS_77-47-4 - ug/L
definition: The unit of measure for 'CAS_77-47-4' (Hexachlorocyclopentadiene (HCCP)) in WISE SoE - Water Quality: Disaggregated data table is 'ug/L'
status: valid
status modified: 2019-10-03
accepted date: 2019-10-03
in scheme: Definition of correct units for the observed determinands in the given WISE SoE DD tables
has determinand: CAS 77-47-4
has uom: ug.L-1
has table: WISE-SoE WaterQuality.DisaggregatedData

WISE-SoE_WaterQuality.DisaggregatedData - CAS_7723-14-0 - mg{P}/L
type: Concept
notation: WISE-SoE_WaterQuality.DisaggregatedData - CAS_7723-14-0 - mg{P}/L
definition: The unit of measure for 'CAS_7723-14-0' (Total phosphorus) in WISE SoE - Water Quality: Disaggregated data table is 'mg{P}/L'
status: valid
status modified: 2019-10-03
accepted date: 2019-10-03
in scheme: Definition of correct units for the observed determinands in the given WISE SoE DD tables
has determinand: CAS 7723-14-0
has uom: mg{P}.L-1
has table: WISE-SoE WaterQuality.DisaggregatedData

WISE-SoE_WaterQuality.DisaggregatedData - CAS_77238-39-2 - ug/L
type: Concept
notation: WISE-SoE_WaterQuality.DisaggregatedData - CAS_77238-39-2 - ug/L
definition: The unit of measure for 'CAS_77238-39-2' (Microcystin) in WISE SoE - Water Quality: Disaggregated data table is 'ug/L'
status: valid
status modified: 2019-10-03
accepted date: 2019-10-03
in scheme: Definition of correct units for the observed determinands in the given WISE SoE DD tables
has determinand: CAS 77238-39-2
has uom: ug.L-1
has table: WISE-SoE WaterQuality.DisaggregatedData

WISE-SoE_WaterQuality.DisaggregatedData - CAS_77732-09-3 - ug/L
type: Concept
notation: WISE-SoE_WaterQuality.DisaggregatedData - CAS_77732-09-3 - ug/L
definition: The unit of measure for 'CAS_77732-09-3' (Oxadixyl) in WISE SoE - Water Quality: Disaggregated data table is 'ug/L'
status: valid
status modified: 2019-10-03
accepted date: 2019-10-03
in scheme: Definition of correct units for the observed determinands in the given WISE SoE DD tables
has determinand: CAS 77732-09-3
has uom: ug.L-1
has table: WISE-SoE WaterQuality.DisaggregatedData

WISE-SoE_WaterQuality.DisaggregatedData - CAS_7782-41-4 - ug/L
type: Concept
notation: WISE-SoE_WaterQuality.DisaggregatedData - CAS_7782-41-4 - ug/L
definition: The unit of measure for 'CAS_7782-41-4' (Fluorine) in WISE SoE - Water Quality: Disaggregated data table is 'ug/L'
status: valid
status modified: 2019-10-03
accepted date: 2019-10-03
in scheme: Definition of correct units for the observed determinands in the given WISE SoE DD tables
has determinand: CAS 7782-41-4
has uom: ug.L-1
has table: WISE-SoE WaterQuality.DisaggregatedData

WISE-SoE_WaterQuality.DisaggregatedData - CAS_7782-49-2 - ug/L
type: Concept
notation: WISE-SoE_WaterQuality.DisaggregatedData - CAS_7782-49-2 - ug/L
definition: The unit of measure for 'CAS_7782-49-2' (Selenium and its compounds) in WISE SoE - Water Quality: Disaggregated data table is 'ug/L'
status: valid
status modified: 2019-10-03
accepted date: 2019-10-03
in scheme: Definition of correct units for the observed determinands in the given WISE SoE DD tables
has determinand: CAS 7782-49-2
has uom: ug.L-1
has table: WISE-SoE WaterQuality.DisaggregatedData

WISE-SoE_WaterQuality.DisaggregatedData - CAS_7783-06-4 - mg{S}/L
type: Concept
notation: WISE-SoE_WaterQuality.DisaggregatedData - CAS_7783-06-4 - mg{S}/L
definition: The unit of measure for 'CAS_7783-06-4' (Hydrogen sulphide) in WISE SoE - Water Quality: Disaggregated data table is 'mg{S}/L'
status: valid
status modified: 2019-10-03
accepted date: 2019-10-03
in scheme: Definition of correct units for the observed determinands in the given WISE SoE DD tables
has determinand: CAS 7783-06-4
has uom: mg{S}.L-1
has table: WISE-SoE WaterQuality.DisaggregatedData

WISE-SoE_WaterQuality.DisaggregatedData - CAS_7786-34-7 - ug/L
type: Concept
notation: WISE-SoE_WaterQuality.DisaggregatedData - CAS_7786-34-7 - ug/L
definition: The unit of measure for 'CAS_7786-34-7' (Mevinphos) in WISE SoE - Water Quality: Disaggregated data table is 'ug/L'
status: valid
status modified: 2019-10-03
accepted date: 2019-10-03
in scheme: Definition of correct units for the observed determinands in the given WISE SoE DD tables
has determinand: CAS 7786-34-7
has uom: ug.L-1
has table: WISE-SoE WaterQuality.DisaggregatedData

WISE-SoE_WaterQuality.DisaggregatedData - CAS_7790-93-4 - ug/L
type: Concept
notation: WISE-SoE_WaterQuality.DisaggregatedData - CAS_7790-93-4 - ug/L
definition: The unit of measure for 'CAS_7790-93-4' (Chloric acid) in WISE SoE - Water Quality: Disaggregated data table is 'ug/L'
status: valid
status modified: 2019-10-03
accepted date: 2019-10-03
in scheme: Definition of correct units for the observed determinands in the given WISE SoE DD tables
has determinand: CAS 7790-93-4
has uom: ug.L-1
has table: WISE-SoE WaterQuality.DisaggregatedData

WISE-SoE_WaterQuality.DisaggregatedData - CAS_78-87-5 - ug/L
type: Concept
notation: WISE-SoE_WaterQuality.DisaggregatedData - CAS_78-87-5 - ug/L
definition: The unit of measure for 'CAS_78-87-5' (1,2-dichloropropane) in WISE SoE - Water Quality: Disaggregated data table is 'ug/L'
status: valid
status modified: 2019-10-03
accepted date: 2019-10-03
in scheme: Definition of correct units for the observed determinands in the given WISE SoE DD tables
has determinand: CAS 78-87-5
has uom: ug.L-1
has table: WISE-SoE WaterQuality.DisaggregatedData

WISE-SoE_WaterQuality.DisaggregatedData - CAS_78-88-6 - ug/L
type: Concept
notation: WISE-SoE_WaterQuality.DisaggregatedData - CAS_78-88-6 - ug/L
definition: The unit of measure for 'CAS_78-88-6' (2,3-dichloropropene) in WISE SoE - Water Quality: Disaggregated data table is 'ug/L'
status: valid
status modified: 2019-10-03
accepted date: 2019-10-03
in scheme: Definition of correct units for the observed determinands in the given WISE SoE DD tables
has determinand: CAS 78-88-6
has uom: ug.L-1
has table: WISE-SoE WaterQuality.DisaggregatedData

WISE-SoE_WaterQuality.DisaggregatedData - CAS_786-19-6 - ug/L
type: Concept
notation: WISE-SoE_WaterQuality.DisaggregatedData - CAS_786-19-6 - ug/L
definition: The unit of measure for 'CAS_786-19-6' (Carbophenothion) in WISE SoE - Water Quality: Disaggregated data table is 'ug/L'
status: valid
status modified: 2019-10-03
accepted date: 2019-10-03
in scheme: Definition of correct units for the observed determinands in the given WISE SoE DD tables
has determinand: CAS 786-19-6
has uom: ug.L-1
has table: WISE-SoE WaterQuality.DisaggregatedData

WISE-SoE_WaterQuality.DisaggregatedData - CAS_789-02-6 - ug/L
type: Concept
notation: WISE-SoE_WaterQuality.DisaggregatedData - CAS_789-02-6 - ug/L
definition: The unit of measure for 'CAS_789-02-6' (DDT, o,p') in WISE SoE - Water Quality: Disaggregated data table is 'ug/L'
status: valid
status modified: 2019-10-03
accepted date: 2019-10-03
in scheme: Definition of correct units for the observed determinands in the given WISE SoE DD tables
has determinand: CAS 789-02-6
has uom: ug.L-1
has table: WISE-SoE WaterQuality.DisaggregatedData

WISE-SoE_WaterQuality.DisaggregatedData - CAS_79-00-5 - ug/L
type: Concept
notation: WISE-SoE_WaterQuality.DisaggregatedData - CAS_79-00-5 - ug/L
definition: The unit of measure for 'CAS_79-00-5' (1,1,2-trichloroethane) in WISE SoE - Water Quality: Disaggregated data table is 'ug/L'
status: valid
status modified: 2019-10-03
accepted date: 2019-10-03
in scheme: Definition of correct units for the observed determinands in the given WISE SoE DD tables
has determinand: CAS 79-00-5
has uom: ug.L-1
has table: WISE-SoE WaterQuality.DisaggregatedData

WISE-SoE_WaterQuality.DisaggregatedData - CAS_79-01-6 - ug/L
type: Concept
notation: WISE-SoE_WaterQuality.DisaggregatedData - CAS_79-01-6 - ug/L
definition: The unit of measure for 'CAS_79-01-6' (Trichloroethylene) in WISE SoE - Water Quality: Disaggregated data table is 'ug/L'
status: valid
status modified: 2019-10-03
accepted date: 2019-10-03
in scheme: Definition of correct units for the observed determinands in the given WISE SoE DD tables
has determinand: CAS 79-01-6
has uom: ug.L-1
has table: WISE-SoE WaterQuality.DisaggregatedData

WISE-SoE_WaterQuality.DisaggregatedData - CAS_79-06-1 - ug/L
type: Concept
notation: WISE-SoE_WaterQuality.DisaggregatedData - CAS_79-06-1 - ug/L
definition: The unit of measure for 'CAS_79-06-1' (Acrylamide) in WISE SoE - Water Quality: Disaggregated data table is 'ug/L'
status: valid
status modified: 2019-10-03
accepted date: 2019-10-03
in scheme: Definition of correct units for the observed determinands in the given WISE SoE DD tables
has determinand: CAS 79-06-1
has uom: ug.L-1
has table: WISE-SoE WaterQuality.DisaggregatedData

WISE-SoE_WaterQuality.DisaggregatedData - CAS_79-11-8 - ug/L
type: Concept
notation: WISE-SoE_WaterQuality.DisaggregatedData - CAS_79-11-8 - ug/L
definition: The unit of measure for 'CAS_79-11-8' (Chloroacetic acid) in WISE SoE - Water Quality: Disaggregated data table is 'ug/L'
status: valid
status modified: 2019-10-03
accepted date: 2019-10-03
in scheme: Definition of correct units for the observed determinands in the given WISE SoE DD tables
has determinand: CAS 79-11-8
has uom: ug.L-1
has table: WISE-SoE WaterQuality.DisaggregatedData

WISE-SoE_WaterQuality.DisaggregatedData - CAS_79-34-5 - ug/L
type: Concept
notation: WISE-SoE_WaterQuality.DisaggregatedData - CAS_79-34-5 - ug/L
definition: The unit of measure for 'CAS_79-34-5' (1,1,2,2-tetrachloroethane) in WISE SoE - Water Quality: Disaggregated data table is 'ug/L'
status: valid
status modified: 2019-10-03
accepted date: 2019-10-03
in scheme: Definition of correct units for the observed determinands in the given WISE SoE DD tables
has determinand: CAS 79-34-5
has uom: ug.L-1
has table: WISE-SoE WaterQuality.DisaggregatedData

WISE-SoE_WaterQuality.DisaggregatedData - CAS_79-43-6 - ug/L
type: Concept
notation: WISE-SoE_WaterQuality.DisaggregatedData - CAS_79-43-6 - ug/L
definition: The unit of measure for 'CAS_79-43-6' (Dichloroacetic acid) in WISE SoE - Water Quality: Disaggregated data table is 'ug/L'
status: valid
status modified: 2019-10-03
accepted date: 2019-10-03
in scheme: Definition of correct units for the observed determinands in the given WISE SoE DD tables
has determinand: CAS 79-43-6
has uom: ug.L-1
has table: WISE-SoE WaterQuality.DisaggregatedData

WISE-SoE_WaterQuality.DisaggregatedData - CAS_79-57-2 - ug/L
type: Concept
notation: WISE-SoE_WaterQuality.DisaggregatedData - CAS_79-57-2 - ug/L
definition: The unit of measure for 'CAS_79-57-2' (Oxytetracycline) in WISE SoE - Water Quality: Disaggregated data table is 'ug/L'
status: valid
status modified: 2019-10-03
accepted date: 2019-10-03
in scheme: Definition of correct units for the observed determinands in the given WISE SoE DD tables
has determinand: CAS 79-57-2
has uom: ug.L-1
has table: WISE-SoE WaterQuality.DisaggregatedData

WISE-SoE_WaterQuality.DisaggregatedData - CAS_79-94-7 - ug/L
type: Concept
notation: WISE-SoE_WaterQuality.DisaggregatedData - CAS_79-94-7 - ug/L
definition: The unit of measure for 'CAS_79-94-7' (Tetrabromobisphenol A (TBBP-A)) in WISE SoE - Water Quality: Disaggregated data table is 'ug/L'
status: valid
status modified: 2019-10-03
accepted date: 2019-10-03
in scheme: Definition of correct units for the observed determinands in the given WISE SoE DD tables
has determinand: CAS 79-94-7
has uom: ug.L-1
has table: WISE-SoE WaterQuality.DisaggregatedData

WISE-SoE_WaterQuality.DisaggregatedData - CAS_79241-46-6 - ug/L
type: Concept
notation: WISE-SoE_WaterQuality.DisaggregatedData - CAS_79241-46-6 - ug/L
definition: The unit of measure for 'CAS_79241-46-6' (Fluazifop-P-butyl) in WISE SoE - Water Quality: Disaggregated data table is 'ug/L'
status: valid
status modified: 2019-10-03
accepted date: 2019-10-03
in scheme: Definition of correct units for the observed determinands in the given WISE SoE DD tables
has determinand: CAS 79241-46-6
has uom: ug.L-1
has table: WISE-SoE WaterQuality.DisaggregatedData

WISE-SoE_WaterQuality.DisaggregatedData - CAS_79277-27-3 - ug/L
type: Concept
notation: WISE-SoE_WaterQuality.DisaggregatedData - CAS_79277-27-3 - ug/L
definition: The unit of measure for 'CAS_79277-27-3' (Thifensulfuron-methyl) in WISE SoE - Water Quality: Disaggregated data table is 'ug/L'
status: valid
status modified: 2019-10-03
accepted date: 2019-10-03
in scheme: Definition of correct units for the observed determinands in the given WISE SoE DD tables
has determinand: CAS 79277-27-3
has uom: ug.L-1
has table: WISE-SoE WaterQuality.DisaggregatedData

WISE-SoE_WaterQuality.DisaggregatedData - CAS_793-24-8 - ug/L
type: Concept
notation: WISE-SoE_WaterQuality.DisaggregatedData - CAS_793-24-8 - ug/L
definition: The unit of measure for 'CAS_793-24-8' (4-(dimethylbutylamino) diphenylamin (6PPD)) in WISE SoE - Water Quality: Disaggregated data table is 'ug/L'
status: valid
status modified: 2019-10-03
accepted date: 2019-10-03
in scheme: Definition of correct units for the observed determinands in the given WISE SoE DD tables
has determinand: CAS 793-24-8
has uom: ug.L-1
has table: WISE-SoE WaterQuality.DisaggregatedData

WISE-SoE_WaterQuality.DisaggregatedData - CAS_80-05-7 - ug/L
type: Concept
notation: WISE-SoE_WaterQuality.DisaggregatedData - CAS_80-05-7 - ug/L
definition: The unit of measure for 'CAS_80-05-7' (Bisphenol A) in WISE SoE - Water Quality: Disaggregated data table is 'ug/L'
status: valid
status modified: 2019-10-03
accepted date: 2019-10-03
in scheme: Definition of correct units for the observed determinands in the given WISE SoE DD tables
has determinand: CAS 80-05-7
has uom: ug.L-1
has table: WISE-SoE WaterQuality.DisaggregatedData

WISE-SoE_WaterQuality.DisaggregatedData - CAS_8001-35-2 - ug/L
type: Concept
notation: WISE-SoE_WaterQuality.DisaggregatedData - CAS_8001-35-2 - ug/L
definition: The unit of measure for 'CAS_8001-35-2' (Toxaphene) in WISE SoE - Water Quality: Disaggregated data table is 'ug/L'
status: valid
status modified: 2019-10-03
accepted date: 2019-10-03
in scheme: Definition of correct units for the observed determinands in the given WISE SoE DD tables
has determinand: CAS 8001-35-2
has uom: ug.L-1
has table: WISE-SoE WaterQuality.DisaggregatedData

WISE-SoE_WaterQuality.DisaggregatedData - CAS_8065-48-3 - ug/L
type: Concept
notation: WISE-SoE_WaterQuality.DisaggregatedData - CAS_8065-48-3 - ug/L
definition: The unit of measure for 'CAS_8065-48-3' (Demeton-O and Demeton-S (mixture)) in WISE SoE - Water Quality: Disaggregated data table is 'ug/L'
status: valid
status modified: 2019-10-03
accepted date: 2019-10-03
in scheme: Definition of correct units for the observed determinands in the given WISE SoE DD tables
has determinand: CAS 8065-48-3
has uom: ug.L-1
has table: WISE-SoE WaterQuality.DisaggregatedData

WISE-SoE_WaterQuality.DisaggregatedData - CAS_80844-07-1 - ug/L
type: Concept
notation: WISE-SoE_WaterQuality.DisaggregatedData - CAS_80844-07-1 - ug/L
definition: The unit of measure for 'CAS_80844-07-1' (Etofenprox) in WISE SoE - Water Quality: Disaggregated data table is 'ug/L'
status: valid
status modified: 2019-10-03
accepted date: 2019-10-03
in scheme: Definition of correct units for the observed determinands in the given WISE SoE DD tables
has determinand: CAS 80844-07-1
has uom: ug.L-1
has table: WISE-SoE WaterQuality.DisaggregatedData

WISE-SoE_WaterQuality.DisaggregatedData - CAS_81-15-2 - ug/L
type: Concept
notation: WISE-SoE_WaterQuality.DisaggregatedData - CAS_81-15-2 - ug/L
definition: The unit of measure for 'CAS_81-15-2' (Musk xylene) in WISE SoE - Water Quality: Disaggregated data table is 'ug/L'
status: valid
status modified: 2019-10-03
accepted date: 2019-10-03
in scheme: Definition of correct units for the observed determinands in the given WISE SoE DD tables
has determinand: CAS 81-15-2
has uom: ug.L-1
has table: WISE-SoE WaterQuality.DisaggregatedData

WISE-SoE_WaterQuality.DisaggregatedData - CAS_81103-11-9 - ug/L
type: Concept
notation: WISE-SoE_WaterQuality.DisaggregatedData - CAS_81103-11-9 - ug/L
definition: The unit of measure for 'CAS_81103-11-9' (Clarithromycin) in WISE SoE - Water Quality: Disaggregated data table is 'ug/L'
status: valid
status modified: 2019-10-03
accepted date: 2019-10-03
in scheme: Definition of correct units for the observed determinands in the given WISE SoE DD tables
has determinand: CAS 81103-11-9
has uom: ug.L-1
has table: WISE-SoE WaterQuality.DisaggregatedData

WISE-SoE_WaterQuality.DisaggregatedData - CAS_81406-37-3 - ug/L
type: Concept
notation: WISE-SoE_WaterQuality.DisaggregatedData - CAS_81406-37-3 - ug/L
definition: The unit of measure for 'CAS_81406-37-3' (Fluroxypyr-meptyl) in WISE SoE - Water Quality: Disaggregated data table is 'ug/L'
status: valid
status modified: 2019-10-03
accepted date: 2019-10-03
in scheme: Definition of correct units for the observed determinands in the given WISE SoE DD tables
has determinand: CAS 81406-37-3
has uom: ug.L-1
has table: WISE-SoE WaterQuality.DisaggregatedData

WISE-SoE_WaterQuality.DisaggregatedData - CAS_81777-89-1 - ug/L
type: Concept
notation: WISE-SoE_WaterQuality.DisaggregatedData - CAS_81777-89-1 - ug/L
definition: The unit of measure for 'CAS_81777-89-1' (Clomazone) in WISE SoE - Water Quality: Disaggregated data table is 'ug/L'
status: valid
status modified: 2019-10-03
accepted date: 2019-10-03
in scheme: Definition of correct units for the observed determinands in the given WISE SoE DD tables
has determinand: CAS 81777-89-1
has uom: ug.L-1
has table: WISE-SoE WaterQuality.DisaggregatedData

WISE-SoE_WaterQuality.DisaggregatedData - CAS_82-68-8 - ug/L
type: Concept
notation: WISE-SoE_WaterQuality.DisaggregatedData - CAS_82-68-8 - ug/L
definition: The unit of measure for 'CAS_82-68-8' (Quintozene) in WISE SoE - Water Quality: Disaggregated data table is 'ug/L'
status: valid
status modified: 2019-10-03
accepted date: 2019-10-03
in scheme: Definition of correct units for the observed determinands in the given WISE SoE DD tables
has determinand: CAS 82-68-8
has uom: ug.L-1
has table: WISE-SoE WaterQuality.DisaggregatedData

WISE-SoE_WaterQuality.DisaggregatedData - CAS_82097-50-5 - ug/L
type: Concept
notation: WISE-SoE_WaterQuality.DisaggregatedData - CAS_82097-50-5 - ug/L
definition: The unit of measure for 'CAS_82097-50-5' (Triasulfuron) in WISE SoE - Water Quality: Disaggregated data table is 'ug/L'
status: valid
status modified: 2019-10-03
accepted date: 2019-10-03
in scheme: Definition of correct units for the observed determinands in the given WISE SoE DD tables
has determinand: CAS 82097-50-5
has uom: ug.L-1
has table: WISE-SoE WaterQuality.DisaggregatedData

WISE-SoE_WaterQuality.DisaggregatedData - CAS_82558-50-7 - ug/L
type: Concept
notation: WISE-SoE_WaterQuality.DisaggregatedData - CAS_82558-50-7 - ug/L
definition: The unit of measure for 'CAS_82558-50-7' (Benzamide) in WISE SoE - Water Quality: Disaggregated data table is 'ug/L'
status: valid
status modified: 2019-10-03
accepted date: 2019-10-03
in scheme: Definition of correct units for the observed determinands in the given WISE SoE DD tables
has determinand: CAS 82558-50-7
has uom: ug.L-1
has table: WISE-SoE WaterQuality.DisaggregatedData

WISE-SoE_WaterQuality.DisaggregatedData - CAS_83-32-9 - ug/L
type: Concept
notation: WISE-SoE_WaterQuality.DisaggregatedData - CAS_83-32-9 - ug/L
definition: The unit of measure for 'CAS_83-32-9' (Acenaphthene) in WISE SoE - Water Quality: Disaggregated data table is 'ug/L'
status: valid
status modified: 2019-10-03
accepted date: 2019-10-03
in scheme: Definition of correct units for the observed determinands in the given WISE SoE DD tables
has determinand: CAS 83-32-9
has uom: ug.L-1
has table: WISE-SoE WaterQuality.DisaggregatedData

WISE-SoE_WaterQuality.DisaggregatedData - CAS_83-42-1 - ug/L
type: Concept
notation: WISE-SoE_WaterQuality.DisaggregatedData - CAS_83-42-1 - ug/L
definition: The unit of measure for 'CAS_83-42-1' (2-chloro-6-nitrotoluene) in WISE SoE - Water Quality: Disaggregated data table is 'ug/L'
status: valid
status modified: 2019-10-03
accepted date: 2019-10-03
in scheme: Definition of correct units for the observed determinands in the given WISE SoE DD tables
has determinand: CAS 83-42-1
has uom: ug.L-1
has table: WISE-SoE WaterQuality.DisaggregatedData

WISE-SoE_WaterQuality.DisaggregatedData - CAS_83055-99-6 - ug/L
type: Concept
notation: WISE-SoE_WaterQuality.DisaggregatedData - CAS_83055-99-6 - ug/L
definition: The unit of measure for 'CAS_83055-99-6' (Bensulfuron-methyl) in WISE SoE - Water Quality: Disaggregated data table is 'ug/L'
status: valid
status modified: 2019-10-03
accepted date: 2019-10-03
in scheme: Definition of correct units for the observed determinands in the given WISE SoE DD tables
has determinand: CAS 83055-99-6
has uom: ug.L-1
has table: WISE-SoE WaterQuality.DisaggregatedData

WISE-SoE_WaterQuality.DisaggregatedData - CAS_83164-33-4 - ug/L
type: Concept
notation: WISE-SoE_WaterQuality.DisaggregatedData - CAS_83164-33-4 - ug/L
definition: The unit of measure for 'CAS_83164-33-4' (Diflufenican) in WISE SoE - Water Quality: Disaggregated data table is 'ug/L'
status: valid
status modified: 2019-10-03
accepted date: 2019-10-03
in scheme: Definition of correct units for the observed determinands in the given WISE SoE DD tables
has determinand: CAS 83164-33-4
has uom: ug.L-1
has table: WISE-SoE WaterQuality.DisaggregatedData

WISE-SoE_WaterQuality.DisaggregatedData - CAS_834-12-8 - ug/L
type: Concept
notation: WISE-SoE_WaterQuality.DisaggregatedData - CAS_834-12-8 - ug/L
definition: The unit of measure for 'CAS_834-12-8' (Ametryn) in WISE SoE - Water Quality: Disaggregated data table is 'ug/L'
status: valid
status modified: 2019-10-03
accepted date: 2019-10-03
in scheme: Definition of correct units for the observed determinands in the given WISE SoE DD tables
has determinand: CAS 834-12-8
has uom: ug.L-1
has table: WISE-SoE WaterQuality.DisaggregatedData

WISE-SoE_WaterQuality.DisaggregatedData - CAS_83905-01-5 - ug/L
type: Concept
notation: WISE-SoE_WaterQuality.DisaggregatedData - CAS_83905-01-5 - ug/L
definition: The unit of measure for 'CAS_83905-01-5' (Azitromycin) in WISE SoE - Water Quality: Disaggregated data table is 'ug/L'
status: valid
status modified: 2019-10-03
accepted date: 2019-10-03
in scheme: Definition of correct units for the observed determinands in the given WISE SoE DD tables
has determinand: CAS 83905-01-5
has uom: ug.L-1
has table: WISE-SoE WaterQuality.DisaggregatedData

WISE-SoE_WaterQuality.DisaggregatedData - CAS_84-66-2 - ug/L
type: Concept
notation: WISE-SoE_WaterQuality.DisaggregatedData - CAS_84-66-2 - ug/L
definition: The unit of measure for 'CAS_84-66-2' (Di-ethyl phthalate) in WISE SoE - Water Quality: Disaggregated data table is 'ug/L'
status: valid
status modified: 2019-10-03
accepted date: 2019-10-03
in scheme: Definition of correct units for the observed determinands in the given WISE SoE DD tables
has determinand: CAS 84-66-2
has uom: ug.L-1
has table: WISE-SoE WaterQuality.DisaggregatedData

WISE-SoE_WaterQuality.DisaggregatedData - CAS_84-69-5 - ug/L
type: Concept
notation: WISE-SoE_WaterQuality.DisaggregatedData - CAS_84-69-5 - ug/L
definition: The unit of measure for 'CAS_84-69-5' (Di-iso-butyl phthalate) in WISE SoE - Water Quality: Disaggregated data table is 'ug/L'
status: valid
status modified: 2019-10-03
accepted date: 2019-10-03
in scheme: Definition of correct units for the observed determinands in the given WISE SoE DD tables
has determinand: CAS 84-69-5
has uom: ug.L-1
has table: WISE-SoE WaterQuality.DisaggregatedData

WISE-SoE_WaterQuality.DisaggregatedData - CAS_84-74-2 - ug/L
type: Concept
notation: WISE-SoE_WaterQuality.DisaggregatedData - CAS_84-74-2 - ug/L
definition: The unit of measure for 'CAS_84-74-2' (Dibutylphthalate) in WISE SoE - Water Quality: Disaggregated data table is 'ug/L'
status: valid
status modified: 2019-10-03
accepted date: 2019-10-03
in scheme: Definition of correct units for the observed determinands in the given WISE SoE DD tables
has determinand: CAS 84-74-2
has uom: ug.L-1
has table: WISE-SoE WaterQuality.DisaggregatedData

WISE-SoE_WaterQuality.DisaggregatedData - CAS_84852-15-3 - ug/L
type: Concept
notation: WISE-SoE_WaterQuality.DisaggregatedData - CAS_84852-15-3 - ug/L
definition: The unit of measure for 'CAS_84852-15-3' (4-nonylphenol, branched) in WISE SoE - Water Quality: Disaggregated data table is 'ug/L'
status: valid
status modified: 2019-10-03
accepted date: 2019-10-03
in scheme: Definition of correct units for the observed determinands in the given WISE SoE DD tables
has determinand: CAS 84852-15-3
has uom: ug.L-1
has table: WISE-SoE WaterQuality.DisaggregatedData

WISE-SoE_WaterQuality.DisaggregatedData - CAS_85-01-8 - ug/L
type: Concept
notation: WISE-SoE_WaterQuality.DisaggregatedData - CAS_85-01-8 - ug/L
definition: The unit of measure for 'CAS_85-01-8' (Phenanthrene) in WISE SoE - Water Quality: Disaggregated data table is 'ug/L'
status: valid
status modified: 2019-10-03
accepted date: 2019-10-03
in scheme: Definition of correct units for the observed determinands in the given WISE SoE DD tables
has determinand: CAS 85-01-8
has uom: ug.L-1
has table: WISE-SoE WaterQuality.DisaggregatedData

WISE-SoE_WaterQuality.DisaggregatedData - CAS_85-22-3 - ug/L
type: Concept
notation: WISE-SoE_WaterQuality.DisaggregatedData - CAS_85-22-3 - ug/L
definition: The unit of measure for 'CAS_85-22-3' (Pentabromoethylbenzene) in WISE SoE - Water Quality: Disaggregated data table is 'ug/L'
status: valid
status modified: 2019-10-03
accepted date: 2019-10-03
in scheme: Definition of correct units for the observed determinands in the given WISE SoE DD tables
has determinand: CAS 85-22-3
has uom: ug.L-1
has table: WISE-SoE WaterQuality.DisaggregatedData

WISE-SoE_WaterQuality.DisaggregatedData - CAS_85-68-7 - ug/L
type: Concept
notation: WISE-SoE_WaterQuality.DisaggregatedData - CAS_85-68-7 - ug/L
definition: The unit of measure for 'CAS_85-68-7' (Butyl benzyl phthalate (BBP)) in WISE SoE - Water Quality: Disaggregated data table is 'ug/L'
status: valid
status modified: 2019-10-03
accepted date: 2019-10-03
in scheme: Definition of correct units for the observed determinands in the given WISE SoE DD tables
has determinand: CAS 85-68-7
has uom: ug.L-1
has table: WISE-SoE WaterQuality.DisaggregatedData

WISE-SoE_WaterQuality.DisaggregatedData - CAS_85509-19-9 - ug/L
type: Concept
notation: WISE-SoE_WaterQuality.DisaggregatedData - CAS_85509-19-9 - ug/L
definition: The unit of measure for 'CAS_85509-19-9' (Flusilazole) in WISE SoE - Water Quality: Disaggregated data table is 'ug/L'
status: valid
status modified: 2019-10-03
accepted date: 2019-10-03
in scheme: Definition of correct units for the observed determinands in the given WISE SoE DD tables
has determinand: CAS 85509-19-9
has uom: ug.L-1
has table: WISE-SoE WaterQuality.DisaggregatedData

WISE-SoE_WaterQuality.DisaggregatedData - CAS_85535-84-8 - ug/L
type: Concept
notation: WISE-SoE_WaterQuality.DisaggregatedData - CAS_85535-84-8 - ug/L
definition: The unit of measure for 'CAS_85535-84-8' (Chloroalkanes C10-13) in WISE SoE - Water Quality: Disaggregated data table is 'ug/L'
status: valid
status modified: 2019-10-03
accepted date: 2019-10-03
in scheme: Definition of correct units for the observed determinands in the given WISE SoE DD tables
has determinand: CAS 85535-84-8
has uom: ug.L-1
has table: WISE-SoE WaterQuality.DisaggregatedData

WISE-SoE_WaterQuality.DisaggregatedData - CAS_85535-85-9 - ug/L
type: Concept
notation: WISE-SoE_WaterQuality.DisaggregatedData - CAS_85535-85-9 - ug/L
definition: The unit of measure for 'CAS_85535-85-9' (Chloroalkanes C14-17,MCCP) in WISE SoE - Water Quality: Disaggregated data table is 'ug/L'
status: valid
status modified: 2019-10-03
accepted date: 2019-10-03
in scheme: Definition of correct units for the observed determinands in the given WISE SoE DD tables
has determinand: CAS 85535-85-9
has uom: ug.L-1
has table: WISE-SoE WaterQuality.DisaggregatedData

WISE-SoE_WaterQuality.DisaggregatedData - CAS_85721-33-1 - ug/L
type: Concept
notation: WISE-SoE_WaterQuality.DisaggregatedData - CAS_85721-33-1 - ug/L
definition: The unit of measure for 'CAS_85721-33-1' (Ciprofloxacin) in WISE SoE - Water Quality: Disaggregated data table is 'ug/L'
status: valid
status modified: 2019-10-03
accepted date: 2019-10-03
in scheme: Definition of correct units for the observed determinands in the given WISE SoE DD tables
has determinand: CAS 85721-33-1
has uom: ug.L-1
has table: WISE-SoE WaterQuality.DisaggregatedData

WISE-SoE_WaterQuality.DisaggregatedData - CAS_86-50-0 - ug/L
type: Concept
notation: WISE-SoE_WaterQuality.DisaggregatedData - CAS_86-50-0 - ug/L
definition: The unit of measure for 'CAS_86-50-0' (Azinphos-methyl) in WISE SoE - Water Quality: Disaggregated data table is 'ug/L'
status: valid
status modified: 2019-10-03
accepted date: 2019-10-03
in scheme: Definition of correct units for the observed determinands in the given WISE SoE DD tables
has determinand: CAS 86-50-0
has uom: ug.L-1
has table: WISE-SoE WaterQuality.DisaggregatedData

WISE-SoE_WaterQuality.DisaggregatedData - CAS_86-73-7 - ug/L
type: Concept
notation: WISE-SoE_WaterQuality.DisaggregatedData - CAS_86-73-7 - ug/L
definition: The unit of measure for 'CAS_86-73-7' (Fluorene) in WISE SoE - Water Quality: Disaggregated data table is 'ug/L'
status: valid
status modified: 2019-10-03
accepted date: 2019-10-03
in scheme: Definition of correct units for the observed determinands in the given WISE SoE DD tables
has determinand: CAS 86-73-7
has uom: ug.L-1
has table: WISE-SoE WaterQuality.DisaggregatedData

WISE-SoE_WaterQuality.DisaggregatedData - CAS_86209-51-0 - ug/L
type: Concept
notation: WISE-SoE_WaterQuality.DisaggregatedData - CAS_86209-51-0 - ug/L
definition: The unit of measure for 'CAS_86209-51-0' (Primisulfuron-methyl) in WISE SoE - Water Quality: Disaggregated data table is 'ug/L'
status: valid
status modified: 2019-10-03
accepted date: 2019-10-03
in scheme: Definition of correct units for the observed determinands in the given WISE SoE DD tables
has determinand: CAS 86209-51-0
has uom: ug.L-1
has table: WISE-SoE WaterQuality.DisaggregatedData

WISE-SoE_WaterQuality.DisaggregatedData - CAS_87-60-5 - ug/L
type: Concept
notation: WISE-SoE_WaterQuality.DisaggregatedData - CAS_87-60-5 - ug/L
definition: The unit of measure for 'CAS_87-60-5' (3-chloro-o-toluidine) in WISE SoE - Water Quality: Disaggregated data table is 'ug/L'
status: valid
status modified: 2019-10-03
accepted date: 2019-10-03
in scheme: Definition of correct units for the observed determinands in the given WISE SoE DD tables
has determinand: CAS 87-60-5
has uom: ug.L-1
has table: WISE-SoE WaterQuality.DisaggregatedData

WISE-SoE_WaterQuality.DisaggregatedData - CAS_87-61-6 - ug/L
type: Concept
notation: WISE-SoE_WaterQuality.DisaggregatedData - CAS_87-61-6 - ug/L
definition: The unit of measure for 'CAS_87-61-6' (1,2,3-trichlorobenzene) in WISE SoE - Water Quality: Disaggregated data table is 'ug/L'
status: valid
status modified: 2019-10-03
accepted date: 2019-10-03
in scheme: Definition of correct units for the observed determinands in the given WISE SoE DD tables
has determinand: CAS 87-61-6
has uom: ug.L-1
has table: WISE-SoE WaterQuality.DisaggregatedData

WISE-SoE_WaterQuality.DisaggregatedData - CAS_87-65-0 - ug/L
type: Concept
notation: WISE-SoE_WaterQuality.DisaggregatedData - CAS_87-65-0 - ug/L
definition: The unit of measure for 'CAS_87-65-0' (2,6-dichlorophenol) in WISE SoE - Water Quality: Disaggregated data table is 'ug/L'
status: valid
status modified: 2019-10-03
accepted date: 2019-10-03
in scheme: Definition of correct units for the observed determinands in the given WISE SoE DD tables
has determinand: CAS 87-65-0
has uom: ug.L-1
has table: WISE-SoE WaterQuality.DisaggregatedData

WISE-SoE_WaterQuality.DisaggregatedData - CAS_87-68-3 - ug/L
type: Concept
notation: WISE-SoE_WaterQuality.DisaggregatedData - CAS_87-68-3 - ug/L
definition: The unit of measure for 'CAS_87-68-3' (Hexachlorobutadiene) in WISE SoE - Water Quality: Disaggregated data table is 'ug/L'
status: valid
status modified: 2019-10-03
accepted date: 2019-10-03
in scheme: Definition of correct units for the observed determinands in the given WISE SoE DD tables
has determinand: CAS 87-68-3
has uom: ug.L-1
has table: WISE-SoE WaterQuality.DisaggregatedData

WISE-SoE_WaterQuality.DisaggregatedData - CAS_87-86-5 - ug/L
type: Concept
notation: WISE-SoE_WaterQuality.DisaggregatedData - CAS_87-86-5 - ug/L
definition: The unit of measure for 'CAS_87-86-5' (Pentachlorophenol) in WISE SoE - Water Quality: Disaggregated data table is 'ug/L'
status: valid
status modified: 2019-10-03
accepted date: 2019-10-03
in scheme: Definition of correct units for the observed determinands in the given WISE SoE DD tables
has determinand: CAS 87-86-5
has uom: ug.L-1
has table: WISE-SoE WaterQuality.DisaggregatedData

WISE-SoE_WaterQuality.DisaggregatedData - CAS_87674-68-8 - ug/L
type: Concept
notation: WISE-SoE_WaterQuality.DisaggregatedData - CAS_87674-68-8 - ug/L
definition: The unit of measure for 'CAS_87674-68-8' (Dimethenamid) in WISE SoE - Water Quality: Disaggregated data table is 'ug/L'
status: valid
status modified: 2019-10-03
accepted date: 2019-10-03
in scheme: Definition of correct units for the observed determinands in the given WISE SoE DD tables
has determinand: CAS 87674-68-8
has uom: ug.L-1
has table: WISE-SoE WaterQuality.DisaggregatedData

WISE-SoE_WaterQuality.DisaggregatedData - CAS_87820-88-0 - ug/L
type: Concept
notation: WISE-SoE_WaterQuality.DisaggregatedData - CAS_87820-88-0 - ug/L
definition: The unit of measure for 'CAS_87820-88-0' (Tralkoxydim) in WISE SoE - Water Quality: Disaggregated data table is 'ug/L'
status: valid
status modified: 2019-10-03
accepted date: 2019-10-03
in scheme: Definition of correct units for the observed determinands in the given WISE SoE DD tables
has determinand: CAS 87820-88-0
has uom: ug.L-1
has table: WISE-SoE WaterQuality.DisaggregatedData

WISE-SoE_WaterQuality.DisaggregatedData - CAS_88-06-2 - ug/L
type: Concept
notation: WISE-SoE_WaterQuality.DisaggregatedData - CAS_88-06-2 - ug/L
definition: The unit of measure for 'CAS_88-06-2' (2,4,6-trichlorophenol) in WISE SoE - Water Quality: Disaggregated data table is 'ug/L'
status: valid
status modified: 2019-10-03
accepted date: 2019-10-03
in scheme: Definition of correct units for the observed determinands in the given WISE SoE DD tables
has determinand: CAS 88-06-2
has uom: ug.L-1
has table: WISE-SoE WaterQuality.DisaggregatedData

WISE-SoE_WaterQuality.DisaggregatedData - CAS_88-73-3 - ug/L
type: Concept
notation: WISE-SoE_WaterQuality.DisaggregatedData - CAS_88-73-3 - ug/L
definition: The unit of measure for 'CAS_88-73-3' (1-chloro-2-nitrobenzene) in WISE SoE - Water Quality: Disaggregated data table is 'ug/L'
status: valid
status modified: 2019-10-03
accepted date: 2019-10-03
in scheme: Definition of correct units for the observed determinands in the given WISE SoE DD tables
has determinand: CAS 88-73-3
has uom: ug.L-1
has table: WISE-SoE WaterQuality.DisaggregatedData

WISE-SoE_WaterQuality.DisaggregatedData - CAS_88-85-7 - ug/L
type: Concept
notation: WISE-SoE_WaterQuality.DisaggregatedData - CAS_88-85-7 - ug/L
definition: The unit of measure for 'CAS_88-85-7' (Dinoseb) in WISE SoE - Water Quality: Disaggregated data table is 'ug/L'
status: valid
status modified: 2019-10-03
accepted date: 2019-10-03
in scheme: Definition of correct units for the observed determinands in the given WISE SoE DD tables
has determinand: CAS 88-85-7
has uom: ug.L-1
has table: WISE-SoE WaterQuality.DisaggregatedData

WISE-SoE_WaterQuality.DisaggregatedData - CAS_886-50-0 - ug/L
type: Concept
notation: WISE-SoE_WaterQuality.DisaggregatedData - CAS_886-50-0 - ug/L
definition: The unit of measure for 'CAS_886-50-0' (Terbutryn) in WISE SoE - Water Quality: Disaggregated data table is 'ug/L'
status: valid
status modified: 2019-10-03
accepted date: 2019-10-03
in scheme: Definition of correct units for the observed determinands in the given WISE SoE DD tables
has determinand: CAS 886-50-0
has uom: ug.L-1
has table: WISE-SoE WaterQuality.DisaggregatedData

WISE-SoE_WaterQuality.DisaggregatedData - CAS_88671-89-0 - ug/L
type: Concept
notation: WISE-SoE_WaterQuality.DisaggregatedData - CAS_88671-89-0 - ug/L
definition: The unit of measure for 'CAS_88671-89-0' (Myclobutanil) in WISE SoE - Water Quality: Disaggregated data table is 'ug/L'
status: valid
status modified: 2019-10-03
accepted date: 2019-10-03
in scheme: Definition of correct units for the observed determinands in the given WISE SoE DD tables
has determinand: CAS 88671-89-0
has uom: ug.L-1
has table: WISE-SoE WaterQuality.DisaggregatedData

WISE-SoE_WaterQuality.DisaggregatedData - CAS_89-21-4 - ug/L
type: Concept
notation: WISE-SoE_WaterQuality.DisaggregatedData - CAS_89-21-4 - ug/L
definition: The unit of measure for 'CAS_89-21-4' (4-chloro-2-nitroanisole) in WISE SoE - Water Quality: Disaggregated data table is 'ug/L'
status: valid
status modified: 2019-10-03
accepted date: 2019-10-03
in scheme: Definition of correct units for the observed determinands in the given WISE SoE DD tables
has determinand: CAS 89-21-4
has uom: ug.L-1
has table: WISE-SoE WaterQuality.DisaggregatedData

WISE-SoE_WaterQuality.DisaggregatedData - CAS_89-59-8 - ug/L
type: Concept
notation: WISE-SoE_WaterQuality.DisaggregatedData - CAS_89-59-8 - ug/L
definition: The unit of measure for 'CAS_89-59-8' (4-Chloro-2-nitrotoluene) in WISE SoE - Water Quality: Disaggregated data table is 'ug/L'
status: valid
status modified: 2019-10-03
accepted date: 2019-10-03
in scheme: Definition of correct units for the observed determinands in the given WISE SoE DD tables
has determinand: CAS 89-59-8
has uom: ug.L-1
has table: WISE-SoE WaterQuality.DisaggregatedData

WISE-SoE_WaterQuality.DisaggregatedData - CAS_89-60-1 - ug/L
type: Concept
notation: WISE-SoE_WaterQuality.DisaggregatedData - CAS_89-60-1 - ug/L
definition: The unit of measure for 'CAS_89-60-1' (4-chloro-3-nitrotoluene) in WISE SoE - Water Quality: Disaggregated data table is 'ug/L'
status: valid
status modified: 2019-10-03
accepted date: 2019-10-03
in scheme: Definition of correct units for the observed determinands in the given WISE SoE DD tables
has determinand: CAS 89-60-1
has uom: ug.L-1
has table: WISE-SoE WaterQuality.DisaggregatedData

WISE-SoE_WaterQuality.DisaggregatedData - CAS_89-61-2 - ug/L
type: Concept
notation: WISE-SoE_WaterQuality.DisaggregatedData - CAS_89-61-2 - ug/L
definition: The unit of measure for 'CAS_89-61-2' (1,4-dichloro-2-nitrobenzene) in WISE SoE - Water Quality: Disaggregated data table is 'ug/L'
status: valid
status modified: 2019-10-03
accepted date: 2019-10-03
in scheme: Definition of correct units for the observed determinands in the given WISE SoE DD tables
has determinand: CAS 89-61-2
has uom: ug.L-1
has table: WISE-SoE WaterQuality.DisaggregatedData

WISE-SoE_WaterQuality.DisaggregatedData - CAS_89-63-4 - ug/L
type: Concept
notation: WISE-SoE_WaterQuality.DisaggregatedData - CAS_89-63-4 - ug/L
definition: The unit of measure for 'CAS_89-63-4' (4-chloro-2-nitroaniline) in WISE SoE - Water Quality: Disaggregated data table is 'ug/L'
status: valid
status modified: 2019-10-03
accepted date: 2019-10-03
in scheme: Definition of correct units for the observed determinands in the given WISE SoE DD tables
has determinand: CAS 89-63-4
has uom: ug.L-1
has table: WISE-SoE WaterQuality.DisaggregatedData

WISE-SoE_WaterQuality.DisaggregatedData - CAS_90-12-0 - ug/L
type: Concept
notation: WISE-SoE_WaterQuality.DisaggregatedData - CAS_90-12-0 - ug/L
definition: The unit of measure for 'CAS_90-12-0' (1-methylnaphthalene) in WISE SoE - Water Quality: Disaggregated data table is 'ug/L'
status: valid
status modified: 2019-10-03
accepted date: 2019-10-03
in scheme: Definition of correct units for the observed determinands in the given WISE SoE DD tables
has determinand: CAS 90-12-0
has uom: ug.L-1
has table: WISE-SoE WaterQuality.DisaggregatedData

WISE-SoE_WaterQuality.DisaggregatedData - CAS_90-13-1 - ug/L
type: Concept
notation: WISE-SoE_WaterQuality.DisaggregatedData - CAS_90-13-1 - ug/L
definition: The unit of measure for 'CAS_90-13-1' (1-Chloronaphthalene) in WISE SoE - Water Quality: Disaggregated data table is 'ug/L'
status: valid
status modified: 2019-10-03
accepted date: 2019-10-03
in scheme: Definition of correct units for the observed determinands in the given WISE SoE DD tables
has determinand: CAS 90-13-1
has uom: ug.L-1
has table: WISE-SoE WaterQuality.DisaggregatedData

WISE-SoE_WaterQuality.DisaggregatedData - CAS_9016-45-9 - ug/L
type: Concept
notation: WISE-SoE_WaterQuality.DisaggregatedData - CAS_9016-45-9 - ug/L
definition: The unit of measure for 'CAS_9016-45-9' (Nonylphenol ethoxylate) in WISE SoE - Water Quality: Disaggregated data table is 'ug/L'
status: valid
status modified: 2019-10-03
accepted date: 2019-10-03
in scheme: Definition of correct units for the observed determinands in the given WISE SoE DD tables
has determinand: CAS 9016-45-9
has uom: ug.L-1
has table: WISE-SoE WaterQuality.DisaggregatedData

WISE-SoE_WaterQuality.DisaggregatedData - CAS_91-20-3 - ug/L
type: Concept
notation: WISE-SoE_WaterQuality.DisaggregatedData - CAS_91-20-3 - ug/L
definition: The unit of measure for 'CAS_91-20-3' (Naphthalene) in WISE SoE - Water Quality: Disaggregated data table is 'ug/L'
status: valid
status modified: 2019-10-03
accepted date: 2019-10-03
in scheme: Definition of correct units for the observed determinands in the given WISE SoE DD tables
has determinand: CAS 91-20-3
has uom: ug.L-1
has table: WISE-SoE WaterQuality.DisaggregatedData

WISE-SoE_WaterQuality.DisaggregatedData - CAS_91-57-6 - ug/L
type: Concept
notation: WISE-SoE_WaterQuality.DisaggregatedData - CAS_91-57-6 - ug/L
definition: The unit of measure for 'CAS_91-57-6' (2-methylnaphthalene) in WISE SoE - Water Quality: Disaggregated data table is 'ug/L'
status: valid
status modified: 2019-10-03
accepted date: 2019-10-03
in scheme: Definition of correct units for the observed determinands in the given WISE SoE DD tables
has determinand: CAS 91-57-6
has uom: ug.L-1
has table: WISE-SoE WaterQuality.DisaggregatedData

WISE-SoE_WaterQuality.DisaggregatedData - CAS_91-94-1 - ug/L
type: Concept
notation: WISE-SoE_WaterQuality.DisaggregatedData - CAS_91-94-1 - ug/L
definition: The unit of measure for 'CAS_91-94-1' (3,3'-dichlorobenzidine) in WISE SoE - Water Quality: Disaggregated data table is 'ug/L'
status: valid
status modified: 2019-10-03
accepted date: 2019-10-03
in scheme: Definition of correct units for the observed determinands in the given WISE SoE DD tables
has determinand: CAS 91-94-1
has uom: ug.L-1
has table: WISE-SoE WaterQuality.DisaggregatedData

WISE-SoE_WaterQuality.DisaggregatedData - CAS_919-86-8 - ug/L
type: Concept
notation: WISE-SoE_WaterQuality.DisaggregatedData - CAS_919-86-8 - ug/L
definition: The unit of measure for 'CAS_919-86-8' (Demeton-S-methyl) in WISE SoE - Water Quality: Disaggregated data table is 'ug/L'
status: valid
status modified: 2019-10-03
accepted date: 2019-10-03
in scheme: Definition of correct units for the observed determinands in the given WISE SoE DD tables
has determinand: CAS 919-86-8
has uom: ug.L-1
has table: WISE-SoE WaterQuality.DisaggregatedData

WISE-SoE_WaterQuality.DisaggregatedData - CAS_92-52-4 - ug/L
type: Concept
notation: WISE-SoE_WaterQuality.DisaggregatedData - CAS_92-52-4 - ug/L
definition: The unit of measure for 'CAS_92-52-4' (Biphenyl) in WISE SoE - Water Quality: Disaggregated data table is 'ug/L'
status: valid
status modified: 2019-10-03
accepted date: 2019-10-03
in scheme: Definition of correct units for the observed determinands in the given WISE SoE DD tables
has determinand: CAS 92-52-4
has uom: ug.L-1
has table: WISE-SoE WaterQuality.DisaggregatedData

WISE-SoE_WaterQuality.DisaggregatedData - CAS_92-87-5 - ug/L
type: Concept
notation: WISE-SoE_WaterQuality.DisaggregatedData - CAS_92-87-5 - ug/L
definition: The unit of measure for 'CAS_92-87-5' (Benzidine) in WISE SoE - Water Quality: Disaggregated data table is 'ug/L'
status: valid
status modified: 2019-10-03
accepted date: 2019-10-03
in scheme: Definition of correct units for the observed determinands in the given WISE SoE DD tables
has determinand: CAS 92-87-5
has uom: ug.L-1
has table: WISE-SoE WaterQuality.DisaggregatedData

WISE-SoE_WaterQuality.DisaggregatedData - CAS_93-65-2 - ug/L
type: Concept
notation: WISE-SoE_WaterQuality.DisaggregatedData - CAS_93-65-2 - ug/L
definition: The unit of measure for 'CAS_93-65-2' (Mecoprop) in WISE SoE - Water Quality: Disaggregated data table is 'ug/L'
status: valid
status modified: 2019-10-03
accepted date: 2019-10-03
in scheme: Definition of correct units for the observed determinands in the given WISE SoE DD tables
has determinand: CAS 93-65-2
has uom: ug.L-1
has table: WISE-SoE WaterQuality.DisaggregatedData

WISE-SoE_WaterQuality.DisaggregatedData - CAS_93-72-1 - ug/L
type: Concept
notation: WISE-SoE_WaterQuality.DisaggregatedData - CAS_93-72-1 - ug/L
definition: The unit of measure for 'CAS_93-72-1' (Fenoprop) in WISE SoE - Water Quality: Disaggregated data table is 'ug/L'
status: valid
status modified: 2019-10-03
accepted date: 2019-10-03
in scheme: Definition of correct units for the observed determinands in the given WISE SoE DD tables
has determinand: CAS 93-72-1
has uom: ug.L-1
has table: WISE-SoE WaterQuality.DisaggregatedData

WISE-SoE_WaterQuality.DisaggregatedData - CAS_93-76-5 - ug/L
type: Concept
notation: WISE-SoE_WaterQuality.DisaggregatedData - CAS_93-76-5 - ug/L
definition: The unit of measure for 'CAS_93-76-5' (2,4,5-T) in WISE SoE - Water Quality: Disaggregated data table is 'ug/L'
status: valid
status modified: 2019-10-03
accepted date: 2019-10-03
in scheme: Definition of correct units for the observed determinands in the given WISE SoE DD tables
has determinand: CAS 93-76-5
has uom: ug.L-1
has table: WISE-SoE WaterQuality.DisaggregatedData

WISE-SoE_WaterQuality.DisaggregatedData - CAS_933-75-5 - ug/L
type: Concept
notation: WISE-SoE_WaterQuality.DisaggregatedData - CAS_933-75-5 - ug/L
definition: The unit of measure for 'CAS_933-75-5' (2,3,6-Trichlorophenol) in WISE SoE - Water Quality: Disaggregated data table is 'ug/L'
status: valid
status modified: 2019-10-03
accepted date: 2019-10-03
in scheme: Definition of correct units for the observed determinands in the given WISE SoE DD tables
has determinand: CAS 933-75-5
has uom: ug.L-1
has table: WISE-SoE WaterQuality.DisaggregatedData

WISE-SoE_WaterQuality.DisaggregatedData - CAS_933-78-8 - ug/L
type: Concept
notation: WISE-SoE_WaterQuality.DisaggregatedData - CAS_933-78-8 - ug/L
definition: The unit of measure for 'CAS_933-78-8' (2,3,5-trichlorophenol) in WISE SoE - Water Quality: Disaggregated data table is 'ug/L'
status: valid
status modified: 2019-10-03
accepted date: 2019-10-03
in scheme: Definition of correct units for the observed determinands in the given WISE SoE DD tables
has determinand: CAS 933-78-8
has uom: ug.L-1
has table: WISE-SoE WaterQuality.DisaggregatedData

WISE-SoE_WaterQuality.DisaggregatedData - CAS_94-74-6 - ug/L
type: Concept
notation: WISE-SoE_WaterQuality.DisaggregatedData - CAS_94-74-6 - ug/L
definition: The unit of measure for 'CAS_94-74-6' (MCPA) in WISE SoE - Water Quality: Disaggregated data table is 'ug/L'
status: valid
status modified: 2019-10-03
accepted date: 2019-10-03
in scheme: Definition of correct units for the observed determinands in the given WISE SoE DD tables
has determinand: CAS 94-74-6
has uom: ug.L-1
has table: WISE-SoE WaterQuality.DisaggregatedData

WISE-SoE_WaterQuality.DisaggregatedData - CAS_94-75-7 - ug/L
type: Concept
notation: WISE-SoE_WaterQuality.DisaggregatedData - CAS_94-75-7 - ug/L
definition: The unit of measure for 'CAS_94-75-7' (2,4-dichlorophenoxyacetic acid, 2-4 D) in WISE SoE - Water Quality: Disaggregated data table is 'ug/L'
status: valid
status modified: 2019-10-03
accepted date: 2019-10-03
in scheme: Definition of correct units for the observed determinands in the given WISE SoE DD tables
has determinand: CAS 94-75-7
has uom: ug.L-1
has table: WISE-SoE WaterQuality.DisaggregatedData

WISE-SoE_WaterQuality.DisaggregatedData - CAS_94-81-5 - ug/L
type: Concept
notation: WISE-SoE_WaterQuality.DisaggregatedData - CAS_94-81-5 - ug/L
definition: The unit of measure for 'CAS_94-81-5' (MCPB) in WISE SoE - Water Quality: Disaggregated data table is 'ug/L'
status: valid
status modified: 2019-10-03
accepted date: 2019-10-03
in scheme: Definition of correct units for the observed determinands in the given WISE SoE DD tables
has determinand: CAS 94-81-5
has uom: ug.L-1
has table: WISE-SoE WaterQuality.DisaggregatedData

WISE-SoE_WaterQuality.DisaggregatedData - CAS_94-82-6 - ug/L
type: Concept
notation: WISE-SoE_WaterQuality.DisaggregatedData - CAS_94-82-6 - ug/L
definition: The unit of measure for 'CAS_94-82-6' (2,4-DB) in WISE SoE - Water Quality: Disaggregated data table is 'ug/L'
status: valid
status modified: 2019-10-03
accepted date: 2019-10-03
in scheme: Definition of correct units for the observed determinands in the given WISE SoE DD tables
has determinand: CAS 94-82-6
has uom: ug.L-1
has table: WISE-SoE WaterQuality.DisaggregatedData

WISE-SoE_WaterQuality.DisaggregatedData - CAS_94125-34-5 - ug/L
type: Concept
notation: WISE-SoE_WaterQuality.DisaggregatedData - CAS_94125-34-5 - ug/L
definition: The unit of measure for 'CAS_94125-34-5' (Prosulfuron) in WISE SoE - Water Quality: Disaggregated data table is 'ug/L'
status: valid
status modified: 2019-10-03
accepted date: 2019-10-03
in scheme: Definition of correct units for the observed determinands in the given WISE SoE DD tables
has determinand: CAS 94125-34-5
has uom: ug.L-1
has table: WISE-SoE WaterQuality.DisaggregatedData

WISE-SoE_WaterQuality.DisaggregatedData - CAS_944-22-9 - ug/L
type: Concept
notation: WISE-SoE_WaterQuality.DisaggregatedData - CAS_944-22-9 - ug/L
definition: The unit of measure for 'CAS_944-22-9' (Fonofos) in WISE SoE - Water Quality: Disaggregated data table is 'ug/L'
status: valid
status modified: 2019-10-03
accepted date: 2019-10-03
in scheme: Definition of correct units for the observed determinands in the given WISE SoE DD tables
has determinand: CAS 944-22-9
has uom: ug.L-1
has table: WISE-SoE WaterQuality.DisaggregatedData

WISE-SoE_WaterQuality.DisaggregatedData - CAS_95-14-7 - ug/L
type: Concept
notation: WISE-SoE_WaterQuality.DisaggregatedData - CAS_95-14-7 - ug/L
definition: The unit of measure for 'CAS_95-14-7' (Benzotriazol) in WISE SoE - Water Quality: Disaggregated data table is 'ug/L'
status: valid
status modified: 2019-10-03
accepted date: 2019-10-03
in scheme: Definition of correct units for the observed determinands in the given WISE SoE DD tables
has determinand: CAS 95-14-7
has uom: ug.L-1
has table: WISE-SoE WaterQuality.DisaggregatedData

WISE-SoE_WaterQuality.DisaggregatedData - CAS_95-16-9 - ug/L
type: Concept
notation: WISE-SoE_WaterQuality.DisaggregatedData - CAS_95-16-9 - ug/L
definition: The unit of measure for 'CAS_95-16-9' (Benzosulfonazole) in WISE SoE - Water Quality: Disaggregated data table is 'ug/L'
status: valid
status modified: 2019-10-03
accepted date: 2019-10-03
in scheme: Definition of correct units for the observed determinands in the given WISE SoE DD tables
has determinand: CAS 95-16-9
has uom: ug.L-1
has table: WISE-SoE WaterQuality.DisaggregatedData

WISE-SoE_WaterQuality.DisaggregatedData - CAS_95-47-6 - ug/L
type: Concept
notation: WISE-SoE_WaterQuality.DisaggregatedData - CAS_95-47-6 - ug/L
definition: The unit of measure for 'CAS_95-47-6' (O-xylene) in WISE SoE - Water Quality: Disaggregated data table is 'ug/L'
status: valid
status modified: 2019-10-03
accepted date: 2019-10-03
in scheme: Definition of correct units for the observed determinands in the given WISE SoE DD tables
has determinand: CAS 95-47-6
has uom: ug.L-1
has table: WISE-SoE WaterQuality.DisaggregatedData

WISE-SoE_WaterQuality.DisaggregatedData - CAS_95-48-7 - ug/L
type: Concept
notation: WISE-SoE_WaterQuality.DisaggregatedData - CAS_95-48-7 - ug/L
definition: The unit of measure for 'CAS_95-48-7' (2-methyl-phenol) in WISE SoE - Water Quality: Disaggregated data table is 'ug/L'
status: valid
status modified: 2019-10-03
accepted date: 2019-10-03
in scheme: Definition of correct units for the observed determinands in the given WISE SoE DD tables
has determinand: CAS 95-48-7
has uom: ug.L-1
has table: WISE-SoE WaterQuality.DisaggregatedData

WISE-SoE_WaterQuality.DisaggregatedData - CAS_95-49-8 - ug/L
type: Concept
notation: WISE-SoE_WaterQuality.DisaggregatedData - CAS_95-49-8 - ug/L
definition: The unit of measure for 'CAS_95-49-8' (2-chlorotoluene) in WISE SoE - Water Quality: Disaggregated data table is 'ug/L'
status: valid
status modified: 2019-10-03
accepted date: 2019-10-03
in scheme: Definition of correct units for the observed determinands in the given WISE SoE DD tables
has determinand: CAS 95-49-8
has uom: ug.L-1
has table: WISE-SoE WaterQuality.DisaggregatedData

WISE-SoE_WaterQuality.DisaggregatedData - CAS_95-50-1 - ug/L
type: Concept
notation: WISE-SoE_WaterQuality.DisaggregatedData - CAS_95-50-1 - ug/L
definition: The unit of measure for 'CAS_95-50-1' (1,2-dichlorobenzene) in WISE SoE - Water Quality: Disaggregated data table is 'ug/L'
status: valid
status modified: 2019-10-03
accepted date: 2019-10-03
in scheme: Definition of correct units for the observed determinands in the given WISE SoE DD tables
has determinand: CAS 95-50-1
has uom: ug.L-1
has table: WISE-SoE WaterQuality.DisaggregatedData

WISE-SoE_WaterQuality.DisaggregatedData - CAS_95-51-2 - ug/L
type: Concept
notation: WISE-SoE_WaterQuality.DisaggregatedData - CAS_95-51-2 - ug/L
definition: The unit of measure for 'CAS_95-51-2' (2-chloroaniline) in WISE SoE - Water Quality: Disaggregated data table is 'ug/L'
status: valid
status modified: 2019-10-03
accepted date: 2019-10-03
in scheme: Definition of correct units for the observed determinands in the given WISE SoE DD tables
has determinand: CAS 95-51-2
has uom: ug.L-1
has table: WISE-SoE WaterQuality.DisaggregatedData

WISE-SoE_WaterQuality.DisaggregatedData - CAS_95-57-8 - ug/L
type: Concept
notation: WISE-SoE_WaterQuality.DisaggregatedData - CAS_95-57-8 - ug/L
definition: The unit of measure for 'CAS_95-57-8' (2-chlorophenol) in WISE SoE - Water Quality: Disaggregated data table is 'ug/L'
status: valid
status modified: 2019-10-03
accepted date: 2019-10-03
in scheme: Definition of correct units for the observed determinands in the given WISE SoE DD tables
has determinand: CAS 95-57-8
has uom: ug.L-1
has table: WISE-SoE WaterQuality.DisaggregatedData

WISE-SoE_WaterQuality.DisaggregatedData - CAS_95-63-6 - ug/L
type: Concept
notation: WISE-SoE_WaterQuality.DisaggregatedData - CAS_95-63-6 - ug/L
definition: The unit of measure for 'CAS_95-63-6' (1,2,4-trimethylbenzene) in WISE SoE - Water Quality: Disaggregated data table is 'ug/L'
status: valid
status modified: 2019-10-03
accepted date: 2019-10-03
in scheme: Definition of correct units for the observed determinands in the given WISE SoE DD tables
has determinand: CAS 95-63-6
has uom: ug.L-1
has table: WISE-SoE WaterQuality.DisaggregatedData

WISE-SoE_WaterQuality.DisaggregatedData - CAS_95-65-8 - ug/L
type: Concept
notation: WISE-SoE_WaterQuality.DisaggregatedData - CAS_95-65-8 - ug/L
definition: The unit of measure for 'CAS_95-65-8' (3,4-dimethyl-phenol) in WISE SoE - Water Quality: Disaggregated data table is 'ug/L'
status: valid
status modified: 2019-10-03
accepted date: 2019-10-03
in scheme: Definition of correct units for the observed determinands in the given WISE SoE DD tables
has determinand: CAS 95-65-8
has uom: ug.L-1
has table: WISE-SoE WaterQuality.DisaggregatedData

WISE-SoE_WaterQuality.DisaggregatedData - CAS_95-74-9 - ug/L
type: Concept
notation: WISE-SoE_WaterQuality.DisaggregatedData - CAS_95-74-9 - ug/L
definition: The unit of measure for 'CAS_95-74-9' (3-chloro-p-toluidine) in WISE SoE - Water Quality: Disaggregated data table is 'ug/L'
status: valid
status modified: 2019-10-03
accepted date: 2019-10-03
in scheme: Definition of correct units for the observed determinands in the given WISE SoE DD tables
has determinand: CAS 95-74-9
has uom: ug.L-1
has table: WISE-SoE WaterQuality.DisaggregatedData

WISE-SoE_WaterQuality.DisaggregatedData - CAS_95-76-1 - ug/L
type: Concept
notation: WISE-SoE_WaterQuality.DisaggregatedData - CAS_95-76-1 - ug/L
definition: The unit of measure for 'CAS_95-76-1' (3,4-dichloroaniline) in WISE SoE - Water Quality: Disaggregated data table is 'ug/L'
status: valid
status modified: 2019-10-03
accepted date: 2019-10-03
in scheme: Definition of correct units for the observed determinands in the given WISE SoE DD tables
has determinand: CAS 95-76-1
has uom: ug.L-1
has table: WISE-SoE WaterQuality.DisaggregatedData

WISE-SoE_WaterQuality.DisaggregatedData - CAS_95-79-4 - ug/L
type: Concept
notation: WISE-SoE_WaterQuality.DisaggregatedData - CAS_95-79-4 - ug/L
definition: The unit of measure for 'CAS_95-79-4' (5-chloro-o-toluidine) in WISE SoE - Water Quality: Disaggregated data table is 'ug/L'
status: valid
status modified: 2019-10-03
accepted date: 2019-10-03
in scheme: Definition of correct units for the observed determinands in the given WISE SoE DD tables
has determinand: CAS 95-79-4
has uom: ug.L-1
has table: WISE-SoE WaterQuality.DisaggregatedData

WISE-SoE_WaterQuality.DisaggregatedData - CAS_95-82-9 - ug/L
type: Concept
notation: WISE-SoE_WaterQuality.DisaggregatedData - CAS_95-82-9 - ug/L
definition: The unit of measure for 'CAS_95-82-9' (2,5-dichloroaniline) in WISE SoE - Water Quality: Disaggregated data table is 'ug/L'
status: valid
status modified: 2019-10-03
accepted date: 2019-10-03
in scheme: Definition of correct units for the observed determinands in the given WISE SoE DD tables
has determinand: CAS 95-82-9
has uom: ug.L-1
has table: WISE-SoE WaterQuality.DisaggregatedData

WISE-SoE_WaterQuality.DisaggregatedData - CAS_95-85-2 - ug/L
type: Concept
notation: WISE-SoE_WaterQuality.DisaggregatedData - CAS_95-85-2 - ug/L
definition: The unit of measure for 'CAS_95-85-2' (2-amino-4-chlorophenol) in WISE SoE - Water Quality: Disaggregated data table is 'ug/L'
status: valid
status modified: 2019-10-03
accepted date: 2019-10-03
in scheme: Definition of correct units for the observed determinands in the given WISE SoE DD tables
has determinand: CAS 95-85-2
has uom: ug.L-1
has table: WISE-SoE WaterQuality.DisaggregatedData

WISE-SoE_WaterQuality.DisaggregatedData - CAS_95-87-4 - ug/L
type: Concept
notation: WISE-SoE_WaterQuality.DisaggregatedData - CAS_95-87-4 - ug/L
definition: The unit of measure for 'CAS_95-87-4' (2,5-dimethylphenol) in WISE SoE - Water Quality: Disaggregated data table is 'ug/L'
status: valid
status modified: 2019-10-03
accepted date: 2019-10-03
in scheme: Definition of correct units for the observed determinands in the given WISE SoE DD tables
has determinand: CAS 95-87-4
has uom: ug.L-1
has table: WISE-SoE WaterQuality.DisaggregatedData

WISE-SoE_WaterQuality.DisaggregatedData - CAS_95-94-3 - ug/L
type: Concept
notation: WISE-SoE_WaterQuality.DisaggregatedData - CAS_95-94-3 - ug/L
definition: The unit of measure for 'CAS_95-94-3' (1,2,4,5-tetrachlorobenzene) in WISE SoE - Water Quality: Disaggregated data table is 'ug/L'
status: valid
status modified: 2019-10-03
accepted date: 2019-10-03
in scheme: Definition of correct units for the observed determinands in the given WISE SoE DD tables
has determinand: CAS 95-94-3
has uom: ug.L-1
has table: WISE-SoE WaterQuality.DisaggregatedData

WISE-SoE_WaterQuality.DisaggregatedData - CAS_95-95-4 - ug/L
type: Concept
notation: WISE-SoE_WaterQuality.DisaggregatedData - CAS_95-95-4 - ug/L
definition: The unit of measure for 'CAS_95-95-4' (2,4,5-trichlorophenol) in WISE SoE - Water Quality: Disaggregated data table is 'ug/L'
status: valid
status modified: 2019-10-03
accepted date: 2019-10-03
in scheme: Definition of correct units for the observed determinands in the given WISE SoE DD tables
has determinand: CAS 95-95-4
has uom: ug.L-1
has table: WISE-SoE WaterQuality.DisaggregatedData

WISE-SoE_WaterQuality.DisaggregatedData - CAS_950-37-8 - ug/L
type: Concept
notation: WISE-SoE_WaterQuality.DisaggregatedData - CAS_950-37-8 - ug/L
definition: The unit of measure for 'CAS_950-37-8' (Methidathion) in WISE SoE - Water Quality: Disaggregated data table is 'ug/L'
status: valid
status modified: 2019-10-03
accepted date: 2019-10-03
in scheme: Definition of correct units for the observed determinands in the given WISE SoE DD tables
has determinand: CAS 950-37-8
has uom: ug.L-1
has table: WISE-SoE WaterQuality.DisaggregatedData

WISE-SoE_WaterQuality.DisaggregatedData - CAS_95465-99-9 - ug/L
type: Concept
notation: WISE-SoE_WaterQuality.DisaggregatedData - CAS_95465-99-9 - ug/L
definition: The unit of measure for 'CAS_95465-99-9' (Cadusafos) in WISE SoE - Water Quality: Disaggregated data table is 'ug/L'
status: valid
status modified: 2019-10-03
accepted date: 2019-10-03
in scheme: Definition of correct units for the observed determinands in the given WISE SoE DD tables
has determinand: CAS 95465-99-9
has uom: ug.L-1
has table: WISE-SoE WaterQuality.DisaggregatedData

WISE-SoE_WaterQuality.DisaggregatedData - CAS_95617-09-7 - ug/L
type: Concept
notation: WISE-SoE_WaterQuality.DisaggregatedData - CAS_95617-09-7 - ug/L
definition: The unit of measure for 'CAS_95617-09-7' (Fenoxaprop) in WISE SoE - Water Quality: Disaggregated data table is 'ug/L'
status: valid
status modified: 2019-10-03
accepted date: 2019-10-03
in scheme: Definition of correct units for the observed determinands in the given WISE SoE DD tables
has determinand: CAS 95617-09-7
has uom: ug.L-1
has table: WISE-SoE WaterQuality.DisaggregatedData

WISE-SoE_WaterQuality.DisaggregatedData - CAS_959-98-8 - ug/L
type: Concept
notation: WISE-SoE_WaterQuality.DisaggregatedData - CAS_959-98-8 - ug/L
definition: The unit of measure for 'CAS_959-98-8' (Alpha-Endosulfan) in WISE SoE - Water Quality: Disaggregated data table is 'ug/L'
status: valid
status modified: 2019-10-03
accepted date: 2019-10-03
in scheme: Definition of correct units for the observed determinands in the given WISE SoE DD tables
has determinand: CAS 959-98-8
has uom: ug.L-1
has table: WISE-SoE WaterQuality.DisaggregatedData

WISE-SoE_WaterQuality.DisaggregatedData - CAS_96-12-8 - ug/L
type: Concept
notation: WISE-SoE_WaterQuality.DisaggregatedData - CAS_96-12-8 - ug/L
definition: The unit of measure for 'CAS_96-12-8' (1,2-dibromo-3-chloropropane) in WISE SoE - Water Quality: Disaggregated data table is 'ug/L'
status: valid
status modified: 2019-10-03
accepted date: 2019-10-03
in scheme: Definition of correct units for the observed determinands in the given WISE SoE DD tables
has determinand: CAS 96-12-8
has uom: ug.L-1
has table: WISE-SoE WaterQuality.DisaggregatedData

WISE-SoE_WaterQuality.DisaggregatedData - CAS_96-18-4 - ug/L
type: Concept
notation: WISE-SoE_WaterQuality.DisaggregatedData - CAS_96-18-4 - ug/L
definition: The unit of measure for 'CAS_96-18-4' (1,2,3-trichloropropane) in WISE SoE - Water Quality: Disaggregated data table is 'ug/L'
status: valid
status modified: 2019-10-03
accepted date: 2019-10-03
in scheme: Definition of correct units for the observed determinands in the given WISE SoE DD tables
has determinand: CAS 96-18-4
has uom: ug.L-1
has table: WISE-SoE WaterQuality.DisaggregatedData

WISE-SoE_WaterQuality.DisaggregatedData - CAS_96-23-1 - ug/L
type: Concept
notation: WISE-SoE_WaterQuality.DisaggregatedData - CAS_96-23-1 - ug/L
definition: The unit of measure for 'CAS_96-23-1' (1,3-dichloropropan-2-ol) in WISE SoE - Water Quality: Disaggregated data table is 'ug/L'
status: valid
status modified: 2019-10-03
accepted date: 2019-10-03
in scheme: Definition of correct units for the observed determinands in the given WISE SoE DD tables
has determinand: CAS 96-23-1
has uom: ug.L-1
has table: WISE-SoE WaterQuality.DisaggregatedData

WISE-SoE_WaterQuality.DisaggregatedData - CAS_96-45-7 - ug/L
type: Concept
notation: WISE-SoE_WaterQuality.DisaggregatedData - CAS_96-45-7 - ug/L
definition: The unit of measure for 'CAS_96-45-7' (Ethylenethiourea (ETU)) in WISE SoE - Water Quality: Disaggregated data table is 'ug/L'
status: valid
status modified: 2019-10-03
accepted date: 2019-10-03
in scheme: Definition of correct units for the observed determinands in the given WISE SoE DD tables
has determinand: CAS 96-45-7
has uom: ug.L-1
has table: WISE-SoE WaterQuality.DisaggregatedData

WISE-SoE_WaterQuality.DisaggregatedData - CAS_96489-71-3 - ug/L
type: Concept
notation: WISE-SoE_WaterQuality.DisaggregatedData - CAS_96489-71-3 - ug/L
definition: The unit of measure for 'CAS_96489-71-3' (Pyridaben) in WISE SoE - Water Quality: Disaggregated data table is 'ug/L'
status: valid
status modified: 2019-10-03
accepted date: 2019-10-03
in scheme: Definition of correct units for the observed determinands in the given WISE SoE DD tables
has determinand: CAS 96489-71-3
has uom: ug.L-1
has table: WISE-SoE WaterQuality.DisaggregatedData

WISE-SoE_WaterQuality.DisaggregatedData - CAS_97-00-7 - ug/L
type: Concept
notation: WISE-SoE_WaterQuality.DisaggregatedData - CAS_97-00-7 - ug/L
definition: The unit of measure for 'CAS_97-00-7' (1-chloro-2,4-dinitrobenzene) in WISE SoE - Water Quality: Disaggregated data table is 'ug/L'
status: valid
status modified: 2019-10-03
accepted date: 2019-10-03
in scheme: Definition of correct units for the observed determinands in the given WISE SoE DD tables
has determinand: CAS 97-00-7
has uom: ug.L-1
has table: WISE-SoE WaterQuality.DisaggregatedData

WISE-SoE_WaterQuality.DisaggregatedData - CAS_98-06-6 - ug/L
type: Concept
notation: WISE-SoE_WaterQuality.DisaggregatedData - CAS_98-06-6 - ug/L
definition: The unit of measure for 'CAS_98-06-6' (tert-butylbenzene) in WISE SoE - Water Quality: Disaggregated data table is 'ug/L'
status: valid
status modified: 2019-10-03
accepted date: 2019-10-03
in scheme: Definition of correct units for the observed determinands in the given WISE SoE DD tables
has determinand: CAS 98-06-6
has uom: ug.L-1
has table: WISE-SoE WaterQuality.DisaggregatedData

WISE-SoE_WaterQuality.DisaggregatedData - CAS_98-51-1 - ug/L
type: Concept
notation: WISE-SoE_WaterQuality.DisaggregatedData - CAS_98-51-1 - ug/L
definition: The unit of measure for 'CAS_98-51-1' (4-tert-butyltoluene) in WISE SoE - Water Quality: Disaggregated data table is 'ug/L'
status: valid
status modified: 2019-10-03
accepted date: 2019-10-03
in scheme: Definition of correct units for the observed determinands in the given WISE SoE DD tables
has determinand: CAS 98-51-1
has uom: ug.L-1
has table: WISE-SoE WaterQuality.DisaggregatedData

WISE-SoE_WaterQuality.DisaggregatedData - CAS_98-82-8 - ug/L
type: Concept
notation: WISE-SoE_WaterQuality.DisaggregatedData - CAS_98-82-8 - ug/L
definition: The unit of measure for 'CAS_98-82-8' (Isopropylbenzene) in WISE SoE - Water Quality: Disaggregated data table is 'ug/L'
status: valid
status modified: 2019-10-03
accepted date: 2019-10-03
in scheme: Definition of correct units for the observed determinands in the given WISE SoE DD tables
has determinand: CAS 98-82-8
has uom: ug.L-1
has table: WISE-SoE WaterQuality.DisaggregatedData

WISE-SoE_WaterQuality.DisaggregatedData - CAS_98-87-3 - ug/L
type: Concept
notation: WISE-SoE_WaterQuality.DisaggregatedData - CAS_98-87-3 - ug/L
definition: The unit of measure for 'CAS_98-87-3' (a,a-dichlorotoluene) in WISE SoE - Water Quality: Disaggregated data table is 'ug/L'
status: valid
status modified: 2019-10-03
accepted date: 2019-10-03
in scheme: Definition of correct units for the observed determinands in the given WISE SoE DD tables
has determinand: CAS 98-87-3
has uom: ug.L-1
has table: WISE-SoE WaterQuality.DisaggregatedData

WISE-SoE_WaterQuality.DisaggregatedData - CAS_98-95-3 - ug/L
type: Concept
notation: WISE-SoE_WaterQuality.DisaggregatedData - CAS_98-95-3 - ug/L
definition: The unit of measure for 'CAS_98-95-3' (Nitrobenzene) in WISE SoE - Water Quality: Disaggregated data table is 'ug/L'
status: valid
status modified: 2019-10-03
accepted date: 2019-10-03
in scheme: Definition of correct units for the observed determinands in the given WISE SoE DD tables
has determinand: CAS 98-95-3
has uom: ug.L-1
has table: WISE-SoE WaterQuality.DisaggregatedData

WISE-SoE_WaterQuality.DisaggregatedData - CAS_99-30-9 - ug/L
type: Concept
notation: WISE-SoE_WaterQuality.DisaggregatedData - CAS_99-30-9 - ug/L
definition: The unit of measure for 'CAS_99-30-9' (Dicloran) in WISE SoE - Water Quality: Disaggregated data table is 'ug/L'
status: valid
status modified: 2019-10-03
accepted date: 2019-10-03
in scheme: Definition of correct units for the observed determinands in the given WISE SoE DD tables
has determinand: CAS 99-30-9
has uom: ug.L-1
has table: WISE-SoE WaterQuality.DisaggregatedData

WISE-SoE_WaterQuality.DisaggregatedData - CAS_99-54-7 - ug/L
type: Concept
notation: WISE-SoE_WaterQuality.DisaggregatedData - CAS_99-54-7 - ug/L
definition: The unit of measure for 'CAS_99-54-7' (1,2-Dichloro-4-nitrobenzene) in WISE SoE - Water Quality: Disaggregated data table is 'ug/L'
status: valid
status modified: 2019-10-03
accepted date: 2019-10-03
in scheme: Definition of correct units for the observed determinands in the given WISE SoE DD tables
has determinand: CAS 99-54-7
has uom: ug.L-1
has table: WISE-SoE WaterQuality.DisaggregatedData

WISE-SoE_WaterQuality.DisaggregatedData - CAS_99-87-6 - ug/L
type: Concept
notation: WISE-SoE_WaterQuality.DisaggregatedData - CAS_99-87-6 - ug/L
definition: The unit of measure for 'CAS_99-87-6' (4-isopropyltoluene) in WISE SoE - Water Quality: Disaggregated data table is 'ug/L'
status: valid
status modified: 2019-10-03
accepted date: 2019-10-03
in scheme: Definition of correct units for the observed determinands in the given WISE SoE DD tables
has determinand: CAS 99-87-6
has uom: ug.L-1
has table: WISE-SoE WaterQuality.DisaggregatedData

WISE-SoE_WaterQuality.DisaggregatedData - CAS_99105-77-8 - ug/L
type: Concept
notation: WISE-SoE_WaterQuality.DisaggregatedData - CAS_99105-77-8 - ug/L
definition: The unit of measure for 'CAS_99105-77-8' (Sulcotrione) in WISE SoE - Water Quality: Disaggregated data table is 'ug/L'
status: valid
status modified: 2019-10-03
accepted date: 2019-10-03
in scheme: Definition of correct units for the observed determinands in the given WISE SoE DD tables
has determinand: CAS 99105-77-8
has uom: ug.L-1
has table: WISE-SoE WaterQuality.DisaggregatedData

WISE-SoE_WaterQuality.DisaggregatedData - CAS_994-05-8 - ug/L
type: Concept
notation: WISE-SoE_WaterQuality.DisaggregatedData - CAS_994-05-8 - ug/L
definition: The unit of measure for 'CAS_994-05-8' (TAME) in WISE SoE - Water Quality: Disaggregated data table is 'ug/L'
status: valid
status modified: 2019-10-03
accepted date: 2019-10-03
in scheme: Definition of correct units for the observed determinands in the given WISE SoE DD tables
has determinand: CAS 994-05-8
has uom: ug.L-1
has table: WISE-SoE WaterQuality.DisaggregatedData

WISE-SoE_WaterQuality.DisaggregatedData - CAS_999-81-5 - ug/L
type: Concept
notation: WISE-SoE_WaterQuality.DisaggregatedData - CAS_999-81-5 - ug/L
definition: The unit of measure for 'CAS_999-81-5' (Chlormequat chloride) in WISE SoE - Water Quality: Disaggregated data table is 'ug/L'
status: valid
status modified: 2019-10-03
accepted date: 2019-10-03
in scheme: Definition of correct units for the observed determinands in the given WISE SoE DD tables
has determinand: CAS 999-81-5
has uom: ug.L-1
has table: WISE-SoE WaterQuality.DisaggregatedData

WISE-SoE_WaterQuality.DisaggregatedData - EEA_00-00-0 - ug/L
type: Concept
notation: WISE-SoE_WaterQuality.DisaggregatedData - EEA_00-00-0 - ug/L
definition: The unit of measure for 'EEA_00-00-0' (Other chemical parameter) in WISE SoE - Water Quality: Disaggregated data table is 'ug/L'
status: valid
status modified: 2019-10-03
accepted date: 2019-10-03
in scheme: Definition of correct units for the observed determinands in the given WISE SoE DD tables
has determinand: EEA 00-00-0
has uom: ug.L-1
has table: WISE-SoE WaterQuality.DisaggregatedData

WISE-SoE_WaterQuality.DisaggregatedData - EEA_11-05-2 - mg/L
type: Concept
notation: WISE-SoE_WaterQuality.DisaggregatedData - EEA_11-05-2 - mg/L
definition: The unit of measure for 'EEA_11-05-2' (Total phytoplankton biomass) in WISE SoE - Water Quality: Disaggregated data table is 'mg/L'
status: valid
status modified: 2019-10-03
accepted date: 2019-10-03
in scheme: Definition of correct units for the observed determinands in the given WISE SoE DD tables
has determinand: EEA 11-05-2
has uom: mg.L-1
has table: WISE-SoE WaterQuality.DisaggregatedData

WISE-SoE_WaterQuality.DisaggregatedData - EEA_123-07-9 - {presence}
type: Concept
notation: WISE-SoE_WaterQuality.DisaggregatedData - EEA_123-07-9 - {presence}
definition: The unit of measure for 'EEA_123-07-9' (Isoetides presence) in WISE SoE - Water Quality: Disaggregated data table is '{presence}'
status: valid
status modified: 2019-10-03
accepted date: 2019-10-03
in scheme: Definition of correct units for the observed determinands in the given WISE SoE DD tables
has determinand: EEA 123-07-9
has uom: {presence}
has table: WISE-SoE WaterQuality.DisaggregatedData

WISE-SoE_WaterQuality.DisaggregatedData - EEA_31-01-6 - mg{CaCO3}/L
type: Concept
notation: WISE-SoE_WaterQuality.DisaggregatedData - EEA_31-01-6 - mg{CaCO3}/L
definition: The unit of measure for 'EEA_31-01-6' (Hardness) in WISE SoE - Water Quality: Disaggregated data table is 'mg{CaCO3}/L'
status: valid
status modified: 2019-10-03
accepted date: 2019-10-03
in scheme: Definition of correct units for the observed determinands in the given WISE SoE DD tables
has determinand: EEA 31-01-6
has uom: mg{CaCO3}.L-1
has table: WISE-SoE WaterQuality.DisaggregatedData

WISE-SoE_WaterQuality.DisaggregatedData - EEA_31-02-7 - mg/L
type: Concept
notation: WISE-SoE_WaterQuality.DisaggregatedData - EEA_31-02-7 - mg/L
definition: The unit of measure for 'EEA_31-02-7' (Total suspended solids) in WISE SoE - Water Quality: Disaggregated data table is 'mg/L'
status: valid
status modified: 2019-10-03
accepted date: 2019-10-03
in scheme: Definition of correct units for the observed determinands in the given WISE SoE DD tables
has determinand: EEA 31-02-7
has uom: mg.L-1
has table: WISE-SoE WaterQuality.DisaggregatedData

WISE-SoE_WaterQuality.DisaggregatedData - EEA_31-03-8 - mg/L
type: Concept
notation: WISE-SoE_WaterQuality.DisaggregatedData - EEA_31-03-8 - mg/L
definition: The unit of measure for 'EEA_31-03-8' (Total dissolved solids) in WISE SoE - Water Quality: Disaggregated data table is 'mg/L'
status: valid
status modified: 2019-10-03
accepted date: 2019-10-03
in scheme: Definition of correct units for the observed determinands in the given WISE SoE DD tables
has determinand: EEA 31-03-8
has uom: mg.L-1
has table: WISE-SoE WaterQuality.DisaggregatedData

WISE-SoE_WaterQuality.DisaggregatedData - EEA_3111-01-1 - m
type: Concept
notation: WISE-SoE_WaterQuality.DisaggregatedData - EEA_3111-01-1 - m
definition: The unit of measure for 'EEA_3111-01-1' (Secchi depth) in WISE SoE - Water Quality: Disaggregated data table is 'm'
status: valid
status modified: 2019-10-03
accepted date: 2019-10-03
in scheme: Definition of correct units for the observed determinands in the given WISE SoE DD tables
has determinand: EEA 3111-01-1
has uom: http://dd.eionet.europa.eu/vocabulary/wise/uom/m
has table: WISE-SoE WaterQuality.DisaggregatedData

WISE-SoE_WaterQuality.DisaggregatedData - EEA_3112-01-4 - {NTU}
type: Concept
notation: WISE-SoE_WaterQuality.DisaggregatedData - EEA_3112-01-4 - {NTU}
definition: The unit of measure for 'EEA_3112-01-4' (Turbidity) in WISE SoE - Water Quality: Disaggregated data table is '{NTU}'
status: valid
status modified: 2019-10-03
accepted date: 2019-10-03
in scheme: Definition of correct units for the observed determinands in the given WISE SoE DD tables
has determinand: EEA 3112-01-4
has uom: {NTU}
has table: WISE-SoE WaterQuality.DisaggregatedData

WISE-SoE_WaterQuality.DisaggregatedData - EEA_3121-01-5 - Cel
type: Concept
notation: WISE-SoE_WaterQuality.DisaggregatedData - EEA_3121-01-5 - Cel
definition: The unit of measure for 'EEA_3121-01-5' (Water temperature) in WISE SoE - Water Quality: Disaggregated data table is 'Cel'
status: valid
status modified: 2019-10-03
accepted date: 2019-10-03
in scheme: Definition of correct units for the observed determinands in the given WISE SoE DD tables
has determinand: EEA 3121-01-5
has uom: Cel
has table: WISE-SoE WaterQuality.DisaggregatedData

WISE-SoE_WaterQuality.DisaggregatedData - EEA_3131-01-9 - %
type: Concept
notation: WISE-SoE_WaterQuality.DisaggregatedData - EEA_3131-01-9 - %
definition: The unit of measure for 'EEA_3131-01-9' (Oxygen saturation) in WISE SoE - Water Quality: Disaggregated data table is '%'
status: valid
status modified: 2019-10-03
accepted date: 2019-10-03
in scheme: Definition of correct units for the observed determinands in the given WISE SoE DD tables
has determinand: EEA 3131-01-9
has uom: percent
has table: WISE-SoE WaterQuality.DisaggregatedData

WISE-SoE_WaterQuality.DisaggregatedData - EEA_3132-01-2 - mg/L
type: Concept
notation: WISE-SoE_WaterQuality.DisaggregatedData - EEA_3132-01-2 - mg/L
definition: The unit of measure for 'EEA_3132-01-2' (Dissolved oxygen) in WISE SoE - Water Quality: Disaggregated data table is 'mg/L'
status: valid
status modified: 2019-10-03
accepted date: 2019-10-03
in scheme: Definition of correct units for the observed determinands in the given WISE SoE DD tables
has determinand: EEA 3132-01-2
has uom: mg.L-1
has table: WISE-SoE WaterQuality.DisaggregatedData

WISE-SoE_WaterQuality.DisaggregatedData - EEA_3133-01-5 - mg{O2}/L
type: Concept
notation: WISE-SoE_WaterQuality.DisaggregatedData - EEA_3133-01-5 - mg{O2}/L
definition: The unit of measure for 'EEA_3133-01-5' (BOD5) in WISE SoE - Water Quality: Disaggregated data table is 'mg{O2}/L'
status: valid
status modified: 2019-10-03
accepted date: 2019-10-03
in scheme: Definition of correct units for the observed determinands in the given WISE SoE DD tables
has determinand: EEA 3133-01-5
has uom: mg{O2}.L-1
has table: WISE-SoE WaterQuality.DisaggregatedData

WISE-SoE_WaterQuality.DisaggregatedData - EEA_3133-02-6 - mg{O2}/L
type: Concept
notation: WISE-SoE_WaterQuality.DisaggregatedData - EEA_3133-02-6 - mg{O2}/L
definition: The unit of measure for 'EEA_3133-02-6' (BOD7) in WISE SoE - Water Quality: Disaggregated data table is 'mg{O2}/L'
status: valid
status modified: 2019-10-03
accepted date: 2019-10-03
in scheme: Definition of correct units for the observed determinands in the given WISE SoE DD tables
has determinand: EEA 3133-02-6
has uom: mg{O2}.L-1
has table: WISE-SoE WaterQuality.DisaggregatedData

WISE-SoE_WaterQuality.DisaggregatedData - EEA_3133-03-7 - mg{O2}/L
type: Concept
notation: WISE-SoE_WaterQuality.DisaggregatedData - EEA_3133-03-7 - mg{O2}/L
definition: The unit of measure for 'EEA_3133-03-7' (CODCr) in WISE SoE - Water Quality: Disaggregated data table is 'mg{O2}/L'
status: valid
status modified: 2019-10-03
accepted date: 2019-10-03
in scheme: Definition of correct units for the observed determinands in the given WISE SoE DD tables
has determinand: EEA 3133-03-7
has uom: mg{O2}.L-1
has table: WISE-SoE WaterQuality.DisaggregatedData

WISE-SoE_WaterQuality.DisaggregatedData - EEA_3133-04-8 - mg{O2}/L
type: Concept
notation: WISE-SoE_WaterQuality.DisaggregatedData - EEA_3133-04-8 - mg{O2}/L
definition: The unit of measure for 'EEA_3133-04-8' (CODMn) in WISE SoE - Water Quality: Disaggregated data table is 'mg{O2}/L'
status: valid
status modified: 2019-10-03
accepted date: 2019-10-03
in scheme: Definition of correct units for the observed determinands in the given WISE SoE DD tables
has determinand: EEA 3133-04-8
has uom: mg{O2}.L-1
has table: WISE-SoE WaterQuality.DisaggregatedData

WISE-SoE_WaterQuality.DisaggregatedData - EEA_3133-05-9 - mg{C}/L
type: Concept
notation: WISE-SoE_WaterQuality.DisaggregatedData - EEA_3133-05-9 - mg{C}/L
definition: The unit of measure for 'EEA_3133-05-9' (Dissolved organic carbon (DOC)) in WISE SoE - Water Quality: Disaggregated data table is 'mg{C}/L'
status: valid
status modified: 2019-10-03
accepted date: 2019-10-03
in scheme: Definition of correct units for the observed determinands in the given WISE SoE DD tables
has determinand: EEA 3133-05-9
has uom: mg{C}.L-1
has table: WISE-SoE WaterQuality.DisaggregatedData

WISE-SoE_WaterQuality.DisaggregatedData - EEA_3133-06-0 - mg{C}/L
type: Concept
notation: WISE-SoE_WaterQuality.DisaggregatedData - EEA_3133-06-0 - mg{C}/L
definition: The unit of measure for 'EEA_3133-06-0' (Total organic carbon (TOC)) in WISE SoE - Water Quality: Disaggregated data table is 'mg{C}/L'
status: valid
status modified: 2019-10-03
accepted date: 2019-10-03
in scheme: Definition of correct units for the observed determinands in the given WISE SoE DD tables
has determinand: EEA 3133-06-0
has uom: mg{C}.L-1
has table: WISE-SoE WaterQuality.DisaggregatedData

WISE-SoE_WaterQuality.DisaggregatedData - EEA_3141-01-3 - {PSU}
type: Concept
notation: WISE-SoE_WaterQuality.DisaggregatedData - EEA_3141-01-3 - {PSU}
definition: The unit of measure for 'EEA_3141-01-3' (Salinity) in WISE SoE - Water Quality: Disaggregated data table is '{PSU}'
status: valid
status modified: 2019-10-03
accepted date: 2019-10-03
in scheme: Definition of correct units for the observed determinands in the given WISE SoE DD tables
has determinand: EEA 3141-01-3
has uom: {PSU}
has table: WISE-SoE WaterQuality.DisaggregatedData

WISE-SoE_WaterQuality.DisaggregatedData - EEA_3142-01-6 - uS/cm
type: Concept
notation: WISE-SoE_WaterQuality.DisaggregatedData - EEA_3142-01-6 - uS/cm
definition: The unit of measure for 'EEA_3142-01-6' (Electrical conductivity) in WISE SoE - Water Quality: Disaggregated data table is 'uS/cm'
status: valid
status modified: 2019-10-03
accepted date: 2019-10-03
in scheme: Definition of correct units for the observed determinands in the given WISE SoE DD tables
has determinand: EEA 3142-01-6
has uom: uS.cm-1
has table: WISE-SoE WaterQuality.DisaggregatedData

WISE-SoE_WaterQuality.DisaggregatedData - EEA_3142-02-7 - mg/L
type: Concept
notation: WISE-SoE_WaterQuality.DisaggregatedData - EEA_3142-02-7 - mg/L
definition: The unit of measure for 'EEA_3142-02-7' (Chlorine Cl-) in WISE SoE - Water Quality: Disaggregated data table is 'mg/L'
status: valid
status modified: 2019-10-03
accepted date: 2019-10-03
in scheme: Definition of correct units for the observed determinands in the given WISE SoE DD tables
has determinand: EEA 3142-02-7
has uom: mg.L-1
has table: WISE-SoE WaterQuality.DisaggregatedData

WISE-SoE_WaterQuality.DisaggregatedData - EEA_3151-01-7 - mmol/L
type: Concept
notation: WISE-SoE_WaterQuality.DisaggregatedData - EEA_3151-01-7 - mmol/L
definition: The unit of measure for 'EEA_3151-01-7' (Acid neutralizing capacity) in WISE SoE - Water Quality: Disaggregated data table is 'mmol/L'
status: valid
status modified: 2019-10-03
accepted date: 2019-10-03
in scheme: Definition of correct units for the observed determinands in the given WISE SoE DD tables
has determinand: EEA 3151-01-7
has uom: mmol.L-1
has table: WISE-SoE WaterQuality.DisaggregatedData

WISE-SoE_WaterQuality.DisaggregatedData - EEA_3152-01-0 - [pH]
type: Concept
notation: WISE-SoE_WaterQuality.DisaggregatedData - EEA_3152-01-0 - [pH]
definition: The unit of measure for 'EEA_3152-01-0' (pH) in WISE SoE - Water Quality: Disaggregated data table is '[pH]'
status: valid
status modified: 2019-10-03
accepted date: 2019-10-03
in scheme: Definition of correct units for the observed determinands in the given WISE SoE DD tables
has determinand: EEA 3152-01-0
has uom: [pH]
has table: WISE-SoE WaterQuality.DisaggregatedData

WISE-SoE_WaterQuality.DisaggregatedData - EEA_3153-01-3 - mmol/L
type: Concept
notation: WISE-SoE_WaterQuality.DisaggregatedData - EEA_3153-01-3 - mmol/L
definition: The unit of measure for 'EEA_3153-01-3' (Acid neutralizing capacity to pH 4.5) in WISE SoE - Water Quality: Disaggregated data table is 'mmol/L'
status: valid
status modified: 2019-10-03
accepted date: 2019-10-03
in scheme: Definition of correct units for the observed determinands in the given WISE SoE DD tables
has determinand: EEA 3153-01-3
has uom: mmol.L-1
has table: WISE-SoE WaterQuality.DisaggregatedData

WISE-SoE_WaterQuality.DisaggregatedData - EEA_3153-02-4 - mg/L
type: Concept
notation: WISE-SoE_WaterQuality.DisaggregatedData - EEA_3153-02-4 - mg/L
definition: The unit of measure for 'EEA_3153-02-4' (Alkalinity) in WISE SoE - Water Quality: Disaggregated data table is 'mg/L'
status: valid
status modified: 2019-10-03
accepted date: 2019-10-03
in scheme: Definition of correct units for the observed determinands in the given WISE SoE DD tables
has determinand: EEA 3153-02-4
has uom: mg.L-1
has table: WISE-SoE WaterQuality.DisaggregatedData

WISE-SoE_WaterQuality.DisaggregatedData - EEA_3161-01-1 - mg{N}/L
type: Concept
notation: WISE-SoE_WaterQuality.DisaggregatedData - EEA_3161-01-1 - mg{N}/L
definition: The unit of measure for 'EEA_3161-01-1' (Kjeldahl nitrogen) in WISE SoE - Water Quality: Disaggregated data table is 'mg{N}/L'
status: valid
status modified: 2019-10-03
accepted date: 2019-10-03
in scheme: Definition of correct units for the observed determinands in the given WISE SoE DD tables
has determinand: EEA 3161-01-1
has uom: mg{N}.L-1
has table: WISE-SoE WaterQuality.DisaggregatedData

WISE-SoE_WaterQuality.DisaggregatedData - EEA_3161-02-2 - mg{N}/L
type: Concept
notation: WISE-SoE_WaterQuality.DisaggregatedData - EEA_3161-02-2 - mg{N}/L
definition: The unit of measure for 'EEA_3161-02-2' (Total oxidised nitrogen) in WISE SoE - Water Quality: Disaggregated data table is 'mg{N}/L'
status: valid
status modified: 2019-10-03
accepted date: 2019-10-03
in scheme: Definition of correct units for the observed determinands in the given WISE SoE DD tables
has determinand: EEA 3161-02-2
has uom: mg{N}.L-1
has table: WISE-SoE WaterQuality.DisaggregatedData

WISE-SoE_WaterQuality.DisaggregatedData - EEA_3161-03-3 - mg{N}/L
type: Concept
notation: WISE-SoE_WaterQuality.DisaggregatedData - EEA_3161-03-3 - mg{N}/L
definition: The unit of measure for 'EEA_3161-03-3' (Total organic nitrogen) in WISE SoE - Water Quality: Disaggregated data table is 'mg{N}/L'
status: valid
status modified: 2019-10-03
accepted date: 2019-10-03
in scheme: Definition of correct units for the observed determinands in the given WISE SoE DD tables
has determinand: EEA 3161-03-3
has uom: mg{N}.L-1
has table: WISE-SoE WaterQuality.DisaggregatedData

WISE-SoE_WaterQuality.DisaggregatedData - EEA_3161-04-4 - mg{N}/L
type: Concept
notation: WISE-SoE_WaterQuality.DisaggregatedData - EEA_3161-04-4 - mg{N}/L
definition: The unit of measure for 'EEA_3161-04-4' (Particulate organic nitrogen) in WISE SoE - Water Quality: Disaggregated data table is 'mg{N}/L'
status: valid
status modified: 2019-10-03
accepted date: 2019-10-03
in scheme: Definition of correct units for the observed determinands in the given WISE SoE DD tables
has determinand: EEA 3161-04-4
has uom: mg{N}.L-1
has table: WISE-SoE WaterQuality.DisaggregatedData

WISE-SoE_WaterQuality.DisaggregatedData - EEA_3161-05-5 - mg{N}/L
type: Concept
notation: WISE-SoE_WaterQuality.DisaggregatedData - EEA_3161-05-5 - mg{N}/L
definition: The unit of measure for 'EEA_3161-05-5' (Total inorganic nitrogen) in WISE SoE - Water Quality: Disaggregated data table is 'mg{N}/L'
status: valid
status modified: 2019-10-03
accepted date: 2019-10-03
in scheme: Definition of correct units for the observed determinands in the given WISE SoE DD tables
has determinand: EEA 3161-05-5
has uom: mg{N}.L-1
has table: WISE-SoE WaterQuality.DisaggregatedData

WISE-SoE_WaterQuality.DisaggregatedData - EEA_31613-01-1 - mg{NH3}/L
type: Concept
notation: WISE-SoE_WaterQuality.DisaggregatedData - EEA_31613-01-1 - mg{NH3}/L
definition: The unit of measure for 'EEA_31613-01-1' (Non-ionised ammonia) in WISE SoE - Water Quality: Disaggregated data table is 'mg{NH3}/L'
status: valid
status modified: 2019-10-03
accepted date: 2019-10-03
in scheme: Definition of correct units for the observed determinands in the given WISE SoE DD tables
has determinand: EEA 31613-01-1
has uom: mg{NH3}.L-1
has table: WISE-SoE WaterQuality.DisaggregatedData

WISE-SoE_WaterQuality.DisaggregatedData - EEA_31615-01-7 - mg{N}/L
type: Concept
notation: WISE-SoE_WaterQuality.DisaggregatedData - EEA_31615-01-7 - mg{N}/L
definition: The unit of measure for 'EEA_31615-01-7' (Total nitrogen) in WISE SoE - Water Quality: Disaggregated data table is 'mg{N}/L'
status: valid
status modified: 2019-10-03
accepted date: 2019-10-03
in scheme: Definition of correct units for the observed determinands in the given WISE SoE DD tables
has determinand: EEA 31615-01-7
has uom: mg{N}.L-1
has table: WISE-SoE WaterQuality.DisaggregatedData

WISE-SoE_WaterQuality.DisaggregatedData - EEA_3163-01-7 - mg{Si}/L
type: Concept
notation: WISE-SoE_WaterQuality.DisaggregatedData - EEA_3163-01-7 - mg{Si}/L
definition: The unit of measure for 'EEA_3163-01-7' (Silicate) in WISE SoE - Water Quality: Disaggregated data table is 'mg{Si}/L'
status: valid
status modified: 2019-10-03
accepted date: 2019-10-03
in scheme: Definition of correct units for the observed determinands in the given WISE SoE DD tables
has determinand: EEA 3163-01-7
has uom: mg{Si}.L-1
has table: WISE-SoE WaterQuality.DisaggregatedData

WISE-SoE_WaterQuality.DisaggregatedData - EEA_3164-01-0 - ug/L
type: Concept
notation: WISE-SoE_WaterQuality.DisaggregatedData - EEA_3164-01-0 - ug/L
definition: The unit of measure for 'EEA_3164-01-0' (Chlorophyll a) in WISE SoE - Water Quality: Disaggregated data table is 'ug/L'
status: valid
status modified: 2019-10-03
accepted date: 2019-10-03
in scheme: Definition of correct units for the observed determinands in the given WISE SoE DD tables
has determinand: EEA 3164-01-0
has uom: ug.L-1
has table: WISE-SoE WaterQuality.DisaggregatedData

WISE-SoE_WaterQuality.DisaggregatedData - EEA_3164-07-6 - {massRatio}
type: Concept
notation: WISE-SoE_WaterQuality.DisaggregatedData - EEA_3164-07-6 - {massRatio}
definition: The unit of measure for 'EEA_3164-07-6' (Total nitrogen to total phosphorus ratio) in WISE SoE - Water Quality: Disaggregated data table is '{massRatio}'
status: valid
status modified: 2019-10-03
accepted date: 2019-10-03
in scheme: Definition of correct units for the observed determinands in the given WISE SoE DD tables
has determinand: EEA 3164-07-6
has uom: {massRatio}
has table: WISE-SoE WaterQuality.DisaggregatedData

WISE-SoE_WaterQuality.DisaggregatedData - EEA_3164-08-7 - {massRatio}
type: Concept
notation: WISE-SoE_WaterQuality.DisaggregatedData - EEA_3164-08-7 - {massRatio}
definition: The unit of measure for 'EEA_3164-08-7' (Nitrate to orthophosphate ratio) in WISE SoE - Water Quality: Disaggregated data table is '{massRatio}'
status: valid
status modified: 2019-10-03
accepted date: 2019-10-03
in scheme: Definition of correct units for the observed determinands in the given WISE SoE DD tables
has determinand: EEA 3164-08-7
has uom: {massRatio}
has table: WISE-SoE WaterQuality.DisaggregatedData

WISE-SoE_WaterQuality.DisaggregatedData - EEA_32-02-0 - ug/L
type: Concept
notation: WISE-SoE_WaterQuality.DisaggregatedData - EEA_32-02-0 - ug/L
definition: The unit of measure for 'EEA_32-02-0' (Total cyclodiene pesticides (aldrin + dieldrin + endrin + isodrin)) in WISE SoE - Water Quality: Disaggregated data table is 'ug/L'
status: valid
status modified: 2019-10-03
accepted date: 2019-10-03
in scheme: Definition of correct units for the observed determinands in the given WISE SoE DD tables
has determinand: EEA 32-02-0
has uom: ug.L-1
has table: WISE-SoE WaterQuality.DisaggregatedData

WISE-SoE_WaterQuality.DisaggregatedData - EEA_32-03-1 - ug/L
type: Concept
notation: WISE-SoE_WaterQuality.DisaggregatedData - EEA_32-03-1 - ug/L
definition: The unit of measure for 'EEA_32-03-1' (Total DDT (DDT, p,p' + DDT, o,p' + DDE, p,p' + DDD, p,p')) in WISE SoE - Water Quality: Disaggregated data table is 'ug/L'
status: valid
status modified: 2019-10-03
accepted date: 2019-10-03
in scheme: Definition of correct units for the observed determinands in the given WISE SoE DD tables
has determinand: EEA 32-03-1
has uom: ug.L-1
has table: WISE-SoE WaterQuality.DisaggregatedData

WISE-SoE_WaterQuality.DisaggregatedData - EEA_32-04-2 - ug/L
type: Concept
notation: WISE-SoE_WaterQuality.DisaggregatedData - EEA_32-04-2 - ug/L
definition: The unit of measure for 'EEA_32-04-2' (Brominated diphenylethers (congener numbers 28, 47, 99, 100, 153 and 154)) in WISE SoE - Water Quality: Disaggregated data table is 'ug/L'
status: valid
status modified: 2019-10-03
accepted date: 2019-10-03
in scheme: Definition of correct units for the observed determinands in the given WISE SoE DD tables
has determinand: EEA 32-04-2
has uom: ug.L-1
has table: WISE-SoE WaterQuality.DisaggregatedData

WISE-SoE_WaterQuality.DisaggregatedData - EEA_32-23-5 - ug/L
type: Concept
notation: WISE-SoE_WaterQuality.DisaggregatedData - EEA_32-23-5 - ug/L
definition: The unit of measure for 'EEA_32-23-5' (Total Benzo(b)fluor-anthene (CAS_205-99-2) + Benzo(k)fluor-anthene (CAS_207-08-9)) in WISE SoE - Water Quality: Disaggregated data table is 'ug/L'
status: valid
status modified: 2019-10-03
accepted date: 2019-10-03
in scheme: Definition of correct units for the observed determinands in the given WISE SoE DD tables
has determinand: EEA 32-23-5
has uom: ug.L-1
has table: WISE-SoE WaterQuality.DisaggregatedData

WISE-SoE_WaterQuality.DisaggregatedData - EEA_32-24-6 - ug/L
type: Concept
notation: WISE-SoE_WaterQuality.DisaggregatedData - EEA_32-24-6 - ug/L
definition: The unit of measure for 'EEA_32-24-6' (Total Benzo(g,h,i)perylene (CAS_191-24-2) + Indeno(1,2,3-cd)pyrene (CAS_193-39-5)) in WISE SoE - Water Quality: Disaggregated data table is 'ug/L'
status: valid
status modified: 2019-10-03
accepted date: 2019-10-03
in scheme: Definition of correct units for the observed determinands in the given WISE SoE DD tables
has determinand: EEA 32-24-6
has uom: ug.L-1
has table: WISE-SoE WaterQuality.DisaggregatedData

WISE-SoE_WaterQuality.DisaggregatedData - EEA_32-26-8 - ug/L
type: Concept
notation: WISE-SoE_WaterQuality.DisaggregatedData - EEA_32-26-8 - ug/L
definition: The unit of measure for 'EEA_32-26-8' (Pesticides - aggregated) in WISE SoE - Water Quality: Disaggregated data table is 'ug/L'
status: valid
status modified: 2019-10-03
accepted date: 2019-10-03
in scheme: Definition of correct units for the observed determinands in the given WISE SoE DD tables
has determinand: EEA 32-26-8
has uom: ug.L-1
has table: WISE-SoE WaterQuality.DisaggregatedData

WISE-SoE_WaterQuality.DisaggregatedData - EEA_33-01-2 - ug/L
type: Concept
notation: WISE-SoE_WaterQuality.DisaggregatedData - EEA_33-01-2 - ug/L
definition: The unit of measure for 'EEA_33-01-2' (Alkalised benzene) in WISE SoE - Water Quality: Disaggregated data table is 'ug/L'
status: valid
status modified: 2019-10-03
accepted date: 2019-10-03
in scheme: Definition of correct units for the observed determinands in the given WISE SoE DD tables
has determinand: EEA 33-01-2
has uom: ug.L-1
has table: WISE-SoE WaterQuality.DisaggregatedData

WISE-SoE_WaterQuality.DisaggregatedData - EEA_33-02-3 - ug/L
type: Concept
notation: WISE-SoE_WaterQuality.DisaggregatedData - EEA_33-02-3 - ug/L
definition: The unit of measure for 'EEA_33-02-3' (Benzol) in WISE SoE - Water Quality: Disaggregated data table is 'ug/L'
status: valid
status modified: 2019-10-03
accepted date: 2019-10-03
in scheme: Definition of correct units for the observed determinands in the given WISE SoE DD tables
has determinand: EEA 33-02-3
has uom: ug.L-1
has table: WISE-SoE WaterQuality.DisaggregatedData

WISE-SoE_WaterQuality.DisaggregatedData - EEA_33-04-5 - ug/L
type: Concept
notation: WISE-SoE_WaterQuality.DisaggregatedData - EEA_33-04-5 - ug/L
definition: The unit of measure for 'EEA_33-04-5' (Brominated flame retardants) in WISE SoE - Water Quality: Disaggregated data table is 'ug/L'
status: valid
status modified: 2019-10-03
accepted date: 2019-10-03
in scheme: Definition of correct units for the observed determinands in the given WISE SoE DD tables
has determinand: EEA 33-04-5
has uom: ug.L-1
has table: WISE-SoE WaterQuality.DisaggregatedData

WISE-SoE_WaterQuality.DisaggregatedData - EEA_33-05-6 - ug/L
type: Concept
notation: WISE-SoE_WaterQuality.DisaggregatedData - EEA_33-05-6 - ug/L
definition: The unit of measure for 'EEA_33-05-6' (BTEX) in WISE SoE - Water Quality: Disaggregated data table is 'ug/L'
status: valid
status modified: 2019-10-03
accepted date: 2019-10-03
in scheme: Definition of correct units for the observed determinands in the given WISE SoE DD tables
has determinand: EEA 33-05-6
has uom: ug.L-1
has table: WISE-SoE WaterQuality.DisaggregatedData

WISE-SoE_WaterQuality.DisaggregatedData - EEA_33-06-7 - ug/L
type: Concept
notation: WISE-SoE_WaterQuality.DisaggregatedData - EEA_33-06-7 - ug/L
definition: The unit of measure for 'EEA_33-06-7' (Chlorinated benzene) in WISE SoE - Water Quality: Disaggregated data table is 'ug/L'
status: valid
status modified: 2019-10-03
accepted date: 2019-10-03
in scheme: Definition of correct units for the observed determinands in the given WISE SoE DD tables
has determinand: EEA 33-06-7
has uom: ug.L-1
has table: WISE-SoE WaterQuality.DisaggregatedData

WISE-SoE_WaterQuality.DisaggregatedData - EEA_33-07-8 - ug/L
type: Concept
notation: WISE-SoE_WaterQuality.DisaggregatedData - EEA_33-07-8 - ug/L
definition: The unit of measure for 'EEA_33-07-8' (Chlorinated phenol) in WISE SoE - Water Quality: Disaggregated data table is 'ug/L'
status: valid
status modified: 2019-10-03
accepted date: 2019-10-03
in scheme: Definition of correct units for the observed determinands in the given WISE SoE DD tables
has determinand: EEA 33-07-8
has uom: ug.L-1
has table: WISE-SoE WaterQuality.DisaggregatedData

WISE-SoE_WaterQuality.DisaggregatedData - EEA_33-08-9 - ug/L
type: Concept
notation: WISE-SoE_WaterQuality.DisaggregatedData - EEA_33-08-9 - ug/L
definition: The unit of measure for 'EEA_33-08-9' (Chromium (III)) in WISE SoE - Water Quality: Disaggregated data table is 'ug/L'
status: valid
status modified: 2019-10-03
accepted date: 2019-10-03
in scheme: Definition of correct units for the observed determinands in the given WISE SoE DD tables
has determinand: EEA 33-08-9
has uom: ug.L-1
has table: WISE-SoE WaterQuality.DisaggregatedData

WISE-SoE_WaterQuality.DisaggregatedData - EEA_33-09-0 - ug/L
type: Concept
notation: WISE-SoE_WaterQuality.DisaggregatedData - EEA_33-09-0 - ug/L
definition: The unit of measure for 'EEA_33-09-0' (Detergents) in WISE SoE - Water Quality: Disaggregated data table is 'ug/L'
status: valid
status modified: 2019-10-03
accepted date: 2019-10-03
in scheme: Definition of correct units for the observed determinands in the given WISE SoE DD tables
has determinand: EEA 33-09-0
has uom: ug.L-1
has table: WISE-SoE WaterQuality.DisaggregatedData

WISE-SoE_WaterQuality.DisaggregatedData - EEA_33-10-3 - ug/L
type: Concept
notation: WISE-SoE_WaterQuality.DisaggregatedData - EEA_33-10-3 - ug/L
definition: The unit of measure for 'EEA_33-10-3' (Dichlorobenzene) in WISE SoE - Water Quality: Disaggregated data table is 'ug/L'
status: valid
status modified: 2019-10-03
accepted date: 2019-10-03
in scheme: Definition of correct units for the observed determinands in the given WISE SoE DD tables
has determinand: EEA 33-10-3
has uom: ug.L-1
has table: WISE-SoE WaterQuality.DisaggregatedData

WISE-SoE_WaterQuality.DisaggregatedData - EEA_33-11-4 - ug/L
type: Concept
notation: WISE-SoE_WaterQuality.DisaggregatedData - EEA_33-11-4 - ug/L
definition: The unit of measure for 'EEA_33-11-4' (Dichlorophenol) in WISE SoE - Water Quality: Disaggregated data table is 'ug/L'
status: valid
status modified: 2019-10-03
accepted date: 2019-10-03
in scheme: Definition of correct units for the observed determinands in the given WISE SoE DD tables
has determinand: EEA 33-11-4
has uom: ug.L-1
has table: WISE-SoE WaterQuality.DisaggregatedData

WISE-SoE_WaterQuality.DisaggregatedData - EEA_33-13-6 - ug/L
type: Concept
notation: WISE-SoE_WaterQuality.DisaggregatedData - EEA_33-13-6 - ug/L
definition: The unit of measure for 'EEA_33-13-6' (DOX) in WISE SoE - Water Quality: Disaggregated data table is 'ug/L'
status: valid
status modified: 2019-10-03
accepted date: 2019-10-03
in scheme: Definition of correct units for the observed determinands in the given WISE SoE DD tables
has determinand: EEA 33-13-6
has uom: ug.L-1
has table: WISE-SoE WaterQuality.DisaggregatedData

WISE-SoE_WaterQuality.DisaggregatedData - EEA_33-14-7 - ug/L
type: Concept
notation: WISE-SoE_WaterQuality.DisaggregatedData - EEA_33-14-7 - ug/L
definition: The unit of measure for 'EEA_33-14-7' (Extractable organically bound chlorine) in WISE SoE - Water Quality: Disaggregated data table is 'ug/L'
status: valid
status modified: 2019-10-03
accepted date: 2019-10-03
in scheme: Definition of correct units for the observed determinands in the given WISE SoE DD tables
has determinand: EEA 33-14-7
has uom: ug.L-1
has table: WISE-SoE WaterQuality.DisaggregatedData

WISE-SoE_WaterQuality.DisaggregatedData - EEA_33-15-8 - ug/L
type: Concept
notation: WISE-SoE_WaterQuality.DisaggregatedData - EEA_33-15-8 - ug/L
definition: The unit of measure for 'EEA_33-15-8' (Halogenated organic compounds) in WISE SoE - Water Quality: Disaggregated data table is 'ug/L'
status: valid
status modified: 2019-10-03
accepted date: 2019-10-03
in scheme: Definition of correct units for the observed determinands in the given WISE SoE DD tables
has determinand: EEA 33-15-8
has uom: ug.L-1
has table: WISE-SoE WaterQuality.DisaggregatedData

WISE-SoE_WaterQuality.DisaggregatedData - EEA_33-17-0 - ug/L
type: Concept
notation: WISE-SoE_WaterQuality.DisaggregatedData - EEA_33-17-0 - ug/L
definition: The unit of measure for 'EEA_33-17-0' (Hydrocarbons) in WISE SoE - Water Quality: Disaggregated data table is 'ug/L'
status: valid
status modified: 2019-10-03
accepted date: 2019-10-03
in scheme: Definition of correct units for the observed determinands in the given WISE SoE DD tables
has determinand: EEA 33-17-0
has uom: ug.L-1
has table: WISE-SoE WaterQuality.DisaggregatedData

WISE-SoE_WaterQuality.DisaggregatedData - EEA_33-18-1 - ug/L
type: Concept
notation: WISE-SoE_WaterQuality.DisaggregatedData - EEA_33-18-1 - ug/L
definition: The unit of measure for 'EEA_33-18-1' (Meta xylene + para xylene) in WISE SoE - Water Quality: Disaggregated data table is 'ug/L'
status: valid
status modified: 2019-10-03
accepted date: 2019-10-03
in scheme: Definition of correct units for the observed determinands in the given WISE SoE DD tables
has determinand: EEA 33-18-1
has uom: ug.L-1
has table: WISE-SoE WaterQuality.DisaggregatedData

WISE-SoE_WaterQuality.DisaggregatedData - EEA_33-19-2 - ug/L
type: Concept
notation: WISE-SoE_WaterQuality.DisaggregatedData - EEA_33-19-2 - ug/L
definition: The unit of measure for 'EEA_33-19-2' (Mono basic phenols) in WISE SoE - Water Quality: Disaggregated data table is 'ug/L'
status: valid
status modified: 2019-10-03
accepted date: 2019-10-03
in scheme: Definition of correct units for the observed determinands in the given WISE SoE DD tables
has determinand: EEA 33-19-2
has uom: ug.L-1
has table: WISE-SoE WaterQuality.DisaggregatedData

WISE-SoE_WaterQuality.DisaggregatedData - EEA_33-20-5 - ug/L
type: Concept
notation: WISE-SoE_WaterQuality.DisaggregatedData - EEA_33-20-5 - ug/L
definition: The unit of measure for 'EEA_33-20-5' (Monochlorophenols) in WISE SoE - Water Quality: Disaggregated data table is 'ug/L'
status: valid
status modified: 2019-10-03
accepted date: 2019-10-03
in scheme: Definition of correct units for the observed determinands in the given WISE SoE DD tables
has determinand: EEA 33-20-5
has uom: ug.L-1
has table: WISE-SoE WaterQuality.DisaggregatedData

WISE-SoE_WaterQuality.DisaggregatedData - EEA_33-21-6 - ug/L
type: Concept
notation: WISE-SoE_WaterQuality.DisaggregatedData - EEA_33-21-6 - ug/L
definition: The unit of measure for 'EEA_33-21-6' (Nitrobenzene) in WISE SoE - Water Quality: Disaggregated data table is 'ug/L'
status: valid
status modified: 2019-10-03
accepted date: 2019-10-03
in scheme: Definition of correct units for the observed determinands in the given WISE SoE DD tables
has determinand: EEA 33-21-6
has uom: ug.L-1
has table: WISE-SoE WaterQuality.DisaggregatedData

WISE-SoE_WaterQuality.DisaggregatedData - EEA_33-22-7 - ug/L
type: Concept
notation: WISE-SoE_WaterQuality.DisaggregatedData - EEA_33-22-7 - ug/L
definition: The unit of measure for 'EEA_33-22-7' (Oil fractions (C10-40)) in WISE SoE - Water Quality: Disaggregated data table is 'ug/L'
status: valid
status modified: 2019-10-03
accepted date: 2019-10-03
in scheme: Definition of correct units for the observed determinands in the given WISE SoE DD tables
has determinand: EEA 33-22-7
has uom: ug.L-1
has table: WISE-SoE WaterQuality.DisaggregatedData

WISE-SoE_WaterQuality.DisaggregatedData - EEA_33-23-8 - ug/L
type: Concept
notation: WISE-SoE_WaterQuality.DisaggregatedData - EEA_33-23-8 - ug/L
definition: The unit of measure for 'EEA_33-23-8' (Petroleum hydrocarbons) in WISE SoE - Water Quality: Disaggregated data table is 'ug/L'
status: valid
status modified: 2019-10-03
accepted date: 2019-10-03
in scheme: Definition of correct units for the observed determinands in the given WISE SoE DD tables
has determinand: EEA 33-23-8
has uom: ug.L-1
has table: WISE-SoE WaterQuality.DisaggregatedData

WISE-SoE_WaterQuality.DisaggregatedData - EEA_33-24-9 - ug/L
type: Concept
notation: WISE-SoE_WaterQuality.DisaggregatedData - EEA_33-24-9 - ug/L
definition: The unit of measure for 'EEA_33-24-9' (Petroleum products) in WISE SoE - Water Quality: Disaggregated data table is 'ug/L'
status: valid
status modified: 2019-10-03
accepted date: 2019-10-03
in scheme: Definition of correct units for the observed determinands in the given WISE SoE DD tables
has determinand: EEA 33-24-9
has uom: ug.L-1
has table: WISE-SoE WaterQuality.DisaggregatedData

WISE-SoE_WaterQuality.DisaggregatedData - EEA_33-26-1 - ug/L
type: Concept
notation: WISE-SoE_WaterQuality.DisaggregatedData - EEA_33-26-1 - ug/L
definition: The unit of measure for 'EEA_33-26-1' (Polychlorinated dibenzodioxins (PCDD)) in WISE SoE - Water Quality: Disaggregated data table is 'ug/L'
status: valid
status modified: 2019-10-03
accepted date: 2019-10-03
in scheme: Definition of correct units for the observed determinands in the given WISE SoE DD tables
has determinand: EEA 33-26-1
has uom: ug.L-1
has table: WISE-SoE WaterQuality.DisaggregatedData

WISE-SoE_WaterQuality.DisaggregatedData - EEA_33-28-3 - ug/L
type: Concept
notation: WISE-SoE_WaterQuality.DisaggregatedData - EEA_33-28-3 - ug/L
definition: The unit of measure for 'EEA_33-28-3' (Surfactants (anionic and nonionic)) in WISE SoE - Water Quality: Disaggregated data table is 'ug/L'
status: valid
status modified: 2019-10-03
accepted date: 2019-10-03
in scheme: Definition of correct units for the observed determinands in the given WISE SoE DD tables
has determinand: EEA 33-28-3
has uom: ug.L-1
has table: WISE-SoE WaterQuality.DisaggregatedData

WISE-SoE_WaterQuality.DisaggregatedData - EEA_33-29-4 - ug/L
type: Concept
notation: WISE-SoE_WaterQuality.DisaggregatedData - EEA_33-29-4 - ug/L
definition: The unit of measure for 'EEA_33-29-4' (Surfactants (anionic)) in WISE SoE - Water Quality: Disaggregated data table is 'ug/L'
status: valid
status modified: 2019-10-03
accepted date: 2019-10-03
in scheme: Definition of correct units for the observed determinands in the given WISE SoE DD tables
has determinand: EEA 33-29-4
has uom: ug.L-1
has table: WISE-SoE WaterQuality.DisaggregatedData

WISE-SoE_WaterQuality.DisaggregatedData - EEA_33-31-8 - ug/L
type: Concept
notation: WISE-SoE_WaterQuality.DisaggregatedData - EEA_33-31-8 - ug/L
definition: The unit of measure for 'EEA_33-31-8' (Total chrysene + triphenylene) in WISE SoE - Water Quality: Disaggregated data table is 'ug/L'
status: valid
status modified: 2019-10-03
accepted date: 2019-10-03
in scheme: Definition of correct units for the observed determinands in the given WISE SoE DD tables
has determinand: EEA 33-31-8
has uom: ug.L-1
has table: WISE-SoE WaterQuality.DisaggregatedData

WISE-SoE_WaterQuality.DisaggregatedData - EEA_33-32-9 - ug/L
type: Concept
notation: WISE-SoE_WaterQuality.DisaggregatedData - EEA_33-32-9 - ug/L
definition: The unit of measure for 'EEA_33-32-9' (Total DDD (DDD, o,p' + DDD, p,p')) in WISE SoE - Water Quality: Disaggregated data table is 'ug/L'
status: valid
status modified: 2019-10-03
accepted date: 2019-10-03
in scheme: Definition of correct units for the observed determinands in the given WISE SoE DD tables
has determinand: EEA 33-32-9
has uom: ug.L-1
has table: WISE-SoE WaterQuality.DisaggregatedData

WISE-SoE_WaterQuality.DisaggregatedData - EEA_33-36-3 - ug/L
type: Concept
notation: WISE-SoE_WaterQuality.DisaggregatedData - EEA_33-36-3 - ug/L
definition: The unit of measure for 'EEA_33-36-3' (Total hydrocarbons) in WISE SoE - Water Quality: Disaggregated data table is 'ug/L'
status: valid
status modified: 2019-10-03
accepted date: 2019-10-03
in scheme: Definition of correct units for the observed determinands in the given WISE SoE DD tables
has determinand: EEA 33-36-3
has uom: ug.L-1
has table: WISE-SoE WaterQuality.DisaggregatedData

WISE-SoE_WaterQuality.DisaggregatedData - EEA_33-38-5 - ug/L
type: Concept
notation: WISE-SoE_WaterQuality.DisaggregatedData - EEA_33-38-5 - ug/L
definition: The unit of measure for 'EEA_33-38-5' (Polychlorinated biphenyls (7 PCB: 28,52,101,118,138,153,180)) in WISE SoE - Water Quality: Disaggregated data table is 'ug/L'
status: valid
status modified: 2019-10-03
accepted date: 2019-10-03
in scheme: Definition of correct units for the observed determinands in the given WISE SoE DD tables
has determinand: EEA 33-38-5
has uom: ug.L-1
has table: WISE-SoE WaterQuality.DisaggregatedData

WISE-SoE_WaterQuality.DisaggregatedData - EEA_33-40-9 - ug/L
type: Concept
notation: WISE-SoE_WaterQuality.DisaggregatedData - EEA_33-40-9 - ug/L
definition: The unit of measure for 'EEA_33-40-9' (Total dioxins and furans (PCDD + PCDF)) in WISE SoE - Water Quality: Disaggregated data table is 'ug/L'
status: valid
status modified: 2019-10-03
accepted date: 2019-10-03
in scheme: Definition of correct units for the observed determinands in the given WISE SoE DD tables
has determinand: EEA 33-40-9
has uom: ug.L-1
has table: WISE-SoE WaterQuality.DisaggregatedData

WISE-SoE_WaterQuality.DisaggregatedData - EEA_33-41-0 - ug/L
type: Concept
notation: WISE-SoE_WaterQuality.DisaggregatedData - EEA_33-41-0 - ug/L
definition: The unit of measure for 'EEA_33-41-0' (Total tri-, tetra- and pentachlorophenol) in WISE SoE - Water Quality: Disaggregated data table is 'ug/L'
status: valid
status modified: 2019-10-03
accepted date: 2019-10-03
in scheme: Definition of correct units for the observed determinands in the given WISE SoE DD tables
has determinand: EEA 33-41-0
has uom: ug.L-1
has table: WISE-SoE WaterQuality.DisaggregatedData

WISE-SoE_WaterQuality.DisaggregatedData - EEA_33-42-1 - ug/L
type: Concept
notation: WISE-SoE_WaterQuality.DisaggregatedData - EEA_33-42-1 - ug/L
definition: The unit of measure for 'EEA_33-42-1' (Total trichloroethylene + tetrachloroethylene) in WISE SoE - Water Quality: Disaggregated data table is 'ug/L'
status: valid
status modified: 2019-10-03
accepted date: 2019-10-03
in scheme: Definition of correct units for the observed determinands in the given WISE SoE DD tables
has determinand: EEA 33-42-1
has uom: ug.L-1
has table: WISE-SoE WaterQuality.DisaggregatedData

WISE-SoE_WaterQuality.DisaggregatedData - EEA_33-43-2 - ug/L
type: Concept
notation: WISE-SoE_WaterQuality.DisaggregatedData - EEA_33-43-2 - ug/L
definition: The unit of measure for 'EEA_33-43-2' (Total trihalomethanes) in WISE SoE - Water Quality: Disaggregated data table is 'ug/L'
status: valid
status modified: 2019-10-03
accepted date: 2019-10-03
in scheme: Definition of correct units for the observed determinands in the given WISE SoE DD tables
has determinand: EEA 33-43-2
has uom: ug.L-1
has table: WISE-SoE WaterQuality.DisaggregatedData

WISE-SoE_WaterQuality.DisaggregatedData - EEA_33-44-3 - ug/L
type: Concept
notation: WISE-SoE_WaterQuality.DisaggregatedData - EEA_33-44-3 - ug/L
definition: The unit of measure for 'EEA_33-44-3' (Total highly volatile halogenated hydrocarbons) in WISE SoE - Water Quality: Disaggregated data table is 'ug/L'
status: valid
status modified: 2019-10-03
accepted date: 2019-10-03
in scheme: Definition of correct units for the observed determinands in the given WISE SoE DD tables
has determinand: EEA 33-44-3
has uom: ug.L-1
has table: WISE-SoE WaterQuality.DisaggregatedData

WISE-SoE_WaterQuality.DisaggregatedData - EEA_33-45-4 - ug/L
type: Concept
notation: WISE-SoE_WaterQuality.DisaggregatedData - EEA_33-45-4 - ug/L
definition: The unit of measure for 'EEA_33-45-4' (Volatile halogenated hydrocarbons (VHH)) in WISE SoE - Water Quality: Disaggregated data table is 'ug/L'
status: valid
status modified: 2019-10-03
accepted date: 2019-10-03
in scheme: Definition of correct units for the observed determinands in the given WISE SoE DD tables
has determinand: EEA 33-45-4
has uom: ug.L-1
has table: WISE-SoE WaterQuality.DisaggregatedData

WISE-SoE_WaterQuality.DisaggregatedData - EEA_33-46-5 - ug/L
type: Concept
notation: WISE-SoE_WaterQuality.DisaggregatedData - EEA_33-46-5 - ug/L
definition: The unit of measure for 'EEA_33-46-5' (Volatile organic halogens (VOX)) in WISE SoE - Water Quality: Disaggregated data table is 'ug/L'
status: valid
status modified: 2019-10-03
accepted date: 2019-10-03
in scheme: Definition of correct units for the observed determinands in the given WISE SoE DD tables
has determinand: EEA 33-46-5
has uom: ug.L-1
has table: WISE-SoE WaterQuality.DisaggregatedData

WISE-SoE_WaterQuality.DisaggregatedData - EEA_33-50-1 - ug/L
type: Concept
notation: WISE-SoE_WaterQuality.DisaggregatedData - EEA_33-50-1 - ug/L
definition: The unit of measure for 'EEA_33-50-1' (Heptachlor and heptachlor epoxide) in WISE SoE - Water Quality: Disaggregated data table is 'ug/L'
status: valid
status modified: 2019-10-03
accepted date: 2019-10-03
in scheme: Definition of correct units for the observed determinands in the given WISE SoE DD tables
has determinand: EEA 33-50-1
has uom: ug.L-1
has table: WISE-SoE WaterQuality.DisaggregatedData

WISE-SoE_WaterQuality.DisaggregatedData - EEA_33-51-2 - ug/L
type: Concept
notation: WISE-SoE_WaterQuality.DisaggregatedData - EEA_33-51-2 - ug/L
definition: The unit of measure for 'EEA_33-51-2' (Total macrolide antibiotics (erythromycin + clarithromycin + azithromycin)) in WISE SoE - Water Quality: Disaggregated data table is 'ug/L'
status: valid
status modified: 2019-10-03
accepted date: 2019-10-03
in scheme: Definition of correct units for the observed determinands in the given WISE SoE DD tables
has determinand: EEA 33-51-2
has uom: ug.L-1
has table: WISE-SoE WaterQuality.DisaggregatedData

WISE-SoE_WaterQuality.DisaggregatedData - EEA_33-52-3 - ug/L
type: Concept
notation: WISE-SoE_WaterQuality.DisaggregatedData - EEA_33-52-3 - ug/L
definition: The unit of measure for 'EEA_33-52-3' (Total neonicotinoid insecticides (imidacloprid + thiacloprid + thiamethoxam + clothianidin + acetamiprid)) in WISE SoE - Water Quality: Disaggregated data table is 'ug/L'
status: valid
status modified: 2019-10-03
accepted date: 2019-10-03
in scheme: Definition of correct units for the observed determinands in the given WISE SoE DD tables
has determinand: EEA 33-52-3
has uom: ug.L-1
has table: WISE-SoE WaterQuality.DisaggregatedData

WISE-SoE_WaterQuality.DisaggregatedData - EEA_33-53-4 - ug/L
type: Concept
notation: WISE-SoE_WaterQuality.DisaggregatedData - EEA_33-53-4 - ug/L
definition: The unit of measure for 'EEA_33-53-4' (Total Estrone (E1) + 17beta-estradiol (E2)) in WISE SoE - Water Quality: Disaggregated data table is 'ug/L'
status: valid
status modified: 2019-10-03
accepted date: 2019-10-03
in scheme: Definition of correct units for the observed determinands in the given WISE SoE DD tables
has determinand: EEA 33-53-4
has uom: ug.L-1
has table: WISE-SoE WaterQuality.DisaggregatedData

WISE-SoE_WaterQuality.DisaggregatedData - EEA_33-54-5 - ug/L
type: Concept
notation: WISE-SoE_WaterQuality.DisaggregatedData - EEA_33-54-5 - ug/L
definition: The unit of measure for 'EEA_33-54-5' (Dioxin-like polychlorinated biphenyls (12 PCB-DLs: 77,81,105,114,118,123,126,156,157,167,169,189)) in WISE SoE - Water Quality: Disaggregated data table is 'ug/L'
status: valid
status modified: 2019-10-03
accepted date: 2019-10-03
in scheme: Definition of correct units for the observed determinands in the given WISE SoE DD tables
has determinand: EEA 33-54-5
has uom: ug.L-1
has table: WISE-SoE WaterQuality.DisaggregatedData

WISE-SoE_WaterQuality.DisaggregatedData - EEA_33-55-6 - ug/L
type: Concept
notation: WISE-SoE_WaterQuality.DisaggregatedData - EEA_33-55-6 - ug/L
definition: The unit of measure for 'EEA_33-55-6' (Octylphenols (CAS 1806-26-4) including isomer 4-(1,1',3,3'-tetramethylbutyl)-phenol (CAS 140-66-9)) in WISE SoE - Water Quality: Disaggregated data table is 'ug/L'
status: valid
status modified: 2019-10-03
accepted date: 2019-10-03
in scheme: Definition of correct units for the observed determinands in the given WISE SoE DD tables
has determinand: EEA 33-55-6
has uom: ug.L-1
has table: WISE-SoE WaterQuality.DisaggregatedData

WISE-SoE_WaterQuality.DisaggregatedData - EEA_33-56-7 - ug/L
type: Concept
notation: WISE-SoE_WaterQuality.DisaggregatedData - EEA_33-56-7 - ug/L
definition: The unit of measure for 'EEA_33-56-7' (Total PAHs (Benzo(a)pyrene, Benzo(b)fluoranthene, Benzo(k)fluoranthene, Benzo(ghi)perylene, Indeno(1,2,3-cd)pyrene)) in WISE SoE - Water Quality: Disaggregated data table is 'ug/L'
status: valid
status modified: 2019-10-03
accepted date: 2019-10-03
in scheme: Definition of correct units for the observed determinands in the given WISE SoE DD tables
has determinand: EEA 33-56-7
has uom: ug.L-1
has table: WISE-SoE WaterQuality.DisaggregatedData

WISE-SoE_WaterQuality.DisaggregatedData - EEA_33-57-8 - ug/L
type: Concept
notation: WISE-SoE_WaterQuality.DisaggregatedData - EEA_33-57-8 - ug/L
definition: The unit of measure for 'EEA_33-57-8' (Hexabromocyclododecanes (HBCDD)) in WISE SoE - Water Quality: Disaggregated data table is 'ug/L'
status: valid
status modified: 2019-10-03
accepted date: 2019-10-03
in scheme: Definition of correct units for the observed determinands in the given WISE SoE DD tables
has determinand: EEA 33-57-8
has uom: ug.L-1
has table: WISE-SoE WaterQuality.DisaggregatedData

WISE-SoE_WaterQuality.DisaggregatedData - EEA_33-58-9 - ug/L
type: Concept
notation: WISE-SoE_WaterQuality.DisaggregatedData - EEA_33-58-9 - ug/L
definition: The unit of measure for 'EEA_33-58-9' (Dioxins and dioxin-like compounds (7 PCDDs + 10 PCDFs + 12 PCB-DLs)) in WISE SoE - Water Quality: Disaggregated data table is 'ug/L'
status: valid
status modified: 2019-10-03
accepted date: 2019-10-03
in scheme: Definition of correct units for the observed determinands in the given WISE SoE DD tables
has determinand: EEA 33-58-9
has uom: ug.L-1
has table: WISE-SoE WaterQuality.DisaggregatedData

WISE-SoE_WaterQuality.DisaggregatedData - EEA_33-59-0 - ug/L
type: Concept
notation: WISE-SoE_WaterQuality.DisaggregatedData - EEA_33-59-0 - ug/L
definition: The unit of measure for 'EEA_33-59-0' (Nonylphenol and nonylphenol ethoxylates (NP + NPEs)) in WISE SoE - Water Quality: Disaggregated data table is 'ug/L'
status: valid
status modified: 2019-10-03
accepted date: 2019-10-03
in scheme: Definition of correct units for the observed determinands in the given WISE SoE DD tables
has determinand: EEA 33-59-0
has uom: ug.L-1
has table: WISE-SoE WaterQuality.DisaggregatedData

WISE-SoE_WaterQuality.DisaggregatedData - EEA_33-60-3 - ug/L
type: Concept
notation: WISE-SoE_WaterQuality.DisaggregatedData - EEA_33-60-3 - ug/L
definition: The unit of measure for 'EEA_33-60-3' (Organotin compounds (as total Sn)) in WISE SoE - Water Quality: Disaggregated data table is 'ug/L'
status: valid
status modified: 2019-10-03
accepted date: 2019-10-03
in scheme: Definition of correct units for the observed determinands in the given WISE SoE DD tables
has determinand: EEA 33-60-3
has uom: ug.L-1
has table: WISE-SoE WaterQuality.DisaggregatedData

WISE-SoE_WaterQuality.DisaggregatedData - EEA_33-61-4 - ug/L
type: Concept
notation: WISE-SoE_WaterQuality.DisaggregatedData - EEA_33-61-4 - ug/L
definition: The unit of measure for 'EEA_33-61-4' (Triphenyltin and compounds) in WISE SoE - Water Quality: Disaggregated data table is 'ug/L'
status: valid
status modified: 2019-10-03
accepted date: 2019-10-03
in scheme: Definition of correct units for the observed determinands in the given WISE SoE DD tables
has determinand: EEA 33-61-4
has uom: ug.L-1
has table: WISE-SoE WaterQuality.DisaggregatedData

WISE-SoE_WaterQuality.DisaggregatedData - EEA_33-62-5 - ug/L
type: Concept
notation: WISE-SoE_WaterQuality.DisaggregatedData - EEA_33-62-5 - ug/L
definition: The unit of measure for 'EEA_33-62-5' (Total PAHs (4 PAHs: Benzo(a)pyrene, Benzo(b)fluoranthene, Benzo(k)fluoranthene, Indeno(1,2,3-cd)pyrene)) in WISE SoE - Water Quality: Disaggregated data table is 'ug/L'
status: valid
status modified: 2019-10-03
accepted date: 2019-10-03
in scheme: Definition of correct units for the observed determinands in the given WISE SoE DD tables
has determinand: EEA 33-62-5
has uom: ug.L-1
has table: WISE-SoE WaterQuality.DisaggregatedData

WISE-SoE_WaterQuality.DisaggregatedData - EEA_33-63-6 - ug/L
type: Concept
notation: WISE-SoE_WaterQuality.DisaggregatedData - EEA_33-63-6 - ug/L
definition: The unit of measure for 'EEA_33-63-6' (Total brominated diphenylethers (penta-BDE + octa-BDE + deca-BDE)) in WISE SoE - Water Quality: Disaggregated data table is 'ug/L'
status: valid
status modified: 2019-10-03
accepted date: 2019-10-03
in scheme: Definition of correct units for the observed determinands in the given WISE SoE DD tables
has determinand: EEA 33-63-6
has uom: ug.L-1
has table: WISE-SoE WaterQuality.DisaggregatedData

WISE-SoE_WaterQuality.DisaggregatedData - EEA_33-64-7 - ug/L
type: Concept
notation: WISE-SoE_WaterQuality.DisaggregatedData - EEA_33-64-7 - ug/L
definition: The unit of measure for 'EEA_33-64-7' (Total cyanide) in WISE SoE - Water Quality: Disaggregated data table is 'ug/L'
status: valid
status modified: 2019-10-03
accepted date: 2019-10-03
in scheme: Definition of correct units for the observed determinands in the given WISE SoE DD tables
has determinand: EEA 33-64-7
has uom: ug.L-1
has table: WISE-SoE WaterQuality.DisaggregatedData

WISE-SoE_WaterQuality.DisaggregatedData - EEA_33-65-8 - ug/L
type: Concept
notation: WISE-SoE_WaterQuality.DisaggregatedData - EEA_33-65-8 - ug/L
definition: The unit of measure for 'EEA_33-65-8' (Oxydemeton-methyl) in WISE SoE - Water Quality: Disaggregated data table is 'ug/L'
status: valid
status modified: 2019-10-03
accepted date: 2019-10-03
in scheme: Definition of correct units for the observed determinands in the given WISE SoE DD tables
has determinand: EEA 33-65-8
has uom: ug.L-1
has table: WISE-SoE WaterQuality.DisaggregatedData

WISE-SoE_WaterQuality.DisaggregatedData - EEA_34-01-5 - ug/L
type: Concept
notation: WISE-SoE_WaterQuality.DisaggregatedData - EEA_34-01-5 - ug/L
definition: The unit of measure for 'EEA_34-01-5' (Pesticides (Active substances in pesticides, including their relevant metabolites, degradation and reaction products)) in WISE SoE - Water Quality: Disaggregated data table is 'ug/L'
status: valid
status modified: 2019-10-03
accepted date: 2019-10-03
in scheme: Definition of correct units for the observed determinands in the given WISE SoE DD tables
has determinand: EEA 34-01-5
has uom: ug.L-1
has table: WISE-SoE WaterQuality.DisaggregatedData