emissions_variables_MMR
type: ConceptScheme
notation: emissions_variables_MMR
is part of: ghg
registration status: Released
user modified: demo_user
date modified: 2017-02-13 15:20:51.0
vocabulary type: Common
is numeric concept identifiers: false
is notations equal identifiers: false

[4(KP)][Biomass Burning][Emissions][CH4][kt][no source][no method][no target][no option][Afforestation and Reforestation]
type: Concept
definition: [4(KP)][Biomass Burning][Emissions][CH4][kt][no source][no method][no target][no option][Afforestation and Reforestation]
status: valid
status modified: 2017-02-13
accepted date: 2017-02-13
in scheme: emissions_variables_MMR

[4(KP)][Biomass Burning][Emissions][CH4][kt][no source][no method][no target][no option][Cropland Management]
type: Concept
definition: [4(KP)][Biomass Burning][Emissions][CH4][kt][no source][no method][no target][no option][Cropland Management]
status: valid
status modified: 2017-02-13
accepted date: 2017-02-13
in scheme: emissions_variables_MMR

[4(KP)][Biomass Burning][Emissions][CH4][kt][no source][no method][no target][no option][Deforestation]
type: Concept
definition: [4(KP)][Biomass Burning][Emissions][CH4][kt][no source][no method][no target][no option][Deforestation]
status: valid
status modified: 2017-02-13
accepted date: 2017-02-13
in scheme: emissions_variables_MMR

[4(KP)][Biomass Burning][Emissions][CH4][kt][no source][no method][no target][no option][Forest Management]
type: Concept
definition: [4(KP)][Biomass Burning][Emissions][CH4][kt][no source][no method][no target][no option][Forest Management]
status: valid
status modified: 2017-02-13
accepted date: 2017-02-13
in scheme: emissions_variables_MMR

[4(KP)][Biomass Burning][Emissions][CH4][kt][no source][no method][no target][no option][Grazing Land Management]
type: Concept
definition: [4(KP)][Biomass Burning][Emissions][CH4][kt][no source][no method][no target][no option][Grazing Land Management]
status: valid
status modified: 2017-02-13
accepted date: 2017-02-13
in scheme: emissions_variables_MMR

[4(KP)][Biomass Burning][Emissions][CH4][kt][no source][no method][no target][no option][Revegetation]
type: Concept
definition: [4(KP)][Biomass Burning][Emissions][CH4][kt][no source][no method][no target][no option][Revegetation]
status: valid
status modified: 2017-02-13
accepted date: 2017-02-13
in scheme: emissions_variables_MMR

[4(KP)][Biomass Burning][Emissions][CH4][kt][no source][no method][no target][no option][Wetland Drainage and Rewetting]
type: Concept
definition: [4(KP)][Biomass Burning][Emissions][CH4][kt][no source][no method][no target][no option][Wetland Drainage and Rewetting]
status: valid
status modified: 2017-02-13
accepted date: 2017-02-13
in scheme: emissions_variables_MMR

[4(KP)][Biomass Burning][Emissions][CO2][kt][no source][no method][no target][no option][Afforestation and Reforestation]
type: Concept
definition: [4(KP)][Biomass Burning][Emissions][CO2][kt][no source][no method][no target][no option][Afforestation and Reforestation]
status: valid
status modified: 2017-02-13
accepted date: 2017-02-13
in scheme: emissions_variables_MMR

[4(KP)][Biomass Burning][Emissions][CO2][kt][no source][no method][no target][no option][Cropland Management]
type: Concept
definition: [4(KP)][Biomass Burning][Emissions][CO2][kt][no source][no method][no target][no option][Cropland Management]
status: valid
status modified: 2017-02-13
accepted date: 2017-02-13
in scheme: emissions_variables_MMR

[4(KP)][Biomass Burning][Emissions][CO2][kt][no source][no method][no target][no option][Deforestation]
type: Concept
definition: [4(KP)][Biomass Burning][Emissions][CO2][kt][no source][no method][no target][no option][Deforestation]
status: valid
status modified: 2017-02-13
accepted date: 2017-02-13
in scheme: emissions_variables_MMR

[4(KP)][Biomass Burning][Emissions][CO2][kt][no source][no method][no target][no option][Forest Management]
type: Concept
definition: [4(KP)][Biomass Burning][Emissions][CO2][kt][no source][no method][no target][no option][Forest Management]
status: valid
status modified: 2017-02-13
accepted date: 2017-02-13
in scheme: emissions_variables_MMR

[4(KP)][Biomass Burning][Emissions][CO2][kt][no source][no method][no target][no option][Grazing Land Management]
type: Concept
definition: [4(KP)][Biomass Burning][Emissions][CO2][kt][no source][no method][no target][no option][Grazing Land Management]
status: valid
status modified: 2017-02-13
accepted date: 2017-02-13
in scheme: emissions_variables_MMR

[4(KP)][Biomass Burning][Emissions][CO2][kt][no source][no method][no target][no option][Revegetation]
type: Concept
definition: [4(KP)][Biomass Burning][Emissions][CO2][kt][no source][no method][no target][no option][Revegetation]
status: valid
status modified: 2017-02-13
accepted date: 2017-02-13
in scheme: emissions_variables_MMR

[4(KP)][Biomass Burning][Emissions][CO2][kt][no source][no method][no target][no option][Wetland Drainage and Rewetting]
type: Concept
definition: [4(KP)][Biomass Burning][Emissions][CO2][kt][no source][no method][no target][no option][Wetland Drainage and Rewetting]
status: valid
status modified: 2017-02-13
accepted date: 2017-02-13
in scheme: emissions_variables_MMR

[4(KP)][Biomass Burning][Emissions][N2O][kt][no source][no method][no target][no option][Afforestation and Reforestation]
type: Concept
definition: [4(KP)][Biomass Burning][Emissions][N2O][kt][no source][no method][no target][no option][Afforestation and Reforestation]
status: valid
status modified: 2017-02-13
accepted date: 2017-02-13
in scheme: emissions_variables_MMR

[4(KP)][Biomass Burning][Emissions][N2O][kt][no source][no method][no target][no option][Cropland Management]
type: Concept
definition: [4(KP)][Biomass Burning][Emissions][N2O][kt][no source][no method][no target][no option][Cropland Management]
status: valid
status modified: 2017-02-13
accepted date: 2017-02-13
in scheme: emissions_variables_MMR

[4(KP)][Biomass Burning][Emissions][N2O][kt][no source][no method][no target][no option][Deforestation]
type: Concept
definition: [4(KP)][Biomass Burning][Emissions][N2O][kt][no source][no method][no target][no option][Deforestation]
status: valid
status modified: 2017-02-13
accepted date: 2017-02-13
in scheme: emissions_variables_MMR

[4(KP)][Biomass Burning][Emissions][N2O][kt][no source][no method][no target][no option][Forest Management]
type: Concept
definition: [4(KP)][Biomass Burning][Emissions][N2O][kt][no source][no method][no target][no option][Forest Management]
status: valid
status modified: 2017-02-13
accepted date: 2017-02-13
in scheme: emissions_variables_MMR

[4(KP)][Biomass Burning][Emissions][N2O][kt][no source][no method][no target][no option][Grazing Land Management]
type: Concept
definition: [4(KP)][Biomass Burning][Emissions][N2O][kt][no source][no method][no target][no option][Grazing Land Management]
status: valid
status modified: 2017-02-13
accepted date: 2017-02-13
in scheme: emissions_variables_MMR

[4(KP)][Biomass Burning][Emissions][N2O][kt][no source][no method][no target][no option][Revegetation]
type: Concept
definition: [4(KP)][Biomass Burning][Emissions][N2O][kt][no source][no method][no target][no option][Revegetation]
status: valid
status modified: 2017-02-13
accepted date: 2017-02-13
in scheme: emissions_variables_MMR

[4(KP)][Biomass Burning][Emissions][N2O][kt][no source][no method][no target][no option][Wetland Drainage and Rewetting]
type: Concept
definition: [4(KP)][Biomass Burning][Emissions][N2O][kt][no source][no method][no target][no option][Wetland Drainage and Rewetting]
status: valid
status modified: 2017-02-13
accepted date: 2017-02-13
in scheme: emissions_variables_MMR

http://dd.eionet.europa.eu/vocabulary/ghg/emissions_variables_MMR/40273549-A8E6-4200-BD38-3DED22782FD5
type: Concept
preferred label: [4(KP)][Carbon stock change][Emissions][CO2][kt][no source][Change in carbon stock][Deforested land previously reported under afforestation/reforestation and forest management and subject to natural disturbances][no option][Deforestation]
definition: [4(KP)][Carbon stock change][Emissions][CO2][kt][no source][Change in carbon stock][Deforested land previously reported under afforestation/reforestation and forest management and subject to natural disturbances][no option][Deforestation]
status: valid
status modified: 2017-02-13
accepted date: 2017-02-13
in scheme: emissions_variables_MMR

[4(KP)][Carbon stock change][Emissions][CO2][kt][no source][Change in carbon stock][no target][no option][Activity A.1]
type: Concept
definition: [4(KP)][Carbon stock change][Emissions][CO2][kt][no source][Change in carbon stock][no target][no option][Activity A.1]
status: valid
status modified: 2017-02-13
accepted date: 2017-02-13
in scheme: emissions_variables_MMR

[4(KP)][Carbon stock change][Emissions][CO2][kt][no source][Change in carbon stock][no target][no option][Activity A.2]
type: Concept
definition: [4(KP)][Carbon stock change][Emissions][CO2][kt][no source][Change in carbon stock][no target][no option][Activity A.2]
status: valid
status modified: 2017-02-13
accepted date: 2017-02-13
in scheme: emissions_variables_MMR

[4(KP)][Carbon stock change][Emissions][CO2][kt][no source][Change in carbon stock][no target][no option][Activity B.1]
type: Concept
definition: [4(KP)][Carbon stock change][Emissions][CO2][kt][no source][Change in carbon stock][no target][no option][Activity B.1]
status: valid
status modified: 2017-02-13
accepted date: 2017-02-13
in scheme: emissions_variables_MMR

[4(KP)][Carbon stock change][Emissions][CO2][kt][no source][Change in carbon stock][no target][no option][Afforestation and Reforestation]
type: Concept
definition: [4(KP)][Carbon stock change][Emissions][CO2][kt][no source][Change in carbon stock][no target][no option][Afforestation and Reforestation]
status: valid
status modified: 2017-02-13
accepted date: 2017-02-13
in scheme: emissions_variables_MMR

[4(KP)][Carbon stock change][Emissions][CO2][kt][no source][Change in carbon stock][no target][no option][Cropland Management]
type: Concept
definition: [4(KP)][Carbon stock change][Emissions][CO2][kt][no source][Change in carbon stock][no target][no option][Cropland Management]
status: valid
status modified: 2017-02-13
accepted date: 2017-02-13
in scheme: emissions_variables_MMR

[4(KP)][Carbon stock change][Emissions][CO2][kt][no source][Change in carbon stock][no target][no option][Deforestation]
type: Concept
definition: [4(KP)][Carbon stock change][Emissions][CO2][kt][no source][Change in carbon stock][no target][no option][Deforestation]
status: valid
status modified: 2017-02-13
accepted date: 2017-02-13
in scheme: emissions_variables_MMR

[4(KP)][Carbon stock change][Emissions][CO2][kt][no source][Change in carbon stock][no target][no option][Forest Management]
type: Concept
definition: [4(KP)][Carbon stock change][Emissions][CO2][kt][no source][Change in carbon stock][no target][no option][Forest Management]
status: valid
status modified: 2017-02-13
accepted date: 2017-02-13
in scheme: emissions_variables_MMR

[4(KP)][Carbon stock change][Emissions][CO2][kt][no source][Change in carbon stock][no target][no option][Grazing Land Management]
type: Concept
definition: [4(KP)][Carbon stock change][Emissions][CO2][kt][no source][Change in carbon stock][no target][no option][Grazing Land Management]
status: valid
status modified: 2017-02-13
accepted date: 2017-02-13
in scheme: emissions_variables_MMR

[4(KP)][Carbon stock change][Emissions][CO2][kt][no source][Change in carbon stock][no target][no option][Harvested and converted forest plantations]
type: Concept
definition: [4(KP)][Carbon stock change][Emissions][CO2][kt][no source][Change in carbon stock][no target][no option][Harvested and converted forest plantations]
status: valid
status modified: 2017-02-13
accepted date: 2017-02-13
in scheme: emissions_variables_MMR

[4(KP)][Carbon stock change][Emissions][CO2][kt][no source][Change in carbon stock][no target][no option][Land subject to natural disturbances]
type: Concept
definition: [4(KP)][Carbon stock change][Emissions][CO2][kt][no source][Change in carbon stock][no target][no option][Land subject to natural disturbances]
status: valid
status modified: 2017-02-13
accepted date: 2017-02-13
in scheme: emissions_variables_MMR

[4(KP)][Carbon stock change][Emissions][CO2][kt][no source][Change in carbon stock][no target][no option][Newly established forest]
type: Concept
definition: [4(KP)][Carbon stock change][Emissions][CO2][kt][no source][Change in carbon stock][no target][no option][Newly established forest]
status: valid
status modified: 2017-02-13
accepted date: 2017-02-13
in scheme: emissions_variables_MMR

[4(KP)][Carbon stock change][Emissions][CO2][kt][no source][Change in carbon stock][no target][no option][Revegetation]
type: Concept
definition: [4(KP)][Carbon stock change][Emissions][CO2][kt][no source][Change in carbon stock][no target][no option][Revegetation]
status: valid
status modified: 2017-02-13
accepted date: 2017-02-13
in scheme: emissions_variables_MMR

[4(KP)][Carbon stock change][Emissions][CO2][kt][no source][Change in carbon stock][no target][no option][Wetland Drainage and Rewetting]
type: Concept
definition: [4(KP)][Carbon stock change][Emissions][CO2][kt][no source][Change in carbon stock][no target][no option][Wetland Drainage and Rewetting]
status: valid
status modified: 2017-02-13
accepted date: 2017-02-13
in scheme: emissions_variables_MMR

[4(KP)][Carbon stock changes in the harvested wood products pool][Emissions][CO2][kt CO2 equivalent][land subject to afforestation and reforestation][no method][no target][no option][no type]
type: Concept
definition: [4(KP)][Carbon stock changes in the harvested wood products pool][Emissions][CO2][kt CO2 equivalent][land subject to afforestation and reforestation][no method][no target][no option][no type]
status: valid
status modified: 2017-02-13
accepted date: 2017-02-13
in scheme: emissions_variables_MMR

[4(KP)][Carbon stock changes in the harvested wood products pool][Emissions][CO2][kt CO2 equivalent][land subject to deforestation][no method][no target][no option][no type]
type: Concept
definition: [4(KP)][Carbon stock changes in the harvested wood products pool][Emissions][CO2][kt CO2 equivalent][land subject to deforestation][no method][no target][no option][no type]
status: valid
status modified: 2017-02-13
accepted date: 2017-02-13
in scheme: emissions_variables_MMR

[4(KP)][Carbon stock changes in the harvested wood products pool][Emissions][CO2][kt CO2 equivalent][land subject to forest management][no method][no target][no option][no type]
type: Concept
definition: [4(KP)][Carbon stock changes in the harvested wood products pool][Emissions][CO2][kt CO2 equivalent][land subject to forest management][no method][no target][no option][no type]
status: valid
status modified: 2017-02-13
accepted date: 2017-02-13
in scheme: emissions_variables_MMR

[4(KP)][Carbon stock changes in the harvested wood products pool][Emissions][CO2][kt CO2 equivalent][no source][no method][no target][no option][no type]
type: Concept
definition: [4(KP)][Carbon stock changes in the harvested wood products pool][Emissions][CO2][kt CO2 equivalent][no source][no method][no target][no option][no type]
status: valid
status modified: 2017-02-13
accepted date: 2017-02-13
in scheme: emissions_variables_MMR

[4(KP)][CH4 and N2O emissions from drained and rewetted organic soils][Emissions][CH4][kt][no source][no method][no target][no option][Afforestation and Reforestation]
type: Concept
definition: [4(KP)][CH4 and N2O emissions from drained and rewetted organic soils][Emissions][CH4][kt][no source][no method][no target][no option][Afforestation and Reforestation]
status: valid
status modified: 2017-02-13
accepted date: 2017-02-13
in scheme: emissions_variables_MMR

[4(KP)][CH4 and N2O emissions from drained and rewetted organic soils][Emissions][CH4][kt][no source][no method][no target][no option][Cropland Management]
type: Concept
definition: [4(KP)][CH4 and N2O emissions from drained and rewetted organic soils][Emissions][CH4][kt][no source][no method][no target][no option][Cropland Management]
status: valid
status modified: 2017-02-13
accepted date: 2017-02-13
in scheme: emissions_variables_MMR

[4(KP)][CH4 and N2O emissions from drained and rewetted organic soils][Emissions][CH4][kt][no source][no method][no target][no option][Deforestation]
type: Concept
definition: [4(KP)][CH4 and N2O emissions from drained and rewetted organic soils][Emissions][CH4][kt][no source][no method][no target][no option][Deforestation]
status: valid
status modified: 2017-02-13
accepted date: 2017-02-13
in scheme: emissions_variables_MMR

[4(KP)][CH4 and N2O emissions from drained and rewetted organic soils][Emissions][CH4][kt][no source][no method][no target][no option][Forest Management]
type: Concept
definition: [4(KP)][CH4 and N2O emissions from drained and rewetted organic soils][Emissions][CH4][kt][no source][no method][no target][no option][Forest Management]
status: valid
status modified: 2017-02-13
accepted date: 2017-02-13
in scheme: emissions_variables_MMR

[4(KP)][CH4 and N2O emissions from drained and rewetted organic soils][Emissions][CH4][kt][no source][no method][no target][no option][Grazing Land Management]
type: Concept
definition: [4(KP)][CH4 and N2O emissions from drained and rewetted organic soils][Emissions][CH4][kt][no source][no method][no target][no option][Grazing Land Management]
status: valid
status modified: 2017-02-13
accepted date: 2017-02-13
in scheme: emissions_variables_MMR

[4(KP)][CH4 and N2O emissions from drained and rewetted organic soils][Emissions][CH4][kt][no source][no method][no target][no option][Revegetation]
type: Concept
definition: [4(KP)][CH4 and N2O emissions from drained and rewetted organic soils][Emissions][CH4][kt][no source][no method][no target][no option][Revegetation]
status: valid
status modified: 2017-02-13
accepted date: 2017-02-13
in scheme: emissions_variables_MMR

[4(KP)][CH4 and N2O emissions from drained and rewetted organic soils][Emissions][CH4][kt][no source][no method][no target][no option][Wetland Drainage and Rewetting]
type: Concept
definition: [4(KP)][CH4 and N2O emissions from drained and rewetted organic soils][Emissions][CH4][kt][no source][no method][no target][no option][Wetland Drainage and Rewetting]
status: valid
status modified: 2017-02-13
accepted date: 2017-02-13
in scheme: emissions_variables_MMR

[4(KP)][CH4 and N2O emissions from drained and rewetted organic soils][Emissions][N2O][kt][no source][no method][no target][no option][Afforestation and Reforestation]
type: Concept
definition: [4(KP)][CH4 and N2O emissions from drained and rewetted organic soils][Emissions][N2O][kt][no source][no method][no target][no option][Afforestation and Reforestation]
status: valid
status modified: 2017-02-13
accepted date: 2017-02-13
in scheme: emissions_variables_MMR

[4(KP)][CH4 and N2O emissions from drained and rewetted organic soils][Emissions][N2O][kt][no source][no method][no target][no option][Cropland Management]
type: Concept
definition: [4(KP)][CH4 and N2O emissions from drained and rewetted organic soils][Emissions][N2O][kt][no source][no method][no target][no option][Cropland Management]
status: valid
status modified: 2017-02-13
accepted date: 2017-02-13
in scheme: emissions_variables_MMR

[4(KP)][CH4 and N2O emissions from drained and rewetted organic soils][Emissions][N2O][kt][no source][no method][no target][no option][Deforestation]
type: Concept
definition: [4(KP)][CH4 and N2O emissions from drained and rewetted organic soils][Emissions][N2O][kt][no source][no method][no target][no option][Deforestation]
status: valid
status modified: 2017-02-13
accepted date: 2017-02-13
in scheme: emissions_variables_MMR

[4(KP)][CH4 and N2O emissions from drained and rewetted organic soils][Emissions][N2O][kt][no source][no method][no target][no option][Forest Management]
type: Concept
definition: [4(KP)][CH4 and N2O emissions from drained and rewetted organic soils][Emissions][N2O][kt][no source][no method][no target][no option][Forest Management]
status: valid
status modified: 2017-02-13
accepted date: 2017-02-13
in scheme: emissions_variables_MMR

[4(KP)][CH4 and N2O emissions from drained and rewetted organic soils][Emissions][N2O][kt][no source][no method][no target][no option][Grazing Land Management]
type: Concept
definition: [4(KP)][CH4 and N2O emissions from drained and rewetted organic soils][Emissions][N2O][kt][no source][no method][no target][no option][Grazing Land Management]
status: valid
status modified: 2017-02-13
accepted date: 2017-02-13
in scheme: emissions_variables_MMR

[4(KP)][CH4 and N2O emissions from drained and rewetted organic soils][Emissions][N2O][kt][no source][no method][no target][no option][Revegetation]
type: Concept
definition: [4(KP)][CH4 and N2O emissions from drained and rewetted organic soils][Emissions][N2O][kt][no source][no method][no target][no option][Revegetation]
status: valid
status modified: 2017-02-13
accepted date: 2017-02-13
in scheme: emissions_variables_MMR

[4(KP)][CH4 and N2O emissions from drained and rewetted organic soils][Emissions][N2O][kt][no source][no method][no target][no option][Wetland Drainage and Rewetting]
type: Concept
definition: [4(KP)][CH4 and N2O emissions from drained and rewetted organic soils][Emissions][N2O][kt][no source][no method][no target][no option][Wetland Drainage and Rewetting]
status: valid
status modified: 2017-02-13
accepted date: 2017-02-13
in scheme: emissions_variables_MMR

[4(KP)][Controlled Burning][Emissions][CH4][kt][no source][no method][no target][no option][Afforestation and Reforestation]
type: Concept
definition: [4(KP)][Controlled Burning][Emissions][CH4][kt][no source][no method][no target][no option][Afforestation and Reforestation]
status: valid
status modified: 2017-02-13
accepted date: 2017-02-13
in scheme: emissions_variables_MMR

[4(KP)][Controlled Burning][Emissions][CH4][kt][no source][no method][no target][no option][Cropland Management]
type: Concept
definition: [4(KP)][Controlled Burning][Emissions][CH4][kt][no source][no method][no target][no option][Cropland Management]
status: valid
status modified: 2017-02-13
accepted date: 2017-02-13
in scheme: emissions_variables_MMR

[4(KP)][Controlled Burning][Emissions][CH4][kt][no source][no method][no target][no option][Deforestation]
type: Concept
definition: [4(KP)][Controlled Burning][Emissions][CH4][kt][no source][no method][no target][no option][Deforestation]
status: valid
status modified: 2017-02-13
accepted date: 2017-02-13
in scheme: emissions_variables_MMR

[4(KP)][Controlled Burning][Emissions][CH4][kt][no source][no method][no target][no option][Forest Management]
type: Concept
definition: [4(KP)][Controlled Burning][Emissions][CH4][kt][no source][no method][no target][no option][Forest Management]
status: valid
status modified: 2017-02-13
accepted date: 2017-02-13
in scheme: emissions_variables_MMR

[4(KP)][Controlled Burning][Emissions][CH4][kt][no source][no method][no target][no option][Grazing Land Management]
type: Concept
definition: [4(KP)][Controlled Burning][Emissions][CH4][kt][no source][no method][no target][no option][Grazing Land Management]
status: valid
status modified: 2017-02-13
accepted date: 2017-02-13
in scheme: emissions_variables_MMR

[4(KP)][Controlled Burning][Emissions][CH4][kt][no source][no method][no target][no option][Revegetation]
type: Concept
definition: [4(KP)][Controlled Burning][Emissions][CH4][kt][no source][no method][no target][no option][Revegetation]
status: valid
status modified: 2017-02-13
accepted date: 2017-02-13
in scheme: emissions_variables_MMR

[4(KP)][Controlled Burning][Emissions][CH4][kt][no source][no method][no target][no option][Wetland Drainage and Rewetting]
type: Concept
definition: [4(KP)][Controlled Burning][Emissions][CH4][kt][no source][no method][no target][no option][Wetland Drainage and Rewetting]
status: valid
status modified: 2017-02-13
accepted date: 2017-02-13
in scheme: emissions_variables_MMR

[4(KP)][Controlled Burning][Emissions][CO2][kt][no source][no method][no target][no option][Afforestation and Reforestation]
type: Concept
definition: [4(KP)][Controlled Burning][Emissions][CO2][kt][no source][no method][no target][no option][Afforestation and Reforestation]
status: valid
status modified: 2017-02-13
accepted date: 2017-02-13
in scheme: emissions_variables_MMR

[4(KP)][Controlled Burning][Emissions][CO2][kt][no source][no method][no target][no option][Cropland Management]
type: Concept
definition: [4(KP)][Controlled Burning][Emissions][CO2][kt][no source][no method][no target][no option][Cropland Management]
status: valid
status modified: 2017-02-13
accepted date: 2017-02-13
in scheme: emissions_variables_MMR

[4(KP)][Controlled Burning][Emissions][CO2][kt][no source][no method][no target][no option][Deforestation]
type: Concept
definition: [4(KP)][Controlled Burning][Emissions][CO2][kt][no source][no method][no target][no option][Deforestation]
status: valid
status modified: 2017-02-13
accepted date: 2017-02-13
in scheme: emissions_variables_MMR

[4(KP)][Controlled Burning][Emissions][CO2][kt][no source][no method][no target][no option][Forest Management]
type: Concept
definition: [4(KP)][Controlled Burning][Emissions][CO2][kt][no source][no method][no target][no option][Forest Management]
status: valid
status modified: 2017-02-13
accepted date: 2017-02-13
in scheme: emissions_variables_MMR

[4(KP)][Controlled Burning][Emissions][CO2][kt][no source][no method][no target][no option][Grazing Land Management]
type: Concept
definition: [4(KP)][Controlled Burning][Emissions][CO2][kt][no source][no method][no target][no option][Grazing Land Management]
status: valid
status modified: 2017-02-13
accepted date: 2017-02-13
in scheme: emissions_variables_MMR

[4(KP)][Controlled Burning][Emissions][CO2][kt][no source][no method][no target][no option][Revegetation]
type: Concept
definition: [4(KP)][Controlled Burning][Emissions][CO2][kt][no source][no method][no target][no option][Revegetation]
status: valid
status modified: 2017-02-13
accepted date: 2017-02-13
in scheme: emissions_variables_MMR

[4(KP)][Controlled Burning][Emissions][CO2][kt][no source][no method][no target][no option][Wetland Drainage and Rewetting]
type: Concept
definition: [4(KP)][Controlled Burning][Emissions][CO2][kt][no source][no method][no target][no option][Wetland Drainage and Rewetting]
status: valid
status modified: 2017-02-13
accepted date: 2017-02-13
in scheme: emissions_variables_MMR

[4(KP)][Controlled Burning][Emissions][N2O][kt][no source][no method][no target][no option][Afforestation and Reforestation]
type: Concept
definition: [4(KP)][Controlled Burning][Emissions][N2O][kt][no source][no method][no target][no option][Afforestation and Reforestation]
status: valid
status modified: 2017-02-13
accepted date: 2017-02-13
in scheme: emissions_variables_MMR

[4(KP)][Controlled Burning][Emissions][N2O][kt][no source][no method][no target][no option][Cropland Management]
type: Concept
definition: [4(KP)][Controlled Burning][Emissions][N2O][kt][no source][no method][no target][no option][Cropland Management]
status: valid
status modified: 2017-02-13
accepted date: 2017-02-13
in scheme: emissions_variables_MMR

[4(KP)][Controlled Burning][Emissions][N2O][kt][no source][no method][no target][no option][Deforestation]
type: Concept
definition: [4(KP)][Controlled Burning][Emissions][N2O][kt][no source][no method][no target][no option][Deforestation]
status: valid
status modified: 2017-02-13
accepted date: 2017-02-13
in scheme: emissions_variables_MMR

[4(KP)][Controlled Burning][Emissions][N2O][kt][no source][no method][no target][no option][Forest Management]
type: Concept
definition: [4(KP)][Controlled Burning][Emissions][N2O][kt][no source][no method][no target][no option][Forest Management]
status: valid
status modified: 2017-02-13
accepted date: 2017-02-13
in scheme: emissions_variables_MMR

[4(KP)][Controlled Burning][Emissions][N2O][kt][no source][no method][no target][no option][Grazing Land Management]
type: Concept
definition: [4(KP)][Controlled Burning][Emissions][N2O][kt][no source][no method][no target][no option][Grazing Land Management]
status: valid
status modified: 2017-02-13
accepted date: 2017-02-13
in scheme: emissions_variables_MMR

[4(KP)][Controlled Burning][Emissions][N2O][kt][no source][no method][no target][no option][Revegetation]
type: Concept
definition: [4(KP)][Controlled Burning][Emissions][N2O][kt][no source][no method][no target][no option][Revegetation]
status: valid
status modified: 2017-02-13
accepted date: 2017-02-13
in scheme: emissions_variables_MMR

[4(KP)][Controlled Burning][Emissions][N2O][kt][no source][no method][no target][no option][Wetland Drainage and Rewetting]
type: Concept
definition: [4(KP)][Controlled Burning][Emissions][N2O][kt][no source][no method][no target][no option][Wetland Drainage and Rewetting]
status: valid
status modified: 2017-02-13
accepted date: 2017-02-13
in scheme: emissions_variables_MMR

[4(KP)][Direct and indirect N2O emissions from N fertilization][Emissions][N2O][kt][no source][no method][no target][no option][Afforestation and Reforestation]
type: Concept
definition: [4(KP)][Direct and indirect N2O emissions from N fertilization][Emissions][N2O][kt][no source][no method][no target][no option][Afforestation and Reforestation]
status: valid
status modified: 2017-02-13
accepted date: 2017-02-13
in scheme: emissions_variables_MMR

[4(KP)][Direct and indirect N2O emissions from N fertilization][Emissions][N2O][kt][no source][no method][no target][no option][Deforestation]
type: Concept
definition: [4(KP)][Direct and indirect N2O emissions from N fertilization][Emissions][N2O][kt][no source][no method][no target][no option][Deforestation]
status: valid
status modified: 2017-02-13
accepted date: 2017-02-13
in scheme: emissions_variables_MMR

[4(KP)][Direct and indirect N2O emissions from N fertilization][Emissions][N2O][kt][no source][no method][no target][no option][Forest Management]
type: Concept
definition: [4(KP)][Direct and indirect N2O emissions from N fertilization][Emissions][N2O][kt][no source][no method][no target][no option][Forest Management]
status: valid
status modified: 2017-02-13
accepted date: 2017-02-13
in scheme: emissions_variables_MMR

[4(KP)][Direct and indirect N2O emissions from N fertilization][Emissions][N2O][kt][no source][no method][no target][no option][Revegetation]
type: Concept
definition: [4(KP)][Direct and indirect N2O emissions from N fertilization][Emissions][N2O][kt][no source][no method][no target][no option][Revegetation]
status: valid
status modified: 2017-02-13
accepted date: 2017-02-13
in scheme: emissions_variables_MMR

[4(KP)][Direct and indirect N2O emissions from N fertilization][Emissions][N2O][kt][no source][no method][no target][no option][Wetland Drainage and Rewetting]
type: Concept
definition: [4(KP)][Direct and indirect N2O emissions from N fertilization][Emissions][N2O][kt][no source][no method][no target][no option][Wetland Drainage and Rewetting]
status: valid
status modified: 2017-02-13
accepted date: 2017-02-13
in scheme: emissions_variables_MMR

[4(KP)][Drained Organic Soils][Emissions][CH4][kt][no source][no method][no target][no option][Afforestation and Reforestation]
type: Concept
definition: [4(KP)][Drained Organic Soils][Emissions][CH4][kt][no source][no method][no target][no option][Afforestation and Reforestation]
status: valid
status modified: 2017-02-13
accepted date: 2017-02-13
in scheme: emissions_variables_MMR

[4(KP)][Drained Organic Soils][Emissions][CH4][kt][no source][no method][no target][no option][Cropland Management]
type: Concept
definition: [4(KP)][Drained Organic Soils][Emissions][CH4][kt][no source][no method][no target][no option][Cropland Management]
status: valid
status modified: 2017-02-13
accepted date: 2017-02-13
in scheme: emissions_variables_MMR

[4(KP)][Drained Organic Soils][Emissions][CH4][kt][no source][no method][no target][no option][Deforestation]
type: Concept
definition: [4(KP)][Drained Organic Soils][Emissions][CH4][kt][no source][no method][no target][no option][Deforestation]
status: valid
status modified: 2017-02-13
accepted date: 2017-02-13
in scheme: emissions_variables_MMR

[4(KP)][Drained Organic Soils][Emissions][CH4][kt][no source][no method][no target][no option][Forest Management]
type: Concept
definition: [4(KP)][Drained Organic Soils][Emissions][CH4][kt][no source][no method][no target][no option][Forest Management]
status: valid
status modified: 2017-02-13
accepted date: 2017-02-13
in scheme: emissions_variables_MMR

[4(KP)][Drained Organic Soils][Emissions][CH4][kt][no source][no method][no target][no option][Grazing Land Management]
type: Concept
definition: [4(KP)][Drained Organic Soils][Emissions][CH4][kt][no source][no method][no target][no option][Grazing Land Management]
status: valid
status modified: 2017-02-13
accepted date: 2017-02-13
in scheme: emissions_variables_MMR

[4(KP)][Drained Organic Soils][Emissions][CH4][kt][no source][no method][no target][no option][Revegetation]
type: Concept
definition: [4(KP)][Drained Organic Soils][Emissions][CH4][kt][no source][no method][no target][no option][Revegetation]
status: valid
status modified: 2017-02-13
accepted date: 2017-02-13
in scheme: emissions_variables_MMR

[4(KP)][Drained Organic Soils][Emissions][CH4][kt][no source][no method][no target][no option][Wetland Drainage and Rewetting]
type: Concept
definition: [4(KP)][Drained Organic Soils][Emissions][CH4][kt][no source][no method][no target][no option][Wetland Drainage and Rewetting]
status: valid
status modified: 2017-02-13
accepted date: 2017-02-13
in scheme: emissions_variables_MMR

[4(KP)][Drained Organic Soils][Emissions][N2O][kt][no source][no method][no target][no option][Afforestation and Reforestation]
type: Concept
definition: [4(KP)][Drained Organic Soils][Emissions][N2O][kt][no source][no method][no target][no option][Afforestation and Reforestation]
status: valid
status modified: 2017-02-13
accepted date: 2017-02-13
in scheme: emissions_variables_MMR

[4(KP)][Drained Organic Soils][Emissions][N2O][kt][no source][no method][no target][no option][Deforestation]
type: Concept
definition: [4(KP)][Drained Organic Soils][Emissions][N2O][kt][no source][no method][no target][no option][Deforestation]
status: valid
status modified: 2017-02-13
accepted date: 2017-02-13
in scheme: emissions_variables_MMR

[4(KP)][Drained Organic Soils][Emissions][N2O][kt][no source][no method][no target][no option][Forest Management]
type: Concept
definition: [4(KP)][Drained Organic Soils][Emissions][N2O][kt][no source][no method][no target][no option][Forest Management]
status: valid
status modified: 2017-02-13
accepted date: 2017-02-13
in scheme: emissions_variables_MMR

[4(KP)][Drained Organic Soils][Emissions][N2O][kt][no source][no method][no target][no option][Revegetation]
type: Concept
definition: [4(KP)][Drained Organic Soils][Emissions][N2O][kt][no source][no method][no target][no option][Revegetation]
status: valid
status modified: 2017-02-13
accepted date: 2017-02-13
in scheme: emissions_variables_MMR

[4(KP)][Drained Organic Soils][Emissions][N2O][kt][no source][no method][no target][no option][Wetland Drainage and Rewetting]
type: Concept
definition: [4(KP)][Drained Organic Soils][Emissions][N2O][kt][no source][no method][no target][no option][Wetland Drainage and Rewetting]
status: valid
status modified: 2017-02-13
accepted date: 2017-02-13
in scheme: emissions_variables_MMR

[4(KP)][Emissions and removals from natural disturbances][Emissions][CH4][kt][Emissions from areas subject to natural disturbances][no method][no target][no option][Afforestation and Reforestation]
type: Concept
definition: [4(KP)][Emissions and removals from natural disturbances][Emissions][CH4][kt][Emissions from areas subject to natural disturbances][no method][no target][no option][Afforestation and Reforestation]
status: valid
status modified: 2017-02-13
accepted date: 2017-02-13
in scheme: emissions_variables_MMR

[4(KP)][Emissions and removals from natural disturbances][Emissions][CH4][kt][Emissions from areas subject to natural disturbances][no method][no target][no option][Forest Management]
type: Concept
definition: [4(KP)][Emissions and removals from natural disturbances][Emissions][CH4][kt][Emissions from areas subject to natural disturbances][no method][no target][no option][Forest Management]
status: valid
status modified: 2017-02-13
accepted date: 2017-02-13
in scheme: emissions_variables_MMR

[4(KP)][Emissions and removals from natural disturbances][Emissions][CO2][kt C][Emissions from areas subject to natural disturbances][no method][no target][no option][Afforestation and Reforestation]
type: Concept
definition: [4(KP)][Emissions and removals from natural disturbances][Emissions][CO2][kt C][Emissions from areas subject to natural disturbances][no method][no target][no option][Afforestation and Reforestation]
status: valid
status modified: 2017-02-13
accepted date: 2017-02-13
in scheme: emissions_variables_MMR

[4(KP)][Emissions and removals from natural disturbances][Emissions][CO2][kt C][Emissions from areas subject to natural disturbances][no method][no target][no option][Forest Management]
type: Concept
definition: [4(KP)][Emissions and removals from natural disturbances][Emissions][CO2][kt C][Emissions from areas subject to natural disturbances][no method][no target][no option][Forest Management]
status: valid
status modified: 2017-02-13
accepted date: 2017-02-13
in scheme: emissions_variables_MMR

[4(KP)][Emissions and removals from natural disturbances][Emissions][N2O][kt][Emissions from areas subject to natural disturbances][no method][no target][no option][Afforestation and Reforestation]
type: Concept
definition: [4(KP)][Emissions and removals from natural disturbances][Emissions][N2O][kt][Emissions from areas subject to natural disturbances][no method][no target][no option][Afforestation and Reforestation]
status: valid
status modified: 2017-02-13
accepted date: 2017-02-13
in scheme: emissions_variables_MMR

[4(KP)][Emissions and removals from natural disturbances][Emissions][N2O][kt][Emissions from areas subject to natural disturbances][no method][no target][no option][Forest Management]
type: Concept
definition: [4(KP)][Emissions and removals from natural disturbances][Emissions][N2O][kt][Emissions from areas subject to natural disturbances][no method][no target][no option][Forest Management]
status: valid
status modified: 2017-02-13
accepted date: 2017-02-13
in scheme: emissions_variables_MMR

[4(KP)][Information Items on deforestation wildfires][Emissions][CO2][kt][Cropland][Change in carbon stock][no target][no option][Deforestation]
type: Concept
definition: [4(KP)][Information Items on deforestation wildfires][Emissions][CO2][kt][Cropland][Change in carbon stock][no target][no option][Deforestation]
status: valid
status modified: 2017-02-13
accepted date: 2017-02-13
in scheme: emissions_variables_MMR

[4(KP)][Information Items on deforestation wildfires][Emissions][CO2][kt][Forest Land][Change in carbon stock][no target][no option][Deforestation]
type: Concept
definition: [4(KP)][Information Items on deforestation wildfires][Emissions][CO2][kt][Forest Land][Change in carbon stock][no target][no option][Deforestation]
status: valid
status modified: 2017-02-13
accepted date: 2017-02-13
in scheme: emissions_variables_MMR

[4(KP)][Information Items on deforestation wildfires][Emissions][CO2][kt][Grassland][Change in carbon stock][no target][no option][Deforestation]
type: Concept
definition: [4(KP)][Information Items on deforestation wildfires][Emissions][CO2][kt][Grassland][Change in carbon stock][no target][no option][Deforestation]
status: valid
status modified: 2017-02-13
accepted date: 2017-02-13
in scheme: emissions_variables_MMR

http://dd.eionet.europa.eu/vocabulary/ghg/emissions_variables_MMR/2F69C315-9014-429D-AF1C-7D0572B04EFD
type: Concept
preferred label: [4(KP)][Information Items on deforestation wildfires][Emissions][CO2][kt][Land areas under deforestation by land-use category in the reporting year][Change in carbon stock][no target][no option][Deforestation]
definition: [4(KP)][Information Items on deforestation wildfires][Emissions][CO2][kt][Land areas under deforestation by land-use category in the reporting year][Change in carbon stock][no target][no option][Deforestation]
status: valid
status modified: 2017-02-13
accepted date: 2017-02-13
in scheme: emissions_variables_MMR

[4(KP)][Information Items on deforestation wildfires][Emissions][CO2][kt][Other Land][Change in carbon stock][no target][no option][Deforestation]
type: Concept
definition: [4(KP)][Information Items on deforestation wildfires][Emissions][CO2][kt][Other Land][Change in carbon stock][no target][no option][Deforestation]
status: valid
status modified: 2017-02-13
accepted date: 2017-02-13
in scheme: emissions_variables_MMR

[4(KP)][Information Items on deforestation wildfires][Emissions][CO2][kt][Settlements][Change in carbon stock][no target][no option][Deforestation]
type: Concept
definition: [4(KP)][Information Items on deforestation wildfires][Emissions][CO2][kt][Settlements][Change in carbon stock][no target][no option][Deforestation]
status: valid
status modified: 2017-02-13
accepted date: 2017-02-13
in scheme: emissions_variables_MMR

[4(KP)][Information Items on deforestation wildfires][Emissions][CO2][kt][Wetlands][Change in carbon stock][no target][no option][Deforestation]
type: Concept
definition: [4(KP)][Information Items on deforestation wildfires][Emissions][CO2][kt][Wetlands][Change in carbon stock][no target][no option][Deforestation]
status: valid
status modified: 2017-02-13
accepted date: 2017-02-13
in scheme: emissions_variables_MMR

[4(KP)][Land subject to natural disturbances][Emissions][CO2][kt][no source][Change in carbon stock][no target][no option][Afforestation and Reforestation]
type: Concept
definition: [4(KP)][Land subject to natural disturbances][Emissions][CO2][kt][no source][Change in carbon stock][no target][no option][Afforestation and Reforestation]
status: valid
status modified: 2017-02-13
accepted date: 2017-02-13
in scheme: emissions_variables_MMR

http://dd.eionet.europa.eu/vocabulary/ghg/emissions_variables_MMR/91D0CD27-C088-465E-B23A-491EA4E4B6E6
type: Concept
preferred label: [4(KP)][N2O emissions from N mineralization/immobilization due to carbon loss/gain associated with land-use conversions and management change in mineral soils][Emissions][N2O][kt][no source][no method][no target][no option][Afforestation and Reforestation]
definition: [4(KP)][N2O emissions from N mineralization/immobilization due to carbon loss/gain associated with land-use conversions and management change in mineral soils][Emissions][N2O][kt][no source][no method][no target][no option][Afforestation and Reforestation]
status: valid
status modified: 2017-02-13
accepted date: 2017-02-13
in scheme: emissions_variables_MMR

http://dd.eionet.europa.eu/vocabulary/ghg/emissions_variables_MMR/565BBDE3-26BB-4D52-8634-F5DCA86250AB
type: Concept
preferred label: [4(KP)][N2O emissions from N mineralization/immobilization due to carbon loss/gain associated with land-use conversions and management change in mineral soils][Emissions][N2O][kt][no source][no method][no target][no option][Cropland Management]
definition: [4(KP)][N2O emissions from N mineralization/immobilization due to carbon loss/gain associated with land-use conversions and management change in mineral soils][Emissions][N2O][kt][no source][no method][no target][no option][Cropland Management]
status: valid
status modified: 2017-02-13
accepted date: 2017-02-13
in scheme: emissions_variables_MMR

http://dd.eionet.europa.eu/vocabulary/ghg/emissions_variables_MMR/FB7B26F4-9BB8-4E9E-9E11-F1B9D153F92A
type: Concept
preferred label: [4(KP)][N2O emissions from N mineralization/immobilization due to carbon loss/gain associated with land-use conversions and management change in mineral soils][Emissions][N2O][kt][no source][no method][no target][no option][Deforestation]
definition: [4(KP)][N2O emissions from N mineralization/immobilization due to carbon loss/gain associated with land-use conversions and management change in mineral soils][Emissions][N2O][kt][no source][no method][no target][no option][Deforestation]
status: valid
status modified: 2017-02-13
accepted date: 2017-02-13
in scheme: emissions_variables_MMR

http://dd.eionet.europa.eu/vocabulary/ghg/emissions_variables_MMR/141C93C7-CBC1-4518-8196-AF6D5BA21B1D
type: Concept
preferred label: [4(KP)][N2O emissions from N mineralization/immobilization due to carbon loss/gain associated with land-use conversions and management change in mineral soils][Emissions][N2O][kt][no source][no method][no target][no option][Forest Management]
definition: [4(KP)][N2O emissions from N mineralization/immobilization due to carbon loss/gain associated with land-use conversions and management change in mineral soils][Emissions][N2O][kt][no source][no method][no target][no option][Forest Management]
status: valid
status modified: 2017-02-13
accepted date: 2017-02-13
in scheme: emissions_variables_MMR

http://dd.eionet.europa.eu/vocabulary/ghg/emissions_variables_MMR/CD6DED16-D339-4DFA-A0F0-86C5748F445E
type: Concept
preferred label: [4(KP)][N2O emissions from N mineralization/immobilization due to carbon loss/gain associated with land-use conversions and management change in mineral soils][Emissions][N2O][kt][no source][no method][no target][no option][Grazing Land Management]
definition: [4(KP)][N2O emissions from N mineralization/immobilization due to carbon loss/gain associated with land-use conversions and management change in mineral soils][Emissions][N2O][kt][no source][no method][no target][no option][Grazing Land Management]
status: valid
status modified: 2017-02-13
accepted date: 2017-02-13
in scheme: emissions_variables_MMR

http://dd.eionet.europa.eu/vocabulary/ghg/emissions_variables_MMR/4E65BAC8-50EF-46F4-8BFF-021E79B51892
type: Concept
preferred label: [4(KP)][N2O emissions from N mineralization/immobilization due to carbon loss/gain associated with land-use conversions and management change in mineral soils][Emissions][N2O][kt][no source][no method][no target][no option][Revegetation]
definition: [4(KP)][N2O emissions from N mineralization/immobilization due to carbon loss/gain associated with land-use conversions and management change in mineral soils][Emissions][N2O][kt][no source][no method][no target][no option][Revegetation]
status: valid
status modified: 2017-02-13
accepted date: 2017-02-13
in scheme: emissions_variables_MMR

[4(KP)][Rewetted Organic Soils][Emissions][CH4][kt][no source][no method][no target][no option][Afforestation and Reforestation]
type: Concept
definition: [4(KP)][Rewetted Organic Soils][Emissions][CH4][kt][no source][no method][no target][no option][Afforestation and Reforestation]
status: valid
status modified: 2017-02-13
accepted date: 2017-02-13
in scheme: emissions_variables_MMR

[4(KP)][Rewetted Organic Soils][Emissions][CH4][kt][no source][no method][no target][no option][Cropland Management]
type: Concept
definition: [4(KP)][Rewetted Organic Soils][Emissions][CH4][kt][no source][no method][no target][no option][Cropland Management]
status: valid
status modified: 2017-02-13
accepted date: 2017-02-13
in scheme: emissions_variables_MMR

[4(KP)][Rewetted Organic Soils][Emissions][CH4][kt][no source][no method][no target][no option][Deforestation]
type: Concept
definition: [4(KP)][Rewetted Organic Soils][Emissions][CH4][kt][no source][no method][no target][no option][Deforestation]
status: valid
status modified: 2017-02-13
accepted date: 2017-02-13
in scheme: emissions_variables_MMR

[4(KP)][Rewetted Organic Soils][Emissions][CH4][kt][no source][no method][no target][no option][Forest Management]
type: Concept
definition: [4(KP)][Rewetted Organic Soils][Emissions][CH4][kt][no source][no method][no target][no option][Forest Management]
status: valid
status modified: 2017-02-13
accepted date: 2017-02-13
in scheme: emissions_variables_MMR

[4(KP)][Rewetted Organic Soils][Emissions][CH4][kt][no source][no method][no target][no option][Grazing Land Management]
type: Concept
definition: [4(KP)][Rewetted Organic Soils][Emissions][CH4][kt][no source][no method][no target][no option][Grazing Land Management]
status: valid
status modified: 2017-02-13
accepted date: 2017-02-13
in scheme: emissions_variables_MMR

[4(KP)][Rewetted Organic Soils][Emissions][CH4][kt][no source][no method][no target][no option][Revegetation]
type: Concept
definition: [4(KP)][Rewetted Organic Soils][Emissions][CH4][kt][no source][no method][no target][no option][Revegetation]
status: valid
status modified: 2017-02-13
accepted date: 2017-02-13
in scheme: emissions_variables_MMR

[4(KP)][Rewetted Organic Soils][Emissions][CH4][kt][no source][no method][no target][no option][Wetland Drainage and Rewetting]
type: Concept
definition: [4(KP)][Rewetted Organic Soils][Emissions][CH4][kt][no source][no method][no target][no option][Wetland Drainage and Rewetting]
status: valid
status modified: 2017-02-13
accepted date: 2017-02-13
in scheme: emissions_variables_MMR

[4(KP)][Rewetted Organic Soils][Emissions][N2O][kt][no source][no method][no target][no option][Afforestation and Reforestation]
type: Concept
definition: [4(KP)][Rewetted Organic Soils][Emissions][N2O][kt][no source][no method][no target][no option][Afforestation and Reforestation]
status: valid
status modified: 2017-02-13
accepted date: 2017-02-13
in scheme: emissions_variables_MMR

[4(KP)][Rewetted Organic Soils][Emissions][N2O][kt][no source][no method][no target][no option][Deforestation]
type: Concept
definition: [4(KP)][Rewetted Organic Soils][Emissions][N2O][kt][no source][no method][no target][no option][Deforestation]
status: valid
status modified: 2017-02-13
accepted date: 2017-02-13
in scheme: emissions_variables_MMR

[4(KP)][Rewetted Organic Soils][Emissions][N2O][kt][no source][no method][no target][no option][Forest Management]
type: Concept
definition: [4(KP)][Rewetted Organic Soils][Emissions][N2O][kt][no source][no method][no target][no option][Forest Management]
status: valid
status modified: 2017-02-13
accepted date: 2017-02-13
in scheme: emissions_variables_MMR

[4(KP)][Rewetted Organic Soils][Emissions][N2O][kt][no source][no method][no target][no option][Revegetation]
type: Concept
definition: [4(KP)][Rewetted Organic Soils][Emissions][N2O][kt][no source][no method][no target][no option][Revegetation]
status: valid
status modified: 2017-02-13
accepted date: 2017-02-13
in scheme: emissions_variables_MMR

[4(KP)][Rewetted Organic Soils][Emissions][N2O][kt][no source][no method][no target][no option][Wetland Drainage and Rewetting]
type: Concept
definition: [4(KP)][Rewetted Organic Soils][Emissions][N2O][kt][no source][no method][no target][no option][Wetland Drainage and Rewetting]
status: valid
status modified: 2017-02-13
accepted date: 2017-02-13
in scheme: emissions_variables_MMR

http://dd.eionet.europa.eu/vocabulary/ghg/emissions_variables_MMR/322307C4-74C5-492B-85D7-D617DCCADADD
type: Concept
preferred label: [4(KP)][Total for 2013 natural disturbances][Emissions][CH4][kt][Emissions from areas subject to natural disturbances][Natural disturbances][Geographic location][no option][Afforestation and Reforestation]
definition: [4(KP)][Total for 2013 natural disturbances][Emissions][CH4][kt][Emissions from areas subject to natural disturbances][Natural disturbances][Geographic location][no option][Afforestation and Reforestation]
status: valid
status modified: 2017-02-13
accepted date: 2017-02-13
in scheme: emissions_variables_MMR

[4(KP)][Total for 2013 natural disturbances][Emissions][CH4][kt][Emissions from areas subject to natural disturbances][Natural disturbances][Geographic location][no option][Forest Management]
type: Concept
definition: [4(KP)][Total for 2013 natural disturbances][Emissions][CH4][kt][Emissions from areas subject to natural disturbances][Natural disturbances][Geographic location][no option][Forest Management]
status: valid
status modified: 2017-02-13
accepted date: 2017-02-13
in scheme: emissions_variables_MMR

http://dd.eionet.europa.eu/vocabulary/ghg/emissions_variables_MMR/FF3A4349-E659-45B8-9BFA-996A750BBBDE
type: Concept
preferred label: [4(KP)][Total for 2013 natural disturbances][Emissions][CO2][kt C][Emissions from areas subject to natural disturbances][Natural disturbances][Geographic location][no option][Afforestation and Reforestation]
definition: [4(KP)][Total for 2013 natural disturbances][Emissions][CO2][kt C][Emissions from areas subject to natural disturbances][Natural disturbances][Geographic location][no option][Afforestation and Reforestation]
status: valid
status modified: 2017-02-13
accepted date: 2017-02-13
in scheme: emissions_variables_MMR

[4(KP)][Total for 2013 natural disturbances][Emissions][CO2][kt C][Emissions from areas subject to natural disturbances][Natural disturbances][Geographic location][no option][Forest Management]
type: Concept
definition: [4(KP)][Total for 2013 natural disturbances][Emissions][CO2][kt C][Emissions from areas subject to natural disturbances][Natural disturbances][Geographic location][no option][Forest Management]
status: valid
status modified: 2017-02-13
accepted date: 2017-02-13
in scheme: emissions_variables_MMR

http://dd.eionet.europa.eu/vocabulary/ghg/emissions_variables_MMR/D8151728-708C-4480-99ED-A57AE0329B6C
type: Concept
preferred label: [4(KP)][Total for 2013 natural disturbances][Emissions][N2O][kt][Emissions from areas subject to natural disturbances][Natural disturbances][Geographic location][no option][Afforestation and Reforestation]
definition: [4(KP)][Total for 2013 natural disturbances][Emissions][N2O][kt][Emissions from areas subject to natural disturbances][Natural disturbances][Geographic location][no option][Afforestation and Reforestation]
status: valid
status modified: 2017-02-13
accepted date: 2017-02-13
in scheme: emissions_variables_MMR

[4(KP)][Total for 2013 natural disturbances][Emissions][N2O][kt][Emissions from areas subject to natural disturbances][Natural disturbances][Geographic location][no option][Forest Management]
type: Concept
definition: [4(KP)][Total for 2013 natural disturbances][Emissions][N2O][kt][Emissions from areas subject to natural disturbances][Natural disturbances][Geographic location][no option][Forest Management]
status: valid
status modified: 2017-02-13
accepted date: 2017-02-13
in scheme: emissions_variables_MMR

http://dd.eionet.europa.eu/vocabulary/ghg/emissions_variables_MMR/E11E076E-E937-4BC3-92D9-5DC9D91D939C
type: Concept
preferred label: [4(KP)][Total for 2014 natural disturbances][Emissions][CH4][kt][Emissions from areas subject to natural disturbances][Natural disturbances][Geographic location][no option][Afforestation and Reforestation]
definition: [4(KP)][Total for 2014 natural disturbances][Emissions][CH4][kt][Emissions from areas subject to natural disturbances][Natural disturbances][Geographic location][no option][Afforestation and Reforestation]
status: valid
status modified: 2017-02-13
accepted date: 2017-02-13
in scheme: emissions_variables_MMR

[4(KP)][Total for 2014 natural disturbances][Emissions][CH4][kt][Emissions from areas subject to natural disturbances][Natural disturbances][Geographic location][no option][Forest Management]
type: Concept
definition: [4(KP)][Total for 2014 natural disturbances][Emissions][CH4][kt][Emissions from areas subject to natural disturbances][Natural disturbances][Geographic location][no option][Forest Management]
status: valid
status modified: 2017-02-13
accepted date: 2017-02-13
in scheme: emissions_variables_MMR

http://dd.eionet.europa.eu/vocabulary/ghg/emissions_variables_MMR/688D8863-23E0-42EB-8D5A-9AB5D08C68E7
type: Concept
preferred label: [4(KP)][Total for 2014 natural disturbances][Emissions][CO2][kt C][Emissions from areas subject to natural disturbances][Natural disturbances][Geographic location][no option][Afforestation and Reforestation]
definition: [4(KP)][Total for 2014 natural disturbances][Emissions][CO2][kt C][Emissions from areas subject to natural disturbances][Natural disturbances][Geographic location][no option][Afforestation and Reforestation]
status: valid
status modified: 2017-02-13
accepted date: 2017-02-13
in scheme: emissions_variables_MMR

[4(KP)][Total for 2014 natural disturbances][Emissions][CO2][kt C][Emissions from areas subject to natural disturbances][Natural disturbances][Geographic location][no option][Forest Management]
type: Concept
definition: [4(KP)][Total for 2014 natural disturbances][Emissions][CO2][kt C][Emissions from areas subject to natural disturbances][Natural disturbances][Geographic location][no option][Forest Management]
status: valid
status modified: 2017-02-13
accepted date: 2017-02-13
in scheme: emissions_variables_MMR

http://dd.eionet.europa.eu/vocabulary/ghg/emissions_variables_MMR/A4950A61-F957-4122-9301-2507AC0C9F5B
type: Concept
preferred label: [4(KP)][Total for 2014 natural disturbances][Emissions][N2O][kt][Emissions from areas subject to natural disturbances][Natural disturbances][Geographic location][no option][Afforestation and Reforestation]
definition: [4(KP)][Total for 2014 natural disturbances][Emissions][N2O][kt][Emissions from areas subject to natural disturbances][Natural disturbances][Geographic location][no option][Afforestation and Reforestation]
status: valid
status modified: 2017-02-13
accepted date: 2017-02-13
in scheme: emissions_variables_MMR

[4(KP)][Total for 2014 natural disturbances][Emissions][N2O][kt][Emissions from areas subject to natural disturbances][Natural disturbances][Geographic location][no option][Forest Management]
type: Concept
definition: [4(KP)][Total for 2014 natural disturbances][Emissions][N2O][kt][Emissions from areas subject to natural disturbances][Natural disturbances][Geographic location][no option][Forest Management]
status: valid
status modified: 2017-02-13
accepted date: 2017-02-13
in scheme: emissions_variables_MMR

http://dd.eionet.europa.eu/vocabulary/ghg/emissions_variables_MMR/E1D4022B-44E1-41E7-A553-11A5FE618535
type: Concept
preferred label: [4(KP)][Total for 2015 natural disturbances][Emissions][CH4][kt][Emissions from areas subject to natural disturbances][Natural disturbances][Geographic location][no option][Afforestation and Reforestation]
definition: [4(KP)][Total for 2015 natural disturbances][Emissions][CH4][kt][Emissions from areas subject to natural disturbances][Natural disturbances][Geographic location][no option][Afforestation and Reforestation]
status: valid
status modified: 2017-02-13
accepted date: 2017-02-13
in scheme: emissions_variables_MMR

[4(KP)][Total for 2015 natural disturbances][Emissions][CH4][kt][Emissions from areas subject to natural disturbances][Natural disturbances][Geographic location][no option][Forest Management]
type: Concept
definition: [4(KP)][Total for 2015 natural disturbances][Emissions][CH4][kt][Emissions from areas subject to natural disturbances][Natural disturbances][Geographic location][no option][Forest Management]
status: valid
status modified: 2017-02-13
accepted date: 2017-02-13
in scheme: emissions_variables_MMR

http://dd.eionet.europa.eu/vocabulary/ghg/emissions_variables_MMR/E1D3729F-2CAD-4B7F-AB4F-714141CC0A84
type: Concept
preferred label: [4(KP)][Total for 2015 natural disturbances][Emissions][CO2][kt C][Emissions from areas subject to natural disturbances][Natural disturbances][Geographic location][no option][Afforestation and Reforestation]
definition: [4(KP)][Total for 2015 natural disturbances][Emissions][CO2][kt C][Emissions from areas subject to natural disturbances][Natural disturbances][Geographic location][no option][Afforestation and Reforestation]
status: valid
status modified: 2017-02-13
accepted date: 2017-02-13
in scheme: emissions_variables_MMR

[4(KP)][Total for 2015 natural disturbances][Emissions][CO2][kt C][Emissions from areas subject to natural disturbances][Natural disturbances][Geographic location][no option][Forest Management]
type: Concept
definition: [4(KP)][Total for 2015 natural disturbances][Emissions][CO2][kt C][Emissions from areas subject to natural disturbances][Natural disturbances][Geographic location][no option][Forest Management]
status: valid
status modified: 2017-02-13
accepted date: 2017-02-13
in scheme: emissions_variables_MMR

http://dd.eionet.europa.eu/vocabulary/ghg/emissions_variables_MMR/E36E1031-1C06-4FD2-BC1C-6B9D3B26A45C
type: Concept
preferred label: [4(KP)][Total for 2015 natural disturbances][Emissions][N2O][kt][Emissions from areas subject to natural disturbances][Natural disturbances][Geographic location][no option][Afforestation and Reforestation]
definition: [4(KP)][Total for 2015 natural disturbances][Emissions][N2O][kt][Emissions from areas subject to natural disturbances][Natural disturbances][Geographic location][no option][Afforestation and Reforestation]
status: valid
status modified: 2017-02-13
accepted date: 2017-02-13
in scheme: emissions_variables_MMR

[4(KP)][Total for 2015 natural disturbances][Emissions][N2O][kt][Emissions from areas subject to natural disturbances][Natural disturbances][Geographic location][no option][Forest Management]
type: Concept
definition: [4(KP)][Total for 2015 natural disturbances][Emissions][N2O][kt][Emissions from areas subject to natural disturbances][Natural disturbances][Geographic location][no option][Forest Management]
status: valid
status modified: 2017-02-13
accepted date: 2017-02-13
in scheme: emissions_variables_MMR

http://dd.eionet.europa.eu/vocabulary/ghg/emissions_variables_MMR/FC8820EA-A556-4ED5-B0B9-8F63AC980E4B
type: Concept
preferred label: [4(KP)][Total for 2016 natural disturbances][Emissions][CH4][kt][Emissions from areas subject to natural disturbances][Natural disturbances][Geographic location][no option][Afforestation and Reforestation]
definition: [4(KP)][Total for 2016 natural disturbances][Emissions][CH4][kt][Emissions from areas subject to natural disturbances][Natural disturbances][Geographic location][no option][Afforestation and Reforestation]
status: valid
status modified: 2017-02-13
accepted date: 2017-02-13
in scheme: emissions_variables_MMR

[4(KP)][Total for 2016 natural disturbances][Emissions][CH4][kt][Emissions from areas subject to natural disturbances][Natural disturbances][Geographic location][no option][Forest Management]
type: Concept
definition: [4(KP)][Total for 2016 natural disturbances][Emissions][CH4][kt][Emissions from areas subject to natural disturbances][Natural disturbances][Geographic location][no option][Forest Management]
status: valid
status modified: 2017-02-13
accepted date: 2017-02-13
in scheme: emissions_variables_MMR

http://dd.eionet.europa.eu/vocabulary/ghg/emissions_variables_MMR/76F8BAB3-C909-469E-8525-03B66086B427
type: Concept
preferred label: [4(KP)][Total for 2016 natural disturbances][Emissions][CO2][kt C][Emissions from areas subject to natural disturbances][Natural disturbances][Geographic location][no option][Afforestation and Reforestation]
definition: [4(KP)][Total for 2016 natural disturbances][Emissions][CO2][kt C][Emissions from areas subject to natural disturbances][Natural disturbances][Geographic location][no option][Afforestation and Reforestation]
status: valid
status modified: 2017-02-13
accepted date: 2017-02-13
in scheme: emissions_variables_MMR

[4(KP)][Total for 2016 natural disturbances][Emissions][CO2][kt C][Emissions from areas subject to natural disturbances][Natural disturbances][Geographic location][no option][Forest Management]
type: Concept
definition: [4(KP)][Total for 2016 natural disturbances][Emissions][CO2][kt C][Emissions from areas subject to natural disturbances][Natural disturbances][Geographic location][no option][Forest Management]
status: valid
status modified: 2017-02-13
accepted date: 2017-02-13
in scheme: emissions_variables_MMR

http://dd.eionet.europa.eu/vocabulary/ghg/emissions_variables_MMR/58D1BDA2-2C16-4925-B8D9-7058DE2C5D11
type: Concept
preferred label: [4(KP)][Total for 2016 natural disturbances][Emissions][N2O][kt][Emissions from areas subject to natural disturbances][Natural disturbances][Geographic location][no option][Afforestation and Reforestation]
definition: [4(KP)][Total for 2016 natural disturbances][Emissions][N2O][kt][Emissions from areas subject to natural disturbances][Natural disturbances][Geographic location][no option][Afforestation and Reforestation]
status: valid
status modified: 2017-02-13
accepted date: 2017-02-13
in scheme: emissions_variables_MMR

[4(KP)][Total for 2016 natural disturbances][Emissions][N2O][kt][Emissions from areas subject to natural disturbances][Natural disturbances][Geographic location][no option][Forest Management]
type: Concept
definition: [4(KP)][Total for 2016 natural disturbances][Emissions][N2O][kt][Emissions from areas subject to natural disturbances][Natural disturbances][Geographic location][no option][Forest Management]
status: valid
status modified: 2017-02-13
accepted date: 2017-02-13
in scheme: emissions_variables_MMR

http://dd.eionet.europa.eu/vocabulary/ghg/emissions_variables_MMR/B8E61A80-78B6-4E7B-98ED-69ED8E8EB115
type: Concept
preferred label: [4(KP)][Total for 2017 natural disturbances][Emissions][CH4][kt][Emissions from areas subject to natural disturbances][Natural disturbances][Geographic location][no option][Afforestation and Reforestation]
definition: [4(KP)][Total for 2017 natural disturbances][Emissions][CH4][kt][Emissions from areas subject to natural disturbances][Natural disturbances][Geographic location][no option][Afforestation and Reforestation]
status: valid
status modified: 2017-02-13
accepted date: 2017-02-13
in scheme: emissions_variables_MMR

[4(KP)][Total for 2017 natural disturbances][Emissions][CH4][kt][Emissions from areas subject to natural disturbances][Natural disturbances][Geographic location][no option][Forest Management]
type: Concept
definition: [4(KP)][Total for 2017 natural disturbances][Emissions][CH4][kt][Emissions from areas subject to natural disturbances][Natural disturbances][Geographic location][no option][Forest Management]
status: valid
status modified: 2017-02-13
accepted date: 2017-02-13
in scheme: emissions_variables_MMR

http://dd.eionet.europa.eu/vocabulary/ghg/emissions_variables_MMR/B15138A0-40AD-4E30-B24B-826FDDE3C302
type: Concept
preferred label: [4(KP)][Total for 2017 natural disturbances][Emissions][CO2][kt C][Emissions from areas subject to natural disturbances][Natural disturbances][Geographic location][no option][Afforestation and Reforestation]
definition: [4(KP)][Total for 2017 natural disturbances][Emissions][CO2][kt C][Emissions from areas subject to natural disturbances][Natural disturbances][Geographic location][no option][Afforestation and Reforestation]
status: valid
status modified: 2017-02-13
accepted date: 2017-02-13
in scheme: emissions_variables_MMR

[4(KP)][Total for 2017 natural disturbances][Emissions][CO2][kt C][Emissions from areas subject to natural disturbances][Natural disturbances][Geographic location][no option][Forest Management]
type: Concept
definition: [4(KP)][Total for 2017 natural disturbances][Emissions][CO2][kt C][Emissions from areas subject to natural disturbances][Natural disturbances][Geographic location][no option][Forest Management]
status: valid
status modified: 2017-02-13
accepted date: 2017-02-13
in scheme: emissions_variables_MMR

http://dd.eionet.europa.eu/vocabulary/ghg/emissions_variables_MMR/C34DA62F-EE7D-4D1D-A8A6-60ECBF527090
type: Concept
preferred label: [4(KP)][Total for 2017 natural disturbances][Emissions][N2O][kt][Emissions from areas subject to natural disturbances][Natural disturbances][Geographic location][no option][Afforestation and Reforestation]
definition: [4(KP)][Total for 2017 natural disturbances][Emissions][N2O][kt][Emissions from areas subject to natural disturbances][Natural disturbances][Geographic location][no option][Afforestation and Reforestation]
status: valid
status modified: 2017-02-13
accepted date: 2017-02-13
in scheme: emissions_variables_MMR

[4(KP)][Total for 2017 natural disturbances][Emissions][N2O][kt][Emissions from areas subject to natural disturbances][Natural disturbances][Geographic location][no option][Forest Management]
type: Concept
definition: [4(KP)][Total for 2017 natural disturbances][Emissions][N2O][kt][Emissions from areas subject to natural disturbances][Natural disturbances][Geographic location][no option][Forest Management]
status: valid
status modified: 2017-02-13
accepted date: 2017-02-13
in scheme: emissions_variables_MMR

http://dd.eionet.europa.eu/vocabulary/ghg/emissions_variables_MMR/59A14131-D65F-4F0F-96F3-EB63CDB3F089
type: Concept
preferred label: [4(KP)][Total for 2018 natural disturbances][Emissions][CH4][kt][Emissions from areas subject to natural disturbances][Natural disturbances][Geographic location][no option][Afforestation and Reforestation]
definition: [4(KP)][Total for 2018 natural disturbances][Emissions][CH4][kt][Emissions from areas subject to natural disturbances][Natural disturbances][Geographic location][no option][Afforestation and Reforestation]
status: valid
status modified: 2017-02-13
accepted date: 2017-02-13
in scheme: emissions_variables_MMR

[4(KP)][Total for 2018 natural disturbances][Emissions][CH4][kt][Emissions from areas subject to natural disturbances][Natural disturbances][Geographic location][no option][Forest Management]
type: Concept
definition: [4(KP)][Total for 2018 natural disturbances][Emissions][CH4][kt][Emissions from areas subject to natural disturbances][Natural disturbances][Geographic location][no option][Forest Management]
status: valid
status modified: 2017-02-13
accepted date: 2017-02-13
in scheme: emissions_variables_MMR

http://dd.eionet.europa.eu/vocabulary/ghg/emissions_variables_MMR/4F252569-2BD4-423B-B5D2-90CD72FD22CF
type: Concept
preferred label: [4(KP)][Total for 2018 natural disturbances][Emissions][CO2][kt C][Emissions from areas subject to natural disturbances][Natural disturbances][Geographic location][no option][Afforestation and Reforestation]
definition: [4(KP)][Total for 2018 natural disturbances][Emissions][CO2][kt C][Emissions from areas subject to natural disturbances][Natural disturbances][Geographic location][no option][Afforestation and Reforestation]
status: valid
status modified: 2017-02-13
accepted date: 2017-02-13
in scheme: emissions_variables_MMR

[4(KP)][Total for 2018 natural disturbances][Emissions][CO2][kt C][Emissions from areas subject to natural disturbances][Natural disturbances][Geographic location][no option][Forest Management]
type: Concept
definition: [4(KP)][Total for 2018 natural disturbances][Emissions][CO2][kt C][Emissions from areas subject to natural disturbances][Natural disturbances][Geographic location][no option][Forest Management]
status: valid
status modified: 2017-02-13
accepted date: 2017-02-13
in scheme: emissions_variables_MMR

http://dd.eionet.europa.eu/vocabulary/ghg/emissions_variables_MMR/00F233B1-7BAA-44D0-A83B-BF0577FD47E9
type: Concept
preferred label: [4(KP)][Total for 2018 natural disturbances][Emissions][N2O][kt][Emissions from areas subject to natural disturbances][Natural disturbances][Geographic location][no option][Afforestation and Reforestation]
definition: [4(KP)][Total for 2018 natural disturbances][Emissions][N2O][kt][Emissions from areas subject to natural disturbances][Natural disturbances][Geographic location][no option][Afforestation and Reforestation]
status: valid
status modified: 2017-02-13
accepted date: 2017-02-13
in scheme: emissions_variables_MMR

[4(KP)][Total for 2018 natural disturbances][Emissions][N2O][kt][Emissions from areas subject to natural disturbances][Natural disturbances][Geographic location][no option][Forest Management]
type: Concept
definition: [4(KP)][Total for 2018 natural disturbances][Emissions][N2O][kt][Emissions from areas subject to natural disturbances][Natural disturbances][Geographic location][no option][Forest Management]
status: valid
status modified: 2017-02-13
accepted date: 2017-02-13
in scheme: emissions_variables_MMR

http://dd.eionet.europa.eu/vocabulary/ghg/emissions_variables_MMR/BD006934-0702-4A8C-A3A9-80F1850275D6
type: Concept
preferred label: [4(KP)][Total for 2019 natural disturbances][Emissions][CH4][kt][Emissions from areas subject to natural disturbances][Natural disturbances][Geographic location][no option][Afforestation and Reforestation]
definition: [4(KP)][Total for 2019 natural disturbances][Emissions][CH4][kt][Emissions from areas subject to natural disturbances][Natural disturbances][Geographic location][no option][Afforestation and Reforestation]
status: valid
status modified: 2017-02-13
accepted date: 2017-02-13
in scheme: emissions_variables_MMR

[4(KP)][Total for 2019 natural disturbances][Emissions][CH4][kt][Emissions from areas subject to natural disturbances][Natural disturbances][Geographic location][no option][Forest Management]
type: Concept
definition: [4(KP)][Total for 2019 natural disturbances][Emissions][CH4][kt][Emissions from areas subject to natural disturbances][Natural disturbances][Geographic location][no option][Forest Management]
status: valid
status modified: 2017-02-13
accepted date: 2017-02-13
in scheme: emissions_variables_MMR

http://dd.eionet.europa.eu/vocabulary/ghg/emissions_variables_MMR/9004762E-94CB-45AD-BCB7-090AFFBD734D
type: Concept
preferred label: [4(KP)][Total for 2019 natural disturbances][Emissions][CO2][kt C][Emissions from areas subject to natural disturbances][Natural disturbances][Geographic location][no option][Afforestation and Reforestation]
definition: [4(KP)][Total for 2019 natural disturbances][Emissions][CO2][kt C][Emissions from areas subject to natural disturbances][Natural disturbances][Geographic location][no option][Afforestation and Reforestation]
status: valid
status modified: 2017-02-13
accepted date: 2017-02-13
in scheme: emissions_variables_MMR

[4(KP)][Total for 2019 natural disturbances][Emissions][CO2][kt C][Emissions from areas subject to natural disturbances][Natural disturbances][Geographic location][no option][Forest Management]
type: Concept
definition: [4(KP)][Total for 2019 natural disturbances][Emissions][CO2][kt C][Emissions from areas subject to natural disturbances][Natural disturbances][Geographic location][no option][Forest Management]
status: valid
status modified: 2017-02-13
accepted date: 2017-02-13
in scheme: emissions_variables_MMR

http://dd.eionet.europa.eu/vocabulary/ghg/emissions_variables_MMR/6D4525F3-267C-4C4A-A6FA-5DCBBACB25F3
type: Concept
preferred label: [4(KP)][Total for 2019 natural disturbances][Emissions][N2O][kt][Emissions from areas subject to natural disturbances][Natural disturbances][Geographic location][no option][Afforestation and Reforestation]
definition: [4(KP)][Total for 2019 natural disturbances][Emissions][N2O][kt][Emissions from areas subject to natural disturbances][Natural disturbances][Geographic location][no option][Afforestation and Reforestation]
status: valid
status modified: 2017-02-13
accepted date: 2017-02-13
in scheme: emissions_variables_MMR

[4(KP)][Total for 2019 natural disturbances][Emissions][N2O][kt][Emissions from areas subject to natural disturbances][Natural disturbances][Geographic location][no option][Forest Management]
type: Concept
definition: [4(KP)][Total for 2019 natural disturbances][Emissions][N2O][kt][Emissions from areas subject to natural disturbances][Natural disturbances][Geographic location][no option][Forest Management]
status: valid
status modified: 2017-02-13
accepted date: 2017-02-13
in scheme: emissions_variables_MMR

http://dd.eionet.europa.eu/vocabulary/ghg/emissions_variables_MMR/F5F488D0-4003-4868-8A34-D1D2A6E0BEE6
type: Concept
preferred label: [4(KP)][Total for 2020 natural disturbances][Emissions][CH4][kt][Emissions from areas subject to natural disturbances][Natural disturbances][Geographic location][no option][Afforestation and Reforestation]
definition: [4(KP)][Total for 2020 natural disturbances][Emissions][CH4][kt][Emissions from areas subject to natural disturbances][Natural disturbances][Geographic location][no option][Afforestation and Reforestation]
status: valid
status modified: 2017-02-13
accepted date: 2017-02-13
in scheme: emissions_variables_MMR

[4(KP)][Total for 2020 natural disturbances][Emissions][CH4][kt][Emissions from areas subject to natural disturbances][Natural disturbances][Geographic location][no option][Forest Management]
type: Concept
definition: [4(KP)][Total for 2020 natural disturbances][Emissions][CH4][kt][Emissions from areas subject to natural disturbances][Natural disturbances][Geographic location][no option][Forest Management]
status: valid
status modified: 2017-02-13
accepted date: 2017-02-13
in scheme: emissions_variables_MMR

http://dd.eionet.europa.eu/vocabulary/ghg/emissions_variables_MMR/6905F64A-5F42-42B2-807A-AF972B5F986B
type: Concept
preferred label: [4(KP)][Total for 2020 natural disturbances][Emissions][CO2][kt C][Emissions from areas subject to natural disturbances][Natural disturbances][Geographic location][no option][Afforestation and Reforestation]
definition: [4(KP)][Total for 2020 natural disturbances][Emissions][CO2][kt C][Emissions from areas subject to natural disturbances][Natural disturbances][Geographic location][no option][Afforestation and Reforestation]
status: valid
status modified: 2017-02-13
accepted date: 2017-02-13
in scheme: emissions_variables_MMR

[4(KP)][Total for 2020 natural disturbances][Emissions][CO2][kt C][Emissions from areas subject to natural disturbances][Natural disturbances][Geographic location][no option][Forest Management]
type: Concept
definition: [4(KP)][Total for 2020 natural disturbances][Emissions][CO2][kt C][Emissions from areas subject to natural disturbances][Natural disturbances][Geographic location][no option][Forest Management]
status: valid
status modified: 2017-02-13
accepted date: 2017-02-13
in scheme: emissions_variables_MMR

http://dd.eionet.europa.eu/vocabulary/ghg/emissions_variables_MMR/9A8AA773-D1C2-47BF-8CF2-3F9E8424D656
type: Concept
preferred label: [4(KP)][Total for 2020 natural disturbances][Emissions][N2O][kt][Emissions from areas subject to natural disturbances][Natural disturbances][Geographic location][no option][Afforestation and Reforestation]
definition: [4(KP)][Total for 2020 natural disturbances][Emissions][N2O][kt][Emissions from areas subject to natural disturbances][Natural disturbances][Geographic location][no option][Afforestation and Reforestation]
status: valid
status modified: 2017-02-13
accepted date: 2017-02-13
in scheme: emissions_variables_MMR

[4(KP)][Total for 2020 natural disturbances][Emissions][N2O][kt][Emissions from areas subject to natural disturbances][Natural disturbances][Geographic location][no option][Forest Management]
type: Concept
definition: [4(KP)][Total for 2020 natural disturbances][Emissions][N2O][kt][Emissions from areas subject to natural disturbances][Natural disturbances][Geographic location][no option][Forest Management]
status: valid
status modified: 2017-02-13
accepted date: 2017-02-13
in scheme: emissions_variables_MMR

[4(KP)][Total natural disturbances][Emissions][CH4][kt][Emissions from areas subject to natural disturbances][Natural disturbances][Geographic location][no option][Afforestation and Reforestation]
type: Concept
definition: [4(KP)][Total natural disturbances][Emissions][CH4][kt][Emissions from areas subject to natural disturbances][Natural disturbances][Geographic location][no option][Afforestation and Reforestation]
status: valid
status modified: 2017-02-13
accepted date: 2017-02-13
in scheme: emissions_variables_MMR

[4(KP)][Total natural disturbances][Emissions][CH4][kt][Emissions from areas subject to natural disturbances][Natural disturbances][Geographic location][no option][Forest Management]
type: Concept
definition: [4(KP)][Total natural disturbances][Emissions][CH4][kt][Emissions from areas subject to natural disturbances][Natural disturbances][Geographic location][no option][Forest Management]
status: valid
status modified: 2017-02-13
accepted date: 2017-02-13
in scheme: emissions_variables_MMR

[4(KP)][Total natural disturbances][Emissions][CO2][kt C][Emissions from areas subject to natural disturbances][Natural disturbances][Geographic location][no option][Afforestation and Reforestation]
type: Concept
definition: [4(KP)][Total natural disturbances][Emissions][CO2][kt C][Emissions from areas subject to natural disturbances][Natural disturbances][Geographic location][no option][Afforestation and Reforestation]
status: valid
status modified: 2017-02-13
accepted date: 2017-02-13
in scheme: emissions_variables_MMR

[4(KP)][Total natural disturbances][Emissions][CO2][kt C][Emissions from areas subject to natural disturbances][Natural disturbances][Geographic location][no option][Forest Management]
type: Concept
definition: [4(KP)][Total natural disturbances][Emissions][CO2][kt C][Emissions from areas subject to natural disturbances][Natural disturbances][Geographic location][no option][Forest Management]
status: valid
status modified: 2017-02-13
accepted date: 2017-02-13
in scheme: emissions_variables_MMR

[4(KP)][Total natural disturbances][Emissions][N2O][kt][Emissions from areas subject to natural disturbances][Natural disturbances][Geographic location][no option][Afforestation and Reforestation]
type: Concept
definition: [4(KP)][Total natural disturbances][Emissions][N2O][kt][Emissions from areas subject to natural disturbances][Natural disturbances][Geographic location][no option][Afforestation and Reforestation]
status: valid
status modified: 2017-02-13
accepted date: 2017-02-13
in scheme: emissions_variables_MMR

[4(KP)][Total natural disturbances][Emissions][N2O][kt][Emissions from areas subject to natural disturbances][Natural disturbances][Geographic location][no option][Forest Management]
type: Concept
definition: [4(KP)][Total natural disturbances][Emissions][N2O][kt][Emissions from areas subject to natural disturbances][Natural disturbances][Geographic location][no option][Forest Management]
status: valid
status modified: 2017-02-13
accepted date: 2017-02-13
in scheme: emissions_variables_MMR

[4(KP)][Wildfires][Emissions][CH4][kt][no source][no method][no target][no option][Afforestation and Reforestation]
type: Concept
definition: [4(KP)][Wildfires][Emissions][CH4][kt][no source][no method][no target][no option][Afforestation and Reforestation]
status: valid
status modified: 2017-02-13
accepted date: 2017-02-13
in scheme: emissions_variables_MMR

[4(KP)][Wildfires][Emissions][CH4][kt][no source][no method][no target][no option][Cropland Management]
type: Concept
definition: [4(KP)][Wildfires][Emissions][CH4][kt][no source][no method][no target][no option][Cropland Management]
status: valid
status modified: 2017-02-13
accepted date: 2017-02-13
in scheme: emissions_variables_MMR

[4(KP)][Wildfires][Emissions][CH4][kt][no source][no method][no target][no option][Deforestation]
type: Concept
definition: [4(KP)][Wildfires][Emissions][CH4][kt][no source][no method][no target][no option][Deforestation]
status: valid
status modified: 2017-02-13
accepted date: 2017-02-13
in scheme: emissions_variables_MMR

[4(KP)][Wildfires][Emissions][CH4][kt][no source][no method][no target][no option][Forest Management]
type: Concept
definition: [4(KP)][Wildfires][Emissions][CH4][kt][no source][no method][no target][no option][Forest Management]
status: valid
status modified: 2017-02-13
accepted date: 2017-02-13
in scheme: emissions_variables_MMR

[4(KP)][Wildfires][Emissions][CH4][kt][no source][no method][no target][no option][Grazing Land Management]
type: Concept
definition: [4(KP)][Wildfires][Emissions][CH4][kt][no source][no method][no target][no option][Grazing Land Management]
status: valid
status modified: 2017-02-13
accepted date: 2017-02-13
in scheme: emissions_variables_MMR

[4(KP)][Wildfires][Emissions][CH4][kt][no source][no method][no target][no option][Revegetation]
type: Concept
definition: [4(KP)][Wildfires][Emissions][CH4][kt][no source][no method][no target][no option][Revegetation]
status: valid
status modified: 2017-02-13
accepted date: 2017-02-13
in scheme: emissions_variables_MMR

[4(KP)][Wildfires][Emissions][CH4][kt][no source][no method][no target][no option][Wetland Drainage and Rewetting]
type: Concept
definition: [4(KP)][Wildfires][Emissions][CH4][kt][no source][no method][no target][no option][Wetland Drainage and Rewetting]
status: valid
status modified: 2017-02-13
accepted date: 2017-02-13
in scheme: emissions_variables_MMR

[4(KP)][Wildfires][Emissions][CO2][kt][no source][no method][no target][no option][Afforestation and Reforestation]
type: Concept
definition: [4(KP)][Wildfires][Emissions][CO2][kt][no source][no method][no target][no option][Afforestation and Reforestation]
status: valid
status modified: 2017-02-13
accepted date: 2017-02-13
in scheme: emissions_variables_MMR

[4(KP)][Wildfires][Emissions][CO2][kt][no source][no method][no target][no option][Cropland Management]
type: Concept
definition: [4(KP)][Wildfires][Emissions][CO2][kt][no source][no method][no target][no option][Cropland Management]
status: valid
status modified: 2017-02-13
accepted date: 2017-02-13
in scheme: emissions_variables_MMR

[4(KP)][Wildfires][Emissions][CO2][kt][no source][no method][no target][no option][Deforestation]
type: Concept
definition: [4(KP)][Wildfires][Emissions][CO2][kt][no source][no method][no target][no option][Deforestation]
status: valid
status modified: 2017-02-13
accepted date: 2017-02-13
in scheme: emissions_variables_MMR

[4(KP)][Wildfires][Emissions][CO2][kt][no source][no method][no target][no option][Forest Management]
type: Concept
definition: [4(KP)][Wildfires][Emissions][CO2][kt][no source][no method][no target][no option][Forest Management]
status: valid
status modified: 2017-02-13
accepted date: 2017-02-13
in scheme: emissions_variables_MMR

[4(KP)][Wildfires][Emissions][CO2][kt][no source][no method][no target][no option][Grazing Land Management]
type: Concept
definition: [4(KP)][Wildfires][Emissions][CO2][kt][no source][no method][no target][no option][Grazing Land Management]
status: valid
status modified: 2017-02-13
accepted date: 2017-02-13
in scheme: emissions_variables_MMR

[4(KP)][Wildfires][Emissions][CO2][kt][no source][no method][no target][no option][Revegetation]
type: Concept
definition: [4(KP)][Wildfires][Emissions][CO2][kt][no source][no method][no target][no option][Revegetation]
status: valid
status modified: 2017-02-13
accepted date: 2017-02-13
in scheme: emissions_variables_MMR

[4(KP)][Wildfires][Emissions][CO2][kt][no source][no method][no target][no option][Wetland Drainage and Rewetting]
type: Concept
definition: [4(KP)][Wildfires][Emissions][CO2][kt][no source][no method][no target][no option][Wetland Drainage and Rewetting]
status: valid
status modified: 2017-02-13
accepted date: 2017-02-13
in scheme: emissions_variables_MMR

[4(KP)][Wildfires][Emissions][N2O][kt][no source][no method][no target][no option][Afforestation and Reforestation]
type: Concept
definition: [4(KP)][Wildfires][Emissions][N2O][kt][no source][no method][no target][no option][Afforestation and Reforestation]
status: valid
status modified: 2017-02-13
accepted date: 2017-02-13
in scheme: emissions_variables_MMR

[4(KP)][Wildfires][Emissions][N2O][kt][no source][no method][no target][no option][Cropland Management]
type: Concept
definition: [4(KP)][Wildfires][Emissions][N2O][kt][no source][no method][no target][no option][Cropland Management]
status: valid
status modified: 2017-02-13
accepted date: 2017-02-13
in scheme: emissions_variables_MMR

[4(KP)][Wildfires][Emissions][N2O][kt][no source][no method][no target][no option][Deforestation]
type: Concept
definition: [4(KP)][Wildfires][Emissions][N2O][kt][no source][no method][no target][no option][Deforestation]
status: valid
status modified: 2017-02-13
accepted date: 2017-02-13
in scheme: emissions_variables_MMR

[4(KP)][Wildfires][Emissions][N2O][kt][no source][no method][no target][no option][Forest Management]
type: Concept
definition: [4(KP)][Wildfires][Emissions][N2O][kt][no source][no method][no target][no option][Forest Management]
status: valid
status modified: 2017-02-13
accepted date: 2017-02-13
in scheme: emissions_variables_MMR

[4(KP)][Wildfires][Emissions][N2O][kt][no source][no method][no target][no option][Grazing Land Management]
type: Concept
definition: [4(KP)][Wildfires][Emissions][N2O][kt][no source][no method][no target][no option][Grazing Land Management]
status: valid
status modified: 2017-02-13
accepted date: 2017-02-13
in scheme: emissions_variables_MMR

[4(KP)][Wildfires][Emissions][N2O][kt][no source][no method][no target][no option][Revegetation]
type: Concept
definition: [4(KP)][Wildfires][Emissions][N2O][kt][no source][no method][no target][no option][Revegetation]
status: valid
status modified: 2017-02-13
accepted date: 2017-02-13
in scheme: emissions_variables_MMR

[4(KP)][Wildfires][Emissions][N2O][kt][no source][no method][no target][no option][Wetland Drainage and Rewetting]
type: Concept
definition: [4(KP)][Wildfires][Emissions][N2O][kt][no source][no method][no target][no option][Wetland Drainage and Rewetting]
status: valid
status modified: 2017-02-13
accepted date: 2017-02-13
in scheme: emissions_variables_MMR

[Agricultural Soils][Farming][Emissions][N2O][kt][no source][no method][no target][no option][Atmospheric Deposition]
type: Concept
definition: [Agricultural Soils][Farming][Emissions][N2O][kt][no source][no method][no target][no option][Atmospheric Deposition]
status: valid
status modified: 2017-02-13
accepted date: 2017-02-13
in scheme: emissions_variables_MMR

[Agricultural Soils][Farming][Emissions][N2O][kt][no source][no method][no target][no option][Indirect N2O Emissions From Managed Soils]
type: Concept
definition: [Agricultural Soils][Farming][Emissions][N2O][kt][no source][no method][no target][no option][Indirect N2O Emissions From Managed Soils]
status: valid
status modified: 2017-02-13
accepted date: 2017-02-13
in scheme: emissions_variables_MMR

[Agricultural Soils][Farming][Emissions][N2O][kt][no source][no method][no target][no option][Nitrogen Leaching and Run-off]
type: Concept
definition: [Agricultural Soils][Farming][Emissions][N2O][kt][no source][no method][no target][no option][Nitrogen Leaching and Run-off]
status: valid
status modified: 2017-02-13
accepted date: 2017-02-13
in scheme: emissions_variables_MMR

[Cropland][Biomass Burning][Emissions][CH4][kt][Land][no method][no target][no option][no type]
type: Concept
definition: [Cropland][Biomass Burning][Emissions][CH4][kt][Land][no method][no target][no option][no type]
status: valid
status modified: 2017-02-13
accepted date: 2017-02-13
in scheme: emissions_variables_MMR

[Cropland][Biomass Burning][Emissions][CO2][kt][Land][no method][no target][no option][no type]
type: Concept
definition: [Cropland][Biomass Burning][Emissions][CO2][kt][Land][no method][no target][no option][no type]
status: valid
status modified: 2017-02-13
accepted date: 2017-02-13
in scheme: emissions_variables_MMR

[Cropland][Biomass Burning][Emissions][N2O][kt][Land][no method][no target][no option][no type]
type: Concept
definition: [Cropland][Biomass Burning][Emissions][N2O][kt][Land][no method][no target][no option][no type]
status: valid
status modified: 2017-02-13
accepted date: 2017-02-13
in scheme: emissions_variables_MMR

[Cropland][Carbon stock change][Emissions][CO2][][Cropland][no method][Cropland][no option][no type]
type: Concept
definition: [Cropland][Carbon stock change][Emissions][CO2][][Cropland][no method][Cropland][no option][no type]
status: valid
status modified: 2017-02-13
accepted date: 2017-02-13
in scheme: emissions_variables_MMR

[Cropland][Carbon stock change][Emissions][CO2][][Land][no method][Cropland][no option][no type]
type: Concept
definition: [Cropland][Carbon stock change][Emissions][CO2][][Land][no method][Cropland][no option][no type]
status: valid
status modified: 2017-02-13
accepted date: 2017-02-13
in scheme: emissions_variables_MMR

[Cropland][Direct N2O Emissions from N Mineralization/Immobilization][Emissions][N2O][kt][Land][no method][no target][no option][no type]
type: Concept
definition: [Cropland][Direct N2O Emissions from N Mineralization/Immobilization][Emissions][N2O][kt][Land][no method][no target][no option][no type]
status: valid
status modified: 2017-02-13
accepted date: 2017-02-13
in scheme: emissions_variables_MMR

[Cropland][Drained Organic Soils][Emissions][CH4][kt][Land][no method][Cropland][no option][Organic soils]
type: Concept
definition: [Cropland][Drained Organic Soils][Emissions][CH4][kt][Land][no method][Cropland][no option][Organic soils]
status: valid
status modified: 2017-02-13
accepted date: 2017-02-13
in scheme: emissions_variables_MMR

[Cropland][Drained Organic Soils][Emissions][CO2][kt][Land][no method][Cropland][no option][Organic soils]
type: Concept
definition: [Cropland][Drained Organic Soils][Emissions][CO2][kt][Land][no method][Cropland][no option][Organic soils]
status: valid
status modified: 2017-02-13
accepted date: 2017-02-13
in scheme: emissions_variables_MMR

[Cropland][Emissions and removals from drainage and rewetting and other management of organic and mineral soils][Emissions][CH4][kt][Land][no method][Cropland][no option][no type]
type: Concept
definition: [Cropland][Emissions and removals from drainage and rewetting and other management of organic and mineral soils][Emissions][CH4][kt][Land][no method][Cropland][no option][no type]
status: valid
status modified: 2017-02-13
accepted date: 2017-02-13
in scheme: emissions_variables_MMR

[Cropland][Emissions and removals from drainage and rewetting and other management of organic and mineral soils][Emissions][CH4][kt][Land][no method][no target][no option][no type]
type: Concept
definition: [Cropland][Emissions and removals from drainage and rewetting and other management of organic and mineral soils][Emissions][CH4][kt][Land][no method][no target][no option][no type]
status: valid
status modified: 2017-02-13
accepted date: 2017-02-13
in scheme: emissions_variables_MMR

[Cropland][Emissions and removals from drainage and rewetting and other management of organic and mineral soils][Emissions][CH4][kt][no source][no method][Cropland][no option][no type]
type: Concept
definition: [Cropland][Emissions and removals from drainage and rewetting and other management of organic and mineral soils][Emissions][CH4][kt][no source][no method][Cropland][no option][no type]
status: valid
status modified: 2017-02-13
accepted date: 2017-02-13
in scheme: emissions_variables_MMR

[Cropland][Emissions and removals from drainage and rewetting and other management of organic and mineral soils][Emissions][CO2][kt][Land][no method][Cropland][no option][no type]
type: Concept
definition: [Cropland][Emissions and removals from drainage and rewetting and other management of organic and mineral soils][Emissions][CO2][kt][Land][no method][Cropland][no option][no type]
status: valid
status modified: 2017-02-13
accepted date: 2017-02-13
in scheme: emissions_variables_MMR

[Cropland][Emissions and removals from drainage and rewetting and other management of organic and mineral soils][Emissions][CO2][kt][Land][no method][no target][no option][no type]
type: Concept
definition: [Cropland][Emissions and removals from drainage and rewetting and other management of organic and mineral soils][Emissions][CO2][kt][Land][no method][no target][no option][no type]
status: valid
status modified: 2017-02-13
accepted date: 2017-02-13
in scheme: emissions_variables_MMR

[Cropland][Emissions and removals from drainage and rewetting and other management of organic and mineral soils][Emissions][CO2][kt][no source][no method][Cropland][no option][no type]
type: Concept
definition: [Cropland][Emissions and removals from drainage and rewetting and other management of organic and mineral soils][Emissions][CO2][kt][no source][no method][Cropland][no option][no type]
status: valid
status modified: 2017-02-13
accepted date: 2017-02-13
in scheme: emissions_variables_MMR

[Cropland][Emissions and removals from drainage and rewetting and other management of organic and mineral soils][Emissions][N2O][kt][Land][no method][Cropland][no option][no type]
type: Concept
definition: [Cropland][Emissions and removals from drainage and rewetting and other management of organic and mineral soils][Emissions][N2O][kt][Land][no method][Cropland][no option][no type]
status: valid
status modified: 2017-02-13
accepted date: 2017-02-13
in scheme: emissions_variables_MMR

[Cropland][Emissions and removals from drainage and rewetting and other management of organic and mineral soils][Emissions][N2O][kt][Land][no method][no target][no option][no type]
type: Concept
definition: [Cropland][Emissions and removals from drainage and rewetting and other management of organic and mineral soils][Emissions][N2O][kt][Land][no method][no target][no option][no type]
status: valid
status modified: 2017-02-13
accepted date: 2017-02-13
in scheme: emissions_variables_MMR

[Cropland][Emissions and removals from drainage and rewetting and other management of organic and mineral soils][Emissions][N2O][kt][no source][no method][Cropland][no option][no type]
type: Concept
definition: [Cropland][Emissions and removals from drainage and rewetting and other management of organic and mineral soils][Emissions][N2O][kt][no source][no method][Cropland][no option][no type]
status: valid
status modified: 2017-02-13
accepted date: 2017-02-13
in scheme: emissions_variables_MMR

[Cropland][Other Mineral Soils][Emissions][CH4][kt][Land][no method][Cropland][no option][Mineral soils]
type: Concept
definition: [Cropland][Other Mineral Soils][Emissions][CH4][kt][Land][no method][Cropland][no option][Mineral soils]
status: valid
status modified: 2017-02-13
accepted date: 2017-02-13
in scheme: emissions_variables_MMR

[Cropland][Other Mineral Soils][Emissions][CO2][kt][Land][no method][Cropland][no option][Mineral soils]
type: Concept
definition: [Cropland][Other Mineral Soils][Emissions][CO2][kt][Land][no method][Cropland][no option][Mineral soils]
status: valid
status modified: 2017-02-13
accepted date: 2017-02-13
in scheme: emissions_variables_MMR

[Cropland][Other Mineral Soils][Emissions][N2O][kt][Land][no method][Cropland][no option][Mineral soils]
type: Concept
definition: [Cropland][Other Mineral Soils][Emissions][N2O][kt][Land][no method][Cropland][no option][Mineral soils]
status: valid
status modified: 2017-02-13
accepted date: 2017-02-13
in scheme: emissions_variables_MMR

[Cropland][Other Organic Soils][Emissions][CH4][kt][Land][no method][Cropland][no option][Organic soils]
type: Concept
definition: [Cropland][Other Organic Soils][Emissions][CH4][kt][Land][no method][Cropland][no option][Organic soils]
status: valid
status modified: 2017-02-13
accepted date: 2017-02-13
in scheme: emissions_variables_MMR

[Cropland][Other Organic Soils][Emissions][CO2][kt][Land][no method][Cropland][no option][Organic soils]
type: Concept
definition: [Cropland][Other Organic Soils][Emissions][CO2][kt][Land][no method][Cropland][no option][Organic soils]
status: valid
status modified: 2017-02-13
accepted date: 2017-02-13
in scheme: emissions_variables_MMR

[Cropland][Rewetted Mineral Soils][Emissions][CH4][kt][Land][no method][Cropland][no option][Mineral soils]
type: Concept
definition: [Cropland][Rewetted Mineral Soils][Emissions][CH4][kt][Land][no method][Cropland][no option][Mineral soils]
status: valid
status modified: 2017-02-13
accepted date: 2017-02-13
in scheme: emissions_variables_MMR

[Cropland][Rewetted Mineral Soils][Emissions][CO2][kt][Land][no method][Cropland][no option][Mineral soils]
type: Concept
definition: [Cropland][Rewetted Mineral Soils][Emissions][CO2][kt][Land][no method][Cropland][no option][Mineral soils]
status: valid
status modified: 2017-02-13
accepted date: 2017-02-13
in scheme: emissions_variables_MMR

[Cropland][Rewetted Organic Soils][Emissions][CH4][kt][Land][no method][Cropland][no option][Organic soils]
type: Concept
definition: [Cropland][Rewetted Organic Soils][Emissions][CH4][kt][Land][no method][Cropland][no option][Organic soils]
status: valid
status modified: 2017-02-13
accepted date: 2017-02-13
in scheme: emissions_variables_MMR

[Cropland][Rewetted Organic Soils][Emissions][CO2][kt][Land][no method][Cropland][no option][Organic soils]
type: Concept
definition: [Cropland][Rewetted Organic Soils][Emissions][CO2][kt][Land][no method][Cropland][no option][Organic soils]
status: valid
status modified: 2017-02-13
accepted date: 2017-02-13
in scheme: emissions_variables_MMR

[Forest Land][Carbon stock change][Emissions][CO2][][Forest Land][no method][Forest Land][no option][no type]
type: Concept
definition: [Forest Land][Carbon stock change][Emissions][CO2][][Forest Land][no method][Forest Land][no option][no type]
status: valid
status modified: 2017-02-13
accepted date: 2017-02-13
in scheme: emissions_variables_MMR

[Forest Land][Carbon stock change][Emissions][CO2][][Land][no method][Forest Land][no option][no type]
type: Concept
definition: [Forest Land][Carbon stock change][Emissions][CO2][][Land][no method][Forest Land][no option][no type]
status: valid
status modified: 2017-02-13
accepted date: 2017-02-13
in scheme: emissions_variables_MMR

[Forest Land][Drained Organic Soils][Emissions][CH4][kt][Land][no method][Forest Land][no option][Organic soils]
type: Concept
definition: [Forest Land][Drained Organic Soils][Emissions][CH4][kt][Land][no method][Forest Land][no option][Organic soils]
status: valid
status modified: 2017-02-13
accepted date: 2017-02-13
in scheme: emissions_variables_MMR

[Forest Land][Drained Organic Soils][Emissions][CO2][kt][Land][no method][Forest Land][no option][Organic soils]
type: Concept
definition: [Forest Land][Drained Organic Soils][Emissions][CO2][kt][Land][no method][Forest Land][no option][Organic soils]
status: valid
status modified: 2017-02-13
accepted date: 2017-02-13
in scheme: emissions_variables_MMR

[Forest Land][Drained Organic Soils][Emissions][N2O][kt][Land][no method][Forest Land][no option][Organic soils]
type: Concept
definition: [Forest Land][Drained Organic Soils][Emissions][N2O][kt][Land][no method][Forest Land][no option][Organic soils]
status: valid
status modified: 2017-02-13
accepted date: 2017-02-13
in scheme: emissions_variables_MMR

[Forest Land][Emissions and removals from drainage and rewetting and other management of organic and mineral soils][Emissions][CH4][kt][Land][no method][Forest Land][no option][no type]
type: Concept
definition: [Forest Land][Emissions and removals from drainage and rewetting and other management of organic and mineral soils][Emissions][CH4][kt][Land][no method][Forest Land][no option][no type]
status: valid
status modified: 2017-02-13
accepted date: 2017-02-13
in scheme: emissions_variables_MMR

[Forest Land][Emissions and removals from drainage and rewetting and other management of organic and mineral soils][Emissions][CH4][kt][Land][no method][no target][no option][no type]
type: Concept
definition: [Forest Land][Emissions and removals from drainage and rewetting and other management of organic and mineral soils][Emissions][CH4][kt][Land][no method][no target][no option][no type]
status: valid
status modified: 2017-02-13
accepted date: 2017-02-13
in scheme: emissions_variables_MMR

[Forest Land][Emissions and removals from drainage and rewetting and other management of organic and mineral soils][Emissions][CO2][kt][Land][no method][Forest Land][no option][no type]
type: Concept
definition: [Forest Land][Emissions and removals from drainage and rewetting and other management of organic and mineral soils][Emissions][CO2][kt][Land][no method][Forest Land][no option][no type]
status: valid
status modified: 2017-02-13
accepted date: 2017-02-13
in scheme: emissions_variables_MMR

[Forest Land][Emissions and removals from drainage and rewetting and other management of organic and mineral soils][Emissions][CO2][kt][Land][no method][no target][no option][no type]
type: Concept
definition: [Forest Land][Emissions and removals from drainage and rewetting and other management of organic and mineral soils][Emissions][CO2][kt][Land][no method][no target][no option][no type]
status: valid
status modified: 2017-02-13
accepted date: 2017-02-13
in scheme: emissions_variables_MMR

[Forest Land][Emissions and removals from drainage and rewetting and other management of organic and mineral soils][Emissions][N2O][kt][Land][no method][Forest Land][no option][no type]
type: Concept
definition: [Forest Land][Emissions and removals from drainage and rewetting and other management of organic and mineral soils][Emissions][N2O][kt][Land][no method][Forest Land][no option][no type]
status: valid
status modified: 2017-02-13
accepted date: 2017-02-13
in scheme: emissions_variables_MMR

[Forest Land][Emissions and removals from drainage and rewetting and other management of organic and mineral soils][Emissions][N2O][kt][Land][no method][no target][no option][no type]
type: Concept
definition: [Forest Land][Emissions and removals from drainage and rewetting and other management of organic and mineral soils][Emissions][N2O][kt][Land][no method][no target][no option][no type]
status: valid
status modified: 2017-02-13
accepted date: 2017-02-13
in scheme: emissions_variables_MMR

[Forest Land][Other Mineral Soils][Emissions][CH4][kt][Land][no method][Forest Land][no option][Mineral soils]
type: Concept
definition: [Forest Land][Other Mineral Soils][Emissions][CH4][kt][Land][no method][Forest Land][no option][Mineral soils]
status: valid
status modified: 2017-02-13
accepted date: 2017-02-13
in scheme: emissions_variables_MMR

[Forest Land][Other Mineral Soils][Emissions][CO2][kt][Land][no method][Forest Land][no option][Mineral soils]
type: Concept
definition: [Forest Land][Other Mineral Soils][Emissions][CO2][kt][Land][no method][Forest Land][no option][Mineral soils]
status: valid
status modified: 2017-02-13
accepted date: 2017-02-13
in scheme: emissions_variables_MMR

[Forest Land][Other Mineral Soils][Emissions][N2O][kt][Land][no method][Forest Land][no option][Mineral soils]
type: Concept
definition: [Forest Land][Other Mineral Soils][Emissions][N2O][kt][Land][no method][Forest Land][no option][Mineral soils]
status: valid
status modified: 2017-02-13
accepted date: 2017-02-13
in scheme: emissions_variables_MMR

[Forest Land][Other Organic Soils][Emissions][CH4][kt][Land][no method][Forest Land][no option][Organic soils]
type: Concept
definition: [Forest Land][Other Organic Soils][Emissions][CH4][kt][Land][no method][Forest Land][no option][Organic soils]
status: valid
status modified: 2017-02-13
accepted date: 2017-02-13
in scheme: emissions_variables_MMR

[Forest Land][Other Organic Soils][Emissions][CO2][kt][Land][no method][Forest Land][no option][Organic soils]
type: Concept
definition: [Forest Land][Other Organic Soils][Emissions][CO2][kt][Land][no method][Forest Land][no option][Organic soils]
status: valid
status modified: 2017-02-13
accepted date: 2017-02-13
in scheme: emissions_variables_MMR

[Forest Land][Other Organic Soils][Emissions][N2O][kt][Land][no method][Forest Land][no option][Organic soils]
type: Concept
definition: [Forest Land][Other Organic Soils][Emissions][N2O][kt][Land][no method][Forest Land][no option][Organic soils]
status: valid
status modified: 2017-02-13
accepted date: 2017-02-13
in scheme: emissions_variables_MMR

[Forest Land][Rewetted Mineral Soils][Emissions][CH4][kt][Land][no method][Forest Land][no option][Mineral soils]
type: Concept
definition: [Forest Land][Rewetted Mineral Soils][Emissions][CH4][kt][Land][no method][Forest Land][no option][Mineral soils]
status: valid
status modified: 2017-02-13
accepted date: 2017-02-13
in scheme: emissions_variables_MMR

[Forest Land][Rewetted Mineral Soils][Emissions][CO2][kt][Land][no method][Forest Land][no option][Mineral soils]
type: Concept
definition: [Forest Land][Rewetted Mineral Soils][Emissions][CO2][kt][Land][no method][Forest Land][no option][Mineral soils]
status: valid
status modified: 2017-02-13
accepted date: 2017-02-13
in scheme: emissions_variables_MMR

[Forest Land][Rewetted Mineral Soils][Emissions][N2O][kt][Land][no method][Forest Land][no option][Mineral soils]
type: Concept
definition: [Forest Land][Rewetted Mineral Soils][Emissions][N2O][kt][Land][no method][Forest Land][no option][Mineral soils]
status: valid
status modified: 2017-02-13
accepted date: 2017-02-13
in scheme: emissions_variables_MMR

[Forest Land][Rewetted Organic Soils][Emissions][CH4][kt][Land][no method][Forest Land][no option][Organic soils]
type: Concept
definition: [Forest Land][Rewetted Organic Soils][Emissions][CH4][kt][Land][no method][Forest Land][no option][Organic soils]
status: valid
status modified: 2017-02-13
accepted date: 2017-02-13
in scheme: emissions_variables_MMR

[Forest Land][Rewetted Organic Soils][Emissions][CO2][kt][Land][no method][Forest Land][no option][Organic soils]
type: Concept
definition: [Forest Land][Rewetted Organic Soils][Emissions][CO2][kt][Land][no method][Forest Land][no option][Organic soils]
status: valid
status modified: 2017-02-13
accepted date: 2017-02-13
in scheme: emissions_variables_MMR

[Forest Land][Rewetted Organic Soils][Emissions][N2O][kt][Land][no method][Forest Land][no option][Organic soils]
type: Concept
definition: [Forest Land][Rewetted Organic Soils][Emissions][N2O][kt][Land][no method][Forest Land][no option][Organic soils]
status: valid
status modified: 2017-02-13
accepted date: 2017-02-13
in scheme: emissions_variables_MMR

[Fuel Combustion - Reference Approach][Other Fossil Fuels][Emissions][CO2][kt][no source][no method][no target][no option][Sum of 1.AC Other Fossil Fuels]
type: Concept
definition: [Fuel Combustion - Reference Approach][Other Fossil Fuels][Emissions][CO2][kt][no source][no method][no target][no option][Sum of 1.AC Other Fossil Fuels]
status: valid
status modified: 2017-02-13
accepted date: 2017-02-13
in scheme: emissions_variables_MMR

[Grassland][Biomass Burning][Emissions][CH4][kt][Land][no method][no target][no option][no type]
type: Concept
definition: [Grassland][Biomass Burning][Emissions][CH4][kt][Land][no method][no target][no option][no type]
status: valid
status modified: 2017-02-13
accepted date: 2017-02-13
in scheme: emissions_variables_MMR

[Grassland][Biomass Burning][Emissions][CO2][kt][Land][no method][no target][no option][no type]
type: Concept
definition: [Grassland][Biomass Burning][Emissions][CO2][kt][Land][no method][no target][no option][no type]
status: valid
status modified: 2017-02-13
accepted date: 2017-02-13
in scheme: emissions_variables_MMR

[Grassland][Biomass Burning][Emissions][N2O][kt][Land][no method][no target][no option][no type]
type: Concept
definition: [Grassland][Biomass Burning][Emissions][N2O][kt][Land][no method][no target][no option][no type]
status: valid
status modified: 2017-02-13
accepted date: 2017-02-13
in scheme: emissions_variables_MMR

[Grassland][Direct N2O Emissions from N Mineralization/Immobilization][Emissions][N2O][kt][Land][no method][no target][no option][no type]
type: Concept
definition: [Grassland][Direct N2O Emissions from N Mineralization/Immobilization][Emissions][N2O][kt][Land][no method][no target][no option][no type]
status: valid
status modified: 2017-02-13
accepted date: 2017-02-13
in scheme: emissions_variables_MMR

[Grassland][Drained Organic Soils][Emissions][CH4][kt][Land][no method][GrassLand][no option][Organic soils]
type: Concept
definition: [Grassland][Drained Organic Soils][Emissions][CH4][kt][Land][no method][GrassLand][no option][Organic soils]
status: valid
status modified: 2017-02-13
accepted date: 2017-02-13
in scheme: emissions_variables_MMR

[Grassland][Drained Organic Soils][Emissions][CO2][kt][Land][no method][GrassLand][no option][Organic soils]
type: Concept
definition: [Grassland][Drained Organic Soils][Emissions][CO2][kt][Land][no method][GrassLand][no option][Organic soils]
status: valid
status modified: 2017-02-13
accepted date: 2017-02-13
in scheme: emissions_variables_MMR

[Grassland][Emissions and removals from drainage and rewetting and other management of organic and mineral soils][Emissions][CH4][kt][Land][no method][GrassLand][no option][no type]
type: Concept
definition: [Grassland][Emissions and removals from drainage and rewetting and other management of organic and mineral soils][Emissions][CH4][kt][Land][no method][GrassLand][no option][no type]
status: valid
status modified: 2017-02-13
accepted date: 2017-02-13
in scheme: emissions_variables_MMR

[Grassland][Emissions and removals from drainage and rewetting and other management of organic and mineral soils][Emissions][CH4][kt][Land][no method][no target][no option][no type]
type: Concept
definition: [Grassland][Emissions and removals from drainage and rewetting and other management of organic and mineral soils][Emissions][CH4][kt][Land][no method][no target][no option][no type]
status: valid
status modified: 2017-02-13
accepted date: 2017-02-13
in scheme: emissions_variables_MMR

[Grassland][Emissions and removals from drainage and rewetting and other management of organic and mineral soils][Emissions][CH4][kt][no source][no method][GrassLand][no option][no type]
type: Concept
definition: [Grassland][Emissions and removals from drainage and rewetting and other management of organic and mineral soils][Emissions][CH4][kt][no source][no method][GrassLand][no option][no type]
status: valid
status modified: 2017-02-13
accepted date: 2017-02-13
in scheme: emissions_variables_MMR

[Grassland][Emissions and removals from drainage and rewetting and other management of organic and mineral soils][Emissions][CO2][kt][Land][no method][GrassLand][no option][no type]
type: Concept
definition: [Grassland][Emissions and removals from drainage and rewetting and other management of organic and mineral soils][Emissions][CO2][kt][Land][no method][GrassLand][no option][no type]
status: valid
status modified: 2017-02-13
accepted date: 2017-02-13
in scheme: emissions_variables_MMR

[Grassland][Emissions and removals from drainage and rewetting and other management of organic and mineral soils][Emissions][CO2][kt][Land][no method][no target][no option][no type]
type: Concept
definition: [Grassland][Emissions and removals from drainage and rewetting and other management of organic and mineral soils][Emissions][CO2][kt][Land][no method][no target][no option][no type]
status: valid
status modified: 2017-02-13
accepted date: 2017-02-13
in scheme: emissions_variables_MMR

[Grassland][Emissions and removals from drainage and rewetting and other management of organic and mineral soils][Emissions][CO2][kt][no source][no method][GrassLand][no option][no type]
type: Concept
definition: [Grassland][Emissions and removals from drainage and rewetting and other management of organic and mineral soils][Emissions][CO2][kt][no source][no method][GrassLand][no option][no type]
status: valid
status modified: 2017-02-13
accepted date: 2017-02-13
in scheme: emissions_variables_MMR

[Grassland][Emissions and removals from drainage and rewetting and other management of organic and mineral soils][Emissions][N2O][kt][Land][no method][GrassLand][no option][no type]
type: Concept
definition: [Grassland][Emissions and removals from drainage and rewetting and other management of organic and mineral soils][Emissions][N2O][kt][Land][no method][GrassLand][no option][no type]
status: valid
status modified: 2017-02-13
accepted date: 2017-02-13
in scheme: emissions_variables_MMR

[Grassland][Emissions and removals from drainage and rewetting and other management of organic and mineral soils][Emissions][N2O][kt][Land][no method][no target][no option][no type]
type: Concept
definition: [Grassland][Emissions and removals from drainage and rewetting and other management of organic and mineral soils][Emissions][N2O][kt][Land][no method][no target][no option][no type]
status: valid
status modified: 2017-02-13
accepted date: 2017-02-13
in scheme: emissions_variables_MMR

[Grassland][Emissions and removals from drainage and rewetting and other management of organic and mineral soils][Emissions][N2O][kt][no source][no method][GrassLand][no option][no type]
type: Concept
definition: [Grassland][Emissions and removals from drainage and rewetting and other management of organic and mineral soils][Emissions][N2O][kt][no source][no method][GrassLand][no option][no type]
status: valid
status modified: 2017-02-13
accepted date: 2017-02-13
in scheme: emissions_variables_MMR

[Grassland][Other Mineral Soils][Emissions][CH4][kt][Land][no method][GrassLand][no option][Mineral soils]
type: Concept
definition: [Grassland][Other Mineral Soils][Emissions][CH4][kt][Land][no method][GrassLand][no option][Mineral soils]
status: valid
status modified: 2017-02-13
accepted date: 2017-02-13
in scheme: emissions_variables_MMR

[Grassland][Other Mineral Soils][Emissions][CO2][kt][Land][no method][GrassLand][no option][Mineral soils]
type: Concept
definition: [Grassland][Other Mineral Soils][Emissions][CO2][kt][Land][no method][GrassLand][no option][Mineral soils]
status: valid
status modified: 2017-02-13
accepted date: 2017-02-13
in scheme: emissions_variables_MMR

[Grassland][Other Mineral Soils][Emissions][N2O][kt][Land][no method][GrassLand][no option][Mineral soils]
type: Concept
definition: [Grassland][Other Mineral Soils][Emissions][N2O][kt][Land][no method][GrassLand][no option][Mineral soils]
status: valid
status modified: 2017-02-13
accepted date: 2017-02-13
in scheme: emissions_variables_MMR

[Grassland][Other Organic Soils][Emissions][CH4][kt][Land][no method][GrassLand][no option][Organic soils]
type: Concept
definition: [Grassland][Other Organic Soils][Emissions][CH4][kt][Land][no method][GrassLand][no option][Organic soils]
status: valid
status modified: 2017-02-13
accepted date: 2017-02-13
in scheme: emissions_variables_MMR

[Grassland][Other Organic Soils][Emissions][CO2][kt][Land][no method][GrassLand][no option][Organic soils]
type: Concept
definition: [Grassland][Other Organic Soils][Emissions][CO2][kt][Land][no method][GrassLand][no option][Organic soils]
status: valid
status modified: 2017-02-13
accepted date: 2017-02-13
in scheme: emissions_variables_MMR

[Grassland][Rewetted Mineral Soils][Emissions][CH4][kt][Land][no method][GrassLand][no option][Mineral soils]
type: Concept
definition: [Grassland][Rewetted Mineral Soils][Emissions][CH4][kt][Land][no method][GrassLand][no option][Mineral soils]
status: valid
status modified: 2017-02-13
accepted date: 2017-02-13
in scheme: emissions_variables_MMR

[Grassland][Rewetted Mineral Soils][Emissions][CO2][kt][Land][no method][GrassLand][no option][Mineral soils]
type: Concept
definition: [Grassland][Rewetted Mineral Soils][Emissions][CO2][kt][Land][no method][GrassLand][no option][Mineral soils]
status: valid
status modified: 2017-02-13
accepted date: 2017-02-13
in scheme: emissions_variables_MMR

[Grassland][Rewetted Organic Soils][Emissions][CH4][kt][Land][no method][GrassLand][no option][Organic soils]
type: Concept
definition: [Grassland][Rewetted Organic Soils][Emissions][CH4][kt][Land][no method][GrassLand][no option][Organic soils]
status: valid
status modified: 2017-02-13
accepted date: 2017-02-13
in scheme: emissions_variables_MMR

[Grassland][Rewetted Organic Soils][Emissions][CO2][kt][Land][no method][GrassLand][no option][Organic soils]
type: Concept
definition: [Grassland][Rewetted Organic Soils][Emissions][CO2][kt][Land][no method][GrassLand][no option][Organic soils]
status: valid
status modified: 2017-02-13
accepted date: 2017-02-13
in scheme: emissions_variables_MMR

[Land Use, Land-Use Change and Forestry][Land Use][Emissions][N2O][kt][Land][no method][Atmospheric Deposition][no option][no type]
type: Concept
definition: [Land Use, Land-Use Change and Forestry][Land Use][Emissions][N2O][kt][Land][no method][Atmospheric Deposition][no option][no type]
status: valid
status modified: 2017-02-13
accepted date: 2017-02-13
in scheme: emissions_variables_MMR

[Land Use, Land-Use Change and Forestry][Land Use][Emissions][N2O][kt][Land][no method][Indirect N2O Emissions From Managed Soils][no option][no type]
type: Concept
definition: [Land Use, Land-Use Change and Forestry][Land Use][Emissions][N2O][kt][Land][no method][Indirect N2O Emissions From Managed Soils][no option][no type]
status: valid
status modified: 2017-02-13
accepted date: 2017-02-13
in scheme: emissions_variables_MMR

[Land Use, Land-Use Change and Forestry][Land Use][Emissions][N2O][kt][Land][no method][Nitrogen Leaching and Run-off][no option][no type]
type: Concept
definition: [Land Use, Land-Use Change and Forestry][Land Use][Emissions][N2O][kt][Land][no method][Nitrogen Leaching and Run-off][no option][no type]
status: valid
status modified: 2017-02-13
accepted date: 2017-02-13
in scheme: emissions_variables_MMR

[Land Use, Land-Use Change and Forestry][Land Use][Emissions][N2O][kt][Land][no method][no target][no option][Atmospheric Deposition]
type: Concept
definition: [Land Use, Land-Use Change and Forestry][Land Use][Emissions][N2O][kt][Land][no method][no target][no option][Atmospheric Deposition]
status: valid
status modified: 2017-02-13
accepted date: 2017-02-13
in scheme: emissions_variables_MMR

[Land Use, Land-Use Change and Forestry][Land Use][Emissions][N2O][kt][Land][no method][no target][no option][Indirect N2O Emissions From Managed Soils]
type: Concept
definition: [Land Use, Land-Use Change and Forestry][Land Use][Emissions][N2O][kt][Land][no method][no target][no option][Indirect N2O Emissions From Managed Soils]
status: valid
status modified: 2017-02-13
accepted date: 2017-02-13
in scheme: emissions_variables_MMR

[Land Use, Land-Use Change and Forestry][Land Use][Emissions][N2O][kt][Land][no method][no target][no option][Nitrogen Leaching and Run-off]
type: Concept
definition: [Land Use, Land-Use Change and Forestry][Land Use][Emissions][N2O][kt][Land][no method][no target][no option][Nitrogen Leaching and Run-off]
status: valid
status modified: 2017-02-13
accepted date: 2017-02-13
in scheme: emissions_variables_MMR

[Other Land][Biomass Burning][Emissions][CH4][kt][Land][no method][no target][no option][no type]
type: Concept
definition: [Other Land][Biomass Burning][Emissions][CH4][kt][Land][no method][no target][no option][no type]
status: valid
status modified: 2017-02-13
accepted date: 2017-02-13
in scheme: emissions_variables_MMR

[Other Land][Biomass Burning][Emissions][CH4][kt][Other Land][no method][Other Land][no option][no type]
type: Concept
definition: [Other Land][Biomass Burning][Emissions][CH4][kt][Other Land][no method][Other Land][no option][no type]
status: valid
status modified: 2017-02-13
accepted date: 2017-02-13
in scheme: emissions_variables_MMR

[Other Land][Biomass Burning][Emissions][CO2][kt][Land][no method][no target][no option][no type]
type: Concept
definition: [Other Land][Biomass Burning][Emissions][CO2][kt][Land][no method][no target][no option][no type]
status: valid
status modified: 2017-02-13
accepted date: 2017-02-13
in scheme: emissions_variables_MMR

[Other Land][Biomass Burning][Emissions][CO2][kt][no source][no method][Other Land][no option][no type]
type: Concept
definition: [Other Land][Biomass Burning][Emissions][CO2][kt][no source][no method][Other Land][no option][no type]
status: valid
status modified: 2017-02-13
accepted date: 2017-02-13
in scheme: emissions_variables_MMR

[Other Land][Biomass Burning][Emissions][N2O][kt][Land][no method][no target][no option][no type]
type: Concept
definition: [Other Land][Biomass Burning][Emissions][N2O][kt][Land][no method][no target][no option][no type]
status: valid
status modified: 2017-02-13
accepted date: 2017-02-13
in scheme: emissions_variables_MMR

[Other Land][Direct N2O Emissions from N Mineralization/Immobilization][Emissions][N2O][kt][Land][no method][no target][no option][no type]
type: Concept
definition: [Other Land][Direct N2O Emissions from N Mineralization/Immobilization][Emissions][N2O][kt][Land][no method][no target][no option][no type]
status: valid
status modified: 2017-02-13
accepted date: 2017-02-13
in scheme: emissions_variables_MMR

[Other Land][Direct N2O Emissions from N Mineralization/Immobilization][Emissions][N2O][kt][no source][no method][Other Land][no option][no type]
type: Concept
definition: [Other Land][Direct N2O Emissions from N Mineralization/Immobilization][Emissions][N2O][kt][no source][no method][Other Land][no option][no type]
status: valid
status modified: 2017-02-13
accepted date: 2017-02-13
in scheme: emissions_variables_MMR

[Other LULUCF][Biomass Burning][Emissions][CH4][kt][Other][no method][no target][no option][no type]
type: Concept
definition: [Other LULUCF][Biomass Burning][Emissions][CH4][kt][Other][no method][no target][no option][no type]
status: valid
status modified: 2017-02-13
accepted date: 2017-02-13
in scheme: emissions_variables_MMR

[Other LULUCF][Biomass Burning][Emissions][CO2][kt][Other][no method][no target][no option][no type]
type: Concept
definition: [Other LULUCF][Biomass Burning][Emissions][CO2][kt][Other][no method][no target][no option][no type]
status: valid
status modified: 2017-02-13
accepted date: 2017-02-13
in scheme: emissions_variables_MMR

[Other LULUCF][Biomass Burning][Emissions][N2O][kt][Other][no method][no target][no option][no type]
type: Concept
definition: [Other LULUCF][Biomass Burning][Emissions][N2O][kt][Other][no method][no target][no option][no type]
status: valid
status modified: 2017-02-13
accepted date: 2017-02-13
in scheme: emissions_variables_MMR

[Other LULUCF][Direct N2O Emissions from N inputs][Emissions][N2O][kt][Other][no method][no target][no option][no type]
type: Concept
definition: [Other LULUCF][Direct N2O Emissions from N inputs][Emissions][N2O][kt][Other][no method][no target][no option][no type]
status: valid
status modified: 2017-02-13
accepted date: 2017-02-13
in scheme: emissions_variables_MMR

[Other LULUCF][Emissions and removals from drainage and rewetting and other management of organic and mineral soils][Emissions][CH4][kt][Other][no method][no target][no option][no type]
type: Concept
definition: [Other LULUCF][Emissions and removals from drainage and rewetting and other management of organic and mineral soils][Emissions][CH4][kt][Other][no method][no target][no option][no type]
status: valid
status modified: 2017-02-13
accepted date: 2017-02-13
in scheme: emissions_variables_MMR

[Other LULUCF][Emissions and removals from drainage and rewetting and other management of organic and mineral soils][Emissions][CO2][kt][Other][no method][no target][no option][no type]
type: Concept
definition: [Other LULUCF][Emissions and removals from drainage and rewetting and other management of organic and mineral soils][Emissions][CO2][kt][Other][no method][no target][no option][no type]
status: valid
status modified: 2017-02-13
accepted date: 2017-02-13
in scheme: emissions_variables_MMR

[Other LULUCF][Emissions and removals from drainage and rewetting and other management of organic and mineral soils][Emissions][N2O][kt][Other][no method][no target][no option][no type]
type: Concept
definition: [Other LULUCF][Emissions and removals from drainage and rewetting and other management of organic and mineral soils][Emissions][N2O][kt][Other][no method][no target][no option][no type]
status: valid
status modified: 2017-02-13
accepted date: 2017-02-13
in scheme: emissions_variables_MMR

[Reference approach][Fuels][Emissions][CO2][kt][no source][no method][no target][no option][no type]
type: Concept
definition: [Reference approach][Fuels][Emissions][CO2][kt][no source][no method][no target][no option][no type]
status: valid
status modified: 2017-02-13
accepted date: 2017-02-13
in scheme: emissions_variables_MMR

[Sectoral approach][Fuels][Emissions][CO2][kt][no source][no method][no target][no option][no type]
type: Concept
definition: [Sectoral approach][Fuels][Emissions][CO2][kt][no source][no method][no target][no option][no type]
status: valid
status modified: 2017-02-13
accepted date: 2017-02-13
in scheme: emissions_variables_MMR

[Settlements][Biomass Burning][Emissions][CH4][kt][Land][no method][no target][no option][no type]
type: Concept
definition: [Settlements][Biomass Burning][Emissions][CH4][kt][Land][no method][no target][no option][no type]
status: valid
status modified: 2017-02-13
accepted date: 2017-02-13
in scheme: emissions_variables_MMR

[Settlements][Biomass Burning][Emissions][CH4][kt][Settlements][no method][Settlements][no option][no type]
type: Concept
definition: [Settlements][Biomass Burning][Emissions][CH4][kt][Settlements][no method][Settlements][no option][no type]
status: valid
status modified: 2017-02-13
accepted date: 2017-02-13
in scheme: emissions_variables_MMR

[Settlements][Biomass Burning][Emissions][CO2][kt][Land][no method][no target][no option][no type]
type: Concept
definition: [Settlements][Biomass Burning][Emissions][CO2][kt][Land][no method][no target][no option][no type]
status: valid
status modified: 2017-02-13
accepted date: 2017-02-13
in scheme: emissions_variables_MMR

[Settlements][Biomass Burning][Emissions][CO2][kt][no source][no method][Settlements][no option][no type]
type: Concept
definition: [Settlements][Biomass Burning][Emissions][CO2][kt][no source][no method][Settlements][no option][no type]
status: valid
status modified: 2017-02-13
accepted date: 2017-02-13
in scheme: emissions_variables_MMR

[Settlements][Biomass Burning][Emissions][N2O][kt][Land][no method][no target][no option][no type]
type: Concept
definition: [Settlements][Biomass Burning][Emissions][N2O][kt][Land][no method][no target][no option][no type]
status: valid
status modified: 2017-02-13
accepted date: 2017-02-13
in scheme: emissions_variables_MMR

[Settlements][Direct N2O Emissions from N inputs][Emissions][N2O][kt][Land][no method][no target][no option][no type]
type: Concept
definition: [Settlements][Direct N2O Emissions from N inputs][Emissions][N2O][kt][Land][no method][no target][no option][no type]
status: valid
status modified: 2017-02-13
accepted date: 2017-02-13
in scheme: emissions_variables_MMR

[Settlements][Direct N2O Emissions from N Mineralization/Immobilization][Emissions][N2O][kt][Land][no method][no target][no option][no type]
type: Concept
definition: [Settlements][Direct N2O Emissions from N Mineralization/Immobilization][Emissions][N2O][kt][Land][no method][no target][no option][no type]
status: valid
status modified: 2017-02-13
accepted date: 2017-02-13
in scheme: emissions_variables_MMR

[SF6 and PFCs from Other Product Use][no classification][Emissions][Unspecified mix of HFCs and PFCs][t CO2 equivalent][no source][no method][no target][no option][no type]
type: Concept
definition: [SF6 and PFCs from Other Product Use][no classification][Emissions][Unspecified mix of HFCs and PFCs][t CO2 equivalent][no source][no method][no target][no option][no type]
status: valid
status modified: 2017-02-13
accepted date: 2017-02-13
in scheme: emissions_variables_MMR

[Total HWP from Domestic Harvest][Paper and Paperboard][Emissions][CO2][kt][HWP in use][no method][no target][Approach B1][no type]
type: Concept
definition: [Total HWP from Domestic Harvest][Paper and Paperboard][Emissions][CO2][kt][HWP in use][no method][no target][Approach B1][no type]
status: valid
status modified: 2017-02-13
accepted date: 2017-02-13
in scheme: emissions_variables_MMR

[Waste Incineration][Hazardous Waste][Emissions][CH4][kt][no source][no method][no target][no option][Biogenic]
type: Concept
definition: [Waste Incineration][Hazardous Waste][Emissions][CH4][kt][no source][no method][no target][no option][Biogenic]
status: valid
status modified: 2017-02-13
accepted date: 2017-02-13
in scheme: emissions_variables_MMR

[Waste Incineration][Hazardous Waste][Emissions][CO2][kt][no source][no method][no target][no option][Biogenic]
type: Concept
definition: [Waste Incineration][Hazardous Waste][Emissions][CO2][kt][no source][no method][no target][no option][Biogenic]
status: valid
status modified: 2017-02-13
accepted date: 2017-02-13
in scheme: emissions_variables_MMR

[Waste Incineration][Hazardous Waste][Emissions][N2O][kt][no source][no method][no target][no option][Biogenic]
type: Concept
definition: [Waste Incineration][Hazardous Waste][Emissions][N2O][kt][no source][no method][no target][no option][Biogenic]
status: valid
status modified: 2017-02-13
accepted date: 2017-02-13
in scheme: emissions_variables_MMR

[Wetlands][Biomass Burning][Emissions][CH4][kt][Land][no method][no target][no option][no type]
type: Concept
definition: [Wetlands][Biomass Burning][Emissions][CH4][kt][Land][no method][no target][no option][no type]
status: valid
status modified: 2017-02-13
accepted date: 2017-02-13
in scheme: emissions_variables_MMR

[Wetlands][Biomass Burning][Emissions][CO2][kt][Land][no method][no target][no option][no type]
type: Concept
definition: [Wetlands][Biomass Burning][Emissions][CO2][kt][Land][no method][no target][no option][no type]
status: valid
status modified: 2017-02-13
accepted date: 2017-02-13
in scheme: emissions_variables_MMR

[Wetlands][Biomass Burning][Emissions][N2O][kt][Land][no method][no target][no option][no type]
type: Concept
definition: [Wetlands][Biomass Burning][Emissions][N2O][kt][Land][no method][no target][no option][no type]
status: valid
status modified: 2017-02-13
accepted date: 2017-02-13
in scheme: emissions_variables_MMR

[Wetlands][Direct N2O Emissions from N inputs][Emissions][N2O][kt][Land][no method][no target][no option][no type]
type: Concept
definition: [Wetlands][Direct N2O Emissions from N inputs][Emissions][N2O][kt][Land][no method][no target][no option][no type]
status: valid
status modified: 2017-02-13
accepted date: 2017-02-13
in scheme: emissions_variables_MMR

[Wetlands][Direct N2O Emissions from N Mineralization/Immobilization][Emissions][N2O][kt][Land][no method][no target][no option][no type]
type: Concept
definition: [Wetlands][Direct N2O Emissions from N Mineralization/Immobilization][Emissions][N2O][kt][Land][no method][no target][no option][no type]
status: valid
status modified: 2017-02-13
accepted date: 2017-02-13
in scheme: emissions_variables_MMR

[Wetlands][Drained Organic Soils][Emissions][CH4][kt][Land][no method][Flooded Land][no option][Organic soils]
type: Concept
definition: [Wetlands][Drained Organic Soils][Emissions][CH4][kt][Land][no method][Flooded Land][no option][Organic soils]
status: valid
status modified: 2017-02-13
accepted date: 2017-02-13
in scheme: emissions_variables_MMR

[Wetlands][Drained Organic Soils][Emissions][CH4][kt][Land][no method][Other Wetlands][no option][Organic soils]
type: Concept
definition: [Wetlands][Drained Organic Soils][Emissions][CH4][kt][Land][no method][Other Wetlands][no option][Organic soils]
status: valid
status modified: 2017-02-13
accepted date: 2017-02-13
in scheme: emissions_variables_MMR

[Wetlands][Drained Organic Soils][Emissions][CH4][kt][Land][no method][Peat Extraction][no option][Organic soils]
type: Concept
definition: [Wetlands][Drained Organic Soils][Emissions][CH4][kt][Land][no method][Peat Extraction][no option][Organic soils]
status: valid
status modified: 2017-02-13
accepted date: 2017-02-13
in scheme: emissions_variables_MMR

[Wetlands][Drained Organic Soils][Emissions][CO2][kt][Land][no method][Flooded Land][no option][Organic soils]
type: Concept
definition: [Wetlands][Drained Organic Soils][Emissions][CO2][kt][Land][no method][Flooded Land][no option][Organic soils]
status: valid
status modified: 2017-02-13
accepted date: 2017-02-13
in scheme: emissions_variables_MMR

[Wetlands][Drained Organic Soils][Emissions][CO2][kt][Land][no method][Other Wetlands][no option][Organic soils]
type: Concept
definition: [Wetlands][Drained Organic Soils][Emissions][CO2][kt][Land][no method][Other Wetlands][no option][Organic soils]
status: valid
status modified: 2017-02-13
accepted date: 2017-02-13
in scheme: emissions_variables_MMR

[Wetlands][Drained Organic Soils][Emissions][CO2][kt][Land][no method][Peat Extraction][no option][Organic soils]
type: Concept
definition: [Wetlands][Drained Organic Soils][Emissions][CO2][kt][Land][no method][Peat Extraction][no option][Organic soils]
status: valid
status modified: 2017-02-13
accepted date: 2017-02-13
in scheme: emissions_variables_MMR

[Wetlands][Drained Organic Soils][Emissions][N2O][kt][Land][no method][Flooded Land][no option][Organic soils]
type: Concept
definition: [Wetlands][Drained Organic Soils][Emissions][N2O][kt][Land][no method][Flooded Land][no option][Organic soils]
status: valid
status modified: 2017-02-13
accepted date: 2017-02-13
in scheme: emissions_variables_MMR

[Wetlands][Drained Organic Soils][Emissions][N2O][kt][Land][no method][Other Wetlands][no option][Organic soils]
type: Concept
definition: [Wetlands][Drained Organic Soils][Emissions][N2O][kt][Land][no method][Other Wetlands][no option][Organic soils]
status: valid
status modified: 2017-02-13
accepted date: 2017-02-13
in scheme: emissions_variables_MMR

[Wetlands][Drained Organic Soils][Emissions][N2O][kt][Land][no method][Peat Extraction][no option][Organic soils]
type: Concept
definition: [Wetlands][Drained Organic Soils][Emissions][N2O][kt][Land][no method][Peat Extraction][no option][Organic soils]
status: valid
status modified: 2017-02-13
accepted date: 2017-02-13
in scheme: emissions_variables_MMR

[Wetlands][Emissions and removals from drainage and rewetting and other management of organic and mineral soils][Emissions][CH4][kt][Land][no method][Flooded Land][no option][no type]
type: Concept
definition: [Wetlands][Emissions and removals from drainage and rewetting and other management of organic and mineral soils][Emissions][CH4][kt][Land][no method][Flooded Land][no option][no type]
status: valid
status modified: 2017-02-13
accepted date: 2017-02-13
in scheme: emissions_variables_MMR

[Wetlands][Emissions and removals from drainage and rewetting and other management of organic and mineral soils][Emissions][CH4][kt][Land][no method][no target][no option][no type]
type: Concept
definition: [Wetlands][Emissions and removals from drainage and rewetting and other management of organic and mineral soils][Emissions][CH4][kt][Land][no method][no target][no option][no type]
status: valid
status modified: 2017-02-13
accepted date: 2017-02-13
in scheme: emissions_variables_MMR

[Wetlands][Emissions and removals from drainage and rewetting and other management of organic and mineral soils][Emissions][CH4][kt][Land][no method][Other Wetlands][no option][Mineral soils]
type: Concept
definition: [Wetlands][Emissions and removals from drainage and rewetting and other management of organic and mineral soils][Emissions][CH4][kt][Land][no method][Other Wetlands][no option][Mineral soils]
status: valid
status modified: 2017-02-13
accepted date: 2017-02-13
in scheme: emissions_variables_MMR

[Wetlands][Emissions and removals from drainage and rewetting and other management of organic and mineral soils][Emissions][CH4][kt][Land][no method][Other Wetlands][no option][no type]
type: Concept
definition: [Wetlands][Emissions and removals from drainage and rewetting and other management of organic and mineral soils][Emissions][CH4][kt][Land][no method][Other Wetlands][no option][no type]
status: valid
status modified: 2017-02-13
accepted date: 2017-02-13
in scheme: emissions_variables_MMR

[Wetlands][Emissions and removals from drainage and rewetting and other management of organic and mineral soils][Emissions][CH4][kt][Land][no method][Peat Extraction][no option][no type]
type: Concept
definition: [Wetlands][Emissions and removals from drainage and rewetting and other management of organic and mineral soils][Emissions][CH4][kt][Land][no method][Peat Extraction][no option][no type]
status: valid
status modified: 2017-02-13
accepted date: 2017-02-13
in scheme: emissions_variables_MMR

[Wetlands][Emissions and removals from drainage and rewetting and other management of organic and mineral soils][Emissions][CH4][kt][no source][no method][Wetlands][no option][no type]
type: Concept
definition: [Wetlands][Emissions and removals from drainage and rewetting and other management of organic and mineral soils][Emissions][CH4][kt][no source][no method][Wetlands][no option][no type]
status: valid
status modified: 2017-02-13
accepted date: 2017-02-13
in scheme: emissions_variables_MMR

[Wetlands][Emissions and removals from drainage and rewetting and other management of organic and mineral soils][Emissions][CO2][kt][Land][no method][Flooded Land][no option][no type]
type: Concept
definition: [Wetlands][Emissions and removals from drainage and rewetting and other management of organic and mineral soils][Emissions][CO2][kt][Land][no method][Flooded Land][no option][no type]
status: valid
status modified: 2017-02-13
accepted date: 2017-02-13
in scheme: emissions_variables_MMR

[Wetlands][Emissions and removals from drainage and rewetting and other management of organic and mineral soils][Emissions][CO2][kt][Land][no method][no target][no option][no type]
type: Concept
definition: [Wetlands][Emissions and removals from drainage and rewetting and other management of organic and mineral soils][Emissions][CO2][kt][Land][no method][no target][no option][no type]
status: valid
status modified: 2017-02-13
accepted date: 2017-02-13
in scheme: emissions_variables_MMR

[Wetlands][Emissions and removals from drainage and rewetting and other management of organic and mineral soils][Emissions][CO2][kt][Land][no method][Other Wetlands][no option][Mineral soils]
type: Concept
definition: [Wetlands][Emissions and removals from drainage and rewetting and other management of organic and mineral soils][Emissions][CO2][kt][Land][no method][Other Wetlands][no option][Mineral soils]
status: valid
status modified: 2017-02-13
accepted date: 2017-02-13
in scheme: emissions_variables_MMR

[Wetlands][Emissions and removals from drainage and rewetting and other management of organic and mineral soils][Emissions][CO2][kt][Land][no method][Other Wetlands][no option][no type]
type: Concept
definition: [Wetlands][Emissions and removals from drainage and rewetting and other management of organic and mineral soils][Emissions][CO2][kt][Land][no method][Other Wetlands][no option][no type]
status: valid
status modified: 2017-02-13
accepted date: 2017-02-13
in scheme: emissions_variables_MMR

[Wetlands][Emissions and removals from drainage and rewetting and other management of organic and mineral soils][Emissions][CO2][kt][Land][no method][Peat Extraction][no option][no type]
type: Concept
definition: [Wetlands][Emissions and removals from drainage and rewetting and other management of organic and mineral soils][Emissions][CO2][kt][Land][no method][Peat Extraction][no option][no type]
status: valid
status modified: 2017-02-13
accepted date: 2017-02-13
in scheme: emissions_variables_MMR

[Wetlands][Emissions and removals from drainage and rewetting and other management of organic and mineral soils][Emissions][CO2][kt][no source][no method][Wetlands][no option][no type]
type: Concept
definition: [Wetlands][Emissions and removals from drainage and rewetting and other management of organic and mineral soils][Emissions][CO2][kt][no source][no method][Wetlands][no option][no type]
status: valid
status modified: 2017-02-13
accepted date: 2017-02-13
in scheme: emissions_variables_MMR

[Wetlands][Emissions and removals from drainage and rewetting and other management of organic and mineral soils][Emissions][N2O][kt][Land][no method][Flooded Land][no option][no type]
type: Concept
definition: [Wetlands][Emissions and removals from drainage and rewetting and other management of organic and mineral soils][Emissions][N2O][kt][Land][no method][Flooded Land][no option][no type]
status: valid
status modified: 2017-02-13
accepted date: 2017-02-13
in scheme: emissions_variables_MMR

[Wetlands][Emissions and removals from drainage and rewetting and other management of organic and mineral soils][Emissions][N2O][kt][Land][no method][no target][no option][no type]
type: Concept
definition: [Wetlands][Emissions and removals from drainage and rewetting and other management of organic and mineral soils][Emissions][N2O][kt][Land][no method][no target][no option][no type]
status: valid
status modified: 2017-02-13
accepted date: 2017-02-13
in scheme: emissions_variables_MMR

[Wetlands][Emissions and removals from drainage and rewetting and other management of organic and mineral soils][Emissions][N2O][kt][Land][no method][Other Wetlands][no option][Mineral soils]
type: Concept
definition: [Wetlands][Emissions and removals from drainage and rewetting and other management of organic and mineral soils][Emissions][N2O][kt][Land][no method][Other Wetlands][no option][Mineral soils]
status: valid
status modified: 2017-02-13
accepted date: 2017-02-13
in scheme: emissions_variables_MMR

[Wetlands][Emissions and removals from drainage and rewetting and other management of organic and mineral soils][Emissions][N2O][kt][Land][no method][Other Wetlands][no option][no type]
type: Concept
definition: [Wetlands][Emissions and removals from drainage and rewetting and other management of organic and mineral soils][Emissions][N2O][kt][Land][no method][Other Wetlands][no option][no type]
status: valid
status modified: 2017-02-13
accepted date: 2017-02-13
in scheme: emissions_variables_MMR

[Wetlands][Emissions and removals from drainage and rewetting and other management of organic and mineral soils][Emissions][N2O][kt][Land][no method][Peat Extraction][no option][no type]
type: Concept
definition: [Wetlands][Emissions and removals from drainage and rewetting and other management of organic and mineral soils][Emissions][N2O][kt][Land][no method][Peat Extraction][no option][no type]
status: valid
status modified: 2017-02-13
accepted date: 2017-02-13
in scheme: emissions_variables_MMR

[Wetlands][Emissions and removals from drainage and rewetting and other management of organic and mineral soils][Emissions][N2O][kt][no source][no method][Wetlands][no option][no type]
type: Concept
definition: [Wetlands][Emissions and removals from drainage and rewetting and other management of organic and mineral soils][Emissions][N2O][kt][no source][no method][Wetlands][no option][no type]
status: valid
status modified: 2017-02-13
accepted date: 2017-02-13
in scheme: emissions_variables_MMR

[Wetlands][Other Mineral Soils][Emissions][CH4][kt][Land][no method][Flooded Land][no option][Mineral soils]
type: Concept
definition: [Wetlands][Other Mineral Soils][Emissions][CH4][kt][Land][no method][Flooded Land][no option][Mineral soils]
status: valid
status modified: 2017-02-13
accepted date: 2017-02-13
in scheme: emissions_variables_MMR

[Wetlands][Other Mineral Soils][Emissions][CH4][kt][Land][no method][Other Wetlands][no option][Mineral soils]
type: Concept
definition: [Wetlands][Other Mineral Soils][Emissions][CH4][kt][Land][no method][Other Wetlands][no option][Mineral soils]
status: valid
status modified: 2017-02-13
accepted date: 2017-02-13
in scheme: emissions_variables_MMR

[Wetlands][Other Mineral Soils][Emissions][CH4][kt][Land][no method][Peat Extraction][no option][Mineral soils]
type: Concept
definition: [Wetlands][Other Mineral Soils][Emissions][CH4][kt][Land][no method][Peat Extraction][no option][Mineral soils]
status: valid
status modified: 2017-02-13
accepted date: 2017-02-13
in scheme: emissions_variables_MMR

[Wetlands][Other Mineral Soils][Emissions][CO2][kt][Land][no method][Flooded Land][no option][Mineral soils]
type: Concept
definition: [Wetlands][Other Mineral Soils][Emissions][CO2][kt][Land][no method][Flooded Land][no option][Mineral soils]
status: valid
status modified: 2017-02-13
accepted date: 2017-02-13
in scheme: emissions_variables_MMR

[Wetlands][Other Mineral Soils][Emissions][CO2][kt][Land][no method][Other Wetlands][no option][Mineral soils]
type: Concept
definition: [Wetlands][Other Mineral Soils][Emissions][CO2][kt][Land][no method][Other Wetlands][no option][Mineral soils]
status: valid
status modified: 2017-02-13
accepted date: 2017-02-13
in scheme: emissions_variables_MMR

[Wetlands][Other Mineral Soils][Emissions][CO2][kt][Land][no method][Peat Extraction][no option][Mineral soils]
type: Concept
definition: [Wetlands][Other Mineral Soils][Emissions][CO2][kt][Land][no method][Peat Extraction][no option][Mineral soils]
status: valid
status modified: 2017-02-13
accepted date: 2017-02-13
in scheme: emissions_variables_MMR

[Wetlands][Other Mineral Soils][Emissions][N2O][kt][Land][no method][Flooded Land][no option][Mineral soils]
type: Concept
definition: [Wetlands][Other Mineral Soils][Emissions][N2O][kt][Land][no method][Flooded Land][no option][Mineral soils]
status: valid
status modified: 2017-02-13
accepted date: 2017-02-13
in scheme: emissions_variables_MMR

[Wetlands][Other Mineral Soils][Emissions][N2O][kt][Land][no method][Other Wetlands][no option][Mineral soils]
type: Concept
definition: [Wetlands][Other Mineral Soils][Emissions][N2O][kt][Land][no method][Other Wetlands][no option][Mineral soils]
status: valid
status modified: 2017-02-13
accepted date: 2017-02-13
in scheme: emissions_variables_MMR

[Wetlands][Other Mineral Soils][Emissions][N2O][kt][Land][no method][Peat Extraction][no option][Mineral soils]
type: Concept
definition: [Wetlands][Other Mineral Soils][Emissions][N2O][kt][Land][no method][Peat Extraction][no option][Mineral soils]
status: valid
status modified: 2017-02-13
accepted date: 2017-02-13
in scheme: emissions_variables_MMR

[Wetlands][Other Organic Soils][Emissions][CH4][kt][Land][no method][Flooded Land][no option][Organic soils]
type: Concept
definition: [Wetlands][Other Organic Soils][Emissions][CH4][kt][Land][no method][Flooded Land][no option][Organic soils]
status: valid
status modified: 2017-02-13
accepted date: 2017-02-13
in scheme: emissions_variables_MMR

[Wetlands][Other Organic Soils][Emissions][CH4][kt][Land][no method][Other Wetlands][no option][Organic soils]
type: Concept
definition: [Wetlands][Other Organic Soils][Emissions][CH4][kt][Land][no method][Other Wetlands][no option][Organic soils]
status: valid
status modified: 2017-02-13
accepted date: 2017-02-13
in scheme: emissions_variables_MMR

[Wetlands][Other Organic Soils][Emissions][CH4][kt][Land][no method][Peat Extraction][no option][Organic soils]
type: Concept
definition: [Wetlands][Other Organic Soils][Emissions][CH4][kt][Land][no method][Peat Extraction][no option][Organic soils]
status: valid
status modified: 2017-02-13
accepted date: 2017-02-13
in scheme: emissions_variables_MMR

[Wetlands][Other Organic Soils][Emissions][CO2][kt][Land][no method][Flooded Land][no option][Organic soils]
type: Concept
definition: [Wetlands][Other Organic Soils][Emissions][CO2][kt][Land][no method][Flooded Land][no option][Organic soils]
status: valid
status modified: 2017-02-13
accepted date: 2017-02-13
in scheme: emissions_variables_MMR

[Wetlands][Other Organic Soils][Emissions][CO2][kt][Land][no method][Other Wetlands][no option][Organic soils]
type: Concept
definition: [Wetlands][Other Organic Soils][Emissions][CO2][kt][Land][no method][Other Wetlands][no option][Organic soils]
status: valid
status modified: 2017-02-13
accepted date: 2017-02-13
in scheme: emissions_variables_MMR

[Wetlands][Other Organic Soils][Emissions][CO2][kt][Land][no method][Peat Extraction][no option][Organic soils]
type: Concept
definition: [Wetlands][Other Organic Soils][Emissions][CO2][kt][Land][no method][Peat Extraction][no option][Organic soils]
status: valid
status modified: 2017-02-13
accepted date: 2017-02-13
in scheme: emissions_variables_MMR

[Wetlands][Other Organic Soils][Emissions][N2O][kt][Land][no method][Flooded Land][no option][Organic soils]
type: Concept
definition: [Wetlands][Other Organic Soils][Emissions][N2O][kt][Land][no method][Flooded Land][no option][Organic soils]
status: valid
status modified: 2017-02-13
accepted date: 2017-02-13
in scheme: emissions_variables_MMR

[Wetlands][Other Organic Soils][Emissions][N2O][kt][Land][no method][Other Wetlands][no option][Organic soils]
type: Concept
definition: [Wetlands][Other Organic Soils][Emissions][N2O][kt][Land][no method][Other Wetlands][no option][Organic soils]
status: valid
status modified: 2017-02-13
accepted date: 2017-02-13
in scheme: emissions_variables_MMR

[Wetlands][Other Organic Soils][Emissions][N2O][kt][Land][no method][Peat Extraction][no option][Organic soils]
type: Concept
definition: [Wetlands][Other Organic Soils][Emissions][N2O][kt][Land][no method][Peat Extraction][no option][Organic soils]
status: valid
status modified: 2017-02-13
accepted date: 2017-02-13
in scheme: emissions_variables_MMR

[Wetlands][Rewetted Mineral Soils][Emissions][CH4][kt][Land][no method][Flooded Land][no option][Mineral soils]
type: Concept
definition: [Wetlands][Rewetted Mineral Soils][Emissions][CH4][kt][Land][no method][Flooded Land][no option][Mineral soils]
status: valid
status modified: 2017-02-13
accepted date: 2017-02-13
in scheme: emissions_variables_MMR

[Wetlands][Rewetted Mineral Soils][Emissions][CH4][kt][Land][no method][Other Wetlands][no option][Mineral soils]
type: Concept
definition: [Wetlands][Rewetted Mineral Soils][Emissions][CH4][kt][Land][no method][Other Wetlands][no option][Mineral soils]
status: valid
status modified: 2017-02-13
accepted date: 2017-02-13
in scheme: emissions_variables_MMR

[Wetlands][Rewetted Mineral Soils][Emissions][CH4][kt][Land][no method][Peat Extraction][no option][Mineral soils]
type: Concept
definition: [Wetlands][Rewetted Mineral Soils][Emissions][CH4][kt][Land][no method][Peat Extraction][no option][Mineral soils]
status: valid
status modified: 2017-02-13
accepted date: 2017-02-13
in scheme: emissions_variables_MMR

[Wetlands][Rewetted Mineral Soils][Emissions][CO2][kt][Land][no method][Flooded Land][no option][Mineral soils]
type: Concept
definition: [Wetlands][Rewetted Mineral Soils][Emissions][CO2][kt][Land][no method][Flooded Land][no option][Mineral soils]
status: valid
status modified: 2017-02-13
accepted date: 2017-02-13
in scheme: emissions_variables_MMR

[Wetlands][Rewetted Mineral Soils][Emissions][CO2][kt][Land][no method][Other Wetlands][no option][Mineral soils]
type: Concept
definition: [Wetlands][Rewetted Mineral Soils][Emissions][CO2][kt][Land][no method][Other Wetlands][no option][Mineral soils]
status: valid
status modified: 2017-02-13
accepted date: 2017-02-13
in scheme: emissions_variables_MMR

[Wetlands][Rewetted Mineral Soils][Emissions][CO2][kt][Land][no method][Peat Extraction][no option][Mineral soils]
type: Concept
definition: [Wetlands][Rewetted Mineral Soils][Emissions][CO2][kt][Land][no method][Peat Extraction][no option][Mineral soils]
status: valid
status modified: 2017-02-13
accepted date: 2017-02-13
in scheme: emissions_variables_MMR

[Wetlands][Rewetted Mineral Soils][Emissions][N2O][kt][Land][no method][Flooded Land][no option][Mineral soils]
type: Concept
definition: [Wetlands][Rewetted Mineral Soils][Emissions][N2O][kt][Land][no method][Flooded Land][no option][Mineral soils]
status: valid
status modified: 2017-02-13
accepted date: 2017-02-13
in scheme: emissions_variables_MMR

[Wetlands][Rewetted Mineral Soils][Emissions][N2O][kt][Land][no method][Other Wetlands][no option][Mineral soils]
type: Concept
definition: [Wetlands][Rewetted Mineral Soils][Emissions][N2O][kt][Land][no method][Other Wetlands][no option][Mineral soils]
status: valid
status modified: 2017-02-13
accepted date: 2017-02-13
in scheme: emissions_variables_MMR

[Wetlands][Rewetted Mineral Soils][Emissions][N2O][kt][Land][no method][Peat Extraction][no option][Mineral soils]
type: Concept
definition: [Wetlands][Rewetted Mineral Soils][Emissions][N2O][kt][Land][no method][Peat Extraction][no option][Mineral soils]
status: valid
status modified: 2017-02-13
accepted date: 2017-02-13
in scheme: emissions_variables_MMR

[Wetlands][Rewetted Organic Soils][Emissions][CH4][kt][Land][no method][Flooded Land][no option][Organic soils]
type: Concept
definition: [Wetlands][Rewetted Organic Soils][Emissions][CH4][kt][Land][no method][Flooded Land][no option][Organic soils]
status: valid
status modified: 2017-02-13
accepted date: 2017-02-13
in scheme: emissions_variables_MMR

[Wetlands][Rewetted Organic Soils][Emissions][CH4][kt][Land][no method][Other Wetlands][no option][Organic soils]
type: Concept
definition: [Wetlands][Rewetted Organic Soils][Emissions][CH4][kt][Land][no method][Other Wetlands][no option][Organic soils]
status: valid
status modified: 2017-02-13
accepted date: 2017-02-13
in scheme: emissions_variables_MMR

[Wetlands][Rewetted Organic Soils][Emissions][CH4][kt][Land][no method][Peat Extraction][no option][Organic soils]
type: Concept
definition: [Wetlands][Rewetted Organic Soils][Emissions][CH4][kt][Land][no method][Peat Extraction][no option][Organic soils]
status: valid
status modified: 2017-02-13
accepted date: 2017-02-13
in scheme: emissions_variables_MMR

[Wetlands][Rewetted Organic Soils][Emissions][CO2][kt][Land][no method][Flooded Land][no option][Organic soils]
type: Concept
definition: [Wetlands][Rewetted Organic Soils][Emissions][CO2][kt][Land][no method][Flooded Land][no option][Organic soils]
status: valid
status modified: 2017-02-13
accepted date: 2017-02-13
in scheme: emissions_variables_MMR

[Wetlands][Rewetted Organic Soils][Emissions][CO2][kt][Land][no method][Other Wetlands][no option][Organic soils]
type: Concept
definition: [Wetlands][Rewetted Organic Soils][Emissions][CO2][kt][Land][no method][Other Wetlands][no option][Organic soils]
status: valid
status modified: 2017-02-13
accepted date: 2017-02-13
in scheme: emissions_variables_MMR

[Wetlands][Rewetted Organic Soils][Emissions][CO2][kt][Land][no method][Peat Extraction][no option][Organic soils]
type: Concept
definition: [Wetlands][Rewetted Organic Soils][Emissions][CO2][kt][Land][no method][Peat Extraction][no option][Organic soils]
status: valid
status modified: 2017-02-13
accepted date: 2017-02-13
in scheme: emissions_variables_MMR

[Wetlands][Rewetted Organic Soils][Emissions][N2O][kt][Land][no method][Flooded Land][no option][Organic soils]
type: Concept
definition: [Wetlands][Rewetted Organic Soils][Emissions][N2O][kt][Land][no method][Flooded Land][no option][Organic soils]
status: valid
status modified: 2017-02-13
accepted date: 2017-02-13
in scheme: emissions_variables_MMR

[Wetlands][Rewetted Organic Soils][Emissions][N2O][kt][Land][no method][Other Wetlands][no option][Organic soils]
type: Concept
definition: [Wetlands][Rewetted Organic Soils][Emissions][N2O][kt][Land][no method][Other Wetlands][no option][Organic soils]
status: valid
status modified: 2017-02-13
accepted date: 2017-02-13
in scheme: emissions_variables_MMR

[Wetlands][Rewetted Organic Soils][Emissions][N2O][kt][Land][no method][Peat Extraction][no option][Organic soils]
type: Concept
definition: [Wetlands][Rewetted Organic Soils][Emissions][N2O][kt][Land][no method][Peat Extraction][no option][Organic soils]
status: valid
status modified: 2017-02-13
accepted date: 2017-02-13
in scheme: emissions_variables_MMR

1 [Energy][Fuels][Emissions][Aggregate GHGs][kt CO2 equivalent][no source][no method][no target][no option][no type]
type: Concept
definition: 1 [Energy][Fuels][Emissions][Aggregate GHGs][kt CO2 equivalent][no source][no method][no target][no option][no type]
status: valid
status modified: 2017-02-13
accepted date: 2017-02-13
in scheme: emissions_variables_MMR

1 [Energy][Fuels][Emissions][CH4][kt][no source][no method][no target][no option][no type]
type: Concept
definition: 1 [Energy][Fuels][Emissions][CH4][kt][no source][no method][no target][no option][no type]
status: valid
status modified: 2017-02-13
accepted date: 2017-02-13
in scheme: emissions_variables_MMR

1 [Energy][Fuels][Emissions][CO][kt][no source][no method][no target][no option][no type]
type: Concept
definition: 1 [Energy][Fuels][Emissions][CO][kt][no source][no method][no target][no option][no type]
status: valid
status modified: 2017-02-13
accepted date: 2017-02-13
in scheme: emissions_variables_MMR

1 [Energy][Fuels][Emissions][CO2][kt][no source][no method][no target][no option][no type]
type: Concept
definition: 1 [Energy][Fuels][Emissions][CO2][kt][no source][no method][no target][no option][no type]
status: valid
status modified: 2017-02-13
accepted date: 2017-02-13
in scheme: emissions_variables_MMR

1 [Energy][Fuels][Emissions][N2O][kt][no source][no method][no target][no option][no type]
type: Concept
definition: 1 [Energy][Fuels][Emissions][N2O][kt][no source][no method][no target][no option][no type]
status: valid
status modified: 2017-02-13
accepted date: 2017-02-13
in scheme: emissions_variables_MMR

1 [Energy][Fuels][Emissions][NH3][kt][no source][no method][no target][no option][no type]
type: Concept
definition: 1 [Energy][Fuels][Emissions][NH3][kt][no source][no method][no target][no option][no type]
status: valid
status modified: 2017-02-13
accepted date: 2017-02-13
in scheme: emissions_variables_MMR

1 [Energy][Fuels][Emissions][NMVOC][kt][no source][no method][no target][no option][no type]
type: Concept
definition: 1 [Energy][Fuels][Emissions][NMVOC][kt][no source][no method][no target][no option][no type]
status: valid
status modified: 2017-02-13
accepted date: 2017-02-13
in scheme: emissions_variables_MMR

1 [Energy][Fuels][Emissions][NOx][kt][no source][no method][no target][no option][no type]
type: Concept
definition: 1 [Energy][Fuels][Emissions][NOx][kt][no source][no method][no target][no option][no type]
status: valid
status modified: 2017-02-13
accepted date: 2017-02-13
in scheme: emissions_variables_MMR

1 [Energy][Fuels][Emissions][SO2][kt][no source][no method][no target][no option][no type]
type: Concept
definition: 1 [Energy][Fuels][Emissions][SO2][kt][no source][no method][no target][no option][no type]
status: valid
status modified: 2017-02-13
accepted date: 2017-02-13
in scheme: emissions_variables_MMR

1.A.1 [Energy Industries][Biomass][Emissions][CH4][kt][no source][no method][no target][no option][no type]
type: Concept
definition: 1.A.1 [Energy Industries][Biomass][Emissions][CH4][kt][no source][no method][no target][no option][no type]
status: valid
status modified: 2017-02-13
accepted date: 2017-02-13
in scheme: emissions_variables_MMR

1.A.1 [Energy Industries][Biomass][Emissions][CO2][kt][no source][no method][no target][no option][no type]
type: Concept
definition: 1.A.1 [Energy Industries][Biomass][Emissions][CO2][kt][no source][no method][no target][no option][no type]
status: valid
status modified: 2017-02-13
accepted date: 2017-02-13
in scheme: emissions_variables_MMR

1.A.1 [Energy Industries][Biomass][Emissions][N2O][kt][no source][no method][no target][no option][no type]
type: Concept
definition: 1.A.1 [Energy Industries][Biomass][Emissions][N2O][kt][no source][no method][no target][no option][no type]
status: valid
status modified: 2017-02-13
accepted date: 2017-02-13
in scheme: emissions_variables_MMR

1.A.1 [Energy Industries][Fuels][Emissions][Aggregate GHGs][kt CO2 equivalent][no source][no method][no target][no option][no type]
type: Concept
definition: 1.A.1 [Energy Industries][Fuels][Emissions][Aggregate GHGs][kt CO2 equivalent][no source][no method][no target][no option][no type]
status: valid
status modified: 2017-02-13
accepted date: 2017-02-13
in scheme: emissions_variables_MMR

1.A.1 [Energy Industries][Fuels][Emissions][CH4][kt][no source][no method][no target][no option][no type]
type: Concept
definition: 1.A.1 [Energy Industries][Fuels][Emissions][CH4][kt][no source][no method][no target][no option][no type]
status: valid
status modified: 2017-02-13
accepted date: 2017-02-13
in scheme: emissions_variables_MMR

1.A.1 [Energy Industries][Fuels][Emissions][CO][kt][no source][no method][no target][no option][no type]
type: Concept
definition: 1.A.1 [Energy Industries][Fuels][Emissions][CO][kt][no source][no method][no target][no option][no type]
status: valid
status modified: 2017-02-13
accepted date: 2017-02-13
in scheme: emissions_variables_MMR

1.A.1 [Energy Industries][Fuels][Emissions][CO2][kt][no source][no method][no target][no option][no type]
type: Concept
definition: 1.A.1 [Energy Industries][Fuels][Emissions][CO2][kt][no source][no method][no target][no option][no type]
status: valid
status modified: 2017-02-13
accepted date: 2017-02-13
in scheme: emissions_variables_MMR

1.A.1 [Energy Industries][Fuels][Emissions][N2O][kt][no source][no method][no target][no option][no type]
type: Concept
definition: 1.A.1 [Energy Industries][Fuels][Emissions][N2O][kt][no source][no method][no target][no option][no type]
status: valid
status modified: 2017-02-13
accepted date: 2017-02-13
in scheme: emissions_variables_MMR

1.A.1 [Energy Industries][Fuels][Emissions][NMVOC][kt][no source][no method][no target][no option][no type]
type: Concept
definition: 1.A.1 [Energy Industries][Fuels][Emissions][NMVOC][kt][no source][no method][no target][no option][no type]
status: valid
status modified: 2017-02-13
accepted date: 2017-02-13
in scheme: emissions_variables_MMR

1.A.1 [Energy Industries][Fuels][Emissions][NOx][kt][no source][no method][no target][no option][no type]
type: Concept
definition: 1.A.1 [Energy Industries][Fuels][Emissions][NOx][kt][no source][no method][no target][no option][no type]
status: valid
status modified: 2017-02-13
accepted date: 2017-02-13
in scheme: emissions_variables_MMR

1.A.1 [Energy Industries][Fuels][Emissions][SO2][kt][no source][no method][no target][no option][no type]
type: Concept
definition: 1.A.1 [Energy Industries][Fuels][Emissions][SO2][kt][no source][no method][no target][no option][no type]
status: valid
status modified: 2017-02-13
accepted date: 2017-02-13
in scheme: emissions_variables_MMR

1.A.1 [Energy Industries][Gaseous Fuels][Emissions][CH4][kt][no source][no method][no target][no option][no type]
type: Concept
definition: 1.A.1 [Energy Industries][Gaseous Fuels][Emissions][CH4][kt][no source][no method][no target][no option][no type]
status: valid
status modified: 2017-02-13
accepted date: 2017-02-13
in scheme: emissions_variables_MMR

1.A.1 [Energy Industries][Gaseous Fuels][Emissions][CO2][kt][no source][no method][no target][no option][no type]
type: Concept
definition: 1.A.1 [Energy Industries][Gaseous Fuels][Emissions][CO2][kt][no source][no method][no target][no option][no type]
status: valid
status modified: 2017-02-13
accepted date: 2017-02-13
in scheme: emissions_variables_MMR

1.A.1 [Energy Industries][Gaseous Fuels][Emissions][N2O][kt][no source][no method][no target][no option][no type]
type: Concept
definition: 1.A.1 [Energy Industries][Gaseous Fuels][Emissions][N2O][kt][no source][no method][no target][no option][no type]
status: valid
status modified: 2017-02-13
accepted date: 2017-02-13
in scheme: emissions_variables_MMR

1.A.1 [Energy Industries][Liquid Fuels][Emissions][CH4][kt][no source][no method][no target][no option][no type]
type: Concept
definition: 1.A.1 [Energy Industries][Liquid Fuels][Emissions][CH4][kt][no source][no method][no target][no option][no type]
status: valid
status modified: 2017-02-13
accepted date: 2017-02-13
in scheme: emissions_variables_MMR

1.A.1 [Energy Industries][Liquid Fuels][Emissions][CO2][kt][no source][no method][no target][no option][no type]
type: Concept
definition: 1.A.1 [Energy Industries][Liquid Fuels][Emissions][CO2][kt][no source][no method][no target][no option][no type]
status: valid
status modified: 2017-02-13
accepted date: 2017-02-13
in scheme: emissions_variables_MMR

1.A.1 [Energy Industries][Liquid Fuels][Emissions][N2O][kt][no source][no method][no target][no option][no type]
type: Concept
definition: 1.A.1 [Energy Industries][Liquid Fuels][Emissions][N2O][kt][no source][no method][no target][no option][no type]
status: valid
status modified: 2017-02-13
accepted date: 2017-02-13
in scheme: emissions_variables_MMR

1.A.1 [Energy Industries][Other Fossil Fuels][Emissions][CH4][kt][no source][no method][no target][no option][no type]
type: Concept
definition: 1.A.1 [Energy Industries][Other Fossil Fuels][Emissions][CH4][kt][no source][no method][no target][no option][no type]
status: valid
status modified: 2017-02-13
accepted date: 2017-02-13
in scheme: emissions_variables_MMR

1.A.1 [Energy Industries][Other Fossil Fuels][Emissions][CO2][kt][no source][no method][no target][no option][no type]
type: Concept
definition: 1.A.1 [Energy Industries][Other Fossil Fuels][Emissions][CO2][kt][no source][no method][no target][no option][no type]
status: valid
status modified: 2017-02-13
accepted date: 2017-02-13
in scheme: emissions_variables_MMR

1.A.1 [Energy Industries][Other Fossil Fuels][Emissions][N2O][kt][no source][no method][no target][no option][no type]
type: Concept
definition: 1.A.1 [Energy Industries][Other Fossil Fuels][Emissions][N2O][kt][no source][no method][no target][no option][no type]
status: valid
status modified: 2017-02-13
accepted date: 2017-02-13
in scheme: emissions_variables_MMR

1.A.1 [Energy Industries][Peat][Emissions][CH4][kt][no source][no method][no target][no option][no type]
type: Concept
definition: 1.A.1 [Energy Industries][Peat][Emissions][CH4][kt][no source][no method][no target][no option][no type]
status: valid
status modified: 2017-02-13
accepted date: 2017-02-13
in scheme: emissions_variables_MMR

1.A.1 [Energy Industries][Peat][Emissions][CO2][kt][no source][no method][no target][no option][no type]
type: Concept
definition: 1.A.1 [Energy Industries][Peat][Emissions][CO2][kt][no source][no method][no target][no option][no type]
status: valid
status modified: 2017-02-13
accepted date: 2017-02-13
in scheme: emissions_variables_MMR

1.A.1 [Energy Industries][Peat][Emissions][N2O][kt][no source][no method][no target][no option][no type]
type: Concept
definition: 1.A.1 [Energy Industries][Peat][Emissions][N2O][kt][no source][no method][no target][no option][no type]
status: valid
status modified: 2017-02-13
accepted date: 2017-02-13
in scheme: emissions_variables_MMR

1.A.1 [Energy Industries][Solid Fuels][Emissions][CH4][kt][no source][no method][no target][no option][no type]
type: Concept
definition: 1.A.1 [Energy Industries][Solid Fuels][Emissions][CH4][kt][no source][no method][no target][no option][no type]
status: valid
status modified: 2017-02-13
accepted date: 2017-02-13
in scheme: emissions_variables_MMR

1.A.1 [Energy Industries][Solid Fuels][Emissions][CO2][kt][no source][no method][no target][no option][no type]
type: Concept
definition: 1.A.1 [Energy Industries][Solid Fuels][Emissions][CO2][kt][no source][no method][no target][no option][no type]
status: valid
status modified: 2017-02-13
accepted date: 2017-02-13
in scheme: emissions_variables_MMR

1.A.1 [Energy Industries][Solid Fuels][Emissions][N2O][kt][no source][no method][no target][no option][no type]
type: Concept
definition: 1.A.1 [Energy Industries][Solid Fuels][Emissions][N2O][kt][no source][no method][no target][no option][no type]
status: valid
status modified: 2017-02-13
accepted date: 2017-02-13
in scheme: emissions_variables_MMR

1.A.1.a [Public Electricity and Heat Production][Biomass][Emissions][CH4][kt][no source][no method][no target][no option][no type]
type: Concept
definition: 1.A.1.a [Public Electricity and Heat Production][Biomass][Emissions][CH4][kt][no source][no method][no target][no option][no type]
status: valid
status modified: 2017-02-13
accepted date: 2017-02-13
in scheme: emissions_variables_MMR

1.A.1.a [Public Electricity and Heat Production][Biomass][Emissions][CO2][kt][no source][no method][no target][no option][no type]
type: Concept
definition: 1.A.1.a [Public Electricity and Heat Production][Biomass][Emissions][CO2][kt][no source][no method][no target][no option][no type]
status: valid
status modified: 2017-02-13
accepted date: 2017-02-13
in scheme: emissions_variables_MMR

1.A.1.a [Public Electricity and Heat Production][Biomass][Emissions][N2O][kt][no source][no method][no target][no option][no type]
type: Concept
definition: 1.A.1.a [Public Electricity and Heat Production][Biomass][Emissions][N2O][kt][no source][no method][no target][no option][no type]
status: valid
status modified: 2017-02-13
accepted date: 2017-02-13
in scheme: emissions_variables_MMR

1.A.1.a [Public Electricity and Heat Production][Fossil fuels][Emissions][CO2][kt][no source][no method][no target][no option][no type]
type: Concept
definition: 1.A.1.a [Public Electricity and Heat Production][Fossil fuels][Emissions][CO2][kt][no source][no method][no target][no option][no type]
status: valid
status modified: 2017-02-13
accepted date: 2017-02-13
in scheme: emissions_variables_MMR

1.A.1.a [Public Electricity and Heat Production][Fuels][Emissions][CH4][kt][no source][no method][no target][no option][no type]
type: Concept
definition: 1.A.1.a [Public Electricity and Heat Production][Fuels][Emissions][CH4][kt][no source][no method][no target][no option][no type]
status: valid
status modified: 2017-02-13
accepted date: 2017-02-13
in scheme: emissions_variables_MMR

1.A.1.a [Public Electricity and Heat Production][Fuels][Emissions][CO][kt][no source][no method][no target][no option][no type]
type: Concept
definition: 1.A.1.a [Public Electricity and Heat Production][Fuels][Emissions][CO][kt][no source][no method][no target][no option][no type]
status: valid
status modified: 2017-02-13
accepted date: 2017-02-13
in scheme: emissions_variables_MMR

1.A.1.a [Public Electricity and Heat Production][Fuels][Emissions][N2O][kt][no source][no method][no target][no option][no type]
type: Concept
definition: 1.A.1.a [Public Electricity and Heat Production][Fuels][Emissions][N2O][kt][no source][no method][no target][no option][no type]
status: valid
status modified: 2017-02-13
accepted date: 2017-02-13
in scheme: emissions_variables_MMR

1.A.1.a [Public Electricity and Heat Production][Fuels][Emissions][NMVOC][kt][no source][no method][no target][no option][no type]
type: Concept
definition: 1.A.1.a [Public Electricity and Heat Production][Fuels][Emissions][NMVOC][kt][no source][no method][no target][no option][no type]
status: valid
status modified: 2017-02-13
accepted date: 2017-02-13
in scheme: emissions_variables_MMR

1.A.1.a [Public Electricity and Heat Production][Fuels][Emissions][NOx][kt][no source][no method][no target][no option][no type]
type: Concept
definition: 1.A.1.a [Public Electricity and Heat Production][Fuels][Emissions][NOx][kt][no source][no method][no target][no option][no type]
status: valid
status modified: 2017-02-13
accepted date: 2017-02-13
in scheme: emissions_variables_MMR

1.A.1.a [Public Electricity and Heat Production][Fuels][Emissions][SO2][kt][no source][no method][no target][no option][no type]
type: Concept
definition: 1.A.1.a [Public Electricity and Heat Production][Fuels][Emissions][SO2][kt][no source][no method][no target][no option][no type]
status: valid
status modified: 2017-02-13
accepted date: 2017-02-13
in scheme: emissions_variables_MMR

1.A.1.a [Public Electricity and Heat Production][Gaseous Fuels][Emissions][CH4][kt][no source][no method][no target][no option][no type]
type: Concept
definition: 1.A.1.a [Public Electricity and Heat Production][Gaseous Fuels][Emissions][CH4][kt][no source][no method][no target][no option][no type]
status: valid
status modified: 2017-02-13
accepted date: 2017-02-13
in scheme: emissions_variables_MMR

1.A.1.a [Public Electricity and Heat Production][Gaseous Fuels][Emissions][CO2][kt][no source][no method][no target][no option][no type]
type: Concept
definition: 1.A.1.a [Public Electricity and Heat Production][Gaseous Fuels][Emissions][CO2][kt][no source][no method][no target][no option][no type]
status: valid
status modified: 2017-02-13
accepted date: 2017-02-13
in scheme: emissions_variables_MMR

1.A.1.a [Public Electricity and Heat Production][Gaseous Fuels][Emissions][N2O][kt][no source][no method][no target][no option][no type]
type: Concept
definition: 1.A.1.a [Public Electricity and Heat Production][Gaseous Fuels][Emissions][N2O][kt][no source][no method][no target][no option][no type]
status: valid
status modified: 2017-02-13
accepted date: 2017-02-13
in scheme: emissions_variables_MMR

1.A.1.a [Public Electricity and Heat Production][Liquid Fuels][Emissions][CH4][kt][no source][no method][no target][no option][no type]
type: Concept
definition: 1.A.1.a [Public Electricity and Heat Production][Liquid Fuels][Emissions][CH4][kt][no source][no method][no target][no option][no type]
status: valid
status modified: 2017-02-13
accepted date: 2017-02-13
in scheme: emissions_variables_MMR

1.A.1.a [Public Electricity and Heat Production][Liquid Fuels][Emissions][CO2][kt][no source][no method][no target][no option][no type]
type: Concept
definition: 1.A.1.a [Public Electricity and Heat Production][Liquid Fuels][Emissions][CO2][kt][no source][no method][no target][no option][no type]
status: valid
status modified: 2017-02-13
accepted date: 2017-02-13
in scheme: emissions_variables_MMR

1.A.1.a [Public Electricity and Heat Production][Liquid Fuels][Emissions][N2O][kt][no source][no method][no target][no option][no type]
type: Concept
definition: 1.A.1.a [Public Electricity and Heat Production][Liquid Fuels][Emissions][N2O][kt][no source][no method][no target][no option][no type]
status: valid
status modified: 2017-02-13
accepted date: 2017-02-13
in scheme: emissions_variables_MMR

1.A.1.a [Public Electricity and Heat Production][Other Fossil Fuels][Emissions][CH4][kt][no source][no method][no target][no option][no type]
type: Concept
definition: 1.A.1.a [Public Electricity and Heat Production][Other Fossil Fuels][Emissions][CH4][kt][no source][no method][no target][no option][no type]
status: valid
status modified: 2017-02-13
accepted date: 2017-02-13
in scheme: emissions_variables_MMR

1.A.1.a [Public Electricity and Heat Production][Other Fossil Fuels][Emissions][CO2][kt][no source][no method][no target][no option][no type]
type: Concept
definition: 1.A.1.a [Public Electricity and Heat Production][Other Fossil Fuels][Emissions][CO2][kt][no source][no method][no target][no option][no type]
status: valid
status modified: 2017-02-13
accepted date: 2017-02-13
in scheme: emissions_variables_MMR

1.A.1.a [Public Electricity and Heat Production][Other Fossil Fuels][Emissions][N2O][kt][no source][no method][no target][no option][no type]
type: Concept
definition: 1.A.1.a [Public Electricity and Heat Production][Other Fossil Fuels][Emissions][N2O][kt][no source][no method][no target][no option][no type]
status: valid
status modified: 2017-02-13
accepted date: 2017-02-13
in scheme: emissions_variables_MMR

1.A.1.a [Public Electricity and Heat Production][Peat][Emissions][CH4][kt][no source][no method][no target][no option][no type]
type: Concept
definition: 1.A.1.a [Public Electricity and Heat Production][Peat][Emissions][CH4][kt][no source][no method][no target][no option][no type]
status: valid
status modified: 2017-02-13
accepted date: 2017-02-13
in scheme: emissions_variables_MMR

1.A.1.a [Public Electricity and Heat Production][Peat][Emissions][CO2][kt][no source][no method][no target][no option][no type]
type: Concept
definition: 1.A.1.a [Public Electricity and Heat Production][Peat][Emissions][CO2][kt][no source][no method][no target][no option][no type]
status: valid
status modified: 2017-02-13
accepted date: 2017-02-13
in scheme: emissions_variables_MMR

1.A.1.a [Public Electricity and Heat Production][Peat][Emissions][N2O][kt][no source][no method][no target][no option][no type]
type: Concept
definition: 1.A.1.a [Public Electricity and Heat Production][Peat][Emissions][N2O][kt][no source][no method][no target][no option][no type]
status: valid
status modified: 2017-02-13
accepted date: 2017-02-13
in scheme: emissions_variables_MMR

1.A.1.a [Public Electricity and Heat Production][Solid Fuels][Emissions][CH4][kt][no source][no method][no target][no option][no type]
type: Concept
definition: 1.A.1.a [Public Electricity and Heat Production][Solid Fuels][Emissions][CH4][kt][no source][no method][no target][no option][no type]
status: valid
status modified: 2017-02-13
accepted date: 2017-02-13
in scheme: emissions_variables_MMR

1.A.1.a [Public Electricity and Heat Production][Solid Fuels][Emissions][CO2][kt][no source][no method][no target][no option][no type]
type: Concept
definition: 1.A.1.a [Public Electricity and Heat Production][Solid Fuels][Emissions][CO2][kt][no source][no method][no target][no option][no type]
status: valid
status modified: 2017-02-13
accepted date: 2017-02-13
in scheme: emissions_variables_MMR

1.A.1.a [Public Electricity and Heat Production][Solid Fuels][Emissions][N2O][kt][no source][no method][no target][no option][no type]
type: Concept
definition: 1.A.1.a [Public Electricity and Heat Production][Solid Fuels][Emissions][N2O][kt][no source][no method][no target][no option][no type]
status: valid
status modified: 2017-02-13
accepted date: 2017-02-13
in scheme: emissions_variables_MMR

1.A.1.a.i [Electricity Generation][Biomass][Emissions][CH4][kt][no source][no method][no target][no option][no type]
type: Concept
definition: 1.A.1.a.i [Electricity Generation][Biomass][Emissions][CH4][kt][no source][no method][no target][no option][no type]
status: valid
status modified: 2017-02-13
accepted date: 2017-02-13
in scheme: emissions_variables_MMR

1.A.1.a.i [Electricity Generation][Biomass][Emissions][CO2][kt][no source][no method][no target][no option][no type]
type: Concept
definition: 1.A.1.a.i [Electricity Generation][Biomass][Emissions][CO2][kt][no source][no method][no target][no option][no type]
status: valid
status modified: 2017-02-13
accepted date: 2017-02-13
in scheme: emissions_variables_MMR

1.A.1.a.i [Electricity Generation][Biomass][Emissions][N2O][kt][no source][no method][no target][no option][no type]
type: Concept
definition: 1.A.1.a.i [Electricity Generation][Biomass][Emissions][N2O][kt][no source][no method][no target][no option][no type]
status: valid
status modified: 2017-02-13
accepted date: 2017-02-13
in scheme: emissions_variables_MMR

1.A.1.a.i [Electricity Generation][Fuels][Emissions][CH4][kt][no source][no method][no target][no option][no type]
type: Concept
definition: 1.A.1.a.i [Electricity Generation][Fuels][Emissions][CH4][kt][no source][no method][no target][no option][no type]
status: valid
status modified: 2017-02-13
accepted date: 2017-02-13
in scheme: emissions_variables_MMR

1.A.1.a.i [Electricity Generation][Fuels][Emissions][CO2][kt][no source][no method][no target][no option][no type]
type: Concept
definition: 1.A.1.a.i [Electricity Generation][Fuels][Emissions][CO2][kt][no source][no method][no target][no option][no type]
status: valid
status modified: 2017-02-13
accepted date: 2017-02-13
in scheme: emissions_variables_MMR

1.A.1.a.i [Electricity Generation][Fuels][Emissions][N2O][kt][no source][no method][no target][no option][no type]
type: Concept
definition: 1.A.1.a.i [Electricity Generation][Fuels][Emissions][N2O][kt][no source][no method][no target][no option][no type]
status: valid
status modified: 2017-02-13
accepted date: 2017-02-13
in scheme: emissions_variables_MMR

1.A.1.a.i [Electricity Generation][Gaseous Fuels][Emissions][CH4][kt][no source][no method][no target][no option][no type]
type: Concept
definition: 1.A.1.a.i [Electricity Generation][Gaseous Fuels][Emissions][CH4][kt][no source][no method][no target][no option][no type]
status: valid
status modified: 2017-02-13
accepted date: 2017-02-13
in scheme: emissions_variables_MMR

1.A.1.a.i [Electricity Generation][Gaseous Fuels][Emissions][CO2][kt][no source][no method][no target][no option][no type]
type: Concept
definition: 1.A.1.a.i [Electricity Generation][Gaseous Fuels][Emissions][CO2][kt][no source][no method][no target][no option][no type]
status: valid
status modified: 2017-02-13
accepted date: 2017-02-13
in scheme: emissions_variables_MMR

1.A.1.a.i [Electricity Generation][Gaseous Fuels][Emissions][N2O][kt][no source][no method][no target][no option][no type]
type: Concept
definition: 1.A.1.a.i [Electricity Generation][Gaseous Fuels][Emissions][N2O][kt][no source][no method][no target][no option][no type]
status: valid
status modified: 2017-02-13
accepted date: 2017-02-13
in scheme: emissions_variables_MMR

1.A.1.a.i [Electricity Generation][Liquid Fuels][Emissions][CH4][kt][no source][no method][no target][no option][no type]
type: Concept
definition: 1.A.1.a.i [Electricity Generation][Liquid Fuels][Emissions][CH4][kt][no source][no method][no target][no option][no type]
status: valid
status modified: 2017-02-13
accepted date: 2017-02-13
in scheme: emissions_variables_MMR

1.A.1.a.i [Electricity Generation][Liquid Fuels][Emissions][CO2][kt][no source][no method][no target][no option][no type]
type: Concept
definition: 1.A.1.a.i [Electricity Generation][Liquid Fuels][Emissions][CO2][kt][no source][no method][no target][no option][no type]
status: valid
status modified: 2017-02-13
accepted date: 2017-02-13
in scheme: emissions_variables_MMR

1.A.1.a.i [Electricity Generation][Liquid Fuels][Emissions][N2O][kt][no source][no method][no target][no option][no type]
type: Concept
definition: 1.A.1.a.i [Electricity Generation][Liquid Fuels][Emissions][N2O][kt][no source][no method][no target][no option][no type]
status: valid
status modified: 2017-02-13
accepted date: 2017-02-13
in scheme: emissions_variables_MMR

1.A.1.a.i [Electricity Generation][Other Fossil Fuels][Emissions][CH4][kt][no source][no method][no target][no option][no type]
type: Concept
definition: 1.A.1.a.i [Electricity Generation][Other Fossil Fuels][Emissions][CH4][kt][no source][no method][no target][no option][no type]
status: valid
status modified: 2017-02-13
accepted date: 2017-02-13
in scheme: emissions_variables_MMR

1.A.1.a.i [Electricity Generation][Other Fossil Fuels][Emissions][CO2][kt][no source][no method][no target][no option][no type]
type: Concept
definition: 1.A.1.a.i [Electricity Generation][Other Fossil Fuels][Emissions][CO2][kt][no source][no method][no target][no option][no type]
status: valid
status modified: 2017-02-13
accepted date: 2017-02-13
in scheme: emissions_variables_MMR

1.A.1.a.i [Electricity Generation][Other Fossil Fuels][Emissions][N2O][kt][no source][no method][no target][no option][no type]
type: Concept
definition: 1.A.1.a.i [Electricity Generation][Other Fossil Fuels][Emissions][N2O][kt][no source][no method][no target][no option][no type]
status: valid
status modified: 2017-02-13
accepted date: 2017-02-13
in scheme: emissions_variables_MMR

1.A.1.a.i [Electricity Generation][Peat][Emissions][CH4][kt][no source][no method][no target][no option][no type]
type: Concept
definition: 1.A.1.a.i [Electricity Generation][Peat][Emissions][CH4][kt][no source][no method][no target][no option][no type]
status: valid
status modified: 2017-02-13
accepted date: 2017-02-13
in scheme: emissions_variables_MMR

1.A.1.a.i [Electricity Generation][Peat][Emissions][CO2][kt][no source][no method][no target][no option][no type]
type: Concept
definition: 1.A.1.a.i [Electricity Generation][Peat][Emissions][CO2][kt][no source][no method][no target][no option][no type]
status: valid
status modified: 2017-02-13
accepted date: 2017-02-13
in scheme: emissions_variables_MMR

1.A.1.a.i [Electricity Generation][Peat][Emissions][N2O][kt][no source][no method][no target][no option][no type]
type: Concept
definition: 1.A.1.a.i [Electricity Generation][Peat][Emissions][N2O][kt][no source][no method][no target][no option][no type]
status: valid
status modified: 2017-02-13
accepted date: 2017-02-13
in scheme: emissions_variables_MMR

1.A.1.a.i [Electricity Generation][Solid Fuels][Emissions][CH4][kt][no source][no method][no target][no option][no type]
type: Concept
definition: 1.A.1.a.i [Electricity Generation][Solid Fuels][Emissions][CH4][kt][no source][no method][no target][no option][no type]
status: valid
status modified: 2017-02-13
accepted date: 2017-02-13
in scheme: emissions_variables_MMR

1.A.1.a.i [Electricity Generation][Solid Fuels][Emissions][CO2][kt][no source][no method][no target][no option][no type]
type: Concept
definition: 1.A.1.a.i [Electricity Generation][Solid Fuels][Emissions][CO2][kt][no source][no method][no target][no option][no type]
status: valid
status modified: 2017-02-13
accepted date: 2017-02-13
in scheme: emissions_variables_MMR

1.A.1.a.i [Electricity Generation][Solid Fuels][Emissions][N2O][kt][no source][no method][no target][no option][no type]
type: Concept
definition: 1.A.1.a.i [Electricity Generation][Solid Fuels][Emissions][N2O][kt][no source][no method][no target][no option][no type]
status: valid
status modified: 2017-02-13
accepted date: 2017-02-13
in scheme: emissions_variables_MMR

1.A.1.a.ii [Combined heat and power generation][Biomass][Emissions][CH4][kt][no source][no method][no target][no option][no type]
type: Concept
definition: 1.A.1.a.ii [Combined heat and power generation][Biomass][Emissions][CH4][kt][no source][no method][no target][no option][no type]
status: valid
status modified: 2017-02-13
accepted date: 2017-02-13
in scheme: emissions_variables_MMR

1.A.1.a.ii [Combined heat and power generation][Biomass][Emissions][CO2][kt][no source][no method][no target][no option][no type]
type: Concept
definition: 1.A.1.a.ii [Combined heat and power generation][Biomass][Emissions][CO2][kt][no source][no method][no target][no option][no type]
status: valid
status modified: 2017-02-13
accepted date: 2017-02-13
in scheme: emissions_variables_MMR

1.A.1.a.ii [Combined heat and power generation][Biomass][Emissions][N2O][kt][no source][no method][no target][no option][no type]
type: Concept
definition: 1.A.1.a.ii [Combined heat and power generation][Biomass][Emissions][N2O][kt][no source][no method][no target][no option][no type]
status: valid
status modified: 2017-02-13
accepted date: 2017-02-13
in scheme: emissions_variables_MMR

1.A.1.a.ii [Combined heat and power generation][Fuels][Emissions][CH4][kt][no source][no method][no target][no option][no type]
type: Concept
definition: 1.A.1.a.ii [Combined heat and power generation][Fuels][Emissions][CH4][kt][no source][no method][no target][no option][no type]
status: valid
status modified: 2017-02-13
accepted date: 2017-02-13
in scheme: emissions_variables_MMR

1.A.1.a.ii [Combined heat and power generation][Fuels][Emissions][CO2][kt][no source][no method][no target][no option][no type]
type: Concept
definition: 1.A.1.a.ii [Combined heat and power generation][Fuels][Emissions][CO2][kt][no source][no method][no target][no option][no type]
status: valid
status modified: 2017-02-13
accepted date: 2017-02-13
in scheme: emissions_variables_MMR

1.A.1.a.ii [Combined heat and power generation][Fuels][Emissions][N2O][kt][no source][no method][no target][no option][no type]
type: Concept
definition: 1.A.1.a.ii [Combined heat and power generation][Fuels][Emissions][N2O][kt][no source][no method][no target][no option][no type]
status: valid
status modified: 2017-02-13
accepted date: 2017-02-13
in scheme: emissions_variables_MMR

1.A.1.a.ii [Combined heat and power generation][Gaseous Fuels][Emissions][CH4][kt][no source][no method][no target][no option][no type]
type: Concept
definition: 1.A.1.a.ii [Combined heat and power generation][Gaseous Fuels][Emissions][CH4][kt][no source][no method][no target][no option][no type]
status: valid
status modified: 2017-02-13
accepted date: 2017-02-13
in scheme: emissions_variables_MMR

1.A.1.a.ii [Combined heat and power generation][Gaseous Fuels][Emissions][CO2][kt][no source][no method][no target][no option][no type]
type: Concept
definition: 1.A.1.a.ii [Combined heat and power generation][Gaseous Fuels][Emissions][CO2][kt][no source][no method][no target][no option][no type]
status: valid
status modified: 2017-02-13
accepted date: 2017-02-13
in scheme: emissions_variables_MMR

1.A.1.a.ii [Combined heat and power generation][Gaseous Fuels][Emissions][N2O][kt][no source][no method][no target][no option][no type]
type: Concept
definition: 1.A.1.a.ii [Combined heat and power generation][Gaseous Fuels][Emissions][N2O][kt][no source][no method][no target][no option][no type]
status: valid
status modified: 2017-02-13
accepted date: 2017-02-13
in scheme: emissions_variables_MMR

1.A.1.a.ii [Combined heat and power generation][Liquid Fuels][Emissions][CH4][kt][no source][no method][no target][no option][no type]
type: Concept
definition: 1.A.1.a.ii [Combined heat and power generation][Liquid Fuels][Emissions][CH4][kt][no source][no method][no target][no option][no type]
status: valid
status modified: 2017-02-13
accepted date: 2017-02-13
in scheme: emissions_variables_MMR

1.A.1.a.ii [Combined heat and power generation][Liquid Fuels][Emissions][CO2][kt][no source][no method][no target][no option][no type]
type: Concept
definition: 1.A.1.a.ii [Combined heat and power generation][Liquid Fuels][Emissions][CO2][kt][no source][no method][no target][no option][no type]
status: valid
status modified: 2017-02-13
accepted date: 2017-02-13
in scheme: emissions_variables_MMR

1.A.1.a.ii [Combined heat and power generation][Liquid Fuels][Emissions][N2O][kt][no source][no method][no target][no option][no type]
type: Concept
definition: 1.A.1.a.ii [Combined heat and power generation][Liquid Fuels][Emissions][N2O][kt][no source][no method][no target][no option][no type]
status: valid
status modified: 2017-02-13
accepted date: 2017-02-13
in scheme: emissions_variables_MMR

1.A.1.a.ii [Combined heat and power generation][Other Fossil Fuels][Emissions][CH4][kt][no source][no method][no target][no option][no type]
type: Concept
definition: 1.A.1.a.ii [Combined heat and power generation][Other Fossil Fuels][Emissions][CH4][kt][no source][no method][no target][no option][no type]
status: valid
status modified: 2017-02-13
accepted date: 2017-02-13
in scheme: emissions_variables_MMR

1.A.1.a.ii [Combined heat and power generation][Other Fossil Fuels][Emissions][CO2][kt][no source][no method][no target][no option][no type]
type: Concept
definition: 1.A.1.a.ii [Combined heat and power generation][Other Fossil Fuels][Emissions][CO2][kt][no source][no method][no target][no option][no type]
status: valid
status modified: 2017-02-13
accepted date: 2017-02-13
in scheme: emissions_variables_MMR

1.A.1.a.ii [Combined heat and power generation][Other Fossil Fuels][Emissions][N2O][kt][no source][no method][no target][no option][no type]
type: Concept
definition: 1.A.1.a.ii [Combined heat and power generation][Other Fossil Fuels][Emissions][N2O][kt][no source][no method][no target][no option][no type]
status: valid
status modified: 2017-02-13
accepted date: 2017-02-13
in scheme: emissions_variables_MMR

1.A.1.a.ii [Combined heat and power generation][Peat][Emissions][CH4][kt][no source][no method][no target][no option][no type]
type: Concept
definition: 1.A.1.a.ii [Combined heat and power generation][Peat][Emissions][CH4][kt][no source][no method][no target][no option][no type]
status: valid
status modified: 2017-02-13
accepted date: 2017-02-13
in scheme: emissions_variables_MMR

1.A.1.a.ii [Combined heat and power generation][Peat][Emissions][CO2][kt][no source][no method][no target][no option][no type]
type: Concept
definition: 1.A.1.a.ii [Combined heat and power generation][Peat][Emissions][CO2][kt][no source][no method][no target][no option][no type]
status: valid
status modified: 2017-02-13
accepted date: 2017-02-13
in scheme: emissions_variables_MMR

1.A.1.a.ii [Combined heat and power generation][Peat][Emissions][N2O][kt][no source][no method][no target][no option][no type]
type: Concept
definition: 1.A.1.a.ii [Combined heat and power generation][Peat][Emissions][N2O][kt][no source][no method][no target][no option][no type]
status: valid
status modified: 2017-02-13
accepted date: 2017-02-13
in scheme: emissions_variables_MMR

1.A.1.a.ii [Combined heat and power generation][Solid Fuels][Emissions][CH4][kt][no source][no method][no target][no option][no type]
type: Concept
definition: 1.A.1.a.ii [Combined heat and power generation][Solid Fuels][Emissions][CH4][kt][no source][no method][no target][no option][no type]
status: valid
status modified: 2017-02-13
accepted date: 2017-02-13
in scheme: emissions_variables_MMR

1.A.1.a.ii [Combined heat and power generation][Solid Fuels][Emissions][CO2][kt][no source][no method][no target][no option][no type]
type: Concept
definition: 1.A.1.a.ii [Combined heat and power generation][Solid Fuels][Emissions][CO2][kt][no source][no method][no target][no option][no type]
status: valid
status modified: 2017-02-13
accepted date: 2017-02-13
in scheme: emissions_variables_MMR

1.A.1.a.ii [Combined heat and power generation][Solid Fuels][Emissions][N2O][kt][no source][no method][no target][no option][no type]
type: Concept
definition: 1.A.1.a.ii [Combined heat and power generation][Solid Fuels][Emissions][N2O][kt][no source][no method][no target][no option][no type]
status: valid
status modified: 2017-02-13
accepted date: 2017-02-13
in scheme: emissions_variables_MMR

1.A.1.a.iii [Heat plants][Biomass][Emissions][CH4][kt][no source][no method][no target][no option][no type]
type: Concept
definition: 1.A.1.a.iii [Heat plants][Biomass][Emissions][CH4][kt][no source][no method][no target][no option][no type]
status: valid
status modified: 2017-02-13
accepted date: 2017-02-13
in scheme: emissions_variables_MMR

1.A.1.a.iii [Heat plants][Biomass][Emissions][CO2][kt][no source][no method][no target][no option][no type]
type: Concept
definition: 1.A.1.a.iii [Heat plants][Biomass][Emissions][CO2][kt][no source][no method][no target][no option][no type]
status: valid
status modified: 2017-02-13
accepted date: 2017-02-13
in scheme: emissions_variables_MMR

1.A.1.a.iii [Heat plants][Biomass][Emissions][N2O][kt][no source][no method][no target][no option][no type]
type: Concept
definition: 1.A.1.a.iii [Heat plants][Biomass][Emissions][N2O][kt][no source][no method][no target][no option][no type]
status: valid
status modified: 2017-02-13
accepted date: 2017-02-13
in scheme: emissions_variables_MMR

1.A.1.a.iii [Heat plants][Fuels][Emissions][CH4][kt][no source][no method][no target][no option][no type]
type: Concept
definition: 1.A.1.a.iii [Heat plants][Fuels][Emissions][CH4][kt][no source][no method][no target][no option][no type]
status: valid
status modified: 2017-02-13
accepted date: 2017-02-13
in scheme: emissions_variables_MMR

1.A.1.a.iii [Heat plants][Fuels][Emissions][CO2][kt][no source][no method][no target][no option][no type]
type: Concept
definition: 1.A.1.a.iii [Heat plants][Fuels][Emissions][CO2][kt][no source][no method][no target][no option][no type]
status: valid
status modified: 2017-02-13
accepted date: 2017-02-13
in scheme: emissions_variables_MMR

1.A.1.a.iii [Heat plants][Fuels][Emissions][N2O][kt][no source][no method][no target][no option][no type]
type: Concept
definition: 1.A.1.a.iii [Heat plants][Fuels][Emissions][N2O][kt][no source][no method][no target][no option][no type]
status: valid
status modified: 2017-02-13
accepted date: 2017-02-13
in scheme: emissions_variables_MMR

1.A.1.a.iii [Heat plants][Gaseous Fuels][Emissions][CH4][kt][no source][no method][no target][no option][no type]
type: Concept
definition: 1.A.1.a.iii [Heat plants][Gaseous Fuels][Emissions][CH4][kt][no source][no method][no target][no option][no type]
status: valid
status modified: 2017-02-13
accepted date: 2017-02-13
in scheme: emissions_variables_MMR

1.A.1.a.iii [Heat plants][Gaseous Fuels][Emissions][CO2][kt][no source][no method][no target][no option][no type]
type: Concept
definition: 1.A.1.a.iii [Heat plants][Gaseous Fuels][Emissions][CO2][kt][no source][no method][no target][no option][no type]
status: valid
status modified: 2017-02-13
accepted date: 2017-02-13
in scheme: emissions_variables_MMR

1.A.1.a.iii [Heat plants][Gaseous Fuels][Emissions][N2O][kt][no source][no method][no target][no option][no type]
type: Concept
definition: 1.A.1.a.iii [Heat plants][Gaseous Fuels][Emissions][N2O][kt][no source][no method][no target][no option][no type]
status: valid
status modified: 2017-02-13
accepted date: 2017-02-13
in scheme: emissions_variables_MMR

1.A.1.a.iii [Heat plants][Liquid Fuels][Emissions][CH4][kt][no source][no method][no target][no option][no type]
type: Concept
definition: 1.A.1.a.iii [Heat plants][Liquid Fuels][Emissions][CH4][kt][no source][no method][no target][no option][no type]
status: valid
status modified: 2017-02-13
accepted date: 2017-02-13
in scheme: emissions_variables_MMR

1.A.1.a.iii [Heat plants][Liquid Fuels][Emissions][CO2][kt][no source][no method][no target][no option][no type]
type: Concept
definition: 1.A.1.a.iii [Heat plants][Liquid Fuels][Emissions][CO2][kt][no source][no method][no target][no option][no type]
status: valid
status modified: 2017-02-13
accepted date: 2017-02-13
in scheme: emissions_variables_MMR

1.A.1.a.iii [Heat plants][Liquid Fuels][Emissions][N2O][kt][no source][no method][no target][no option][no type]
type: Concept
definition: 1.A.1.a.iii [Heat plants][Liquid Fuels][Emissions][N2O][kt][no source][no method][no target][no option][no type]
status: valid
status modified: 2017-02-13
accepted date: 2017-02-13
in scheme: emissions_variables_MMR

1.A.1.a.iii [Heat plants][Other Fossil Fuels][Emissions][CH4][kt][no source][no method][no target][no option][no type]
type: Concept
definition: 1.A.1.a.iii [Heat plants][Other Fossil Fuels][Emissions][CH4][kt][no source][no method][no target][no option][no type]
status: valid
status modified: 2017-02-13
accepted date: 2017-02-13
in scheme: emissions_variables_MMR

1.A.1.a.iii [Heat plants][Other Fossil Fuels][Emissions][CO2][kt][no source][no method][no target][no option][no type]
type: Concept
definition: 1.A.1.a.iii [Heat plants][Other Fossil Fuels][Emissions][CO2][kt][no source][no method][no target][no option][no type]
status: valid
status modified: 2017-02-13
accepted date: 2017-02-13
in scheme: emissions_variables_MMR

1.A.1.a.iii [Heat plants][Other Fossil Fuels][Emissions][N2O][kt][no source][no method][no target][no option][no type]
type: Concept
definition: 1.A.1.a.iii [Heat plants][Other Fossil Fuels][Emissions][N2O][kt][no source][no method][no target][no option][no type]
status: valid
status modified: 2017-02-13
accepted date: 2017-02-13
in scheme: emissions_variables_MMR

1.A.1.a.iii [Heat plants][Peat][Emissions][CH4][kt][no source][no method][no target][no option][no type]
type: Concept
definition: 1.A.1.a.iii [Heat plants][Peat][Emissions][CH4][kt][no source][no method][no target][no option][no type]
status: valid
status modified: 2017-02-13
accepted date: 2017-02-13
in scheme: emissions_variables_MMR

1.A.1.a.iii [Heat plants][Peat][Emissions][CO2][kt][no source][no method][no target][no option][no type]
type: Concept
definition: 1.A.1.a.iii [Heat plants][Peat][Emissions][CO2][kt][no source][no method][no target][no option][no type]
status: valid
status modified: 2017-02-13
accepted date: 2017-02-13
in scheme: emissions_variables_MMR

1.A.1.a.iii [Heat plants][Peat][Emissions][N2O][kt][no source][no method][no target][no option][no type]
type: Concept
definition: 1.A.1.a.iii [Heat plants][Peat][Emissions][N2O][kt][no source][no method][no target][no option][no type]
status: valid
status modified: 2017-02-13
accepted date: 2017-02-13
in scheme: emissions_variables_MMR

1.A.1.a.iii [Heat plants][Solid Fuels][Emissions][CH4][kt][no source][no method][no target][no option][no type]
type: Concept
definition: 1.A.1.a.iii [Heat plants][Solid Fuels][Emissions][CH4][kt][no source][no method][no target][no option][no type]
status: valid
status modified: 2017-02-13
accepted date: 2017-02-13
in scheme: emissions_variables_MMR

1.A.1.a.iii [Heat plants][Solid Fuels][Emissions][CO2][kt][no source][no method][no target][no option][no type]
type: Concept
definition: 1.A.1.a.iii [Heat plants][Solid Fuels][Emissions][CO2][kt][no source][no method][no target][no option][no type]
status: valid
status modified: 2017-02-13
accepted date: 2017-02-13
in scheme: emissions_variables_MMR

1.A.1.a.iii [Heat plants][Solid Fuels][Emissions][N2O][kt][no source][no method][no target][no option][no type]
type: Concept
definition: 1.A.1.a.iii [Heat plants][Solid Fuels][Emissions][N2O][kt][no source][no method][no target][no option][no type]
status: valid
status modified: 2017-02-13
accepted date: 2017-02-13
in scheme: emissions_variables_MMR

1.A.1.a.iv [Other Public Electricity and Heat Production][Biomass][Emissions][CH4][kt][no source][no method][no target][no option][no type]
type: Concept
definition: 1.A.1.a.iv [Other Public Electricity and Heat Production][Biomass][Emissions][CH4][kt][no source][no method][no target][no option][no type]
status: valid
status modified: 2017-02-13
accepted date: 2017-02-13
in scheme: emissions_variables_MMR

1.A.1.a.iv [Other Public Electricity and Heat Production][Biomass][Emissions][CO2][kt][no source][no method][no target][no option][no type]
type: Concept
definition: 1.A.1.a.iv [Other Public Electricity and Heat Production][Biomass][Emissions][CO2][kt][no source][no method][no target][no option][no type]
status: valid
status modified: 2017-02-13
accepted date: 2017-02-13
in scheme: emissions_variables_MMR

1.A.1.a.iv [Other Public Electricity and Heat Production][Biomass][Emissions][N2O][kt][no source][no method][no target][no option][no type]
type: Concept
definition: 1.A.1.a.iv [Other Public Electricity and Heat Production][Biomass][Emissions][N2O][kt][no source][no method][no target][no option][no type]
status: valid
status modified: 2017-02-13
accepted date: 2017-02-13
in scheme: emissions_variables_MMR

1.A.1.a.iv [Other Public Electricity and Heat Production][Fuels][Emissions][CH4][kt][no source][no method][no target][no option][no type]
type: Concept
definition: 1.A.1.a.iv [Other Public Electricity and Heat Production][Fuels][Emissions][CH4][kt][no source][no method][no target][no option][no type]
status: valid
status modified: 2017-02-13
accepted date: 2017-02-13
in scheme: emissions_variables_MMR

1.A.1.a.iv [Other Public Electricity and Heat Production][Fuels][Emissions][CO2][kt][no source][no method][no target][no option][no type]
type: Concept
definition: 1.A.1.a.iv [Other Public Electricity and Heat Production][Fuels][Emissions][CO2][kt][no source][no method][no target][no option][no type]
status: valid
status modified: 2017-02-13
accepted date: 2017-02-13
in scheme: emissions_variables_MMR

1.A.1.a.iv [Other Public Electricity and Heat Production][Fuels][Emissions][N2O][kt][no source][no method][no target][no option][no type]
type: Concept
definition: 1.A.1.a.iv [Other Public Electricity and Heat Production][Fuels][Emissions][N2O][kt][no source][no method][no target][no option][no type]
status: valid
status modified: 2017-02-13
accepted date: 2017-02-13
in scheme: emissions_variables_MMR

1.A.1.a.iv [Other Public Electricity and Heat Production][Gaseous Fuels][Emissions][CH4][kt][no source][no method][no target][no option][no type]
type: Concept
definition: 1.A.1.a.iv [Other Public Electricity and Heat Production][Gaseous Fuels][Emissions][CH4][kt][no source][no method][no target][no option][no type]
status: valid
status modified: 2017-02-13
accepted date: 2017-02-13
in scheme: emissions_variables_MMR

1.A.1.a.iv [Other Public Electricity and Heat Production][Gaseous Fuels][Emissions][CO2][kt][no source][no method][no target][no option][no type]
type: Concept
definition: 1.A.1.a.iv [Other Public Electricity and Heat Production][Gaseous Fuels][Emissions][CO2][kt][no source][no method][no target][no option][no type]
status: valid
status modified: 2017-02-13
accepted date: 2017-02-13
in scheme: emissions_variables_MMR

1.A.1.a.iv [Other Public Electricity and Heat Production][Gaseous Fuels][Emissions][N2O][kt][no source][no method][no target][no option][no type]
type: Concept
definition: 1.A.1.a.iv [Other Public Electricity and Heat Production][Gaseous Fuels][Emissions][N2O][kt][no source][no method][no target][no option][no type]
status: valid
status modified: 2017-02-13
accepted date: 2017-02-13
in scheme: emissions_variables_MMR

1.A.1.a.iv [Other Public Electricity and Heat Production][Liquid Fuels][Emissions][CH4][kt][no source][no method][no target][no option][no type]
type: Concept
definition: 1.A.1.a.iv [Other Public Electricity and Heat Production][Liquid Fuels][Emissions][CH4][kt][no source][no method][no target][no option][no type]
status: valid
status modified: 2017-02-13
accepted date: 2017-02-13
in scheme: emissions_variables_MMR

1.A.1.a.iv [Other Public Electricity and Heat Production][Liquid Fuels][Emissions][CO2][kt][no source][no method][no target][no option][no type]
type: Concept
definition: 1.A.1.a.iv [Other Public Electricity and Heat Production][Liquid Fuels][Emissions][CO2][kt][no source][no method][no target][no option][no type]
status: valid
status modified: 2017-02-13
accepted date: 2017-02-13
in scheme: emissions_variables_MMR

1.A.1.a.iv [Other Public Electricity and Heat Production][Liquid Fuels][Emissions][N2O][kt][no source][no method][no target][no option][no type]
type: Concept
definition: 1.A.1.a.iv [Other Public Electricity and Heat Production][Liquid Fuels][Emissions][N2O][kt][no source][no method][no target][no option][no type]
status: valid
status modified: 2017-02-13
accepted date: 2017-02-13
in scheme: emissions_variables_MMR

1.A.1.a.iv [Other Public Electricity and Heat Production][Other Fossil Fuels][Emissions][CH4][kt][no source][no method][no target][no option][no type]
type: Concept
definition: 1.A.1.a.iv [Other Public Electricity and Heat Production][Other Fossil Fuels][Emissions][CH4][kt][no source][no method][no target][no option][no type]
status: valid
status modified: 2017-02-13
accepted date: 2017-02-13
in scheme: emissions_variables_MMR

1.A.1.a.iv [Other Public Electricity and Heat Production][Other Fossil Fuels][Emissions][CO2][kt][no source][no method][no target][no option][no type]
type: Concept
definition: 1.A.1.a.iv [Other Public Electricity and Heat Production][Other Fossil Fuels][Emissions][CO2][kt][no source][no method][no target][no option][no type]
status: valid
status modified: 2017-02-13
accepted date: 2017-02-13
in scheme: emissions_variables_MMR

1.A.1.a.iv [Other Public Electricity and Heat Production][Other Fossil Fuels][Emissions][N2O][kt][no source][no method][no target][no option][no type]
type: Concept
definition: 1.A.1.a.iv [Other Public Electricity and Heat Production][Other Fossil Fuels][Emissions][N2O][kt][no source][no method][no target][no option][no type]
status: valid
status modified: 2017-02-13
accepted date: 2017-02-13
in scheme: emissions_variables_MMR

1.A.1.a.iv [Other Public Electricity and Heat Production][Peat][Emissions][CH4][kt][no source][no method][no target][no option][no type]
type: Concept
definition: 1.A.1.a.iv [Other Public Electricity and Heat Production][Peat][Emissions][CH4][kt][no source][no method][no target][no option][no type]
status: valid
status modified: 2017-02-13
accepted date: 2017-02-13
in scheme: emissions_variables_MMR

1.A.1.a.iv [Other Public Electricity and Heat Production][Peat][Emissions][CO2][kt][no source][no method][no target][no option][no type]
type: Concept
definition: 1.A.1.a.iv [Other Public Electricity and Heat Production][Peat][Emissions][CO2][kt][no source][no method][no target][no option][no type]
status: valid
status modified: 2017-02-13
accepted date: 2017-02-13
in scheme: emissions_variables_MMR

1.A.1.a.iv [Other Public Electricity and Heat Production][Peat][Emissions][N2O][kt][no source][no method][no target][no option][no type]
type: Concept
definition: 1.A.1.a.iv [Other Public Electricity and Heat Production][Peat][Emissions][N2O][kt][no source][no method][no target][no option][no type]
status: valid
status modified: 2017-02-13
accepted date: 2017-02-13
in scheme: emissions_variables_MMR

1.A.1.a.iv [Other Public Electricity and Heat Production][Solid Fuels][Emissions][CH4][kt][no source][no method][no target][no option][no type]
type: Concept
definition: 1.A.1.a.iv [Other Public Electricity and Heat Production][Solid Fuels][Emissions][CH4][kt][no source][no method][no target][no option][no type]
status: valid
status modified: 2017-02-13
accepted date: 2017-02-13
in scheme: emissions_variables_MMR

1.A.1.a.iv [Other Public Electricity and Heat Production][Solid Fuels][Emissions][CO2][kt][no source][no method][no target][no option][no type]
type: Concept
definition: 1.A.1.a.iv [Other Public Electricity and Heat Production][Solid Fuels][Emissions][CO2][kt][no source][no method][no target][no option][no type]
status: valid
status modified: 2017-02-13
accepted date: 2017-02-13
in scheme: emissions_variables_MMR

1.A.1.a.iv [Other Public Electricity and Heat Production][Solid Fuels][Emissions][N2O][kt][no source][no method][no target][no option][no type]
type: Concept
definition: 1.A.1.a.iv [Other Public Electricity and Heat Production][Solid Fuels][Emissions][N2O][kt][no source][no method][no target][no option][no type]
status: valid
status modified: 2017-02-13
accepted date: 2017-02-13
in scheme: emissions_variables_MMR

1.A.1.b [Petroleum Refining][Fuels][Emissions][CH4][kt][no source][no method][no target][no option][no type]
type: Concept
definition: 1.A.1.b [Petroleum Refining][Fuels][Emissions][CH4][kt][no source][no method][no target][no option][no type]
status: valid
status modified: 2017-02-13
accepted date: 2017-02-13
in scheme: emissions_variables_MMR

1.A.1.b [Petroleum Refining][Fuels][Emissions][CO][kt][no source][no method][no target][no option][no type]
type: Concept
definition: 1.A.1.b [Petroleum Refining][Fuels][Emissions][CO][kt][no source][no method][no target][no option][no type]
status: valid
status modified: 2017-02-13
accepted date: 2017-02-13
in scheme: emissions_variables_MMR

1.A.1.b [Petroleum Refining][Fuels][Emissions][CO2][kt][no source][no method][no target][no option][no type]
type: Concept
definition: 1.A.1.b [Petroleum Refining][Fuels][Emissions][CO2][kt][no source][no method][no target][no option][no type]
status: valid
status modified: 2017-02-13
accepted date: 2017-02-13
in scheme: emissions_variables_MMR

1.A.1.b [Petroleum Refining][Fuels][Emissions][N2O][kt][no source][no method][no target][no option][no type]
type: Concept
definition: 1.A.1.b [Petroleum Refining][Fuels][Emissions][N2O][kt][no source][no method][no target][no option][no type]
status: valid
status modified: 2017-02-13
accepted date: 2017-02-13
in scheme: emissions_variables_MMR

1.A.1.b [Petroleum Refining][Fuels][Emissions][NMVOC][kt][no source][no method][no target][no option][no type]
type: Concept
definition: 1.A.1.b [Petroleum Refining][Fuels][Emissions][NMVOC][kt][no source][no method][no target][no option][no type]
status: valid
status modified: 2017-02-13
accepted date: 2017-02-13
in scheme: emissions_variables_MMR

1.A.1.b [Petroleum Refining][Fuels][Emissions][NOx][kt][no source][no method][no target][no option][no type]
type: Concept
definition: 1.A.1.b [Petroleum Refining][Fuels][Emissions][NOx][kt][no source][no method][no target][no option][no type]
status: valid
status modified: 2017-02-13
accepted date: 2017-02-13
in scheme: emissions_variables_MMR

1.A.1.b [Petroleum Refining][Fuels][Emissions][SO2][kt][no source][no method][no target][no option][no type]
type: Concept
definition: 1.A.1.b [Petroleum Refining][Fuels][Emissions][SO2][kt][no source][no method][no target][no option][no type]
status: valid
status modified: 2017-02-13
accepted date: 2017-02-13
in scheme: emissions_variables_MMR

1.A.1.b Biomass [Petroleum Refining][Biomass][Emissions][CH4][kt][no source][no method][no target][no option][no type]
type: Concept
definition: 1.A.1.b Biomass [Petroleum Refining][Biomass][Emissions][CH4][kt][no source][no method][no target][no option][no type]
status: valid
status modified: 2017-02-13
accepted date: 2017-02-13
in scheme: emissions_variables_MMR

1.A.1.b Biomass [Petroleum Refining][Biomass][Emissions][CO2][kt][no source][no method][no target][no option][no type]
type: Concept
definition: 1.A.1.b Biomass [Petroleum Refining][Biomass][Emissions][CO2][kt][no source][no method][no target][no option][no type]
status: valid
status modified: 2017-02-13
accepted date: 2017-02-13
in scheme: emissions_variables_MMR

1.A.1.b Biomass [Petroleum Refining][Biomass][Emissions][N2O][kt][no source][no method][no target][no option][no type]
type: Concept
definition: 1.A.1.b Biomass [Petroleum Refining][Biomass][Emissions][N2O][kt][no source][no method][no target][no option][no type]
status: valid
status modified: 2017-02-13
accepted date: 2017-02-13
in scheme: emissions_variables_MMR

1.A.1.b Gaseous Fuels [Petroleum Refining][Gaseous Fuels][Emissions][CH4][kt][no source][no method][no target][no option][no type]
type: Concept
definition: 1.A.1.b Gaseous Fuels [Petroleum Refining][Gaseous Fuels][Emissions][CH4][kt][no source][no method][no target][no option][no type]
status: valid
status modified: 2017-02-13
accepted date: 2017-02-13
in scheme: emissions_variables_MMR

1.A.1.b Gaseous Fuels [Petroleum Refining][Gaseous Fuels][Emissions][CO2][kt][no source][no method][no target][no option][no type]
type: Concept
definition: 1.A.1.b Gaseous Fuels [Petroleum Refining][Gaseous Fuels][Emissions][CO2][kt][no source][no method][no target][no option][no type]
status: valid
status modified: 2017-02-13
accepted date: 2017-02-13
in scheme: emissions_variables_MMR

1.A.1.b Gaseous Fuels [Petroleum Refining][Gaseous Fuels][Emissions][N2O][kt][no source][no method][no target][no option][no type]
type: Concept
definition: 1.A.1.b Gaseous Fuels [Petroleum Refining][Gaseous Fuels][Emissions][N2O][kt][no source][no method][no target][no option][no type]
status: valid
status modified: 2017-02-13
accepted date: 2017-02-13
in scheme: emissions_variables_MMR

1.A.1.b Liquid Fuels [Petroleum Refining][Liquid Fuels][Emissions][CH4][kt][no source][no method][no target][no option][no type]
type: Concept
definition: 1.A.1.b Liquid Fuels [Petroleum Refining][Liquid Fuels][Emissions][CH4][kt][no source][no method][no target][no option][no type]
status: valid
status modified: 2017-02-13
accepted date: 2017-02-13
in scheme: emissions_variables_MMR

1.A.1.b Liquid Fuels [Petroleum Refining][Liquid Fuels][Emissions][CO2][kt][no source][no method][no target][no option][no type]
type: Concept
definition: 1.A.1.b Liquid Fuels [Petroleum Refining][Liquid Fuels][Emissions][CO2][kt][no source][no method][no target][no option][no type]
status: valid
status modified: 2017-02-13
accepted date: 2017-02-13
in scheme: emissions_variables_MMR

1.A.1.b Liquid Fuels [Petroleum Refining][Liquid Fuels][Emissions][N2O][kt][no source][no method][no target][no option][no type]
type: Concept
definition: 1.A.1.b Liquid Fuels [Petroleum Refining][Liquid Fuels][Emissions][N2O][kt][no source][no method][no target][no option][no type]
status: valid
status modified: 2017-02-13
accepted date: 2017-02-13
in scheme: emissions_variables_MMR

1.A.1.b Other Fossil Fuels [Petroleum Refining][Other Fossil Fuels][Emissions][CH4][kt][no source][no method][no target][no option][no type]
type: Concept
definition: 1.A.1.b Other Fossil Fuels [Petroleum Refining][Other Fossil Fuels][Emissions][CH4][kt][no source][no method][no target][no option][no type]
status: valid
status modified: 2017-02-13
accepted date: 2017-02-13
in scheme: emissions_variables_MMR

1.A.1.b Other Fossil Fuels [Petroleum Refining][Other Fossil Fuels][Emissions][CO2][kt][no source][no method][no target][no option][no type]
type: Concept
definition: 1.A.1.b Other Fossil Fuels [Petroleum Refining][Other Fossil Fuels][Emissions][CO2][kt][no source][no method][no target][no option][no type]
status: valid
status modified: 2017-02-13
accepted date: 2017-02-13
in scheme: emissions_variables_MMR

1.A.1.b Other Fossil Fuels [Petroleum Refining][Other Fossil Fuels][Emissions][N2O][kt][no source][no method][no target][no option][no type]
type: Concept
definition: 1.A.1.b Other Fossil Fuels [Petroleum Refining][Other Fossil Fuels][Emissions][N2O][kt][no source][no method][no target][no option][no type]
status: valid
status modified: 2017-02-13
accepted date: 2017-02-13
in scheme: emissions_variables_MMR

1.A.1.b Peat [Petroleum Refining][Peat][Emissions][CH4][kt][no source][no method][no target][no option][no type]
type: Concept
definition: 1.A.1.b Peat [Petroleum Refining][Peat][Emissions][CH4][kt][no source][no method][no target][no option][no type]
status: valid
status modified: 2017-02-13
accepted date: 2017-02-13
in scheme: emissions_variables_MMR

1.A.1.b Peat [Petroleum Refining][Peat][Emissions][CO2][kt][no source][no method][no target][no option][no type]
type: Concept
definition: 1.A.1.b Peat [Petroleum Refining][Peat][Emissions][CO2][kt][no source][no method][no target][no option][no type]
status: valid
status modified: 2017-02-13
accepted date: 2017-02-13
in scheme: emissions_variables_MMR

1.A.1.b Peat [Petroleum Refining][Peat][Emissions][N2O][kt][no source][no method][no target][no option][no type]
type: Concept
definition: 1.A.1.b Peat [Petroleum Refining][Peat][Emissions][N2O][kt][no source][no method][no target][no option][no type]
status: valid
status modified: 2017-02-13
accepted date: 2017-02-13
in scheme: emissions_variables_MMR

1.A.1.b Solid Fuels [Petroleum Refining][Solid Fuels][Emissions][CH4][kt][no source][no method][no target][no option][no type]
type: Concept
definition: 1.A.1.b Solid Fuels [Petroleum Refining][Solid Fuels][Emissions][CH4][kt][no source][no method][no target][no option][no type]
status: valid
status modified: 2017-02-13
accepted date: 2017-02-13
in scheme: emissions_variables_MMR

1.A.1.b Solid Fuels [Petroleum Refining][Solid Fuels][Emissions][CO2][kt][no source][no method][no target][no option][no type]
type: Concept
definition: 1.A.1.b Solid Fuels [Petroleum Refining][Solid Fuels][Emissions][CO2][kt][no source][no method][no target][no option][no type]
status: valid
status modified: 2017-02-13
accepted date: 2017-02-13
in scheme: emissions_variables_MMR

1.A.1.b Solid Fuels [Petroleum Refining][Solid Fuels][Emissions][N2O][kt][no source][no method][no target][no option][no type]
type: Concept
definition: 1.A.1.b Solid Fuels [Petroleum Refining][Solid Fuels][Emissions][N2O][kt][no source][no method][no target][no option][no type]
status: valid
status modified: 2017-02-13
accepted date: 2017-02-13
in scheme: emissions_variables_MMR

1.A.1.c [Manufacture of Solid Fuels and Other Energy Industries][Biomass][Emissions][CH4][kt][no source][no method][no target][no option][no type]
type: Concept
definition: 1.A.1.c [Manufacture of Solid Fuels and Other Energy Industries][Biomass][Emissions][CH4][kt][no source][no method][no target][no option][no type]
status: valid
status modified: 2017-02-13
accepted date: 2017-02-13
in scheme: emissions_variables_MMR

1.A.1.c [Manufacture of Solid Fuels and Other Energy Industries][Biomass][Emissions][CO2][kt][no source][no method][no target][no option][no type]
type: Concept
definition: 1.A.1.c [Manufacture of Solid Fuels and Other Energy Industries][Biomass][Emissions][CO2][kt][no source][no method][no target][no option][no type]
status: valid
status modified: 2017-02-13
accepted date: 2017-02-13
in scheme: emissions_variables_MMR

1.A.1.c [Manufacture of Solid Fuels and Other Energy Industries][Biomass][Emissions][N2O][kt][no source][no method][no target][no option][no type]
type: Concept
definition: 1.A.1.c [Manufacture of Solid Fuels and Other Energy Industries][Biomass][Emissions][N2O][kt][no source][no method][no target][no option][no type]
status: valid
status modified: 2017-02-13
accepted date: 2017-02-13
in scheme: emissions_variables_MMR

1.A.1.c [Manufacture of Solid Fuels and Other Energy Industries][Fossil fuels][Emissions][CO2][kt][no source][no method][no target][no option][no type]
type: Concept
definition: 1.A.1.c [Manufacture of Solid Fuels and Other Energy Industries][Fossil fuels][Emissions][CO2][kt][no source][no method][no target][no option][no type]
status: valid
status modified: 2017-02-13
accepted date: 2017-02-13
in scheme: emissions_variables_MMR

1.A.1.c [Manufacture of Solid Fuels and Other Energy Industries][Fuels][Emissions][CH4][kt][no source][no method][no target][no option][no type]
type: Concept
definition: 1.A.1.c [Manufacture of Solid Fuels and Other Energy Industries][Fuels][Emissions][CH4][kt][no source][no method][no target][no option][no type]
status: valid
status modified: 2017-02-13
accepted date: 2017-02-13
in scheme: emissions_variables_MMR

1.A.1.c [Manufacture of Solid Fuels and Other Energy Industries][Fuels][Emissions][CO][kt][no source][no method][no target][no option][no type]
type: Concept
definition: 1.A.1.c [Manufacture of Solid Fuels and Other Energy Industries][Fuels][Emissions][CO][kt][no source][no method][no target][no option][no type]
status: valid
status modified: 2017-02-13
accepted date: 2017-02-13
in scheme: emissions_variables_MMR

1.A.1.c [Manufacture of Solid Fuels and Other Energy Industries][Fuels][Emissions][N2O][kt][no source][no method][no target][no option][no type]
type: Concept
definition: 1.A.1.c [Manufacture of Solid Fuels and Other Energy Industries][Fuels][Emissions][N2O][kt][no source][no method][no target][no option][no type]
status: valid
status modified: 2017-02-13
accepted date: 2017-02-13
in scheme: emissions_variables_MMR

1.A.1.c [Manufacture of Solid Fuels and Other Energy Industries][Fuels][Emissions][NMVOC][kt][no source][no method][no target][no option][no type]
type: Concept
definition: 1.A.1.c [Manufacture of Solid Fuels and Other Energy Industries][Fuels][Emissions][NMVOC][kt][no source][no method][no target][no option][no type]
status: valid
status modified: 2017-02-13
accepted date: 2017-02-13
in scheme: emissions_variables_MMR

1.A.1.c [Manufacture of Solid Fuels and Other Energy Industries][Fuels][Emissions][NOx][kt][no source][no method][no target][no option][no type]
type: Concept
definition: 1.A.1.c [Manufacture of Solid Fuels and Other Energy Industries][Fuels][Emissions][NOx][kt][no source][no method][no target][no option][no type]
status: valid
status modified: 2017-02-13
accepted date: 2017-02-13
in scheme: emissions_variables_MMR

1.A.1.c [Manufacture of Solid Fuels and Other Energy Industries][Fuels][Emissions][SO2][kt][no source][no method][no target][no option][no type]
type: Concept
definition: 1.A.1.c [Manufacture of Solid Fuels and Other Energy Industries][Fuels][Emissions][SO2][kt][no source][no method][no target][no option][no type]
status: valid
status modified: 2017-02-13
accepted date: 2017-02-13
in scheme: emissions_variables_MMR

1.A.1.c [Manufacture of Solid Fuels and Other Energy Industries][Gaseous Fuels][Emissions][CH4][kt][no source][no method][no target][no option][no type]
type: Concept
definition: 1.A.1.c [Manufacture of Solid Fuels and Other Energy Industries][Gaseous Fuels][Emissions][CH4][kt][no source][no method][no target][no option][no type]
status: valid
status modified: 2017-02-13
accepted date: 2017-02-13
in scheme: emissions_variables_MMR

1.A.1.c [Manufacture of Solid Fuels and Other Energy Industries][Gaseous Fuels][Emissions][CO2][kt][no source][no method][no target][no option][no type]
type: Concept
definition: 1.A.1.c [Manufacture of Solid Fuels and Other Energy Industries][Gaseous Fuels][Emissions][CO2][kt][no source][no method][no target][no option][no type]
status: valid
status modified: 2017-02-13
accepted date: 2017-02-13
in scheme: emissions_variables_MMR

1.A.1.c [Manufacture of Solid Fuels and Other Energy Industries][Gaseous Fuels][Emissions][N2O][kt][no source][no method][no target][no option][no type]
type: Concept
definition: 1.A.1.c [Manufacture of Solid Fuels and Other Energy Industries][Gaseous Fuels][Emissions][N2O][kt][no source][no method][no target][no option][no type]
status: valid
status modified: 2017-02-13
accepted date: 2017-02-13
in scheme: emissions_variables_MMR

1.A.1.c [Manufacture of Solid Fuels and Other Energy Industries][Liquid Fuels][Emissions][CH4][kt][no source][no method][no target][no option][no type]
type: Concept
definition: 1.A.1.c [Manufacture of Solid Fuels and Other Energy Industries][Liquid Fuels][Emissions][CH4][kt][no source][no method][no target][no option][no type]
status: valid
status modified: 2017-02-13
accepted date: 2017-02-13
in scheme: emissions_variables_MMR

1.A.1.c [Manufacture of Solid Fuels and Other Energy Industries][Liquid Fuels][Emissions][CO2][kt][no source][no method][no target][no option][no type]
type: Concept
definition: 1.A.1.c [Manufacture of Solid Fuels and Other Energy Industries][Liquid Fuels][Emissions][CO2][kt][no source][no method][no target][no option][no type]
status: valid
status modified: 2017-02-13
accepted date: 2017-02-13
in scheme: emissions_variables_MMR

1.A.1.c [Manufacture of Solid Fuels and Other Energy Industries][Liquid Fuels][Emissions][N2O][kt][no source][no method][no target][no option][no type]
type: Concept
definition: 1.A.1.c [Manufacture of Solid Fuels and Other Energy Industries][Liquid Fuels][Emissions][N2O][kt][no source][no method][no target][no option][no type]
status: valid
status modified: 2017-02-13
accepted date: 2017-02-13
in scheme: emissions_variables_MMR

1.A.1.c [Manufacture of Solid Fuels and Other Energy Industries][Other Fossil Fuels][Emissions][CH4][kt][no source][no method][no target][no option][no type]
type: Concept
definition: 1.A.1.c [Manufacture of Solid Fuels and Other Energy Industries][Other Fossil Fuels][Emissions][CH4][kt][no source][no method][no target][no option][no type]
status: valid
status modified: 2017-02-13
accepted date: 2017-02-13
in scheme: emissions_variables_MMR

1.A.1.c [Manufacture of Solid Fuels and Other Energy Industries][Other Fossil Fuels][Emissions][CO2][kt][no source][no method][no target][no option][no type]
type: Concept
definition: 1.A.1.c [Manufacture of Solid Fuels and Other Energy Industries][Other Fossil Fuels][Emissions][CO2][kt][no source][no method][no target][no option][no type]
status: valid
status modified: 2017-02-13
accepted date: 2017-02-13
in scheme: emissions_variables_MMR

1.A.1.c [Manufacture of Solid Fuels and Other Energy Industries][Other Fossil Fuels][Emissions][N2O][kt][no source][no method][no target][no option][no type]
type: Concept
definition: 1.A.1.c [Manufacture of Solid Fuels and Other Energy Industries][Other Fossil Fuels][Emissions][N2O][kt][no source][no method][no target][no option][no type]
status: valid
status modified: 2017-02-13
accepted date: 2017-02-13
in scheme: emissions_variables_MMR

1.A.1.c [Manufacture of Solid Fuels and Other Energy Industries][Peat][Emissions][CH4][kt][no source][no method][no target][no option][no type]
type: Concept
definition: 1.A.1.c [Manufacture of Solid Fuels and Other Energy Industries][Peat][Emissions][CH4][kt][no source][no method][no target][no option][no type]
status: valid
status modified: 2017-02-13
accepted date: 2017-02-13
in scheme: emissions_variables_MMR

1.A.1.c [Manufacture of Solid Fuels and Other Energy Industries][Peat][Emissions][CO2][kt][no source][no method][no target][no option][no type]
type: Concept
definition: 1.A.1.c [Manufacture of Solid Fuels and Other Energy Industries][Peat][Emissions][CO2][kt][no source][no method][no target][no option][no type]
status: valid
status modified: 2017-02-13
accepted date: 2017-02-13
in scheme: emissions_variables_MMR

1.A.1.c [Manufacture of Solid Fuels and Other Energy Industries][Peat][Emissions][N2O][kt][no source][no method][no target][no option][no type]
type: Concept
definition: 1.A.1.c [Manufacture of Solid Fuels and Other Energy Industries][Peat][Emissions][N2O][kt][no source][no method][no target][no option][no type]
status: valid
status modified: 2017-02-13
accepted date: 2017-02-13
in scheme: emissions_variables_MMR

1.A.1.c [Manufacture of Solid Fuels and Other Energy Industries][Solid Fuels][Emissions][CH4][kt][no source][no method][no target][no option][no type]
type: Concept
definition: 1.A.1.c [Manufacture of Solid Fuels and Other Energy Industries][Solid Fuels][Emissions][CH4][kt][no source][no method][no target][no option][no type]
status: valid
status modified: 2017-02-13
accepted date: 2017-02-13
in scheme: emissions_variables_MMR

1.A.1.c [Manufacture of Solid Fuels and Other Energy Industries][Solid Fuels][Emissions][CO2][kt][no source][no method][no target][no option][no type]
type: Concept
definition: 1.A.1.c [Manufacture of Solid Fuels and Other Energy Industries][Solid Fuels][Emissions][CO2][kt][no source][no method][no target][no option][no type]
status: valid
status modified: 2017-02-13
accepted date: 2017-02-13
in scheme: emissions_variables_MMR

1.A.1.c [Manufacture of Solid Fuels and Other Energy Industries][Solid Fuels][Emissions][N2O][kt][no source][no method][no target][no option][no type]
type: Concept
definition: 1.A.1.c [Manufacture of Solid Fuels and Other Energy Industries][Solid Fuels][Emissions][N2O][kt][no source][no method][no target][no option][no type]
status: valid
status modified: 2017-02-13
accepted date: 2017-02-13
in scheme: emissions_variables_MMR

1.A.1.c.i [Manufacture of solid fuels][Biomass][Emissions][CH4][kt][no source][no method][no target][no option][no type]
type: Concept
definition: 1.A.1.c.i [Manufacture of solid fuels][Biomass][Emissions][CH4][kt][no source][no method][no target][no option][no type]
status: valid
status modified: 2017-02-13
accepted date: 2017-02-13
in scheme: emissions_variables_MMR

1.A.1.c.i [Manufacture of solid fuels][Biomass][Emissions][CO2][kt][no source][no method][no target][no option][no type]
type: Concept
definition: 1.A.1.c.i [Manufacture of solid fuels][Biomass][Emissions][CO2][kt][no source][no method][no target][no option][no type]
status: valid
status modified: 2017-02-13
accepted date: 2017-02-13
in scheme: emissions_variables_MMR

1.A.1.c.i [Manufacture of solid fuels][Biomass][Emissions][N2O][kt][no source][no method][no target][no option][no type]
type: Concept
definition: 1.A.1.c.i [Manufacture of solid fuels][Biomass][Emissions][N2O][kt][no source][no method][no target][no option][no type]
status: valid
status modified: 2017-02-13
accepted date: 2017-02-13
in scheme: emissions_variables_MMR

1.A.1.c.i [Manufacture of solid fuels][Fuels][Emissions][CH4][kt][no source][no method][no target][no option][no type]
type: Concept
definition: 1.A.1.c.i [Manufacture of solid fuels][Fuels][Emissions][CH4][kt][no source][no method][no target][no option][no type]
status: valid
status modified: 2017-02-13
accepted date: 2017-02-13
in scheme: emissions_variables_MMR

1.A.1.c.i [Manufacture of solid fuels][Fuels][Emissions][CO2][kt][no source][no method][no target][no option][no type]
type: Concept
definition: 1.A.1.c.i [Manufacture of solid fuels][Fuels][Emissions][CO2][kt][no source][no method][no target][no option][no type]
status: valid
status modified: 2017-02-13
accepted date: 2017-02-13
in scheme: emissions_variables_MMR

1.A.1.c.i [Manufacture of solid fuels][Fuels][Emissions][N2O][kt][no source][no method][no target][no option][no type]
type: Concept
definition: 1.A.1.c.i [Manufacture of solid fuels][Fuels][Emissions][N2O][kt][no source][no method][no target][no option][no type]
status: valid
status modified: 2017-02-13
accepted date: 2017-02-13
in scheme: emissions_variables_MMR

1.A.1.c.i [Manufacture of solid fuels][Gaseous Fuels][Emissions][CH4][kt][no source][no method][no target][no option][no type]
type: Concept
definition: 1.A.1.c.i [Manufacture of solid fuels][Gaseous Fuels][Emissions][CH4][kt][no source][no method][no target][no option][no type]
status: valid
status modified: 2017-02-13
accepted date: 2017-02-13
in scheme: emissions_variables_MMR

1.A.1.c.i [Manufacture of solid fuels][Gaseous Fuels][Emissions][CO2][kt][no source][no method][no target][no option][no type]
type: Concept
definition: 1.A.1.c.i [Manufacture of solid fuels][Gaseous Fuels][Emissions][CO2][kt][no source][no method][no target][no option][no type]
status: valid
status modified: 2017-02-13
accepted date: 2017-02-13
in scheme: emissions_variables_MMR

1.A.1.c.i [Manufacture of solid fuels][Gaseous Fuels][Emissions][N2O][kt][no source][no method][no target][no option][no type]
type: Concept
definition: 1.A.1.c.i [Manufacture of solid fuels][Gaseous Fuels][Emissions][N2O][kt][no source][no method][no target][no option][no type]
status: valid
status modified: 2017-02-13
accepted date: 2017-02-13
in scheme: emissions_variables_MMR

1.A.1.c.i [Manufacture of solid fuels][Liquid Fuels][Emissions][CH4][kt][no source][no method][no target][no option][no type]
type: Concept
definition: 1.A.1.c.i [Manufacture of solid fuels][Liquid Fuels][Emissions][CH4][kt][no source][no method][no target][no option][no type]
status: valid
status modified: 2017-02-13
accepted date: 2017-02-13
in scheme: emissions_variables_MMR

1.A.1.c.i [Manufacture of solid fuels][Liquid Fuels][Emissions][CO2][kt][no source][no method][no target][no option][no type]
type: Concept
definition: 1.A.1.c.i [Manufacture of solid fuels][Liquid Fuels][Emissions][CO2][kt][no source][no method][no target][no option][no type]
status: valid
status modified: 2017-02-13
accepted date: 2017-02-13
in scheme: emissions_variables_MMR

1.A.1.c.i [Manufacture of solid fuels][Liquid Fuels][Emissions][N2O][kt][no source][no method][no target][no option][no type]
type: Concept
definition: 1.A.1.c.i [Manufacture of solid fuels][Liquid Fuels][Emissions][N2O][kt][no source][no method][no target][no option][no type]
status: valid
status modified: 2017-02-13
accepted date: 2017-02-13
in scheme: emissions_variables_MMR

1.A.1.c.i [Manufacture of solid fuels][Other Fossil Fuels][Emissions][CH4][kt][no source][no method][no target][no option][no type]
type: Concept
definition: 1.A.1.c.i [Manufacture of solid fuels][Other Fossil Fuels][Emissions][CH4][kt][no source][no method][no target][no option][no type]
status: valid
status modified: 2017-02-13
accepted date: 2017-02-13
in scheme: emissions_variables_MMR

1.A.1.c.i [Manufacture of solid fuels][Other Fossil Fuels][Emissions][CO2][kt][no source][no method][no target][no option][no type]
type: Concept
definition: 1.A.1.c.i [Manufacture of solid fuels][Other Fossil Fuels][Emissions][CO2][kt][no source][no method][no target][no option][no type]
status: valid
status modified: 2017-02-13
accepted date: 2017-02-13
in scheme: emissions_variables_MMR

1.A.1.c.i [Manufacture of solid fuels][Other Fossil Fuels][Emissions][N2O][kt][no source][no method][no target][no option][no type]
type: Concept
definition: 1.A.1.c.i [Manufacture of solid fuels][Other Fossil Fuels][Emissions][N2O][kt][no source][no method][no target][no option][no type]
status: valid
status modified: 2017-02-13
accepted date: 2017-02-13
in scheme: emissions_variables_MMR

1.A.1.c.i [Manufacture of solid fuels][Peat][Emissions][CH4][kt][no source][no method][no target][no option][no type]
type: Concept
definition: 1.A.1.c.i [Manufacture of solid fuels][Peat][Emissions][CH4][kt][no source][no method][no target][no option][no type]
status: valid
status modified: 2017-02-13
accepted date: 2017-02-13
in scheme: emissions_variables_MMR

1.A.1.c.i [Manufacture of solid fuels][Peat][Emissions][CO2][kt][no source][no method][no target][no option][no type]
type: Concept
definition: 1.A.1.c.i [Manufacture of solid fuels][Peat][Emissions][CO2][kt][no source][no method][no target][no option][no type]
status: valid
status modified: 2017-02-13
accepted date: 2017-02-13
in scheme: emissions_variables_MMR

1.A.1.c.i [Manufacture of solid fuels][Peat][Emissions][N2O][kt][no source][no method][no target][no option][no type]
type: Concept
definition: 1.A.1.c.i [Manufacture of solid fuels][Peat][Emissions][N2O][kt][no source][no method][no target][no option][no type]
status: valid
status modified: 2017-02-13
accepted date: 2017-02-13
in scheme: emissions_variables_MMR

1.A.1.c.i [Manufacture of solid fuels][Solid Fuels][Emissions][CH4][kt][no source][no method][no target][no option][no type]
type: Concept
definition: 1.A.1.c.i [Manufacture of solid fuels][Solid Fuels][Emissions][CH4][kt][no source][no method][no target][no option][no type]
status: valid
status modified: 2017-02-13
accepted date: 2017-02-13
in scheme: emissions_variables_MMR

1.A.1.c.i [Manufacture of solid fuels][Solid Fuels][Emissions][CO2][kt][no source][no method][no target][no option][no type]
type: Concept
definition: 1.A.1.c.i [Manufacture of solid fuels][Solid Fuels][Emissions][CO2][kt][no source][no method][no target][no option][no type]
status: valid
status modified: 2017-02-13
accepted date: 2017-02-13
in scheme: emissions_variables_MMR

1.A.1.c.i [Manufacture of solid fuels][Solid Fuels][Emissions][N2O][kt][no source][no method][no target][no option][no type]
type: Concept
definition: 1.A.1.c.i [Manufacture of solid fuels][Solid Fuels][Emissions][N2O][kt][no source][no method][no target][no option][no type]
status: valid
status modified: 2017-02-13
accepted date: 2017-02-13
in scheme: emissions_variables_MMR

1.A.1.c.ii [Oil and gas extraction][Biomass][Emissions][CH4][kt][no source][no method][no target][no option][no type]
type: Concept
definition: 1.A.1.c.ii [Oil and gas extraction][Biomass][Emissions][CH4][kt][no source][no method][no target][no option][no type]
status: valid
status modified: 2017-02-13
accepted date: 2017-02-13
in scheme: emissions_variables_MMR

1.A.1.c.ii [Oil and gas extraction][Biomass][Emissions][CO2][kt][no source][no method][no target][no option][no type]
type: Concept
definition: 1.A.1.c.ii [Oil and gas extraction][Biomass][Emissions][CO2][kt][no source][no method][no target][no option][no type]
status: valid
status modified: 2017-02-13
accepted date: 2017-02-13
in scheme: emissions_variables_MMR

1.A.1.c.ii [Oil and gas extraction][Biomass][Emissions][N2O][kt][no source][no method][no target][no option][no type]
type: Concept
definition: 1.A.1.c.ii [Oil and gas extraction][Biomass][Emissions][N2O][kt][no source][no method][no target][no option][no type]
status: valid
status modified: 2017-02-13
accepted date: 2017-02-13
in scheme: emissions_variables_MMR

1.A.1.c.ii [Oil and gas extraction][Fuels][Emissions][CH4][kt][no source][no method][no target][no option][no type]
type: Concept
definition: 1.A.1.c.ii [Oil and gas extraction][Fuels][Emissions][CH4][kt][no source][no method][no target][no option][no type]
status: valid
status modified: 2017-02-13
accepted date: 2017-02-13
in scheme: emissions_variables_MMR

1.A.1.c.ii [Oil and gas extraction][Fuels][Emissions][CO2][kt][no source][no method][no target][no option][no type]
type: Concept
definition: 1.A.1.c.ii [Oil and gas extraction][Fuels][Emissions][CO2][kt][no source][no method][no target][no option][no type]
status: valid
status modified: 2017-02-13
accepted date: 2017-02-13
in scheme: emissions_variables_MMR

1.A.1.c.ii [Oil and gas extraction][Fuels][Emissions][N2O][kt][no source][no method][no target][no option][no type]
type: Concept
definition: 1.A.1.c.ii [Oil and gas extraction][Fuels][Emissions][N2O][kt][no source][no method][no target][no option][no type]
status: valid
status modified: 2017-02-13
accepted date: 2017-02-13
in scheme: emissions_variables_MMR

1.A.1.c.ii [Oil and gas extraction][Gaseous Fuels][Emissions][CH4][kt][no source][no method][no target][no option][no type]
type: Concept
definition: 1.A.1.c.ii [Oil and gas extraction][Gaseous Fuels][Emissions][CH4][kt][no source][no method][no target][no option][no type]
status: valid
status modified: 2017-02-13
accepted date: 2017-02-13
in scheme: emissions_variables_MMR

1.A.1.c.ii [Oil and gas extraction][Gaseous Fuels][Emissions][CO2][kt][no source][no method][no target][no option][no type]
type: Concept
definition: 1.A.1.c.ii [Oil and gas extraction][Gaseous Fuels][Emissions][CO2][kt][no source][no method][no target][no option][no type]
status: valid
status modified: 2017-02-13
accepted date: 2017-02-13
in scheme: emissions_variables_MMR

1.A.1.c.ii [Oil and gas extraction][Gaseous Fuels][Emissions][N2O][kt][no source][no method][no target][no option][no type]
type: Concept
definition: 1.A.1.c.ii [Oil and gas extraction][Gaseous Fuels][Emissions][N2O][kt][no source][no method][no target][no option][no type]
status: valid
status modified: 2017-02-13
accepted date: 2017-02-13
in scheme: emissions_variables_MMR

1.A.1.c.ii [Oil and gas extraction][Liquid Fuels][Emissions][CH4][kt][no source][no method][no target][no option][no type]
type: Concept
definition: 1.A.1.c.ii [Oil and gas extraction][Liquid Fuels][Emissions][CH4][kt][no source][no method][no target][no option][no type]
status: valid
status modified: 2017-02-13
accepted date: 2017-02-13
in scheme: emissions_variables_MMR

1.A.1.c.ii [Oil and gas extraction][Liquid Fuels][Emissions][CO2][kt][no source][no method][no target][no option][no type]
type: Concept
definition: 1.A.1.c.ii [Oil and gas extraction][Liquid Fuels][Emissions][CO2][kt][no source][no method][no target][no option][no type]
status: valid
status modified: 2017-02-13
accepted date: 2017-02-13
in scheme: emissions_variables_MMR

1.A.1.c.ii [Oil and gas extraction][Liquid Fuels][Emissions][N2O][kt][no source][no method][no target][no option][no type]
type: Concept
definition: 1.A.1.c.ii [Oil and gas extraction][Liquid Fuels][Emissions][N2O][kt][no source][no method][no target][no option][no type]
status: valid
status modified: 2017-02-13
accepted date: 2017-02-13
in scheme: emissions_variables_MMR

1.A.1.c.ii [Oil and gas extraction][Other Fossil Fuels][Emissions][CH4][kt][no source][no method][no target][no option][no type]
type: Concept
definition: 1.A.1.c.ii [Oil and gas extraction][Other Fossil Fuels][Emissions][CH4][kt][no source][no method][no target][no option][no type]
status: valid
status modified: 2017-02-13
accepted date: 2017-02-13
in scheme: emissions_variables_MMR

1.A.1.c.ii [Oil and gas extraction][Other Fossil Fuels][Emissions][CO2][kt][no source][no method][no target][no option][no type]
type: Concept
definition: 1.A.1.c.ii [Oil and gas extraction][Other Fossil Fuels][Emissions][CO2][kt][no source][no method][no target][no option][no type]
status: valid
status modified: 2017-02-13
accepted date: 2017-02-13
in scheme: emissions_variables_MMR

1.A.1.c.ii [Oil and gas extraction][Other Fossil Fuels][Emissions][N2O][kt][no source][no method][no target][no option][no type]
type: Concept
definition: 1.A.1.c.ii [Oil and gas extraction][Other Fossil Fuels][Emissions][N2O][kt][no source][no method][no target][no option][no type]
status: valid
status modified: 2017-02-13
accepted date: 2017-02-13
in scheme: emissions_variables_MMR

1.A.1.c.ii [Oil and gas extraction][Peat][Emissions][CH4][kt][no source][no method][no target][no option][no type]
type: Concept
definition: 1.A.1.c.ii [Oil and gas extraction][Peat][Emissions][CH4][kt][no source][no method][no target][no option][no type]
status: valid
status modified: 2017-02-13
accepted date: 2017-02-13
in scheme: emissions_variables_MMR

1.A.1.c.ii [Oil and gas extraction][Peat][Emissions][CO2][kt][no source][no method][no target][no option][no type]
type: Concept
definition: 1.A.1.c.ii [Oil and gas extraction][Peat][Emissions][CO2][kt][no source][no method][no target][no option][no type]
status: valid
status modified: 2017-02-13
accepted date: 2017-02-13
in scheme: emissions_variables_MMR

1.A.1.c.ii [Oil and gas extraction][Peat][Emissions][N2O][kt][no source][no method][no target][no option][no type]
type: Concept
definition: 1.A.1.c.ii [Oil and gas extraction][Peat][Emissions][N2O][kt][no source][no method][no target][no option][no type]
status: valid
status modified: 2017-02-13
accepted date: 2017-02-13
in scheme: emissions_variables_MMR

1.A.1.c.ii [Oil and gas extraction][Solid Fuels][Emissions][CH4][kt][no source][no method][no target][no option][no type]
type: Concept
definition: 1.A.1.c.ii [Oil and gas extraction][Solid Fuels][Emissions][CH4][kt][no source][no method][no target][no option][no type]
status: valid
status modified: 2017-02-13
accepted date: 2017-02-13
in scheme: emissions_variables_MMR

1.A.1.c.ii [Oil and gas extraction][Solid Fuels][Emissions][CO2][kt][no source][no method][no target][no option][no type]
type: Concept
definition: 1.A.1.c.ii [Oil and gas extraction][Solid Fuels][Emissions][CO2][kt][no source][no method][no target][no option][no type]
status: valid
status modified: 2017-02-13
accepted date: 2017-02-13
in scheme: emissions_variables_MMR

1.A.1.c.ii [Oil and gas extraction][Solid Fuels][Emissions][N2O][kt][no source][no method][no target][no option][no type]
type: Concept
definition: 1.A.1.c.ii [Oil and gas extraction][Solid Fuels][Emissions][N2O][kt][no source][no method][no target][no option][no type]
status: valid
status modified: 2017-02-13
accepted date: 2017-02-13
in scheme: emissions_variables_MMR

1.A.1.c.iii [Other energy industries][Biomass][Emissions][CH4][kt][no source][no method][no target][no option][no type]
type: Concept
definition: 1.A.1.c.iii [Other energy industries][Biomass][Emissions][CH4][kt][no source][no method][no target][no option][no type]
status: valid
status modified: 2017-02-13
accepted date: 2017-02-13
in scheme: emissions_variables_MMR

1.A.1.c.iii [Other energy industries][Biomass][Emissions][CO2][kt][no source][no method][no target][no option][no type]
type: Concept
definition: 1.A.1.c.iii [Other energy industries][Biomass][Emissions][CO2][kt][no source][no method][no target][no option][no type]
status: valid
status modified: 2017-02-13
accepted date: 2017-02-13
in scheme: emissions_variables_MMR

1.A.1.c.iii [Other energy industries][Biomass][Emissions][N2O][kt][no source][no method][no target][no option][no type]
type: Concept
definition: 1.A.1.c.iii [Other energy industries][Biomass][Emissions][N2O][kt][no source][no method][no target][no option][no type]
status: valid
status modified: 2017-02-13
accepted date: 2017-02-13
in scheme: emissions_variables_MMR

1.A.1.c.iii [Other energy industries][Fuels][Emissions][CH4][kt][no source][no method][no target][no option][no type]
type: Concept
definition: 1.A.1.c.iii [Other energy industries][Fuels][Emissions][CH4][kt][no source][no method][no target][no option][no type]
status: valid
status modified: 2017-02-13
accepted date: 2017-02-13
in scheme: emissions_variables_MMR

1.A.1.c.iii [Other energy industries][Fuels][Emissions][CO2][kt][no source][no method][no target][no option][no type]
type: Concept
definition: 1.A.1.c.iii [Other energy industries][Fuels][Emissions][CO2][kt][no source][no method][no target][no option][no type]
status: valid
status modified: 2017-02-13
accepted date: 2017-02-13
in scheme: emissions_variables_MMR

1.A.1.c.iii [Other energy industries][Fuels][Emissions][N2O][kt][no source][no method][no target][no option][no type]
type: Concept
definition: 1.A.1.c.iii [Other energy industries][Fuels][Emissions][N2O][kt][no source][no method][no target][no option][no type]
status: valid
status modified: 2017-02-13
accepted date: 2017-02-13
in scheme: emissions_variables_MMR

1.A.1.c.iii [Other energy industries][Gaseous Fuels][Emissions][CH4][kt][no source][no method][no target][no option][no type]
type: Concept
definition: 1.A.1.c.iii [Other energy industries][Gaseous Fuels][Emissions][CH4][kt][no source][no method][no target][no option][no type]
status: valid
status modified: 2017-02-13
accepted date: 2017-02-13
in scheme: emissions_variables_MMR

1.A.1.c.iii [Other energy industries][Gaseous Fuels][Emissions][CO2][kt][no source][no method][no target][no option][no type]
type: Concept
definition: 1.A.1.c.iii [Other energy industries][Gaseous Fuels][Emissions][CO2][kt][no source][no method][no target][no option][no type]
status: valid
status modified: 2017-02-13
accepted date: 2017-02-13
in scheme: emissions_variables_MMR

1.A.1.c.iii [Other energy industries][Gaseous Fuels][Emissions][N2O][kt][no source][no method][no target][no option][no type]
type: Concept
definition: 1.A.1.c.iii [Other energy industries][Gaseous Fuels][Emissions][N2O][kt][no source][no method][no target][no option][no type]
status: valid
status modified: 2017-02-13
accepted date: 2017-02-13
in scheme: emissions_variables_MMR

1.A.1.c.iii [Other energy industries][Liquid Fuels][Emissions][CH4][kt][no source][no method][no target][no option][no type]
type: Concept
definition: 1.A.1.c.iii [Other energy industries][Liquid Fuels][Emissions][CH4][kt][no source][no method][no target][no option][no type]
status: valid
status modified: 2017-02-13
accepted date: 2017-02-13
in scheme: emissions_variables_MMR

1.A.1.c.iii [Other energy industries][Liquid Fuels][Emissions][CO2][kt][no source][no method][no target][no option][no type]
type: Concept
definition: 1.A.1.c.iii [Other energy industries][Liquid Fuels][Emissions][CO2][kt][no source][no method][no target][no option][no type]
status: valid
status modified: 2017-02-13
accepted date: 2017-02-13
in scheme: emissions_variables_MMR

1.A.1.c.iii [Other energy industries][Liquid Fuels][Emissions][N2O][kt][no source][no method][no target][no option][no type]
type: Concept
definition: 1.A.1.c.iii [Other energy industries][Liquid Fuels][Emissions][N2O][kt][no source][no method][no target][no option][no type]
status: valid
status modified: 2017-02-13
accepted date: 2017-02-13
in scheme: emissions_variables_MMR

1.A.1.c.iii [Other energy industries][Other Fossil Fuels][Emissions][CH4][kt][no source][no method][no target][no option][no type]
type: Concept
definition: 1.A.1.c.iii [Other energy industries][Other Fossil Fuels][Emissions][CH4][kt][no source][no method][no target][no option][no type]
status: valid
status modified: 2017-02-13
accepted date: 2017-02-13
in scheme: emissions_variables_MMR

1.A.1.c.iii [Other energy industries][Other Fossil Fuels][Emissions][CO2][kt][no source][no method][no target][no option][no type]
type: Concept
definition: 1.A.1.c.iii [Other energy industries][Other Fossil Fuels][Emissions][CO2][kt][no source][no method][no target][no option][no type]
status: valid
status modified: 2017-02-13
accepted date: 2017-02-13
in scheme: emissions_variables_MMR

1.A.1.c.iii [Other energy industries][Other Fossil Fuels][Emissions][N2O][kt][no source][no method][no target][no option][no type]
type: Concept
definition: 1.A.1.c.iii [Other energy industries][Other Fossil Fuels][Emissions][N2O][kt][no source][no method][no target][no option][no type]
status: valid
status modified: 2017-02-13
accepted date: 2017-02-13
in scheme: emissions_variables_MMR

1.A.1.c.iii [Other energy industries][Peat][Emissions][CH4][kt][no source][no method][no target][no option][no type]
type: Concept
definition: 1.A.1.c.iii [Other energy industries][Peat][Emissions][CH4][kt][no source][no method][no target][no option][no type]
status: valid
status modified: 2017-02-13
accepted date: 2017-02-13
in scheme: emissions_variables_MMR

1.A.1.c.iii [Other energy industries][Peat][Emissions][CO2][kt][no source][no method][no target][no option][no type]
type: Concept
definition: 1.A.1.c.iii [Other energy industries][Peat][Emissions][CO2][kt][no source][no method][no target][no option][no type]
status: valid
status modified: 2017-02-13
accepted date: 2017-02-13
in scheme: emissions_variables_MMR

1.A.1.c.iii [Other energy industries][Peat][Emissions][N2O][kt][no source][no method][no target][no option][no type]
type: Concept
definition: 1.A.1.c.iii [Other energy industries][Peat][Emissions][N2O][kt][no source][no method][no target][no option][no type]
status: valid
status modified: 2017-02-13
accepted date: 2017-02-13
in scheme: emissions_variables_MMR

1.A.1.c.iii [Other energy industries][Solid Fuels][Emissions][CH4][kt][no source][no method][no target][no option][no type]
type: Concept
definition: 1.A.1.c.iii [Other energy industries][Solid Fuels][Emissions][CH4][kt][no source][no method][no target][no option][no type]
status: valid
status modified: 2017-02-13
accepted date: 2017-02-13
in scheme: emissions_variables_MMR

1.A.1.c.iii [Other energy industries][Solid Fuels][Emissions][CO2][kt][no source][no method][no target][no option][no type]
type: Concept
definition: 1.A.1.c.iii [Other energy industries][Solid Fuels][Emissions][CO2][kt][no source][no method][no target][no option][no type]
status: valid
status modified: 2017-02-13
accepted date: 2017-02-13
in scheme: emissions_variables_MMR

1.A.1.c.iii [Other energy industries][Solid Fuels][Emissions][N2O][kt][no source][no method][no target][no option][no type]
type: Concept
definition: 1.A.1.c.iii [Other energy industries][Solid Fuels][Emissions][N2O][kt][no source][no method][no target][no option][no type]
status: valid
status modified: 2017-02-13
accepted date: 2017-02-13
in scheme: emissions_variables_MMR

1.A.1.c.iv [Other Manufacture of Solid Fuels and Other Energy Industries][Biomass][Emissions][CH4][kt][no source][no method][no target][no option][no type]
type: Concept
definition: 1.A.1.c.iv [Other Manufacture of Solid Fuels and Other Energy Industries][Biomass][Emissions][CH4][kt][no source][no method][no target][no option][no type]
status: valid
status modified: 2017-02-13
accepted date: 2017-02-13
in scheme: emissions_variables_MMR

1.A.1.c.iv [Other Manufacture of Solid Fuels and Other Energy Industries][Biomass][Emissions][CO2][kt][no source][no method][no target][no option][no type]
type: Concept
definition: 1.A.1.c.iv [Other Manufacture of Solid Fuels and Other Energy Industries][Biomass][Emissions][CO2][kt][no source][no method][no target][no option][no type]
status: valid
status modified: 2017-02-13
accepted date: 2017-02-13
in scheme: emissions_variables_MMR

1.A.1.c.iv [Other Manufacture of Solid Fuels and Other Energy Industries][Biomass][Emissions][N2O][kt][no source][no method][no target][no option][no type]
type: Concept
definition: 1.A.1.c.iv [Other Manufacture of Solid Fuels and Other Energy Industries][Biomass][Emissions][N2O][kt][no source][no method][no target][no option][no type]
status: valid
status modified: 2017-02-13
accepted date: 2017-02-13
in scheme: emissions_variables_MMR

1.A.1.c.iv [Other Manufacture of Solid Fuels and Other Energy Industries][Fuels][Emissions][CH4][kt][no source][no method][no target][no option][no type]
type: Concept
definition: 1.A.1.c.iv [Other Manufacture of Solid Fuels and Other Energy Industries][Fuels][Emissions][CH4][kt][no source][no method][no target][no option][no type]
status: valid
status modified: 2017-02-13
accepted date: 2017-02-13
in scheme: emissions_variables_MMR

1.A.1.c.iv [Other Manufacture of Solid Fuels and Other Energy Industries][Fuels][Emissions][CO2][kt][no source][no method][no target][no option][no type]
type: Concept
definition: 1.A.1.c.iv [Other Manufacture of Solid Fuels and Other Energy Industries][Fuels][Emissions][CO2][kt][no source][no method][no target][no option][no type]
status: valid
status modified: 2017-02-13
accepted date: 2017-02-13
in scheme: emissions_variables_MMR

1.A.1.c.iv [Other Manufacture of Solid Fuels and Other Energy Industries][Fuels][Emissions][N2O][kt][no source][no method][no target][no option][no type]
type: Concept
definition: 1.A.1.c.iv [Other Manufacture of Solid Fuels and Other Energy Industries][Fuels][Emissions][N2O][kt][no source][no method][no target][no option][no type]
status: valid
status modified: 2017-02-13
accepted date: 2017-02-13
in scheme: emissions_variables_MMR

1.A.1.c.iv [Other Manufacture of Solid Fuels and Other Energy Industries][Gaseous Fuels][Emissions][CH4][kt][no source][no method][no target][no option][no type]
type: Concept
definition: 1.A.1.c.iv [Other Manufacture of Solid Fuels and Other Energy Industries][Gaseous Fuels][Emissions][CH4][kt][no source][no method][no target][no option][no type]
status: valid
status modified: 2017-02-13
accepted date: 2017-02-13
in scheme: emissions_variables_MMR

1.A.1.c.iv [Other Manufacture of Solid Fuels and Other Energy Industries][Gaseous Fuels][Emissions][CO2][kt][no source][no method][no target][no option][no type]
type: Concept
definition: 1.A.1.c.iv [Other Manufacture of Solid Fuels and Other Energy Industries][Gaseous Fuels][Emissions][CO2][kt][no source][no method][no target][no option][no type]
status: valid
status modified: 2017-02-13
accepted date: 2017-02-13
in scheme: emissions_variables_MMR

1.A.1.c.iv [Other Manufacture of Solid Fuels and Other Energy Industries][Gaseous Fuels][Emissions][N2O][kt][no source][no method][no target][no option][no type]
type: Concept
definition: 1.A.1.c.iv [Other Manufacture of Solid Fuels and Other Energy Industries][Gaseous Fuels][Emissions][N2O][kt][no source][no method][no target][no option][no type]
status: valid
status modified: 2017-02-13
accepted date: 2017-02-13
in scheme: emissions_variables_MMR

1.A.1.c.iv [Other Manufacture of Solid Fuels and Other Energy Industries][Liquid Fuels][Emissions][CH4][kt][no source][no method][no target][no option][no type]
type: Concept
definition: 1.A.1.c.iv [Other Manufacture of Solid Fuels and Other Energy Industries][Liquid Fuels][Emissions][CH4][kt][no source][no method][no target][no option][no type]
status: valid
status modified: 2017-02-13
accepted date: 2017-02-13
in scheme: emissions_variables_MMR

1.A.1.c.iv [Other Manufacture of Solid Fuels and Other Energy Industries][Liquid Fuels][Emissions][CO2][kt][no source][no method][no target][no option][no type]
type: Concept
definition: 1.A.1.c.iv [Other Manufacture of Solid Fuels and Other Energy Industries][Liquid Fuels][Emissions][CO2][kt][no source][no method][no target][no option][no type]
status: valid
status modified: 2017-02-13
accepted date: 2017-02-13
in scheme: emissions_variables_MMR

1.A.1.c.iv [Other Manufacture of Solid Fuels and Other Energy Industries][Liquid Fuels][Emissions][N2O][kt][no source][no method][no target][no option][no type]
type: Concept
definition: 1.A.1.c.iv [Other Manufacture of Solid Fuels and Other Energy Industries][Liquid Fuels][Emissions][N2O][kt][no source][no method][no target][no option][no type]
status: valid
status modified: 2017-02-13
accepted date: 2017-02-13
in scheme: emissions_variables_MMR

1.A.1.c.iv [Other Manufacture of Solid Fuels and Other Energy Industries][Other Fossil Fuels][Emissions][CH4][kt][no source][no method][no target][no option][no type]
type: Concept
definition: 1.A.1.c.iv [Other Manufacture of Solid Fuels and Other Energy Industries][Other Fossil Fuels][Emissions][CH4][kt][no source][no method][no target][no option][no type]
status: valid
status modified: 2017-02-13
accepted date: 2017-02-13
in scheme: emissions_variables_MMR

1.A.1.c.iv [Other Manufacture of Solid Fuels and Other Energy Industries][Other Fossil Fuels][Emissions][CO2][kt][no source][no method][no target][no option][no type]
type: Concept
definition: 1.A.1.c.iv [Other Manufacture of Solid Fuels and Other Energy Industries][Other Fossil Fuels][Emissions][CO2][kt][no source][no method][no target][no option][no type]
status: valid
status modified: 2017-02-13
accepted date: 2017-02-13
in scheme: emissions_variables_MMR

1.A.1.c.iv [Other Manufacture of Solid Fuels and Other Energy Industries][Other Fossil Fuels][Emissions][N2O][kt][no source][no method][no target][no option][no type]
type: Concept
definition: 1.A.1.c.iv [Other Manufacture of Solid Fuels and Other Energy Industries][Other Fossil Fuels][Emissions][N2O][kt][no source][no method][no target][no option][no type]
status: valid
status modified: 2017-02-13
accepted date: 2017-02-13
in scheme: emissions_variables_MMR

1.A.1.c.iv [Other Manufacture of Solid Fuels and Other Energy Industries][Peat][Emissions][CH4][kt][no source][no method][no target][no option][no type]
type: Concept
definition: 1.A.1.c.iv [Other Manufacture of Solid Fuels and Other Energy Industries][Peat][Emissions][CH4][kt][no source][no method][no target][no option][no type]
status: valid
status modified: 2017-02-13
accepted date: 2017-02-13
in scheme: emissions_variables_MMR

1.A.1.c.iv [Other Manufacture of Solid Fuels and Other Energy Industries][Peat][Emissions][CO2][kt][no source][no method][no target][no option][no type]
type: Concept
definition: 1.A.1.c.iv [Other Manufacture of Solid Fuels and Other Energy Industries][Peat][Emissions][CO2][kt][no source][no method][no target][no option][no type]
status: valid
status modified: 2017-02-13
accepted date: 2017-02-13
in scheme: emissions_variables_MMR

1.A.1.c.iv [Other Manufacture of Solid Fuels and Other Energy Industries][Peat][Emissions][N2O][kt][no source][no method][no target][no option][no type]
type: Concept
definition: 1.A.1.c.iv [Other Manufacture of Solid Fuels and Other Energy Industries][Peat][Emissions][N2O][kt][no source][no method][no target][no option][no type]
status: valid
status modified: 2017-02-13
accepted date: 2017-02-13
in scheme: emissions_variables_MMR

1.A.1.c.iv [Other Manufacture of Solid Fuels and Other Energy Industries][Solid Fuels][Emissions][CH4][kt][no source][no method][no target][no option][no type]
type: Concept
definition: 1.A.1.c.iv [Other Manufacture of Solid Fuels and Other Energy Industries][Solid Fuels][Emissions][CH4][kt][no source][no method][no target][no option][no type]
status: valid
status modified: 2017-02-13
accepted date: 2017-02-13
in scheme: emissions_variables_MMR

1.A.1.c.iv [Other Manufacture of Solid Fuels and Other Energy Industries][Solid Fuels][Emissions][CO2][kt][no source][no method][no target][no option][no type]
type: Concept
definition: 1.A.1.c.iv [Other Manufacture of Solid Fuels and Other Energy Industries][Solid Fuels][Emissions][CO2][kt][no source][no method][no target][no option][no type]
status: valid
status modified: 2017-02-13
accepted date: 2017-02-13
in scheme: emissions_variables_MMR

1.A.1.c.iv [Other Manufacture of Solid Fuels and Other Energy Industries][Solid Fuels][Emissions][N2O][kt][no source][no method][no target][no option][no type]
type: Concept
definition: 1.A.1.c.iv [Other Manufacture of Solid Fuels and Other Energy Industries][Solid Fuels][Emissions][N2O][kt][no source][no method][no target][no option][no type]
status: valid
status modified: 2017-02-13
accepted date: 2017-02-13
in scheme: emissions_variables_MMR

1.A.2 [Manufacturing Industries and Construction][Biomass][Emissions][CH4][kt][no source][no method][no target][no option][no type]
type: Concept
definition: 1.A.2 [Manufacturing Industries and Construction][Biomass][Emissions][CH4][kt][no source][no method][no target][no option][no type]
status: valid
status modified: 2017-02-13
accepted date: 2017-02-13
in scheme: emissions_variables_MMR

1.A.2 [Manufacturing Industries and Construction][Biomass][Emissions][CO2][kt][no source][no method][no target][no option][no type]
type: Concept
definition: 1.A.2 [Manufacturing Industries and Construction][Biomass][Emissions][CO2][kt][no source][no method][no target][no option][no type]
status: valid
status modified: 2017-02-13
accepted date: 2017-02-13
in scheme: emissions_variables_MMR

1.A.2 [Manufacturing Industries and Construction][Biomass][Emissions][N2O][kt][no source][no method][no target][no option][no type]
type: Concept
definition: 1.A.2 [Manufacturing Industries and Construction][Biomass][Emissions][N2O][kt][no source][no method][no target][no option][no type]
status: valid
status modified: 2017-02-13
accepted date: 2017-02-13
in scheme: emissions_variables_MMR

1.A.2 [Manufacturing Industries and Construction][Fuels][Emissions][Aggregate GHGs][kt CO2 equivalent][no source][no method][no target][no option][no type]
type: Concept
definition: 1.A.2 [Manufacturing Industries and Construction][Fuels][Emissions][Aggregate GHGs][kt CO2 equivalent][no source][no method][no target][no option][no type]
status: valid
status modified: 2017-02-13
accepted date: 2017-02-13
in scheme: emissions_variables_MMR

1.A.2 [Manufacturing Industries and Construction][Fuels][Emissions][CH4][kt][no source][no method][no target][no option][no type]
type: Concept
definition: 1.A.2 [Manufacturing Industries and Construction][Fuels][Emissions][CH4][kt][no source][no method][no target][no option][no type]
status: valid
status modified: 2017-02-13
accepted date: 2017-02-13
in scheme: emissions_variables_MMR

1.A.2 [Manufacturing Industries and Construction][Fuels][Emissions][CO][kt][no source][no method][no target][no option][no type]
type: Concept
definition: 1.A.2 [Manufacturing Industries and Construction][Fuels][Emissions][CO][kt][no source][no method][no target][no option][no type]
status: valid
status modified: 2017-02-13
accepted date: 2017-02-13
in scheme: emissions_variables_MMR

1.A.2 [Manufacturing Industries and Construction][Fuels][Emissions][CO2][kt][no source][no method][no target][no option][no type]
type: Concept
definition: 1.A.2 [Manufacturing Industries and Construction][Fuels][Emissions][CO2][kt][no source][no method][no target][no option][no type]
status: valid
status modified: 2017-02-13
accepted date: 2017-02-13
in scheme: emissions_variables_MMR

1.A.2 [Manufacturing Industries and Construction][Fuels][Emissions][N2O][kt][no source][no method][no target][no option][no type]
type: Concept
definition: 1.A.2 [Manufacturing Industries and Construction][Fuels][Emissions][N2O][kt][no source][no method][no target][no option][no type]
status: valid
status modified: 2017-02-13
accepted date: 2017-02-13
in scheme: emissions_variables_MMR

1.A.2 [Manufacturing Industries and Construction][Fuels][Emissions][NMVOC][kt][no source][no method][no target][no option][no type]
type: Concept
definition: 1.A.2 [Manufacturing Industries and Construction][Fuels][Emissions][NMVOC][kt][no source][no method][no target][no option][no type]
status: valid
status modified: 2017-02-13
accepted date: 2017-02-13
in scheme: emissions_variables_MMR

1.A.2 [Manufacturing Industries and Construction][Fuels][Emissions][NOx][kt][no source][no method][no target][no option][no type]
type: Concept
definition: 1.A.2 [Manufacturing Industries and Construction][Fuels][Emissions][NOx][kt][no source][no method][no target][no option][no type]
status: valid
status modified: 2017-02-13
accepted date: 2017-02-13
in scheme: emissions_variables_MMR

1.A.2 [Manufacturing Industries and Construction][Fuels][Emissions][SO2][kt][no source][no method][no target][no option][no type]
type: Concept
definition: 1.A.2 [Manufacturing Industries and Construction][Fuels][Emissions][SO2][kt][no source][no method][no target][no option][no type]
status: valid
status modified: 2017-02-13
accepted date: 2017-02-13
in scheme: emissions_variables_MMR

1.A.2 [Manufacturing Industries and Construction][Gaseous Fuels][Emissions][CH4][kt][no source][no method][no target][no option][no type]
type: Concept
definition: 1.A.2 [Manufacturing Industries and Construction][Gaseous Fuels][Emissions][CH4][kt][no source][no method][no target][no option][no type]
status: valid
status modified: 2017-02-13
accepted date: 2017-02-13
in scheme: emissions_variables_MMR

1.A.2 [Manufacturing Industries and Construction][Gaseous Fuels][Emissions][CO2][kt][no source][no method][no target][no option][no type]
type: Concept
definition: 1.A.2 [Manufacturing Industries and Construction][Gaseous Fuels][Emissions][CO2][kt][no source][no method][no target][no option][no type]
status: valid
status modified: 2017-02-13
accepted date: 2017-02-13
in scheme: emissions_variables_MMR

1.A.2 [Manufacturing Industries and Construction][Gaseous Fuels][Emissions][N2O][kt][no source][no method][no target][no option][no type]
type: Concept
definition: 1.A.2 [Manufacturing Industries and Construction][Gaseous Fuels][Emissions][N2O][kt][no source][no method][no target][no option][no type]
status: valid
status modified: 2017-02-13
accepted date: 2017-02-13
in scheme: emissions_variables_MMR

1.A.2 [Manufacturing Industries and Construction][Liquid Fuels][Emissions][CH4][kt][no source][no method][no target][no option][no type]
type: Concept
definition: 1.A.2 [Manufacturing Industries and Construction][Liquid Fuels][Emissions][CH4][kt][no source][no method][no target][no option][no type]
status: valid
status modified: 2017-02-13
accepted date: 2017-02-13
in scheme: emissions_variables_MMR

1.A.2 [Manufacturing Industries and Construction][Liquid Fuels][Emissions][CO2][kt][no source][no method][no target][no option][no type]
type: Concept
definition: 1.A.2 [Manufacturing Industries and Construction][Liquid Fuels][Emissions][CO2][kt][no source][no method][no target][no option][no type]
status: valid
status modified: 2017-02-13
accepted date: 2017-02-13
in scheme: emissions_variables_MMR

1.A.2 [Manufacturing Industries and Construction][Liquid Fuels][Emissions][N2O][kt][no source][no method][no target][no option][no type]
type: Concept
definition: 1.A.2 [Manufacturing Industries and Construction][Liquid Fuels][Emissions][N2O][kt][no source][no method][no target][no option][no type]
status: valid
status modified: 2017-02-13
accepted date: 2017-02-13
in scheme: emissions_variables_MMR

1.A.2 [Manufacturing Industries and Construction][Other Fossil Fuels][Emissions][CH4][kt][no source][no method][no target][no option][no type]
type: Concept
definition: 1.A.2 [Manufacturing Industries and Construction][Other Fossil Fuels][Emissions][CH4][kt][no source][no method][no target][no option][no type]
status: valid
status modified: 2017-02-13
accepted date: 2017-02-13
in scheme: emissions_variables_MMR

1.A.2 [Manufacturing Industries and Construction][Other Fossil Fuels][Emissions][CO2][kt][no source][no method][no target][no option][no type]
type: Concept
definition: 1.A.2 [Manufacturing Industries and Construction][Other Fossil Fuels][Emissions][CO2][kt][no source][no method][no target][no option][no type]
status: valid
status modified: 2017-02-13
accepted date: 2017-02-13
in scheme: emissions_variables_MMR

1.A.2 [Manufacturing Industries and Construction][Other Fossil Fuels][Emissions][N2O][kt][no source][no method][no target][no option][no type]
type: Concept
definition: 1.A.2 [Manufacturing Industries and Construction][Other Fossil Fuels][Emissions][N2O][kt][no source][no method][no target][no option][no type]
status: valid
status modified: 2017-02-13
accepted date: 2017-02-13
in scheme: emissions_variables_MMR

1.A.2 [Manufacturing Industries and Construction][Peat][Emissions][CH4][kt][no source][no method][no target][no option][no type]
type: Concept
definition: 1.A.2 [Manufacturing Industries and Construction][Peat][Emissions][CH4][kt][no source][no method][no target][no option][no type]
status: valid
status modified: 2017-02-13
accepted date: 2017-02-13
in scheme: emissions_variables_MMR

1.A.2 [Manufacturing Industries and Construction][Peat][Emissions][CO2][kt][no source][no method][no target][no option][no type]
type: Concept
definition: 1.A.2 [Manufacturing Industries and Construction][Peat][Emissions][CO2][kt][no source][no method][no target][no option][no type]
status: valid
status modified: 2017-02-13
accepted date: 2017-02-13
in scheme: emissions_variables_MMR

1.A.2 [Manufacturing Industries and Construction][Peat][Emissions][N2O][kt][no source][no method][no target][no option][no type]
type: Concept
definition: 1.A.2 [Manufacturing Industries and Construction][Peat][Emissions][N2O][kt][no source][no method][no target][no option][no type]
status: valid
status modified: 2017-02-13
accepted date: 2017-02-13
in scheme: emissions_variables_MMR

1.A.2 [Manufacturing Industries and Construction][Solid Fuels][Emissions][CH4][kt][no source][no method][no target][no option][no type]
type: Concept
definition: 1.A.2 [Manufacturing Industries and Construction][Solid Fuels][Emissions][CH4][kt][no source][no method][no target][no option][no type]
status: valid
status modified: 2017-02-13
accepted date: 2017-02-13
in scheme: emissions_variables_MMR

1.A.2 [Manufacturing Industries and Construction][Solid Fuels][Emissions][CO2][kt][no source][no method][no target][no option][no type]
type: Concept
definition: 1.A.2 [Manufacturing Industries and Construction][Solid Fuels][Emissions][CO2][kt][no source][no method][no target][no option][no type]
status: valid
status modified: 2017-02-13
accepted date: 2017-02-13
in scheme: emissions_variables_MMR

1.A.2 [Manufacturing Industries and Construction][Solid Fuels][Emissions][N2O][kt][no source][no method][no target][no option][no type]
type: Concept
definition: 1.A.2 [Manufacturing Industries and Construction][Solid Fuels][Emissions][N2O][kt][no source][no method][no target][no option][no type]
status: valid
status modified: 2017-02-13
accepted date: 2017-02-13
in scheme: emissions_variables_MMR

1.A.2.a [Iron and Steel][Fuels][Emissions][CH4][kt][no source][no method][no target][no option][no type]
type: Concept
definition: 1.A.2.a [Iron and Steel][Fuels][Emissions][CH4][kt][no source][no method][no target][no option][no type]
status: valid
status modified: 2017-02-13
accepted date: 2017-02-13
in scheme: emissions_variables_MMR

1.A.2.a [Iron and Steel][Fuels][Emissions][CO][kt][no source][no method][no target][no option][no type]
type: Concept
definition: 1.A.2.a [Iron and Steel][Fuels][Emissions][CO][kt][no source][no method][no target][no option][no type]
status: valid
status modified: 2017-02-13
accepted date: 2017-02-13
in scheme: emissions_variables_MMR

1.A.2.a [Iron and Steel][Fuels][Emissions][CO2][kt][no source][no method][no target][no option][no type]
type: Concept
definition: 1.A.2.a [Iron and Steel][Fuels][Emissions][CO2][kt][no source][no method][no target][no option][no type]
status: valid
status modified: 2017-02-13
accepted date: 2017-02-13
in scheme: emissions_variables_MMR

1.A.2.a [Iron and Steel][Fuels][Emissions][N2O][kt][no source][no method][no target][no option][no type]
type: Concept
definition: 1.A.2.a [Iron and Steel][Fuels][Emissions][N2O][kt][no source][no method][no target][no option][no type]
status: valid
status modified: 2017-02-13
accepted date: 2017-02-13
in scheme: emissions_variables_MMR

1.A.2.a [Iron and Steel][Fuels][Emissions][NMVOC][kt][no source][no method][no target][no option][no type]
type: Concept
definition: 1.A.2.a [Iron and Steel][Fuels][Emissions][NMVOC][kt][no source][no method][no target][no option][no type]
status: valid
status modified: 2017-02-13
accepted date: 2017-02-13
in scheme: emissions_variables_MMR

1.A.2.a [Iron and Steel][Fuels][Emissions][NOx][kt][no source][no method][no target][no option][no type]
type: Concept
definition: 1.A.2.a [Iron and Steel][Fuels][Emissions][NOx][kt][no source][no method][no target][no option][no type]
status: valid
status modified: 2017-02-13
accepted date: 2017-02-13
in scheme: emissions_variables_MMR

1.A.2.a [Iron and Steel][Fuels][Emissions][SO2][kt][no source][no method][no target][no option][no type]
type: Concept
definition: 1.A.2.a [Iron and Steel][Fuels][Emissions][SO2][kt][no source][no method][no target][no option][no type]
status: valid
status modified: 2017-02-13
accepted date: 2017-02-13
in scheme: emissions_variables_MMR

1.A.2.a Biomass [Iron and Steel][Biomass][Emissions][CH4][kt][no source][no method][no target][no option][no type]
type: Concept
definition: 1.A.2.a Biomass [Iron and Steel][Biomass][Emissions][CH4][kt][no source][no method][no target][no option][no type]
status: valid
status modified: 2017-02-13
accepted date: 2017-02-13
in scheme: emissions_variables_MMR

1.A.2.a Biomass [Iron and Steel][Biomass][Emissions][CO2][kt][no source][no method][no target][no option][no type]
type: Concept
definition: 1.A.2.a Biomass [Iron and Steel][Biomass][Emissions][CO2][kt][no source][no method][no target][no option][no type]
status: valid
status modified: 2017-02-13
accepted date: 2017-02-13
in scheme: emissions_variables_MMR

1.A.2.a Biomass [Iron and Steel][Biomass][Emissions][N2O][kt][no source][no method][no target][no option][no type]
type: Concept
definition: 1.A.2.a Biomass [Iron and Steel][Biomass][Emissions][N2O][kt][no source][no method][no target][no option][no type]
status: valid
status modified: 2017-02-13
accepted date: 2017-02-13
in scheme: emissions_variables_MMR

1.A.2.a Gaseous Fuels [Iron and Steel][Gaseous Fuels][Emissions][CH4][kt][no source][no method][no target][no option][no type]
type: Concept
definition: 1.A.2.a Gaseous Fuels [Iron and Steel][Gaseous Fuels][Emissions][CH4][kt][no source][no method][no target][no option][no type]
status: valid
status modified: 2017-02-13
accepted date: 2017-02-13
in scheme: emissions_variables_MMR

1.A.2.a Gaseous Fuels [Iron and Steel][Gaseous Fuels][Emissions][CO2][kt][no source][no method][no target][no option][no type]
type: Concept
definition: 1.A.2.a Gaseous Fuels [Iron and Steel][Gaseous Fuels][Emissions][CO2][kt][no source][no method][no target][no option][no type]
status: valid
status modified: 2017-02-13
accepted date: 2017-02-13
in scheme: emissions_variables_MMR

1.A.2.a Gaseous Fuels [Iron and Steel][Gaseous Fuels][Emissions][N2O][kt][no source][no method][no target][no option][no type]
type: Concept
definition: 1.A.2.a Gaseous Fuels [Iron and Steel][Gaseous Fuels][Emissions][N2O][kt][no source][no method][no target][no option][no type]
status: valid
status modified: 2017-02-13
accepted date: 2017-02-13
in scheme: emissions_variables_MMR

1.A.2.a Liquid Fuels [Iron and Steel][Liquid Fuels][Emissions][CH4][kt][no source][no method][no target][no option][no type]
type: Concept
definition: 1.A.2.a Liquid Fuels [Iron and Steel][Liquid Fuels][Emissions][CH4][kt][no source][no method][no target][no option][no type]
status: valid
status modified: 2017-02-13
accepted date: 2017-02-13
in scheme: emissions_variables_MMR

1.A.2.a Liquid Fuels [Iron and Steel][Liquid Fuels][Emissions][CO2][kt][no source][no method][no target][no option][no type]
type: Concept
definition: 1.A.2.a Liquid Fuels [Iron and Steel][Liquid Fuels][Emissions][CO2][kt][no source][no method][no target][no option][no type]
status: valid
status modified: 2017-02-13
accepted date: 2017-02-13
in scheme: emissions_variables_MMR

1.A.2.a Liquid Fuels [Iron and Steel][Liquid Fuels][Emissions][N2O][kt][no source][no method][no target][no option][no type]
type: Concept
definition: 1.A.2.a Liquid Fuels [Iron and Steel][Liquid Fuels][Emissions][N2O][kt][no source][no method][no target][no option][no type]
status: valid
status modified: 2017-02-13
accepted date: 2017-02-13
in scheme: emissions_variables_MMR

1.A.2.a Other Fossil Fuel [Iron and Steel][Other Fossil Fuels][Emissions][CH4][kt][no source][no method][no target][no option][no type]
type: Concept
definition: 1.A.2.a Other Fossil Fuel [Iron and Steel][Other Fossil Fuels][Emissions][CH4][kt][no source][no method][no target][no option][no type]
status: valid
status modified: 2017-02-13
accepted date: 2017-02-13
in scheme: emissions_variables_MMR

1.A.2.a Other Fossil Fuel [Iron and Steel][Other Fossil Fuels][Emissions][CO2][kt][no source][no method][no target][no option][no type]
type: Concept
definition: 1.A.2.a Other Fossil Fuel [Iron and Steel][Other Fossil Fuels][Emissions][CO2][kt][no source][no method][no target][no option][no type]
status: valid
status modified: 2017-02-13
accepted date: 2017-02-13
in scheme: emissions_variables_MMR

1.A.2.a Other Fossil Fuel [Iron and Steel][Other Fossil Fuels][Emissions][N2O][kt][no source][no method][no target][no option][no type]
type: Concept
definition: 1.A.2.a Other Fossil Fuel [Iron and Steel][Other Fossil Fuels][Emissions][N2O][kt][no source][no method][no target][no option][no type]
status: valid
status modified: 2017-02-13
accepted date: 2017-02-13
in scheme: emissions_variables_MMR

1.A.2.a Peat [Iron and Steel][Peat][Emissions][CH4][kt][no source][no method][no target][no option][no type]
type: Concept
definition: 1.A.2.a Peat [Iron and Steel][Peat][Emissions][CH4][kt][no source][no method][no target][no option][no type]
status: valid
status modified: 2017-02-13
accepted date: 2017-02-13
in scheme: emissions_variables_MMR

1.A.2.a Peat [Iron and Steel][Peat][Emissions][CO2][kt][no source][no method][no target][no option][no type]
type: Concept
definition: 1.A.2.a Peat [Iron and Steel][Peat][Emissions][CO2][kt][no source][no method][no target][no option][no type]
status: valid
status modified: 2017-02-13
accepted date: 2017-02-13
in scheme: emissions_variables_MMR

1.A.2.a Peat [Iron and Steel][Peat][Emissions][N2O][kt][no source][no method][no target][no option][no type]
type: Concept
definition: 1.A.2.a Peat [Iron and Steel][Peat][Emissions][N2O][kt][no source][no method][no target][no option][no type]
status: valid
status modified: 2017-02-13
accepted date: 2017-02-13
in scheme: emissions_variables_MMR

1.A.2.a Solid Fuels [Iron and Steel][Solid Fuels][Emissions][CH4][kt][no source][no method][no target][no option][no type]
type: Concept
definition: 1.A.2.a Solid Fuels [Iron and Steel][Solid Fuels][Emissions][CH4][kt][no source][no method][no target][no option][no type]
status: valid
status modified: 2017-02-13
accepted date: 2017-02-13
in scheme: emissions_variables_MMR

1.A.2.a Solid Fuels [Iron and Steel][Solid Fuels][Emissions][CO2][kt][no source][no method][no target][no option][no type]
type: Concept
definition: 1.A.2.a Solid Fuels [Iron and Steel][Solid Fuels][Emissions][CO2][kt][no source][no method][no target][no option][no type]
status: valid
status modified: 2017-02-13
accepted date: 2017-02-13
in scheme: emissions_variables_MMR

1.A.2.a Solid Fuels [Iron and Steel][Solid Fuels][Emissions][N2O][kt][no source][no method][no target][no option][no type]
type: Concept
definition: 1.A.2.a Solid Fuels [Iron and Steel][Solid Fuels][Emissions][N2O][kt][no source][no method][no target][no option][no type]
status: valid
status modified: 2017-02-13
accepted date: 2017-02-13
in scheme: emissions_variables_MMR

1.A.2.b [Non-Ferrous Metals][Fuels][Emissions][CH4][kt][no source][no method][no target][no option][no type]
type: Concept
definition: 1.A.2.b [Non-Ferrous Metals][Fuels][Emissions][CH4][kt][no source][no method][no target][no option][no type]
status: valid
status modified: 2017-02-13
accepted date: 2017-02-13
in scheme: emissions_variables_MMR

1.A.2.b [Non-Ferrous Metals][Fuels][Emissions][CO][kt][no source][no method][no target][no option][no type]
type: Concept
definition: 1.A.2.b [Non-Ferrous Metals][Fuels][Emissions][CO][kt][no source][no method][no target][no option][no type]
status: valid
status modified: 2017-02-13
accepted date: 2017-02-13
in scheme: emissions_variables_MMR

1.A.2.b [Non-Ferrous Metals][Fuels][Emissions][CO2][kt][no source][no method][no target][no option][no type]
type: Concept
definition: 1.A.2.b [Non-Ferrous Metals][Fuels][Emissions][CO2][kt][no source][no method][no target][no option][no type]
status: valid
status modified: 2017-02-13
accepted date: 2017-02-13
in scheme: emissions_variables_MMR

1.A.2.b [Non-Ferrous Metals][Fuels][Emissions][N2O][kt][no source][no method][no target][no option][no type]
type: Concept
definition: 1.A.2.b [Non-Ferrous Metals][Fuels][Emissions][N2O][kt][no source][no method][no target][no option][no type]
status: valid
status modified: 2017-02-13
accepted date: 2017-02-13
in scheme: emissions_variables_MMR

1.A.2.b [Non-Ferrous Metals][Fuels][Emissions][NMVOC][kt][no source][no method][no target][no option][no type]
type: Concept
definition: 1.A.2.b [Non-Ferrous Metals][Fuels][Emissions][NMVOC][kt][no source][no method][no target][no option][no type]
status: valid
status modified: 2017-02-13
accepted date: 2017-02-13
in scheme: emissions_variables_MMR

1.A.2.b [Non-Ferrous Metals][Fuels][Emissions][NOx][kt][no source][no method][no target][no option][no type]
type: Concept
definition: 1.A.2.b [Non-Ferrous Metals][Fuels][Emissions][NOx][kt][no source][no method][no target][no option][no type]
status: valid
status modified: 2017-02-13
accepted date: 2017-02-13
in scheme: emissions_variables_MMR

1.A.2.b [Non-Ferrous Metals][Fuels][Emissions][SO2][kt][no source][no method][no target][no option][no type]
type: Concept
definition: 1.A.2.b [Non-Ferrous Metals][Fuels][Emissions][SO2][kt][no source][no method][no target][no option][no type]
status: valid
status modified: 2017-02-13
accepted date: 2017-02-13
in scheme: emissions_variables_MMR

1.A.2.b Biomass [Non-Ferrous Metals][Biomass][Emissions][CH4][kt][no source][no method][no target][no option][no type]
type: Concept
definition: 1.A.2.b Biomass [Non-Ferrous Metals][Biomass][Emissions][CH4][kt][no source][no method][no target][no option][no type]
status: valid
status modified: 2017-02-13
accepted date: 2017-02-13
in scheme: emissions_variables_MMR

1.A.2.b Biomass [Non-Ferrous Metals][Biomass][Emissions][CO2][kt][no source][no method][no target][no option][no type]
type: Concept
definition: 1.A.2.b Biomass [Non-Ferrous Metals][Biomass][Emissions][CO2][kt][no source][no method][no target][no option][no type]
status: valid
status modified: 2017-02-13
accepted date: 2017-02-13
in scheme: emissions_variables_MMR

1.A.2.b Biomass [Non-Ferrous Metals][Biomass][Emissions][N2O][kt][no source][no method][no target][no option][no type]
type: Concept
definition: 1.A.2.b Biomass [Non-Ferrous Metals][Biomass][Emissions][N2O][kt][no source][no method][no target][no option][no type]
status: valid
status modified: 2017-02-13
accepted date: 2017-02-13
in scheme: emissions_variables_MMR

1.A.2.b Gaseous Fuels [Non-Ferrous Metals][Gaseous Fuels][Emissions][CH4][kt][no source][no method][no target][no option][no type]
type: Concept
definition: 1.A.2.b Gaseous Fuels [Non-Ferrous Metals][Gaseous Fuels][Emissions][CH4][kt][no source][no method][no target][no option][no type]
status: valid
status modified: 2017-02-13
accepted date: 2017-02-13
in scheme: emissions_variables_MMR

1.A.2.b Gaseous Fuels [Non-Ferrous Metals][Gaseous Fuels][Emissions][CO2][kt][no source][no method][no target][no option][no type]
type: Concept
definition: 1.A.2.b Gaseous Fuels [Non-Ferrous Metals][Gaseous Fuels][Emissions][CO2][kt][no source][no method][no target][no option][no type]
status: valid
status modified: 2017-02-13
accepted date: 2017-02-13
in scheme: emissions_variables_MMR

1.A.2.b Gaseous Fuels [Non-Ferrous Metals][Gaseous Fuels][Emissions][N2O][kt][no source][no method][no target][no option][no type]
type: Concept
definition: 1.A.2.b Gaseous Fuels [Non-Ferrous Metals][Gaseous Fuels][Emissions][N2O][kt][no source][no method][no target][no option][no type]
status: valid
status modified: 2017-02-13
accepted date: 2017-02-13
in scheme: emissions_variables_MMR

1.A.2.b Liquid Fuels [Non-Ferrous Metals][Liquid Fuels][Emissions][CH4][kt][no source][no method][no target][no option][no type]
type: Concept
definition: 1.A.2.b Liquid Fuels [Non-Ferrous Metals][Liquid Fuels][Emissions][CH4][kt][no source][no method][no target][no option][no type]
status: valid
status modified: 2017-02-13
accepted date: 2017-02-13
in scheme: emissions_variables_MMR

1.A.2.b Liquid Fuels [Non-Ferrous Metals][Liquid Fuels][Emissions][CO2][kt][no source][no method][no target][no option][no type]
type: Concept
definition: 1.A.2.b Liquid Fuels [Non-Ferrous Metals][Liquid Fuels][Emissions][CO2][kt][no source][no method][no target][no option][no type]
status: valid
status modified: 2017-02-13
accepted date: 2017-02-13
in scheme: emissions_variables_MMR

1.A.2.b Liquid Fuels [Non-Ferrous Metals][Liquid Fuels][Emissions][N2O][kt][no source][no method][no target][no option][no type]
type: Concept
definition: 1.A.2.b Liquid Fuels [Non-Ferrous Metals][Liquid Fuels][Emissions][N2O][kt][no source][no method][no target][no option][no type]
status: valid
status modified: 2017-02-13
accepted date: 2017-02-13
in scheme: emissions_variables_MMR

1.A.2.b Other Fossil Fuel [Non-Ferrous Metals][Other Fossil Fuels][Emissions][CH4][kt][no source][no method][no target][no option][no type]
type: Concept
definition: 1.A.2.b Other Fossil Fuel [Non-Ferrous Metals][Other Fossil Fuels][Emissions][CH4][kt][no source][no method][no target][no option][no type]
status: valid
status modified: 2017-02-13
accepted date: 2017-02-13
in scheme: emissions_variables_MMR

1.A.2.b Other Fossil Fuel [Non-Ferrous Metals][Other Fossil Fuels][Emissions][CO2][kt][no source][no method][no target][no option][no type]
type: Concept
definition: 1.A.2.b Other Fossil Fuel [Non-Ferrous Metals][Other Fossil Fuels][Emissions][CO2][kt][no source][no method][no target][no option][no type]
status: valid
status modified: 2017-02-13
accepted date: 2017-02-13
in scheme: emissions_variables_MMR

1.A.2.b Other Fossil Fuel [Non-Ferrous Metals][Other Fossil Fuels][Emissions][N2O][kt][no source][no method][no target][no option][no type]
type: Concept
definition: 1.A.2.b Other Fossil Fuel [Non-Ferrous Metals][Other Fossil Fuels][Emissions][N2O][kt][no source][no method][no target][no option][no type]
status: valid
status modified: 2017-02-13
accepted date: 2017-02-13
in scheme: emissions_variables_MMR

1.A.2.b Peat [Non-Ferrous Metals][Peat][Emissions][CH4][kt][no source][no method][no target][no option][no type]
type: Concept
definition: 1.A.2.b Peat [Non-Ferrous Metals][Peat][Emissions][CH4][kt][no source][no method][no target][no option][no type]
status: valid
status modified: 2017-02-13
accepted date: 2017-02-13
in scheme: emissions_variables_MMR

1.A.2.b Peat [Non-Ferrous Metals][Peat][Emissions][CO2][kt][no source][no method][no target][no option][no type]
type: Concept
definition: 1.A.2.b Peat [Non-Ferrous Metals][Peat][Emissions][CO2][kt][no source][no method][no target][no option][no type]
status: valid
status modified: 2017-02-13
accepted date: 2017-02-13
in scheme: emissions_variables_MMR

1.A.2.b Peat [Non-Ferrous Metals][Peat][Emissions][N2O][kt][no source][no method][no target][no option][no type]
type: Concept
definition: 1.A.2.b Peat [Non-Ferrous Metals][Peat][Emissions][N2O][kt][no source][no method][no target][no option][no type]
status: valid
status modified: 2017-02-13
accepted date: 2017-02-13
in scheme: emissions_variables_MMR

1.A.2.b Solid Fuels [Non-Ferrous Metals][Solid Fuels][Emissions][CH4][kt][no source][no method][no target][no option][no type]
type: Concept
definition: 1.A.2.b Solid Fuels [Non-Ferrous Metals][Solid Fuels][Emissions][CH4][kt][no source][no method][no target][no option][no type]
status: valid
status modified: 2017-02-13
accepted date: 2017-02-13
in scheme: emissions_variables_MMR

1.A.2.b Solid Fuels [Non-Ferrous Metals][Solid Fuels][Emissions][CO2][kt][no source][no method][no target][no option][no type]
type: Concept
definition: 1.A.2.b Solid Fuels [Non-Ferrous Metals][Solid Fuels][Emissions][CO2][kt][no source][no method][no target][no option][no type]
status: valid
status modified: 2017-02-13
accepted date: 2017-02-13
in scheme: emissions_variables_MMR

1.A.2.b Solid Fuels [Non-Ferrous Metals][Solid Fuels][Emissions][N2O][kt][no source][no method][no target][no option][no type]
type: Concept
definition: 1.A.2.b Solid Fuels [Non-Ferrous Metals][Solid Fuels][Emissions][N2O][kt][no source][no method][no target][no option][no type]
status: valid
status modified: 2017-02-13
accepted date: 2017-02-13
in scheme: emissions_variables_MMR

1.A.2.c [Chemicals][Fuels][Emissions][CH4][kt][no source][no method][no target][no option][no type]
type: Concept
definition: 1.A.2.c [Chemicals][Fuels][Emissions][CH4][kt][no source][no method][no target][no option][no type]
status: valid
status modified: 2017-02-13
accepted date: 2017-02-13
in scheme: emissions_variables_MMR

1.A.2.c [Chemicals][Fuels][Emissions][CO][kt][no source][no method][no target][no option][no type]
type: Concept
definition: 1.A.2.c [Chemicals][Fuels][Emissions][CO][kt][no source][no method][no target][no option][no type]
status: valid
status modified: 2017-02-13
accepted date: 2017-02-13
in scheme: emissions_variables_MMR

1.A.2.c [Chemicals][Fuels][Emissions][CO2][kt][no source][no method][no target][no option][no type]
type: Concept
definition: 1.A.2.c [Chemicals][Fuels][Emissions][CO2][kt][no source][no method][no target][no option][no type]
status: valid
status modified: 2017-02-13
accepted date: 2017-02-13
in scheme: emissions_variables_MMR

1.A.2.c [Chemicals][Fuels][Emissions][N2O][kt][no source][no method][no target][no option][no type]
type: Concept
definition: 1.A.2.c [Chemicals][Fuels][Emissions][N2O][kt][no source][no method][no target][no option][no type]
status: valid
status modified: 2017-02-13
accepted date: 2017-02-13
in scheme: emissions_variables_MMR

1.A.2.c [Chemicals][Fuels][Emissions][NMVOC][kt][no source][no method][no target][no option][no type]
type: Concept
definition: 1.A.2.c [Chemicals][Fuels][Emissions][NMVOC][kt][no source][no method][no target][no option][no type]
status: valid
status modified: 2017-02-13
accepted date: 2017-02-13
in scheme: emissions_variables_MMR

1.A.2.c [Chemicals][Fuels][Emissions][NOx][kt][no source][no method][no target][no option][no type]
type: Concept
definition: 1.A.2.c [Chemicals][Fuels][Emissions][NOx][kt][no source][no method][no target][no option][no type]
status: valid
status modified: 2017-02-13
accepted date: 2017-02-13
in scheme: emissions_variables_MMR

1.A.2.c [Chemicals][Fuels][Emissions][SO2][kt][no source][no method][no target][no option][no type]
type: Concept
definition: 1.A.2.c [Chemicals][Fuels][Emissions][SO2][kt][no source][no method][no target][no option][no type]
status: valid
status modified: 2017-02-13
accepted date: 2017-02-13
in scheme: emissions_variables_MMR

1.A.2.c Biomass [Chemicals][Biomass][Emissions][CH4][kt][no source][no method][no target][no option][no type]
type: Concept
definition: 1.A.2.c Biomass [Chemicals][Biomass][Emissions][CH4][kt][no source][no method][no target][no option][no type]
status: valid
status modified: 2017-02-13
accepted date: 2017-02-13
in scheme: emissions_variables_MMR

1.A.2.c Biomass [Chemicals][Biomass][Emissions][CO2][kt][no source][no method][no target][no option][no type]
type: Concept
definition: 1.A.2.c Biomass [Chemicals][Biomass][Emissions][CO2][kt][no source][no method][no target][no option][no type]
status: valid
status modified: 2017-02-13
accepted date: 2017-02-13
in scheme: emissions_variables_MMR

1.A.2.c Biomass [Chemicals][Biomass][Emissions][N2O][kt][no source][no method][no target][no option][no type]
type: Concept
definition: 1.A.2.c Biomass [Chemicals][Biomass][Emissions][N2O][kt][no source][no method][no target][no option][no type]
status: valid
status modified: 2017-02-13
accepted date: 2017-02-13
in scheme: emissions_variables_MMR

1.A.2.c Gaseous Fuels [Chemicals][Gaseous Fuels][Emissions][CH4][kt][no source][no method][no target][no option][no type]
type: Concept
definition: 1.A.2.c Gaseous Fuels [Chemicals][Gaseous Fuels][Emissions][CH4][kt][no source][no method][no target][no option][no type]
status: valid
status modified: 2017-02-13
accepted date: 2017-02-13
in scheme: emissions_variables_MMR

1.A.2.c Gaseous Fuels [Chemicals][Gaseous Fuels][Emissions][CO2][kt][no source][no method][no target][no option][no type]
type: Concept
definition: 1.A.2.c Gaseous Fuels [Chemicals][Gaseous Fuels][Emissions][CO2][kt][no source][no method][no target][no option][no type]
status: valid
status modified: 2017-02-13
accepted date: 2017-02-13
in scheme: emissions_variables_MMR

1.A.2.c Gaseous Fuels [Chemicals][Gaseous Fuels][Emissions][N2O][kt][no source][no method][no target][no option][no type]
type: Concept
definition: 1.A.2.c Gaseous Fuels [Chemicals][Gaseous Fuels][Emissions][N2O][kt][no source][no method][no target][no option][no type]
status: valid
status modified: 2017-02-13
accepted date: 2017-02-13
in scheme: emissions_variables_MMR

1.A.2.c Liquid Fuels [Chemicals][Liquid Fuels][Emissions][CH4][kt][no source][no method][no target][no option][no type]
type: Concept
definition: 1.A.2.c Liquid Fuels [Chemicals][Liquid Fuels][Emissions][CH4][kt][no source][no method][no target][no option][no type]
status: valid
status modified: 2017-02-13
accepted date: 2017-02-13
in scheme: emissions_variables_MMR

1.A.2.c Liquid Fuels [Chemicals][Liquid Fuels][Emissions][CO2][kt][no source][no method][no target][no option][no type]
type: Concept
definition: 1.A.2.c Liquid Fuels [Chemicals][Liquid Fuels][Emissions][CO2][kt][no source][no method][no target][no option][no type]
status: valid
status modified: 2017-02-13
accepted date: 2017-02-13
in scheme: emissions_variables_MMR

1.A.2.c Liquid Fuels [Chemicals][Liquid Fuels][Emissions][N2O][kt][no source][no method][no target][no option][no type]
type: Concept
definition: 1.A.2.c Liquid Fuels [Chemicals][Liquid Fuels][Emissions][N2O][kt][no source][no method][no target][no option][no type]
status: valid
status modified: 2017-02-13
accepted date: 2017-02-13
in scheme: emissions_variables_MMR

1.A.2.c Other Fossil Fuel [Chemicals][Other Fossil Fuels][Emissions][CH4][kt][no source][no method][no target][no option][no type]
type: Concept
definition: 1.A.2.c Other Fossil Fuel [Chemicals][Other Fossil Fuels][Emissions][CH4][kt][no source][no method][no target][no option][no type]
status: valid
status modified: 2017-02-13
accepted date: 2017-02-13
in scheme: emissions_variables_MMR

1.A.2.c Other Fossil Fuel [Chemicals][Other Fossil Fuels][Emissions][CO2][kt][no source][no method][no target][no option][no type]
type: Concept
definition: 1.A.2.c Other Fossil Fuel [Chemicals][Other Fossil Fuels][Emissions][CO2][kt][no source][no method][no target][no option][no type]
status: valid
status modified: 2017-02-13
accepted date: 2017-02-13
in scheme: emissions_variables_MMR

1.A.2.c Other Fossil Fuel [Chemicals][Other Fossil Fuels][Emissions][N2O][kt][no source][no method][no target][no option][no type]
type: Concept
definition: 1.A.2.c Other Fossil Fuel [Chemicals][Other Fossil Fuels][Emissions][N2O][kt][no source][no method][no target][no option][no type]
status: valid
status modified: 2017-02-13
accepted date: 2017-02-13
in scheme: emissions_variables_MMR

1.A.2.c Peat [Chemicals][Peat][Emissions][CH4][kt][no source][no method][no target][no option][no type]
type: Concept
definition: 1.A.2.c Peat [Chemicals][Peat][Emissions][CH4][kt][no source][no method][no target][no option][no type]
status: valid
status modified: 2017-02-13
accepted date: 2017-02-13
in scheme: emissions_variables_MMR

1.A.2.c Peat [Chemicals][Peat][Emissions][CO2][kt][no source][no method][no target][no option][no type]
type: Concept
definition: 1.A.2.c Peat [Chemicals][Peat][Emissions][CO2][kt][no source][no method][no target][no option][no type]
status: valid
status modified: 2017-02-13
accepted date: 2017-02-13
in scheme: emissions_variables_MMR

1.A.2.c Peat [Chemicals][Peat][Emissions][N2O][kt][no source][no method][no target][no option][no type]
type: Concept
definition: 1.A.2.c Peat [Chemicals][Peat][Emissions][N2O][kt][no source][no method][no target][no option][no type]
status: valid
status modified: 2017-02-13
accepted date: 2017-02-13
in scheme: emissions_variables_MMR

1.A.2.c Solid Fuels [Chemicals][Solid Fuels][Emissions][CH4][kt][no source][no method][no target][no option][no type]
type: Concept
definition: 1.A.2.c Solid Fuels [Chemicals][Solid Fuels][Emissions][CH4][kt][no source][no method][no target][no option][no type]
status: valid
status modified: 2017-02-13
accepted date: 2017-02-13
in scheme: emissions_variables_MMR

1.A.2.c Solid Fuels [Chemicals][Solid Fuels][Emissions][CO2][kt][no source][no method][no target][no option][no type]
type: Concept
definition: 1.A.2.c Solid Fuels [Chemicals][Solid Fuels][Emissions][CO2][kt][no source][no method][no target][no option][no type]
status: valid
status modified: 2017-02-13
accepted date: 2017-02-13
in scheme: emissions_variables_MMR

1.A.2.c Solid Fuels [Chemicals][Solid Fuels][Emissions][N2O][kt][no source][no method][no target][no option][no type]
type: Concept
definition: 1.A.2.c Solid Fuels [Chemicals][Solid Fuels][Emissions][N2O][kt][no source][no method][no target][no option][no type]
status: valid
status modified: 2017-02-13
accepted date: 2017-02-13
in scheme: emissions_variables_MMR

1.A.2.d [Pulp, Paper and Print][Fuels][Emissions][CH4][kt][no source][no method][no target][no option][no type]
type: Concept
definition: 1.A.2.d [Pulp, Paper and Print][Fuels][Emissions][CH4][kt][no source][no method][no target][no option][no type]
status: valid
status modified: 2017-02-13
accepted date: 2017-02-13
in scheme: emissions_variables_MMR

1.A.2.d [Pulp, Paper and Print][Fuels][Emissions][CO][kt][no source][no method][no target][no option][no type]
type: Concept
definition: 1.A.2.d [Pulp, Paper and Print][Fuels][Emissions][CO][kt][no source][no method][no target][no option][no type]
status: valid
status modified: 2017-02-13
accepted date: 2017-02-13
in scheme: emissions_variables_MMR

1.A.2.d [Pulp, Paper and Print][Fuels][Emissions][CO2][kt][no source][no method][no target][no option][no type]
type: Concept
definition: 1.A.2.d [Pulp, Paper and Print][Fuels][Emissions][CO2][kt][no source][no method][no target][no option][no type]
status: valid
status modified: 2017-02-13
accepted date: 2017-02-13
in scheme: emissions_variables_MMR

1.A.2.d [Pulp, Paper and Print][Fuels][Emissions][N2O][kt][no source][no method][no target][no option][no type]
type: Concept
definition: 1.A.2.d [Pulp, Paper and Print][Fuels][Emissions][N2O][kt][no source][no method][no target][no option][no type]
status: valid
status modified: 2017-02-13
accepted date: 2017-02-13
in scheme: emissions_variables_MMR

1.A.2.d [Pulp, Paper and Print][Fuels][Emissions][NMVOC][kt][no source][no method][no target][no option][no type]
type: Concept
definition: 1.A.2.d [Pulp, Paper and Print][Fuels][Emissions][NMVOC][kt][no source][no method][no target][no option][no type]
status: valid
status modified: 2017-02-13
accepted date: 2017-02-13
in scheme: emissions_variables_MMR

1.A.2.d [Pulp, Paper and Print][Fuels][Emissions][NOx][kt][no source][no method][no target][no option][no type]
type: Concept
definition: 1.A.2.d [Pulp, Paper and Print][Fuels][Emissions][NOx][kt][no source][no method][no target][no option][no type]
status: valid
status modified: 2017-02-13
accepted date: 2017-02-13
in scheme: emissions_variables_MMR

1.A.2.d [Pulp, Paper and Print][Fuels][Emissions][SO2][kt][no source][no method][no target][no option][no type]
type: Concept
definition: 1.A.2.d [Pulp, Paper and Print][Fuels][Emissions][SO2][kt][no source][no method][no target][no option][no type]
status: valid
status modified: 2017-02-13
accepted date: 2017-02-13
in scheme: emissions_variables_MMR

1.A.2.d Biomass [Pulp, Paper and Print][Biomass][Emissions][CH4][kt][no source][no method][no target][no option][no type]
type: Concept
definition: 1.A.2.d Biomass [Pulp, Paper and Print][Biomass][Emissions][CH4][kt][no source][no method][no target][no option][no type]
status: valid
status modified: 2017-02-13
accepted date: 2017-02-13
in scheme: emissions_variables_MMR

1.A.2.d Biomass [Pulp, Paper and Print][Biomass][Emissions][CO2][kt][no source][no method][no target][no option][no type]
type: Concept
definition: 1.A.2.d Biomass [Pulp, Paper and Print][Biomass][Emissions][CO2][kt][no source][no method][no target][no option][no type]
status: valid
status modified: 2017-02-13
accepted date: 2017-02-13
in scheme: emissions_variables_MMR

1.A.2.d Biomass [Pulp, Paper and Print][Biomass][Emissions][N2O][kt][no source][no method][no target][no option][no type]
type: Concept
definition: 1.A.2.d Biomass [Pulp, Paper and Print][Biomass][Emissions][N2O][kt][no source][no method][no target][no option][no type]
status: valid
status modified: 2017-02-13
accepted date: 2017-02-13
in scheme: emissions_variables_MMR

1.A.2.d Gaseous Fuels [Pulp, Paper and Print][Gaseous Fuels][Emissions][CH4][kt][no source][no method][no target][no option][no type]
type: Concept
definition: 1.A.2.d Gaseous Fuels [Pulp, Paper and Print][Gaseous Fuels][Emissions][CH4][kt][no source][no method][no target][no option][no type]
status: valid
status modified: 2017-02-13
accepted date: 2017-02-13
in scheme: emissions_variables_MMR

1.A.2.d Gaseous Fuels [Pulp, Paper and Print][Gaseous Fuels][Emissions][CO2][kt][no source][no method][no target][no option][no type]
type: Concept
definition: 1.A.2.d Gaseous Fuels [Pulp, Paper and Print][Gaseous Fuels][Emissions][CO2][kt][no source][no method][no target][no option][no type]
status: valid
status modified: 2017-02-13
accepted date: 2017-02-13
in scheme: emissions_variables_MMR

1.A.2.d Gaseous Fuels [Pulp, Paper and Print][Gaseous Fuels][Emissions][N2O][kt][no source][no method][no target][no option][no type]
type: Concept
definition: 1.A.2.d Gaseous Fuels [Pulp, Paper and Print][Gaseous Fuels][Emissions][N2O][kt][no source][no method][no target][no option][no type]
status: valid
status modified: 2017-02-13
accepted date: 2017-02-13
in scheme: emissions_variables_MMR

1.A.2.d Liquid Fuels [Pulp, Paper and Print][Liquid Fuels][Emissions][CH4][kt][no source][no method][no target][no option][no type]
type: Concept
definition: 1.A.2.d Liquid Fuels [Pulp, Paper and Print][Liquid Fuels][Emissions][CH4][kt][no source][no method][no target][no option][no type]
status: valid
status modified: 2017-02-13
accepted date: 2017-02-13
in scheme: emissions_variables_MMR

1.A.2.d Liquid Fuels [Pulp, Paper and Print][Liquid Fuels][Emissions][CO2][kt][no source][no method][no target][no option][no type]
type: Concept
definition: 1.A.2.d Liquid Fuels [Pulp, Paper and Print][Liquid Fuels][Emissions][CO2][kt][no source][no method][no target][no option][no type]
status: valid
status modified: 2017-02-13
accepted date: 2017-02-13
in scheme: emissions_variables_MMR

1.A.2.d Liquid Fuels [Pulp, Paper and Print][Liquid Fuels][Emissions][N2O][kt][no source][no method][no target][no option][no type]
type: Concept
definition: 1.A.2.d Liquid Fuels [Pulp, Paper and Print][Liquid Fuels][Emissions][N2O][kt][no source][no method][no target][no option][no type]
status: valid
status modified: 2017-02-13
accepted date: 2017-02-13
in scheme: emissions_variables_MMR

1.A.2.d Other Fossil Fuel [Pulp, Paper and Print][Other Fossil Fuels][Emissions][CH4][kt][no source][no method][no target][no option][no type]
type: Concept
definition: 1.A.2.d Other Fossil Fuel [Pulp, Paper and Print][Other Fossil Fuels][Emissions][CH4][kt][no source][no method][no target][no option][no type]
status: valid
status modified: 2017-02-13
accepted date: 2017-02-13
in scheme: emissions_variables_MMR

1.A.2.d Other Fossil Fuel [Pulp, Paper and Print][Other Fossil Fuels][Emissions][CO2][kt][no source][no method][no target][no option][no type]
type: Concept
definition: 1.A.2.d Other Fossil Fuel [Pulp, Paper and Print][Other Fossil Fuels][Emissions][CO2][kt][no source][no method][no target][no option][no type]
status: valid
status modified: 2017-02-13
accepted date: 2017-02-13
in scheme: emissions_variables_MMR

1.A.2.d Other Fossil Fuel [Pulp, Paper and Print][Other Fossil Fuels][Emissions][N2O][kt][no source][no method][no target][no option][no type]
type: Concept
definition: 1.A.2.d Other Fossil Fuel [Pulp, Paper and Print][Other Fossil Fuels][Emissions][N2O][kt][no source][no method][no target][no option][no type]
status: valid
status modified: 2017-02-13
accepted date: 2017-02-13
in scheme: emissions_variables_MMR

1.A.2.d Peat [Pulp, Paper and Print][Peat][Emissions][CH4][kt][no source][no method][no target][no option][no type]
type: Concept
definition: 1.A.2.d Peat [Pulp, Paper and Print][Peat][Emissions][CH4][kt][no source][no method][no target][no option][no type]
status: valid
status modified: 2017-02-13
accepted date: 2017-02-13
in scheme: emissions_variables_MMR

1.A.2.d Peat [Pulp, Paper and Print][Peat][Emissions][CO2][kt][no source][no method][no target][no option][no type]
type: Concept
definition: 1.A.2.d Peat [Pulp, Paper and Print][Peat][Emissions][CO2][kt][no source][no method][no target][no option][no type]
status: valid
status modified: 2017-02-13
accepted date: 2017-02-13
in scheme: emissions_variables_MMR

1.A.2.d Peat [Pulp, Paper and Print][Peat][Emissions][N2O][kt][no source][no method][no target][no option][no type]
type: Concept
definition: 1.A.2.d Peat [Pulp, Paper and Print][Peat][Emissions][N2O][kt][no source][no method][no target][no option][no type]
status: valid
status modified: 2017-02-13
accepted date: 2017-02-13
in scheme: emissions_variables_MMR

1.A.2.d Solid Fuels [Pulp, Paper and Print][Solid Fuels][Emissions][CH4][kt][no source][no method][no target][no option][no type]
type: Concept
definition: 1.A.2.d Solid Fuels [Pulp, Paper and Print][Solid Fuels][Emissions][CH4][kt][no source][no method][no target][no option][no type]
status: valid
status modified: 2017-02-13
accepted date: 2017-02-13
in scheme: emissions_variables_MMR

1.A.2.d Solid Fuels [Pulp, Paper and Print][Solid Fuels][Emissions][CO2][kt][no source][no method][no target][no option][no type]
type: Concept
definition: 1.A.2.d Solid Fuels [Pulp, Paper and Print][Solid Fuels][Emissions][CO2][kt][no source][no method][no target][no option][no type]
status: valid
status modified: 2017-02-13
accepted date: 2017-02-13
in scheme: emissions_variables_MMR

1.A.2.d Solid Fuels [Pulp, Paper and Print][Solid Fuels][Emissions][N2O][kt][no source][no method][no target][no option][no type]
type: Concept
definition: 1.A.2.d Solid Fuels [Pulp, Paper and Print][Solid Fuels][Emissions][N2O][kt][no source][no method][no target][no option][no type]
status: valid
status modified: 2017-02-13
accepted date: 2017-02-13
in scheme: emissions_variables_MMR

1.A.2.e [Food Processing, Beverages and Tobacco][Fuels][Emissions][CH4][kt][no source][no method][no target][no option][no type]
type: Concept
definition: 1.A.2.e [Food Processing, Beverages and Tobacco][Fuels][Emissions][CH4][kt][no source][no method][no target][no option][no type]
status: valid
status modified: 2017-02-13
accepted date: 2017-02-13
in scheme: emissions_variables_MMR

1.A.2.e [Food Processing, Beverages and Tobacco][Fuels][Emissions][CO][kt][no source][no method][no target][no option][no type]
type: Concept
definition: 1.A.2.e [Food Processing, Beverages and Tobacco][Fuels][Emissions][CO][kt][no source][no method][no target][no option][no type]
status: valid
status modified: 2017-02-13
accepted date: 2017-02-13
in scheme: emissions_variables_MMR

1.A.2.e [Food Processing, Beverages and Tobacco][Fuels][Emissions][CO2][kt][no source][no method][no target][no option][no type]
type: Concept
definition: 1.A.2.e [Food Processing, Beverages and Tobacco][Fuels][Emissions][CO2][kt][no source][no method][no target][no option][no type]
status: valid
status modified: 2017-02-13
accepted date: 2017-02-13
in scheme: emissions_variables_MMR

1.A.2.e [Food Processing, Beverages and Tobacco][Fuels][Emissions][N2O][kt][no source][no method][no target][no option][no type]
type: Concept
definition: 1.A.2.e [Food Processing, Beverages and Tobacco][Fuels][Emissions][N2O][kt][no source][no method][no target][no option][no type]
status: valid
status modified: 2017-02-13
accepted date: 2017-02-13
in scheme: emissions_variables_MMR

1.A.2.e [Food Processing, Beverages and Tobacco][Fuels][Emissions][NMVOC][kt][no source][no method][no target][no option][no type]
type: Concept
definition: 1.A.2.e [Food Processing, Beverages and Tobacco][Fuels][Emissions][NMVOC][kt][no source][no method][no target][no option][no type]
status: valid
status modified: 2017-02-13
accepted date: 2017-02-13
in scheme: emissions_variables_MMR

1.A.2.e [Food Processing, Beverages and Tobacco][Fuels][Emissions][NOx][kt][no source][no method][no target][no option][no type]
type: Concept
definition: 1.A.2.e [Food Processing, Beverages and Tobacco][Fuels][Emissions][NOx][kt][no source][no method][no target][no option][no type]
status: valid
status modified: 2017-02-13
accepted date: 2017-02-13
in scheme: emissions_variables_MMR

1.A.2.e [Food Processing, Beverages and Tobacco][Fuels][Emissions][SO2][kt][no source][no method][no target][no option][no type]
type: Concept
definition: 1.A.2.e [Food Processing, Beverages and Tobacco][Fuels][Emissions][SO2][kt][no source][no method][no target][no option][no type]
status: valid
status modified: 2017-02-13
accepted date: 2017-02-13
in scheme: emissions_variables_MMR

1.A.2.e Biomass [Food Processing, Beverages and Tobacco][Biomass][Emissions][CH4][kt][no source][no method][no target][no option][no type]
type: Concept
definition: 1.A.2.e Biomass [Food Processing, Beverages and Tobacco][Biomass][Emissions][CH4][kt][no source][no method][no target][no option][no type]
status: valid
status modified: 2017-02-13
accepted date: 2017-02-13
in scheme: emissions_variables_MMR

1.A.2.e Biomass [Food Processing, Beverages and Tobacco][Biomass][Emissions][CO2][kt][no source][no method][no target][no option][no type]
type: Concept
definition: 1.A.2.e Biomass [Food Processing, Beverages and Tobacco][Biomass][Emissions][CO2][kt][no source][no method][no target][no option][no type]
status: valid
status modified: 2017-02-13
accepted date: 2017-02-13
in scheme: emissions_variables_MMR

1.A.2.e Biomass [Food Processing, Beverages and Tobacco][Biomass][Emissions][N2O][kt][no source][no method][no target][no option][no type]
type: Concept
definition: 1.A.2.e Biomass [Food Processing, Beverages and Tobacco][Biomass][Emissions][N2O][kt][no source][no method][no target][no option][no type]
status: valid
status modified: 2017-02-13
accepted date: 2017-02-13
in scheme: emissions_variables_MMR

1.A.2.e Gaseous Fuels [Food Processing, Beverages and Tobacco][Gaseous Fuels][Emissions][CH4][kt][no source][no method][no target][no option][no type]
type: Concept
definition: 1.A.2.e Gaseous Fuels [Food Processing, Beverages and Tobacco][Gaseous Fuels][Emissions][CH4][kt][no source][no method][no target][no option][no type]
status: valid
status modified: 2017-02-13
accepted date: 2017-02-13
in scheme: emissions_variables_MMR

1.A.2.e Gaseous Fuels [Food Processing, Beverages and Tobacco][Gaseous Fuels][Emissions][CO2][kt][no source][no method][no target][no option][no type]
type: Concept
definition: 1.A.2.e Gaseous Fuels [Food Processing, Beverages and Tobacco][Gaseous Fuels][Emissions][CO2][kt][no source][no method][no target][no option][no type]
status: valid
status modified: 2017-02-13
accepted date: 2017-02-13
in scheme: emissions_variables_MMR

1.A.2.e Gaseous Fuels [Food Processing, Beverages and Tobacco][Gaseous Fuels][Emissions][N2O][kt][no source][no method][no target][no option][no type]
type: Concept
definition: 1.A.2.e Gaseous Fuels [Food Processing, Beverages and Tobacco][Gaseous Fuels][Emissions][N2O][kt][no source][no method][no target][no option][no type]
status: valid
status modified: 2017-02-13
accepted date: 2017-02-13
in scheme: emissions_variables_MMR

1.A.2.e Liquid Fuels [Food Processing, Beverages and Tobacco][Liquid Fuels][Emissions][CH4][kt][no source][no method][no target][no option][no type]
type: Concept
definition: 1.A.2.e Liquid Fuels [Food Processing, Beverages and Tobacco][Liquid Fuels][Emissions][CH4][kt][no source][no method][no target][no option][no type]
status: valid
status modified: 2017-02-13
accepted date: 2017-02-13
in scheme: emissions_variables_MMR

1.A.2.e Liquid Fuels [Food Processing, Beverages and Tobacco][Liquid Fuels][Emissions][CO2][kt][no source][no method][no target][no option][no type]
type: Concept
definition: 1.A.2.e Liquid Fuels [Food Processing, Beverages and Tobacco][Liquid Fuels][Emissions][CO2][kt][no source][no method][no target][no option][no type]
status: valid
status modified: 2017-02-13
accepted date: 2017-02-13
in scheme: emissions_variables_MMR

1.A.2.e Liquid Fuels [Food Processing, Beverages and Tobacco][Liquid Fuels][Emissions][N2O][kt][no source][no method][no target][no option][no type]
type: Concept
definition: 1.A.2.e Liquid Fuels [Food Processing, Beverages and Tobacco][Liquid Fuels][Emissions][N2O][kt][no source][no method][no target][no option][no type]
status: valid
status modified: 2017-02-13
accepted date: 2017-02-13
in scheme: emissions_variables_MMR

1.A.2.e Other Fossil Fuel [Food Processing, Beverages and Tobacco][Other Fossil Fuels][Emissions][CH4][kt][no source][no method][no target][no option][no type]
type: Concept
definition: 1.A.2.e Other Fossil Fuel [Food Processing, Beverages and Tobacco][Other Fossil Fuels][Emissions][CH4][kt][no source][no method][no target][no option][no type]
status: valid
status modified: 2017-02-13
accepted date: 2017-02-13
in scheme: emissions_variables_MMR

1.A.2.e Other Fossil Fuel [Food Processing, Beverages and Tobacco][Other Fossil Fuels][Emissions][CO2][kt][no source][no method][no target][no option][no type]
type: Concept
definition: 1.A.2.e Other Fossil Fuel [Food Processing, Beverages and Tobacco][Other Fossil Fuels][Emissions][CO2][kt][no source][no method][no target][no option][no type]
status: valid
status modified: 2017-02-13
accepted date: 2017-02-13
in scheme: emissions_variables_MMR

1.A.2.e Other Fossil Fuel [Food Processing, Beverages and Tobacco][Other Fossil Fuels][Emissions][N2O][kt][no source][no method][no target][no option][no type]
type: Concept
definition: 1.A.2.e Other Fossil Fuel [Food Processing, Beverages and Tobacco][Other Fossil Fuels][Emissions][N2O][kt][no source][no method][no target][no option][no type]
status: valid
status modified: 2017-02-13
accepted date: 2017-02-13
in scheme: emissions_variables_MMR

1.A.2.e Peat [Food Processing, Beverages and Tobacco][Peat][Emissions][CH4][kt][no source][no method][no target][no option][no type]
type: Concept
definition: 1.A.2.e Peat [Food Processing, Beverages and Tobacco][Peat][Emissions][CH4][kt][no source][no method][no target][no option][no type]
status: valid
status modified: 2017-02-13
accepted date: 2017-02-13
in scheme: emissions_variables_MMR

1.A.2.e Peat [Food Processing, Beverages and Tobacco][Peat][Emissions][CO2][kt][no source][no method][no target][no option][no type]
type: Concept
definition: 1.A.2.e Peat [Food Processing, Beverages and Tobacco][Peat][Emissions][CO2][kt][no source][no method][no target][no option][no type]
status: valid
status modified: 2017-02-13
accepted date: 2017-02-13
in scheme: emissions_variables_MMR

1.A.2.e Peat [Food Processing, Beverages and Tobacco][Peat][Emissions][N2O][kt][no source][no method][no target][no option][no type]
type: Concept
definition: 1.A.2.e Peat [Food Processing, Beverages and Tobacco][Peat][Emissions][N2O][kt][no source][no method][no target][no option][no type]
status: valid
status modified: 2017-02-13
accepted date: 2017-02-13
in scheme: emissions_variables_MMR

1.A.2.e Solid Fuels [Food Processing, Beverages and Tobacco][Solid Fuels][Emissions][CH4][kt][no source][no method][no target][no option][no type]
type: Concept
definition: 1.A.2.e Solid Fuels [Food Processing, Beverages and Tobacco][Solid Fuels][Emissions][CH4][kt][no source][no method][no target][no option][no type]
status: valid
status modified: 2017-02-13
accepted date: 2017-02-13
in scheme: emissions_variables_MMR

1.A.2.e Solid Fuels [Food Processing, Beverages and Tobacco][Solid Fuels][Emissions][CO2][kt][no source][no method][no target][no option][no type]
type: Concept
definition: 1.A.2.e Solid Fuels [Food Processing, Beverages and Tobacco][Solid Fuels][Emissions][CO2][kt][no source][no method][no target][no option][no type]
status: valid
status modified: 2017-02-13
accepted date: 2017-02-13
in scheme: emissions_variables_MMR

1.A.2.e Solid Fuels [Food Processing, Beverages and Tobacco][Solid Fuels][Emissions][N2O][kt][no source][no method][no target][no option][no type]
type: Concept
definition: 1.A.2.e Solid Fuels [Food Processing, Beverages and Tobacco][Solid Fuels][Emissions][N2O][kt][no source][no method][no target][no option][no type]
status: valid
status modified: 2017-02-13
accepted date: 2017-02-13
in scheme: emissions_variables_MMR

1.A.2.f [Non-metallic minerals][Fuels][Emissions][CH4][kt][no source][no method][no target][no option][no type]
type: Concept
definition: 1.A.2.f [Non-metallic minerals][Fuels][Emissions][CH4][kt][no source][no method][no target][no option][no type]
status: valid
status modified: 2017-02-13
accepted date: 2017-02-13
in scheme: emissions_variables_MMR

1.A.2.f [Non-metallic minerals][Fuels][Emissions][CO][kt][no source][no method][no target][no option][no type]
type: Concept
definition: 1.A.2.f [Non-metallic minerals][Fuels][Emissions][CO][kt][no source][no method][no target][no option][no type]
status: valid
status modified: 2017-02-13
accepted date: 2017-02-13
in scheme: emissions_variables_MMR

1.A.2.f [Non-metallic minerals][Fuels][Emissions][CO2][kt][no source][no method][no target][no option][no type]
type: Concept
definition: 1.A.2.f [Non-metallic minerals][Fuels][Emissions][CO2][kt][no source][no method][no target][no option][no type]
status: valid
status modified: 2017-02-13
accepted date: 2017-02-13
in scheme: emissions_variables_MMR

1.A.2.f [Non-metallic minerals][Fuels][Emissions][N2O][kt][no source][no method][no target][no option][no type]
type: Concept
definition: 1.A.2.f [Non-metallic minerals][Fuels][Emissions][N2O][kt][no source][no method][no target][no option][no type]
status: valid
status modified: 2017-02-13
accepted date: 2017-02-13
in scheme: emissions_variables_MMR

1.A.2.f [Non-metallic minerals][Fuels][Emissions][NMVOC][kt][no source][no method][no target][no option][no type]
type: Concept
definition: 1.A.2.f [Non-metallic minerals][Fuels][Emissions][NMVOC][kt][no source][no method][no target][no option][no type]
status: valid
status modified: 2017-02-13
accepted date: 2017-02-13
in scheme: emissions_variables_MMR

1.A.2.f [Non-metallic minerals][Fuels][Emissions][NOx][kt][no source][no method][no target][no option][no type]
type: Concept
definition: 1.A.2.f [Non-metallic minerals][Fuels][Emissions][NOx][kt][no source][no method][no target][no option][no type]
status: valid
status modified: 2017-02-13
accepted date: 2017-02-13
in scheme: emissions_variables_MMR

1.A.2.f [Non-metallic minerals][Fuels][Emissions][SO2][kt][no source][no method][no target][no option][no type]
type: Concept
definition: 1.A.2.f [Non-metallic minerals][Fuels][Emissions][SO2][kt][no source][no method][no target][no option][no type]
status: valid
status modified: 2017-02-13
accepted date: 2017-02-13
in scheme: emissions_variables_MMR

1.A.2.f Biomass [Non-metallic minerals][Biomass][Emissions][CH4][kt][no source][no method][no target][no option][no type]
type: Concept
definition: 1.A.2.f Biomass [Non-metallic minerals][Biomass][Emissions][CH4][kt][no source][no method][no target][no option][no type]
status: valid
status modified: 2017-02-13
accepted date: 2017-02-13
in scheme: emissions_variables_MMR

1.A.2.f Biomass [Non-metallic minerals][Biomass][Emissions][CO2][kt][no source][no method][no target][no option][no type]
type: Concept
definition: 1.A.2.f Biomass [Non-metallic minerals][Biomass][Emissions][CO2][kt][no source][no method][no target][no option][no type]
status: valid
status modified: 2017-02-13
accepted date: 2017-02-13
in scheme: emissions_variables_MMR

1.A.2.f Biomass [Non-metallic minerals][Biomass][Emissions][N2O][kt][no source][no method][no target][no option][no type]
type: Concept
definition: 1.A.2.f Biomass [Non-metallic minerals][Biomass][Emissions][N2O][kt][no source][no method][no target][no option][no type]
status: valid
status modified: 2017-02-13
accepted date: 2017-02-13
in scheme: emissions_variables_MMR

1.A.2.f Gaseous Fuels [Non-metallic minerals][Gaseous Fuels][Emissions][CH4][kt][no source][no method][no target][no option][no type]
type: Concept
definition: 1.A.2.f Gaseous Fuels [Non-metallic minerals][Gaseous Fuels][Emissions][CH4][kt][no source][no method][no target][no option][no type]
status: valid
status modified: 2017-02-13
accepted date: 2017-02-13
in scheme: emissions_variables_MMR

1.A.2.f Gaseous Fuels [Non-metallic minerals][Gaseous Fuels][Emissions][CO2][kt][no source][no method][no target][no option][no type]
type: Concept
definition: 1.A.2.f Gaseous Fuels [Non-metallic minerals][Gaseous Fuels][Emissions][CO2][kt][no source][no method][no target][no option][no type]
status: valid
status modified: 2017-02-13
accepted date: 2017-02-13
in scheme: emissions_variables_MMR

1.A.2.f Gaseous Fuels [Non-metallic minerals][Gaseous Fuels][Emissions][N2O][kt][no source][no method][no target][no option][no type]
type: Concept
definition: 1.A.2.f Gaseous Fuels [Non-metallic minerals][Gaseous Fuels][Emissions][N2O][kt][no source][no method][no target][no option][no type]
status: valid
status modified: 2017-02-13
accepted date: 2017-02-13
in scheme: emissions_variables_MMR

1.A.2.f Liquid Fuels [Non-metallic minerals][Liquid Fuels][Emissions][CH4][kt][no source][no method][no target][no option][no type]
type: Concept
definition: 1.A.2.f Liquid Fuels [Non-metallic minerals][Liquid Fuels][Emissions][CH4][kt][no source][no method][no target][no option][no type]
status: valid
status modified: 2017-02-13
accepted date: 2017-02-13
in scheme: emissions_variables_MMR

1.A.2.f Liquid Fuels [Non-metallic minerals][Liquid Fuels][Emissions][CO2][kt][no source][no method][no target][no option][no type]
type: Concept
definition: 1.A.2.f Liquid Fuels [Non-metallic minerals][Liquid Fuels][Emissions][CO2][kt][no source][no method][no target][no option][no type]
status: valid
status modified: 2017-02-13
accepted date: 2017-02-13
in scheme: emissions_variables_MMR

1.A.2.f Liquid Fuels [Non-metallic minerals][Liquid Fuels][Emissions][N2O][kt][no source][no method][no target][no option][no type]
type: Concept
definition: 1.A.2.f Liquid Fuels [Non-metallic minerals][Liquid Fuels][Emissions][N2O][kt][no source][no method][no target][no option][no type]
status: valid
status modified: 2017-02-13
accepted date: 2017-02-13
in scheme: emissions_variables_MMR

1.A.2.f Other Fossil Fuel [Non-metallic minerals][Other Fossil Fuels][Emissions][CH4][kt][no source][no method][no target][no option][no type]
type: Concept
definition: 1.A.2.f Other Fossil Fuel [Non-metallic minerals][Other Fossil Fuels][Emissions][CH4][kt][no source][no method][no target][no option][no type]
status: valid
status modified: 2017-02-13
accepted date: 2017-02-13
in scheme: emissions_variables_MMR

1.A.2.f Other Fossil Fuel [Non-metallic minerals][Other Fossil Fuels][Emissions][CO2][kt][no source][no method][no target][no option][no type]
type: Concept
definition: 1.A.2.f Other Fossil Fuel [Non-metallic minerals][Other Fossil Fuels][Emissions][CO2][kt][no source][no method][no target][no option][no type]
status: valid
status modified: 2017-02-13
accepted date: 2017-02-13
in scheme: emissions_variables_MMR

1.A.2.f Other Fossil Fuel [Non-metallic minerals][Other Fossil Fuels][Emissions][N2O][kt][no source][no method][no target][no option][no type]
type: Concept
definition: 1.A.2.f Other Fossil Fuel [Non-metallic minerals][Other Fossil Fuels][Emissions][N2O][kt][no source][no method][no target][no option][no type]
status: valid
status modified: 2017-02-13
accepted date: 2017-02-13
in scheme: emissions_variables_MMR

1.A.2.f Peat [Non-metallic minerals][Peat][Emissions][CH4][kt][no source][no method][no target][no option][no type]
type: Concept
definition: 1.A.2.f Peat [Non-metallic minerals][Peat][Emissions][CH4][kt][no source][no method][no target][no option][no type]
status: valid
status modified: 2017-02-13
accepted date: 2017-02-13
in scheme: emissions_variables_MMR

1.A.2.f Peat [Non-metallic minerals][Peat][Emissions][CO2][kt][no source][no method][no target][no option][no type]
type: Concept
definition: 1.A.2.f Peat [Non-metallic minerals][Peat][Emissions][CO2][kt][no source][no method][no target][no option][no type]
status: valid
status modified: 2017-02-13
accepted date: 2017-02-13
in scheme: emissions_variables_MMR

1.A.2.f Peat [Non-metallic minerals][Peat][Emissions][N2O][kt][no source][no method][no target][no option][no type]
type: Concept
definition: 1.A.2.f Peat [Non-metallic minerals][Peat][Emissions][N2O][kt][no source][no method][no target][no option][no type]
status: valid
status modified: 2017-02-13
accepted date: 2017-02-13
in scheme: emissions_variables_MMR

1.A.2.f Solid Fuels [Non-metallic minerals][Solid Fuels][Emissions][CH4][kt][no source][no method][no target][no option][no type]
type: Concept
definition: 1.A.2.f Solid Fuels [Non-metallic minerals][Solid Fuels][Emissions][CH4][kt][no source][no method][no target][no option][no type]
status: valid
status modified: 2017-02-13
accepted date: 2017-02-13
in scheme: emissions_variables_MMR

1.A.2.f Solid Fuels [Non-metallic minerals][Solid Fuels][Emissions][CO2][kt][no source][no method][no target][no option][no type]
type: Concept
definition: 1.A.2.f Solid Fuels [Non-metallic minerals][Solid Fuels][Emissions][CO2][kt][no source][no method][no target][no option][no type]
status: valid
status modified: 2017-02-13
accepted date: 2017-02-13
in scheme: emissions_variables_MMR

1.A.2.f Solid Fuels [Non-metallic minerals][Solid Fuels][Emissions][N2O][kt][no source][no method][no target][no option][no type]
type: Concept
definition: 1.A.2.f Solid Fuels [Non-metallic minerals][Solid Fuels][Emissions][N2O][kt][no source][no method][no target][no option][no type]
status: valid
status modified: 2017-02-13
accepted date: 2017-02-13
in scheme: emissions_variables_MMR

1.A.2.g [Other Manufacturing Industries and Constructions][Biomass][Emissions][CH4][kt][no source][no method][no target][no option][no type]
type: Concept
definition: 1.A.2.g [Other Manufacturing Industries and Constructions][Biomass][Emissions][CH4][kt][no source][no method][no target][no option][no type]
status: valid
status modified: 2017-02-13
accepted date: 2017-02-13
in scheme: emissions_variables_MMR

1.A.2.g [Other Manufacturing Industries and Constructions][Biomass][Emissions][CO2][kt][no source][no method][no target][no option][no type]
type: Concept
definition: 1.A.2.g [Other Manufacturing Industries and Constructions][Biomass][Emissions][CO2][kt][no source][no method][no target][no option][no type]
status: valid
status modified: 2017-02-13
accepted date: 2017-02-13
in scheme: emissions_variables_MMR

1.A.2.g [Other Manufacturing Industries and Constructions][Biomass][Emissions][N2O][kt][no source][no method][no target][no option][no type]
type: Concept
definition: 1.A.2.g [Other Manufacturing Industries and Constructions][Biomass][Emissions][N2O][kt][no source][no method][no target][no option][no type]
status: valid
status modified: 2017-02-13
accepted date: 2017-02-13
in scheme: emissions_variables_MMR

1.A.2.g [Other Manufacturing Industries and Constructions][Fossil fuels][Emissions][CO2][kt][no source][no method][no target][no option][no type]
type: Concept
definition: 1.A.2.g [Other Manufacturing Industries and Constructions][Fossil fuels][Emissions][CO2][kt][no source][no method][no target][no option][no type]
status: valid
status modified: 2017-02-13
accepted date: 2017-02-13
in scheme: emissions_variables_MMR

1.A.2.g [Other Manufacturing Industries and Constructions][Fuels][Emissions][CH4][kt][no source][no method][no target][no option][no type]
type: Concept
definition: 1.A.2.g [Other Manufacturing Industries and Constructions][Fuels][Emissions][CH4][kt][no source][no method][no target][no option][no type]
status: valid
status modified: 2017-02-13
accepted date: 2017-02-13
in scheme: emissions_variables_MMR

1.A.2.g [Other Manufacturing Industries and Constructions][Fuels][Emissions][CO][kt][no source][no method][no target][no option][no type]
type: Concept
definition: 1.A.2.g [Other Manufacturing Industries and Constructions][Fuels][Emissions][CO][kt][no source][no method][no target][no option][no type]
status: valid
status modified: 2017-02-13
accepted date: 2017-02-13
in scheme: emissions_variables_MMR

1.A.2.g [Other Manufacturing Industries and Constructions][Fuels][Emissions][N2O][kt][no source][no method][no target][no option][no type]
type: Concept
definition: 1.A.2.g [Other Manufacturing Industries and Constructions][Fuels][Emissions][N2O][kt][no source][no method][no target][no option][no type]
status: valid
status modified: 2017-02-13
accepted date: 2017-02-13
in scheme: emissions_variables_MMR

1.A.2.g [Other Manufacturing Industries and Constructions][Fuels][Emissions][NMVOC][kt][no source][no method][no target][no option][no type]
type: Concept
definition: 1.A.2.g [Other Manufacturing Industries and Constructions][Fuels][Emissions][NMVOC][kt][no source][no method][no target][no option][no type]
status: valid
status modified: 2017-02-13
accepted date: 2017-02-13
in scheme: emissions_variables_MMR

1.A.2.g [Other Manufacturing Industries and Constructions][Fuels][Emissions][NOx][kt][no source][no method][no target][no option][no type]
type: Concept
definition: 1.A.2.g [Other Manufacturing Industries and Constructions][Fuels][Emissions][NOx][kt][no source][no method][no target][no option][no type]
status: valid
status modified: 2017-02-13
accepted date: 2017-02-13
in scheme: emissions_variables_MMR

1.A.2.g [Other Manufacturing Industries and Constructions][Fuels][Emissions][SO2][kt][no source][no method][no target][no option][no type]
type: Concept
definition: 1.A.2.g [Other Manufacturing Industries and Constructions][Fuels][Emissions][SO2][kt][no source][no method][no target][no option][no type]
status: valid
status modified: 2017-02-13
accepted date: 2017-02-13
in scheme: emissions_variables_MMR

1.A.2.g [Other Manufacturing Industries and Constructions][Gaseous Fuels][Emissions][CH4][kt][no source][no method][no target][no option][no type]
type: Concept
definition: 1.A.2.g [Other Manufacturing Industries and Constructions][Gaseous Fuels][Emissions][CH4][kt][no source][no method][no target][no option][no type]
status: valid
status modified: 2017-02-13
accepted date: 2017-02-13
in scheme: emissions_variables_MMR

1.A.2.g [Other Manufacturing Industries and Constructions][Gaseous Fuels][Emissions][CO2][kt][no source][no method][no target][no option][no type]
type: Concept
definition: 1.A.2.g [Other Manufacturing Industries and Constructions][Gaseous Fuels][Emissions][CO2][kt][no source][no method][no target][no option][no type]
status: valid
status modified: 2017-02-13
accepted date: 2017-02-13
in scheme: emissions_variables_MMR

1.A.2.g [Other Manufacturing Industries and Constructions][Gaseous Fuels][Emissions][N2O][kt][no source][no method][no target][no option][no type]
type: Concept
definition: 1.A.2.g [Other Manufacturing Industries and Constructions][Gaseous Fuels][Emissions][N2O][kt][no source][no method][no target][no option][no type]
status: valid
status modified: 2017-02-13
accepted date: 2017-02-13
in scheme: emissions_variables_MMR

1.A.2.g [Other Manufacturing Industries and Constructions][Liquid Fuels][Emissions][CH4][kt][no source][no method][no target][no option][no type]
type: Concept
definition: 1.A.2.g [Other Manufacturing Industries and Constructions][Liquid Fuels][Emissions][CH4][kt][no source][no method][no target][no option][no type]
status: valid
status modified: 2017-02-13
accepted date: 2017-02-13
in scheme: emissions_variables_MMR

1.A.2.g [Other Manufacturing Industries and Constructions][Liquid Fuels][Emissions][CO2][kt][no source][no method][no target][no option][no type]
type: Concept
definition: 1.A.2.g [Other Manufacturing Industries and Constructions][Liquid Fuels][Emissions][CO2][kt][no source][no method][no target][no option][no type]
status: valid
status modified: 2017-02-13
accepted date: 2017-02-13
in scheme: emissions_variables_MMR

1.A.2.g [Other Manufacturing Industries and Constructions][Liquid Fuels][Emissions][N2O][kt][no source][no method][no target][no option][no type]
type: Concept
definition: 1.A.2.g [Other Manufacturing Industries and Constructions][Liquid Fuels][Emissions][N2O][kt][no source][no method][no target][no option][no type]
status: valid
status modified: 2017-02-13
accepted date: 2017-02-13
in scheme: emissions_variables_MMR

1.A.2.g [Other Manufacturing Industries and Constructions][Other Fossil Fuels][Emissions][CH4][kt][no source][no method][no target][no option][no type]
type: Concept
definition: 1.A.2.g [Other Manufacturing Industries and Constructions][Other Fossil Fuels][Emissions][CH4][kt][no source][no method][no target][no option][no type]
status: valid
status modified: 2017-02-13
accepted date: 2017-02-13
in scheme: emissions_variables_MMR

1.A.2.g [Other Manufacturing Industries and Constructions][Other Fossil Fuels][Emissions][CO2][kt][no source][no method][no target][no option][no type]
type: Concept
definition: 1.A.2.g [Other Manufacturing Industries and Constructions][Other Fossil Fuels][Emissions][CO2][kt][no source][no method][no target][no option][no type]
status: valid
status modified: 2017-02-13
accepted date: 2017-02-13
in scheme: emissions_variables_MMR

1.A.2.g [Other Manufacturing Industries and Constructions][Other Fossil Fuels][Emissions][N2O][kt][no source][no method][no target][no option][no type]
type: Concept
definition: 1.A.2.g [Other Manufacturing Industries and Constructions][Other Fossil Fuels][Emissions][N2O][kt][no source][no method][no target][no option][no type]
status: valid
status modified: 2017-02-13
accepted date: 2017-02-13
in scheme: emissions_variables_MMR

1.A.2.g [Other Manufacturing Industries and Constructions][Peat][Emissions][CH4][kt][no source][no method][no target][no option][no type]
type: Concept
definition: 1.A.2.g [Other Manufacturing Industries and Constructions][Peat][Emissions][CH4][kt][no source][no method][no target][no option][no type]
status: valid
status modified: 2017-02-13
accepted date: 2017-02-13
in scheme: emissions_variables_MMR

1.A.2.g [Other Manufacturing Industries and Constructions][Peat][Emissions][CO2][kt][no source][no method][no target][no option][no type]
type: Concept
definition: 1.A.2.g [Other Manufacturing Industries and Constructions][Peat][Emissions][CO2][kt][no source][no method][no target][no option][no type]
status: valid
status modified: 2017-02-13
accepted date: 2017-02-13
in scheme: emissions_variables_MMR

1.A.2.g [Other Manufacturing Industries and Constructions][Peat][Emissions][N2O][kt][no source][no method][no target][no option][no type]
type: Concept
definition: 1.A.2.g [Other Manufacturing Industries and Constructions][Peat][Emissions][N2O][kt][no source][no method][no target][no option][no type]
status: valid
status modified: 2017-02-13
accepted date: 2017-02-13
in scheme: emissions_variables_MMR

1.A.2.g [Other Manufacturing Industries and Constructions][Solid Fuels][Emissions][CH4][kt][no source][no method][no target][no option][no type]
type: Concept
definition: 1.A.2.g [Other Manufacturing Industries and Constructions][Solid Fuels][Emissions][CH4][kt][no source][no method][no target][no option][no type]
status: valid
status modified: 2017-02-13
accepted date: 2017-02-13
in scheme: emissions_variables_MMR

1.A.2.g [Other Manufacturing Industries and Constructions][Solid Fuels][Emissions][CO2][kt][no source][no method][no target][no option][no type]
type: Concept
definition: 1.A.2.g [Other Manufacturing Industries and Constructions][Solid Fuels][Emissions][CO2][kt][no source][no method][no target][no option][no type]
status: valid
status modified: 2017-02-13
accepted date: 2017-02-13
in scheme: emissions_variables_MMR

1.A.2.g [Other Manufacturing Industries and Constructions][Solid Fuels][Emissions][N2O][kt][no source][no method][no target][no option][no type]
type: Concept
definition: 1.A.2.g [Other Manufacturing Industries and Constructions][Solid Fuels][Emissions][N2O][kt][no source][no method][no target][no option][no type]
status: valid
status modified: 2017-02-13
accepted date: 2017-02-13
in scheme: emissions_variables_MMR

1.A.2.g.i [Manufacturing of machinery][Biomass][Emissions][CH4][kt][no source][no method][no target][no option][no type]
type: Concept
definition: 1.A.2.g.i [Manufacturing of machinery][Biomass][Emissions][CH4][kt][no source][no method][no target][no option][no type]
status: valid
status modified: 2017-02-13
accepted date: 2017-02-13
in scheme: emissions_variables_MMR

1.A.2.g.i [Manufacturing of machinery][Biomass][Emissions][CO2][kt][no source][no method][no target][no option][no type]
type: Concept
definition: 1.A.2.g.i [Manufacturing of machinery][Biomass][Emissions][CO2][kt][no source][no method][no target][no option][no type]
status: valid
status modified: 2017-02-13
accepted date: 2017-02-13
in scheme: emissions_variables_MMR

1.A.2.g.i [Manufacturing of machinery][Biomass][Emissions][N2O][kt][no source][no method][no target][no option][no type]
type: Concept
definition: 1.A.2.g.i [Manufacturing of machinery][Biomass][Emissions][N2O][kt][no source][no method][no target][no option][no type]
status: valid
status modified: 2017-02-13
accepted date: 2017-02-13
in scheme: emissions_variables_MMR

1.A.2.g.i [Manufacturing of machinery][Fuels][Emissions][CH4][kt][no source][no method][no target][no option][no type]
type: Concept
definition: 1.A.2.g.i [Manufacturing of machinery][Fuels][Emissions][CH4][kt][no source][no method][no target][no option][no type]
status: valid
status modified: 2017-02-13
accepted date: 2017-02-13
in scheme: emissions_variables_MMR

1.A.2.g.i [Manufacturing of machinery][Fuels][Emissions][CO2][kt][no source][no method][no target][no option][no type]
type: Concept
definition: 1.A.2.g.i [Manufacturing of machinery][Fuels][Emissions][CO2][kt][no source][no method][no target][no option][no type]
status: valid
status modified: 2017-02-13
accepted date: 2017-02-13
in scheme: emissions_variables_MMR

1.A.2.g.i [Manufacturing of machinery][Fuels][Emissions][N2O][kt][no source][no method][no target][no option][no type]
type: Concept
definition: 1.A.2.g.i [Manufacturing of machinery][Fuels][Emissions][N2O][kt][no source][no method][no target][no option][no type]
status: valid
status modified: 2017-02-13
accepted date: 2017-02-13
in scheme: emissions_variables_MMR

1.A.2.g.i [Manufacturing of machinery][Gaseous Fuels][Emissions][CH4][kt][no source][no method][no target][no option][no type]
type: Concept
definition: 1.A.2.g.i [Manufacturing of machinery][Gaseous Fuels][Emissions][CH4][kt][no source][no method][no target][no option][no type]
status: valid
status modified: 2017-02-13
accepted date: 2017-02-13
in scheme: emissions_variables_MMR

1.A.2.g.i [Manufacturing of machinery][Gaseous Fuels][Emissions][CO2][kt][no source][no method][no target][no option][no type]
type: Concept
definition: 1.A.2.g.i [Manufacturing of machinery][Gaseous Fuels][Emissions][CO2][kt][no source][no method][no target][no option][no type]
status: valid
status modified: 2017-02-13
accepted date: 2017-02-13
in scheme: emissions_variables_MMR

1.A.2.g.i [Manufacturing of machinery][Gaseous Fuels][Emissions][N2O][kt][no source][no method][no target][no option][no type]
type: Concept
definition: 1.A.2.g.i [Manufacturing of machinery][Gaseous Fuels][Emissions][N2O][kt][no source][no method][no target][no option][no type]
status: valid
status modified: 2017-02-13
accepted date: 2017-02-13
in scheme: emissions_variables_MMR

1.A.2.g.i [Manufacturing of machinery][Liquid Fuels][Emissions][CH4][kt][no source][no method][no target][no option][no type]
type: Concept
definition: 1.A.2.g.i [Manufacturing of machinery][Liquid Fuels][Emissions][CH4][kt][no source][no method][no target][no option][no type]
status: valid
status modified: 2017-02-13
accepted date: 2017-02-13
in scheme: emissions_variables_MMR

1.A.2.g.i [Manufacturing of machinery][Liquid Fuels][Emissions][CO2][kt][no source][no method][no target][no option][no type]
type: Concept
definition: 1.A.2.g.i [Manufacturing of machinery][Liquid Fuels][Emissions][CO2][kt][no source][no method][no target][no option][no type]
status: valid
status modified: 2017-02-13
accepted date: 2017-02-13
in scheme: emissions_variables_MMR

1.A.2.g.i [Manufacturing of machinery][Liquid Fuels][Emissions][N2O][kt][no source][no method][no target][no option][no type]
type: Concept
definition: 1.A.2.g.i [Manufacturing of machinery][Liquid Fuels][Emissions][N2O][kt][no source][no method][no target][no option][no type]
status: valid
status modified: 2017-02-13
accepted date: 2017-02-13
in scheme: emissions_variables_MMR

1.A.2.g.i [Manufacturing of machinery][Other Fossil Fuels][Emissions][CH4][kt][no source][no method][no target][no option][no type]
type: Concept
definition: 1.A.2.g.i [Manufacturing of machinery][Other Fossil Fuels][Emissions][CH4][kt][no source][no method][no target][no option][no type]
status: valid
status modified: 2017-02-13
accepted date: 2017-02-13
in scheme: emissions_variables_MMR

1.A.2.g.i [Manufacturing of machinery][Other Fossil Fuels][Emissions][CO2][kt][no source][no method][no target][no option][no type]
type: Concept
definition: 1.A.2.g.i [Manufacturing of machinery][Other Fossil Fuels][Emissions][CO2][kt][no source][no method][no target][no option][no type]
status: valid
status modified: 2017-02-13
accepted date: 2017-02-13
in scheme: emissions_variables_MMR

1.A.2.g.i [Manufacturing of machinery][Other Fossil Fuels][Emissions][N2O][kt][no source][no method][no target][no option][no type]
type: Concept
definition: 1.A.2.g.i [Manufacturing of machinery][Other Fossil Fuels][Emissions][N2O][kt][no source][no method][no target][no option][no type]
status: valid
status modified: 2017-02-13
accepted date: 2017-02-13
in scheme: emissions_variables_MMR

1.A.2.g.i [Manufacturing of machinery][Peat][Emissions][CH4][kt][no source][no method][no target][no option][no type]
type: Concept
definition: 1.A.2.g.i [Manufacturing of machinery][Peat][Emissions][CH4][kt][no source][no method][no target][no option][no type]
status: valid
status modified: 2017-02-13
accepted date: 2017-02-13
in scheme: emissions_variables_MMR

1.A.2.g.i [Manufacturing of machinery][Peat][Emissions][CO2][kt][no source][no method][no target][no option][no type]
type: Concept
definition: 1.A.2.g.i [Manufacturing of machinery][Peat][Emissions][CO2][kt][no source][no method][no target][no option][no type]
status: valid
status modified: 2017-02-13
accepted date: 2017-02-13
in scheme: emissions_variables_MMR

1.A.2.g.i [Manufacturing of machinery][Peat][Emissions][N2O][kt][no source][no method][no target][no option][no type]
type: Concept
definition: 1.A.2.g.i [Manufacturing of machinery][Peat][Emissions][N2O][kt][no source][no method][no target][no option][no type]
status: valid
status modified: 2017-02-13
accepted date: 2017-02-13
in scheme: emissions_variables_MMR

1.A.2.g.i [Manufacturing of machinery][Solid Fuels][Emissions][CH4][kt][no source][no method][no target][no option][no type]
type: Concept
definition: 1.A.2.g.i [Manufacturing of machinery][Solid Fuels][Emissions][CH4][kt][no source][no method][no target][no option][no type]
status: valid
status modified: 2017-02-13
accepted date: 2017-02-13
in scheme: emissions_variables_MMR

1.A.2.g.i [Manufacturing of machinery][Solid Fuels][Emissions][CO2][kt][no source][no method][no target][no option][no type]
type: Concept
definition: 1.A.2.g.i [Manufacturing of machinery][Solid Fuels][Emissions][CO2][kt][no source][no method][no target][no option][no type]
status: valid
status modified: 2017-02-13
accepted date: 2017-02-13
in scheme: emissions_variables_MMR

1.A.2.g.i [Manufacturing of machinery][Solid Fuels][Emissions][N2O][kt][no source][no method][no target][no option][no type]
type: Concept
definition: 1.A.2.g.i [Manufacturing of machinery][Solid Fuels][Emissions][N2O][kt][no source][no method][no target][no option][no type]
status: valid
status modified: 2017-02-13
accepted date: 2017-02-13
in scheme: emissions_variables_MMR

1.A.2.g.ii [Manufacturing of transport equipment][Biomass][Emissions][CH4][kt][no source][no method][no target][no option][no type]
type: Concept
definition: 1.A.2.g.ii [Manufacturing of transport equipment][Biomass][Emissions][CH4][kt][no source][no method][no target][no option][no type]
status: valid
status modified: 2017-02-13
accepted date: 2017-02-13
in scheme: emissions_variables_MMR

1.A.2.g.ii [Manufacturing of transport equipment][Biomass][Emissions][CO2][kt][no source][no method][no target][no option][no type]
type: Concept
definition: 1.A.2.g.ii [Manufacturing of transport equipment][Biomass][Emissions][CO2][kt][no source][no method][no target][no option][no type]
status: valid
status modified: 2017-02-13
accepted date: 2017-02-13
in scheme: emissions_variables_MMR

1.A.2.g.ii [Manufacturing of transport equipment][Biomass][Emissions][N2O][kt][no source][no method][no target][no option][no type]
type: Concept
definition: 1.A.2.g.ii [Manufacturing of transport equipment][Biomass][Emissions][N2O][kt][no source][no method][no target][no option][no type]
status: valid
status modified: 2017-02-13
accepted date: 2017-02-13
in scheme: emissions_variables_MMR

1.A.2.g.ii [Manufacturing of transport equipment][Fuels][Emissions][CH4][kt][no source][no method][no target][no option][no type]
type: Concept
definition: 1.A.2.g.ii [Manufacturing of transport equipment][Fuels][Emissions][CH4][kt][no source][no method][no target][no option][no type]
status: valid
status modified: 2017-02-13
accepted date: 2017-02-13
in scheme: emissions_variables_MMR

1.A.2.g.ii [Manufacturing of transport equipment][Fuels][Emissions][CO2][kt][no source][no method][no target][no option][no type]
type: Concept
definition: 1.A.2.g.ii [Manufacturing of transport equipment][Fuels][Emissions][CO2][kt][no source][no method][no target][no option][no type]
status: valid
status modified: 2017-02-13
accepted date: 2017-02-13
in scheme: emissions_variables_MMR

1.A.2.g.ii [Manufacturing of transport equipment][Fuels][Emissions][N2O][kt][no source][no method][no target][no option][no type]
type: Concept
definition: 1.A.2.g.ii [Manufacturing of transport equipment][Fuels][Emissions][N2O][kt][no source][no method][no target][no option][no type]
status: valid
status modified: 2017-02-13
accepted date: 2017-02-13
in scheme: emissions_variables_MMR

1.A.2.g.ii [Manufacturing of transport equipment][Gaseous Fuels][Emissions][CH4][kt][no source][no method][no target][no option][no type]
type: Concept
definition: 1.A.2.g.ii [Manufacturing of transport equipment][Gaseous Fuels][Emissions][CH4][kt][no source][no method][no target][no option][no type]
status: valid
status modified: 2017-02-13
accepted date: 2017-02-13
in scheme: emissions_variables_MMR

1.A.2.g.ii [Manufacturing of transport equipment][Gaseous Fuels][Emissions][CO2][kt][no source][no method][no target][no option][no type]
type: Concept
definition: 1.A.2.g.ii [Manufacturing of transport equipment][Gaseous Fuels][Emissions][CO2][kt][no source][no method][no target][no option][no type]
status: valid
status modified: 2017-02-13
accepted date: 2017-02-13
in scheme: emissions_variables_MMR

1.A.2.g.ii [Manufacturing of transport equipment][Gaseous Fuels][Emissions][N2O][kt][no source][no method][no target][no option][no type]
type: Concept
definition: 1.A.2.g.ii [Manufacturing of transport equipment][Gaseous Fuels][Emissions][N2O][kt][no source][no method][no target][no option][no type]
status: valid
status modified: 2017-02-13
accepted date: 2017-02-13
in scheme: emissions_variables_MMR

1.A.2.g.ii [Manufacturing of transport equipment][Liquid Fuels][Emissions][CH4][kt][no source][no method][no target][no option][no type]
type: Concept
definition: 1.A.2.g.ii [Manufacturing of transport equipment][Liquid Fuels][Emissions][CH4][kt][no source][no method][no target][no option][no type]
status: valid
status modified: 2017-02-13
accepted date: 2017-02-13
in scheme: emissions_variables_MMR

1.A.2.g.ii [Manufacturing of transport equipment][Liquid Fuels][Emissions][CO2][kt][no source][no method][no target][no option][no type]
type: Concept
definition: 1.A.2.g.ii [Manufacturing of transport equipment][Liquid Fuels][Emissions][CO2][kt][no source][no method][no target][no option][no type]
status: valid
status modified: 2017-02-13
accepted date: 2017-02-13
in scheme: emissions_variables_MMR

1.A.2.g.ii [Manufacturing of transport equipment][Liquid Fuels][Emissions][N2O][kt][no source][no method][no target][no option][no type]
type: Concept
definition: 1.A.2.g.ii [Manufacturing of transport equipment][Liquid Fuels][Emissions][N2O][kt][no source][no method][no target][no option][no type]
status: valid
status modified: 2017-02-13
accepted date: 2017-02-13
in scheme: emissions_variables_MMR

1.A.2.g.ii [Manufacturing of transport equipment][Other Fossil Fuels][Emissions][CH4][kt][no source][no method][no target][no option][no type]
type: Concept
definition: 1.A.2.g.ii [Manufacturing of transport equipment][Other Fossil Fuels][Emissions][CH4][kt][no source][no method][no target][no option][no type]
status: valid
status modified: 2017-02-13
accepted date: 2017-02-13
in scheme: emissions_variables_MMR

1.A.2.g.ii [Manufacturing of transport equipment][Other Fossil Fuels][Emissions][CO2][kt][no source][no method][no target][no option][no type]
type: Concept
definition: 1.A.2.g.ii [Manufacturing of transport equipment][Other Fossil Fuels][Emissions][CO2][kt][no source][no method][no target][no option][no type]
status: valid
status modified: 2017-02-13
accepted date: 2017-02-13
in scheme: emissions_variables_MMR

1.A.2.g.ii [Manufacturing of transport equipment][Other Fossil Fuels][Emissions][N2O][kt][no source][no method][no target][no option][no type]
type: Concept
definition: 1.A.2.g.ii [Manufacturing of transport equipment][Other Fossil Fuels][Emissions][N2O][kt][no source][no method][no target][no option][no type]
status: valid
status modified: 2017-02-13
accepted date: 2017-02-13
in scheme: emissions_variables_MMR

1.A.2.g.ii [Manufacturing of transport equipment][Peat][Emissions][CH4][kt][no source][no method][no target][no option][no type]
type: Concept
definition: 1.A.2.g.ii [Manufacturing of transport equipment][Peat][Emissions][CH4][kt][no source][no method][no target][no option][no type]
status: valid
status modified: 2017-02-13
accepted date: 2017-02-13
in scheme: emissions_variables_MMR

1.A.2.g.ii [Manufacturing of transport equipment][Peat][Emissions][CO2][kt][no source][no method][no target][no option][no type]
type: Concept
definition: 1.A.2.g.ii [Manufacturing of transport equipment][Peat][Emissions][CO2][kt][no source][no method][no target][no option][no type]
status: valid
status modified: 2017-02-13
accepted date: 2017-02-13
in scheme: emissions_variables_MMR

1.A.2.g.ii [Manufacturing of transport equipment][Peat][Emissions][N2O][kt][no source][no method][no target][no option][no type]
type: Concept
definition: 1.A.2.g.ii [Manufacturing of transport equipment][Peat][Emissions][N2O][kt][no source][no method][no target][no option][no type]
status: valid
status modified: 2017-02-13
accepted date: 2017-02-13
in scheme: emissions_variables_MMR

1.A.2.g.ii [Manufacturing of transport equipment][Solid Fuels][Emissions][CH4][kt][no source][no method][no target][no option][no type]
type: Concept
definition: 1.A.2.g.ii [Manufacturing of transport equipment][Solid Fuels][Emissions][CH4][kt][no source][no method][no target][no option][no type]
status: valid
status modified: 2017-02-13
accepted date: 2017-02-13
in scheme: emissions_variables_MMR

1.A.2.g.ii [Manufacturing of transport equipment][Solid Fuels][Emissions][CO2][kt][no source][no method][no target][no option][no type]
type: Concept
definition: 1.A.2.g.ii [Manufacturing of transport equipment][Solid Fuels][Emissions][CO2][kt][no source][no method][no target][no option][no type]
status: valid
status modified: 2017-02-13
accepted date: 2017-02-13
in scheme: emissions_variables_MMR

1.A.2.g.ii [Manufacturing of transport equipment][Solid Fuels][Emissions][N2O][kt][no source][no method][no target][no option][no type]
type: Concept
definition: 1.A.2.g.ii [Manufacturing of transport equipment][Solid Fuels][Emissions][N2O][kt][no source][no method][no target][no option][no type]
status: valid
status modified: 2017-02-13
accepted date: 2017-02-13
in scheme: emissions_variables_MMR

1.A.2.g.iii [Mining (excluding fuels) and quarrying][Biomass][Emissions][CH4][kt][no source][no method][no target][no option][no type]
type: Concept
definition: 1.A.2.g.iii [Mining (excluding fuels) and quarrying][Biomass][Emissions][CH4][kt][no source][no method][no target][no option][no type]
status: valid
status modified: 2017-02-13
accepted date: 2017-02-13
in scheme: emissions_variables_MMR

1.A.2.g.iii [Mining (excluding fuels) and quarrying][Biomass][Emissions][CO2][kt][no source][no method][no target][no option][no type]
type: Concept
definition: 1.A.2.g.iii [Mining (excluding fuels) and quarrying][Biomass][Emissions][CO2][kt][no source][no method][no target][no option][no type]
status: valid
status modified: 2017-02-13
accepted date: 2017-02-13
in scheme: emissions_variables_MMR

1.A.2.g.iii [Mining (excluding fuels) and quarrying][Biomass][Emissions][N2O][kt][no source][no method][no target][no option][no type]
type: Concept
definition: 1.A.2.g.iii [Mining (excluding fuels) and quarrying][Biomass][Emissions][N2O][kt][no source][no method][no target][no option][no type]
status: valid
status modified: 2017-02-13
accepted date: 2017-02-13
in scheme: emissions_variables_MMR

1.A.2.g.iii [Mining (excluding fuels) and quarrying][Fuels][Emissions][CH4][kt][no source][no method][no target][no option][no type]
type: Concept
definition: 1.A.2.g.iii [Mining (excluding fuels) and quarrying][Fuels][Emissions][CH4][kt][no source][no method][no target][no option][no type]
status: valid
status modified: 2017-02-13
accepted date: 2017-02-13
in scheme: emissions_variables_MMR

1.A.2.g.iii [Mining (excluding fuels) and quarrying][Fuels][Emissions][CO2][kt][no source][no method][no target][no option][no type]
type: Concept
definition: 1.A.2.g.iii [Mining (excluding fuels) and quarrying][Fuels][Emissions][CO2][kt][no source][no method][no target][no option][no type]
status: valid
status modified: 2017-02-13
accepted date: 2017-02-13
in scheme: emissions_variables_MMR

1.A.2.g.iii [Mining (excluding fuels) and quarrying][Fuels][Emissions][N2O][kt][no source][no method][no target][no option][no type]
type: Concept
definition: 1.A.2.g.iii [Mining (excluding fuels) and quarrying][Fuels][Emissions][N2O][kt][no source][no method][no target][no option][no type]
status: valid
status modified: 2017-02-13
accepted date: 2017-02-13
in scheme: emissions_variables_MMR

1.A.2.g.iii [Mining (excluding fuels) and quarrying][Gaseous Fuels][Emissions][CH4][kt][no source][no method][no target][no option][no type]
type: Concept
definition: 1.A.2.g.iii [Mining (excluding fuels) and quarrying][Gaseous Fuels][Emissions][CH4][kt][no source][no method][no target][no option][no type]
status: valid
status modified: 2017-02-13
accepted date: 2017-02-13
in scheme: emissions_variables_MMR

1.A.2.g.iii [Mining (excluding fuels) and quarrying][Gaseous Fuels][Emissions][CO2][kt][no source][no method][no target][no option][no type]
type: Concept
definition: 1.A.2.g.iii [Mining (excluding fuels) and quarrying][Gaseous Fuels][Emissions][CO2][kt][no source][no method][no target][no option][no type]
status: valid
status modified: 2017-02-13
accepted date: 2017-02-13
in scheme: emissions_variables_MMR

1.A.2.g.iii [Mining (excluding fuels) and quarrying][Gaseous Fuels][Emissions][N2O][kt][no source][no method][no target][no option][no type]
type: Concept
definition: 1.A.2.g.iii [Mining (excluding fuels) and quarrying][Gaseous Fuels][Emissions][N2O][kt][no source][no method][no target][no option][no type]
status: valid
status modified: 2017-02-13
accepted date: 2017-02-13
in scheme: emissions_variables_MMR

1.A.2.g.iii [Mining (excluding fuels) and quarrying][Liquid Fuels][Emissions][CH4][kt][no source][no method][no target][no option][no type]
type: Concept
definition: 1.A.2.g.iii [Mining (excluding fuels) and quarrying][Liquid Fuels][Emissions][CH4][kt][no source][no method][no target][no option][no type]
status: valid
status modified: 2017-02-13
accepted date: 2017-02-13
in scheme: emissions_variables_MMR

1.A.2.g.iii [Mining (excluding fuels) and quarrying][Liquid Fuels][Emissions][CO2][kt][no source][no method][no target][no option][no type]
type: Concept
definition: 1.A.2.g.iii [Mining (excluding fuels) and quarrying][Liquid Fuels][Emissions][CO2][kt][no source][no method][no target][no option][no type]
status: valid
status modified: 2017-02-13
accepted date: 2017-02-13
in scheme: emissions_variables_MMR

1.A.2.g.iii [Mining (excluding fuels) and quarrying][Liquid Fuels][Emissions][N2O][kt][no source][no method][no target][no option][no type]
type: Concept
definition: 1.A.2.g.iii [Mining (excluding fuels) and quarrying][Liquid Fuels][Emissions][N2O][kt][no source][no method][no target][no option][no type]
status: valid
status modified: 2017-02-13
accepted date: 2017-02-13
in scheme: emissions_variables_MMR

1.A.2.g.iii [Mining (excluding fuels) and quarrying][Other Fossil Fuels][Emissions][CH4][kt][no source][no method][no target][no option][no type]
type: Concept
definition: 1.A.2.g.iii [Mining (excluding fuels) and quarrying][Other Fossil Fuels][Emissions][CH4][kt][no source][no method][no target][no option][no type]
status: valid
status modified: 2017-02-13
accepted date: 2017-02-13
in scheme: emissions_variables_MMR

1.A.2.g.iii [Mining (excluding fuels) and quarrying][Other Fossil Fuels][Emissions][CO2][kt][no source][no method][no target][no option][no type]
type: Concept
definition: 1.A.2.g.iii [Mining (excluding fuels) and quarrying][Other Fossil Fuels][Emissions][CO2][kt][no source][no method][no target][no option][no type]
status: valid
status modified: 2017-02-13
accepted date: 2017-02-13
in scheme: emissions_variables_MMR

1.A.2.g.iii [Mining (excluding fuels) and quarrying][Other Fossil Fuels][Emissions][N2O][kt][no source][no method][no target][no option][no type]
type: Concept
definition: 1.A.2.g.iii [Mining (excluding fuels) and quarrying][Other Fossil Fuels][Emissions][N2O][kt][no source][no method][no target][no option][no type]
status: valid
status modified: 2017-02-13
accepted date: 2017-02-13
in scheme: emissions_variables_MMR

1.A.2.g.iii [Mining (excluding fuels) and quarrying][Peat][Emissions][CH4][kt][no source][no method][no target][no option][no type]
type: Concept
definition: 1.A.2.g.iii [Mining (excluding fuels) and quarrying][Peat][Emissions][CH4][kt][no source][no method][no target][no option][no type]
status: valid
status modified: 2017-02-13
accepted date: 2017-02-13
in scheme: emissions_variables_MMR

1.A.2.g.iii [Mining (excluding fuels) and quarrying][Peat][Emissions][CO2][kt][no source][no method][no target][no option][no type]
type: Concept
definition: 1.A.2.g.iii [Mining (excluding fuels) and quarrying][Peat][Emissions][CO2][kt][no source][no method][no target][no option][no type]
status: valid
status modified: 2017-02-13
accepted date: 2017-02-13
in scheme: emissions_variables_MMR

1.A.2.g.iii [Mining (excluding fuels) and quarrying][Peat][Emissions][N2O][kt][no source][no method][no target][no option][no type]
type: Concept
definition: 1.A.2.g.iii [Mining (excluding fuels) and quarrying][Peat][Emissions][N2O][kt][no source][no method][no target][no option][no type]
status: valid
status modified: 2017-02-13
accepted date: 2017-02-13
in scheme: emissions_variables_MMR

1.A.2.g.iii [Mining (excluding fuels) and quarrying][Solid Fuels][Emissions][CH4][kt][no source][no method][no target][no option][no type]
type: Concept
definition: 1.A.2.g.iii [Mining (excluding fuels) and quarrying][Solid Fuels][Emissions][CH4][kt][no source][no method][no target][no option][no type]
status: valid
status modified: 2017-02-13
accepted date: 2017-02-13
in scheme: emissions_variables_MMR

1.A.2.g.iii [Mining (excluding fuels) and quarrying][Solid Fuels][Emissions][CO2][kt][no source][no method][no target][no option][no type]
type: Concept
definition: 1.A.2.g.iii [Mining (excluding fuels) and quarrying][Solid Fuels][Emissions][CO2][kt][no source][no method][no target][no option][no type]
status: valid
status modified: 2017-02-13
accepted date: 2017-02-13
in scheme: emissions_variables_MMR

1.A.2.g.iii [Mining (excluding fuels) and quarrying][Solid Fuels][Emissions][N2O][kt][no source][no method][no target][no option][no type]
type: Concept
definition: 1.A.2.g.iii [Mining (excluding fuels) and quarrying][Solid Fuels][Emissions][N2O][kt][no source][no method][no target][no option][no type]
status: valid
status modified: 2017-02-13
accepted date: 2017-02-13
in scheme: emissions_variables_MMR

1.A.2.g.iv [Wood and wood products][Biomass][Emissions][CH4][kt][no source][no method][no target][no option][no type]
type: Concept
definition: 1.A.2.g.iv [Wood and wood products][Biomass][Emissions][CH4][kt][no source][no method][no target][no option][no type]
status: valid
status modified: 2017-02-13
accepted date: 2017-02-13
in scheme: emissions_variables_MMR

1.A.2.g.iv [Wood and wood products][Biomass][Emissions][CO2][kt][no source][no method][no target][no option][no type]
type: Concept
definition: 1.A.2.g.iv [Wood and wood products][Biomass][Emissions][CO2][kt][no source][no method][no target][no option][no type]
status: valid
status modified: 2017-02-13
accepted date: 2017-02-13
in scheme: emissions_variables_MMR

1.A.2.g.iv [Wood and wood products][Biomass][Emissions][N2O][kt][no source][no method][no target][no option][no type]
type: Concept
definition: 1.A.2.g.iv [Wood and wood products][Biomass][Emissions][N2O][kt][no source][no method][no target][no option][no type]
status: valid
status modified: 2017-02-13
accepted date: 2017-02-13
in scheme: emissions_variables_MMR

1.A.2.g.iv [Wood and wood products][Fuels][Emissions][CH4][kt][no source][no method][no target][no option][no type]
type: Concept
definition: 1.A.2.g.iv [Wood and wood products][Fuels][Emissions][CH4][kt][no source][no method][no target][no option][no type]
status: valid
status modified: 2017-02-13
accepted date: 2017-02-13
in scheme: emissions_variables_MMR

1.A.2.g.iv [Wood and wood products][Fuels][Emissions][CO2][kt][no source][no method][no target][no option][no type]
type: Concept
definition: 1.A.2.g.iv [Wood and wood products][Fuels][Emissions][CO2][kt][no source][no method][no target][no option][no type]
status: valid
status modified: 2017-02-13
accepted date: 2017-02-13
in scheme: emissions_variables_MMR

1.A.2.g.iv [Wood and wood products][Fuels][Emissions][N2O][kt][no source][no method][no target][no option][no type]
type: Concept
definition: 1.A.2.g.iv [Wood and wood products][Fuels][Emissions][N2O][kt][no source][no method][no target][no option][no type]
status: valid
status modified: 2017-02-13
accepted date: 2017-02-13
in scheme: emissions_variables_MMR

1.A.2.g.iv [Wood and wood products][Gaseous Fuels][Emissions][CH4][kt][no source][no method][no target][no option][no type]
type: Concept
definition: 1.A.2.g.iv [Wood and wood products][Gaseous Fuels][Emissions][CH4][kt][no source][no method][no target][no option][no type]
status: valid
status modified: 2017-02-13
accepted date: 2017-02-13
in scheme: emissions_variables_MMR

1.A.2.g.iv [Wood and wood products][Gaseous Fuels][Emissions][CO2][kt][no source][no method][no target][no option][no type]
type: Concept
definition: 1.A.2.g.iv [Wood and wood products][Gaseous Fuels][Emissions][CO2][kt][no source][no method][no target][no option][no type]
status: valid
status modified: 2017-02-13
accepted date: 2017-02-13
in scheme: emissions_variables_MMR

1.A.2.g.iv [Wood and wood products][Gaseous Fuels][Emissions][N2O][kt][no source][no method][no target][no option][no type]
type: Concept
definition: 1.A.2.g.iv [Wood and wood products][Gaseous Fuels][Emissions][N2O][kt][no source][no method][no target][no option][no type]
status: valid
status modified: 2017-02-13
accepted date: 2017-02-13
in scheme: emissions_variables_MMR

1.A.2.g.iv [Wood and wood products][Liquid Fuels][Emissions][CH4][kt][no source][no method][no target][no option][no type]
type: Concept
definition: 1.A.2.g.iv [Wood and wood products][Liquid Fuels][Emissions][CH4][kt][no source][no method][no target][no option][no type]
status: valid
status modified: 2017-02-13
accepted date: 2017-02-13
in scheme: emissions_variables_MMR

1.A.2.g.iv [Wood and wood products][Liquid Fuels][Emissions][CO2][kt][no source][no method][no target][no option][no type]
type: Concept
definition: 1.A.2.g.iv [Wood and wood products][Liquid Fuels][Emissions][CO2][kt][no source][no method][no target][no option][no type]
status: valid
status modified: 2017-02-13
accepted date: 2017-02-13
in scheme: emissions_variables_MMR

1.A.2.g.iv [Wood and wood products][Liquid Fuels][Emissions][N2O][kt][no source][no method][no target][no option][no type]
type: Concept
definition: 1.A.2.g.iv [Wood and wood products][Liquid Fuels][Emissions][N2O][kt][no source][no method][no target][no option][no type]
status: valid
status modified: 2017-02-13
accepted date: 2017-02-13
in scheme: emissions_variables_MMR

1.A.2.g.iv [Wood and wood products][Other Fossil Fuels][Emissions][CH4][kt][no source][no method][no target][no option][no type]
type: Concept
definition: 1.A.2.g.iv [Wood and wood products][Other Fossil Fuels][Emissions][CH4][kt][no source][no method][no target][no option][no type]
status: valid
status modified: 2017-02-13
accepted date: 2017-02-13
in scheme: emissions_variables_MMR

1.A.2.g.iv [Wood and wood products][Other Fossil Fuels][Emissions][CO2][kt][no source][no method][no target][no option][no type]
type: Concept
definition: 1.A.2.g.iv [Wood and wood products][Other Fossil Fuels][Emissions][CO2][kt][no source][no method][no target][no option][no type]
status: valid
status modified: 2017-02-13
accepted date: 2017-02-13
in scheme: emissions_variables_MMR

1.A.2.g.iv [Wood and wood products][Other Fossil Fuels][Emissions][N2O][kt][no source][no method][no target][no option][no type]
type: Concept
definition: 1.A.2.g.iv [Wood and wood products][Other Fossil Fuels][Emissions][N2O][kt][no source][no method][no target][no option][no type]
status: valid
status modified: 2017-02-13
accepted date: 2017-02-13
in scheme: emissions_variables_MMR

1.A.2.g.iv [Wood and wood products][Peat][Emissions][CH4][kt][no source][no method][no target][no option][no type]
type: Concept
definition: 1.A.2.g.iv [Wood and wood products][Peat][Emissions][CH4][kt][no source][no method][no target][no option][no type]
status: valid
status modified: 2017-02-13
accepted date: 2017-02-13
in scheme: emissions_variables_MMR

1.A.2.g.iv [Wood and wood products][Peat][Emissions][CO2][kt][no source][no method][no target][no option][no type]
type: Concept
definition: 1.A.2.g.iv [Wood and wood products][Peat][Emissions][CO2][kt][no source][no method][no target][no option][no type]
status: valid
status modified: 2017-02-13
accepted date: 2017-02-13
in scheme: emissions_variables_MMR

1.A.2.g.iv [Wood and wood products][Peat][Emissions][N2O][kt][no source][no method][no target][no option][no type]
type: Concept
definition: 1.A.2.g.iv [Wood and wood products][Peat][Emissions][N2O][kt][no source][no method][no target][no option][no type]
status: valid
status modified: 2017-02-13
accepted date: 2017-02-13
in scheme: emissions_variables_MMR

1.A.2.g.iv [Wood and wood products][Solid Fuels][Emissions][CH4][kt][no source][no method][no target][no option][no type]
type: Concept
definition: 1.A.2.g.iv [Wood and wood products][Solid Fuels][Emissions][CH4][kt][no source][no method][no target][no option][no type]
status: valid
status modified: 2017-02-13
accepted date: 2017-02-13
in scheme: emissions_variables_MMR

1.A.2.g.iv [Wood and wood products][Solid Fuels][Emissions][CO2][kt][no source][no method][no target][no option][no type]
type: Concept
definition: 1.A.2.g.iv [Wood and wood products][Solid Fuels][Emissions][CO2][kt][no source][no method][no target][no option][no type]
status: valid
status modified: 2017-02-13
accepted date: 2017-02-13
in scheme: emissions_variables_MMR

1.A.2.g.iv [Wood and wood products][Solid Fuels][Emissions][N2O][kt][no source][no method][no target][no option][no type]
type: Concept
definition: 1.A.2.g.iv [Wood and wood products][Solid Fuels][Emissions][N2O][kt][no source][no method][no target][no option][no type]
status: valid
status modified: 2017-02-13
accepted date: 2017-02-13
in scheme: emissions_variables_MMR

1.A.2.g.v [Construction][Biomass][Emissions][CH4][kt][no source][no method][no target][no option][no type]
type: Concept
definition: 1.A.2.g.v [Construction][Biomass][Emissions][CH4][kt][no source][no method][no target][no option][no type]
status: valid
status modified: 2017-02-13
accepted date: 2017-02-13
in scheme: emissions_variables_MMR

1.A.2.g.v [Construction][Biomass][Emissions][CO2][kt][no source][no method][no target][no option][no type]
type: Concept
definition: 1.A.2.g.v [Construction][Biomass][Emissions][CO2][kt][no source][no method][no target][no option][no type]
status: valid
status modified: 2017-02-13
accepted date: 2017-02-13
in scheme: emissions_variables_MMR

1.A.2.g.v [Construction][Biomass][Emissions][N2O][kt][no source][no method][no target][no option][no type]
type: Concept
definition: 1.A.2.g.v [Construction][Biomass][Emissions][N2O][kt][no source][no method][no target][no option][no type]
status: valid
status modified: 2017-02-13
accepted date: 2017-02-13
in scheme: emissions_variables_MMR

1.A.2.g.v [Construction][Fuels][Emissions][CH4][kt][no source][no method][no target][no option][no type]
type: Concept
definition: 1.A.2.g.v [Construction][Fuels][Emissions][CH4][kt][no source][no method][no target][no option][no type]
status: valid
status modified: 2017-02-13
accepted date: 2017-02-13
in scheme: emissions_variables_MMR

1.A.2.g.v [Construction][Fuels][Emissions][CO2][kt][no source][no method][no target][no option][no type]
type: Concept
definition: 1.A.2.g.v [Construction][Fuels][Emissions][CO2][kt][no source][no method][no target][no option][no type]
status: valid
status modified: 2017-02-13
accepted date: 2017-02-13
in scheme: emissions_variables_MMR

1.A.2.g.v [Construction][Fuels][Emissions][N2O][kt][no source][no method][no target][no option][no type]
type: Concept
definition: 1.A.2.g.v [Construction][Fuels][Emissions][N2O][kt][no source][no method][no target][no option][no type]
status: valid
status modified: 2017-02-13
accepted date: 2017-02-13
in scheme: emissions_variables_MMR

1.A.2.g.v [Construction][Gaseous Fuels][Emissions][CH4][kt][no source][no method][no target][no option][no type]
type: Concept
definition: 1.A.2.g.v [Construction][Gaseous Fuels][Emissions][CH4][kt][no source][no method][no target][no option][no type]
status: valid
status modified: 2017-02-13
accepted date: 2017-02-13
in scheme: emissions_variables_MMR

1.A.2.g.v [Construction][Gaseous Fuels][Emissions][CO2][kt][no source][no method][no target][no option][no type]
type: Concept
definition: 1.A.2.g.v [Construction][Gaseous Fuels][Emissions][CO2][kt][no source][no method][no target][no option][no type]
status: valid
status modified: 2017-02-13
accepted date: 2017-02-13
in scheme: emissions_variables_MMR

1.A.2.g.v [Construction][Gaseous Fuels][Emissions][N2O][kt][no source][no method][no target][no option][no type]
type: Concept
definition: 1.A.2.g.v [Construction][Gaseous Fuels][Emissions][N2O][kt][no source][no method][no target][no option][no type]
status: valid
status modified: 2017-02-13
accepted date: 2017-02-13
in scheme: emissions_variables_MMR

1.A.2.g.v [Construction][Liquid Fuels][Emissions][CH4][kt][no source][no method][no target][no option][no type]
type: Concept
definition: 1.A.2.g.v [Construction][Liquid Fuels][Emissions][CH4][kt][no source][no method][no target][no option][no type]
status: valid
status modified: 2017-02-13
accepted date: 2017-02-13
in scheme: emissions_variables_MMR

1.A.2.g.v [Construction][Liquid Fuels][Emissions][CO2][kt][no source][no method][no target][no option][no type]
type: Concept
definition: 1.A.2.g.v [Construction][Liquid Fuels][Emissions][CO2][kt][no source][no method][no target][no option][no type]
status: valid
status modified: 2017-02-13
accepted date: 2017-02-13
in scheme: emissions_variables_MMR

1.A.2.g.v [Construction][Liquid Fuels][Emissions][N2O][kt][no source][no method][no target][no option][no type]
type: Concept
definition: 1.A.2.g.v [Construction][Liquid Fuels][Emissions][N2O][kt][no source][no method][no target][no option][no type]
status: valid
status modified: 2017-02-13
accepted date: 2017-02-13
in scheme: emissions_variables_MMR

1.A.2.g.v [Construction][Other Fossil Fuels][Emissions][CH4][kt][no source][no method][no target][no option][no type]
type: Concept
definition: 1.A.2.g.v [Construction][Other Fossil Fuels][Emissions][CH4][kt][no source][no method][no target][no option][no type]
status: valid
status modified: 2017-02-13
accepted date: 2017-02-13
in scheme: emissions_variables_MMR

1.A.2.g.v [Construction][Other Fossil Fuels][Emissions][CO2][kt][no source][no method][no target][no option][no type]
type: Concept
definition: 1.A.2.g.v [Construction][Other Fossil Fuels][Emissions][CO2][kt][no source][no method][no target][no option][no type]
status: valid
status modified: 2017-02-13
accepted date: 2017-02-13
in scheme: emissions_variables_MMR

1.A.2.g.v [Construction][Other Fossil Fuels][Emissions][N2O][kt][no source][no method][no target][no option][no type]
type: Concept
definition: 1.A.2.g.v [Construction][Other Fossil Fuels][Emissions][N2O][kt][no source][no method][no target][no option][no type]
status: valid
status modified: 2017-02-13
accepted date: 2017-02-13
in scheme: emissions_variables_MMR

1.A.2.g.v [Construction][Peat][Emissions][CH4][kt][no source][no method][no target][no option][no type]
type: Concept
definition: 1.A.2.g.v [Construction][Peat][Emissions][CH4][kt][no source][no method][no target][no option][no type]
status: valid
status modified: 2017-02-13
accepted date: 2017-02-13
in scheme: emissions_variables_MMR

1.A.2.g.v [Construction][Peat][Emissions][CO2][kt][no source][no method][no target][no option][no type]
type: Concept
definition: 1.A.2.g.v [Construction][Peat][Emissions][CO2][kt][no source][no method][no target][no option][no type]
status: valid
status modified: 2017-02-13
accepted date: 2017-02-13
in scheme: emissions_variables_MMR

1.A.2.g.v [Construction][Peat][Emissions][N2O][kt][no source][no method][no target][no option][no type]
type: Concept
definition: 1.A.2.g.v [Construction][Peat][Emissions][N2O][kt][no source][no method][no target][no option][no type]
status: valid
status modified: 2017-02-13
accepted date: 2017-02-13
in scheme: emissions_variables_MMR

1.A.2.g.v [Construction][Solid Fuels][Emissions][CH4][kt][no source][no method][no target][no option][no type]
type: Concept
definition: 1.A.2.g.v [Construction][Solid Fuels][Emissions][CH4][kt][no source][no method][no target][no option][no type]
status: valid
status modified: 2017-02-13
accepted date: 2017-02-13
in scheme: emissions_variables_MMR

1.A.2.g.v [Construction][Solid Fuels][Emissions][CO2][kt][no source][no method][no target][no option][no type]
type: Concept
definition: 1.A.2.g.v [Construction][Solid Fuels][Emissions][CO2][kt][no source][no method][no target][no option][no type]
status: valid
status modified: 2017-02-13
accepted date: 2017-02-13
in scheme: emissions_variables_MMR

1.A.2.g.v [Construction][Solid Fuels][Emissions][N2O][kt][no source][no method][no target][no option][no type]
type: Concept
definition: 1.A.2.g.v [Construction][Solid Fuels][Emissions][N2O][kt][no source][no method][no target][no option][no type]
status: valid
status modified: 2017-02-13
accepted date: 2017-02-13
in scheme: emissions_variables_MMR

1.A.2.g.vi [Textile and leather][Biomass][Emissions][CH4][kt][no source][no method][no target][no option][no type]
type: Concept
definition: 1.A.2.g.vi [Textile and leather][Biomass][Emissions][CH4][kt][no source][no method][no target][no option][no type]
status: valid
status modified: 2017-02-13
accepted date: 2017-02-13
in scheme: emissions_variables_MMR

1.A.2.g.vi [Textile and leather][Biomass][Emissions][CO2][kt][no source][no method][no target][no option][no type]
type: Concept
definition: 1.A.2.g.vi [Textile and leather][Biomass][Emissions][CO2][kt][no source][no method][no target][no option][no type]
status: valid
status modified: 2017-02-13
accepted date: 2017-02-13
in scheme: emissions_variables_MMR

1.A.2.g.vi [Textile and leather][Biomass][Emissions][N2O][kt][no source][no method][no target][no option][no type]
type: Concept
definition: 1.A.2.g.vi [Textile and leather][Biomass][Emissions][N2O][kt][no source][no method][no target][no option][no type]
status: valid
status modified: 2017-02-13
accepted date: 2017-02-13
in scheme: emissions_variables_MMR

1.A.2.g.vi [Textile and leather][Fuels][Emissions][CH4][kt][no source][no method][no target][no option][no type]
type: Concept
definition: 1.A.2.g.vi [Textile and leather][Fuels][Emissions][CH4][kt][no source][no method][no target][no option][no type]
status: valid
status modified: 2017-02-13
accepted date: 2017-02-13
in scheme: emissions_variables_MMR

1.A.2.g.vi [Textile and leather][Fuels][Emissions][CO2][kt][no source][no method][no target][no option][no type]
type: Concept
definition: 1.A.2.g.vi [Textile and leather][Fuels][Emissions][CO2][kt][no source][no method][no target][no option][no type]
status: valid
status modified: 2017-02-13
accepted date: 2017-02-13
in scheme: emissions_variables_MMR

1.A.2.g.vi [Textile and leather][Fuels][Emissions][N2O][kt][no source][no method][no target][no option][no type]
type: Concept
definition: 1.A.2.g.vi [Textile and leather][Fuels][Emissions][N2O][kt][no source][no method][no target][no option][no type]
status: valid
status modified: 2017-02-13
accepted date: 2017-02-13
in scheme: emissions_variables_MMR

1.A.2.g.vi [Textile and leather][Gaseous Fuels][Emissions][CH4][kt][no source][no method][no target][no option][no type]
type: Concept
definition: 1.A.2.g.vi [Textile and leather][Gaseous Fuels][Emissions][CH4][kt][no source][no method][no target][no option][no type]
status: valid
status modified: 2017-02-13
accepted date: 2017-02-13
in scheme: emissions_variables_MMR

1.A.2.g.vi [Textile and leather][Gaseous Fuels][Emissions][CO2][kt][no source][no method][no target][no option][no type]
type: Concept
definition: 1.A.2.g.vi [Textile and leather][Gaseous Fuels][Emissions][CO2][kt][no source][no method][no target][no option][no type]
status: valid
status modified: 2017-02-13
accepted date: 2017-02-13
in scheme: emissions_variables_MMR

1.A.2.g.vi [Textile and leather][Gaseous Fuels][Emissions][N2O][kt][no source][no method][no target][no option][no type]
type: Concept
definition: 1.A.2.g.vi [Textile and leather][Gaseous Fuels][Emissions][N2O][kt][no source][no method][no target][no option][no type]
status: valid
status modified: 2017-02-13
accepted date: 2017-02-13
in scheme: emissions_variables_MMR

1.A.2.g.vi [Textile and leather][Liquid Fuels][Emissions][CH4][kt][no source][no method][no target][no option][no type]
type: Concept
definition: 1.A.2.g.vi [Textile and leather][Liquid Fuels][Emissions][CH4][kt][no source][no method][no target][no option][no type]
status: valid
status modified: 2017-02-13
accepted date: 2017-02-13
in scheme: emissions_variables_MMR

1.A.2.g.vi [Textile and leather][Liquid Fuels][Emissions][CO2][kt][no source][no method][no target][no option][no type]
type: Concept
definition: 1.A.2.g.vi [Textile and leather][Liquid Fuels][Emissions][CO2][kt][no source][no method][no target][no option][no type]
status: valid
status modified: 2017-02-13
accepted date: 2017-02-13
in scheme: emissions_variables_MMR

1.A.2.g.vi [Textile and leather][Liquid Fuels][Emissions][N2O][kt][no source][no method][no target][no option][no type]
type: Concept
definition: 1.A.2.g.vi [Textile and leather][Liquid Fuels][Emissions][N2O][kt][no source][no method][no target][no option][no type]
status: valid
status modified: 2017-02-13
accepted date: 2017-02-13
in scheme: emissions_variables_MMR

1.A.2.g.vi [Textile and leather][Other Fossil Fuels][Emissions][CH4][kt][no source][no method][no target][no option][no type]
type: Concept
definition: 1.A.2.g.vi [Textile and leather][Other Fossil Fuels][Emissions][CH4][kt][no source][no method][no target][no option][no type]
status: valid
status modified: 2017-02-13
accepted date: 2017-02-13
in scheme: emissions_variables_MMR

1.A.2.g.vi [Textile and leather][Other Fossil Fuels][Emissions][CO2][kt][no source][no method][no target][no option][no type]
type: Concept
definition: 1.A.2.g.vi [Textile and leather][Other Fossil Fuels][Emissions][CO2][kt][no source][no method][no target][no option][no type]
status: valid
status modified: 2017-02-13
accepted date: 2017-02-13
in scheme: emissions_variables_MMR

1.A.2.g.vi [Textile and leather][Other Fossil Fuels][Emissions][N2O][kt][no source][no method][no target][no option][no type]
type: Concept
definition: 1.A.2.g.vi [Textile and leather][Other Fossil Fuels][Emissions][N2O][kt][no source][no method][no target][no option][no type]
status: valid
status modified: 2017-02-13
accepted date: 2017-02-13
in scheme: emissions_variables_MMR

1.A.2.g.vi [Textile and leather][Peat][Emissions][CH4][kt][no source][no method][no target][no option][no type]
type: Concept
definition: 1.A.2.g.vi [Textile and leather][Peat][Emissions][CH4][kt][no source][no method][no target][no option][no type]
status: valid
status modified: 2017-02-13
accepted date: 2017-02-13
in scheme: emissions_variables_MMR

1.A.2.g.vi [Textile and leather][Peat][Emissions][CO2][kt][no source][no method][no target][no option][no type]
type: Concept
definition: 1.A.2.g.vi [Textile and leather][Peat][Emissions][CO2][kt][no source][no method][no target][no option][no type]
status: valid
status modified: 2017-02-13
accepted date: 2017-02-13
in scheme: emissions_variables_MMR

1.A.2.g.vi [Textile and leather][Peat][Emissions][N2O][kt][no source][no method][no target][no option][no type]
type: Concept
definition: 1.A.2.g.vi [Textile and leather][Peat][Emissions][N2O][kt][no source][no method][no target][no option][no type]
status: valid
status modified: 2017-02-13
accepted date: 2017-02-13
in scheme: emissions_variables_MMR

1.A.2.g.vi [Textile and leather][Solid Fuels][Emissions][CH4][kt][no source][no method][no target][no option][no type]
type: Concept
definition: 1.A.2.g.vi [Textile and leather][Solid Fuels][Emissions][CH4][kt][no source][no method][no target][no option][no type]
status: valid
status modified: 2017-02-13
accepted date: 2017-02-13
in scheme: emissions_variables_MMR

1.A.2.g.vi [Textile and leather][Solid Fuels][Emissions][CO2][kt][no source][no method][no target][no option][no type]
type: Concept
definition: 1.A.2.g.vi [Textile and leather][Solid Fuels][Emissions][CO2][kt][no source][no method][no target][no option][no type]
status: valid
status modified: 2017-02-13
accepted date: 2017-02-13
in scheme: emissions_variables_MMR

1.A.2.g.vi [Textile and leather][Solid Fuels][Emissions][N2O][kt][no source][no method][no target][no option][no type]
type: Concept
definition: 1.A.2.g.vi [Textile and leather][Solid Fuels][Emissions][N2O][kt][no source][no method][no target][no option][no type]
status: valid
status modified: 2017-02-13
accepted date: 2017-02-13
in scheme: emissions_variables_MMR

1.A.2.g.vii [Off-road vehicles and other machinery production][Biomass][Emissions][CH4][kt][no source][no method][no target][no option][no type]
type: Concept
definition: 1.A.2.g.vii [Off-road vehicles and other machinery production][Biomass][Emissions][CH4][kt][no source][no method][no target][no option][no type]
status: valid
status modified: 2017-02-13
accepted date: 2017-02-13
in scheme: emissions_variables_MMR

1.A.2.g.vii [Off-road vehicles and other machinery production][Biomass][Emissions][CO2][kt][no source][no method][no target][no option][no type]
type: Concept
definition: 1.A.2.g.vii [Off-road vehicles and other machinery production][Biomass][Emissions][CO2][kt][no source][no method][no target][no option][no type]
status: valid
status modified: 2017-02-13
accepted date: 2017-02-13
in scheme: emissions_variables_MMR

1.A.2.g.vii [Off-road vehicles and other machinery production][Biomass][Emissions][N2O][kt][no source][no method][no target][no option][no type]
type: Concept
definition: 1.A.2.g.vii [Off-road vehicles and other machinery production][Biomass][Emissions][N2O][kt][no source][no method][no target][no option][no type]
status: valid
status modified: 2017-02-13
accepted date: 2017-02-13
in scheme: emissions_variables_MMR

1.A.2.g.vii [Off-road vehicles and other machinery production][Fuels][Emissions][CH4][kt][no source][no method][no target][no option][no type]
type: Concept
definition: 1.A.2.g.vii [Off-road vehicles and other machinery production][Fuels][Emissions][CH4][kt][no source][no method][no target][no option][no type]
status: valid
status modified: 2017-02-13
accepted date: 2017-02-13
in scheme: emissions_variables_MMR

1.A.2.g.vii [Off-road vehicles and other machinery production][Fuels][Emissions][CO2][kt][no source][no method][no target][no option][no type]
type: Concept
definition: 1.A.2.g.vii [Off-road vehicles and other machinery production][Fuels][Emissions][CO2][kt][no source][no method][no target][no option][no type]
status: valid
status modified: 2017-02-13
accepted date: 2017-02-13
in scheme: emissions_variables_MMR

1.A.2.g.vii [Off-road vehicles and other machinery production][Fuels][Emissions][N2O][kt][no source][no method][no target][no option][no type]
type: Concept
definition: 1.A.2.g.vii [Off-road vehicles and other machinery production][Fuels][Emissions][N2O][kt][no source][no method][no target][no option][no type]
status: valid
status modified: 2017-02-13
accepted date: 2017-02-13
in scheme: emissions_variables_MMR

1.A.2.g.vii [Off-road vehicles and other machinery production][Gaseous Fuels][Emissions][CH4][kt][no source][no method][no target][no option][no type]
type: Concept
definition: 1.A.2.g.vii [Off-road vehicles and other machinery production][Gaseous Fuels][Emissions][CH4][kt][no source][no method][no target][no option][no type]
status: valid
status modified: 2017-02-13
accepted date: 2017-02-13
in scheme: emissions_variables_MMR

1.A.2.g.vii [Off-road vehicles and other machinery production][Gaseous Fuels][Emissions][CO2][kt][no source][no method][no target][no option][no type]
type: Concept
definition: 1.A.2.g.vii [Off-road vehicles and other machinery production][Gaseous Fuels][Emissions][CO2][kt][no source][no method][no target][no option][no type]
status: valid
status modified: 2017-02-13
accepted date: 2017-02-13
in scheme: emissions_variables_MMR

1.A.2.g.vii [Off-road vehicles and other machinery production][Gaseous Fuels][Emissions][N2O][kt][no source][no method][no target][no option][no type]
type: Concept
definition: 1.A.2.g.vii [Off-road vehicles and other machinery production][Gaseous Fuels][Emissions][N2O][kt][no source][no method][no target][no option][no type]
status: valid
status modified: 2017-02-13
accepted date: 2017-02-13
in scheme: emissions_variables_MMR

1.A.2.g.vii [Off-road vehicles and other machinery production][Liquid Fuels][Emissions][CH4][kt][no source][no method][no target][no option][no type]
type: Concept
definition: 1.A.2.g.vii [Off-road vehicles and other machinery production][Liquid Fuels][Emissions][CH4][kt][no source][no method][no target][no option][no type]
status: valid
status modified: 2017-02-13
accepted date: 2017-02-13
in scheme: emissions_variables_MMR

1.A.2.g.vii [Off-road vehicles and other machinery production][Liquid Fuels][Emissions][CO2][kt][no source][no method][no target][no option][no type]
type: Concept
definition: 1.A.2.g.vii [Off-road vehicles and other machinery production][Liquid Fuels][Emissions][CO2][kt][no source][no method][no target][no option][no type]
status: valid
status modified: 2017-02-13
accepted date: 2017-02-13
in scheme: emissions_variables_MMR

1.A.2.g.vii [Off-road vehicles and other machinery production][Liquid Fuels][Emissions][N2O][kt][no source][no method][no target][no option][no type]
type: Concept
definition: 1.A.2.g.vii [Off-road vehicles and other machinery production][Liquid Fuels][Emissions][N2O][kt][no source][no method][no target][no option][no type]
status: valid
status modified: 2017-02-13
accepted date: 2017-02-13
in scheme: emissions_variables_MMR

1.A.2.g.vii [Off-road vehicles and other machinery production][Other Fossil Fuels][Emissions][CH4][kt][no source][no method][no target][no option][no type]
type: Concept
definition: 1.A.2.g.vii [Off-road vehicles and other machinery production][Other Fossil Fuels][Emissions][CH4][kt][no source][no method][no target][no option][no type]
status: valid
status modified: 2017-02-13
accepted date: 2017-02-13
in scheme: emissions_variables_MMR

1.A.2.g.vii [Off-road vehicles and other machinery production][Other Fossil Fuels][Emissions][CO2][kt][no source][no method][no target][no option][no type]
type: Concept
definition: 1.A.2.g.vii [Off-road vehicles and other machinery production][Other Fossil Fuels][Emissions][CO2][kt][no source][no method][no target][no option][no type]
status: valid
status modified: 2017-02-13
accepted date: 2017-02-13
in scheme: emissions_variables_MMR

1.A.2.g.vii [Off-road vehicles and other machinery production][Other Fossil Fuels][Emissions][N2O][kt][no source][no method][no target][no option][no type]
type: Concept
definition: 1.A.2.g.vii [Off-road vehicles and other machinery production][Other Fossil Fuels][Emissions][N2O][kt][no source][no method][no target][no option][no type]
status: valid
status modified: 2017-02-13
accepted date: 2017-02-13
in scheme: emissions_variables_MMR

1.A.2.g.viii [Other Other Manufacturing Industries and Constructions][Biomass][Emissions][CH4][kt][no source][no method][no target][no option][no type]
type: Concept
definition: 1.A.2.g.viii [Other Other Manufacturing Industries and Constructions][Biomass][Emissions][CH4][kt][no source][no method][no target][no option][no type]
status: valid
status modified: 2017-02-13
accepted date: 2017-02-13
in scheme: emissions_variables_MMR

1.A.2.g.viii [Other Other Manufacturing Industries and Constructions][Biomass][Emissions][CO2][kt][no source][no method][no target][no option][no type]
type: Concept
definition: 1.A.2.g.viii [Other Other Manufacturing Industries and Constructions][Biomass][Emissions][CO2][kt][no source][no method][no target][no option][no type]
status: valid
status modified: 2017-02-13
accepted date: 2017-02-13
in scheme: emissions_variables_MMR

1.A.2.g.viii [Other Other Manufacturing Industries and Constructions][Biomass][Emissions][N2O][kt][no source][no method][no target][no option][no type]
type: Concept
definition: 1.A.2.g.viii [Other Other Manufacturing Industries and Constructions][Biomass][Emissions][N2O][kt][no source][no method][no target][no option][no type]
status: valid
status modified: 2017-02-13
accepted date: 2017-02-13
in scheme: emissions_variables_MMR

1.A.2.g.viii [Other Other Manufacturing Industries and Constructions][Fuels][Emissions][CH4][kt][no source][no method][no target][no option][no type]
type: Concept
definition: 1.A.2.g.viii [Other Other Manufacturing Industries and Constructions][Fuels][Emissions][CH4][kt][no source][no method][no target][no option][no type]
status: valid
status modified: 2017-02-13
accepted date: 2017-02-13
in scheme: emissions_variables_MMR

1.A.2.g.viii [Other Other Manufacturing Industries and Constructions][Fuels][Emissions][CO2][kt][no source][no method][no target][no option][no type]
type: Concept
definition: 1.A.2.g.viii [Other Other Manufacturing Industries and Constructions][Fuels][Emissions][CO2][kt][no source][no method][no target][no option][no type]
status: valid
status modified: 2017-02-13
accepted date: 2017-02-13
in scheme: emissions_variables_MMR

1.A.2.g.viii [Other Other Manufacturing Industries and Constructions][Fuels][Emissions][N2O][kt][no source][no method][no target][no option][no type]
type: Concept
definition: 1.A.2.g.viii [Other Other Manufacturing Industries and Constructions][Fuels][Emissions][N2O][kt][no source][no method][no target][no option][no type]
status: valid
status modified: 2017-02-13
accepted date: 2017-02-13
in scheme: emissions_variables_MMR

1.A.2.g.viii [Other Other Manufacturing Industries and Constructions][Gaseous Fuels][Emissions][CH4][kt][no source][no method][no target][no option][no type]
type: Concept
definition: 1.A.2.g.viii [Other Other Manufacturing Industries and Constructions][Gaseous Fuels][Emissions][CH4][kt][no source][no method][no target][no option][no type]
status: valid
status modified: 2017-02-13
accepted date: 2017-02-13
in scheme: emissions_variables_MMR

1.A.2.g.viii [Other Other Manufacturing Industries and Constructions][Gaseous Fuels][Emissions][CO2][kt][no source][no method][no target][no option][no type]
type: Concept
definition: 1.A.2.g.viii [Other Other Manufacturing Industries and Constructions][Gaseous Fuels][Emissions][CO2][kt][no source][no method][no target][no option][no type]
status: valid
status modified: 2017-02-13
accepted date: 2017-02-13
in scheme: emissions_variables_MMR

1.A.2.g.viii [Other Other Manufacturing Industries and Constructions][Gaseous Fuels][Emissions][N2O][kt][no source][no method][no target][no option][no type]
type: Concept
definition: 1.A.2.g.viii [Other Other Manufacturing Industries and Constructions][Gaseous Fuels][Emissions][N2O][kt][no source][no method][no target][no option][no type]
status: valid
status modified: 2017-02-13
accepted date: 2017-02-13
in scheme: emissions_variables_MMR

1.A.2.g.viii [Other Other Manufacturing Industries and Constructions][Liquid Fuels][Emissions][CH4][kt][no source][no method][no target][no option][no type]
type: Concept
definition: 1.A.2.g.viii [Other Other Manufacturing Industries and Constructions][Liquid Fuels][Emissions][CH4][kt][no source][no method][no target][no option][no type]
status: valid
status modified: 2017-02-13
accepted date: 2017-02-13
in scheme: emissions_variables_MMR

1.A.2.g.viii [Other Other Manufacturing Industries and Constructions][Liquid Fuels][Emissions][CO2][kt][no source][no method][no target][no option][no type]
type: Concept
definition: 1.A.2.g.viii [Other Other Manufacturing Industries and Constructions][Liquid Fuels][Emissions][CO2][kt][no source][no method][no target][no option][no type]
status: valid
status modified: 2017-02-13
accepted date: 2017-02-13
in scheme: emissions_variables_MMR

1.A.2.g.viii [Other Other Manufacturing Industries and Constructions][Liquid Fuels][Emissions][N2O][kt][no source][no method][no target][no option][no type]
type: Concept
definition: 1.A.2.g.viii [Other Other Manufacturing Industries and Constructions][Liquid Fuels][Emissions][N2O][kt][no source][no method][no target][no option][no type]
status: valid
status modified: 2017-02-13
accepted date: 2017-02-13
in scheme: emissions_variables_MMR

1.A.2.g.viii [Other Other Manufacturing Industries and Constructions][Other Fossil Fuels][Emissions][CH4][kt][no source][no method][no target][no option][no type]
type: Concept
definition: 1.A.2.g.viii [Other Other Manufacturing Industries and Constructions][Other Fossil Fuels][Emissions][CH4][kt][no source][no method][no target][no option][no type]
status: valid
status modified: 2017-02-13
accepted date: 2017-02-13
in scheme: emissions_variables_MMR

1.A.2.g.viii [Other Other Manufacturing Industries and Constructions][Other Fossil Fuels][Emissions][CO2][kt][no source][no method][no target][no option][no type]
type: Concept
definition: 1.A.2.g.viii [Other Other Manufacturing Industries and Constructions][Other Fossil Fuels][Emissions][CO2][kt][no source][no method][no target][no option][no type]
status: valid
status modified: 2017-02-13
accepted date: 2017-02-13
in scheme: emissions_variables_MMR

1.A.2.g.viii [Other Other Manufacturing Industries and Constructions][Other Fossil Fuels][Emissions][N2O][kt][no source][no method][no target][no option][no type]
type: Concept
definition: 1.A.2.g.viii [Other Other Manufacturing Industries and Constructions][Other Fossil Fuels][Emissions][N2O][kt][no source][no method][no target][no option][no type]
status: valid
status modified: 2017-02-13
accepted date: 2017-02-13
in scheme: emissions_variables_MMR

1.A.2.g.viii [Other Other Manufacturing Industries and Constructions][Peat][Emissions][CH4][kt][no source][no method][no target][no option][no type]
type: Concept
definition: 1.A.2.g.viii [Other Other Manufacturing Industries and Constructions][Peat][Emissions][CH4][kt][no source][no method][no target][no option][no type]
status: valid
status modified: 2017-02-13
accepted date: 2017-02-13
in scheme: emissions_variables_MMR

1.A.2.g.viii [Other Other Manufacturing Industries and Constructions][Peat][Emissions][CO2][kt][no source][no method][no target][no option][no type]
type: Concept
definition: 1.A.2.g.viii [Other Other Manufacturing Industries and Constructions][Peat][Emissions][CO2][kt][no source][no method][no target][no option][no type]
status: valid
status modified: 2017-02-13
accepted date: 2017-02-13
in scheme: emissions_variables_MMR

1.A.2.g.viii [Other Other Manufacturing Industries and Constructions][Peat][Emissions][N2O][kt][no source][no method][no target][no option][no type]
type: Concept
definition: 1.A.2.g.viii [Other Other Manufacturing Industries and Constructions][Peat][Emissions][N2O][kt][no source][no method][no target][no option][no type]
status: valid
status modified: 2017-02-13
accepted date: 2017-02-13
in scheme: emissions_variables_MMR

1.A.2.g.viii [Other Other Manufacturing Industries and Constructions][Solid Fuels][Emissions][CH4][kt][no source][no method][no target][no option][no type]
type: Concept
definition: 1.A.2.g.viii [Other Other Manufacturing Industries and Constructions][Solid Fuels][Emissions][CH4][kt][no source][no method][no target][no option][no type]
status: valid
status modified: 2017-02-13
accepted date: 2017-02-13
in scheme: emissions_variables_MMR

1.A.2.g.viii [Other Other Manufacturing Industries and Constructions][Solid Fuels][Emissions][CO2][kt][no source][no method][no target][no option][no type]
type: Concept
definition: 1.A.2.g.viii [Other Other Manufacturing Industries and Constructions][Solid Fuels][Emissions][CO2][kt][no source][no method][no target][no option][no type]
status: valid
status modified: 2017-02-13
accepted date: 2017-02-13
in scheme: emissions_variables_MMR

1.A.2.g.viii [Other Other Manufacturing Industries and Constructions][Solid Fuels][Emissions][N2O][kt][no source][no method][no target][no option][no type]
type: Concept
definition: 1.A.2.g.viii [Other Other Manufacturing Industries and Constructions][Solid Fuels][Emissions][N2O][kt][no source][no method][no target][no option][no type]
status: valid
status modified: 2017-02-13
accepted date: 2017-02-13
in scheme: emissions_variables_MMR

1.A.3 [Transport][Biomass][Emissions][CH4][kt][no source][no method][no target][no option][no type]
type: Concept
definition: 1.A.3 [Transport][Biomass][Emissions][CH4][kt][no source][no method][no target][no option][no type]
status: valid
status modified: 2017-02-13
accepted date: 2017-02-13
in scheme: emissions_variables_MMR

1.A.3 [Transport][Biomass][Emissions][CO2][kt][no source][no method][no target][no option][no type]
type: Concept
definition: 1.A.3 [Transport][Biomass][Emissions][CO2][kt][no source][no method][no target][no option][no type]
status: valid
status modified: 2017-02-13
accepted date: 2017-02-13
in scheme: emissions_variables_MMR

1.A.3 [Transport][Biomass][Emissions][N2O][kt][no source][no method][no target][no option][no type]
type: Concept
definition: 1.A.3 [Transport][Biomass][Emissions][N2O][kt][no source][no method][no target][no option][no type]
status: valid
status modified: 2017-02-13
accepted date: 2017-02-13
in scheme: emissions_variables_MMR

1.A.3 [Transport][Fuels][Emissions][Aggregate GHGs][kt CO2 equivalent][no source][no method][no target][no option][no type]
type: Concept
definition: 1.A.3 [Transport][Fuels][Emissions][Aggregate GHGs][kt CO2 equivalent][no source][no method][no target][no option][no type]
status: valid
status modified: 2017-02-13
accepted date: 2017-02-13
in scheme: emissions_variables_MMR

1.A.3 [Transport][Fuels][Emissions][CH4][kt][no source][no method][no target][no option][no type]
type: Concept
definition: 1.A.3 [Transport][Fuels][Emissions][CH4][kt][no source][no method][no target][no option][no type]
status: valid
status modified: 2017-02-13
accepted date: 2017-02-13
in scheme: emissions_variables_MMR

1.A.3 [Transport][Fuels][Emissions][CO][kt][no source][no method][no target][no option][no type]
type: Concept
definition: 1.A.3 [Transport][Fuels][Emissions][CO][kt][no source][no method][no target][no option][no type]
status: valid
status modified: 2017-02-13
accepted date: 2017-02-13
in scheme: emissions_variables_MMR

1.A.3 [Transport][Fuels][Emissions][CO2][kt][no source][no method][no target][no option][no type]
type: Concept
definition: 1.A.3 [Transport][Fuels][Emissions][CO2][kt][no source][no method][no target][no option][no type]
status: valid
status modified: 2017-02-13
accepted date: 2017-02-13
in scheme: emissions_variables_MMR

1.A.3 [Transport][Fuels][Emissions][N2O][kt][no source][no method][no target][no option][no type]
type: Concept
definition: 1.A.3 [Transport][Fuels][Emissions][N2O][kt][no source][no method][no target][no option][no type]
status: valid
status modified: 2017-02-13
accepted date: 2017-02-13
in scheme: emissions_variables_MMR

1.A.3 [Transport][Fuels][Emissions][NMVOC][kt][no source][no method][no target][no option][no type]
type: Concept
definition: 1.A.3 [Transport][Fuels][Emissions][NMVOC][kt][no source][no method][no target][no option][no type]
status: valid
status modified: 2017-02-13
accepted date: 2017-02-13
in scheme: emissions_variables_MMR

1.A.3 [Transport][Fuels][Emissions][NOx][kt][no source][no method][no target][no option][no type]
type: Concept
definition: 1.A.3 [Transport][Fuels][Emissions][NOx][kt][no source][no method][no target][no option][no type]
status: valid
status modified: 2017-02-13
accepted date: 2017-02-13
in scheme: emissions_variables_MMR

1.A.3 [Transport][Fuels][Emissions][SO2][kt][no source][no method][no target][no option][no type]
type: Concept
definition: 1.A.3 [Transport][Fuels][Emissions][SO2][kt][no source][no method][no target][no option][no type]
status: valid
status modified: 2017-02-13
accepted date: 2017-02-13
in scheme: emissions_variables_MMR

1.A.3 [Transport][Gaseous Fuels][Emissions][CH4][kt][no source][no method][no target][no option][no type]
type: Concept
definition: 1.A.3 [Transport][Gaseous Fuels][Emissions][CH4][kt][no source][no method][no target][no option][no type]
status: valid
status modified: 2017-02-13
accepted date: 2017-02-13
in scheme: emissions_variables_MMR

1.A.3 [Transport][Gaseous Fuels][Emissions][CO2][kt][no source][no method][no target][no option][no type]
type: Concept
definition: 1.A.3 [Transport][Gaseous Fuels][Emissions][CO2][kt][no source][no method][no target][no option][no type]
status: valid
status modified: 2017-02-13
accepted date: 2017-02-13
in scheme: emissions_variables_MMR

1.A.3 [Transport][Gaseous Fuels][Emissions][N2O][kt][no source][no method][no target][no option][no type]
type: Concept
definition: 1.A.3 [Transport][Gaseous Fuels][Emissions][N2O][kt][no source][no method][no target][no option][no type]
status: valid
status modified: 2017-02-13
accepted date: 2017-02-13
in scheme: emissions_variables_MMR

1.A.3 [Transport][Liquid Fuels][Emissions][CH4][kt][no source][no method][no target][no option][no type]
type: Concept
definition: 1.A.3 [Transport][Liquid Fuels][Emissions][CH4][kt][no source][no method][no target][no option][no type]
status: valid
status modified: 2017-02-13
accepted date: 2017-02-13
in scheme: emissions_variables_MMR

1.A.3 [Transport][Liquid Fuels][Emissions][CO2][kt][no source][no method][no target][no option][no type]
type: Concept
definition: 1.A.3 [Transport][Liquid Fuels][Emissions][CO2][kt][no source][no method][no target][no option][no type]
status: valid
status modified: 2017-02-13
accepted date: 2017-02-13
in scheme: emissions_variables_MMR

1.A.3 [Transport][Liquid Fuels][Emissions][N2O][kt][no source][no method][no target][no option][no type]
type: Concept
definition: 1.A.3 [Transport][Liquid Fuels][Emissions][N2O][kt][no source][no method][no target][no option][no type]
status: valid
status modified: 2017-02-13
accepted date: 2017-02-13
in scheme: emissions_variables_MMR

1.A.3 [Transport][Other Fossil Fuels][Emissions][CH4][kt][no source][no method][no target][no option][no type]
type: Concept
definition: 1.A.3 [Transport][Other Fossil Fuels][Emissions][CH4][kt][no source][no method][no target][no option][no type]
status: valid
status modified: 2017-02-13
accepted date: 2017-02-13
in scheme: emissions_variables_MMR

1.A.3 [Transport][Other Fossil Fuels][Emissions][CO2][kt][no source][no method][no target][no option][no type]
type: Concept
definition: 1.A.3 [Transport][Other Fossil Fuels][Emissions][CO2][kt][no source][no method][no target][no option][no type]
status: valid
status modified: 2017-02-13
accepted date: 2017-02-13
in scheme: emissions_variables_MMR

1.A.3 [Transport][Other Fossil Fuels][Emissions][N2O][kt][no source][no method][no target][no option][no type]
type: Concept
definition: 1.A.3 [Transport][Other Fossil Fuels][Emissions][N2O][kt][no source][no method][no target][no option][no type]
status: valid
status modified: 2017-02-13
accepted date: 2017-02-13
in scheme: emissions_variables_MMR

1.A.3 [Transport][Solid Fuels][Emissions][CH4][kt][no source][no method][no target][no option][no type]
type: Concept
definition: 1.A.3 [Transport][Solid Fuels][Emissions][CH4][kt][no source][no method][no target][no option][no type]
status: valid
status modified: 2017-02-13
accepted date: 2017-02-13
in scheme: emissions_variables_MMR

1.A.3 [Transport][Solid Fuels][Emissions][CO2][kt][no source][no method][no target][no option][no type]
type: Concept
definition: 1.A.3 [Transport][Solid Fuels][Emissions][CO2][kt][no source][no method][no target][no option][no type]
status: valid
status modified: 2017-02-13
accepted date: 2017-02-13
in scheme: emissions_variables_MMR

1.A.3 [Transport][Solid Fuels][Emissions][N2O][kt][no source][no method][no target][no option][no type]
type: Concept
definition: 1.A.3 [Transport][Solid Fuels][Emissions][N2O][kt][no source][no method][no target][no option][no type]
status: valid
status modified: 2017-02-13
accepted date: 2017-02-13
in scheme: emissions_variables_MMR

1.A.3.a [Domestic Aviation][Fossil fuels][Emissions][CO2][kt][no source][no method][no target][no option][no type]
type: Concept
definition: 1.A.3.a [Domestic Aviation][Fossil fuels][Emissions][CO2][kt][no source][no method][no target][no option][no type]
status: valid
status modified: 2017-02-13
accepted date: 2017-02-13
in scheme: emissions_variables_MMR

1.A.3.a [Domestic Aviation][Fuels][Emissions][CH4][kt][no source][no method][no target][no option][no type]
type: Concept
definition: 1.A.3.a [Domestic Aviation][Fuels][Emissions][CH4][kt][no source][no method][no target][no option][no type]
status: valid
status modified: 2017-02-13
accepted date: 2017-02-13
in scheme: emissions_variables_MMR

1.A.3.a [Domestic Aviation][Fuels][Emissions][CO][kt][no source][no method][no target][no option][no type]
type: Concept
definition: 1.A.3.a [Domestic Aviation][Fuels][Emissions][CO][kt][no source][no method][no target][no option][no type]
status: valid
status modified: 2017-02-13
accepted date: 2017-02-13
in scheme: emissions_variables_MMR

1.A.3.a [Domestic Aviation][Fuels][Emissions][CO2][kt][no source][no method][no target][no option][no type]
type: Concept
definition: 1.A.3.a [Domestic Aviation][Fuels][Emissions][CO2][kt][no source][no method][no target][no option][no type]
status: valid
status modified: 2017-02-13
accepted date: 2017-02-13
in scheme: emissions_variables_MMR

1.A.3.a [Domestic Aviation][Fuels][Emissions][N2O][kt][no source][no method][no target][no option][no type]
type: Concept
definition: 1.A.3.a [Domestic Aviation][Fuels][Emissions][N2O][kt][no source][no method][no target][no option][no type]
status: valid
status modified: 2017-02-13
accepted date: 2017-02-13
in scheme: emissions_variables_MMR

1.A.3.a [Domestic Aviation][Fuels][Emissions][NMVOC][kt][no source][no method][no target][no option][no type]
type: Concept
definition: 1.A.3.a [Domestic Aviation][Fuels][Emissions][NMVOC][kt][no source][no method][no target][no option][no type]
status: valid
status modified: 2017-02-13
accepted date: 2017-02-13
in scheme: emissions_variables_MMR

1.A.3.a [Domestic Aviation][Fuels][Emissions][NOx][kt][no source][no method][no target][no option][no type]
type: Concept
definition: 1.A.3.a [Domestic Aviation][Fuels][Emissions][NOx][kt][no source][no method][no target][no option][no type]
status: valid
status modified: 2017-02-13
accepted date: 2017-02-13
in scheme: emissions_variables_MMR

1.A.3.a [Domestic Aviation][Fuels][Emissions][SO2][kt][no source][no method][no target][no option][no type]
type: Concept
definition: 1.A.3.a [Domestic Aviation][Fuels][Emissions][SO2][kt][no source][no method][no target][no option][no type]
status: valid
status modified: 2017-02-13
accepted date: 2017-02-13
in scheme: emissions_variables_MMR

1.A.3.a [Domestic Aviation][Liquid Fuels][Emissions][CH4][kt][no source][no method][no target][no option][no type]
type: Concept
definition: 1.A.3.a [Domestic Aviation][Liquid Fuels][Emissions][CH4][kt][no source][no method][no target][no option][no type]
status: valid
status modified: 2017-02-13
accepted date: 2017-02-13
in scheme: emissions_variables_MMR

1.A.3.a [Domestic Aviation][Liquid Fuels][Emissions][N2O][kt][no source][no method][no target][no option][no type]
type: Concept
definition: 1.A.3.a [Domestic Aviation][Liquid Fuels][Emissions][N2O][kt][no source][no method][no target][no option][no type]
status: valid
status modified: 2017-02-13
accepted date: 2017-02-13
in scheme: emissions_variables_MMR

1.A.3.a Aviation Gasoline [Domestic Aviation][Aviation Gasoline][Emissions][CH4][kt][no source][no method][no target][no option][no type]
type: Concept
definition: 1.A.3.a Aviation Gasoline [Domestic Aviation][Aviation Gasoline][Emissions][CH4][kt][no source][no method][no target][no option][no type]
status: valid
status modified: 2017-02-13
accepted date: 2017-02-13
in scheme: emissions_variables_MMR

1.A.3.a Aviation Gasoline [Domestic Aviation][Aviation Gasoline][Emissions][CO2][kt][no source][no method][no target][no option][no type]
type: Concept
definition: 1.A.3.a Aviation Gasoline [Domestic Aviation][Aviation Gasoline][Emissions][CO2][kt][no source][no method][no target][no option][no type]
status: valid
status modified: 2017-02-13
accepted date: 2017-02-13
in scheme: emissions_variables_MMR

1.A.3.a Aviation Gasoline [Domestic Aviation][Aviation Gasoline][Emissions][N2O][kt][no source][no method][no target][no option][no type]
type: Concept
definition: 1.A.3.a Aviation Gasoline [Domestic Aviation][Aviation Gasoline][Emissions][N2O][kt][no source][no method][no target][no option][no type]
status: valid
status modified: 2017-02-13
accepted date: 2017-02-13
in scheme: emissions_variables_MMR

1.A.3.a Biomass [Domestic Aviation][Biomass][Emissions][CH4][kt][no source][no method][no target][no option][no type]
type: Concept
definition: 1.A.3.a Biomass [Domestic Aviation][Biomass][Emissions][CH4][kt][no source][no method][no target][no option][no type]
status: valid
status modified: 2017-02-13
accepted date: 2017-02-13
in scheme: emissions_variables_MMR

1.A.3.a Biomass [Domestic Aviation][Biomass][Emissions][CO2][kt][no source][no method][no target][no option][no type]
type: Concept
definition: 1.A.3.a Biomass [Domestic Aviation][Biomass][Emissions][CO2][kt][no source][no method][no target][no option][no type]
status: valid
status modified: 2017-02-13
accepted date: 2017-02-13
in scheme: emissions_variables_MMR

1.A.3.a Biomass [Domestic Aviation][Biomass][Emissions][N2O][kt][no source][no method][no target][no option][no type]
type: Concept
definition: 1.A.3.a Biomass [Domestic Aviation][Biomass][Emissions][N2O][kt][no source][no method][no target][no option][no type]
status: valid
status modified: 2017-02-13
accepted date: 2017-02-13
in scheme: emissions_variables_MMR

1.A.3.a Jet Kerosene [Domestic Aviation][Jet Kerosene][Emissions][CH4][kt][no source][no method][no target][no option][no type]
type: Concept
definition: 1.A.3.a Jet Kerosene [Domestic Aviation][Jet Kerosene][Emissions][CH4][kt][no source][no method][no target][no option][no type]
status: valid
status modified: 2017-02-13
accepted date: 2017-02-13
in scheme: emissions_variables_MMR

1.A.3.a Jet Kerosene [Domestic Aviation][Jet Kerosene][Emissions][CO2][kt][no source][no method][no target][no option][no type]
type: Concept
definition: 1.A.3.a Jet Kerosene [Domestic Aviation][Jet Kerosene][Emissions][CO2][kt][no source][no method][no target][no option][no type]
status: valid
status modified: 2017-02-13
accepted date: 2017-02-13
in scheme: emissions_variables_MMR

1.A.3.a Jet Kerosene [Domestic Aviation][Jet Kerosene][Emissions][N2O][kt][no source][no method][no target][no option][no type]
type: Concept
definition: 1.A.3.a Jet Kerosene [Domestic Aviation][Jet Kerosene][Emissions][N2O][kt][no source][no method][no target][no option][no type]
status: valid
status modified: 2017-02-13
accepted date: 2017-02-13
in scheme: emissions_variables_MMR

1.A.3.b [Road Transportation][Biomass][Emissions][CH4][kt][no source][no method][no target][no option][no type]
type: Concept
definition: 1.A.3.b [Road Transportation][Biomass][Emissions][CH4][kt][no source][no method][no target][no option][no type]
status: valid
status modified: 2017-02-13
accepted date: 2017-02-13
in scheme: emissions_variables_MMR

1.A.3.b [Road Transportation][Biomass][Emissions][CO2][kt][no source][no method][no target][no option][no type]
type: Concept
definition: 1.A.3.b [Road Transportation][Biomass][Emissions][CO2][kt][no source][no method][no target][no option][no type]
status: valid
status modified: 2017-02-13
accepted date: 2017-02-13
in scheme: emissions_variables_MMR

1.A.3.b [Road Transportation][Biomass][Emissions][N2O][kt][no source][no method][no target][no option][no type]
type: Concept
definition: 1.A.3.b [Road Transportation][Biomass][Emissions][N2O][kt][no source][no method][no target][no option][no type]
status: valid
status modified: 2017-02-13
accepted date: 2017-02-13
in scheme: emissions_variables_MMR

1.A.3.b [Road Transportation][Diesel Oil][Emissions][CH4][kt][no source][no method][no target][no option][no type]
type: Concept
definition: 1.A.3.b [Road Transportation][Diesel Oil][Emissions][CH4][kt][no source][no method][no target][no option][no type]
status: valid
status modified: 2017-02-13
accepted date: 2017-02-13
in scheme: emissions_variables_MMR

1.A.3.b [Road Transportation][Diesel Oil][Emissions][CO2][kt][no source][no method][no target][no option][no type]
type: Concept
definition: 1.A.3.b [Road Transportation][Diesel Oil][Emissions][CO2][kt][no source][no method][no target][no option][no type]
status: valid
status modified: 2017-02-13
accepted date: 2017-02-13
in scheme: emissions_variables_MMR

1.A.3.b [Road Transportation][Diesel Oil][Emissions][N2O][kt][no source][no method][no target][no option][no type]
type: Concept
definition: 1.A.3.b [Road Transportation][Diesel Oil][Emissions][N2O][kt][no source][no method][no target][no option][no type]
status: valid
status modified: 2017-02-13
accepted date: 2017-02-13
in scheme: emissions_variables_MMR

1.A.3.b [Road Transportation][Fossil fuels][Emissions][CO2][kt][no source][no method][no target][no option][no type]
type: Concept
definition: 1.A.3.b [Road Transportation][Fossil fuels][Emissions][CO2][kt][no source][no method][no target][no option][no type]
status: valid
status modified: 2017-02-13
accepted date: 2017-02-13
in scheme: emissions_variables_MMR

1.A.3.b [Road Transportation][Fuels][Emissions][CH4][kt][no source][no method][no target][no option][no type]
type: Concept
definition: 1.A.3.b [Road Transportation][Fuels][Emissions][CH4][kt][no source][no method][no target][no option][no type]
status: valid
status modified: 2017-02-13
accepted date: 2017-02-13
in scheme: emissions_variables_MMR

1.A.3.b [Road Transportation][Fuels][Emissions][CO][kt][no source][no method][no target][no option][no type]
type: Concept
definition: 1.A.3.b [Road Transportation][Fuels][Emissions][CO][kt][no source][no method][no target][no option][no type]
status: valid
status modified: 2017-02-13
accepted date: 2017-02-13
in scheme: emissions_variables_MMR

1.A.3.b [Road Transportation][Fuels][Emissions][N2O][kt][no source][no method][no target][no option][no type]
type: Concept
definition: 1.A.3.b [Road Transportation][Fuels][Emissions][N2O][kt][no source][no method][no target][no option][no type]
status: valid
status modified: 2017-02-13
accepted date: 2017-02-13
in scheme: emissions_variables_MMR

1.A.3.b [Road Transportation][Fuels][Emissions][NMVOC][kt][no source][no method][no target][no option][no type]
type: Concept
definition: 1.A.3.b [Road Transportation][Fuels][Emissions][NMVOC][kt][no source][no method][no target][no option][no type]
status: valid
status modified: 2017-02-13
accepted date: 2017-02-13
in scheme: emissions_variables_MMR

1.A.3.b [Road Transportation][Fuels][Emissions][NOx][kt][no source][no method][no target][no option][no type]
type: Concept
definition: 1.A.3.b [Road Transportation][Fuels][Emissions][NOx][kt][no source][no method][no target][no option][no type]
status: valid
status modified: 2017-02-13
accepted date: 2017-02-13
in scheme: emissions_variables_MMR

1.A.3.b [Road Transportation][Fuels][Emissions][SO2][kt][no source][no method][no target][no option][no type]
type: Concept
definition: 1.A.3.b [Road Transportation][Fuels][Emissions][SO2][kt][no source][no method][no target][no option][no type]
status: valid
status modified: 2017-02-13
accepted date: 2017-02-13
in scheme: emissions_variables_MMR

1.A.3.b [Road Transportation][Gaseous Fuels][Emissions][CH4][kt][no source][no method][no target][no option][no type]
type: Concept
definition: 1.A.3.b [Road Transportation][Gaseous Fuels][Emissions][CH4][kt][no source][no method][no target][no option][no type]
status: valid
status modified: 2017-02-13
accepted date: 2017-02-13
in scheme: emissions_variables_MMR

1.A.3.b [Road Transportation][Gaseous Fuels][Emissions][CO2][kt][no source][no method][no target][no option][no type]
type: Concept
definition: 1.A.3.b [Road Transportation][Gaseous Fuels][Emissions][CO2][kt][no source][no method][no target][no option][no type]
status: valid
status modified: 2017-02-13
accepted date: 2017-02-13
in scheme: emissions_variables_MMR

1.A.3.b [Road Transportation][Gaseous Fuels][Emissions][N2O][kt][no source][no method][no target][no option][no type]
type: Concept
definition: 1.A.3.b [Road Transportation][Gaseous Fuels][Emissions][N2O][kt][no source][no method][no target][no option][no type]
status: valid
status modified: 2017-02-13
accepted date: 2017-02-13
in scheme: emissions_variables_MMR

1.A.3.b [Road Transportation][Gasoline][Emissions][CH4][kt][no source][no method][no target][no option][no type]
type: Concept
definition: 1.A.3.b [Road Transportation][Gasoline][Emissions][CH4][kt][no source][no method][no target][no option][no type]
status: valid
status modified: 2017-02-13
accepted date: 2017-02-13
in scheme: emissions_variables_MMR

1.A.3.b [Road Transportation][Gasoline][Emissions][CO2][kt][no source][no method][no target][no option][no type]
type: Concept
definition: 1.A.3.b [Road Transportation][Gasoline][Emissions][CO2][kt][no source][no method][no target][no option][no type]
status: valid
status modified: 2017-02-13
accepted date: 2017-02-13
in scheme: emissions_variables_MMR

1.A.3.b [Road Transportation][Gasoline][Emissions][N2O][kt][no source][no method][no target][no option][no type]
type: Concept
definition: 1.A.3.b [Road Transportation][Gasoline][Emissions][N2O][kt][no source][no method][no target][no option][no type]
status: valid
status modified: 2017-02-13
accepted date: 2017-02-13
in scheme: emissions_variables_MMR

1.A.3.b [Road Transportation][Liquefied Petroleum Gases (LPG)][Emissions][CH4][kt][no source][no method][no target][no option][no type]
type: Concept
definition: 1.A.3.b [Road Transportation][Liquefied Petroleum Gases (LPG)][Emissions][CH4][kt][no source][no method][no target][no option][no type]
status: valid
status modified: 2017-02-13
accepted date: 2017-02-13
in scheme: emissions_variables_MMR

1.A.3.b [Road Transportation][Liquefied Petroleum Gases (LPG)][Emissions][CO2][kt][no source][no method][no target][no option][no type]
type: Concept
definition: 1.A.3.b [Road Transportation][Liquefied Petroleum Gases (LPG)][Emissions][CO2][kt][no source][no method][no target][no option][no type]
status: valid
status modified: 2017-02-13
accepted date: 2017-02-13
in scheme: emissions_variables_MMR

1.A.3.b [Road Transportation][Liquefied Petroleum Gases (LPG)][Emissions][N2O][kt][no source][no method][no target][no option][no type]
type: Concept
definition: 1.A.3.b [Road Transportation][Liquefied Petroleum Gases (LPG)][Emissions][N2O][kt][no source][no method][no target][no option][no type]
status: valid
status modified: 2017-02-13
accepted date: 2017-02-13
in scheme: emissions_variables_MMR

1.A.3.b [Road Transportation][Liquid Fuels][Emissions][CH4][kt][no source][no method][no target][no option][no type]
type: Concept
definition: 1.A.3.b [Road Transportation][Liquid Fuels][Emissions][CH4][kt][no source][no method][no target][no option][no type]
status: valid
status modified: 2017-02-13
accepted date: 2017-02-13
in scheme: emissions_variables_MMR

1.A.3.b [Road Transportation][Liquid Fuels][Emissions][CO2][kt][no source][no method][no target][no option][no type]
type: Concept
definition: 1.A.3.b [Road Transportation][Liquid Fuels][Emissions][CO2][kt][no source][no method][no target][no option][no type]
status: valid
status modified: 2017-02-13
accepted date: 2017-02-13
in scheme: emissions_variables_MMR

1.A.3.b [Road Transportation][Liquid Fuels][Emissions][N2O][kt][no source][no method][no target][no option][no type]
type: Concept
definition: 1.A.3.b [Road Transportation][Liquid Fuels][Emissions][N2O][kt][no source][no method][no target][no option][no type]
status: valid
status modified: 2017-02-13
accepted date: 2017-02-13
in scheme: emissions_variables_MMR

1.A.3.b [Road Transportation][Other Fossil Fuels][Emissions][CH4][kt][no source][no method][no target][no option][no type]
type: Concept
definition: 1.A.3.b [Road Transportation][Other Fossil Fuels][Emissions][CH4][kt][no source][no method][no target][no option][no type]
status: valid
status modified: 2017-02-13
accepted date: 2017-02-13
in scheme: emissions_variables_MMR

1.A.3.b [Road Transportation][Other Fossil Fuels][Emissions][CO2][kt][no source][no method][no target][no option][no type]
type: Concept
definition: 1.A.3.b [Road Transportation][Other Fossil Fuels][Emissions][CO2][kt][no source][no method][no target][no option][no type]
status: valid
status modified: 2017-02-13
accepted date: 2017-02-13
in scheme: emissions_variables_MMR

1.A.3.b [Road Transportation][Other Fossil Fuels][Emissions][N2O][kt][no source][no method][no target][no option][no type]
type: Concept
definition: 1.A.3.b [Road Transportation][Other Fossil Fuels][Emissions][N2O][kt][no source][no method][no target][no option][no type]
status: valid
status modified: 2017-02-13
accepted date: 2017-02-13
in scheme: emissions_variables_MMR

1.A.3.b [Road Transportation][Other Liquid Fuels][Emissions][CH4][kt][no source][no method][no target][no option][no type]
type: Concept
definition: 1.A.3.b [Road Transportation][Other Liquid Fuels][Emissions][CH4][kt][no source][no method][no target][no option][no type]
status: valid
status modified: 2017-02-13
accepted date: 2017-02-13
in scheme: emissions_variables_MMR

1.A.3.b [Road Transportation][Other Liquid Fuels][Emissions][CO2][kt][no source][no method][no target][no option][no type]
type: Concept
definition: 1.A.3.b [Road Transportation][Other Liquid Fuels][Emissions][CO2][kt][no source][no method][no target][no option][no type]
status: valid
status modified: 2017-02-13
accepted date: 2017-02-13
in scheme: emissions_variables_MMR

1.A.3.b [Road Transportation][Other Liquid Fuels][Emissions][N2O][kt][no source][no method][no target][no option][no type]
type: Concept
definition: 1.A.3.b [Road Transportation][Other Liquid Fuels][Emissions][N2O][kt][no source][no method][no target][no option][no type]
status: valid
status modified: 2017-02-13
accepted date: 2017-02-13
in scheme: emissions_variables_MMR

1.A.3.b.i [Cars][Fuels][Emissions][CH4][kt][no source][no method][no target][no option][no type]
type: Concept
definition: 1.A.3.b.i [Cars][Fuels][Emissions][CH4][kt][no source][no method][no target][no option][no type]
status: valid
status modified: 2017-02-13
accepted date: 2017-02-13
in scheme: emissions_variables_MMR

1.A.3.b.i [Cars][Fuels][Emissions][CO2][kt][no source][no method][no target][no option][no type]
type: Concept
definition: 1.A.3.b.i [Cars][Fuels][Emissions][CO2][kt][no source][no method][no target][no option][no type]
status: valid
status modified: 2017-02-13
accepted date: 2017-02-13
in scheme: emissions_variables_MMR

1.A.3.b.i [Cars][Fuels][Emissions][N2O][kt][no source][no method][no target][no option][no type]
type: Concept
definition: 1.A.3.b.i [Cars][Fuels][Emissions][N2O][kt][no source][no method][no target][no option][no type]
status: valid
status modified: 2017-02-13
accepted date: 2017-02-13
in scheme: emissions_variables_MMR

1.A.3.b.i [Cars][Liquid Fuels][Emissions][CH4][kt][no source][no method][no target][no option][no type]
type: Concept
definition: 1.A.3.b.i [Cars][Liquid Fuels][Emissions][CH4][kt][no source][no method][no target][no option][no type]
status: valid
status modified: 2017-02-13
accepted date: 2017-02-13
in scheme: emissions_variables_MMR

1.A.3.b.i [Cars][Liquid Fuels][Emissions][CO2][kt][no source][no method][no target][no option][no type]
type: Concept
definition: 1.A.3.b.i [Cars][Liquid Fuels][Emissions][CO2][kt][no source][no method][no target][no option][no type]
status: valid
status modified: 2017-02-13
accepted date: 2017-02-13
in scheme: emissions_variables_MMR

1.A.3.b.i [Cars][Liquid Fuels][Emissions][N2O][kt][no source][no method][no target][no option][no type]
type: Concept
definition: 1.A.3.b.i [Cars][Liquid Fuels][Emissions][N2O][kt][no source][no method][no target][no option][no type]
status: valid
status modified: 2017-02-13
accepted date: 2017-02-13
in scheme: emissions_variables_MMR

1.A.3.b.i Biomass [Cars][Biomass][Emissions][CH4][kt][no source][no method][no target][no option][no type]
type: Concept
definition: 1.A.3.b.i Biomass [Cars][Biomass][Emissions][CH4][kt][no source][no method][no target][no option][no type]
status: valid
status modified: 2017-02-13
accepted date: 2017-02-13
in scheme: emissions_variables_MMR

1.A.3.b.i Biomass [Cars][Biomass][Emissions][CO2][kt][no source][no method][no target][no option][no type]
type: Concept
definition: 1.A.3.b.i Biomass [Cars][Biomass][Emissions][CO2][kt][no source][no method][no target][no option][no type]
status: valid
status modified: 2017-02-13
accepted date: 2017-02-13
in scheme: emissions_variables_MMR

1.A.3.b.i Biomass [Cars][Biomass][Emissions][N2O][kt][no source][no method][no target][no option][no type]
type: Concept
definition: 1.A.3.b.i Biomass [Cars][Biomass][Emissions][N2O][kt][no source][no method][no target][no option][no type]
status: valid
status modified: 2017-02-13
accepted date: 2017-02-13
in scheme: emissions_variables_MMR

1.A.3.b.i Diesel Oil [Cars][Diesel Oil][Emissions][CH4][kt][no source][no method][no target][no option][no type]
type: Concept
definition: 1.A.3.b.i Diesel Oil [Cars][Diesel Oil][Emissions][CH4][kt][no source][no method][no target][no option][no type]
status: valid
status modified: 2017-02-13
accepted date: 2017-02-13
in scheme: emissions_variables_MMR

1.A.3.b.i Diesel Oil [Cars][Diesel Oil][Emissions][CO2][kt][no source][no method][no target][no option][no type]
type: Concept
definition: 1.A.3.b.i Diesel Oil [Cars][Diesel Oil][Emissions][CO2][kt][no source][no method][no target][no option][no type]
status: valid
status modified: 2017-02-13
accepted date: 2017-02-13
in scheme: emissions_variables_MMR

1.A.3.b.i Diesel Oil [Cars][Diesel Oil][Emissions][N2O][kt][no source][no method][no target][no option][no type]
type: Concept
definition: 1.A.3.b.i Diesel Oil [Cars][Diesel Oil][Emissions][N2O][kt][no source][no method][no target][no option][no type]
status: valid
status modified: 2017-02-13
accepted date: 2017-02-13
in scheme: emissions_variables_MMR

1.A.3.b.i Gaseous Fuels [Cars][Gaseous Fuels][Emissions][CH4][kt][no source][no method][no target][no option][no type]
type: Concept
definition: 1.A.3.b.i Gaseous Fuels [Cars][Gaseous Fuels][Emissions][CH4][kt][no source][no method][no target][no option][no type]
status: valid
status modified: 2017-02-13
accepted date: 2017-02-13
in scheme: emissions_variables_MMR

1.A.3.b.i Gaseous Fuels [Cars][Gaseous Fuels][Emissions][CO2][kt][no source][no method][no target][no option][no type]
type: Concept
definition: 1.A.3.b.i Gaseous Fuels [Cars][Gaseous Fuels][Emissions][CO2][kt][no source][no method][no target][no option][no type]
status: valid
status modified: 2017-02-13
accepted date: 2017-02-13
in scheme: emissions_variables_MMR

1.A.3.b.i Gaseous Fuels [Cars][Gaseous Fuels][Emissions][N2O][kt][no source][no method][no target][no option][no type]
type: Concept
definition: 1.A.3.b.i Gaseous Fuels [Cars][Gaseous Fuels][Emissions][N2O][kt][no source][no method][no target][no option][no type]
status: valid
status modified: 2017-02-13
accepted date: 2017-02-13
in scheme: emissions_variables_MMR

1.A.3.b.i Gasoline [Cars][Gasoline][Emissions][CH4][kt][no source][no method][no target][no option][no type]
type: Concept
definition: 1.A.3.b.i Gasoline [Cars][Gasoline][Emissions][CH4][kt][no source][no method][no target][no option][no type]
status: valid
status modified: 2017-02-13
accepted date: 2017-02-13
in scheme: emissions_variables_MMR

1.A.3.b.i Gasoline [Cars][Gasoline][Emissions][CO2][kt][no source][no method][no target][no option][no type]
type: Concept
definition: 1.A.3.b.i Gasoline [Cars][Gasoline][Emissions][CO2][kt][no source][no method][no target][no option][no type]
status: valid
status modified: 2017-02-13
accepted date: 2017-02-13
in scheme: emissions_variables_MMR

1.A.3.b.i Gasoline [Cars][Gasoline][Emissions][N2O][kt][no source][no method][no target][no option][no type]
type: Concept
definition: 1.A.3.b.i Gasoline [Cars][Gasoline][Emissions][N2O][kt][no source][no method][no target][no option][no type]
status: valid
status modified: 2017-02-13
accepted date: 2017-02-13
in scheme: emissions_variables_MMR

1.A.3.b.i LPG [Cars][Liquefied Petroleum Gases (LPG)][Emissions][CH4][kt][no source][no method][no target][no option][no type]
type: Concept
definition: 1.A.3.b.i LPG [Cars][Liquefied Petroleum Gases (LPG)][Emissions][CH4][kt][no source][no method][no target][no option][no type]
status: valid
status modified: 2017-02-13
accepted date: 2017-02-13
in scheme: emissions_variables_MMR

1.A.3.b.i LPG [Cars][Liquefied Petroleum Gases (LPG)][Emissions][CO2][kt][no source][no method][no target][no option][no type]
type: Concept
definition: 1.A.3.b.i LPG [Cars][Liquefied Petroleum Gases (LPG)][Emissions][CO2][kt][no source][no method][no target][no option][no type]
status: valid
status modified: 2017-02-13
accepted date: 2017-02-13
in scheme: emissions_variables_MMR

1.A.3.b.i LPG [Cars][Liquefied Petroleum Gases (LPG)][Emissions][N2O][kt][no source][no method][no target][no option][no type]
type: Concept
definition: 1.A.3.b.i LPG [Cars][Liquefied Petroleum Gases (LPG)][Emissions][N2O][kt][no source][no method][no target][no option][no type]
status: valid
status modified: 2017-02-13
accepted date: 2017-02-13
in scheme: emissions_variables_MMR

1.A.3.b.i Other Fossil Fuels [Cars][Other Fossil Fuels][Emissions][CH4][kt][no source][no method][no target][no option][no type]
type: Concept
definition: 1.A.3.b.i Other Fossil Fuels [Cars][Other Fossil Fuels][Emissions][CH4][kt][no source][no method][no target][no option][no type]
status: valid
status modified: 2017-02-13
accepted date: 2017-02-13
in scheme: emissions_variables_MMR

1.A.3.b.i Other Fossil Fuels [Cars][Other Fossil Fuels][Emissions][CO2][kt][no source][no method][no target][no option][no type]
type: Concept
definition: 1.A.3.b.i Other Fossil Fuels [Cars][Other Fossil Fuels][Emissions][CO2][kt][no source][no method][no target][no option][no type]
status: valid
status modified: 2017-02-13
accepted date: 2017-02-13
in scheme: emissions_variables_MMR

1.A.3.b.i Other Fossil Fuels [Cars][Other Fossil Fuels][Emissions][N2O][kt][no source][no method][no target][no option][no type]
type: Concept
definition: 1.A.3.b.i Other Fossil Fuels [Cars][Other Fossil Fuels][Emissions][N2O][kt][no source][no method][no target][no option][no type]
status: valid
status modified: 2017-02-13
accepted date: 2017-02-13
in scheme: emissions_variables_MMR

1.A.3.b.i Other Liquid Fuels [Cars][Other Liquid Fuels][Emissions][CH4][kt][no source][no method][no target][no option][no type]
type: Concept
definition: 1.A.3.b.i Other Liquid Fuels [Cars][Other Liquid Fuels][Emissions][CH4][kt][no source][no method][no target][no option][no type]
status: valid
status modified: 2017-02-13
accepted date: 2017-02-13
in scheme: emissions_variables_MMR

1.A.3.b.i Other Liquid Fuels [Cars][Other Liquid Fuels][Emissions][CO2][kt][no source][no method][no target][no option][no type]
type: Concept
definition: 1.A.3.b.i Other Liquid Fuels [Cars][Other Liquid Fuels][Emissions][CO2][kt][no source][no method][no target][no option][no type]
status: valid
status modified: 2017-02-13
accepted date: 2017-02-13
in scheme: emissions_variables_MMR

1.A.3.b.i Other Liquid Fuels [Cars][Other Liquid Fuels][Emissions][N2O][kt][no source][no method][no target][no option][no type]
type: Concept
definition: 1.A.3.b.i Other Liquid Fuels [Cars][Other Liquid Fuels][Emissions][N2O][kt][no source][no method][no target][no option][no type]
status: valid
status modified: 2017-02-13
accepted date: 2017-02-13
in scheme: emissions_variables_MMR

1.A.3.b.ii [Light duty trucks][Fuels][Emissions][CH4][kt][no source][no method][no target][no option][no type]
type: Concept
definition: 1.A.3.b.ii [Light duty trucks][Fuels][Emissions][CH4][kt][no source][no method][no target][no option][no type]
status: valid
status modified: 2017-02-13
accepted date: 2017-02-13
in scheme: emissions_variables_MMR

1.A.3.b.ii [Light duty trucks][Fuels][Emissions][CO2][kt][no source][no method][no target][no option][no type]
type: Concept
definition: 1.A.3.b.ii [Light duty trucks][Fuels][Emissions][CO2][kt][no source][no method][no target][no option][no type]
status: valid
status modified: 2017-02-13
accepted date: 2017-02-13
in scheme: emissions_variables_MMR

1.A.3.b.ii [Light duty trucks][Fuels][Emissions][N2O][kt][no source][no method][no target][no option][no type]
type: Concept
definition: 1.A.3.b.ii [Light duty trucks][Fuels][Emissions][N2O][kt][no source][no method][no target][no option][no type]
status: valid
status modified: 2017-02-13
accepted date: 2017-02-13
in scheme: emissions_variables_MMR

1.A.3.b.ii [Light duty trucks][Liquid Fuels][Emissions][CH4][kt][no source][no method][no target][no option][no type]
type: Concept
definition: 1.A.3.b.ii [Light duty trucks][Liquid Fuels][Emissions][CH4][kt][no source][no method][no target][no option][no type]
status: valid
status modified: 2017-02-13
accepted date: 2017-02-13
in scheme: emissions_variables_MMR

1.A.3.b.ii [Light duty trucks][Liquid Fuels][Emissions][CO2][kt][no source][no method][no target][no option][no type]
type: Concept
definition: 1.A.3.b.ii [Light duty trucks][Liquid Fuels][Emissions][CO2][kt][no source][no method][no target][no option][no type]
status: valid
status modified: 2017-02-13
accepted date: 2017-02-13
in scheme: emissions_variables_MMR

1.A.3.b.ii [Light duty trucks][Liquid Fuels][Emissions][N2O][kt][no source][no method][no target][no option][no type]
type: Concept
definition: 1.A.3.b.ii [Light duty trucks][Liquid Fuels][Emissions][N2O][kt][no source][no method][no target][no option][no type]
status: valid
status modified: 2017-02-13
accepted date: 2017-02-13
in scheme: emissions_variables_MMR

1.A.3.b.ii Biomass [Light duty trucks][Biomass][Emissions][CH4][kt][no source][no method][no target][no option][no type]
type: Concept
definition: 1.A.3.b.ii Biomass [Light duty trucks][Biomass][Emissions][CH4][kt][no source][no method][no target][no option][no type]
status: valid
status modified: 2017-02-13
accepted date: 2017-02-13
in scheme: emissions_variables_MMR

1.A.3.b.ii Biomass [Light duty trucks][Biomass][Emissions][CO2][kt][no source][no method][no target][no option][no type]
type: Concept
definition: 1.A.3.b.ii Biomass [Light duty trucks][Biomass][Emissions][CO2][kt][no source][no method][no target][no option][no type]
status: valid
status modified: 2017-02-13
accepted date: 2017-02-13
in scheme: emissions_variables_MMR

1.A.3.b.ii Biomass [Light duty trucks][Biomass][Emissions][N2O][kt][no source][no method][no target][no option][no type]
type: Concept
definition: 1.A.3.b.ii Biomass [Light duty trucks][Biomass][Emissions][N2O][kt][no source][no method][no target][no option][no type]
status: valid
status modified: 2017-02-13
accepted date: 2017-02-13
in scheme: emissions_variables_MMR

1.A.3.b.ii Diesel Oil [Light duty trucks][Diesel Oil][Emissions][CH4][kt][no source][no method][no target][no option][no type]
type: Concept
definition: 1.A.3.b.ii Diesel Oil [Light duty trucks][Diesel Oil][Emissions][CH4][kt][no source][no method][no target][no option][no type]
status: valid
status modified: 2017-02-13
accepted date: 2017-02-13
in scheme: emissions_variables_MMR

1.A.3.b.ii Diesel Oil [Light duty trucks][Diesel Oil][Emissions][CO2][kt][no source][no method][no target][no option][no type]
type: Concept
definition: 1.A.3.b.ii Diesel Oil [Light duty trucks][Diesel Oil][Emissions][CO2][kt][no source][no method][no target][no option][no type]
status: valid
status modified: 2017-02-13
accepted date: 2017-02-13
in scheme: emissions_variables_MMR

1.A.3.b.ii Diesel Oil [Light duty trucks][Diesel Oil][Emissions][N2O][kt][no source][no method][no target][no option][no type]
type: Concept
definition: 1.A.3.b.ii Diesel Oil [Light duty trucks][Diesel Oil][Emissions][N2O][kt][no source][no method][no target][no option][no type]
status: valid
status modified: 2017-02-13
accepted date: 2017-02-13
in scheme: emissions_variables_MMR

1.A.3.b.ii Gaseous Fuels [Light duty trucks][Gaseous Fuels][Emissions][CH4][kt][no source][no method][no target][no option][no type]
type: Concept
definition: 1.A.3.b.ii Gaseous Fuels [Light duty trucks][Gaseous Fuels][Emissions][CH4][kt][no source][no method][no target][no option][no type]
status: valid
status modified: 2017-02-13
accepted date: 2017-02-13
in scheme: emissions_variables_MMR

1.A.3.b.ii Gaseous Fuels [Light duty trucks][Gaseous Fuels][Emissions][CO2][kt][no source][no method][no target][no option][no type]
type: Concept
definition: 1.A.3.b.ii Gaseous Fuels [Light duty trucks][Gaseous Fuels][Emissions][CO2][kt][no source][no method][no target][no option][no type]
status: valid
status modified: 2017-02-13
accepted date: 2017-02-13
in scheme: emissions_variables_MMR

1.A.3.b.ii Gaseous Fuels [Light duty trucks][Gaseous Fuels][Emissions][N2O][kt][no source][no method][no target][no option][no type]
type: Concept
definition: 1.A.3.b.ii Gaseous Fuels [Light duty trucks][Gaseous Fuels][Emissions][N2O][kt][no source][no method][no target][no option][no type]
status: valid
status modified: 2017-02-13
accepted date: 2017-02-13
in scheme: emissions_variables_MMR

1.A.3.b.ii Gasoline [Light duty trucks][Gasoline][Emissions][CH4][kt][no source][no method][no target][no option][no type]
type: Concept
definition: 1.A.3.b.ii Gasoline [Light duty trucks][Gasoline][Emissions][CH4][kt][no source][no method][no target][no option][no type]
status: valid
status modified: 2017-02-13
accepted date: 2017-02-13
in scheme: emissions_variables_MMR

1.A.3.b.ii Gasoline [Light duty trucks][Gasoline][Emissions][CO2][kt][no source][no method][no target][no option][no type]
type: Concept
definition: 1.A.3.b.ii Gasoline [Light duty trucks][Gasoline][Emissions][CO2][kt][no source][no method][no target][no option][no type]
status: valid
status modified: 2017-02-13
accepted date: 2017-02-13
in scheme: emissions_variables_MMR

1.A.3.b.ii Gasoline [Light duty trucks][Gasoline][Emissions][N2O][kt][no source][no method][no target][no option][no type]
type: Concept
definition: 1.A.3.b.ii Gasoline [Light duty trucks][Gasoline][Emissions][N2O][kt][no source][no method][no target][no option][no type]
status: valid
status modified: 2017-02-13
accepted date: 2017-02-13
in scheme: emissions_variables_MMR

1.A.3.b.ii LPG [Light duty trucks][Liquefied Petroleum Gases (LPG)][Emissions][CH4][kt][no source][no method][no target][no option][no type]
type: Concept
definition: 1.A.3.b.ii LPG [Light duty trucks][Liquefied Petroleum Gases (LPG)][Emissions][CH4][kt][no source][no method][no target][no option][no type]
status: valid
status modified: 2017-02-13
accepted date: 2017-02-13
in scheme: emissions_variables_MMR

1.A.3.b.ii LPG [Light duty trucks][Liquefied Petroleum Gases (LPG)][Emissions][CO2][kt][no source][no method][no target][no option][no type]
type: Concept
definition: 1.A.3.b.ii LPG [Light duty trucks][Liquefied Petroleum Gases (LPG)][Emissions][CO2][kt][no source][no method][no target][no option][no type]
status: valid
status modified: 2017-02-13
accepted date: 2017-02-13
in scheme: emissions_variables_MMR

1.A.3.b.ii LPG [Light duty trucks][Liquefied Petroleum Gases (LPG)][Emissions][N2O][kt][no source][no method][no target][no option][no type]
type: Concept
definition: 1.A.3.b.ii LPG [Light duty trucks][Liquefied Petroleum Gases (LPG)][Emissions][N2O][kt][no source][no method][no target][no option][no type]
status: valid
status modified: 2017-02-13
accepted date: 2017-02-13
in scheme: emissions_variables_MMR

1.A.3.b.ii Other Fossil Fuel [Light duty trucks][Other Fossil Fuels][Emissions][CH4][kt][no source][no method][no target][no option][no type]
type: Concept
definition: 1.A.3.b.ii Other Fossil Fuel [Light duty trucks][Other Fossil Fuels][Emissions][CH4][kt][no source][no method][no target][no option][no type]
status: valid
status modified: 2017-02-13
accepted date: 2017-02-13
in scheme: emissions_variables_MMR

1.A.3.b.ii Other Fossil Fuel [Light duty trucks][Other Fossil Fuels][Emissions][CO2][kt][no source][no method][no target][no option][no type]
type: Concept
definition: 1.A.3.b.ii Other Fossil Fuel [Light duty trucks][Other Fossil Fuels][Emissions][CO2][kt][no source][no method][no target][no option][no type]
status: valid
status modified: 2017-02-13
accepted date: 2017-02-13
in scheme: emissions_variables_MMR

1.A.3.b.ii Other Fossil Fuel [Light duty trucks][Other Fossil Fuels][Emissions][N2O][kt][no source][no method][no target][no option][no type]
type: Concept
definition: 1.A.3.b.ii Other Fossil Fuel [Light duty trucks][Other Fossil Fuels][Emissions][N2O][kt][no source][no method][no target][no option][no type]
status: valid
status modified: 2017-02-13
accepted date: 2017-02-13
in scheme: emissions_variables_MMR

1.A.3.b.ii Other Liquid Fuel [Light duty trucks][Other Liquid Fuels][Emissions][CH4][kt][no source][no method][no target][no option][no type]
type: Concept
definition: 1.A.3.b.ii Other Liquid Fuel [Light duty trucks][Other Liquid Fuels][Emissions][CH4][kt][no source][no method][no target][no option][no type]
status: valid
status modified: 2017-02-13
accepted date: 2017-02-13
in scheme: emissions_variables_MMR

1.A.3.b.ii Other Liquid Fuel [Light duty trucks][Other Liquid Fuels][Emissions][CO2][kt][no source][no method][no target][no option][no type]
type: Concept
definition: 1.A.3.b.ii Other Liquid Fuel [Light duty trucks][Other Liquid Fuels][Emissions][CO2][kt][no source][no method][no target][no option][no type]
status: valid
status modified: 2017-02-13
accepted date: 2017-02-13
in scheme: emissions_variables_MMR

1.A.3.b.ii Other Liquid Fuel [Light duty trucks][Other Liquid Fuels][Emissions][N2O][kt][no source][no method][no target][no option][no type]
type: Concept
definition: 1.A.3.b.ii Other Liquid Fuel [Light duty trucks][Other Liquid Fuels][Emissions][N2O][kt][no source][no method][no target][no option][no type]
status: valid
status modified: 2017-02-13
accepted date: 2017-02-13
in scheme: emissions_variables_MMR

1.A.3.b.iii [Heavy duty trucks and buses][Fuels][Emissions][CH4][kt][no source][no method][no target][no option][no type]
type: Concept
definition: 1.A.3.b.iii [Heavy duty trucks and buses][Fuels][Emissions][CH4][kt][no source][no method][no target][no option][no type]
status: valid
status modified: 2017-02-13
accepted date: 2017-02-13
in scheme: emissions_variables_MMR

1.A.3.b.iii [Heavy duty trucks and buses][Fuels][Emissions][CO2][kt][no source][no method][no target][no option][no type]
type: Concept
definition: 1.A.3.b.iii [Heavy duty trucks and buses][Fuels][Emissions][CO2][kt][no source][no method][no target][no option][no type]
status: valid
status modified: 2017-02-13
accepted date: 2017-02-13
in scheme: emissions_variables_MMR

1.A.3.b.iii [Heavy duty trucks and buses][Fuels][Emissions][N2O][kt][no source][no method][no target][no option][no type]
type: Concept
definition: 1.A.3.b.iii [Heavy duty trucks and buses][Fuels][Emissions][N2O][kt][no source][no method][no target][no option][no type]
status: valid
status modified: 2017-02-13
accepted date: 2017-02-13
in scheme: emissions_variables_MMR

1.A.3.b.iii [Heavy duty trucks and buses][Liquid Fuels][Emissions][CH4][kt][no source][no method][no target][no option][no type]
type: Concept
definition: 1.A.3.b.iii [Heavy duty trucks and buses][Liquid Fuels][Emissions][CH4][kt][no source][no method][no target][no option][no type]
status: valid
status modified: 2017-02-13
accepted date: 2017-02-13
in scheme: emissions_variables_MMR

1.A.3.b.iii [Heavy duty trucks and buses][Liquid Fuels][Emissions][CO2][kt][no source][no method][no target][no option][no type]
type: Concept
definition: 1.A.3.b.iii [Heavy duty trucks and buses][Liquid Fuels][Emissions][CO2][kt][no source][no method][no target][no option][no type]
status: valid
status modified: 2017-02-13
accepted date: 2017-02-13
in scheme: emissions_variables_MMR

1.A.3.b.iii [Heavy duty trucks and buses][Liquid Fuels][Emissions][N2O][kt][no source][no method][no target][no option][no type]
type: Concept
definition: 1.A.3.b.iii [Heavy duty trucks and buses][Liquid Fuels][Emissions][N2O][kt][no source][no method][no target][no option][no type]
status: valid
status modified: 2017-02-13
accepted date: 2017-02-13
in scheme: emissions_variables_MMR

1.A.3.b.iii Biomass [Heavy duty trucks and buses][Biomass][Emissions][CH4][kt][no source][no method][no target][no option][no type]
type: Concept
definition: 1.A.3.b.iii Biomass [Heavy duty trucks and buses][Biomass][Emissions][CH4][kt][no source][no method][no target][no option][no type]
status: valid
status modified: 2017-02-13
accepted date: 2017-02-13
in scheme: emissions_variables_MMR

1.A.3.b.iii Biomass [Heavy duty trucks and buses][Biomass][Emissions][CO2][kt][no source][no method][no target][no option][no type]
type: Concept
definition: 1.A.3.b.iii Biomass [Heavy duty trucks and buses][Biomass][Emissions][CO2][kt][no source][no method][no target][no option][no type]
status: valid
status modified: 2017-02-13
accepted date: 2017-02-13
in scheme: emissions_variables_MMR

1.A.3.b.iii Biomass [Heavy duty trucks and buses][Biomass][Emissions][N2O][kt][no source][no method][no target][no option][no type]
type: Concept
definition: 1.A.3.b.iii Biomass [Heavy duty trucks and buses][Biomass][Emissions][N2O][kt][no source][no method][no target][no option][no type]
status: valid
status modified: 2017-02-13
accepted date: 2017-02-13
in scheme: emissions_variables_MMR

1.A.3.b.iii Diesel Oil [Heavy duty trucks and buses][Diesel Oil][Emissions][CH4][kt][no source][no method][no target][no option][no type]
type: Concept
definition: 1.A.3.b.iii Diesel Oil [Heavy duty trucks and buses][Diesel Oil][Emissions][CH4][kt][no source][no method][no target][no option][no type]
status: valid
status modified: 2017-02-13
accepted date: 2017-02-13
in scheme: emissions_variables_MMR

1.A.3.b.iii Diesel Oil [Heavy duty trucks and buses][Diesel Oil][Emissions][CO2][kt][no source][no method][no target][no option][no type]
type: Concept
definition: 1.A.3.b.iii Diesel Oil [Heavy duty trucks and buses][Diesel Oil][Emissions][CO2][kt][no source][no method][no target][no option][no type]
status: valid
status modified: 2017-02-13
accepted date: 2017-02-13
in scheme: emissions_variables_MMR

1.A.3.b.iii Diesel Oil [Heavy duty trucks and buses][Diesel Oil][Emissions][N2O][kt][no source][no method][no target][no option][no type]
type: Concept
definition: 1.A.3.b.iii Diesel Oil [Heavy duty trucks and buses][Diesel Oil][Emissions][N2O][kt][no source][no method][no target][no option][no type]
status: valid
status modified: 2017-02-13
accepted date: 2017-02-13
in scheme: emissions_variables_MMR

1.A.3.b.iii Gaseous Fuels [Heavy duty trucks and buses][Gaseous Fuels][Emissions][CH4][kt][no source][no method][no target][no option][no type]
type: Concept
definition: 1.A.3.b.iii Gaseous Fuels [Heavy duty trucks and buses][Gaseous Fuels][Emissions][CH4][kt][no source][no method][no target][no option][no type]
status: valid
status modified: 2017-02-13
accepted date: 2017-02-13
in scheme: emissions_variables_MMR

1.A.3.b.iii Gaseous Fuels [Heavy duty trucks and buses][Gaseous Fuels][Emissions][CO2][kt][no source][no method][no target][no option][no type]
type: Concept
definition: 1.A.3.b.iii Gaseous Fuels [Heavy duty trucks and buses][Gaseous Fuels][Emissions][CO2][kt][no source][no method][no target][no option][no type]
status: valid
status modified: 2017-02-13
accepted date: 2017-02-13
in scheme: emissions_variables_MMR

1.A.3.b.iii Gaseous Fuels [Heavy duty trucks and buses][Gaseous Fuels][Emissions][N2O][kt][no source][no method][no target][no option][no type]
type: Concept
definition: 1.A.3.b.iii Gaseous Fuels [Heavy duty trucks and buses][Gaseous Fuels][Emissions][N2O][kt][no source][no method][no target][no option][no type]
status: valid
status modified: 2017-02-13
accepted date: 2017-02-13
in scheme: emissions_variables_MMR

1.A.3.b.iii Gasoline [Heavy duty trucks and buses][Gasoline][Emissions][CH4][kt][no source][no method][no target][no option][no type]
type: Concept
definition: 1.A.3.b.iii Gasoline [Heavy duty trucks and buses][Gasoline][Emissions][CH4][kt][no source][no method][no target][no option][no type]
status: valid
status modified: 2017-02-13
accepted date: 2017-02-13
in scheme: emissions_variables_MMR

1.A.3.b.iii Gasoline [Heavy duty trucks and buses][Gasoline][Emissions][CO2][kt][no source][no method][no target][no option][no type]
type: Concept
definition: 1.A.3.b.iii Gasoline [Heavy duty trucks and buses][Gasoline][Emissions][CO2][kt][no source][no method][no target][no option][no type]
status: valid
status modified: 2017-02-13
accepted date: 2017-02-13
in scheme: emissions_variables_MMR

1.A.3.b.iii Gasoline [Heavy duty trucks and buses][Gasoline][Emissions][N2O][kt][no source][no method][no target][no option][no type]
type: Concept
definition: 1.A.3.b.iii Gasoline [Heavy duty trucks and buses][Gasoline][Emissions][N2O][kt][no source][no method][no target][no option][no type]
status: valid
status modified: 2017-02-13
accepted date: 2017-02-13
in scheme: emissions_variables_MMR

1.A.3.b.iii LPG [Heavy duty trucks and buses][Liquefied Petroleum Gases (LPG)][Emissions][CH4][kt][no source][no method][no target][no option][no type]
type: Concept
definition: 1.A.3.b.iii LPG [Heavy duty trucks and buses][Liquefied Petroleum Gases (LPG)][Emissions][CH4][kt][no source][no method][no target][no option][no type]
status: valid
status modified: 2017-02-13
accepted date: 2017-02-13
in scheme: emissions_variables_MMR

1.A.3.b.iii LPG [Heavy duty trucks and buses][Liquefied Petroleum Gases (LPG)][Emissions][CO2][kt][no source][no method][no target][no option][no type]
type: Concept
definition: 1.A.3.b.iii LPG [Heavy duty trucks and buses][Liquefied Petroleum Gases (LPG)][Emissions][CO2][kt][no source][no method][no target][no option][no type]
status: valid
status modified: 2017-02-13
accepted date: 2017-02-13
in scheme: emissions_variables_MMR

1.A.3.b.iii LPG [Heavy duty trucks and buses][Liquefied Petroleum Gases (LPG)][Emissions][N2O][kt][no source][no method][no target][no option][no type]
type: Concept
definition: 1.A.3.b.iii LPG [Heavy duty trucks and buses][Liquefied Petroleum Gases (LPG)][Emissions][N2O][kt][no source][no method][no target][no option][no type]
status: valid
status modified: 2017-02-13
accepted date: 2017-02-13
in scheme: emissions_variables_MMR

1.A.3.b.iii Other Fossil Fuel [Heavy duty trucks and buses][Other Fossil Fuels][Emissions][CH4][kt][no source][no method][no target][no option][no type]
type: Concept
definition: 1.A.3.b.iii Other Fossil Fuel [Heavy duty trucks and buses][Other Fossil Fuels][Emissions][CH4][kt][no source][no method][no target][no option][no type]
status: valid
status modified: 2017-02-13
accepted date: 2017-02-13
in scheme: emissions_variables_MMR

1.A.3.b.iii Other Fossil Fuel [Heavy duty trucks and buses][Other Fossil Fuels][Emissions][CO2][kt][no source][no method][no target][no option][no type]
type: Concept
definition: 1.A.3.b.iii Other Fossil Fuel [Heavy duty trucks and buses][Other Fossil Fuels][Emissions][CO2][kt][no source][no method][no target][no option][no type]
status: valid
status modified: 2017-02-13
accepted date: 2017-02-13
in scheme: emissions_variables_MMR

1.A.3.b.iii Other Fossil Fuel [Heavy duty trucks and buses][Other Fossil Fuels][Emissions][N2O][kt][no source][no method][no target][no option][no type]
type: Concept
definition: 1.A.3.b.iii Other Fossil Fuel [Heavy duty trucks and buses][Other Fossil Fuels][Emissions][N2O][kt][no source][no method][no target][no option][no type]
status: valid
status modified: 2017-02-13
accepted date: 2017-02-13
in scheme: emissions_variables_MMR

1.A.3.b.iii Other Liquid Fuel [Heavy duty trucks and buses][Other Liquid Fuels][Emissions][CH4][kt][no source][no method][no target][no option][no type]
type: Concept
definition: 1.A.3.b.iii Other Liquid Fuel [Heavy duty trucks and buses][Other Liquid Fuels][Emissions][CH4][kt][no source][no method][no target][no option][no type]
status: valid
status modified: 2017-02-13
accepted date: 2017-02-13
in scheme: emissions_variables_MMR

1.A.3.b.iii Other Liquid Fuel [Heavy duty trucks and buses][Other Liquid Fuels][Emissions][CO2][kt][no source][no method][no target][no option][no type]
type: Concept
definition: 1.A.3.b.iii Other Liquid Fuel [Heavy duty trucks and buses][Other Liquid Fuels][Emissions][CO2][kt][no source][no method][no target][no option][no type]
status: valid
status modified: 2017-02-13
accepted date: 2017-02-13
in scheme: emissions_variables_MMR

1.A.3.b.iii Other Liquid Fuel [Heavy duty trucks and buses][Other Liquid Fuels][Emissions][N2O][kt][no source][no method][no target][no option][no type]
type: Concept
definition: 1.A.3.b.iii Other Liquid Fuel [Heavy duty trucks and buses][Other Liquid Fuels][Emissions][N2O][kt][no source][no method][no target][no option][no type]
status: valid
status modified: 2017-02-13
accepted date: 2017-02-13
in scheme: emissions_variables_MMR

1.A.3.b.iv [Motorcycles][Fuels][Emissions][CH4][kt][no source][no method][no target][no option][no type]
type: Concept
definition: 1.A.3.b.iv [Motorcycles][Fuels][Emissions][CH4][kt][no source][no method][no target][no option][no type]
status: valid
status modified: 2017-02-13
accepted date: 2017-02-13
in scheme: emissions_variables_MMR

1.A.3.b.iv [Motorcycles][Fuels][Emissions][CO2][kt][no source][no method][no target][no option][no type]
type: Concept
definition: 1.A.3.b.iv [Motorcycles][Fuels][Emissions][CO2][kt][no source][no method][no target][no option][no type]
status: valid
status modified: 2017-02-13
accepted date: 2017-02-13
in scheme: emissions_variables_MMR

1.A.3.b.iv [Motorcycles][Fuels][Emissions][N2O][kt][no source][no method][no target][no option][no type]
type: Concept
definition: 1.A.3.b.iv [Motorcycles][Fuels][Emissions][N2O][kt][no source][no method][no target][no option][no type]
status: valid
status modified: 2017-02-13
accepted date: 2017-02-13
in scheme: emissions_variables_MMR

1.A.3.b.iv [Motorcycles][Liquid Fuels][Emissions][CH4][kt][no source][no method][no target][no option][no type]
type: Concept
definition: 1.A.3.b.iv [Motorcycles][Liquid Fuels][Emissions][CH4][kt][no source][no method][no target][no option][no type]
status: valid
status modified: 2017-02-13
accepted date: 2017-02-13
in scheme: emissions_variables_MMR

1.A.3.b.iv [Motorcycles][Liquid Fuels][Emissions][CO2][kt][no source][no method][no target][no option][no type]
type: Concept
definition: 1.A.3.b.iv [Motorcycles][Liquid Fuels][Emissions][CO2][kt][no source][no method][no target][no option][no type]
status: valid
status modified: 2017-02-13
accepted date: 2017-02-13
in scheme: emissions_variables_MMR

1.A.3.b.iv [Motorcycles][Liquid Fuels][Emissions][N2O][kt][no source][no method][no target][no option][no type]
type: Concept
definition: 1.A.3.b.iv [Motorcycles][Liquid Fuels][Emissions][N2O][kt][no source][no method][no target][no option][no type]
status: valid
status modified: 2017-02-13
accepted date: 2017-02-13
in scheme: emissions_variables_MMR

1.A.3.b.iv Biomass [Motorcycles][Biomass][Emissions][CH4][kt][no source][no method][no target][no option][no type]
type: Concept
definition: 1.A.3.b.iv Biomass [Motorcycles][Biomass][Emissions][CH4][kt][no source][no method][no target][no option][no type]
status: valid
status modified: 2017-02-13
accepted date: 2017-02-13
in scheme: emissions_variables_MMR

1.A.3.b.iv Biomass [Motorcycles][Biomass][Emissions][CO2][kt][no source][no method][no target][no option][no type]
type: Concept
definition: 1.A.3.b.iv Biomass [Motorcycles][Biomass][Emissions][CO2][kt][no source][no method][no target][no option][no type]
status: valid
status modified: 2017-02-13
accepted date: 2017-02-13
in scheme: emissions_variables_MMR

1.A.3.b.iv Biomass [Motorcycles][Biomass][Emissions][N2O][kt][no source][no method][no target][no option][no type]
type: Concept
definition: 1.A.3.b.iv Biomass [Motorcycles][Biomass][Emissions][N2O][kt][no source][no method][no target][no option][no type]
status: valid
status modified: 2017-02-13
accepted date: 2017-02-13
in scheme: emissions_variables_MMR

1.A.3.b.iv Diesel Oil [Motorcycles][Diesel Oil][Emissions][CH4][kt][no source][no method][no target][no option][no type]
type: Concept
definition: 1.A.3.b.iv Diesel Oil [Motorcycles][Diesel Oil][Emissions][CH4][kt][no source][no method][no target][no option][no type]
status: valid
status modified: 2017-02-13
accepted date: 2017-02-13
in scheme: emissions_variables_MMR

1.A.3.b.iv Diesel Oil [Motorcycles][Diesel Oil][Emissions][CO2][kt][no source][no method][no target][no option][no type]
type: Concept
definition: 1.A.3.b.iv Diesel Oil [Motorcycles][Diesel Oil][Emissions][CO2][kt][no source][no method][no target][no option][no type]
status: valid
status modified: 2017-02-13
accepted date: 2017-02-13
in scheme: emissions_variables_MMR

1.A.3.b.iv Diesel Oil [Motorcycles][Diesel Oil][Emissions][N2O][kt][no source][no method][no target][no option][no type]
type: Concept
definition: 1.A.3.b.iv Diesel Oil [Motorcycles][Diesel Oil][Emissions][N2O][kt][no source][no method][no target][no option][no type]
status: valid
status modified: 2017-02-13
accepted date: 2017-02-13
in scheme: emissions_variables_MMR

1.A.3.b.iv Gaseous Fuels [Motorcycles][Gaseous Fuels][Emissions][CH4][kt][no source][no method][no target][no option][no type]
type: Concept
definition: 1.A.3.b.iv Gaseous Fuels [Motorcycles][Gaseous Fuels][Emissions][CH4][kt][no source][no method][no target][no option][no type]
status: valid
status modified: 2017-02-13
accepted date: 2017-02-13
in scheme: emissions_variables_MMR

1.A.3.b.iv Gaseous Fuels [Motorcycles][Gaseous Fuels][Emissions][CO2][kt][no source][no method][no target][no option][no type]
type: Concept
definition: 1.A.3.b.iv Gaseous Fuels [Motorcycles][Gaseous Fuels][Emissions][CO2][kt][no source][no method][no target][no option][no type]
status: valid
status modified: 2017-02-13
accepted date: 2017-02-13
in scheme: emissions_variables_MMR

1.A.3.b.iv Gaseous Fuels [Motorcycles][Gaseous Fuels][Emissions][N2O][kt][no source][no method][no target][no option][no type]
type: Concept
definition: 1.A.3.b.iv Gaseous Fuels [Motorcycles][Gaseous Fuels][Emissions][N2O][kt][no source][no method][no target][no option][no type]
status: valid
status modified: 2017-02-13
accepted date: 2017-02-13
in scheme: emissions_variables_MMR

1.A.3.b.iv Gasoline [Motorcycles][Gasoline][Emissions][CH4][kt][no source][no method][no target][no option][no type]
type: Concept
definition: 1.A.3.b.iv Gasoline [Motorcycles][Gasoline][Emissions][CH4][kt][no source][no method][no target][no option][no type]
status: valid
status modified: 2017-02-13
accepted date: 2017-02-13
in scheme: emissions_variables_MMR

1.A.3.b.iv Gasoline [Motorcycles][Gasoline][Emissions][CO2][kt][no source][no method][no target][no option][no type]
type: Concept
definition: 1.A.3.b.iv Gasoline [Motorcycles][Gasoline][Emissions][CO2][kt][no source][no method][no target][no option][no type]
status: valid
status modified: 2017-02-13
accepted date: 2017-02-13
in scheme: emissions_variables_MMR

1.A.3.b.iv Gasoline [Motorcycles][Gasoline][Emissions][N2O][kt][no source][no method][no target][no option][no type]
type: Concept
definition: 1.A.3.b.iv Gasoline [Motorcycles][Gasoline][Emissions][N2O][kt][no source][no method][no target][no option][no type]
status: valid
status modified: 2017-02-13
accepted date: 2017-02-13
in scheme: emissions_variables_MMR

1.A.3.b.iv LPG [Motorcycles][Liquefied Petroleum Gases (LPG)][Emissions][CH4][kt][no source][no method][no target][no option][no type]
type: Concept
definition: 1.A.3.b.iv LPG [Motorcycles][Liquefied Petroleum Gases (LPG)][Emissions][CH4][kt][no source][no method][no target][no option][no type]
status: valid
status modified: 2017-02-13
accepted date: 2017-02-13
in scheme: emissions_variables_MMR

1.A.3.b.iv LPG [Motorcycles][Liquefied Petroleum Gases (LPG)][Emissions][CO2][kt][no source][no method][no target][no option][no type]
type: Concept
definition: 1.A.3.b.iv LPG [Motorcycles][Liquefied Petroleum Gases (LPG)][Emissions][CO2][kt][no source][no method][no target][no option][no type]
status: valid
status modified: 2017-02-13
accepted date: 2017-02-13
in scheme: emissions_variables_MMR

1.A.3.b.iv LPG [Motorcycles][Liquefied Petroleum Gases (LPG)][Emissions][N2O][kt][no source][no method][no target][no option][no type]
type: Concept
definition: 1.A.3.b.iv LPG [Motorcycles][Liquefied Petroleum Gases (LPG)][Emissions][N2O][kt][no source][no method][no target][no option][no type]
status: valid
status modified: 2017-02-13
accepted date: 2017-02-13
in scheme: emissions_variables_MMR

1.A.3.b.iv Other Fossil Fuel [Motorcycles][Other Fossil Fuels][Emissions][CH4][kt][no source][no method][no target][no option][no type]
type: Concept
definition: 1.A.3.b.iv Other Fossil Fuel [Motorcycles][Other Fossil Fuels][Emissions][CH4][kt][no source][no method][no target][no option][no type]
status: valid
status modified: 2017-02-13
accepted date: 2017-02-13
in scheme: emissions_variables_MMR

1.A.3.b.iv Other Fossil Fuel [Motorcycles][Other Fossil Fuels][Emissions][CO2][kt][no source][no method][no target][no option][no type]
type: Concept
definition: 1.A.3.b.iv Other Fossil Fuel [Motorcycles][Other Fossil Fuels][Emissions][CO2][kt][no source][no method][no target][no option][no type]
status: valid
status modified: 2017-02-13
accepted date: 2017-02-13
in scheme: emissions_variables_MMR

1.A.3.b.iv Other Fossil Fuel [Motorcycles][Other Fossil Fuels][Emissions][N2O][kt][no source][no method][no target][no option][no type]
type: Concept
definition: 1.A.3.b.iv Other Fossil Fuel [Motorcycles][Other Fossil Fuels][Emissions][N2O][kt][no source][no method][no target][no option][no type]
status: valid
status modified: 2017-02-13
accepted date: 2017-02-13
in scheme: emissions_variables_MMR

1.A.3.b.iv Other Liquid Fuel [Motorcycles][Other Liquid Fuels][Emissions][CH4][kt][no source][no method][no target][no option][no type]
type: Concept
definition: 1.A.3.b.iv Other Liquid Fuel [Motorcycles][Other Liquid Fuels][Emissions][CH4][kt][no source][no method][no target][no option][no type]
status: valid
status modified: 2017-02-13
accepted date: 2017-02-13
in scheme: emissions_variables_MMR

1.A.3.b.iv Other Liquid Fuel [Motorcycles][Other Liquid Fuels][Emissions][CO2][kt][no source][no method][no target][no option][no type]
type: Concept
definition: 1.A.3.b.iv Other Liquid Fuel [Motorcycles][Other Liquid Fuels][Emissions][CO2][kt][no source][no method][no target][no option][no type]
status: valid
status modified: 2017-02-13
accepted date: 2017-02-13
in scheme: emissions_variables_MMR

1.A.3.b.iv Other Liquid Fuel [Motorcycles][Other Liquid Fuels][Emissions][N2O][kt][no source][no method][no target][no option][no type]
type: Concept
definition: 1.A.3.b.iv Other Liquid Fuel [Motorcycles][Other Liquid Fuels][Emissions][N2O][kt][no source][no method][no target][no option][no type]
status: valid
status modified: 2017-02-13
accepted date: 2017-02-13
in scheme: emissions_variables_MMR

1.A.3.b.v [Other Road Transportation][Biomass][Emissions][CH4][kt][no source][no method][no target][no option][no type]
type: Concept
definition: 1.A.3.b.v [Other Road Transportation][Biomass][Emissions][CH4][kt][no source][no method][no target][no option][no type]
status: valid
status modified: 2017-02-13
accepted date: 2017-02-13
in scheme: emissions_variables_MMR

1.A.3.b.v [Other Road Transportation][Biomass][Emissions][CO2][kt][no source][no method][no target][no option][no type]
type: Concept
definition: 1.A.3.b.v [Other Road Transportation][Biomass][Emissions][CO2][kt][no source][no method][no target][no option][no type]
status: valid
status modified: 2017-02-13
accepted date: 2017-02-13
in scheme: emissions_variables_MMR

1.A.3.b.v [Other Road Transportation][Biomass][Emissions][N2O][kt][no source][no method][no target][no option][no type]
type: Concept
definition: 1.A.3.b.v [Other Road Transportation][Biomass][Emissions][N2O][kt][no source][no method][no target][no option][no type]
status: valid
status modified: 2017-02-13
accepted date: 2017-02-13
in scheme: emissions_variables_MMR

1.A.3.b.v [Other Road Transportation][Diesel Oil][Emissions][CH4][kt][no source][no method][no target][no option][no type]
type: Concept
definition: 1.A.3.b.v [Other Road Transportation][Diesel Oil][Emissions][CH4][kt][no source][no method][no target][no option][no type]
status: valid
status modified: 2017-02-13
accepted date: 2017-02-13
in scheme: emissions_variables_MMR

1.A.3.b.v [Other Road Transportation][Diesel Oil][Emissions][CO2][kt][no source][no method][no target][no option][no type]
type: Concept
definition: 1.A.3.b.v [Other Road Transportation][Diesel Oil][Emissions][CO2][kt][no source][no method][no target][no option][no type]
status: valid
status modified: 2017-02-13
accepted date: 2017-02-13
in scheme: emissions_variables_MMR

1.A.3.b.v [Other Road Transportation][Diesel Oil][Emissions][N2O][kt][no source][no method][no target][no option][no type]
type: Concept
definition: 1.A.3.b.v [Other Road Transportation][Diesel Oil][Emissions][N2O][kt][no source][no method][no target][no option][no type]
status: valid
status modified: 2017-02-13
accepted date: 2017-02-13
in scheme: emissions_variables_MMR

1.A.3.b.v [Other Road Transportation][Fuels][Emissions][CH4][kt][no source][no method][no target][no option][no type]
type: Concept
definition: 1.A.3.b.v [Other Road Transportation][Fuels][Emissions][CH4][kt][no source][no method][no target][no option][no type]
status: valid
status modified: 2017-02-13
accepted date: 2017-02-13
in scheme: emissions_variables_MMR

1.A.3.b.v [Other Road Transportation][Fuels][Emissions][CO2][kt][no source][no method][no target][no option][no type]
type: Concept
definition: 1.A.3.b.v [Other Road Transportation][Fuels][Emissions][CO2][kt][no source][no method][no target][no option][no type]
status: valid
status modified: 2017-02-13
accepted date: 2017-02-13
in scheme: emissions_variables_MMR

1.A.3.b.v [Other Road Transportation][Fuels][Emissions][N2O][kt][no source][no method][no target][no option][no type]
type: Concept
definition: 1.A.3.b.v [Other Road Transportation][Fuels][Emissions][N2O][kt][no source][no method][no target][no option][no type]
status: valid
status modified: 2017-02-13
accepted date: 2017-02-13
in scheme: emissions_variables_MMR

1.A.3.b.v [Other Road Transportation][Gaseous Fuels][Emissions][CH4][kt][no source][no method][no target][no option][no type]
type: Concept
definition: 1.A.3.b.v [Other Road Transportation][Gaseous Fuels][Emissions][CH4][kt][no source][no method][no target][no option][no type]
status: valid
status modified: 2017-02-13
accepted date: 2017-02-13
in scheme: emissions_variables_MMR

1.A.3.b.v [Other Road Transportation][Gaseous Fuels][Emissions][CO2][kt][no source][no method][no target][no option][no type]
type: Concept
definition: 1.A.3.b.v [Other Road Transportation][Gaseous Fuels][Emissions][CO2][kt][no source][no method][no target][no option][no type]
status: valid
status modified: 2017-02-13
accepted date: 2017-02-13
in scheme: emissions_variables_MMR

1.A.3.b.v [Other Road Transportation][Gaseous Fuels][Emissions][N2O][kt][no source][no method][no target][no option][no type]
type: Concept
definition: 1.A.3.b.v [Other Road Transportation][Gaseous Fuels][Emissions][N2O][kt][no source][no method][no target][no option][no type]
status: valid
status modified: 2017-02-13
accepted date: 2017-02-13
in scheme: emissions_variables_MMR

1.A.3.b.v [Other Road Transportation][Gasoline][Emissions][CH4][kt][no source][no method][no target][no option][no type]
type: Concept
definition: 1.A.3.b.v [Other Road Transportation][Gasoline][Emissions][CH4][kt][no source][no method][no target][no option][no type]
status: valid
status modified: 2017-02-13
accepted date: 2017-02-13
in scheme: emissions_variables_MMR

1.A.3.b.v [Other Road Transportation][Gasoline][Emissions][CO2][kt][no source][no method][no target][no option][no type]
type: Concept
definition: 1.A.3.b.v [Other Road Transportation][Gasoline][Emissions][CO2][kt][no source][no method][no target][no option][no type]
status: valid
status modified: 2017-02-13
accepted date: 2017-02-13
in scheme: emissions_variables_MMR

1.A.3.b.v [Other Road Transportation][Gasoline][Emissions][N2O][kt][no source][no method][no target][no option][no type]
type: Concept
definition: 1.A.3.b.v [Other Road Transportation][Gasoline][Emissions][N2O][kt][no source][no method][no target][no option][no type]
status: valid
status modified: 2017-02-13
accepted date: 2017-02-13
in scheme: emissions_variables_MMR

1.A.3.b.v [Other Road Transportation][Liquefied Petroleum Gases (LPG)][Emissions][CH4][kt][no source][no method][no target][no option][no type]
type: Concept
definition: 1.A.3.b.v [Other Road Transportation][Liquefied Petroleum Gases (LPG)][Emissions][CH4][kt][no source][no method][no target][no option][no type]
status: valid
status modified: 2017-02-13
accepted date: 2017-02-13
in scheme: emissions_variables_MMR

1.A.3.b.v [Other Road Transportation][Liquefied Petroleum Gases (LPG)][Emissions][CO2][kt][no source][no method][no target][no option][no type]
type: Concept
definition: 1.A.3.b.v [Other Road Transportation][Liquefied Petroleum Gases (LPG)][Emissions][CO2][kt][no source][no method][no target][no option][no type]
status: valid
status modified: 2017-02-13
accepted date: 2017-02-13
in scheme: emissions_variables_MMR

1.A.3.b.v [Other Road Transportation][Liquefied Petroleum Gases (LPG)][Emissions][N2O][kt][no source][no method][no target][no option][no type]
type: Concept
definition: 1.A.3.b.v [Other Road Transportation][Liquefied Petroleum Gases (LPG)][Emissions][N2O][kt][no source][no method][no target][no option][no type]
status: valid
status modified: 2017-02-13
accepted date: 2017-02-13
in scheme: emissions_variables_MMR

1.A.3.b.v [Other Road Transportation][Liquid Fuels][Emissions][CH4][kt][no source][no method][no target][no option][no type]
type: Concept
definition: 1.A.3.b.v [Other Road Transportation][Liquid Fuels][Emissions][CH4][kt][no source][no method][no target][no option][no type]
status: valid
status modified: 2017-02-13
accepted date: 2017-02-13
in scheme: emissions_variables_MMR

1.A.3.b.v [Other Road Transportation][Liquid Fuels][Emissions][CO2][kt][no source][no method][no target][no option][no type]
type: Concept
definition: 1.A.3.b.v [Other Road Transportation][Liquid Fuels][Emissions][CO2][kt][no source][no method][no target][no option][no type]
status: valid
status modified: 2017-02-13
accepted date: 2017-02-13
in scheme: emissions_variables_MMR

1.A.3.b.v [Other Road Transportation][Liquid Fuels][Emissions][N2O][kt][no source][no method][no target][no option][no type]
type: Concept
definition: 1.A.3.b.v [Other Road Transportation][Liquid Fuels][Emissions][N2O][kt][no source][no method][no target][no option][no type]
status: valid
status modified: 2017-02-13
accepted date: 2017-02-13
in scheme: emissions_variables_MMR

1.A.3.b.v [Other Road Transportation][Other Fossil Fuels][Emissions][CH4][kt][no source][no method][no target][no option][no type]
type: Concept
definition: 1.A.3.b.v [Other Road Transportation][Other Fossil Fuels][Emissions][CH4][kt][no source][no method][no target][no option][no type]
status: valid
status modified: 2017-02-13
accepted date: 2017-02-13
in scheme: emissions_variables_MMR

1.A.3.b.v [Other Road Transportation][Other Fossil Fuels][Emissions][CO2][kt][no source][no method][no target][no option][no type]
type: Concept
definition: 1.A.3.b.v [Other Road Transportation][Other Fossil Fuels][Emissions][CO2][kt][no source][no method][no target][no option][no type]
status: valid
status modified: 2017-02-13
accepted date: 2017-02-13
in scheme: emissions_variables_MMR

1.A.3.b.v [Other Road Transportation][Other Fossil Fuels][Emissions][N2O][kt][no source][no method][no target][no option][no type]
type: Concept
definition: 1.A.3.b.v [Other Road Transportation][Other Fossil Fuels][Emissions][N2O][kt][no source][no method][no target][no option][no type]
status: valid
status modified: 2017-02-13
accepted date: 2017-02-13
in scheme: emissions_variables_MMR

1.A.3.b.v [Other Road Transportation][Other Liquid Fuels][Emissions][CH4][kt][no source][no method][no target][no option][no type]
type: Concept
definition: 1.A.3.b.v [Other Road Transportation][Other Liquid Fuels][Emissions][CH4][kt][no source][no method][no target][no option][no type]
status: valid
status modified: 2017-02-13
accepted date: 2017-02-13
in scheme: emissions_variables_MMR

1.A.3.b.v [Other Road Transportation][Other Liquid Fuels][Emissions][CO2][kt][no source][no method][no target][no option][no type]
type: Concept
definition: 1.A.3.b.v [Other Road Transportation][Other Liquid Fuels][Emissions][CO2][kt][no source][no method][no target][no option][no type]
status: valid
status modified: 2017-02-13
accepted date: 2017-02-13
in scheme: emissions_variables_MMR

1.A.3.b.v [Other Road Transportation][Other Liquid Fuels][Emissions][N2O][kt][no source][no method][no target][no option][no type]
type: Concept
definition: 1.A.3.b.v [Other Road Transportation][Other Liquid Fuels][Emissions][N2O][kt][no source][no method][no target][no option][no type]
status: valid
status modified: 2017-02-13
accepted date: 2017-02-13
in scheme: emissions_variables_MMR

1.A.3.c [Railways][Fossil fuels][Emissions][CO2][kt][no source][no method][no target][no option][no type]
type: Concept
definition: 1.A.3.c [Railways][Fossil fuels][Emissions][CO2][kt][no source][no method][no target][no option][no type]
status: valid
status modified: 2017-02-13
accepted date: 2017-02-13
in scheme: emissions_variables_MMR

1.A.3.c [Railways][Fuels][Emissions][CH4][kt][no source][no method][no target][no option][no type]
type: Concept
definition: 1.A.3.c [Railways][Fuels][Emissions][CH4][kt][no source][no method][no target][no option][no type]
status: valid
status modified: 2017-02-13
accepted date: 2017-02-13
in scheme: emissions_variables_MMR

1.A.3.c [Railways][Fuels][Emissions][CO][kt][no source][no method][no target][no option][no type]
type: Concept
definition: 1.A.3.c [Railways][Fuels][Emissions][CO][kt][no source][no method][no target][no option][no type]
status: valid
status modified: 2017-02-13
accepted date: 2017-02-13
in scheme: emissions_variables_MMR

1.A.3.c [Railways][Fuels][Emissions][N2O][kt][no source][no method][no target][no option][no type]
type: Concept
definition: 1.A.3.c [Railways][Fuels][Emissions][N2O][kt][no source][no method][no target][no option][no type]
status: valid
status modified: 2017-02-13
accepted date: 2017-02-13
in scheme: emissions_variables_MMR

1.A.3.c [Railways][Fuels][Emissions][NMVOC][kt][no source][no method][no target][no option][no type]
type: Concept
definition: 1.A.3.c [Railways][Fuels][Emissions][NMVOC][kt][no source][no method][no target][no option][no type]
status: valid
status modified: 2017-02-13
accepted date: 2017-02-13
in scheme: emissions_variables_MMR

1.A.3.c [Railways][Fuels][Emissions][NOx][kt][no source][no method][no target][no option][no type]
type: Concept
definition: 1.A.3.c [Railways][Fuels][Emissions][NOx][kt][no source][no method][no target][no option][no type]
status: valid
status modified: 2017-02-13
accepted date: 2017-02-13
in scheme: emissions_variables_MMR

1.A.3.c [Railways][Fuels][Emissions][SO2][kt][no source][no method][no target][no option][no type]
type: Concept
definition: 1.A.3.c [Railways][Fuels][Emissions][SO2][kt][no source][no method][no target][no option][no type]
status: valid
status modified: 2017-02-13
accepted date: 2017-02-13
in scheme: emissions_variables_MMR

1.A.3.c Biomass [Railways][Biomass][Emissions][CH4][kt][no source][no method][no target][no option][no type]
type: Concept
definition: 1.A.3.c Biomass [Railways][Biomass][Emissions][CH4][kt][no source][no method][no target][no option][no type]
status: valid
status modified: 2017-02-13
accepted date: 2017-02-13
in scheme: emissions_variables_MMR

1.A.3.c Biomass [Railways][Biomass][Emissions][CO2][kt][no source][no method][no target][no option][no type]
type: Concept
definition: 1.A.3.c Biomass [Railways][Biomass][Emissions][CO2][kt][no source][no method][no target][no option][no type]
status: valid
status modified: 2017-02-13
accepted date: 2017-02-13
in scheme: emissions_variables_MMR

1.A.3.c Biomass [Railways][Biomass][Emissions][N2O][kt][no source][no method][no target][no option][no type]
type: Concept
definition: 1.A.3.c Biomass [Railways][Biomass][Emissions][N2O][kt][no source][no method][no target][no option][no type]
status: valid
status modified: 2017-02-13
accepted date: 2017-02-13
in scheme: emissions_variables_MMR

1.A.3.c Gaseous Fuels [Railways][Gaseous Fuels][Emissions][CH4][kt][no source][no method][no target][no option][no type]
type: Concept
definition: 1.A.3.c Gaseous Fuels [Railways][Gaseous Fuels][Emissions][CH4][kt][no source][no method][no target][no option][no type]
status: valid
status modified: 2017-02-13
accepted date: 2017-02-13
in scheme: emissions_variables_MMR

1.A.3.c Gaseous Fuels [Railways][Gaseous Fuels][Emissions][CO2][kt][no source][no method][no target][no option][no type]
type: Concept
definition: 1.A.3.c Gaseous Fuels [Railways][Gaseous Fuels][Emissions][CO2][kt][no source][no method][no target][no option][no type]
status: valid
status modified: 2017-02-13
accepted date: 2017-02-13
in scheme: emissions_variables_MMR

1.A.3.c Gaseous Fuels [Railways][Gaseous Fuels][Emissions][N2O][kt][no source][no method][no target][no option][no type]
type: Concept
definition: 1.A.3.c Gaseous Fuels [Railways][Gaseous Fuels][Emissions][N2O][kt][no source][no method][no target][no option][no type]
status: valid
status modified: 2017-02-13
accepted date: 2017-02-13
in scheme: emissions_variables_MMR

1.A.3.c Liquid Fuels [Railways][Liquid Fuels][Emissions][CH4][kt][no source][no method][no target][no option][no type]
type: Concept
definition: 1.A.3.c Liquid Fuels [Railways][Liquid Fuels][Emissions][CH4][kt][no source][no method][no target][no option][no type]
status: valid
status modified: 2017-02-13
accepted date: 2017-02-13
in scheme: emissions_variables_MMR

1.A.3.c Liquid Fuels [Railways][Liquid Fuels][Emissions][CO2][kt][no source][no method][no target][no option][no type]
type: Concept
definition: 1.A.3.c Liquid Fuels [Railways][Liquid Fuels][Emissions][CO2][kt][no source][no method][no target][no option][no type]
status: valid
status modified: 2017-02-13
accepted date: 2017-02-13
in scheme: emissions_variables_MMR

1.A.3.c Liquid Fuels [Railways][Liquid Fuels][Emissions][N2O][kt][no source][no method][no target][no option][no type]
type: Concept
definition: 1.A.3.c Liquid Fuels [Railways][Liquid Fuels][Emissions][N2O][kt][no source][no method][no target][no option][no type]
status: valid
status modified: 2017-02-13
accepted date: 2017-02-13
in scheme: emissions_variables_MMR

1.A.3.c Other Fossil Fuels [Railways][Other Fossil Fuels][Emissions][CH4][kt][no source][no method][no target][no option][no type]
type: Concept
definition: 1.A.3.c Other Fossil Fuels [Railways][Other Fossil Fuels][Emissions][CH4][kt][no source][no method][no target][no option][no type]
status: valid
status modified: 2017-02-13
accepted date: 2017-02-13
in scheme: emissions_variables_MMR

1.A.3.c Other Fossil Fuels [Railways][Other Fossil Fuels][Emissions][CO2][kt][no source][no method][no target][no option][no type]
type: Concept
definition: 1.A.3.c Other Fossil Fuels [Railways][Other Fossil Fuels][Emissions][CO2][kt][no source][no method][no target][no option][no type]
status: valid
status modified: 2017-02-13
accepted date: 2017-02-13
in scheme: emissions_variables_MMR

1.A.3.c Other Fossil Fuels [Railways][Other Fossil Fuels][Emissions][N2O][kt][no source][no method][no target][no option][no type]
type: Concept
definition: 1.A.3.c Other Fossil Fuels [Railways][Other Fossil Fuels][Emissions][N2O][kt][no source][no method][no target][no option][no type]
status: valid
status modified: 2017-02-13
accepted date: 2017-02-13
in scheme: emissions_variables_MMR

1.A.3.c Solid Fuels [Railways][Solid Fuels][Emissions][CH4][kt][no source][no method][no target][no option][no type]
type: Concept
definition: 1.A.3.c Solid Fuels [Railways][Solid Fuels][Emissions][CH4][kt][no source][no method][no target][no option][no type]
status: valid
status modified: 2017-02-13
accepted date: 2017-02-13
in scheme: emissions_variables_MMR

1.A.3.c Solid Fuels [Railways][Solid Fuels][Emissions][CO2][kt][no source][no method][no target][no option][no type]
type: Concept
definition: 1.A.3.c Solid Fuels [Railways][Solid Fuels][Emissions][CO2][kt][no source][no method][no target][no option][no type]
status: valid
status modified: 2017-02-13
accepted date: 2017-02-13
in scheme: emissions_variables_MMR

1.A.3.c Solid Fuels [Railways][Solid Fuels][Emissions][N2O][kt][no source][no method][no target][no option][no type]
type: Concept
definition: 1.A.3.c Solid Fuels [Railways][Solid Fuels][Emissions][N2O][kt][no source][no method][no target][no option][no type]
status: valid
status modified: 2017-02-13
accepted date: 2017-02-13
in scheme: emissions_variables_MMR

1.A.3.d [Domestic Navigation][Fossil fuels][Emissions][CO2][kt][no source][no method][no target][no option][no type]
type: Concept
definition: 1.A.3.d [Domestic Navigation][Fossil fuels][Emissions][CO2][kt][no source][no method][no target][no option][no type]
status: valid
status modified: 2017-02-13
accepted date: 2017-02-13
in scheme: emissions_variables_MMR

1.A.3.d [Domestic Navigation][Fuels][Emissions][CH4][kt][no source][no method][no target][no option][no type]
type: Concept
definition: 1.A.3.d [Domestic Navigation][Fuels][Emissions][CH4][kt][no source][no method][no target][no option][no type]
status: valid
status modified: 2017-02-13
accepted date: 2017-02-13
in scheme: emissions_variables_MMR

1.A.3.d [Domestic Navigation][Fuels][Emissions][CO][kt][no source][no method][no target][no option][no type]
type: Concept
definition: 1.A.3.d [Domestic Navigation][Fuels][Emissions][CO][kt][no source][no method][no target][no option][no type]
status: valid
status modified: 2017-02-13
accepted date: 2017-02-13
in scheme: emissions_variables_MMR

1.A.3.d [Domestic Navigation][Fuels][Emissions][N2O][kt][no source][no method][no target][no option][no type]
type: Concept
definition: 1.A.3.d [Domestic Navigation][Fuels][Emissions][N2O][kt][no source][no method][no target][no option][no type]
status: valid
status modified: 2017-02-13
accepted date: 2017-02-13
in scheme: emissions_variables_MMR

1.A.3.d [Domestic Navigation][Fuels][Emissions][NMVOC][kt][no source][no method][no target][no option][no type]
type: Concept
definition: 1.A.3.d [Domestic Navigation][Fuels][Emissions][NMVOC][kt][no source][no method][no target][no option][no type]
status: valid
status modified: 2017-02-13
accepted date: 2017-02-13
in scheme: emissions_variables_MMR

1.A.3.d [Domestic Navigation][Fuels][Emissions][NOx][kt][no source][no method][no target][no option][no type]
type: Concept
definition: 1.A.3.d [Domestic Navigation][Fuels][Emissions][NOx][kt][no source][no method][no target][no option][no type]
status: valid
status modified: 2017-02-13
accepted date: 2017-02-13
in scheme: emissions_variables_MMR

1.A.3.d [Domestic Navigation][Fuels][Emissions][SO2][kt][no source][no method][no target][no option][no type]
type: Concept
definition: 1.A.3.d [Domestic Navigation][Fuels][Emissions][SO2][kt][no source][no method][no target][no option][no type]
status: valid
status modified: 2017-02-13
accepted date: 2017-02-13
in scheme: emissions_variables_MMR

1.A.3.d [Domestic Navigation][Liquid Fuels][Emissions][CH4][kt][no source][no method][no target][no option][no type]
type: Concept
definition: 1.A.3.d [Domestic Navigation][Liquid Fuels][Emissions][CH4][kt][no source][no method][no target][no option][no type]
status: valid
status modified: 2017-02-13
accepted date: 2017-02-13
in scheme: emissions_variables_MMR

1.A.3.d [Domestic Navigation][Liquid Fuels][Emissions][CO2][kt][no source][no method][no target][no option][no type]
type: Concept
definition: 1.A.3.d [Domestic Navigation][Liquid Fuels][Emissions][CO2][kt][no source][no method][no target][no option][no type]
status: valid
status modified: 2017-02-13
accepted date: 2017-02-13
in scheme: emissions_variables_MMR

1.A.3.d [Domestic Navigation][Liquid Fuels][Emissions][N2O][kt][no source][no method][no target][no option][no type]
type: Concept
definition: 1.A.3.d [Domestic Navigation][Liquid Fuels][Emissions][N2O][kt][no source][no method][no target][no option][no type]
status: valid
status modified: 2017-02-13
accepted date: 2017-02-13
in scheme: emissions_variables_MMR

1.A.3.d Biomass [Domestic Navigation][Biomass][Emissions][CH4][kt][no source][no method][no target][no option][no type]
type: Concept
definition: 1.A.3.d Biomass [Domestic Navigation][Biomass][Emissions][CH4][kt][no source][no method][no target][no option][no type]
status: valid
status modified: 2017-02-13
accepted date: 2017-02-13
in scheme: emissions_variables_MMR

1.A.3.d Biomass [Domestic Navigation][Biomass][Emissions][CO2][kt][no source][no method][no target][no option][no type]
type: Concept
definition: 1.A.3.d Biomass [Domestic Navigation][Biomass][Emissions][CO2][kt][no source][no method][no target][no option][no type]
status: valid
status modified: 2017-02-13
accepted date: 2017-02-13
in scheme: emissions_variables_MMR

1.A.3.d Biomass [Domestic Navigation][Biomass][Emissions][N2O][kt][no source][no method][no target][no option][no type]
type: Concept
definition: 1.A.3.d Biomass [Domestic Navigation][Biomass][Emissions][N2O][kt][no source][no method][no target][no option][no type]
status: valid
status modified: 2017-02-13
accepted date: 2017-02-13
in scheme: emissions_variables_MMR

1.A.3.d Gas/Diesel Oil [Domestic Navigation][Gas/Diesel Oil][Emissions][CH4][kt][no source][no method][no target][no option][no type]
type: Concept
definition: 1.A.3.d Gas/Diesel Oil [Domestic Navigation][Gas/Diesel Oil][Emissions][CH4][kt][no source][no method][no target][no option][no type]
status: valid
status modified: 2017-02-13
accepted date: 2017-02-13
in scheme: emissions_variables_MMR

1.A.3.d Gas/Diesel Oil [Domestic Navigation][Gas/Diesel Oil][Emissions][CO2][kt][no source][no method][no target][no option][no type]
type: Concept
definition: 1.A.3.d Gas/Diesel Oil [Domestic Navigation][Gas/Diesel Oil][Emissions][CO2][kt][no source][no method][no target][no option][no type]
status: valid
status modified: 2017-02-13
accepted date: 2017-02-13
in scheme: emissions_variables_MMR

1.A.3.d Gas/Diesel Oil [Domestic Navigation][Gas/Diesel Oil][Emissions][N2O][kt][no source][no method][no target][no option][no type]
type: Concept
definition: 1.A.3.d Gas/Diesel Oil [Domestic Navigation][Gas/Diesel Oil][Emissions][N2O][kt][no source][no method][no target][no option][no type]
status: valid
status modified: 2017-02-13
accepted date: 2017-02-13
in scheme: emissions_variables_MMR

1.A.3.d Gaseous Fuels [Domestic Navigation][Gaseous Fuels][Emissions][CH4][kt][no source][no method][no target][no option][no type]
type: Concept
definition: 1.A.3.d Gaseous Fuels [Domestic Navigation][Gaseous Fuels][Emissions][CH4][kt][no source][no method][no target][no option][no type]
status: valid
status modified: 2017-02-13
accepted date: 2017-02-13
in scheme: emissions_variables_MMR

1.A.3.d Gaseous Fuels [Domestic Navigation][Gaseous Fuels][Emissions][CO2][kt][no source][no method][no target][no option][no type]
type: Concept
definition: 1.A.3.d Gaseous Fuels [Domestic Navigation][Gaseous Fuels][Emissions][CO2][kt][no source][no method][no target][no option][no type]
status: valid
status modified: 2017-02-13
accepted date: 2017-02-13
in scheme: emissions_variables_MMR

1.A.3.d Gaseous Fuels [Domestic Navigation][Gaseous Fuels][Emissions][N2O][kt][no source][no method][no target][no option][no type]
type: Concept
definition: 1.A.3.d Gaseous Fuels [Domestic Navigation][Gaseous Fuels][Emissions][N2O][kt][no source][no method][no target][no option][no type]
status: valid
status modified: 2017-02-13
accepted date: 2017-02-13
in scheme: emissions_variables_MMR

1.A.3.d Gasoline [Domestic Navigation][Gasoline][Emissions][CH4][kt][no source][no method][no target][no option][no type]
type: Concept
definition: 1.A.3.d Gasoline [Domestic Navigation][Gasoline][Emissions][CH4][kt][no source][no method][no target][no option][no type]
status: valid
status modified: 2017-02-13
accepted date: 2017-02-13
in scheme: emissions_variables_MMR

1.A.3.d Gasoline [Domestic Navigation][Gasoline][Emissions][CO2][kt][no source][no method][no target][no option][no type]
type: Concept
definition: 1.A.3.d Gasoline [Domestic Navigation][Gasoline][Emissions][CO2][kt][no source][no method][no target][no option][no type]
status: valid
status modified: 2017-02-13
accepted date: 2017-02-13
in scheme: emissions_variables_MMR

1.A.3.d Gasoline [Domestic Navigation][Gasoline][Emissions][N2O][kt][no source][no method][no target][no option][no type]
type: Concept
definition: 1.A.3.d Gasoline [Domestic Navigation][Gasoline][Emissions][N2O][kt][no source][no method][no target][no option][no type]
status: valid
status modified: 2017-02-13
accepted date: 2017-02-13
in scheme: emissions_variables_MMR

1.A.3.d Other Fossil Fuels [Domestic Navigation][Other Fossil Fuels][Emissions][CH4][kt][no source][no method][no target][no option][no type]
type: Concept
definition: 1.A.3.d Other Fossil Fuels [Domestic Navigation][Other Fossil Fuels][Emissions][CH4][kt][no source][no method][no target][no option][no type]
status: valid
status modified: 2017-02-13
accepted date: 2017-02-13
in scheme: emissions_variables_MMR

1.A.3.d Other Fossil Fuels [Domestic Navigation][Other Fossil Fuels][Emissions][CO2][kt][no source][no method][no target][no option][no type]
type: Concept
definition: 1.A.3.d Other Fossil Fuels [Domestic Navigation][Other Fossil Fuels][Emissions][CO2][kt][no source][no method][no target][no option][no type]
status: valid
status modified: 2017-02-13
accepted date: 2017-02-13
in scheme: emissions_variables_MMR

1.A.3.d Other Fossil Fuels [Domestic Navigation][Other Fossil Fuels][Emissions][N2O][kt][no source][no method][no target][no option][no type]
type: Concept
definition: 1.A.3.d Other Fossil Fuels [Domestic Navigation][Other Fossil Fuels][Emissions][N2O][kt][no source][no method][no target][no option][no type]
status: valid
status modified: 2017-02-13
accepted date: 2017-02-13
in scheme: emissions_variables_MMR

1.A.3.d Other Liquid Fuels [Domestic Navigation][Other Liquid Fuels][Emissions][CH4][kt][no source][no method][no target][no option][no type]
type: Concept
definition: 1.A.3.d Other Liquid Fuels [Domestic Navigation][Other Liquid Fuels][Emissions][CH4][kt][no source][no method][no target][no option][no type]
status: valid
status modified: 2017-02-13
accepted date: 2017-02-13
in scheme: emissions_variables_MMR

1.A.3.d Other Liquid Fuels [Domestic Navigation][Other Liquid Fuels][Emissions][CO2][kt][no source][no method][no target][no option][no type]
type: Concept
definition: 1.A.3.d Other Liquid Fuels [Domestic Navigation][Other Liquid Fuels][Emissions][CO2][kt][no source][no method][no target][no option][no type]
status: valid
status modified: 2017-02-13
accepted date: 2017-02-13
in scheme: emissions_variables_MMR

1.A.3.d Other Liquid Fuels [Domestic Navigation][Other Liquid Fuels][Emissions][N2O][kt][no source][no method][no target][no option][no type]
type: Concept
definition: 1.A.3.d Other Liquid Fuels [Domestic Navigation][Other Liquid Fuels][Emissions][N2O][kt][no source][no method][no target][no option][no type]
status: valid
status modified: 2017-02-13
accepted date: 2017-02-13
in scheme: emissions_variables_MMR

1.A.3.d Residual Fuel Oil [Domestic Navigation][Residual Fuel Oil][Emissions][CH4][kt][no source][no method][no target][no option][no type]
type: Concept
definition: 1.A.3.d Residual Fuel Oil [Domestic Navigation][Residual Fuel Oil][Emissions][CH4][kt][no source][no method][no target][no option][no type]
status: valid
status modified: 2017-02-13
accepted date: 2017-02-13
in scheme: emissions_variables_MMR

1.A.3.d Residual Fuel Oil [Domestic Navigation][Residual Fuel Oil][Emissions][CO2][kt][no source][no method][no target][no option][no type]
type: Concept
definition: 1.A.3.d Residual Fuel Oil [Domestic Navigation][Residual Fuel Oil][Emissions][CO2][kt][no source][no method][no target][no option][no type]
status: valid
status modified: 2017-02-13
accepted date: 2017-02-13
in scheme: emissions_variables_MMR

1.A.3.d Residual Fuel Oil [Domestic Navigation][Residual Fuel Oil][Emissions][N2O][kt][no source][no method][no target][no option][no type]
type: Concept
definition: 1.A.3.d Residual Fuel Oil [Domestic Navigation][Residual Fuel Oil][Emissions][N2O][kt][no source][no method][no target][no option][no type]
status: valid
status modified: 2017-02-13
accepted date: 2017-02-13
in scheme: emissions_variables_MMR

1.A.3.e [Other Transportation][Biomass][Emissions][CH4][kt][no source][no method][no target][no option][no type]
type: Concept
definition: 1.A.3.e [Other Transportation][Biomass][Emissions][CH4][kt][no source][no method][no target][no option][no type]
status: valid
status modified: 2017-02-13
accepted date: 2017-02-13
in scheme: emissions_variables_MMR

1.A.3.e [Other Transportation][Biomass][Emissions][CO2][kt][no source][no method][no target][no option][no type]
type: Concept
definition: 1.A.3.e [Other Transportation][Biomass][Emissions][CO2][kt][no source][no method][no target][no option][no type]
status: valid
status modified: 2017-02-13
accepted date: 2017-02-13
in scheme: emissions_variables_MMR

1.A.3.e [Other Transportation][Biomass][Emissions][N2O][kt][no source][no method][no target][no option][no type]
type: Concept
definition: 1.A.3.e [Other Transportation][Biomass][Emissions][N2O][kt][no source][no method][no target][no option][no type]
status: valid
status modified: 2017-02-13
accepted date: 2017-02-13
in scheme: emissions_variables_MMR

1.A.3.e [Other Transportation][Fossil fuels][Emissions][CO2][kt][no source][no method][no target][no option][no type]
type: Concept
definition: 1.A.3.e [Other Transportation][Fossil fuels][Emissions][CO2][kt][no source][no method][no target][no option][no type]
status: valid
status modified: 2017-02-13
accepted date: 2017-02-13
in scheme: emissions_variables_MMR

1.A.3.e [Other Transportation][Fuels][Emissions][CH4][kt][no source][no method][no target][no option][no type]
type: Concept
definition: 1.A.3.e [Other Transportation][Fuels][Emissions][CH4][kt][no source][no method][no target][no option][no type]
status: valid
status modified: 2017-02-13
accepted date: 2017-02-13
in scheme: emissions_variables_MMR

1.A.3.e [Other Transportation][Fuels][Emissions][CO][kt][no source][no method][no target][no option][no type]
type: Concept
definition: 1.A.3.e [Other Transportation][Fuels][Emissions][CO][kt][no source][no method][no target][no option][no type]
status: valid
status modified: 2017-02-13
accepted date: 2017-02-13
in scheme: emissions_variables_MMR

1.A.3.e [Other Transportation][Fuels][Emissions][N2O][kt][no source][no method][no target][no option][no type]
type: Concept
definition: 1.A.3.e [Other Transportation][Fuels][Emissions][N2O][kt][no source][no method][no target][no option][no type]
status: valid
status modified: 2017-02-13
accepted date: 2017-02-13
in scheme: emissions_variables_MMR

1.A.3.e [Other Transportation][Fuels][Emissions][NMVOC][kt][no source][no method][no target][no option][no type]
type: Concept
definition: 1.A.3.e [Other Transportation][Fuels][Emissions][NMVOC][kt][no source][no method][no target][no option][no type]
status: valid
status modified: 2017-02-13
accepted date: 2017-02-13
in scheme: emissions_variables_MMR

1.A.3.e [Other Transportation][Fuels][Emissions][NOx][kt][no source][no method][no target][no option][no type]
type: Concept
definition: 1.A.3.e [Other Transportation][Fuels][Emissions][NOx][kt][no source][no method][no target][no option][no type]
status: valid
status modified: 2017-02-13
accepted date: 2017-02-13
in scheme: emissions_variables_MMR

1.A.3.e [Other Transportation][Fuels][Emissions][SO2][kt][no source][no method][no target][no option][no type]
type: Concept
definition: 1.A.3.e [Other Transportation][Fuels][Emissions][SO2][kt][no source][no method][no target][no option][no type]
status: valid
status modified: 2017-02-13
accepted date: 2017-02-13
in scheme: emissions_variables_MMR

1.A.3.e [Other Transportation][Gaseous Fuels][Emissions][CH4][kt][no source][no method][no target][no option][no type]
type: Concept
definition: 1.A.3.e [Other Transportation][Gaseous Fuels][Emissions][CH4][kt][no source][no method][no target][no option][no type]
status: valid
status modified: 2017-02-13
accepted date: 2017-02-13
in scheme: emissions_variables_MMR

1.A.3.e [Other Transportation][Gaseous Fuels][Emissions][CO2][kt][no source][no method][no target][no option][no type]
type: Concept
definition: 1.A.3.e [Other Transportation][Gaseous Fuels][Emissions][CO2][kt][no source][no method][no target][no option][no type]
status: valid
status modified: 2017-02-13
accepted date: 2017-02-13
in scheme: emissions_variables_MMR

1.A.3.e [Other Transportation][Gaseous Fuels][Emissions][N2O][kt][no source][no method][no target][no option][no type]
type: Concept
definition: 1.A.3.e [Other Transportation][Gaseous Fuels][Emissions][N2O][kt][no source][no method][no target][no option][no type]
status: valid
status modified: 2017-02-13
accepted date: 2017-02-13
in scheme: emissions_variables_MMR

1.A.3.e [Other Transportation][Liquid Fuels][Emissions][CH4][kt][no source][no method][no target][no option][no type]
type: Concept
definition: 1.A.3.e [Other Transportation][Liquid Fuels][Emissions][CH4][kt][no source][no method][no target][no option][no type]
status: valid
status modified: 2017-02-13
accepted date: 2017-02-13
in scheme: emissions_variables_MMR

1.A.3.e [Other Transportation][Liquid Fuels][Emissions][CO2][kt][no source][no method][no target][no option][no type]
type: Concept
definition: 1.A.3.e [Other Transportation][Liquid Fuels][Emissions][CO2][kt][no source][no method][no target][no option][no type]
status: valid
status modified: 2017-02-13
accepted date: 2017-02-13
in scheme: emissions_variables_MMR

1.A.3.e [Other Transportation][Liquid Fuels][Emissions][N2O][kt][no source][no method][no target][no option][no type]
type: Concept
definition: 1.A.3.e [Other Transportation][Liquid Fuels][Emissions][N2O][kt][no source][no method][no target][no option][no type]
status: valid
status modified: 2017-02-13
accepted date: 2017-02-13
in scheme: emissions_variables_MMR

1.A.3.e [Other Transportation][Other Fossil Fuels][Emissions][CH4][kt][no source][no method][no target][no option][no type]
type: Concept
definition: 1.A.3.e [Other Transportation][Other Fossil Fuels][Emissions][CH4][kt][no source][no method][no target][no option][no type]
status: valid
status modified: 2017-02-13
accepted date: 2017-02-13
in scheme: emissions_variables_MMR

1.A.3.e [Other Transportation][Other Fossil Fuels][Emissions][CO2][kt][no source][no method][no target][no option][no type]
type: Concept
definition: 1.A.3.e [Other Transportation][Other Fossil Fuels][Emissions][CO2][kt][no source][no method][no target][no option][no type]
status: valid
status modified: 2017-02-13
accepted date: 2017-02-13
in scheme: emissions_variables_MMR

1.A.3.e [Other Transportation][Other Fossil Fuels][Emissions][N2O][kt][no source][no method][no target][no option][no type]
type: Concept
definition: 1.A.3.e [Other Transportation][Other Fossil Fuels][Emissions][N2O][kt][no source][no method][no target][no option][no type]
status: valid
status modified: 2017-02-13
accepted date: 2017-02-13
in scheme: emissions_variables_MMR

1.A.3.e [Other Transportation][Solid Fuels][Emissions][CH4][kt][no source][no method][no target][no option][no type]
type: Concept
definition: 1.A.3.e [Other Transportation][Solid Fuels][Emissions][CH4][kt][no source][no method][no target][no option][no type]
status: valid
status modified: 2017-02-13
accepted date: 2017-02-13
in scheme: emissions_variables_MMR

1.A.3.e [Other Transportation][Solid Fuels][Emissions][CO2][kt][no source][no method][no target][no option][no type]
type: Concept
definition: 1.A.3.e [Other Transportation][Solid Fuels][Emissions][CO2][kt][no source][no method][no target][no option][no type]
status: valid
status modified: 2017-02-13
accepted date: 2017-02-13
in scheme: emissions_variables_MMR

1.A.3.e [Other Transportation][Solid Fuels][Emissions][N2O][kt][no source][no method][no target][no option][no type]
type: Concept
definition: 1.A.3.e [Other Transportation][Solid Fuels][Emissions][N2O][kt][no source][no method][no target][no option][no type]
status: valid
status modified: 2017-02-13
accepted date: 2017-02-13
in scheme: emissions_variables_MMR

1.A.3.e.i [Pipeline Transport][Fuels][Emissions][CH4][kt][no source][no method][no target][no option][no type]
type: Concept
definition: 1.A.3.e.i [Pipeline Transport][Fuels][Emissions][CH4][kt][no source][no method][no target][no option][no type]
status: valid
status modified: 2017-02-13
accepted date: 2017-02-13
in scheme: emissions_variables_MMR

1.A.3.e.i [Pipeline Transport][Fuels][Emissions][CO2][kt][no source][no method][no target][no option][no type]
type: Concept
definition: 1.A.3.e.i [Pipeline Transport][Fuels][Emissions][CO2][kt][no source][no method][no target][no option][no type]
status: valid
status modified: 2017-02-13
accepted date: 2017-02-13
in scheme: emissions_variables_MMR

1.A.3.e.i [Pipeline Transport][Fuels][Emissions][N2O][kt][no source][no method][no target][no option][no type]
type: Concept
definition: 1.A.3.e.i [Pipeline Transport][Fuels][Emissions][N2O][kt][no source][no method][no target][no option][no type]
status: valid
status modified: 2017-02-13
accepted date: 2017-02-13
in scheme: emissions_variables_MMR

1.A.3.e.i Biomass [Pipeline Transport][Biomass][Emissions][CH4][kt][no source][no method][no target][no option][no type]
type: Concept
definition: 1.A.3.e.i Biomass [Pipeline Transport][Biomass][Emissions][CH4][kt][no source][no method][no target][no option][no type]
status: valid
status modified: 2017-02-13
accepted date: 2017-02-13
in scheme: emissions_variables_MMR

1.A.3.e.i Biomass [Pipeline Transport][Biomass][Emissions][CO2][kt][no source][no method][no target][no option][no type]
type: Concept
definition: 1.A.3.e.i Biomass [Pipeline Transport][Biomass][Emissions][CO2][kt][no source][no method][no target][no option][no type]
status: valid
status modified: 2017-02-13
accepted date: 2017-02-13
in scheme: emissions_variables_MMR

1.A.3.e.i Biomass [Pipeline Transport][Biomass][Emissions][N2O][kt][no source][no method][no target][no option][no type]
type: Concept
definition: 1.A.3.e.i Biomass [Pipeline Transport][Biomass][Emissions][N2O][kt][no source][no method][no target][no option][no type]
status: valid
status modified: 2017-02-13
accepted date: 2017-02-13
in scheme: emissions_variables_MMR

1.A.3.e.i Gaseous Fuels [Pipeline Transport][Gaseous Fuels][Emissions][CH4][kt][no source][no method][no target][no option][no type]
type: Concept
definition: 1.A.3.e.i Gaseous Fuels [Pipeline Transport][Gaseous Fuels][Emissions][CH4][kt][no source][no method][no target][no option][no type]
status: valid
status modified: 2017-02-13
accepted date: 2017-02-13
in scheme: emissions_variables_MMR

1.A.3.e.i Gaseous Fuels [Pipeline Transport][Gaseous Fuels][Emissions][CO2][kt][no source][no method][no target][no option][no type]
type: Concept
definition: 1.A.3.e.i Gaseous Fuels [Pipeline Transport][Gaseous Fuels][Emissions][CO2][kt][no source][no method][no target][no option][no type]
status: valid
status modified: 2017-02-13
accepted date: 2017-02-13
in scheme: emissions_variables_MMR

1.A.3.e.i Gaseous Fuels [Pipeline Transport][Gaseous Fuels][Emissions][N2O][kt][no source][no method][no target][no option][no type]
type: Concept
definition: 1.A.3.e.i Gaseous Fuels [Pipeline Transport][Gaseous Fuels][Emissions][N2O][kt][no source][no method][no target][no option][no type]
status: valid
status modified: 2017-02-13
accepted date: 2017-02-13
in scheme: emissions_variables_MMR

1.A.3.e.i Liquid Fuels [Pipeline Transport][Liquid Fuels][Emissions][CH4][kt][no source][no method][no target][no option][no type]
type: Concept
definition: 1.A.3.e.i Liquid Fuels [Pipeline Transport][Liquid Fuels][Emissions][CH4][kt][no source][no method][no target][no option][no type]
status: valid
status modified: 2017-02-13
accepted date: 2017-02-13
in scheme: emissions_variables_MMR

1.A.3.e.i Liquid Fuels [Pipeline Transport][Liquid Fuels][Emissions][CO2][kt][no source][no method][no target][no option][no type]
type: Concept
definition: 1.A.3.e.i Liquid Fuels [Pipeline Transport][Liquid Fuels][Emissions][CO2][kt][no source][no method][no target][no option][no type]
status: valid
status modified: 2017-02-13
accepted date: 2017-02-13
in scheme: emissions_variables_MMR

1.A.3.e.i Liquid Fuels [Pipeline Transport][Liquid Fuels][Emissions][N2O][kt][no source][no method][no target][no option][no type]
type: Concept
definition: 1.A.3.e.i Liquid Fuels [Pipeline Transport][Liquid Fuels][Emissions][N2O][kt][no source][no method][no target][no option][no type]
status: valid
status modified: 2017-02-13
accepted date: 2017-02-13
in scheme: emissions_variables_MMR

1.A.3.e.i Other Fossil Fuels [Pipeline Transport][Other Fossil Fuels][Emissions][CH4][kt][no source][no method][no target][no option][no type]
type: Concept
definition: 1.A.3.e.i Other Fossil Fuels [Pipeline Transport][Other Fossil Fuels][Emissions][CH4][kt][no source][no method][no target][no option][no type]
status: valid
status modified: 2017-02-13
accepted date: 2017-02-13
in scheme: emissions_variables_MMR

1.A.3.e.i Other Fossil Fuels [Pipeline Transport][Other Fossil Fuels][Emissions][CO2][kt][no source][no method][no target][no option][no type]
type: Concept
definition: 1.A.3.e.i Other Fossil Fuels [Pipeline Transport][Other Fossil Fuels][Emissions][CO2][kt][no source][no method][no target][no option][no type]
status: valid
status modified: 2017-02-13
accepted date: 2017-02-13
in scheme: emissions_variables_MMR

1.A.3.e.i Other Fossil Fuels [Pipeline Transport][Other Fossil Fuels][Emissions][N2O][kt][no source][no method][no target][no option][no type]
type: Concept
definition: 1.A.3.e.i Other Fossil Fuels [Pipeline Transport][Other Fossil Fuels][Emissions][N2O][kt][no source][no method][no target][no option][no type]
status: valid
status modified: 2017-02-13
accepted date: 2017-02-13
in scheme: emissions_variables_MMR

1.A.3.e.i Solid Fuels [Pipeline Transport][Solid Fuels][Emissions][CH4][kt][no source][no method][no target][no option][no type]
type: Concept
definition: 1.A.3.e.i Solid Fuels [Pipeline Transport][Solid Fuels][Emissions][CH4][kt][no source][no method][no target][no option][no type]
status: valid
status modified: 2017-02-13
accepted date: 2017-02-13
in scheme: emissions_variables_MMR

1.A.3.e.i Solid Fuels [Pipeline Transport][Solid Fuels][Emissions][CO2][kt][no source][no method][no target][no option][no type]
type: Concept
definition: 1.A.3.e.i Solid Fuels [Pipeline Transport][Solid Fuels][Emissions][CO2][kt][no source][no method][no target][no option][no type]
status: valid
status modified: 2017-02-13
accepted date: 2017-02-13
in scheme: emissions_variables_MMR

1.A.3.e.i Solid Fuels [Pipeline Transport][Solid Fuels][Emissions][N2O][kt][no source][no method][no target][no option][no type]
type: Concept
definition: 1.A.3.e.i Solid Fuels [Pipeline Transport][Solid Fuels][Emissions][N2O][kt][no source][no method][no target][no option][no type]
status: valid
status modified: 2017-02-13
accepted date: 2017-02-13
in scheme: emissions_variables_MMR

1.A.3.e.ii Other [Other non pipeline transport][Biomass][Emissions][CH4][kt][no source][no method][no target][no option][no type]
type: Concept
definition: 1.A.3.e.ii Other [Other non pipeline transport][Biomass][Emissions][CH4][kt][no source][no method][no target][no option][no type]
status: valid
status modified: 2017-02-13
accepted date: 2017-02-13
in scheme: emissions_variables_MMR

1.A.3.e.ii Other [Other non pipeline transport][Biomass][Emissions][CO2][kt][no source][no method][no target][no option][no type]
type: Concept
definition: 1.A.3.e.ii Other [Other non pipeline transport][Biomass][Emissions][CO2][kt][no source][no method][no target][no option][no type]
status: valid
status modified: 2017-02-13
accepted date: 2017-02-13
in scheme: emissions_variables_MMR

1.A.3.e.ii Other [Other non pipeline transport][Biomass][Emissions][N2O][kt][no source][no method][no target][no option][no type]
type: Concept
definition: 1.A.3.e.ii Other [Other non pipeline transport][Biomass][Emissions][N2O][kt][no source][no method][no target][no option][no type]
status: valid
status modified: 2017-02-13
accepted date: 2017-02-13
in scheme: emissions_variables_MMR

1.A.3.e.ii Other [Other non pipeline transport][Fuels][Emissions][CH4][kt][no source][no method][no target][no option][no type]
type: Concept
definition: 1.A.3.e.ii Other [Other non pipeline transport][Fuels][Emissions][CH4][kt][no source][no method][no target][no option][no type]
status: valid
status modified: 2017-02-13
accepted date: 2017-02-13
in scheme: emissions_variables_MMR

1.A.3.e.ii Other [Other non pipeline transport][Fuels][Emissions][CO2][kt][no source][no method][no target][no option][no type]
type: Concept
definition: 1.A.3.e.ii Other [Other non pipeline transport][Fuels][Emissions][CO2][kt][no source][no method][no target][no option][no type]
status: valid
status modified: 2017-02-13
accepted date: 2017-02-13
in scheme: emissions_variables_MMR

1.A.3.e.ii Other [Other non pipeline transport][Fuels][Emissions][N2O][kt][no source][no method][no target][no option][no type]
type: Concept
definition: 1.A.3.e.ii Other [Other non pipeline transport][Fuels][Emissions][N2O][kt][no source][no method][no target][no option][no type]
status: valid
status modified: 2017-02-13
accepted date: 2017-02-13
in scheme: emissions_variables_MMR

1.A.3.e.ii Other [Other non pipeline transport][Gaseous Fuels][Emissions][CH4][kt][no source][no method][no target][no option][no type]
type: Concept
definition: 1.A.3.e.ii Other [Other non pipeline transport][Gaseous Fuels][Emissions][CH4][kt][no source][no method][no target][no option][no type]
status: valid
status modified: 2017-02-13
accepted date: 2017-02-13
in scheme: emissions_variables_MMR

1.A.3.e.ii Other [Other non pipeline transport][Gaseous Fuels][Emissions][CO2][kt][no source][no method][no target][no option][no type]
type: Concept
definition: 1.A.3.e.ii Other [Other non pipeline transport][Gaseous Fuels][Emissions][CO2][kt][no source][no method][no target][no option][no type]
status: valid
status modified: 2017-02-13
accepted date: 2017-02-13
in scheme: emissions_variables_MMR

1.A.3.e.ii Other [Other non pipeline transport][Gaseous Fuels][Emissions][N2O][kt][no source][no method][no target][no option][no type]
type: Concept
definition: 1.A.3.e.ii Other [Other non pipeline transport][Gaseous Fuels][Emissions][N2O][kt][no source][no method][no target][no option][no type]
status: valid
status modified: 2017-02-13
accepted date: 2017-02-13
in scheme: emissions_variables_MMR

1.A.3.e.ii Other [Other non pipeline transport][Liquid Fuels][Emissions][CH4][kt][no source][no method][no target][no option][no type]
type: Concept
definition: 1.A.3.e.ii Other [Other non pipeline transport][Liquid Fuels][Emissions][CH4][kt][no source][no method][no target][no option][no type]
status: valid
status modified: 2017-02-13
accepted date: 2017-02-13
in scheme: emissions_variables_MMR

1.A.3.e.ii Other [Other non pipeline transport][Liquid Fuels][Emissions][CO2][kt][no source][no method][no target][no option][no type]
type: Concept
definition: 1.A.3.e.ii Other [Other non pipeline transport][Liquid Fuels][Emissions][CO2][kt][no source][no method][no target][no option][no type]
status: valid
status modified: 2017-02-13
accepted date: 2017-02-13
in scheme: emissions_variables_MMR

1.A.3.e.ii Other [Other non pipeline transport][Liquid Fuels][Emissions][N2O][kt][no source][no method][no target][no option][no type]
type: Concept
definition: 1.A.3.e.ii Other [Other non pipeline transport][Liquid Fuels][Emissions][N2O][kt][no source][no method][no target][no option][no type]
status: valid
status modified: 2017-02-13
accepted date: 2017-02-13
in scheme: emissions_variables_MMR

1.A.3.e.ii Other [Other non pipeline transport][Other Fossil Fuels][Emissions][CH4][kt][no source][no method][no target][no option][no type]
type: Concept
definition: 1.A.3.e.ii Other [Other non pipeline transport][Other Fossil Fuels][Emissions][CH4][kt][no source][no method][no target][no option][no type]
status: valid
status modified: 2017-02-13
accepted date: 2017-02-13
in scheme: emissions_variables_MMR

1.A.3.e.ii Other [Other non pipeline transport][Other Fossil Fuels][Emissions][CO2][kt][no source][no method][no target][no option][no type]
type: Concept
definition: 1.A.3.e.ii Other [Other non pipeline transport][Other Fossil Fuels][Emissions][CO2][kt][no source][no method][no target][no option][no type]
status: valid
status modified: 2017-02-13
accepted date: 2017-02-13
in scheme: emissions_variables_MMR

1.A.3.e.ii Other [Other non pipeline transport][Other Fossil Fuels][Emissions][N2O][kt][no source][no method][no target][no option][no type]
type: Concept
definition: 1.A.3.e.ii Other [Other non pipeline transport][Other Fossil Fuels][Emissions][N2O][kt][no source][no method][no target][no option][no type]
status: valid
status modified: 2017-02-13
accepted date: 2017-02-13
in scheme: emissions_variables_MMR

1.A.3.e.ii Other [Other non pipeline transport][Solid Fuels][Emissions][CH4][kt][no source][no method][no target][no option][no type]
type: Concept
definition: 1.A.3.e.ii Other [Other non pipeline transport][Solid Fuels][Emissions][CH4][kt][no source][no method][no target][no option][no type]
status: valid
status modified: 2017-02-13
accepted date: 2017-02-13
in scheme: emissions_variables_MMR

1.A.3.e.ii Other [Other non pipeline transport][Solid Fuels][Emissions][CO2][kt][no source][no method][no target][no option][no type]
type: Concept
definition: 1.A.3.e.ii Other [Other non pipeline transport][Solid Fuels][Emissions][CO2][kt][no source][no method][no target][no option][no type]
status: valid
status modified: 2017-02-13
accepted date: 2017-02-13
in scheme: emissions_variables_MMR

1.A.3.e.ii Other [Other non pipeline transport][Solid Fuels][Emissions][N2O][kt][no source][no method][no target][no option][no type]
type: Concept
definition: 1.A.3.e.ii Other [Other non pipeline transport][Solid Fuels][Emissions][N2O][kt][no source][no method][no target][no option][no type]
status: valid
status modified: 2017-02-13
accepted date: 2017-02-13
in scheme: emissions_variables_MMR

1.A.4 [Other Sectors][Biomass][Emissions][CH4][kt][no source][no method][no target][no option][no type]
type: Concept
definition: 1.A.4 [Other Sectors][Biomass][Emissions][CH4][kt][no source][no method][no target][no option][no type]
status: valid
status modified: 2017-02-13
accepted date: 2017-02-13
in scheme: emissions_variables_MMR

1.A.4 [Other Sectors][Biomass][Emissions][CO2][kt][no source][no method][no target][no option][no type]
type: Concept
definition: 1.A.4 [Other Sectors][Biomass][Emissions][CO2][kt][no source][no method][no target][no option][no type]
status: valid
status modified: 2017-02-13
accepted date: 2017-02-13
in scheme: emissions_variables_MMR

1.A.4 [Other Sectors][Biomass][Emissions][N2O][kt][no source][no method][no target][no option][no type]
type: Concept
definition: 1.A.4 [Other Sectors][Biomass][Emissions][N2O][kt][no source][no method][no target][no option][no type]
status: valid
status modified: 2017-02-13
accepted date: 2017-02-13
in scheme: emissions_variables_MMR

1.A.4 [Other Sectors][Fuels][Emissions][Aggregate GHGs][kt CO2 equivalent][no source][no method][no target][no option][no type]
type: Concept
definition: 1.A.4 [Other Sectors][Fuels][Emissions][Aggregate GHGs][kt CO2 equivalent][no source][no method][no target][no option][no type]
status: valid
status modified: 2017-02-13
accepted date: 2017-02-13
in scheme: emissions_variables_MMR

1.A.4 [Other Sectors][Fuels][Emissions][CH4][kt][no source][no method][no target][no option][no type]
type: Concept
definition: 1.A.4 [Other Sectors][Fuels][Emissions][CH4][kt][no source][no method][no target][no option][no type]
status: valid
status modified: 2017-02-13
accepted date: 2017-02-13
in scheme: emissions_variables_MMR

1.A.4 [Other Sectors][Fuels][Emissions][CO][kt][no source][no method][no target][no option][no type]
type: Concept
definition: 1.A.4 [Other Sectors][Fuels][Emissions][CO][kt][no source][no method][no target][no option][no type]
status: valid
status modified: 2017-02-13
accepted date: 2017-02-13
in scheme: emissions_variables_MMR

1.A.4 [Other Sectors][Fuels][Emissions][CO2][kt][no source][no method][no target][no option][no type]
type: Concept
definition: 1.A.4 [Other Sectors][Fuels][Emissions][CO2][kt][no source][no method][no target][no option][no type]
status: valid
status modified: 2017-02-13
accepted date: 2017-02-13
in scheme: emissions_variables_MMR

1.A.4 [Other Sectors][Fuels][Emissions][N2O][kt][no source][no method][no target][no option][no type]
type: Concept
definition: 1.A.4 [Other Sectors][Fuels][Emissions][N2O][kt][no source][no method][no target][no option][no type]
status: valid
status modified: 2017-02-13
accepted date: 2017-02-13
in scheme: emissions_variables_MMR

1.A.4 [Other Sectors][Fuels][Emissions][NMVOC][kt][no source][no method][no target][no option][no type]
type: Concept
definition: 1.A.4 [Other Sectors][Fuels][Emissions][NMVOC][kt][no source][no method][no target][no option][no type]
status: valid
status modified: 2017-02-13
accepted date: 2017-02-13
in scheme: emissions_variables_MMR

1.A.4 [Other Sectors][Fuels][Emissions][NOx][kt][no source][no method][no target][no option][no type]
type: Concept
definition: 1.A.4 [Other Sectors][Fuels][Emissions][NOx][kt][no source][no method][no target][no option][no type]
status: valid
status modified: 2017-02-13
accepted date: 2017-02-13
in scheme: emissions_variables_MMR

1.A.4 [Other Sectors][Fuels][Emissions][SO2][kt][no source][no method][no target][no option][no type]
type: Concept
definition: 1.A.4 [Other Sectors][Fuels][Emissions][SO2][kt][no source][no method][no target][no option][no type]
status: valid
status modified: 2017-02-13
accepted date: 2017-02-13
in scheme: emissions_variables_MMR

1.A.4 [Other Sectors][Gaseous Fuels][Emissions][CH4][kt][no source][no method][no target][no option][no type]
type: Concept
definition: 1.A.4 [Other Sectors][Gaseous Fuels][Emissions][CH4][kt][no source][no method][no target][no option][no type]
status: valid
status modified: 2017-02-13
accepted date: 2017-02-13
in scheme: emissions_variables_MMR

1.A.4 [Other Sectors][Gaseous Fuels][Emissions][CO2][kt][no source][no method][no target][no option][no type]
type: Concept
definition: 1.A.4 [Other Sectors][Gaseous Fuels][Emissions][CO2][kt][no source][no method][no target][no option][no type]
status: valid
status modified: 2017-02-13
accepted date: 2017-02-13
in scheme: emissions_variables_MMR

1.A.4 [Other Sectors][Gaseous Fuels][Emissions][N2O][kt][no source][no method][no target][no option][no type]
type: Concept
definition: 1.A.4 [Other Sectors][Gaseous Fuels][Emissions][N2O][kt][no source][no method][no target][no option][no type]
status: valid
status modified: 2017-02-13
accepted date: 2017-02-13
in scheme: emissions_variables_MMR

1.A.4 [Other Sectors][Liquid Fuels][Emissions][CH4][kt][no source][no method][no target][no option][no type]
type: Concept
definition: 1.A.4 [Other Sectors][Liquid Fuels][Emissions][CH4][kt][no source][no method][no target][no option][no type]
status: valid
status modified: 2017-02-13
accepted date: 2017-02-13
in scheme: emissions_variables_MMR

1.A.4 [Other Sectors][Liquid Fuels][Emissions][CO2][kt][no source][no method][no target][no option][no type]
type: Concept
definition: 1.A.4 [Other Sectors][Liquid Fuels][Emissions][CO2][kt][no source][no method][no target][no option][no type]
status: valid
status modified: 2017-02-13
accepted date: 2017-02-13
in scheme: emissions_variables_MMR

1.A.4 [Other Sectors][Liquid Fuels][Emissions][N2O][kt][no source][no method][no target][no option][no type]
type: Concept
definition: 1.A.4 [Other Sectors][Liquid Fuels][Emissions][N2O][kt][no source][no method][no target][no option][no type]
status: valid
status modified: 2017-02-13
accepted date: 2017-02-13
in scheme: emissions_variables_MMR

1.A.4 [Other Sectors][Other Fossil Fuels][Emissions][CH4][kt][no source][no method][no target][no option][no type]
type: Concept
definition: 1.A.4 [Other Sectors][Other Fossil Fuels][Emissions][CH4][kt][no source][no method][no target][no option][no type]
status: valid
status modified: 2017-02-13
accepted date: 2017-02-13
in scheme: emissions_variables_MMR

1.A.4 [Other Sectors][Other Fossil Fuels][Emissions][CO2][kt][no source][no method][no target][no option][no type]
type: Concept
definition: 1.A.4 [Other Sectors][Other Fossil Fuels][Emissions][CO2][kt][no source][no method][no target][no option][no type]
status: valid
status modified: 2017-02-13
accepted date: 2017-02-13
in scheme: emissions_variables_MMR

1.A.4 [Other Sectors][Other Fossil Fuels][Emissions][N2O][kt][no source][no method][no target][no option][no type]
type: Concept
definition: 1.A.4 [Other Sectors][Other Fossil Fuels][Emissions][N2O][kt][no source][no method][no target][no option][no type]
status: valid
status modified: 2017-02-13
accepted date: 2017-02-13
in scheme: emissions_variables_MMR

1.A.4 [Other Sectors][Peat][Emissions][CH4][kt][no source][no method][no target][no option][no type]
type: Concept
definition: 1.A.4 [Other Sectors][Peat][Emissions][CH4][kt][no source][no method][no target][no option][no type]
status: valid
status modified: 2017-02-13
accepted date: 2017-02-13
in scheme: emissions_variables_MMR

1.A.4 [Other Sectors][Peat][Emissions][CO2][kt][no source][no method][no target][no option][no type]
type: Concept
definition: 1.A.4 [Other Sectors][Peat][Emissions][CO2][kt][no source][no method][no target][no option][no type]
status: valid
status modified: 2017-02-13
accepted date: 2017-02-13
in scheme: emissions_variables_MMR

1.A.4 [Other Sectors][Peat][Emissions][N2O][kt][no source][no method][no target][no option][no type]
type: Concept
definition: 1.A.4 [Other Sectors][Peat][Emissions][N2O][kt][no source][no method][no target][no option][no type]
status: valid
status modified: 2017-02-13
accepted date: 2017-02-13
in scheme: emissions_variables_MMR

1.A.4 [Other Sectors][Solid Fuels][Emissions][CH4][kt][no source][no method][no target][no option][no type]
type: Concept
definition: 1.A.4 [Other Sectors][Solid Fuels][Emissions][CH4][kt][no source][no method][no target][no option][no type]
status: valid
status modified: 2017-02-13
accepted date: 2017-02-13
in scheme: emissions_variables_MMR

1.A.4 [Other Sectors][Solid Fuels][Emissions][CO2][kt][no source][no method][no target][no option][no type]
type: Concept
definition: 1.A.4 [Other Sectors][Solid Fuels][Emissions][CO2][kt][no source][no method][no target][no option][no type]
status: valid
status modified: 2017-02-13
accepted date: 2017-02-13
in scheme: emissions_variables_MMR

1.A.4 [Other Sectors][Solid Fuels][Emissions][N2O][kt][no source][no method][no target][no option][no type]
type: Concept
definition: 1.A.4 [Other Sectors][Solid Fuels][Emissions][N2O][kt][no source][no method][no target][no option][no type]
status: valid
status modified: 2017-02-13
accepted date: 2017-02-13
in scheme: emissions_variables_MMR

1.A.4.a [Commercial/Institutional][Biomass][Emissions][CH4][kt][no source][no method][no target][no option][no type]
type: Concept
definition: 1.A.4.a [Commercial/Institutional][Biomass][Emissions][CH4][kt][no source][no method][no target][no option][no type]
status: valid
status modified: 2017-02-13
accepted date: 2017-02-13
in scheme: emissions_variables_MMR

1.A.4.a [Commercial/Institutional][Biomass][Emissions][CO2][kt][no source][no method][no target][no option][no type]
type: Concept
definition: 1.A.4.a [Commercial/Institutional][Biomass][Emissions][CO2][kt][no source][no method][no target][no option][no type]
status: valid
status modified: 2017-02-13
accepted date: 2017-02-13
in scheme: emissions_variables_MMR

1.A.4.a [Commercial/Institutional][Biomass][Emissions][N2O][kt][no source][no method][no target][no option][no type]
type: Concept
definition: 1.A.4.a [Commercial/Institutional][Biomass][Emissions][N2O][kt][no source][no method][no target][no option][no type]
status: valid
status modified: 2017-02-13
accepted date: 2017-02-13
in scheme: emissions_variables_MMR

1.A.4.a [Commercial/Institutional][Fossil fuels][Emissions][CO2][kt][no source][no method][no target][no option][no type]
type: Concept
definition: 1.A.4.a [Commercial/Institutional][Fossil fuels][Emissions][CO2][kt][no source][no method][no target][no option][no type]
status: valid
status modified: 2017-02-13
accepted date: 2017-02-13
in scheme: emissions_variables_MMR

1.A.4.a [Commercial/Institutional][Fuels][Emissions][CH4][kt][no source][no method][no target][no option][no type]
type: Concept
definition: 1.A.4.a [Commercial/Institutional][Fuels][Emissions][CH4][kt][no source][no method][no target][no option][no type]
status: valid
status modified: 2017-02-13
accepted date: 2017-02-13
in scheme: emissions_variables_MMR

1.A.4.a [Commercial/Institutional][Fuels][Emissions][CO][kt][no source][no method][no target][no option][no type]
type: Concept
definition: 1.A.4.a [Commercial/Institutional][Fuels][Emissions][CO][kt][no source][no method][no target][no option][no type]
status: valid
status modified: 2017-02-13
accepted date: 2017-02-13
in scheme: emissions_variables_MMR

1.A.4.a [Commercial/Institutional][Fuels][Emissions][N2O][kt][no source][no method][no target][no option][no type]
type: Concept
definition: 1.A.4.a [Commercial/Institutional][Fuels][Emissions][N2O][kt][no source][no method][no target][no option][no type]
status: valid
status modified: 2017-02-13
accepted date: 2017-02-13
in scheme: emissions_variables_MMR

1.A.4.a [Commercial/Institutional][Fuels][Emissions][NMVOC][kt][no source][no method][no target][no option][no type]
type: Concept
definition: 1.A.4.a [Commercial/Institutional][Fuels][Emissions][NMVOC][kt][no source][no method][no target][no option][no type]
status: valid
status modified: 2017-02-13
accepted date: 2017-02-13
in scheme: emissions_variables_MMR

1.A.4.a [Commercial/Institutional][Fuels][Emissions][NOx][kt][no source][no method][no target][no option][no type]
type: Concept
definition: 1.A.4.a [Commercial/Institutional][Fuels][Emissions][NOx][kt][no source][no method][no target][no option][no type]
status: valid
status modified: 2017-02-13
accepted date: 2017-02-13
in scheme: emissions_variables_MMR

1.A.4.a [Commercial/Institutional][Fuels][Emissions][SO2][kt][no source][no method][no target][no option][no type]
type: Concept
definition: 1.A.4.a [Commercial/Institutional][Fuels][Emissions][SO2][kt][no source][no method][no target][no option][no type]
status: valid
status modified: 2017-02-13
accepted date: 2017-02-13
in scheme: emissions_variables_MMR

1.A.4.a [Commercial/Institutional][Gaseous Fuels][Emissions][CH4][kt][no source][no method][no target][no option][no type]
type: Concept
definition: 1.A.4.a [Commercial/Institutional][Gaseous Fuels][Emissions][CH4][kt][no source][no method][no target][no option][no type]
status: valid
status modified: 2017-02-13
accepted date: 2017-02-13
in scheme: emissions_variables_MMR

1.A.4.a [Commercial/Institutional][Gaseous Fuels][Emissions][CO2][kt][no source][no method][no target][no option][no type]
type: Concept
definition: 1.A.4.a [Commercial/Institutional][Gaseous Fuels][Emissions][CO2][kt][no source][no method][no target][no option][no type]
status: valid
status modified: 2017-02-13
accepted date: 2017-02-13
in scheme: emissions_variables_MMR

1.A.4.a [Commercial/Institutional][Gaseous Fuels][Emissions][N2O][kt][no source][no method][no target][no option][no type]
type: Concept
definition: 1.A.4.a [Commercial/Institutional][Gaseous Fuels][Emissions][N2O][kt][no source][no method][no target][no option][no type]
status: valid
status modified: 2017-02-13
accepted date: 2017-02-13
in scheme: emissions_variables_MMR

1.A.4.a [Commercial/Institutional][Liquid Fuels][Emissions][CH4][kt][no source][no method][no target][no option][no type]
type: Concept
definition: 1.A.4.a [Commercial/Institutional][Liquid Fuels][Emissions][CH4][kt][no source][no method][no target][no option][no type]
status: valid
status modified: 2017-02-13
accepted date: 2017-02-13
in scheme: emissions_variables_MMR

1.A.4.a [Commercial/Institutional][Liquid Fuels][Emissions][CO2][kt][no source][no method][no target][no option][no type]
type: Concept
definition: 1.A.4.a [Commercial/Institutional][Liquid Fuels][Emissions][CO2][kt][no source][no method][no target][no option][no type]
status: valid
status modified: 2017-02-13
accepted date: 2017-02-13
in scheme: emissions_variables_MMR

1.A.4.a [Commercial/Institutional][Liquid Fuels][Emissions][N2O][kt][no source][no method][no target][no option][no type]
type: Concept
definition: 1.A.4.a [Commercial/Institutional][Liquid Fuels][Emissions][N2O][kt][no source][no method][no target][no option][no type]
status: valid
status modified: 2017-02-13
accepted date: 2017-02-13
in scheme: emissions_variables_MMR

1.A.4.a [Commercial/Institutional][Other Fossil Fuels][Emissions][CH4][kt][no source][no method][no target][no option][no type]
type: Concept
definition: 1.A.4.a [Commercial/Institutional][Other Fossil Fuels][Emissions][CH4][kt][no source][no method][no target][no option][no type]
status: valid
status modified: 2017-02-13
accepted date: 2017-02-13
in scheme: emissions_variables_MMR

1.A.4.a [Commercial/Institutional][Other Fossil Fuels][Emissions][CO2][kt][no source][no method][no target][no option][no type]
type: Concept
definition: 1.A.4.a [Commercial/Institutional][Other Fossil Fuels][Emissions][CO2][kt][no source][no method][no target][no option][no type]
status: valid
status modified: 2017-02-13
accepted date: 2017-02-13
in scheme: emissions_variables_MMR

1.A.4.a [Commercial/Institutional][Other Fossil Fuels][Emissions][N2O][kt][no source][no method][no target][no option][no type]
type: Concept
definition: 1.A.4.a [Commercial/Institutional][Other Fossil Fuels][Emissions][N2O][kt][no source][no method][no target][no option][no type]
status: valid
status modified: 2017-02-13
accepted date: 2017-02-13
in scheme: emissions_variables_MMR

1.A.4.a [Commercial/Institutional][Peat][Emissions][CH4][kt][no source][no method][no target][no option][no type]
type: Concept
definition: 1.A.4.a [Commercial/Institutional][Peat][Emissions][CH4][kt][no source][no method][no target][no option][no type]
status: valid
status modified: 2017-02-13
accepted date: 2017-02-13
in scheme: emissions_variables_MMR

1.A.4.a [Commercial/Institutional][Peat][Emissions][CO2][kt][no source][no method][no target][no option][no type]
type: Concept
definition: 1.A.4.a [Commercial/Institutional][Peat][Emissions][CO2][kt][no source][no method][no target][no option][no type]
status: valid
status modified: 2017-02-13
accepted date: 2017-02-13
in scheme: emissions_variables_MMR

1.A.4.a [Commercial/Institutional][Peat][Emissions][N2O][kt][no source][no method][no target][no option][no type]
type: Concept
definition: 1.A.4.a [Commercial/Institutional][Peat][Emissions][N2O][kt][no source][no method][no target][no option][no type]
status: valid
status modified: 2017-02-13
accepted date: 2017-02-13
in scheme: emissions_variables_MMR

1.A.4.a [Commercial/Institutional][Solid Fuels][Emissions][CH4][kt][no source][no method][no target][no option][no type]
type: Concept
definition: 1.A.4.a [Commercial/Institutional][Solid Fuels][Emissions][CH4][kt][no source][no method][no target][no option][no type]
status: valid
status modified: 2017-02-13
accepted date: 2017-02-13
in scheme: emissions_variables_MMR

1.A.4.a [Commercial/Institutional][Solid Fuels][Emissions][CO2][kt][no source][no method][no target][no option][no type]
type: Concept
definition: 1.A.4.a [Commercial/Institutional][Solid Fuels][Emissions][CO2][kt][no source][no method][no target][no option][no type]
status: valid
status modified: 2017-02-13
accepted date: 2017-02-13
in scheme: emissions_variables_MMR

1.A.4.a [Commercial/Institutional][Solid Fuels][Emissions][N2O][kt][no source][no method][no target][no option][no type]
type: Concept
definition: 1.A.4.a [Commercial/Institutional][Solid Fuels][Emissions][N2O][kt][no source][no method][no target][no option][no type]
status: valid
status modified: 2017-02-13
accepted date: 2017-02-13
in scheme: emissions_variables_MMR

1.A.4.a.i [Commercial/Institutional][Biomass][Emissions][CH4][kt][Stationary combustion][no method][no target][no option][no type]
type: Concept
definition: 1.A.4.a.i [Commercial/Institutional][Biomass][Emissions][CH4][kt][Stationary combustion][no method][no target][no option][no type]
status: valid
status modified: 2017-02-13
accepted date: 2017-02-13
in scheme: emissions_variables_MMR

1.A.4.a.i [Commercial/Institutional][Biomass][Emissions][CO2][kt][Stationary combustion][no method][no target][no option][no type]
type: Concept
definition: 1.A.4.a.i [Commercial/Institutional][Biomass][Emissions][CO2][kt][Stationary combustion][no method][no target][no option][no type]
status: valid
status modified: 2017-02-13
accepted date: 2017-02-13
in scheme: emissions_variables_MMR

1.A.4.a.i [Commercial/Institutional][Biomass][Emissions][N2O][kt][Stationary combustion][no method][no target][no option][no type]
type: Concept
definition: 1.A.4.a.i [Commercial/Institutional][Biomass][Emissions][N2O][kt][Stationary combustion][no method][no target][no option][no type]
status: valid
status modified: 2017-02-13
accepted date: 2017-02-13
in scheme: emissions_variables_MMR

1.A.4.a.i [Commercial/Institutional][Fuels][Emissions][CH4][kt][Stationary combustion][no method][no target][no option][no type]
type: Concept
definition: 1.A.4.a.i [Commercial/Institutional][Fuels][Emissions][CH4][kt][Stationary combustion][no method][no target][no option][no type]
status: valid
status modified: 2017-02-13
accepted date: 2017-02-13
in scheme: emissions_variables_MMR

1.A.4.a.i [Commercial/Institutional][Fuels][Emissions][CO2][kt][Stationary combustion][no method][no target][no option][no type]
type: Concept
definition: 1.A.4.a.i [Commercial/Institutional][Fuels][Emissions][CO2][kt][Stationary combustion][no method][no target][no option][no type]
status: valid
status modified: 2017-02-13
accepted date: 2017-02-13
in scheme: emissions_variables_MMR

1.A.4.a.i [Commercial/Institutional][Fuels][Emissions][N2O][kt][Stationary combustion][no method][no target][no option][no type]
type: Concept
definition: 1.A.4.a.i [Commercial/Institutional][Fuels][Emissions][N2O][kt][Stationary combustion][no method][no target][no option][no type]
status: valid
status modified: 2017-02-13
accepted date: 2017-02-13
in scheme: emissions_variables_MMR

1.A.4.a.i [Commercial/Institutional][Gaseous Fuels][Emissions][CH4][kt][Stationary combustion][no method][no target][no option][no type]
type: Concept
definition: 1.A.4.a.i [Commercial/Institutional][Gaseous Fuels][Emissions][CH4][kt][Stationary combustion][no method][no target][no option][no type]
status: valid
status modified: 2017-02-13
accepted date: 2017-02-13
in scheme: emissions_variables_MMR

1.A.4.a.i [Commercial/Institutional][Gaseous Fuels][Emissions][CO2][kt][Stationary combustion][no method][no target][no option][no type]
type: Concept
definition: 1.A.4.a.i [Commercial/Institutional][Gaseous Fuels][Emissions][CO2][kt][Stationary combustion][no method][no target][no option][no type]
status: valid
status modified: 2017-02-13
accepted date: 2017-02-13
in scheme: emissions_variables_MMR

1.A.4.a.i [Commercial/Institutional][Gaseous Fuels][Emissions][N2O][kt][Stationary combustion][no method][no target][no option][no type]
type: Concept
definition: 1.A.4.a.i [Commercial/Institutional][Gaseous Fuels][Emissions][N2O][kt][Stationary combustion][no method][no target][no option][no type]
status: valid
status modified: 2017-02-13
accepted date: 2017-02-13
in scheme: emissions_variables_MMR

1.A.4.a.i [Commercial/Institutional][Liquid Fuels][Emissions][CH4][kt][Stationary combustion][no method][no target][no option][no type]
type: Concept
definition: 1.A.4.a.i [Commercial/Institutional][Liquid Fuels][Emissions][CH4][kt][Stationary combustion][no method][no target][no option][no type]
status: valid
status modified: 2017-02-13
accepted date: 2017-02-13
in scheme: emissions_variables_MMR

1.A.4.a.i [Commercial/Institutional][Liquid Fuels][Emissions][CO2][kt][Stationary combustion][no method][no target][no option][no type]
type: Concept
definition: 1.A.4.a.i [Commercial/Institutional][Liquid Fuels][Emissions][CO2][kt][Stationary combustion][no method][no target][no option][no type]
status: valid
status modified: 2017-02-13
accepted date: 2017-02-13
in scheme: emissions_variables_MMR

1.A.4.a.i [Commercial/Institutional][Liquid Fuels][Emissions][N2O][kt][Stationary combustion][no method][no target][no option][no type]
type: Concept
definition: 1.A.4.a.i [Commercial/Institutional][Liquid Fuels][Emissions][N2O][kt][Stationary combustion][no method][no target][no option][no type]
status: valid
status modified: 2017-02-13
accepted date: 2017-02-13
in scheme: emissions_variables_MMR

1.A.4.a.i [Commercial/Institutional][Other Fossil Fuels][Emissions][CH4][kt][Stationary combustion][no method][no target][no option][no type]
type: Concept
definition: 1.A.4.a.i [Commercial/Institutional][Other Fossil Fuels][Emissions][CH4][kt][Stationary combustion][no method][no target][no option][no type]
status: valid
status modified: 2017-02-13
accepted date: 2017-02-13
in scheme: emissions_variables_MMR

1.A.4.a.i [Commercial/Institutional][Other Fossil Fuels][Emissions][CO2][kt][Stationary combustion][no method][no target][no option][no type]
type: Concept
definition: 1.A.4.a.i [Commercial/Institutional][Other Fossil Fuels][Emissions][CO2][kt][Stationary combustion][no method][no target][no option][no type]
status: valid
status modified: 2017-02-13
accepted date: 2017-02-13
in scheme: emissions_variables_MMR

1.A.4.a.i [Commercial/Institutional][Other Fossil Fuels][Emissions][N2O][kt][Stationary combustion][no method][no target][no option][no type]
type: Concept
definition: 1.A.4.a.i [Commercial/Institutional][Other Fossil Fuels][Emissions][N2O][kt][Stationary combustion][no method][no target][no option][no type]
status: valid
status modified: 2017-02-13
accepted date: 2017-02-13
in scheme: emissions_variables_MMR

1.A.4.a.i [Commercial/Institutional][Peat][Emissions][CH4][kt][Stationary combustion][no method][no target][no option][no type]
type: Concept
definition: 1.A.4.a.i [Commercial/Institutional][Peat][Emissions][CH4][kt][Stationary combustion][no method][no target][no option][no type]
status: valid
status modified: 2017-02-13
accepted date: 2017-02-13
in scheme: emissions_variables_MMR

1.A.4.a.i [Commercial/Institutional][Peat][Emissions][CO2][kt][Stationary combustion][no method][no target][no option][no type]
type: Concept
definition: 1.A.4.a.i [Commercial/Institutional][Peat][Emissions][CO2][kt][Stationary combustion][no method][no target][no option][no type]
status: valid
status modified: 2017-02-13
accepted date: 2017-02-13
in scheme: emissions_variables_MMR

1.A.4.a.i [Commercial/Institutional][Peat][Emissions][N2O][kt][Stationary combustion][no method][no target][no option][no type]
type: Concept
definition: 1.A.4.a.i [Commercial/Institutional][Peat][Emissions][N2O][kt][Stationary combustion][no method][no target][no option][no type]
status: valid
status modified: 2017-02-13
accepted date: 2017-02-13
in scheme: emissions_variables_MMR

1.A.4.a.i [Commercial/Institutional][Solid Fuels][Emissions][CH4][kt][Stationary combustion][no method][no target][no option][no type]
type: Concept
definition: 1.A.4.a.i [Commercial/Institutional][Solid Fuels][Emissions][CH4][kt][Stationary combustion][no method][no target][no option][no type]
status: valid
status modified: 2017-02-13
accepted date: 2017-02-13
in scheme: emissions_variables_MMR

1.A.4.a.i [Commercial/Institutional][Solid Fuels][Emissions][CO2][kt][Stationary combustion][no method][no target][no option][no type]
type: Concept
definition: 1.A.4.a.i [Commercial/Institutional][Solid Fuels][Emissions][CO2][kt][Stationary combustion][no method][no target][no option][no type]
status: valid
status modified: 2017-02-13
accepted date: 2017-02-13
in scheme: emissions_variables_MMR

1.A.4.a.i [Commercial/Institutional][Solid Fuels][Emissions][N2O][kt][Stationary combustion][no method][no target][no option][no type]
type: Concept
definition: 1.A.4.a.i [Commercial/Institutional][Solid Fuels][Emissions][N2O][kt][Stationary combustion][no method][no target][no option][no type]
status: valid
status modified: 2017-02-13
accepted date: 2017-02-13
in scheme: emissions_variables_MMR

1.A.4.a.ii [Commercial/Institutional][Biomass][Emissions][CH4][kt][Off-road vehicles and other machinery][no method][no target][no option][no type]
type: Concept
definition: 1.A.4.a.ii [Commercial/Institutional][Biomass][Emissions][CH4][kt][Off-road vehicles and other machinery][no method][no target][no option][no type]
status: valid
status modified: 2017-02-13
accepted date: 2017-02-13
in scheme: emissions_variables_MMR

1.A.4.a.ii [Commercial/Institutional][Biomass][Emissions][CO2][kt][Off-road vehicles and other machinery][no method][no target][no option][no type]
type: Concept
definition: 1.A.4.a.ii [Commercial/Institutional][Biomass][Emissions][CO2][kt][Off-road vehicles and other machinery][no method][no target][no option][no type]
status: valid
status modified: 2017-02-13
accepted date: 2017-02-13
in scheme: emissions_variables_MMR

1.A.4.a.ii [Commercial/Institutional][Biomass][Emissions][N2O][kt][Off-road vehicles and other machinery][no method][no target][no option][no type]
type: Concept
definition: 1.A.4.a.ii [Commercial/Institutional][Biomass][Emissions][N2O][kt][Off-road vehicles and other machinery][no method][no target][no option][no type]
status: valid
status modified: 2017-02-13
accepted date: 2017-02-13
in scheme: emissions_variables_MMR

1.A.4.a.ii [Commercial/Institutional][Fuels][Emissions][CH4][kt][Off-road vehicles and other machinery][no method][no target][no option][no type]
type: Concept
definition: 1.A.4.a.ii [Commercial/Institutional][Fuels][Emissions][CH4][kt][Off-road vehicles and other machinery][no method][no target][no option][no type]
status: valid
status modified: 2017-02-13
accepted date: 2017-02-13
in scheme: emissions_variables_MMR

1.A.4.a.ii [Commercial/Institutional][Fuels][Emissions][CO2][kt][Off-road vehicles and other machinery][no method][no target][no option][no type]
type: Concept
definition: 1.A.4.a.ii [Commercial/Institutional][Fuels][Emissions][CO2][kt][Off-road vehicles and other machinery][no method][no target][no option][no type]
status: valid
status modified: 2017-02-13
accepted date: 2017-02-13
in scheme: emissions_variables_MMR

1.A.4.a.ii [Commercial/Institutional][Fuels][Emissions][N2O][kt][Off-road vehicles and other machinery][no method][no target][no option][no type]
type: Concept
definition: 1.A.4.a.ii [Commercial/Institutional][Fuels][Emissions][N2O][kt][Off-road vehicles and other machinery][no method][no target][no option][no type]
status: valid
status modified: 2017-02-13
accepted date: 2017-02-13
in scheme: emissions_variables_MMR

1.A.4.a.ii [Commercial/Institutional][Gaseous Fuels][Emissions][CH4][kt][Off-road vehicles and other machinery][no method][no target][no option][no type]
type: Concept
definition: 1.A.4.a.ii [Commercial/Institutional][Gaseous Fuels][Emissions][CH4][kt][Off-road vehicles and other machinery][no method][no target][no option][no type]
status: valid
status modified: 2017-02-13
accepted date: 2017-02-13
in scheme: emissions_variables_MMR

1.A.4.a.ii [Commercial/Institutional][Gaseous Fuels][Emissions][CO2][kt][Off-road vehicles and other machinery][no method][no target][no option][no type]
type: Concept
definition: 1.A.4.a.ii [Commercial/Institutional][Gaseous Fuels][Emissions][CO2][kt][Off-road vehicles and other machinery][no method][no target][no option][no type]
status: valid
status modified: 2017-02-13
accepted date: 2017-02-13
in scheme: emissions_variables_MMR

1.A.4.a.ii [Commercial/Institutional][Gaseous Fuels][Emissions][N2O][kt][Off-road vehicles and other machinery][no method][no target][no option][no type]
type: Concept
definition: 1.A.4.a.ii [Commercial/Institutional][Gaseous Fuels][Emissions][N2O][kt][Off-road vehicles and other machinery][no method][no target][no option][no type]
status: valid
status modified: 2017-02-13
accepted date: 2017-02-13
in scheme: emissions_variables_MMR

1.A.4.a.ii [Commercial/Institutional][Liquid Fuels][Emissions][CH4][kt][Off-road vehicles and other machinery][no method][no target][no option][no type]
type: Concept
definition: 1.A.4.a.ii [Commercial/Institutional][Liquid Fuels][Emissions][CH4][kt][Off-road vehicles and other machinery][no method][no target][no option][no type]
status: valid
status modified: 2017-02-13
accepted date: 2017-02-13
in scheme: emissions_variables_MMR

1.A.4.a.ii [Commercial/Institutional][Liquid Fuels][Emissions][CO2][kt][Off-road vehicles and other machinery][no method][no target][no option][no type]
type: Concept
definition: 1.A.4.a.ii [Commercial/Institutional][Liquid Fuels][Emissions][CO2][kt][Off-road vehicles and other machinery][no method][no target][no option][no type]
status: valid
status modified: 2017-02-13
accepted date: 2017-02-13
in scheme: emissions_variables_MMR

1.A.4.a.ii [Commercial/Institutional][Liquid Fuels][Emissions][N2O][kt][Off-road vehicles and other machinery][no method][no target][no option][no type]
type: Concept
definition: 1.A.4.a.ii [Commercial/Institutional][Liquid Fuels][Emissions][N2O][kt][Off-road vehicles and other machinery][no method][no target][no option][no type]
status: valid
status modified: 2017-02-13
accepted date: 2017-02-13
in scheme: emissions_variables_MMR

1.A.4.a.ii [Commercial/Institutional][Other Fossil Fuels][Emissions][CH4][kt][Off-road vehicles and other machinery][no method][no target][no option][no type]
type: Concept
definition: 1.A.4.a.ii [Commercial/Institutional][Other Fossil Fuels][Emissions][CH4][kt][Off-road vehicles and other machinery][no method][no target][no option][no type]
status: valid
status modified: 2017-02-13
accepted date: 2017-02-13
in scheme: emissions_variables_MMR

1.A.4.a.ii [Commercial/Institutional][Other Fossil Fuels][Emissions][CO2][kt][Off-road vehicles and other machinery][no method][no target][no option][no type]
type: Concept
definition: 1.A.4.a.ii [Commercial/Institutional][Other Fossil Fuels][Emissions][CO2][kt][Off-road vehicles and other machinery][no method][no target][no option][no type]
status: valid
status modified: 2017-02-13
accepted date: 2017-02-13
in scheme: emissions_variables_MMR

1.A.4.a.ii [Commercial/Institutional][Other Fossil Fuels][Emissions][N2O][kt][Off-road vehicles and other machinery][no method][no target][no option][no type]
type: Concept
definition: 1.A.4.a.ii [Commercial/Institutional][Other Fossil Fuels][Emissions][N2O][kt][Off-road vehicles and other machinery][no method][no target][no option][no type]
status: valid
status modified: 2017-02-13
accepted date: 2017-02-13
in scheme: emissions_variables_MMR

1.A.4.a.ii [Commercial/Institutional][Solid Fuels][Emissions][CH4][kt][Off-road vehicles and other machinery][no method][no target][no option][no type]
type: Concept
definition: 1.A.4.a.ii [Commercial/Institutional][Solid Fuels][Emissions][CH4][kt][Off-road vehicles and other machinery][no method][no target][no option][no type]
status: valid
status modified: 2017-02-13
accepted date: 2017-02-13
in scheme: emissions_variables_MMR

1.A.4.a.ii [Commercial/Institutional][Solid Fuels][Emissions][CO2][kt][Off-road vehicles and other machinery][no method][no target][no option][no type]
type: Concept
definition: 1.A.4.a.ii [Commercial/Institutional][Solid Fuels][Emissions][CO2][kt][Off-road vehicles and other machinery][no method][no target][no option][no type]
status: valid
status modified: 2017-02-13
accepted date: 2017-02-13
in scheme: emissions_variables_MMR

1.A.4.a.ii [Commercial/Institutional][Solid Fuels][Emissions][N2O][kt][Off-road vehicles and other machinery][no method][no target][no option][no type]
type: Concept
definition: 1.A.4.a.ii [Commercial/Institutional][Solid Fuels][Emissions][N2O][kt][Off-road vehicles and other machinery][no method][no target][no option][no type]
status: valid
status modified: 2017-02-13
accepted date: 2017-02-13
in scheme: emissions_variables_MMR

1.A.4.a.iii [Commercial/Institutional][Biomass][Emissions][CH4][kt][Other source][no method][no target][no option][no type]
type: Concept
definition: 1.A.4.a.iii [Commercial/Institutional][Biomass][Emissions][CH4][kt][Other source][no method][no target][no option][no type]
status: valid
status modified: 2017-02-13
accepted date: 2017-02-13
in scheme: emissions_variables_MMR

1.A.4.a.iii [Commercial/Institutional][Biomass][Emissions][CO2][kt][Other source][no method][no target][no option][no type]
type: Concept
definition: 1.A.4.a.iii [Commercial/Institutional][Biomass][Emissions][CO2][kt][Other source][no method][no target][no option][no type]
status: valid
status modified: 2017-02-13
accepted date: 2017-02-13
in scheme: emissions_variables_MMR

1.A.4.a.iii [Commercial/Institutional][Biomass][Emissions][N2O][kt][Other source][no method][no target][no option][no type]
type: Concept
definition: 1.A.4.a.iii [Commercial/Institutional][Biomass][Emissions][N2O][kt][Other source][no method][no target][no option][no type]
status: valid
status modified: 2017-02-13
accepted date: 2017-02-13
in scheme: emissions_variables_MMR

1.A.4.a.iii [Commercial/Institutional][Fuels][Emissions][CH4][kt][Other source][no method][no target][no option][no type]
type: Concept
definition: 1.A.4.a.iii [Commercial/Institutional][Fuels][Emissions][CH4][kt][Other source][no method][no target][no option][no type]
status: valid
status modified: 2017-02-13
accepted date: 2017-02-13
in scheme: emissions_variables_MMR

1.A.4.a.iii [Commercial/Institutional][Fuels][Emissions][CO2][kt][Other source][no method][no target][no option][no type]
type: Concept
definition: 1.A.4.a.iii [Commercial/Institutional][Fuels][Emissions][CO2][kt][Other source][no method][no target][no option][no type]
status: valid
status modified: 2017-02-13
accepted date: 2017-02-13
in scheme: emissions_variables_MMR

1.A.4.a.iii [Commercial/Institutional][Fuels][Emissions][N2O][kt][Other source][no method][no target][no option][no type]
type: Concept
definition: 1.A.4.a.iii [Commercial/Institutional][Fuels][Emissions][N2O][kt][Other source][no method][no target][no option][no type]
status: valid
status modified: 2017-02-13
accepted date: 2017-02-13
in scheme: emissions_variables_MMR

1.A.4.a.iii [Commercial/Institutional][Gaseous Fuels][Emissions][CH4][kt][Other source][no method][no target][no option][no type]
type: Concept
definition: 1.A.4.a.iii [Commercial/Institutional][Gaseous Fuels][Emissions][CH4][kt][Other source][no method][no target][no option][no type]
status: valid
status modified: 2017-02-13
accepted date: 2017-02-13
in scheme: emissions_variables_MMR

1.A.4.a.iii [Commercial/Institutional][Gaseous Fuels][Emissions][CO2][kt][Other source][no method][no target][no option][no type]
type: Concept
definition: 1.A.4.a.iii [Commercial/Institutional][Gaseous Fuels][Emissions][CO2][kt][Other source][no method][no target][no option][no type]
status: valid
status modified: 2017-02-13
accepted date: 2017-02-13
in scheme: emissions_variables_MMR

1.A.4.a.iii [Commercial/Institutional][Gaseous Fuels][Emissions][N2O][kt][Other source][no method][no target][no option][no type]
type: Concept
definition: 1.A.4.a.iii [Commercial/Institutional][Gaseous Fuels][Emissions][N2O][kt][Other source][no method][no target][no option][no type]
status: valid
status modified: 2017-02-13
accepted date: 2017-02-13
in scheme: emissions_variables_MMR

1.A.4.a.iii [Commercial/Institutional][Liquid Fuels][Emissions][CH4][kt][Other source][no method][no target][no option][no type]
type: Concept
definition: 1.A.4.a.iii [Commercial/Institutional][Liquid Fuels][Emissions][CH4][kt][Other source][no method][no target][no option][no type]
status: valid
status modified: 2017-02-13
accepted date: 2017-02-13
in scheme: emissions_variables_MMR

1.A.4.a.iii [Commercial/Institutional][Liquid Fuels][Emissions][CO2][kt][Other source][no method][no target][no option][no type]
type: Concept
definition: 1.A.4.a.iii [Commercial/Institutional][Liquid Fuels][Emissions][CO2][kt][Other source][no method][no target][no option][no type]
status: valid
status modified: 2017-02-13
accepted date: 2017-02-13
in scheme: emissions_variables_MMR

1.A.4.a.iii [Commercial/Institutional][Liquid Fuels][Emissions][N2O][kt][Other source][no method][no target][no option][no type]
type: Concept
definition: 1.A.4.a.iii [Commercial/Institutional][Liquid Fuels][Emissions][N2O][kt][Other source][no method][no target][no option][no type]
status: valid
status modified: 2017-02-13
accepted date: 2017-02-13
in scheme: emissions_variables_MMR

1.A.4.a.iii [Commercial/Institutional][Other Fossil Fuels][Emissions][CH4][kt][Other source][no method][no target][no option][no type]
type: Concept
definition: 1.A.4.a.iii [Commercial/Institutional][Other Fossil Fuels][Emissions][CH4][kt][Other source][no method][no target][no option][no type]
status: valid
status modified: 2017-02-13
accepted date: 2017-02-13
in scheme: emissions_variables_MMR

1.A.4.a.iii [Commercial/Institutional][Other Fossil Fuels][Emissions][CO2][kt][Other source][no method][no target][no option][no type]
type: Concept
definition: 1.A.4.a.iii [Commercial/Institutional][Other Fossil Fuels][Emissions][CO2][kt][Other source][no method][no target][no option][no type]
status: valid
status modified: 2017-02-13
accepted date: 2017-02-13
in scheme: emissions_variables_MMR

1.A.4.a.iii [Commercial/Institutional][Other Fossil Fuels][Emissions][N2O][kt][Other source][no method][no target][no option][no type]
type: Concept
definition: 1.A.4.a.iii [Commercial/Institutional][Other Fossil Fuels][Emissions][N2O][kt][Other source][no method][no target][no option][no type]
status: valid
status modified: 2017-02-13
accepted date: 2017-02-13
in scheme: emissions_variables_MMR

1.A.4.a.iii [Commercial/Institutional][Peat][Emissions][CH4][kt][Other source][no method][no target][no option][no type]
type: Concept
definition: 1.A.4.a.iii [Commercial/Institutional][Peat][Emissions][CH4][kt][Other source][no method][no target][no option][no type]
status: valid
status modified: 2017-02-13
accepted date: 2017-02-13
in scheme: emissions_variables_MMR

1.A.4.a.iii [Commercial/Institutional][Peat][Emissions][CO2][kt][Other source][no method][no target][no option][no type]
type: Concept
definition: 1.A.4.a.iii [Commercial/Institutional][Peat][Emissions][CO2][kt][Other source][no method][no target][no option][no type]
status: valid
status modified: 2017-02-13
accepted date: 2017-02-13
in scheme: emissions_variables_MMR

1.A.4.a.iii [Commercial/Institutional][Peat][Emissions][N2O][kt][Other source][no method][no target][no option][no type]
type: Concept
definition: 1.A.4.a.iii [Commercial/Institutional][Peat][Emissions][N2O][kt][Other source][no method][no target][no option][no type]
status: valid
status modified: 2017-02-13
accepted date: 2017-02-13
in scheme: emissions_variables_MMR

1.A.4.a.iii [Commercial/Institutional][Solid Fuels][Emissions][CH4][kt][Other source][no method][no target][no option][no type]
type: Concept
definition: 1.A.4.a.iii [Commercial/Institutional][Solid Fuels][Emissions][CH4][kt][Other source][no method][no target][no option][no type]
status: valid
status modified: 2017-02-13
accepted date: 2017-02-13
in scheme: emissions_variables_MMR

1.A.4.a.iii [Commercial/Institutional][Solid Fuels][Emissions][CO2][kt][Other source][no method][no target][no option][no type]
type: Concept
definition: 1.A.4.a.iii [Commercial/Institutional][Solid Fuels][Emissions][CO2][kt][Other source][no method][no target][no option][no type]
status: valid
status modified: 2017-02-13
accepted date: 2017-02-13
in scheme: emissions_variables_MMR

1.A.4.a.iii [Commercial/Institutional][Solid Fuels][Emissions][N2O][kt][Other source][no method][no target][no option][no type]
type: Concept
definition: 1.A.4.a.iii [Commercial/Institutional][Solid Fuels][Emissions][N2O][kt][Other source][no method][no target][no option][no type]
status: valid
status modified: 2017-02-13
accepted date: 2017-02-13
in scheme: emissions_variables_MMR

1.A.4.b [Residential][Biomass][Emissions][CH4][kt][no source][no method][no target][no option][no type]
type: Concept
definition: 1.A.4.b [Residential][Biomass][Emissions][CH4][kt][no source][no method][no target][no option][no type]
status: valid
status modified: 2017-02-13
accepted date: 2017-02-13
in scheme: emissions_variables_MMR

1.A.4.b [Residential][Biomass][Emissions][CO2][kt][no source][no method][no target][no option][no type]
type: Concept
definition: 1.A.4.b [Residential][Biomass][Emissions][CO2][kt][no source][no method][no target][no option][no type]
status: valid
status modified: 2017-02-13
accepted date: 2017-02-13
in scheme: emissions_variables_MMR

1.A.4.b [Residential][Biomass][Emissions][N2O][kt][no source][no method][no target][no option][no type]
type: Concept
definition: 1.A.4.b [Residential][Biomass][Emissions][N2O][kt][no source][no method][no target][no option][no type]
status: valid
status modified: 2017-02-13
accepted date: 2017-02-13
in scheme: emissions_variables_MMR

1.A.4.b [Residential][Fossil fuels][Emissions][CO2][kt][no source][no method][no target][no option][no type]
type: Concept
definition: 1.A.4.b [Residential][Fossil fuels][Emissions][CO2][kt][no source][no method][no target][no option][no type]
status: valid
status modified: 2017-02-13
accepted date: 2017-02-13
in scheme: emissions_variables_MMR

1.A.4.b [Residential][Fuels][Emissions][CH4][kt][no source][no method][no target][no option][no type]
type: Concept
definition: 1.A.4.b [Residential][Fuels][Emissions][CH4][kt][no source][no method][no target][no option][no type]
status: valid
status modified: 2017-02-13
accepted date: 2017-02-13
in scheme: emissions_variables_MMR

1.A.4.b [Residential][Fuels][Emissions][CO][kt][no source][no method][no target][no option][no type]
type: Concept
definition: 1.A.4.b [Residential][Fuels][Emissions][CO][kt][no source][no method][no target][no option][no type]
status: valid
status modified: 2017-02-13
accepted date: 2017-02-13
in scheme: emissions_variables_MMR

1.A.4.b [Residential][Fuels][Emissions][N2O][kt][no source][no method][no target][no option][no type]
type: Concept
definition: 1.A.4.b [Residential][Fuels][Emissions][N2O][kt][no source][no method][no target][no option][no type]
status: valid
status modified: 2017-02-13
accepted date: 2017-02-13
in scheme: emissions_variables_MMR

1.A.4.b [Residential][Fuels][Emissions][NMVOC][kt][no source][no method][no target][no option][no type]
type: Concept
definition: 1.A.4.b [Residential][Fuels][Emissions][NMVOC][kt][no source][no method][no target][no option][no type]
status: valid
status modified: 2017-02-13
accepted date: 2017-02-13
in scheme: emissions_variables_MMR

1.A.4.b [Residential][Fuels][Emissions][NOx][kt][no source][no method][no target][no option][no type]
type: Concept
definition: 1.A.4.b [Residential][Fuels][Emissions][NOx][kt][no source][no method][no target][no option][no type]
status: valid
status modified: 2017-02-13
accepted date: 2017-02-13
in scheme: emissions_variables_MMR

1.A.4.b [Residential][Fuels][Emissions][SO2][kt][no source][no method][no target][no option][no type]
type: Concept
definition: 1.A.4.b [Residential][Fuels][Emissions][SO2][kt][no source][no method][no target][no option][no type]
status: valid
status modified: 2017-02-13
accepted date: 2017-02-13
in scheme: emissions_variables_MMR

1.A.4.b [Residential][Gaseous Fuels][Emissions][CH4][kt][no source][no method][no target][no option][no type]
type: Concept
definition: 1.A.4.b [Residential][Gaseous Fuels][Emissions][CH4][kt][no source][no method][no target][no option][no type]
status: valid
status modified: 2017-02-13
accepted date: 2017-02-13
in scheme: emissions_variables_MMR

1.A.4.b [Residential][Gaseous Fuels][Emissions][CO2][kt][no source][no method][no target][no option][no type]
type: Concept
definition: 1.A.4.b [Residential][Gaseous Fuels][Emissions][CO2][kt][no source][no method][no target][no option][no type]
status: valid
status modified: 2017-02-13
accepted date: 2017-02-13
in scheme: emissions_variables_MMR

1.A.4.b [Residential][Gaseous Fuels][Emissions][N2O][kt][no source][no method][no target][no option][no type]
type: Concept
definition: 1.A.4.b [Residential][Gaseous Fuels][Emissions][N2O][kt][no source][no method][no target][no option][no type]
status: valid
status modified: 2017-02-13
accepted date: 2017-02-13
in scheme: emissions_variables_MMR

1.A.4.b [Residential][Liquid Fuels][Emissions][CH4][kt][no source][no method][no target][no option][no type]
type: Concept
definition: 1.A.4.b [Residential][Liquid Fuels][Emissions][CH4][kt][no source][no method][no target][no option][no type]
status: valid
status modified: 2017-02-13
accepted date: 2017-02-13
in scheme: emissions_variables_MMR

1.A.4.b [Residential][Liquid Fuels][Emissions][CO2][kt][no source][no method][no target][no option][no type]
type: Concept
definition: 1.A.4.b [Residential][Liquid Fuels][Emissions][CO2][kt][no source][no method][no target][no option][no type]
status: valid
status modified: 2017-02-13
accepted date: 2017-02-13
in scheme: emissions_variables_MMR

1.A.4.b [Residential][Liquid Fuels][Emissions][N2O][kt][no source][no method][no target][no option][no type]
type: Concept
definition: 1.A.4.b [Residential][Liquid Fuels][Emissions][N2O][kt][no source][no method][no target][no option][no type]
status: valid
status modified: 2017-02-13
accepted date: 2017-02-13
in scheme: emissions_variables_MMR

1.A.4.b [Residential][Other Fossil Fuels][Emissions][CH4][kt][no source][no method][no target][no option][no type]
type: Concept
definition: 1.A.4.b [Residential][Other Fossil Fuels][Emissions][CH4][kt][no source][no method][no target][no option][no type]
status: valid
status modified: 2017-02-13
accepted date: 2017-02-13
in scheme: emissions_variables_MMR

1.A.4.b [Residential][Other Fossil Fuels][Emissions][CO2][kt][no source][no method][no target][no option][no type]
type: Concept
definition: 1.A.4.b [Residential][Other Fossil Fuels][Emissions][CO2][kt][no source][no method][no target][no option][no type]
status: valid
status modified: 2017-02-13
accepted date: 2017-02-13
in scheme: emissions_variables_MMR

1.A.4.b [Residential][Other Fossil Fuels][Emissions][N2O][kt][no source][no method][no target][no option][no type]
type: Concept
definition: 1.A.4.b [Residential][Other Fossil Fuels][Emissions][N2O][kt][no source][no method][no target][no option][no type]
status: valid
status modified: 2017-02-13
accepted date: 2017-02-13
in scheme: emissions_variables_MMR

1.A.4.b [Residential][Peat][Emissions][CH4][kt][no source][no method][no target][no option][no type]
type: Concept
definition: 1.A.4.b [Residential][Peat][Emissions][CH4][kt][no source][no method][no target][no option][no type]
status: valid
status modified: 2017-02-13
accepted date: 2017-02-13
in scheme: emissions_variables_MMR

1.A.4.b [Residential][Peat][Emissions][CO2][kt][no source][no method][no target][no option][no type]
type: Concept
definition: 1.A.4.b [Residential][Peat][Emissions][CO2][kt][no source][no method][no target][no option][no type]
status: valid
status modified: 2017-02-13
accepted date: 2017-02-13
in scheme: emissions_variables_MMR

1.A.4.b [Residential][Peat][Emissions][N2O][kt][no source][no method][no target][no option][no type]
type: Concept
definition: 1.A.4.b [Residential][Peat][Emissions][N2O][kt][no source][no method][no target][no option][no type]
status: valid
status modified: 2017-02-13
accepted date: 2017-02-13
in scheme: emissions_variables_MMR

1.A.4.b [Residential][Solid Fuels][Emissions][CH4][kt][no source][no method][no target][no option][no type]
type: Concept
definition: 1.A.4.b [Residential][Solid Fuels][Emissions][CH4][kt][no source][no method][no target][no option][no type]
status: valid
status modified: 2017-02-13
accepted date: 2017-02-13
in scheme: emissions_variables_MMR

1.A.4.b [Residential][Solid Fuels][Emissions][CO2][kt][no source][no method][no target][no option][no type]
type: Concept
definition: 1.A.4.b [Residential][Solid Fuels][Emissions][CO2][kt][no source][no method][no target][no option][no type]
status: valid
status modified: 2017-02-13
accepted date: 2017-02-13
in scheme: emissions_variables_MMR

1.A.4.b [Residential][Solid Fuels][Emissions][N2O][kt][no source][no method][no target][no option][no type]
type: Concept
definition: 1.A.4.b [Residential][Solid Fuels][Emissions][N2O][kt][no source][no method][no target][no option][no type]
status: valid
status modified: 2017-02-13
accepted date: 2017-02-13
in scheme: emissions_variables_MMR

1.A.4.b.i [Residential][Biomass][Emissions][CH4][kt][Stationary combustion][no method][no target][no option][no type]
type: Concept
definition: 1.A.4.b.i [Residential][Biomass][Emissions][CH4][kt][Stationary combustion][no method][no target][no option][no type]
status: valid
status modified: 2017-02-13
accepted date: 2017-02-13
in scheme: emissions_variables_MMR

1.A.4.b.i [Residential][Biomass][Emissions][CO2][kt][Stationary combustion][no method][no target][no option][no type]
type: Concept
definition: 1.A.4.b.i [Residential][Biomass][Emissions][CO2][kt][Stationary combustion][no method][no target][no option][no type]
status: valid
status modified: 2017-02-13
accepted date: 2017-02-13
in scheme: emissions_variables_MMR

1.A.4.b.i [Residential][Biomass][Emissions][N2O][kt][Stationary combustion][no method][no target][no option][no type]
type: Concept
definition: 1.A.4.b.i [Residential][Biomass][Emissions][N2O][kt][Stationary combustion][no method][no target][no option][no type]
status: valid
status modified: 2017-02-13
accepted date: 2017-02-13
in scheme: emissions_variables_MMR

1.A.4.b.i [Residential][Fuels][Emissions][CH4][kt][Stationary combustion][no method][no target][no option][no type]
type: Concept
definition: 1.A.4.b.i [Residential][Fuels][Emissions][CH4][kt][Stationary combustion][no method][no target][no option][no type]
status: valid
status modified: 2017-02-13
accepted date: 2017-02-13
in scheme: emissions_variables_MMR

1.A.4.b.i [Residential][Fuels][Emissions][CO2][kt][Stationary combustion][no method][no target][no option][no type]
type: Concept
definition: 1.A.4.b.i [Residential][Fuels][Emissions][CO2][kt][Stationary combustion][no method][no target][no option][no type]
status: valid
status modified: 2017-02-13
accepted date: 2017-02-13
in scheme: emissions_variables_MMR

1.A.4.b.i [Residential][Fuels][Emissions][N2O][kt][Stationary combustion][no method][no target][no option][no type]
type: Concept
definition: 1.A.4.b.i [Residential][Fuels][Emissions][N2O][kt][Stationary combustion][no method][no target][no option][no type]
status: valid
status modified: 2017-02-13
accepted date: 2017-02-13
in scheme: emissions_variables_MMR

1.A.4.b.i [Residential][Gaseous Fuels][Emissions][CH4][kt][Stationary combustion][no method][no target][no option][no type]
type: Concept
definition: 1.A.4.b.i [Residential][Gaseous Fuels][Emissions][CH4][kt][Stationary combustion][no method][no target][no option][no type]
status: valid
status modified: 2017-02-13
accepted date: 2017-02-13
in scheme: emissions_variables_MMR

1.A.4.b.i [Residential][Gaseous Fuels][Emissions][CO2][kt][Stationary combustion][no method][no target][no option][no type]
type: Concept
definition: 1.A.4.b.i [Residential][Gaseous Fuels][Emissions][CO2][kt][Stationary combustion][no method][no target][no option][no type]
status: valid
status modified: 2017-02-13
accepted date: 2017-02-13
in scheme: emissions_variables_MMR

1.A.4.b.i [Residential][Gaseous Fuels][Emissions][N2O][kt][Stationary combustion][no method][no target][no option][no type]
type: Concept
definition: 1.A.4.b.i [Residential][Gaseous Fuels][Emissions][N2O][kt][Stationary combustion][no method][no target][no option][no type]
status: valid
status modified: 2017-02-13
accepted date: 2017-02-13
in scheme: emissions_variables_MMR

1.A.4.b.i [Residential][Liquid Fuels][Emissions][CH4][kt][Stationary combustion][no method][no target][no option][no type]
type: Concept
definition: 1.A.4.b.i [Residential][Liquid Fuels][Emissions][CH4][kt][Stationary combustion][no method][no target][no option][no type]
status: valid
status modified: 2017-02-13
accepted date: 2017-02-13
in scheme: emissions_variables_MMR

1.A.4.b.i [Residential][Liquid Fuels][Emissions][CO2][kt][Stationary combustion][no method][no target][no option][no type]
type: Concept
definition: 1.A.4.b.i [Residential][Liquid Fuels][Emissions][CO2][kt][Stationary combustion][no method][no target][no option][no type]
status: valid
status modified: 2017-02-13
accepted date: 2017-02-13
in scheme: emissions_variables_MMR

1.A.4.b.i [Residential][Liquid Fuels][Emissions][N2O][kt][Stationary combustion][no method][no target][no option][no type]
type: Concept
definition: 1.A.4.b.i [Residential][Liquid Fuels][Emissions][N2O][kt][Stationary combustion][no method][no target][no option][no type]
status: valid
status modified: 2017-02-13
accepted date: 2017-02-13
in scheme: emissions_variables_MMR

1.A.4.b.i [Residential][Other Fossil Fuels][Emissions][CH4][kt][Stationary combustion][no method][no target][no option][no type]
type: Concept
definition: 1.A.4.b.i [Residential][Other Fossil Fuels][Emissions][CH4][kt][Stationary combustion][no method][no target][no option][no type]
status: valid
status modified: 2017-02-13
accepted date: 2017-02-13
in scheme: emissions_variables_MMR

1.A.4.b.i [Residential][Other Fossil Fuels][Emissions][CO2][kt][Stationary combustion][no method][no target][no option][no type]
type: Concept
definition: 1.A.4.b.i [Residential][Other Fossil Fuels][Emissions][CO2][kt][Stationary combustion][no method][no target][no option][no type]
status: valid
status modified: 2017-02-13
accepted date: 2017-02-13
in scheme: emissions_variables_MMR

1.A.4.b.i [Residential][Other Fossil Fuels][Emissions][N2O][kt][Stationary combustion][no method][no target][no option][no type]
type: Concept
definition: 1.A.4.b.i [Residential][Other Fossil Fuels][Emissions][N2O][kt][Stationary combustion][no method][no target][no option][no type]
status: valid
status modified: 2017-02-13
accepted date: 2017-02-13
in scheme: emissions_variables_MMR

1.A.4.b.i [Residential][Peat][Emissions][CH4][kt][Stationary combustion][no method][no target][no option][no type]
type: Concept
definition: 1.A.4.b.i [Residential][Peat][Emissions][CH4][kt][Stationary combustion][no method][no target][no option][no type]
status: valid
status modified: 2017-02-13
accepted date: 2017-02-13
in scheme: emissions_variables_MMR

1.A.4.b.i [Residential][Peat][Emissions][CO2][kt][Stationary combustion][no method][no target][no option][no type]
type: Concept
definition: 1.A.4.b.i [Residential][Peat][Emissions][CO2][kt][Stationary combustion][no method][no target][no option][no type]
status: valid
status modified: 2017-02-13
accepted date: 2017-02-13
in scheme: emissions_variables_MMR

1.A.4.b.i [Residential][Peat][Emissions][N2O][kt][Stationary combustion][no method][no target][no option][no type]
type: Concept
definition: 1.A.4.b.i [Residential][Peat][Emissions][N2O][kt][Stationary combustion][no method][no target][no option][no type]
status: valid
status modified: 2017-02-13
accepted date: 2017-02-13
in scheme: emissions_variables_MMR

1.A.4.b.i [Residential][Solid Fuels][Emissions][CH4][kt][Stationary combustion][no method][no target][no option][no type]
type: Concept
definition: 1.A.4.b.i [Residential][Solid Fuels][Emissions][CH4][kt][Stationary combustion][no method][no target][no option][no type]
status: valid
status modified: 2017-02-13
accepted date: 2017-02-13
in scheme: emissions_variables_MMR

1.A.4.b.i [Residential][Solid Fuels][Emissions][CO2][kt][Stationary combustion][no method][no target][no option][no type]
type: Concept
definition: 1.A.4.b.i [Residential][Solid Fuels][Emissions][CO2][kt][Stationary combustion][no method][no target][no option][no type]
status: valid
status modified: 2017-02-13
accepted date: 2017-02-13
in scheme: emissions_variables_MMR

1.A.4.b.i [Residential][Solid Fuels][Emissions][N2O][kt][Stationary combustion][no method][no target][no option][no type]
type: Concept
definition: 1.A.4.b.i [Residential][Solid Fuels][Emissions][N2O][kt][Stationary combustion][no method][no target][no option][no type]
status: valid
status modified: 2017-02-13
accepted date: 2017-02-13
in scheme: emissions_variables_MMR

1.A.4.b.ii [Residential][Biomass][Emissions][CH4][kt][Off-road vehicles and other machinery][no method][no target][no option][no type]
type: Concept
definition: 1.A.4.b.ii [Residential][Biomass][Emissions][CH4][kt][Off-road vehicles and other machinery][no method][no target][no option][no type]
status: valid
status modified: 2017-02-13
accepted date: 2017-02-13
in scheme: emissions_variables_MMR

1.A.4.b.ii [Residential][Biomass][Emissions][CO2][kt][Off-road vehicles and other machinery][no method][no target][no option][no type]
type: Concept
definition: 1.A.4.b.ii [Residential][Biomass][Emissions][CO2][kt][Off-road vehicles and other machinery][no method][no target][no option][no type]
status: valid
status modified: 2017-02-13
accepted date: 2017-02-13
in scheme: emissions_variables_MMR

1.A.4.b.ii [Residential][Biomass][Emissions][N2O][kt][Off-road vehicles and other machinery][no method][no target][no option][no type]
type: Concept
definition: 1.A.4.b.ii [Residential][Biomass][Emissions][N2O][kt][Off-road vehicles and other machinery][no method][no target][no option][no type]
status: valid
status modified: 2017-02-13
accepted date: 2017-02-13
in scheme: emissions_variables_MMR

1.A.4.b.ii [Residential][Fuels][Emissions][CH4][kt][Off-road vehicles and other machinery][no method][no target][no option][no type]
type: Concept
definition: 1.A.4.b.ii [Residential][Fuels][Emissions][CH4][kt][Off-road vehicles and other machinery][no method][no target][no option][no type]
status: valid
status modified: 2017-02-13
accepted date: 2017-02-13
in scheme: emissions_variables_MMR

1.A.4.b.ii [Residential][Fuels][Emissions][CO2][kt][Off-road vehicles and other machinery][no method][no target][no option][no type]
type: Concept
definition: 1.A.4.b.ii [Residential][Fuels][Emissions][CO2][kt][Off-road vehicles and other machinery][no method][no target][no option][no type]
status: valid
status modified: 2017-02-13
accepted date: 2017-02-13
in scheme: emissions_variables_MMR

1.A.4.b.ii [Residential][Fuels][Emissions][N2O][kt][Off-road vehicles and other machinery][no method][no target][no option][no type]
type: Concept
definition: 1.A.4.b.ii [Residential][Fuels][Emissions][N2O][kt][Off-road vehicles and other machinery][no method][no target][no option][no type]
status: valid
status modified: 2017-02-13
accepted date: 2017-02-13
in scheme: emissions_variables_MMR

1.A.4.b.ii [Residential][Gaseous Fuels][Emissions][CH4][kt][Off-road vehicles and other machinery][no method][no target][no option][no type]
type: Concept
definition: 1.A.4.b.ii [Residential][Gaseous Fuels][Emissions][CH4][kt][Off-road vehicles and other machinery][no method][no target][no option][no type]
status: valid
status modified: 2017-02-13
accepted date: 2017-02-13
in scheme: emissions_variables_MMR

1.A.4.b.ii [Residential][Gaseous Fuels][Emissions][CO2][kt][Off-road vehicles and other machinery][no method][no target][no option][no type]
type: Concept
definition: 1.A.4.b.ii [Residential][Gaseous Fuels][Emissions][CO2][kt][Off-road vehicles and other machinery][no method][no target][no option][no type]
status: valid
status modified: 2017-02-13
accepted date: 2017-02-13
in scheme: emissions_variables_MMR

1.A.4.b.ii [Residential][Gaseous Fuels][Emissions][N2O][kt][Off-road vehicles and other machinery][no method][no target][no option][no type]
type: Concept
definition: 1.A.4.b.ii [Residential][Gaseous Fuels][Emissions][N2O][kt][Off-road vehicles and other machinery][no method][no target][no option][no type]
status: valid
status modified: 2017-02-13
accepted date: 2017-02-13
in scheme: emissions_variables_MMR

1.A.4.b.ii [Residential][Liquid Fuels][Emissions][CH4][kt][Off-road vehicles and other machinery][no method][no target][no option][no type]
type: Concept
definition: 1.A.4.b.ii [Residential][Liquid Fuels][Emissions][CH4][kt][Off-road vehicles and other machinery][no method][no target][no option][no type]
status: valid
status modified: 2017-02-13
accepted date: 2017-02-13
in scheme: emissions_variables_MMR

1.A.4.b.ii [Residential][Liquid Fuels][Emissions][CO2][kt][Off-road vehicles and other machinery][no method][no target][no option][no type]
type: Concept
definition: 1.A.4.b.ii [Residential][Liquid Fuels][Emissions][CO2][kt][Off-road vehicles and other machinery][no method][no target][no option][no type]
status: valid
status modified: 2017-02-13
accepted date: 2017-02-13
in scheme: emissions_variables_MMR

1.A.4.b.ii [Residential][Liquid Fuels][Emissions][N2O][kt][Off-road vehicles and other machinery][no method][no target][no option][no type]
type: Concept
definition: 1.A.4.b.ii [Residential][Liquid Fuels][Emissions][N2O][kt][Off-road vehicles and other machinery][no method][no target][no option][no type]
status: valid
status modified: 2017-02-13
accepted date: 2017-02-13
in scheme: emissions_variables_MMR

1.A.4.b.ii [Residential][Other Fossil Fuels][Emissions][CH4][kt][Off-road vehicles and other machinery][no method][no target][no option][no type]
type: Concept
definition: 1.A.4.b.ii [Residential][Other Fossil Fuels][Emissions][CH4][kt][Off-road vehicles and other machinery][no method][no target][no option][no type]
status: valid
status modified: 2017-02-13
accepted date: 2017-02-13
in scheme: emissions_variables_MMR

1.A.4.b.ii [Residential][Other Fossil Fuels][Emissions][CO2][kt][Off-road vehicles and other machinery][no method][no target][no option][no type]
type: Concept
definition: 1.A.4.b.ii [Residential][Other Fossil Fuels][Emissions][CO2][kt][Off-road vehicles and other machinery][no method][no target][no option][no type]
status: valid
status modified: 2017-02-13
accepted date: 2017-02-13
in scheme: emissions_variables_MMR

1.A.4.b.ii [Residential][Other Fossil Fuels][Emissions][N2O][kt][Off-road vehicles and other machinery][no method][no target][no option][no type]
type: Concept
definition: 1.A.4.b.ii [Residential][Other Fossil Fuels][Emissions][N2O][kt][Off-road vehicles and other machinery][no method][no target][no option][no type]
status: valid
status modified: 2017-02-13
accepted date: 2017-02-13
in scheme: emissions_variables_MMR

1.A.4.b.ii [Residential][Solid Fuels][Emissions][CH4][kt][Off-road vehicles and other machinery][no method][no target][no option][no type]
type: Concept
definition: 1.A.4.b.ii [Residential][Solid Fuels][Emissions][CH4][kt][Off-road vehicles and other machinery][no method][no target][no option][no type]
status: valid
status modified: 2017-02-13
accepted date: 2017-02-13
in scheme: emissions_variables_MMR

1.A.4.b.ii [Residential][Solid Fuels][Emissions][CO2][kt][Off-road vehicles and other machinery][no method][no target][no option][no type]
type: Concept
definition: 1.A.4.b.ii [Residential][Solid Fuels][Emissions][CO2][kt][Off-road vehicles and other machinery][no method][no target][no option][no type]
status: valid
status modified: 2017-02-13
accepted date: 2017-02-13
in scheme: emissions_variables_MMR

1.A.4.b.ii [Residential][Solid Fuels][Emissions][N2O][kt][Off-road vehicles and other machinery][no method][no target][no option][no type]
type: Concept
definition: 1.A.4.b.ii [Residential][Solid Fuels][Emissions][N2O][kt][Off-road vehicles and other machinery][no method][no target][no option][no type]
status: valid
status modified: 2017-02-13
accepted date: 2017-02-13
in scheme: emissions_variables_MMR

1.A.4.b.iii [Residential][Biomass][Emissions][CH4][kt][Other source][no method][no target][no option][no type]
type: Concept
definition: 1.A.4.b.iii [Residential][Biomass][Emissions][CH4][kt][Other source][no method][no target][no option][no type]
status: valid
status modified: 2017-02-13
accepted date: 2017-02-13
in scheme: emissions_variables_MMR

1.A.4.b.iii [Residential][Biomass][Emissions][CO2][kt][Other source][no method][no target][no option][no type]
type: Concept
definition: 1.A.4.b.iii [Residential][Biomass][Emissions][CO2][kt][Other source][no method][no target][no option][no type]
status: valid
status modified: 2017-02-13
accepted date: 2017-02-13
in scheme: emissions_variables_MMR

1.A.4.b.iii [Residential][Biomass][Emissions][N2O][kt][Other source][no method][no target][no option][no type]
type: Concept
definition: 1.A.4.b.iii [Residential][Biomass][Emissions][N2O][kt][Other source][no method][no target][no option][no type]
status: valid
status modified: 2017-02-13
accepted date: 2017-02-13
in scheme: emissions_variables_MMR

1.A.4.b.iii [Residential][Fuels][Emissions][CH4][kt][Other source][no method][no target][no option][no type]
type: Concept
definition: 1.A.4.b.iii [Residential][Fuels][Emissions][CH4][kt][Other source][no method][no target][no option][no type]
status: valid
status modified: 2017-02-13
accepted date: 2017-02-13
in scheme: emissions_variables_MMR

1.A.4.b.iii [Residential][Fuels][Emissions][CO2][kt][Other source][no method][no target][no option][no type]
type: Concept
definition: 1.A.4.b.iii [Residential][Fuels][Emissions][CO2][kt][Other source][no method][no target][no option][no type]
status: valid
status modified: 2017-02-13
accepted date: 2017-02-13
in scheme: emissions_variables_MMR

1.A.4.b.iii [Residential][Fuels][Emissions][N2O][kt][Other source][no method][no target][no option][no type]
type: Concept
definition: 1.A.4.b.iii [Residential][Fuels][Emissions][N2O][kt][Other source][no method][no target][no option][no type]
status: valid
status modified: 2017-02-13
accepted date: 2017-02-13
in scheme: emissions_variables_MMR

1.A.4.b.iii [Residential][Gaseous Fuels][Emissions][CH4][kt][Other source][no method][no target][no option][no type]
type: Concept
definition: 1.A.4.b.iii [Residential][Gaseous Fuels][Emissions][CH4][kt][Other source][no method][no target][no option][no type]
status: valid
status modified: 2017-02-13
accepted date: 2017-02-13
in scheme: emissions_variables_MMR

1.A.4.b.iii [Residential][Gaseous Fuels][Emissions][CO2][kt][Other source][no method][no target][no option][no type]
type: Concept
definition: 1.A.4.b.iii [Residential][Gaseous Fuels][Emissions][CO2][kt][Other source][no method][no target][no option][no type]
status: valid
status modified: 2017-02-13
accepted date: 2017-02-13
in scheme: emissions_variables_MMR

1.A.4.b.iii [Residential][Gaseous Fuels][Emissions][N2O][kt][Other source][no method][no target][no option][no type]
type: Concept
definition: 1.A.4.b.iii [Residential][Gaseous Fuels][Emissions][N2O][kt][Other source][no method][no target][no option][no type]
status: valid
status modified: 2017-02-13
accepted date: 2017-02-13
in scheme: emissions_variables_MMR

1.A.4.b.iii [Residential][Liquid Fuels][Emissions][CH4][kt][Other source][no method][no target][no option][no type]
type: Concept
definition: 1.A.4.b.iii [Residential][Liquid Fuels][Emissions][CH4][kt][Other source][no method][no target][no option][no type]
status: valid
status modified: 2017-02-13
accepted date: 2017-02-13
in scheme: emissions_variables_MMR

1.A.4.b.iii [Residential][Liquid Fuels][Emissions][CO2][kt][Other source][no method][no target][no option][no type]
type: Concept
definition: 1.A.4.b.iii [Residential][Liquid Fuels][Emissions][CO2][kt][Other source][no method][no target][no option][no type]
status: valid
status modified: 2017-02-13
accepted date: 2017-02-13
in scheme: emissions_variables_MMR

1.A.4.b.iii [Residential][Liquid Fuels][Emissions][N2O][kt][Other source][no method][no target][no option][no type]
type: Concept
definition: 1.A.4.b.iii [Residential][Liquid Fuels][Emissions][N2O][kt][Other source][no method][no target][no option][no type]
status: valid
status modified: 2017-02-13
accepted date: 2017-02-13
in scheme: emissions_variables_MMR

1.A.4.b.iii [Residential][Other Fossil Fuels][Emissions][CH4][kt][Other source][no method][no target][no option][no type]
type: Concept
definition: 1.A.4.b.iii [Residential][Other Fossil Fuels][Emissions][CH4][kt][Other source][no method][no target][no option][no type]
status: valid
status modified: 2017-02-13
accepted date: 2017-02-13
in scheme: emissions_variables_MMR

1.A.4.b.iii [Residential][Other Fossil Fuels][Emissions][CO2][kt][Other source][no method][no target][no option][no type]
type: Concept
definition: 1.A.4.b.iii [Residential][Other Fossil Fuels][Emissions][CO2][kt][Other source][no method][no target][no option][no type]
status: valid
status modified: 2017-02-13
accepted date: 2017-02-13
in scheme: emissions_variables_MMR

1.A.4.b.iii [Residential][Other Fossil Fuels][Emissions][N2O][kt][Other source][no method][no target][no option][no type]
type: Concept
definition: 1.A.4.b.iii [Residential][Other Fossil Fuels][Emissions][N2O][kt][Other source][no method][no target][no option][no type]
status: valid
status modified: 2017-02-13
accepted date: 2017-02-13
in scheme: emissions_variables_MMR

1.A.4.b.iii [Residential][Peat][Emissions][CH4][kt][Other source][no method][no target][no option][no type]
type: Concept
definition: 1.A.4.b.iii [Residential][Peat][Emissions][CH4][kt][Other source][no method][no target][no option][no type]
status: valid
status modified: 2017-02-13
accepted date: 2017-02-13
in scheme: emissions_variables_MMR

1.A.4.b.iii [Residential][Peat][Emissions][CO2][kt][Other source][no method][no target][no option][no type]
type: Concept
definition: 1.A.4.b.iii [Residential][Peat][Emissions][CO2][kt][Other source][no method][no target][no option][no type]
status: valid
status modified: 2017-02-13
accepted date: 2017-02-13
in scheme: emissions_variables_MMR

1.A.4.b.iii [Residential][Peat][Emissions][N2O][kt][Other source][no method][no target][no option][no type]
type: Concept
definition: 1.A.4.b.iii [Residential][Peat][Emissions][N2O][kt][Other source][no method][no target][no option][no type]
status: valid
status modified: 2017-02-13
accepted date: 2017-02-13
in scheme: emissions_variables_MMR

1.A.4.b.iii [Residential][Solid Fuels][Emissions][CH4][kt][Other source][no method][no target][no option][no type]
type: Concept
definition: 1.A.4.b.iii [Residential][Solid Fuels][Emissions][CH4][kt][Other source][no method][no target][no option][no type]
status: valid
status modified: 2017-02-13
accepted date: 2017-02-13
in scheme: emissions_variables_MMR

1.A.4.b.iii [Residential][Solid Fuels][Emissions][CO2][kt][Other source][no method][no target][no option][no type]
type: Concept
definition: 1.A.4.b.iii [Residential][Solid Fuels][Emissions][CO2][kt][Other source][no method][no target][no option][no type]
status: valid
status modified: 2017-02-13
accepted date: 2017-02-13
in scheme: emissions_variables_MMR

1.A.4.b.iii [Residential][Solid Fuels][Emissions][N2O][kt][Other source][no method][no target][no option][no type]
type: Concept
definition: 1.A.4.b.iii [Residential][Solid Fuels][Emissions][N2O][kt][Other source][no method][no target][no option][no type]
status: valid
status modified: 2017-02-13
accepted date: 2017-02-13
in scheme: emissions_variables_MMR

1.A.4.c [Agriculture/Forestry/Fishing][Biomass][Emissions][CH4][kt][no source][no method][no target][no option][no type]
type: Concept
definition: 1.A.4.c [Agriculture/Forestry/Fishing][Biomass][Emissions][CH4][kt][no source][no method][no target][no option][no type]
status: valid
status modified: 2017-02-13
accepted date: 2017-02-13
in scheme: emissions_variables_MMR

1.A.4.c [Agriculture/Forestry/Fishing][Biomass][Emissions][CO2][kt][no source][no method][no target][no option][no type]
type: Concept
definition: 1.A.4.c [Agriculture/Forestry/Fishing][Biomass][Emissions][CO2][kt][no source][no method][no target][no option][no type]
status: valid
status modified: 2017-02-13
accepted date: 2017-02-13
in scheme: emissions_variables_MMR

1.A.4.c [Agriculture/Forestry/Fishing][Biomass][Emissions][N2O][kt][no source][no method][no target][no option][no type]
type: Concept
definition: 1.A.4.c [Agriculture/Forestry/Fishing][Biomass][Emissions][N2O][kt][no source][no method][no target][no option][no type]
status: valid
status modified: 2017-02-13
accepted date: 2017-02-13
in scheme: emissions_variables_MMR

1.A.4.c [Agriculture/Forestry/Fishing][Fossil fuels][Emissions][CO2][kt][no source][no method][no target][no option][no type]
type: Concept
definition: 1.A.4.c [Agriculture/Forestry/Fishing][Fossil fuels][Emissions][CO2][kt][no source][no method][no target][no option][no type]
status: valid
status modified: 2017-02-13
accepted date: 2017-02-13
in scheme: emissions_variables_MMR

1.A.4.c [Agriculture/Forestry/Fishing][Fuels][Emissions][CH4][kt][no source][no method][no target][no option][no type]
type: Concept
definition: 1.A.4.c [Agriculture/Forestry/Fishing][Fuels][Emissions][CH4][kt][no source][no method][no target][no option][no type]
status: valid
status modified: 2017-02-13
accepted date: 2017-02-13
in scheme: emissions_variables_MMR

1.A.4.c [Agriculture/Forestry/Fishing][Fuels][Emissions][CO][kt][no source][no method][no target][no option][no type]
type: Concept
definition: 1.A.4.c [Agriculture/Forestry/Fishing][Fuels][Emissions][CO][kt][no source][no method][no target][no option][no type]
status: valid
status modified: 2017-02-13
accepted date: 2017-02-13
in scheme: emissions_variables_MMR

1.A.4.c [Agriculture/Forestry/Fishing][Fuels][Emissions][N2O][kt][no source][no method][no target][no option][no type]
type: Concept
definition: 1.A.4.c [Agriculture/Forestry/Fishing][Fuels][Emissions][N2O][kt][no source][no method][no target][no option][no type]
status: valid
status modified: 2017-02-13
accepted date: 2017-02-13
in scheme: emissions_variables_MMR

1.A.4.c [Agriculture/Forestry/Fishing][Fuels][Emissions][NMVOC][kt][no source][no method][no target][no option][no type]
type: Concept
definition: 1.A.4.c [Agriculture/Forestry/Fishing][Fuels][Emissions][NMVOC][kt][no source][no method][no target][no option][no type]
status: valid
status modified: 2017-02-13
accepted date: 2017-02-13
in scheme: emissions_variables_MMR

1.A.4.c [Agriculture/Forestry/Fishing][Fuels][Emissions][NOx][kt][no source][no method][no target][no option][no type]
type: Concept
definition: 1.A.4.c [Agriculture/Forestry/Fishing][Fuels][Emissions][NOx][kt][no source][no method][no target][no option][no type]
status: valid
status modified: 2017-02-13
accepted date: 2017-02-13
in scheme: emissions_variables_MMR

1.A.4.c [Agriculture/Forestry/Fishing][Fuels][Emissions][SO2][kt][no source][no method][no target][no option][no type]
type: Concept
definition: 1.A.4.c [Agriculture/Forestry/Fishing][Fuels][Emissions][SO2][kt][no source][no method][no target][no option][no type]
status: valid
status modified: 2017-02-13
accepted date: 2017-02-13
in scheme: emissions_variables_MMR

1.A.4.c [Agriculture/Forestry/Fishing][Gaseous Fuels][Emissions][CH4][kt][no source][no method][no target][no option][no type]
type: Concept
definition: 1.A.4.c [Agriculture/Forestry/Fishing][Gaseous Fuels][Emissions][CH4][kt][no source][no method][no target][no option][no type]
status: valid
status modified: 2017-02-13
accepted date: 2017-02-13
in scheme: emissions_variables_MMR

1.A.4.c [Agriculture/Forestry/Fishing][Gaseous Fuels][Emissions][CO2][kt][no source][no method][no target][no option][no type]
type: Concept
definition: 1.A.4.c [Agriculture/Forestry/Fishing][Gaseous Fuels][Emissions][CO2][kt][no source][no method][no target][no option][no type]
status: valid
status modified: 2017-02-13
accepted date: 2017-02-13
in scheme: emissions_variables_MMR

1.A.4.c [Agriculture/Forestry/Fishing][Gaseous Fuels][Emissions][N2O][kt][no source][no method][no target][no option][no type]
type: Concept
definition: 1.A.4.c [Agriculture/Forestry/Fishing][Gaseous Fuels][Emissions][N2O][kt][no source][no method][no target][no option][no type]
status: valid
status modified: 2017-02-13
accepted date: 2017-02-13
in scheme: emissions_variables_MMR

1.A.4.c [Agriculture/Forestry/Fishing][Liquid Fuels][Emissions][CH4][kt][no source][no method][no target][no option][no type]
type: Concept
definition: 1.A.4.c [Agriculture/Forestry/Fishing][Liquid Fuels][Emissions][CH4][kt][no source][no method][no target][no option][no type]
status: valid
status modified: 2017-02-13
accepted date: 2017-02-13
in scheme: emissions_variables_MMR

1.A.4.c [Agriculture/Forestry/Fishing][Liquid Fuels][Emissions][CO2][kt][no source][no method][no target][no option][no type]
type: Concept
definition: 1.A.4.c [Agriculture/Forestry/Fishing][Liquid Fuels][Emissions][CO2][kt][no source][no method][no target][no option][no type]
status: valid
status modified: 2017-02-13
accepted date: 2017-02-13
in scheme: emissions_variables_MMR

1.A.4.c [Agriculture/Forestry/Fishing][Liquid Fuels][Emissions][N2O][kt][no source][no method][no target][no option][no type]
type: Concept
definition: 1.A.4.c [Agriculture/Forestry/Fishing][Liquid Fuels][Emissions][N2O][kt][no source][no method][no target][no option][no type]
status: valid
status modified: 2017-02-13
accepted date: 2017-02-13
in scheme: emissions_variables_MMR

1.A.4.c [Agriculture/Forestry/Fishing][Other Fossil Fuels][Emissions][CH4][kt][no source][no method][no target][no option][no type]
type: Concept
definition: 1.A.4.c [Agriculture/Forestry/Fishing][Other Fossil Fuels][Emissions][CH4][kt][no source][no method][no target][no option][no type]
status: valid
status modified: 2017-02-13
accepted date: 2017-02-13
in scheme: emissions_variables_MMR

1.A.4.c [Agriculture/Forestry/Fishing][Other Fossil Fuels][Emissions][CO2][kt][no source][no method][no target][no option][no type]
type: Concept
definition: 1.A.4.c [Agriculture/Forestry/Fishing][Other Fossil Fuels][Emissions][CO2][kt][no source][no method][no target][no option][no type]
status: valid
status modified: 2017-02-13
accepted date: 2017-02-13
in scheme: emissions_variables_MMR

1.A.4.c [Agriculture/Forestry/Fishing][Other Fossil Fuels][Emissions][N2O][kt][no source][no method][no target][no option][no type]
type: Concept
definition: 1.A.4.c [Agriculture/Forestry/Fishing][Other Fossil Fuels][Emissions][N2O][kt][no source][no method][no target][no option][no type]
status: valid
status modified: 2017-02-13
accepted date: 2017-02-13
in scheme: emissions_variables_MMR

1.A.4.c [Agriculture/Forestry/Fishing][Peat][Emissions][CH4][kt][no source][no method][no target][no option][no type]
type: Concept
definition: 1.A.4.c [Agriculture/Forestry/Fishing][Peat][Emissions][CH4][kt][no source][no method][no target][no option][no type]
status: valid
status modified: 2017-02-13
accepted date: 2017-02-13
in scheme: emissions_variables_MMR

1.A.4.c [Agriculture/Forestry/Fishing][Peat][Emissions][CO2][kt][no source][no method][no target][no option][no type]
type: Concept
definition: 1.A.4.c [Agriculture/Forestry/Fishing][Peat][Emissions][CO2][kt][no source][no method][no target][no option][no type]
status: valid
status modified: 2017-02-13
accepted date: 2017-02-13
in scheme: emissions_variables_MMR

1.A.4.c [Agriculture/Forestry/Fishing][Peat][Emissions][N2O][kt][no source][no method][no target][no option][no type]
type: Concept
definition: 1.A.4.c [Agriculture/Forestry/Fishing][Peat][Emissions][N2O][kt][no source][no method][no target][no option][no type]
status: valid
status modified: 2017-02-13
accepted date: 2017-02-13
in scheme: emissions_variables_MMR

1.A.4.c [Agriculture/Forestry/Fishing][Solid Fuels][Emissions][CH4][kt][no source][no method][no target][no option][no type]
type: Concept
definition: 1.A.4.c [Agriculture/Forestry/Fishing][Solid Fuels][Emissions][CH4][kt][no source][no method][no target][no option][no type]
status: valid
status modified: 2017-02-13
accepted date: 2017-02-13
in scheme: emissions_variables_MMR

1.A.4.c [Agriculture/Forestry/Fishing][Solid Fuels][Emissions][CO2][kt][no source][no method][no target][no option][no type]
type: Concept
definition: 1.A.4.c [Agriculture/Forestry/Fishing][Solid Fuels][Emissions][CO2][kt][no source][no method][no target][no option][no type]
status: valid
status modified: 2017-02-13
accepted date: 2017-02-13
in scheme: emissions_variables_MMR

1.A.4.c [Agriculture/Forestry/Fishing][Solid Fuels][Emissions][N2O][kt][no source][no method][no target][no option][no type]
type: Concept
definition: 1.A.4.c [Agriculture/Forestry/Fishing][Solid Fuels][Emissions][N2O][kt][no source][no method][no target][no option][no type]
status: valid
status modified: 2017-02-13
accepted date: 2017-02-13
in scheme: emissions_variables_MMR

1.A.4.c.i [Agriculture/Forestry/Fishing][Fuels][Emissions][CH4][kt][Stationary combustion][no method][no target][no option][no type]
type: Concept
definition: 1.A.4.c.i [Agriculture/Forestry/Fishing][Fuels][Emissions][CH4][kt][Stationary combustion][no method][no target][no option][no type]
status: valid
status modified: 2017-02-13
accepted date: 2017-02-13
in scheme: emissions_variables_MMR

1.A.4.c.i [Agriculture/Forestry/Fishing][Fuels][Emissions][CO2][kt][Stationary combustion][no method][no target][no option][no type]
type: Concept
definition: 1.A.4.c.i [Agriculture/Forestry/Fishing][Fuels][Emissions][CO2][kt][Stationary combustion][no method][no target][no option][no type]
status: valid
status modified: 2017-02-13
accepted date: 2017-02-13
in scheme: emissions_variables_MMR

1.A.4.c.i [Agriculture/Forestry/Fishing][Fuels][Emissions][N2O][kt][Stationary combustion][no method][no target][no option][no type]
type: Concept
definition: 1.A.4.c.i [Agriculture/Forestry/Fishing][Fuels][Emissions][N2O][kt][Stationary combustion][no method][no target][no option][no type]
status: valid
status modified: 2017-02-13
accepted date: 2017-02-13
in scheme: emissions_variables_MMR

1.A.4.c.i Biomass [Agriculture/Forestry/Fishing][Biomass][Emissions][CH4][kt][Stationary combustion][no method][no target][no option][no type]
type: Concept
definition: 1.A.4.c.i Biomass [Agriculture/Forestry/Fishing][Biomass][Emissions][CH4][kt][Stationary combustion][no method][no target][no option][no type]
status: valid
status modified: 2017-02-13
accepted date: 2017-02-13
in scheme: emissions_variables_MMR

1.A.4.c.i Biomass [Agriculture/Forestry/Fishing][Biomass][Emissions][CO2][kt][Stationary combustion][no method][no target][no option][no type]
type: Concept
definition: 1.A.4.c.i Biomass [Agriculture/Forestry/Fishing][Biomass][Emissions][CO2][kt][Stationary combustion][no method][no target][no option][no type]
status: valid
status modified: 2017-02-13
accepted date: 2017-02-13
in scheme: emissions_variables_MMR

1.A.4.c.i Biomass [Agriculture/Forestry/Fishing][Biomass][Emissions][N2O][kt][Stationary combustion][no method][no target][no option][no type]
type: Concept
definition: 1.A.4.c.i Biomass [Agriculture/Forestry/Fishing][Biomass][Emissions][N2O][kt][Stationary combustion][no method][no target][no option][no type]
status: valid
status modified: 2017-02-13
accepted date: 2017-02-13
in scheme: emissions_variables_MMR

1.A.4.c.i Gaseous Fuels [Agriculture/Forestry/Fishing][Gaseous Fuels][Emissions][CH4][kt][Stationary combustion][no method][no target][no option][no type]
type: Concept
definition: 1.A.4.c.i Gaseous Fuels [Agriculture/Forestry/Fishing][Gaseous Fuels][Emissions][CH4][kt][Stationary combustion][no method][no target][no option][no type]
status: valid
status modified: 2017-02-13
accepted date: 2017-02-13
in scheme: emissions_variables_MMR

1.A.4.c.i Gaseous Fuels [Agriculture/Forestry/Fishing][Gaseous Fuels][Emissions][CO2][kt][Stationary combustion][no method][no target][no option][no type]
type: Concept
definition: 1.A.4.c.i Gaseous Fuels [Agriculture/Forestry/Fishing][Gaseous Fuels][Emissions][CO2][kt][Stationary combustion][no method][no target][no option][no type]
status: valid
status modified: 2017-02-13
accepted date: 2017-02-13
in scheme: emissions_variables_MMR

1.A.4.c.i Gaseous Fuels [Agriculture/Forestry/Fishing][Gaseous Fuels][Emissions][N2O][kt][Stationary combustion][no method][no target][no option][no type]
type: Concept
definition: 1.A.4.c.i Gaseous Fuels [Agriculture/Forestry/Fishing][Gaseous Fuels][Emissions][N2O][kt][Stationary combustion][no method][no target][no option][no type]
status: valid
status modified: 2017-02-13
accepted date: 2017-02-13
in scheme: emissions_variables_MMR

1.A.4.c.i Liquid Fuels [Agriculture/Forestry/Fishing][Liquid Fuels][Emissions][CH4][kt][Stationary combustion][no method][no target][no option][no type]
type: Concept
definition: 1.A.4.c.i Liquid Fuels [Agriculture/Forestry/Fishing][Liquid Fuels][Emissions][CH4][kt][Stationary combustion][no method][no target][no option][no type]
status: valid
status modified: 2017-02-13
accepted date: 2017-02-13
in scheme: emissions_variables_MMR

1.A.4.c.i Liquid Fuels [Agriculture/Forestry/Fishing][Liquid Fuels][Emissions][CO2][kt][Stationary combustion][no method][no target][no option][no type]
type: Concept
definition: 1.A.4.c.i Liquid Fuels [Agriculture/Forestry/Fishing][Liquid Fuels][Emissions][CO2][kt][Stationary combustion][no method][no target][no option][no type]
status: valid
status modified: 2017-02-13
accepted date: 2017-02-13
in scheme: emissions_variables_MMR

1.A.4.c.i Liquid Fuels [Agriculture/Forestry/Fishing][Liquid Fuels][Emissions][N2O][kt][Stationary combustion][no method][no target][no option][no type]
type: Concept
definition: 1.A.4.c.i Liquid Fuels [Agriculture/Forestry/Fishing][Liquid Fuels][Emissions][N2O][kt][Stationary combustion][no method][no target][no option][no type]
status: valid
status modified: 2017-02-13
accepted date: 2017-02-13
in scheme: emissions_variables_MMR

1.A.4.c.i Other Fossil Fuels [Agriculture/Forestry/Fishing][Other Fossil Fuels][Emissions][CH4][kt][Stationary combustion][no method][no target][no option][no type]
type: Concept
definition: 1.A.4.c.i Other Fossil Fuels [Agriculture/Forestry/Fishing][Other Fossil Fuels][Emissions][CH4][kt][Stationary combustion][no method][no target][no option][no type]
status: valid
status modified: 2017-02-13
accepted date: 2017-02-13
in scheme: emissions_variables_MMR

1.A.4.c.i Other Fossil Fuels [Agriculture/Forestry/Fishing][Other Fossil Fuels][Emissions][CO2][kt][Stationary combustion][no method][no target][no option][no type]
type: Concept
definition: 1.A.4.c.i Other Fossil Fuels [Agriculture/Forestry/Fishing][Other Fossil Fuels][Emissions][CO2][kt][Stationary combustion][no method][no target][no option][no type]
status: valid
status modified: 2017-02-13
accepted date: 2017-02-13
in scheme: emissions_variables_MMR

1.A.4.c.i Other Fossil Fuels [Agriculture/Forestry/Fishing][Other Fossil Fuels][Emissions][N2O][kt][Stationary combustion][no method][no target][no option][no type]
type: Concept
definition: 1.A.4.c.i Other Fossil Fuels [Agriculture/Forestry/Fishing][Other Fossil Fuels][Emissions][N2O][kt][Stationary combustion][no method][no target][no option][no type]
status: valid
status modified: 2017-02-13
accepted date: 2017-02-13
in scheme: emissions_variables_MMR

1.A.4.c.i Peat [Agriculture/Forestry/Fishing][Peat][Emissions][CH4][kt][Stationary combustion][no method][no target][no option][no type]
type: Concept
definition: 1.A.4.c.i Peat [Agriculture/Forestry/Fishing][Peat][Emissions][CH4][kt][Stationary combustion][no method][no target][no option][no type]
status: valid
status modified: 2017-02-13
accepted date: 2017-02-13
in scheme: emissions_variables_MMR

1.A.4.c.i Peat [Agriculture/Forestry/Fishing][Peat][Emissions][CO2][kt][Stationary combustion][no method][no target][no option][no type]
type: Concept
definition: 1.A.4.c.i Peat [Agriculture/Forestry/Fishing][Peat][Emissions][CO2][kt][Stationary combustion][no method][no target][no option][no type]
status: valid
status modified: 2017-02-13
accepted date: 2017-02-13
in scheme: emissions_variables_MMR

1.A.4.c.i Peat [Agriculture/Forestry/Fishing][Peat][Emissions][N2O][kt][Stationary combustion][no method][no target][no option][no type]
type: Concept
definition: 1.A.4.c.i Peat [Agriculture/Forestry/Fishing][Peat][Emissions][N2O][kt][Stationary combustion][no method][no target][no option][no type]
status: valid
status modified: 2017-02-13
accepted date: 2017-02-13
in scheme: emissions_variables_MMR

1.A.4.c.i Solid Fuels [Agriculture/Forestry/Fishing][Solid Fuels][Emissions][CH4][kt][Stationary combustion][no method][no target][no option][no type]
type: Concept
definition: 1.A.4.c.i Solid Fuels [Agriculture/Forestry/Fishing][Solid Fuels][Emissions][CH4][kt][Stationary combustion][no method][no target][no option][no type]
status: valid
status modified: 2017-02-13
accepted date: 2017-02-13
in scheme: emissions_variables_MMR

1.A.4.c.i Solid Fuels [Agriculture/Forestry/Fishing][Solid Fuels][Emissions][CO2][kt][Stationary combustion][no method][no target][no option][no type]
type: Concept
definition: 1.A.4.c.i Solid Fuels [Agriculture/Forestry/Fishing][Solid Fuels][Emissions][CO2][kt][Stationary combustion][no method][no target][no option][no type]
status: valid
status modified: 2017-02-13
accepted date: 2017-02-13
in scheme: emissions_variables_MMR

1.A.4.c.i Solid Fuels [Agriculture/Forestry/Fishing][Solid Fuels][Emissions][N2O][kt][Stationary combustion][no method][no target][no option][no type]
type: Concept
definition: 1.A.4.c.i Solid Fuels [Agriculture/Forestry/Fishing][Solid Fuels][Emissions][N2O][kt][Stationary combustion][no method][no target][no option][no type]
status: valid
status modified: 2017-02-13
accepted date: 2017-02-13
in scheme: emissions_variables_MMR

1.A.4.c.ii [Agriculture/Forestry/Fishing][Fuels][Emissions][CH4][kt][Off-road vehicles and other machinery][no method][no target][no option][no type]
type: Concept
definition: 1.A.4.c.ii [Agriculture/Forestry/Fishing][Fuels][Emissions][CH4][kt][Off-road vehicles and other machinery][no method][no target][no option][no type]
status: valid
status modified: 2017-02-13
accepted date: 2017-02-13
in scheme: emissions_variables_MMR

1.A.4.c.ii [Agriculture/Forestry/Fishing][Fuels][Emissions][CO2][kt][Off-road vehicles and other machinery][no method][no target][no option][no type]
type: Concept
definition: 1.A.4.c.ii [Agriculture/Forestry/Fishing][Fuels][Emissions][CO2][kt][Off-road vehicles and other machinery][no method][no target][no option][no type]
status: valid
status modified: 2017-02-13
accepted date: 2017-02-13
in scheme: emissions_variables_MMR

1.A.4.c.ii [Agriculture/Forestry/Fishing][Fuels][Emissions][N2O][kt][Off-road vehicles and other machinery][no method][no target][no option][no type]
type: Concept
definition: 1.A.4.c.ii [Agriculture/Forestry/Fishing][Fuels][Emissions][N2O][kt][Off-road vehicles and other machinery][no method][no target][no option][no type]
status: valid
status modified: 2017-02-13
accepted date: 2017-02-13
in scheme: emissions_variables_MMR

1.A.4.c.ii [Agriculture/Forestry/Fishing][Liquid Fuels][Emissions][CH4][kt][Off-road vehicles and other machinery][no method][no target][no option][no type]
type: Concept
definition: 1.A.4.c.ii [Agriculture/Forestry/Fishing][Liquid Fuels][Emissions][CH4][kt][Off-road vehicles and other machinery][no method][no target][no option][no type]
status: valid
status modified: 2017-02-13
accepted date: 2017-02-13
in scheme: emissions_variables_MMR

1.A.4.c.ii [Agriculture/Forestry/Fishing][Liquid Fuels][Emissions][CO2][kt][Off-road vehicles and other machinery][no method][no target][no option][no type]
type: Concept
definition: 1.A.4.c.ii [Agriculture/Forestry/Fishing][Liquid Fuels][Emissions][CO2][kt][Off-road vehicles and other machinery][no method][no target][no option][no type]
status: valid
status modified: 2017-02-13
accepted date: 2017-02-13
in scheme: emissions_variables_MMR

1.A.4.c.ii [Agriculture/Forestry/Fishing][Liquid Fuels][Emissions][N2O][kt][Off-road vehicles and other machinery][no method][no target][no option][no type]
type: Concept
definition: 1.A.4.c.ii [Agriculture/Forestry/Fishing][Liquid Fuels][Emissions][N2O][kt][Off-road vehicles and other machinery][no method][no target][no option][no type]
status: valid
status modified: 2017-02-13
accepted date: 2017-02-13
in scheme: emissions_variables_MMR

1.A.4.c.ii Biomass [Agriculture/Forestry/Fishing][Biomass][Emissions][CH4][kt][Off-road vehicles and other machinery][no method][no target][no option][no type]
type: Concept
definition: 1.A.4.c.ii Biomass [Agriculture/Forestry/Fishing][Biomass][Emissions][CH4][kt][Off-road vehicles and other machinery][no method][no target][no option][no type]
status: valid
status modified: 2017-02-13
accepted date: 2017-02-13
in scheme: emissions_variables_MMR

1.A.4.c.ii Biomass [Agriculture/Forestry/Fishing][Biomass][Emissions][CO2][kt][Off-road vehicles and other machinery][no method][no target][no option][no type]
type: Concept
definition: 1.A.4.c.ii Biomass [Agriculture/Forestry/Fishing][Biomass][Emissions][CO2][kt][Off-road vehicles and other machinery][no method][no target][no option][no type]
status: valid
status modified: 2017-02-13
accepted date: 2017-02-13
in scheme: emissions_variables_MMR

1.A.4.c.ii Biomass [Agriculture/Forestry/Fishing][Biomass][Emissions][N2O][kt][Off-road vehicles and other machinery][no method][no target][no option][no type]
type: Concept
definition: 1.A.4.c.ii Biomass [Agriculture/Forestry/Fishing][Biomass][Emissions][N2O][kt][Off-road vehicles and other machinery][no method][no target][no option][no type]
status: valid
status modified: 2017-02-13
accepted date: 2017-02-13
in scheme: emissions_variables_MMR

1.A.4.c.ii Diesel Oil [Agriculture/Forestry/Fishing][Diesel Oil][Emissions][CH4][kt][Off-road vehicles and other machinery][no method][no target][no option][no type]
type: Concept
definition: 1.A.4.c.ii Diesel Oil [Agriculture/Forestry/Fishing][Diesel Oil][Emissions][CH4][kt][Off-road vehicles and other machinery][no method][no target][no option][no type]
status: valid
status modified: 2017-02-13
accepted date: 2017-02-13
in scheme: emissions_variables_MMR

1.A.4.c.ii Diesel Oil [Agriculture/Forestry/Fishing][Diesel Oil][Emissions][CO2][kt][Off-road vehicles and other machinery][no method][no target][no option][no type]
type: Concept
definition: 1.A.4.c.ii Diesel Oil [Agriculture/Forestry/Fishing][Diesel Oil][Emissions][CO2][kt][Off-road vehicles and other machinery][no method][no target][no option][no type]
status: valid
status modified: 2017-02-13
accepted date: 2017-02-13
in scheme: emissions_variables_MMR

1.A.4.c.ii Diesel Oil [Agriculture/Forestry/Fishing][Diesel Oil][Emissions][N2O][kt][Off-road vehicles and other machinery][no method][no target][no option][no type]
type: Concept
definition: 1.A.4.c.ii Diesel Oil [Agriculture/Forestry/Fishing][Diesel Oil][Emissions][N2O][kt][Off-road vehicles and other machinery][no method][no target][no option][no type]
status: valid
status modified: 2017-02-13
accepted date: 2017-02-13
in scheme: emissions_variables_MMR

1.A.4.c.ii Gaseous Fuels [Agriculture/Forestry/Fishing][Gaseous Fuels][Emissions][CH4][kt][Off-road vehicles and other machinery][no method][no target][no option][no type]
type: Concept
definition: 1.A.4.c.ii Gaseous Fuels [Agriculture/Forestry/Fishing][Gaseous Fuels][Emissions][CH4][kt][Off-road vehicles and other machinery][no method][no target][no option][no type]
status: valid
status modified: 2017-02-13
accepted date: 2017-02-13
in scheme: emissions_variables_MMR

1.A.4.c.ii Gaseous Fuels [Agriculture/Forestry/Fishing][Gaseous Fuels][Emissions][CO2][kt][Off-road vehicles and other machinery][no method][no target][no option][no type]
type: Concept
definition: 1.A.4.c.ii Gaseous Fuels [Agriculture/Forestry/Fishing][Gaseous Fuels][Emissions][CO2][kt][Off-road vehicles and other machinery][no method][no target][no option][no type]
status: valid
status modified: 2017-02-13
accepted date: 2017-02-13
in scheme: emissions_variables_MMR

1.A.4.c.ii Gaseous Fuels [Agriculture/Forestry/Fishing][Gaseous Fuels][Emissions][N2O][kt][Off-road vehicles and other machinery][no method][no target][no option][no type]
type: Concept
definition: 1.A.4.c.ii Gaseous Fuels [Agriculture/Forestry/Fishing][Gaseous Fuels][Emissions][N2O][kt][Off-road vehicles and other machinery][no method][no target][no option][no type]
status: valid
status modified: 2017-02-13
accepted date: 2017-02-13
in scheme: emissions_variables_MMR

1.A.4.c.ii Gasoline [Agriculture/Forestry/Fishing][Gasoline][Emissions][CH4][kt][Off-road vehicles and other machinery][no method][no target][no option][no type]
type: Concept
definition: 1.A.4.c.ii Gasoline [Agriculture/Forestry/Fishing][Gasoline][Emissions][CH4][kt][Off-road vehicles and other machinery][no method][no target][no option][no type]
status: valid
status modified: 2017-02-13
accepted date: 2017-02-13
in scheme: emissions_variables_MMR

1.A.4.c.ii Gasoline [Agriculture/Forestry/Fishing][Gasoline][Emissions][CO2][kt][Off-road vehicles and other machinery][no method][no target][no option][no type]
type: Concept
definition: 1.A.4.c.ii Gasoline [Agriculture/Forestry/Fishing][Gasoline][Emissions][CO2][kt][Off-road vehicles and other machinery][no method][no target][no option][no type]
status: valid
status modified: 2017-02-13
accepted date: 2017-02-13
in scheme: emissions_variables_MMR

1.A.4.c.ii Gasoline [Agriculture/Forestry/Fishing][Gasoline][Emissions][N2O][kt][Off-road vehicles and other machinery][no method][no target][no option][no type]
type: Concept
definition: 1.A.4.c.ii Gasoline [Agriculture/Forestry/Fishing][Gasoline][Emissions][N2O][kt][Off-road vehicles and other machinery][no method][no target][no option][no type]
status: valid
status modified: 2017-02-13
accepted date: 2017-02-13
in scheme: emissions_variables_MMR

1.A.4.c.ii LPG [Agriculture/Forestry/Fishing][Liquefied Petroleum Gases (LPG)][Emissions][CH4][kt][Off-road vehicles and other machinery][no method][no target][no option][no type]
type: Concept
definition: 1.A.4.c.ii LPG [Agriculture/Forestry/Fishing][Liquefied Petroleum Gases (LPG)][Emissions][CH4][kt][Off-road vehicles and other machinery][no method][no target][no option][no type]
status: valid
status modified: 2017-02-13
accepted date: 2017-02-13
in scheme: emissions_variables_MMR

1.A.4.c.ii LPG [Agriculture/Forestry/Fishing][Liquefied Petroleum Gases (LPG)][Emissions][CO2][kt][Off-road vehicles and other machinery][no method][no target][no option][no type]
type: Concept
definition: 1.A.4.c.ii LPG [Agriculture/Forestry/Fishing][Liquefied Petroleum Gases (LPG)][Emissions][CO2][kt][Off-road vehicles and other machinery][no method][no target][no option][no type]
status: valid
status modified: 2017-02-13
accepted date: 2017-02-13
in scheme: emissions_variables_MMR

1.A.4.c.ii LPG [Agriculture/Forestry/Fishing][Liquefied Petroleum Gases (LPG)][Emissions][N2O][kt][Off-road vehicles and other machinery][no method][no target][no option][no type]
type: Concept
definition: 1.A.4.c.ii LPG [Agriculture/Forestry/Fishing][Liquefied Petroleum Gases (LPG)][Emissions][N2O][kt][Off-road vehicles and other machinery][no method][no target][no option][no type]
status: valid
status modified: 2017-02-13
accepted date: 2017-02-13
in scheme: emissions_variables_MMR

1.A.4.c.ii Other Fossil Fuels [Agriculture/Forestry/Fishing][Other Fossil Fuels][Emissions][CH4][kt][Off-road vehicles and other machinery][no method][no target][no option][no type]
type: Concept
definition: 1.A.4.c.ii Other Fossil Fuels [Agriculture/Forestry/Fishing][Other Fossil Fuels][Emissions][CH4][kt][Off-road vehicles and other machinery][no method][no target][no option][no type]
status: valid
status modified: 2017-02-13
accepted date: 2017-02-13
in scheme: emissions_variables_MMR

1.A.4.c.ii Other Fossil Fuels [Agriculture/Forestry/Fishing][Other Fossil Fuels][Emissions][CO2][kt][Off-road vehicles and other machinery][no method][no target][no option][no type]
type: Concept
definition: 1.A.4.c.ii Other Fossil Fuels [Agriculture/Forestry/Fishing][Other Fossil Fuels][Emissions][CO2][kt][Off-road vehicles and other machinery][no method][no target][no option][no type]
status: valid
status modified: 2017-02-13
accepted date: 2017-02-13
in scheme: emissions_variables_MMR

1.A.4.c.ii Other Fossil Fuels [Agriculture/Forestry/Fishing][Other Fossil Fuels][Emissions][N2O][kt][Off-road vehicles and other machinery][no method][no target][no option][no type]
type: Concept
definition: 1.A.4.c.ii Other Fossil Fuels [Agriculture/Forestry/Fishing][Other Fossil Fuels][Emissions][N2O][kt][Off-road vehicles and other machinery][no method][no target][no option][no type]
status: valid
status modified: 2017-02-13
accepted date: 2017-02-13
in scheme: emissions_variables_MMR

1.A.4.c.ii Other Liquid Fuels [Agriculture/Forestry/Fishing][Other Liquid Fuels][Emissions][CH4][kt][Off-road vehicles and other machinery][no method][no target][no option][no type]
type: Concept
definition: 1.A.4.c.ii Other Liquid Fuels [Agriculture/Forestry/Fishing][Other Liquid Fuels][Emissions][CH4][kt][Off-road vehicles and other machinery][no method][no target][no option][no type]
status: valid
status modified: 2017-02-13
accepted date: 2017-02-13
in scheme: emissions_variables_MMR

1.A.4.c.ii Other Liquid Fuels [Agriculture/Forestry/Fishing][Other Liquid Fuels][Emissions][CO2][kt][Off-road vehicles and other machinery][no method][no target][no option][no type]
type: Concept
definition: 1.A.4.c.ii Other Liquid Fuels [Agriculture/Forestry/Fishing][Other Liquid Fuels][Emissions][CO2][kt][Off-road vehicles and other machinery][no method][no target][no option][no type]
status: valid
status modified: 2017-02-13
accepted date: 2017-02-13
in scheme: emissions_variables_MMR

1.A.4.c.ii Other Liquid Fuels [Agriculture/Forestry/Fishing][Other Liquid Fuels][Emissions][N2O][kt][Off-road vehicles and other machinery][no method][no target][no option][no type]
type: Concept
definition: 1.A.4.c.ii Other Liquid Fuels [Agriculture/Forestry/Fishing][Other Liquid Fuels][Emissions][N2O][kt][Off-road vehicles and other machinery][no method][no target][no option][no type]
status: valid
status modified: 2017-02-13
accepted date: 2017-02-13
in scheme: emissions_variables_MMR

1.A.4.c.iii [Agriculture/Forestry/Fishing][Fuels][Emissions][CH4][kt][Fishing][no method][no target][no option][no type]
type: Concept
definition: 1.A.4.c.iii [Agriculture/Forestry/Fishing][Fuels][Emissions][CH4][kt][Fishing][no method][no target][no option][no type]
status: valid
status modified: 2017-02-13
accepted date: 2017-02-13
in scheme: emissions_variables_MMR

1.A.4.c.iii [Agriculture/Forestry/Fishing][Fuels][Emissions][CO2][kt][Fishing][no method][no target][no option][no type]
type: Concept
definition: 1.A.4.c.iii [Agriculture/Forestry/Fishing][Fuels][Emissions][CO2][kt][Fishing][no method][no target][no option][no type]
status: valid
status modified: 2017-02-13
accepted date: 2017-02-13
in scheme: emissions_variables_MMR

1.A.4.c.iii [Agriculture/Forestry/Fishing][Fuels][Emissions][N2O][kt][Fishing][no method][no target][no option][no type]
type: Concept
definition: 1.A.4.c.iii [Agriculture/Forestry/Fishing][Fuels][Emissions][N2O][kt][Fishing][no method][no target][no option][no type]
status: valid
status modified: 2017-02-13
accepted date: 2017-02-13
in scheme: emissions_variables_MMR

1.A.4.c.iii [Agriculture/Forestry/Fishing][Liquid Fuels][Emissions][CH4][kt][Fishing][no method][no target][no option][no type]
type: Concept
definition: 1.A.4.c.iii [Agriculture/Forestry/Fishing][Liquid Fuels][Emissions][CH4][kt][Fishing][no method][no target][no option][no type]
status: valid
status modified: 2017-02-13
accepted date: 2017-02-13
in scheme: emissions_variables_MMR

1.A.4.c.iii [Agriculture/Forestry/Fishing][Liquid Fuels][Emissions][CO2][kt][Fishing][no method][no target][no option][no type]
type: Concept
definition: 1.A.4.c.iii [Agriculture/Forestry/Fishing][Liquid Fuels][Emissions][CO2][kt][Fishing][no method][no target][no option][no type]
status: valid
status modified: 2017-02-13
accepted date: 2017-02-13
in scheme: emissions_variables_MMR

1.A.4.c.iii [Agriculture/Forestry/Fishing][Liquid Fuels][Emissions][N2O][kt][Fishing][no method][no target][no option][no type]
type: Concept
definition: 1.A.4.c.iii [Agriculture/Forestry/Fishing][Liquid Fuels][Emissions][N2O][kt][Fishing][no method][no target][no option][no type]
status: valid
status modified: 2017-02-13
accepted date: 2017-02-13
in scheme: emissions_variables_MMR

1.A.4.c.iii Biomass [Agriculture/Forestry/Fishing][Biomass][Emissions][CH4][kt][Fishing][no method][no target][no option][no type]
type: Concept
definition: 1.A.4.c.iii Biomass [Agriculture/Forestry/Fishing][Biomass][Emissions][CH4][kt][Fishing][no method][no target][no option][no type]
status: valid
status modified: 2017-02-13
accepted date: 2017-02-13
in scheme: emissions_variables_MMR

1.A.4.c.iii Biomass [Agriculture/Forestry/Fishing][Biomass][Emissions][CO2][kt][Fishing][no method][no target][no option][no type]
type: Concept
definition: 1.A.4.c.iii Biomass [Agriculture/Forestry/Fishing][Biomass][Emissions][CO2][kt][Fishing][no method][no target][no option][no type]
status: valid
status modified: 2017-02-13
accepted date: 2017-02-13
in scheme: emissions_variables_MMR

1.A.4.c.iii Biomass [Agriculture/Forestry/Fishing][Biomass][Emissions][N2O][kt][Fishing][no method][no target][no option][no type]
type: Concept
definition: 1.A.4.c.iii Biomass [Agriculture/Forestry/Fishing][Biomass][Emissions][N2O][kt][Fishing][no method][no target][no option][no type]
status: valid
status modified: 2017-02-13
accepted date: 2017-02-13
in scheme: emissions_variables_MMR

1.A.4.c.iii Gas/Diesel Oil [Agriculture/Forestry/Fishing][Gas/Diesel Oil][Emissions][CH4][kt][Fishing][no method][no target][no option][no type]
type: Concept
definition: 1.A.4.c.iii Gas/Diesel Oil [Agriculture/Forestry/Fishing][Gas/Diesel Oil][Emissions][CH4][kt][Fishing][no method][no target][no option][no type]
status: valid
status modified: 2017-02-13
accepted date: 2017-02-13
in scheme: emissions_variables_MMR

1.A.4.c.iii Gas/Diesel Oil [Agriculture/Forestry/Fishing][Gas/Diesel Oil][Emissions][CO2][kt][Fishing][no method][no target][no option][no type]
type: Concept
definition: 1.A.4.c.iii Gas/Diesel Oil [Agriculture/Forestry/Fishing][Gas/Diesel Oil][Emissions][CO2][kt][Fishing][no method][no target][no option][no type]
status: valid
status modified: 2017-02-13
accepted date: 2017-02-13
in scheme: emissions_variables_MMR

1.A.4.c.iii Gas/Diesel Oil [Agriculture/Forestry/Fishing][Gas/Diesel Oil][Emissions][N2O][kt][Fishing][no method][no target][no option][no type]
type: Concept
definition: 1.A.4.c.iii Gas/Diesel Oil [Agriculture/Forestry/Fishing][Gas/Diesel Oil][Emissions][N2O][kt][Fishing][no method][no target][no option][no type]
status: valid
status modified: 2017-02-13
accepted date: 2017-02-13
in scheme: emissions_variables_MMR

1.A.4.c.iii Gaseous Fuels [Agriculture/Forestry/Fishing][Gaseous Fuels][Emissions][CH4][kt][Fishing][no method][no target][no option][no type]
type: Concept
definition: 1.A.4.c.iii Gaseous Fuels [Agriculture/Forestry/Fishing][Gaseous Fuels][Emissions][CH4][kt][Fishing][no method][no target][no option][no type]
status: valid
status modified: 2017-02-13
accepted date: 2017-02-13
in scheme: emissions_variables_MMR

1.A.4.c.iii Gaseous Fuels [Agriculture/Forestry/Fishing][Gaseous Fuels][Emissions][CO2][kt][Fishing][no method][no target][no option][no type]
type: Concept
definition: 1.A.4.c.iii Gaseous Fuels [Agriculture/Forestry/Fishing][Gaseous Fuels][Emissions][CO2][kt][Fishing][no method][no target][no option][no type]
status: valid
status modified: 2017-02-13
accepted date: 2017-02-13
in scheme: emissions_variables_MMR

1.A.4.c.iii Gaseous Fuels [Agriculture/Forestry/Fishing][Gaseous Fuels][Emissions][N2O][kt][Fishing][no method][no target][no option][no type]
type: Concept
definition: 1.A.4.c.iii Gaseous Fuels [Agriculture/Forestry/Fishing][Gaseous Fuels][Emissions][N2O][kt][Fishing][no method][no target][no option][no type]
status: valid
status modified: 2017-02-13
accepted date: 2017-02-13
in scheme: emissions_variables_MMR

1.A.4.c.iii Gasoline [Agriculture/Forestry/Fishing][Gasoline][Emissions][CH4][kt][Fishing][no method][no target][no option][no type]
type: Concept
definition: 1.A.4.c.iii Gasoline [Agriculture/Forestry/Fishing][Gasoline][Emissions][CH4][kt][Fishing][no method][no target][no option][no type]
status: valid
status modified: 2017-02-13
accepted date: 2017-02-13
in scheme: emissions_variables_MMR

1.A.4.c.iii Gasoline [Agriculture/Forestry/Fishing][Gasoline][Emissions][CO2][kt][Fishing][no method][no target][no option][no type]
type: Concept
definition: 1.A.4.c.iii Gasoline [Agriculture/Forestry/Fishing][Gasoline][Emissions][CO2][kt][Fishing][no method][no target][no option][no type]
status: valid
status modified: 2017-02-13
accepted date: 2017-02-13
in scheme: emissions_variables_MMR

1.A.4.c.iii Gasoline [Agriculture/Forestry/Fishing][Gasoline][Emissions][N2O][kt][Fishing][no method][no target][no option][no type]
type: Concept
definition: 1.A.4.c.iii Gasoline [Agriculture/Forestry/Fishing][Gasoline][Emissions][N2O][kt][Fishing][no method][no target][no option][no type]
status: valid
status modified: 2017-02-13
accepted date: 2017-02-13
in scheme: emissions_variables_MMR

1.A.4.c.iii Other Fossil Fuel [Agriculture/Forestry/Fishing][Other Fossil Fuels][Emissions][CH4][kt][Fishing][no method][no target][no option][no type]
type: Concept
definition: 1.A.4.c.iii Other Fossil Fuel [Agriculture/Forestry/Fishing][Other Fossil Fuels][Emissions][CH4][kt][Fishing][no method][no target][no option][no type]
status: valid
status modified: 2017-02-13
accepted date: 2017-02-13
in scheme: emissions_variables_MMR

1.A.4.c.iii Other Fossil Fuel [Agriculture/Forestry/Fishing][Other Fossil Fuels][Emissions][CO2][kt][Fishing][no method][no target][no option][no type]
type: Concept
definition: 1.A.4.c.iii Other Fossil Fuel [Agriculture/Forestry/Fishing][Other Fossil Fuels][Emissions][CO2][kt][Fishing][no method][no target][no option][no type]
status: valid
status modified: 2017-02-13
accepted date: 2017-02-13
in scheme: emissions_variables_MMR

1.A.4.c.iii Other Fossil Fuel [Agriculture/Forestry/Fishing][Other Fossil Fuels][Emissions][N2O][kt][Fishing][no method][no target][no option][no type]
type: Concept
definition: 1.A.4.c.iii Other Fossil Fuel [Agriculture/Forestry/Fishing][Other Fossil Fuels][Emissions][N2O][kt][Fishing][no method][no target][no option][no type]
status: valid
status modified: 2017-02-13
accepted date: 2017-02-13
in scheme: emissions_variables_MMR

1.A.4.c.iii Other Liquid Fuel [Agriculture/Forestry/Fishing][Other Liquid Fuels][Emissions][CH4][kt][Fishing][no method][no target][no option][no type]
type: Concept
definition: 1.A.4.c.iii Other Liquid Fuel [Agriculture/Forestry/Fishing][Other Liquid Fuels][Emissions][CH4][kt][Fishing][no method][no target][no option][no type]
status: valid
status modified: 2017-02-13
accepted date: 2017-02-13
in scheme: emissions_variables_MMR

1.A.4.c.iii Other Liquid Fuel [Agriculture/Forestry/Fishing][Other Liquid Fuels][Emissions][CO2][kt][Fishing][no method][no target][no option][no type]
type: Concept
definition: 1.A.4.c.iii Other Liquid Fuel [Agriculture/Forestry/Fishing][Other Liquid Fuels][Emissions][CO2][kt][Fishing][no method][no target][no option][no type]
status: valid
status modified: 2017-02-13
accepted date: 2017-02-13
in scheme: emissions_variables_MMR

1.A.4.c.iii Other Liquid Fuel [Agriculture/Forestry/Fishing][Other Liquid Fuels][Emissions][N2O][kt][Fishing][no method][no target][no option][no type]
type: Concept
definition: 1.A.4.c.iii Other Liquid Fuel [Agriculture/Forestry/Fishing][Other Liquid Fuels][Emissions][N2O][kt][Fishing][no method][no target][no option][no type]
status: valid
status modified: 2017-02-13
accepted date: 2017-02-13
in scheme: emissions_variables_MMR

1.A.4.c.iii Residual Fuel Oil [Agriculture/Forestry/Fishing][Residual Fuel Oil][Emissions][CH4][kt][Fishing][no method][no target][no option][no type]
type: Concept
definition: 1.A.4.c.iii Residual Fuel Oil [Agriculture/Forestry/Fishing][Residual Fuel Oil][Emissions][CH4][kt][Fishing][no method][no target][no option][no type]
status: valid
status modified: 2017-02-13
accepted date: 2017-02-13
in scheme: emissions_variables_MMR

1.A.4.c.iii Residual Fuel Oil [Agriculture/Forestry/Fishing][Residual Fuel Oil][Emissions][CO2][kt][Fishing][no method][no target][no option][no type]
type: Concept
definition: 1.A.4.c.iii Residual Fuel Oil [Agriculture/Forestry/Fishing][Residual Fuel Oil][Emissions][CO2][kt][Fishing][no method][no target][no option][no type]
status: valid
status modified: 2017-02-13
accepted date: 2017-02-13
in scheme: emissions_variables_MMR

1.A.4.c.iii Residual Fuel Oil [Agriculture/Forestry/Fishing][Residual Fuel Oil][Emissions][N2O][kt][Fishing][no method][no target][no option][no type]
type: Concept
definition: 1.A.4.c.iii Residual Fuel Oil [Agriculture/Forestry/Fishing][Residual Fuel Oil][Emissions][N2O][kt][Fishing][no method][no target][no option][no type]
status: valid
status modified: 2017-02-13
accepted date: 2017-02-13
in scheme: emissions_variables_MMR

1.A.5 [Other Other Sectors][Biomass][Emissions][CH4][kt][no source][no method][no target][no option][no type]
type: Concept
definition: 1.A.5 [Other Other Sectors][Biomass][Emissions][CH4][kt][no source][no method][no target][no option][no type]
status: valid
status modified: 2017-02-13
accepted date: 2017-02-13
in scheme: emissions_variables_MMR

1.A.5 [Other Other Sectors][Biomass][Emissions][CO2][kt][no source][no method][no target][no option][no type]
type: Concept
definition: 1.A.5 [Other Other Sectors][Biomass][Emissions][CO2][kt][no source][no method][no target][no option][no type]
status: valid
status modified: 2017-02-13
accepted date: 2017-02-13
in scheme: emissions_variables_MMR

1.A.5 [Other Other Sectors][Biomass][Emissions][N2O][kt][no source][no method][no target][no option][no type]
type: Concept
definition: 1.A.5 [Other Other Sectors][Biomass][Emissions][N2O][kt][no source][no method][no target][no option][no type]
status: valid
status modified: 2017-02-13
accepted date: 2017-02-13
in scheme: emissions_variables_MMR

1.A.5 [Other Other Sectors][Fuels][Emissions][Aggregate GHGs][kt CO2 equivalent][no source][no method][no target][no option][no type]
type: Concept
definition: 1.A.5 [Other Other Sectors][Fuels][Emissions][Aggregate GHGs][kt CO2 equivalent][no source][no method][no target][no option][no type]
status: valid
status modified: 2017-02-13
accepted date: 2017-02-13
in scheme: emissions_variables_MMR

1.A.5 [Other Other Sectors][Fuels][Emissions][CH4][kt][no source][no method][no target][no option][no type]
type: Concept
definition: 1.A.5 [Other Other Sectors][Fuels][Emissions][CH4][kt][no source][no method][no target][no option][no type]
status: valid
status modified: 2017-02-13
accepted date: 2017-02-13
in scheme: emissions_variables_MMR

1.A.5 [Other Other Sectors][Fuels][Emissions][CO][kt][no source][no method][no target][no option][no type]
type: Concept
definition: 1.A.5 [Other Other Sectors][Fuels][Emissions][CO][kt][no source][no method][no target][no option][no type]
status: valid
status modified: 2017-02-13
accepted date: 2017-02-13
in scheme: emissions_variables_MMR

1.A.5 [Other Other Sectors][Fuels][Emissions][CO2][kt][no source][no method][no target][no option][no type]
type: Concept
definition: 1.A.5 [Other Other Sectors][Fuels][Emissions][CO2][kt][no source][no method][no target][no option][no type]
status: valid
status modified: 2017-02-13
accepted date: 2017-02-13
in scheme: emissions_variables_MMR

1.A.5 [Other Other Sectors][Fuels][Emissions][N2O][kt][no source][no method][no target][no option][no type]
type: Concept
definition: 1.A.5 [Other Other Sectors][Fuels][Emissions][N2O][kt][no source][no method][no target][no option][no type]
status: valid
status modified: 2017-02-13
accepted date: 2017-02-13
in scheme: emissions_variables_MMR

1.A.5 [Other Other Sectors][Fuels][Emissions][NMVOC][kt][no source][no method][no target][no option][no type]
type: Concept
definition: 1.A.5 [Other Other Sectors][Fuels][Emissions][NMVOC][kt][no source][no method][no target][no option][no type]
status: valid
status modified: 2017-02-13
accepted date: 2017-02-13
in scheme: emissions_variables_MMR

1.A.5 [Other Other Sectors][Fuels][Emissions][NOx][kt][no source][no method][no target][no option][no type]
type: Concept
definition: 1.A.5 [Other Other Sectors][Fuels][Emissions][NOx][kt][no source][no method][no target][no option][no type]
status: valid
status modified: 2017-02-13
accepted date: 2017-02-13
in scheme: emissions_variables_MMR

1.A.5 [Other Other Sectors][Fuels][Emissions][SO2][kt][no source][no method][no target][no option][no type]
type: Concept
definition: 1.A.5 [Other Other Sectors][Fuels][Emissions][SO2][kt][no source][no method][no target][no option][no type]
status: valid
status modified: 2017-02-13
accepted date: 2017-02-13
in scheme: emissions_variables_MMR

1.A.5 [Other Other Sectors][Gaseous Fuels][Emissions][CH4][kt][no source][no method][no target][no option][no type]
type: Concept
definition: 1.A.5 [Other Other Sectors][Gaseous Fuels][Emissions][CH4][kt][no source][no method][no target][no option][no type]
status: valid
status modified: 2017-02-13
accepted date: 2017-02-13
in scheme: emissions_variables_MMR

1.A.5 [Other Other Sectors][Gaseous Fuels][Emissions][CO2][kt][no source][no method][no target][no option][no type]
type: Concept
definition: 1.A.5 [Other Other Sectors][Gaseous Fuels][Emissions][CO2][kt][no source][no method][no target][no option][no type]
status: valid
status modified: 2017-02-13
accepted date: 2017-02-13
in scheme: emissions_variables_MMR

1.A.5 [Other Other Sectors][Gaseous Fuels][Emissions][N2O][kt][no source][no method][no target][no option][no type]
type: Concept
definition: 1.A.5 [Other Other Sectors][Gaseous Fuels][Emissions][N2O][kt][no source][no method][no target][no option][no type]
status: valid
status modified: 2017-02-13
accepted date: 2017-02-13
in scheme: emissions_variables_MMR

1.A.5 [Other Other Sectors][Liquid Fuels][Emissions][CH4][kt][no source][no method][no target][no option][no type]
type: Concept
definition: 1.A.5 [Other Other Sectors][Liquid Fuels][Emissions][CH4][kt][no source][no method][no target][no option][no type]
status: valid
status modified: 2017-02-13
accepted date: 2017-02-13
in scheme: emissions_variables_MMR

1.A.5 [Other Other Sectors][Liquid Fuels][Emissions][CO2][kt][no source][no method][no target][no option][no type]
type: Concept
definition: 1.A.5 [Other Other Sectors][Liquid Fuels][Emissions][CO2][kt][no source][no method][no target][no option][no type]
status: valid
status modified: 2017-02-13
accepted date: 2017-02-13
in scheme: emissions_variables_MMR

1.A.5 [Other Other Sectors][Liquid Fuels][Emissions][N2O][kt][no source][no method][no target][no option][no type]
type: Concept
definition: 1.A.5 [Other Other Sectors][Liquid Fuels][Emissions][N2O][kt][no source][no method][no target][no option][no type]
status: valid
status modified: 2017-02-13
accepted date: 2017-02-13
in scheme: emissions_variables_MMR

1.A.5 [Other Other Sectors][Other Fossil Fuels][Emissions][CH4][kt][no source][no method][no target][no option][no type]
type: Concept
definition: 1.A.5 [Other Other Sectors][Other Fossil Fuels][Emissions][CH4][kt][no source][no method][no target][no option][no type]
status: valid
status modified: 2017-02-13
accepted date: 2017-02-13
in scheme: emissions_variables_MMR

1.A.5 [Other Other Sectors][Other Fossil Fuels][Emissions][CO2][kt][no source][no method][no target][no option][no type]
type: Concept
definition: 1.A.5 [Other Other Sectors][Other Fossil Fuels][Emissions][CO2][kt][no source][no method][no target][no option][no type]
status: valid
status modified: 2017-02-13
accepted date: 2017-02-13
in scheme: emissions_variables_MMR

1.A.5 [Other Other Sectors][Other Fossil Fuels][Emissions][N2O][kt][no source][no method][no target][no option][no type]
type: Concept
definition: 1.A.5 [Other Other Sectors][Other Fossil Fuels][Emissions][N2O][kt][no source][no method][no target][no option][no type]
status: valid
status modified: 2017-02-13
accepted date: 2017-02-13
in scheme: emissions_variables_MMR

1.A.5 [Other Other Sectors][Peat][Emissions][CH4][kt][no source][no method][no target][no option][no type]
type: Concept
definition: 1.A.5 [Other Other Sectors][Peat][Emissions][CH4][kt][no source][no method][no target][no option][no type]
status: valid
status modified: 2017-02-13
accepted date: 2017-02-13
in scheme: emissions_variables_MMR

1.A.5 [Other Other Sectors][Peat][Emissions][CO2][kt][no source][no method][no target][no option][no type]
type: Concept
definition: 1.A.5 [Other Other Sectors][Peat][Emissions][CO2][kt][no source][no method][no target][no option][no type]
status: valid
status modified: 2017-02-13
accepted date: 2017-02-13
in scheme: emissions_variables_MMR

1.A.5 [Other Other Sectors][Peat][Emissions][N2O][kt][no source][no method][no target][no option][no type]
type: Concept
definition: 1.A.5 [Other Other Sectors][Peat][Emissions][N2O][kt][no source][no method][no target][no option][no type]
status: valid
status modified: 2017-02-13
accepted date: 2017-02-13
in scheme: emissions_variables_MMR

1.A.5 [Other Other Sectors][Solid Fuels][Emissions][CH4][kt][no source][no method][no target][no option][no type]
type: Concept
definition: 1.A.5 [Other Other Sectors][Solid Fuels][Emissions][CH4][kt][no source][no method][no target][no option][no type]
status: valid
status modified: 2017-02-13
accepted date: 2017-02-13
in scheme: emissions_variables_MMR

1.A.5 [Other Other Sectors][Solid Fuels][Emissions][CO2][kt][no source][no method][no target][no option][no type]
type: Concept
definition: 1.A.5 [Other Other Sectors][Solid Fuels][Emissions][CO2][kt][no source][no method][no target][no option][no type]
status: valid
status modified: 2017-02-13
accepted date: 2017-02-13
in scheme: emissions_variables_MMR

1.A.5 [Other Other Sectors][Solid Fuels][Emissions][N2O][kt][no source][no method][no target][no option][no type]
type: Concept
definition: 1.A.5 [Other Other Sectors][Solid Fuels][Emissions][N2O][kt][no source][no method][no target][no option][no type]
status: valid
status modified: 2017-02-13
accepted date: 2017-02-13
in scheme: emissions_variables_MMR

1.A.5.a [Other Other Sectors][Biomass][Emissions][CH4][kt][Stationary combustion][no method][no target][no option][no type]
type: Concept
definition: 1.A.5.a [Other Other Sectors][Biomass][Emissions][CH4][kt][Stationary combustion][no method][no target][no option][no type]
status: valid
status modified: 2017-02-13
accepted date: 2017-02-13
in scheme: emissions_variables_MMR

1.A.5.a [Other Other Sectors][Biomass][Emissions][CO2][kt][Stationary combustion][no method][no target][no option][no type]
type: Concept
definition: 1.A.5.a [Other Other Sectors][Biomass][Emissions][CO2][kt][Stationary combustion][no method][no target][no option][no type]
status: valid
status modified: 2017-02-13
accepted date: 2017-02-13
in scheme: emissions_variables_MMR

1.A.5.a [Other Other Sectors][Biomass][Emissions][N2O][kt][Stationary combustion][no method][no target][no option][no type]
type: Concept
definition: 1.A.5.a [Other Other Sectors][Biomass][Emissions][N2O][kt][Stationary combustion][no method][no target][no option][no type]
status: valid
status modified: 2017-02-13
accepted date: 2017-02-13
in scheme: emissions_variables_MMR

1.A.5.a [Other Other Sectors][Fossil fuels][Emissions][CO2][kt][Stationary combustion][no method][no target][no option][no type]
type: Concept
definition: 1.A.5.a [Other Other Sectors][Fossil fuels][Emissions][CO2][kt][Stationary combustion][no method][no target][no option][no type]
status: valid
status modified: 2017-02-13
accepted date: 2017-02-13
in scheme: emissions_variables_MMR

1.A.5.a [Other Other Sectors][Fuels][Emissions][CH4][kt][Stationary combustion][no method][no target][no option][no type]
type: Concept
definition: 1.A.5.a [Other Other Sectors][Fuels][Emissions][CH4][kt][Stationary combustion][no method][no target][no option][no type]
status: valid
status modified: 2017-02-13
accepted date: 2017-02-13
in scheme: emissions_variables_MMR

1.A.5.a [Other Other Sectors][Fuels][Emissions][CO][kt][Stationary combustion][no method][no target][no option][no type]
type: Concept
definition: 1.A.5.a [Other Other Sectors][Fuels][Emissions][CO][kt][Stationary combustion][no method][no target][no option][no type]
status: valid
status modified: 2017-02-13
accepted date: 2017-02-13
in scheme: emissions_variables_MMR

1.A.5.a [Other Other Sectors][Fuels][Emissions][N2O][kt][Stationary combustion][no method][no target][no option][no type]
type: Concept
definition: 1.A.5.a [Other Other Sectors][Fuels][Emissions][N2O][kt][Stationary combustion][no method][no target][no option][no type]
status: valid
status modified: 2017-02-13
accepted date: 2017-02-13
in scheme: emissions_variables_MMR

1.A.5.a [Other Other Sectors][Fuels][Emissions][NMVOC][kt][Stationary combustion][no method][no target][no option][no type]
type: Concept
definition: 1.A.5.a [Other Other Sectors][Fuels][Emissions][NMVOC][kt][Stationary combustion][no method][no target][no option][no type]
status: valid
status modified: 2017-02-13
accepted date: 2017-02-13
in scheme: emissions_variables_MMR

1.A.5.a [Other Other Sectors][Fuels][Emissions][NOx][kt][Stationary combustion][no method][no target][no option][no type]
type: Concept
definition: 1.A.5.a [Other Other Sectors][Fuels][Emissions][NOx][kt][Stationary combustion][no method][no target][no option][no type]
status: valid
status modified: 2017-02-13
accepted date: 2017-02-13
in scheme: emissions_variables_MMR

1.A.5.a [Other Other Sectors][Fuels][Emissions][SO2][kt][Stationary combustion][no method][no target][no option][no type]
type: Concept
definition: 1.A.5.a [Other Other Sectors][Fuels][Emissions][SO2][kt][Stationary combustion][no method][no target][no option][no type]
status: valid
status modified: 2017-02-13
accepted date: 2017-02-13
in scheme: emissions_variables_MMR

1.A.5.a [Other Other Sectors][Gaseous Fuels][Emissions][CH4][kt][Stationary combustion][no method][no target][no option][no type]
type: Concept
definition: 1.A.5.a [Other Other Sectors][Gaseous Fuels][Emissions][CH4][kt][Stationary combustion][no method][no target][no option][no type]
status: valid
status modified: 2017-02-13
accepted date: 2017-02-13
in scheme: emissions_variables_MMR

1.A.5.a [Other Other Sectors][Gaseous Fuels][Emissions][CO2][kt][Stationary combustion][no method][no target][no option][no type]
type: Concept
definition: 1.A.5.a [Other Other Sectors][Gaseous Fuels][Emissions][CO2][kt][Stationary combustion][no method][no target][no option][no type]
status: valid
status modified: 2017-02-13
accepted date: 2017-02-13
in scheme: emissions_variables_MMR

1.A.5.a [Other Other Sectors][Gaseous Fuels][Emissions][N2O][kt][Stationary combustion][no method][no target][no option][no type]
type: Concept
definition: 1.A.5.a [Other Other Sectors][Gaseous Fuels][Emissions][N2O][kt][Stationary combustion][no method][no target][no option][no type]
status: valid
status modified: 2017-02-13
accepted date: 2017-02-13
in scheme: emissions_variables_MMR

1.A.5.a [Other Other Sectors][Liquid Fuels][Emissions][CH4][kt][Stationary combustion][no method][no target][no option][no type]
type: Concept
definition: 1.A.5.a [Other Other Sectors][Liquid Fuels][Emissions][CH4][kt][Stationary combustion][no method][no target][no option][no type]
status: valid
status modified: 2017-02-13
accepted date: 2017-02-13
in scheme: emissions_variables_MMR

1.A.5.a [Other Other Sectors][Liquid Fuels][Emissions][CO2][kt][Stationary combustion][no method][no target][no option][no type]
type: Concept
definition: 1.A.5.a [Other Other Sectors][Liquid Fuels][Emissions][CO2][kt][Stationary combustion][no method][no target][no option][no type]
status: valid
status modified: 2017-02-13
accepted date: 2017-02-13
in scheme: emissions_variables_MMR

1.A.5.a [Other Other Sectors][Liquid Fuels][Emissions][N2O][kt][Stationary combustion][no method][no target][no option][no type]
type: Concept
definition: 1.A.5.a [Other Other Sectors][Liquid Fuels][Emissions][N2O][kt][Stationary combustion][no method][no target][no option][no type]
status: valid
status modified: 2017-02-13
accepted date: 2017-02-13
in scheme: emissions_variables_MMR

1.A.5.a [Other Other Sectors][Other Fossil Fuels][Emissions][CH4][kt][Stationary combustion][no method][no target][no option][no type]
type: Concept
definition: 1.A.5.a [Other Other Sectors][Other Fossil Fuels][Emissions][CH4][kt][Stationary combustion][no method][no target][no option][no type]
status: valid
status modified: 2017-02-13
accepted date: 2017-02-13
in scheme: emissions_variables_MMR

1.A.5.a [Other Other Sectors][Other Fossil Fuels][Emissions][CO2][kt][Stationary combustion][no method][no target][no option][no type]
type: Concept
definition: 1.A.5.a [Other Other Sectors][Other Fossil Fuels][Emissions][CO2][kt][Stationary combustion][no method][no target][no option][no type]
status: valid
status modified: 2017-02-13
accepted date: 2017-02-13
in scheme: emissions_variables_MMR

1.A.5.a [Other Other Sectors][Other Fossil Fuels][Emissions][N2O][kt][Stationary combustion][no method][no target][no option][no type]
type: Concept
definition: 1.A.5.a [Other Other Sectors][Other Fossil Fuels][Emissions][N2O][kt][Stationary combustion][no method][no target][no option][no type]
status: valid
status modified: 2017-02-13
accepted date: 2017-02-13
in scheme: emissions_variables_MMR

1.A.5.a [Other Other Sectors][Peat][Emissions][CH4][kt][Stationary combustion][no method][no target][no option][no type]
type: Concept
definition: 1.A.5.a [Other Other Sectors][Peat][Emissions][CH4][kt][Stationary combustion][no method][no target][no option][no type]
status: valid
status modified: 2017-02-13
accepted date: 2017-02-13
in scheme: emissions_variables_MMR

1.A.5.a [Other Other Sectors][Peat][Emissions][CO2][kt][Stationary combustion][no method][no target][no option][no type]
type: Concept
definition: 1.A.5.a [Other Other Sectors][Peat][Emissions][CO2][kt][Stationary combustion][no method][no target][no option][no type]
status: valid
status modified: 2017-02-13
accepted date: 2017-02-13
in scheme: emissions_variables_MMR

1.A.5.a [Other Other Sectors][Peat][Emissions][N2O][kt][Stationary combustion][no method][no target][no option][no type]
type: Concept
definition: 1.A.5.a [Other Other Sectors][Peat][Emissions][N2O][kt][Stationary combustion][no method][no target][no option][no type]
status: valid
status modified: 2017-02-13
accepted date: 2017-02-13
in scheme: emissions_variables_MMR

1.A.5.a [Other Other Sectors][Solid Fuels][Emissions][CH4][kt][Stationary combustion][no method][no target][no option][no type]
type: Concept
definition: 1.A.5.a [Other Other Sectors][Solid Fuels][Emissions][CH4][kt][Stationary combustion][no method][no target][no option][no type]
status: valid
status modified: 2017-02-13
accepted date: 2017-02-13
in scheme: emissions_variables_MMR

1.A.5.a [Other Other Sectors][Solid Fuels][Emissions][CO2][kt][Stationary combustion][no method][no target][no option][no type]
type: Concept
definition: 1.A.5.a [Other Other Sectors][Solid Fuels][Emissions][CO2][kt][Stationary combustion][no method][no target][no option][no type]
status: valid
status modified: 2017-02-13
accepted date: 2017-02-13
in scheme: emissions_variables_MMR

1.A.5.a [Other Other Sectors][Solid Fuels][Emissions][N2O][kt][Stationary combustion][no method][no target][no option][no type]
type: Concept
definition: 1.A.5.a [Other Other Sectors][Solid Fuels][Emissions][N2O][kt][Stationary combustion][no method][no target][no option][no type]
status: valid
status modified: 2017-02-13
accepted date: 2017-02-13
in scheme: emissions_variables_MMR

1.A.5.b [Other Other Sectors][Biomass][Emissions][CH4][kt][Mobile Combustion][no method][no target][no option][no type]
type: Concept
definition: 1.A.5.b [Other Other Sectors][Biomass][Emissions][CH4][kt][Mobile Combustion][no method][no target][no option][no type]
status: valid
status modified: 2017-02-13
accepted date: 2017-02-13
in scheme: emissions_variables_MMR

1.A.5.b [Other Other Sectors][Biomass][Emissions][CO2][kt][Mobile Combustion][no method][no target][no option][no type]
type: Concept
definition: 1.A.5.b [Other Other Sectors][Biomass][Emissions][CO2][kt][Mobile Combustion][no method][no target][no option][no type]
status: valid
status modified: 2017-02-13
accepted date: 2017-02-13
in scheme: emissions_variables_MMR

1.A.5.b [Other Other Sectors][Biomass][Emissions][N2O][kt][Mobile Combustion][no method][no target][no option][no type]
type: Concept
definition: 1.A.5.b [Other Other Sectors][Biomass][Emissions][N2O][kt][Mobile Combustion][no method][no target][no option][no type]
status: valid
status modified: 2017-02-13
accepted date: 2017-02-13
in scheme: emissions_variables_MMR

1.A.5.b [Other Other Sectors][Fuels][Emissions][CH4][kt][Mobile Combustion][no method][no target][no option][no type]
type: Concept
definition: 1.A.5.b [Other Other Sectors][Fuels][Emissions][CH4][kt][Mobile Combustion][no method][no target][no option][no type]
status: valid
status modified: 2017-02-13
accepted date: 2017-02-13
in scheme: emissions_variables_MMR

1.A.5.b [Other Other Sectors][Fuels][Emissions][CO][kt][Mobile Combustion][no method][no target][no option][no type]
type: Concept
definition: 1.A.5.b [Other Other Sectors][Fuels][Emissions][CO][kt][Mobile Combustion][no method][no target][no option][no type]
status: valid
status modified: 2017-02-13
accepted date: 2017-02-13
in scheme: emissions_variables_MMR

1.A.5.b [Other Other Sectors][Fuels][Emissions][CO2][kt][Mobile Combustion][no method][no target][no option][no type]
type: Concept
definition: 1.A.5.b [Other Other Sectors][Fuels][Emissions][CO2][kt][Mobile Combustion][no method][no target][no option][no type]
status: valid
status modified: 2017-02-13
accepted date: 2017-02-13
in scheme: emissions_variables_MMR

1.A.5.b [Other Other Sectors][Fuels][Emissions][N2O][kt][Mobile Combustion][no method][no target][no option][no type]
type: Concept
definition: 1.A.5.b [Other Other Sectors][Fuels][Emissions][N2O][kt][Mobile Combustion][no method][no target][no option][no type]
status: valid
status modified: 2017-02-13
accepted date: 2017-02-13
in scheme: emissions_variables_MMR

1.A.5.b [Other Other Sectors][Fuels][Emissions][NMVOC][kt][Mobile Combustion][no method][no target][no option][no type]
type: Concept
definition: 1.A.5.b [Other Other Sectors][Fuels][Emissions][NMVOC][kt][Mobile Combustion][no method][no target][no option][no type]
status: valid
status modified: 2017-02-13
accepted date: 2017-02-13
in scheme: emissions_variables_MMR

1.A.5.b [Other Other Sectors][Fuels][Emissions][NOx][kt][Mobile Combustion][no method][no target][no option][no type]
type: Concept
definition: 1.A.5.b [Other Other Sectors][Fuels][Emissions][NOx][kt][Mobile Combustion][no method][no target][no option][no type]
status: valid
status modified: 2017-02-13
accepted date: 2017-02-13
in scheme: emissions_variables_MMR

1.A.5.b [Other Other Sectors][Fuels][Emissions][SO2][kt][Mobile Combustion][no method][no target][no option][no type]
type: Concept
definition: 1.A.5.b [Other Other Sectors][Fuels][Emissions][SO2][kt][Mobile Combustion][no method][no target][no option][no type]
status: valid
status modified: 2017-02-13
accepted date: 2017-02-13
in scheme: emissions_variables_MMR

1.A.5.b [Other Other Sectors][Gaseous Fuels][Emissions][CH4][kt][Mobile Combustion][no method][no target][no option][no type]
type: Concept
definition: 1.A.5.b [Other Other Sectors][Gaseous Fuels][Emissions][CH4][kt][Mobile Combustion][no method][no target][no option][no type]
status: valid
status modified: 2017-02-13
accepted date: 2017-02-13
in scheme: emissions_variables_MMR

1.A.5.b [Other Other Sectors][Gaseous Fuels][Emissions][CO2][kt][Mobile Combustion][no method][no target][no option][no type]
type: Concept
definition: 1.A.5.b [Other Other Sectors][Gaseous Fuels][Emissions][CO2][kt][Mobile Combustion][no method][no target][no option][no type]
status: valid
status modified: 2017-02-13
accepted date: 2017-02-13
in scheme: emissions_variables_MMR

1.A.5.b [Other Other Sectors][Gaseous Fuels][Emissions][N2O][kt][Mobile Combustion][no method][no target][no option][no type]
type: Concept
definition: 1.A.5.b [Other Other Sectors][Gaseous Fuels][Emissions][N2O][kt][Mobile Combustion][no method][no target][no option][no type]
status: valid
status modified: 2017-02-13
accepted date: 2017-02-13
in scheme: emissions_variables_MMR

1.A.5.b [Other Other Sectors][Liquid Fuels][Emissions][CH4][kt][Mobile Combustion][no method][no target][no option][no type]
type: Concept
definition: 1.A.5.b [Other Other Sectors][Liquid Fuels][Emissions][CH4][kt][Mobile Combustion][no method][no target][no option][no type]
status: valid
status modified: 2017-02-13
accepted date: 2017-02-13
in scheme: emissions_variables_MMR

1.A.5.b [Other Other Sectors][Liquid Fuels][Emissions][CO2][kt][Mobile Combustion][no method][no target][no option][no type]
type: Concept
definition: 1.A.5.b [Other Other Sectors][Liquid Fuels][Emissions][CO2][kt][Mobile Combustion][no method][no target][no option][no type]
status: valid
status modified: 2017-02-13
accepted date: 2017-02-13
in scheme: emissions_variables_MMR

1.A.5.b [Other Other Sectors][Liquid Fuels][Emissions][N2O][kt][Mobile Combustion][no method][no target][no option][no type]
type: Concept
definition: 1.A.5.b [Other Other Sectors][Liquid Fuels][Emissions][N2O][kt][Mobile Combustion][no method][no target][no option][no type]
status: valid
status modified: 2017-02-13
accepted date: 2017-02-13
in scheme: emissions_variables_MMR

1.A.5.b [Other Other Sectors][Other Fossil Fuels][Emissions][CH4][kt][Mobile Combustion][no method][no target][no option][no type]
type: Concept
definition: 1.A.5.b [Other Other Sectors][Other Fossil Fuels][Emissions][CH4][kt][Mobile Combustion][no method][no target][no option][no type]
status: valid
status modified: 2017-02-13
accepted date: 2017-02-13
in scheme: emissions_variables_MMR

1.A.5.b [Other Other Sectors][Other Fossil Fuels][Emissions][CO2][kt][Mobile Combustion][no method][no target][no option][no type]
type: Concept
definition: 1.A.5.b [Other Other Sectors][Other Fossil Fuels][Emissions][CO2][kt][Mobile Combustion][no method][no target][no option][no type]
status: valid
status modified: 2017-02-13
accepted date: 2017-02-13
in scheme: emissions_variables_MMR

1.A.5.b [Other Other Sectors][Other Fossil Fuels][Emissions][N2O][kt][Mobile Combustion][no method][no target][no option][no type]
type: Concept
definition: 1.A.5.b [Other Other Sectors][Other Fossil Fuels][Emissions][N2O][kt][Mobile Combustion][no method][no target][no option][no type]
status: valid
status modified: 2017-02-13
accepted date: 2017-02-13
in scheme: emissions_variables_MMR

1.A.5.b [Other Other Sectors][Solid Fuels][Emissions][CH4][kt][Mobile Combustion][no method][no target][no option][no type]
type: Concept
definition: 1.A.5.b [Other Other Sectors][Solid Fuels][Emissions][CH4][kt][Mobile Combustion][no method][no target][no option][no type]
status: valid
status modified: 2017-02-13
accepted date: 2017-02-13
in scheme: emissions_variables_MMR

1.A.5.b [Other Other Sectors][Solid Fuels][Emissions][CO2][kt][Mobile Combustion][no method][no target][no option][no type]
type: Concept
definition: 1.A.5.b [Other Other Sectors][Solid Fuels][Emissions][CO2][kt][Mobile Combustion][no method][no target][no option][no type]
status: valid
status modified: 2017-02-13
accepted date: 2017-02-13
in scheme: emissions_variables_MMR

1.A.5.b [Other Other Sectors][Solid Fuels][Emissions][N2O][kt][Mobile Combustion][no method][no target][no option][no type]
type: Concept
definition: 1.A.5.b [Other Other Sectors][Solid Fuels][Emissions][N2O][kt][Mobile Combustion][no method][no target][no option][no type]
status: valid
status modified: 2017-02-13
accepted date: 2017-02-13
in scheme: emissions_variables_MMR

1.AA [Fuel Combustion - Sectoral approach][Biomass][Emissions][CH4][kt][no source][no method][no target][no option][no type]
type: Concept
definition: 1.AA [Fuel Combustion - Sectoral approach][Biomass][Emissions][CH4][kt][no source][no method][no target][no option][no type]
status: valid
status modified: 2017-02-13
accepted date: 2017-02-13
in scheme: emissions_variables_MMR

1.AA [Fuel Combustion - Sectoral approach][Biomass][Emissions][CO2][kt][no source][no method][no target][no option][no type]
type: Concept
definition: 1.AA [Fuel Combustion - Sectoral approach][Biomass][Emissions][CO2][kt][no source][no method][no target][no option][no type]
status: valid
status modified: 2017-02-13
accepted date: 2017-02-13
in scheme: emissions_variables_MMR

1.AA [Fuel Combustion - Sectoral approach][Biomass][Emissions][N2O][kt][no source][no method][no target][no option][no type]
type: Concept
definition: 1.AA [Fuel Combustion - Sectoral approach][Biomass][Emissions][N2O][kt][no source][no method][no target][no option][no type]
status: valid
status modified: 2017-02-13
accepted date: 2017-02-13
in scheme: emissions_variables_MMR

1.AA [Fuel Combustion - Sectoral approach][Fuels][Emissions][Aggregate GHGs][kt CO2 equivalent][no source][no method][no target][no option][no type]
type: Concept
definition: 1.AA [Fuel Combustion - Sectoral approach][Fuels][Emissions][Aggregate GHGs][kt CO2 equivalent][no source][no method][no target][no option][no type]
status: valid
status modified: 2017-02-13
accepted date: 2017-02-13
in scheme: emissions_variables_MMR

1.AA [Fuel Combustion - Sectoral approach][Fuels][Emissions][CH4][kt][no source][no method][no target][no option][no type]
type: Concept
definition: 1.AA [Fuel Combustion - Sectoral approach][Fuels][Emissions][CH4][kt][no source][no method][no target][no option][no type]
status: valid
status modified: 2017-02-13
accepted date: 2017-02-13
in scheme: emissions_variables_MMR

1.AA [Fuel Combustion - Sectoral approach][Fuels][Emissions][CO][kt][no source][no method][no target][no option][no type]
type: Concept
definition: 1.AA [Fuel Combustion - Sectoral approach][Fuels][Emissions][CO][kt][no source][no method][no target][no option][no type]
status: valid
status modified: 2017-02-13
accepted date: 2017-02-13
in scheme: emissions_variables_MMR

1.AA [Fuel Combustion - Sectoral approach][Fuels][Emissions][CO2][kt][no source][no method][no target][no option][no type]
type: Concept
definition: 1.AA [Fuel Combustion - Sectoral approach][Fuels][Emissions][CO2][kt][no source][no method][no target][no option][no type]
status: valid
status modified: 2017-02-13
accepted date: 2017-02-13
in scheme: emissions_variables_MMR

1.AA [Fuel Combustion - Sectoral approach][Fuels][Emissions][N2O][kt][no source][no method][no target][no option][no type]
type: Concept
definition: 1.AA [Fuel Combustion - Sectoral approach][Fuels][Emissions][N2O][kt][no source][no method][no target][no option][no type]
status: valid
status modified: 2017-02-13
accepted date: 2017-02-13
in scheme: emissions_variables_MMR

1.AA [Fuel Combustion - Sectoral approach][Fuels][Emissions][NMVOC][kt][no source][no method][no target][no option][no type]
type: Concept
definition: 1.AA [Fuel Combustion - Sectoral approach][Fuels][Emissions][NMVOC][kt][no source][no method][no target][no option][no type]
status: valid
status modified: 2017-02-13
accepted date: 2017-02-13
in scheme: emissions_variables_MMR

1.AA [Fuel Combustion - Sectoral approach][Fuels][Emissions][NOx][kt][no source][no method][no target][no option][no type]
type: Concept
definition: 1.AA [Fuel Combustion - Sectoral approach][Fuels][Emissions][NOx][kt][no source][no method][no target][no option][no type]
status: valid
status modified: 2017-02-13
accepted date: 2017-02-13
in scheme: emissions_variables_MMR

1.AA [Fuel Combustion - Sectoral approach][Fuels][Emissions][SO2][kt][no source][no method][no target][no option][no type]
type: Concept
definition: 1.AA [Fuel Combustion - Sectoral approach][Fuels][Emissions][SO2][kt][no source][no method][no target][no option][no type]
status: valid
status modified: 2017-02-13
accepted date: 2017-02-13
in scheme: emissions_variables_MMR

1.AA [Fuel Combustion - Sectoral approach][Gaseous Fuels][Emissions][CH4][kt][no source][no method][no target][no option][no type]
type: Concept
definition: 1.AA [Fuel Combustion - Sectoral approach][Gaseous Fuels][Emissions][CH4][kt][no source][no method][no target][no option][no type]
status: valid
status modified: 2017-02-13
accepted date: 2017-02-13
in scheme: emissions_variables_MMR

1.AA [Fuel Combustion - Sectoral approach][Gaseous Fuels][Emissions][CO2][kt][no source][no method][no target][no option][no type]
type: Concept
definition: 1.AA [Fuel Combustion - Sectoral approach][Gaseous Fuels][Emissions][CO2][kt][no source][no method][no target][no option][no type]
status: valid
status modified: 2017-02-13
accepted date: 2017-02-13
in scheme: emissions_variables_MMR

1.AA [Fuel Combustion - Sectoral approach][Gaseous Fuels][Emissions][N2O][kt][no source][no method][no target][no option][no type]
type: Concept
definition: 1.AA [Fuel Combustion - Sectoral approach][Gaseous Fuels][Emissions][N2O][kt][no source][no method][no target][no option][no type]
status: valid
status modified: 2017-02-13
accepted date: 2017-02-13
in scheme: emissions_variables_MMR

1.AA [Fuel Combustion - Sectoral approach][Liquid Fuels][Emissions][CH4][kt][no source][no method][no target][no option][no type]
type: Concept
definition: 1.AA [Fuel Combustion - Sectoral approach][Liquid Fuels][Emissions][CH4][kt][no source][no method][no target][no option][no type]
status: valid
status modified: 2017-02-13
accepted date: 2017-02-13
in scheme: emissions_variables_MMR

1.AA [Fuel Combustion - Sectoral approach][Liquid Fuels][Emissions][CO2][kt][no source][no method][no target][no option][no type]
type: Concept
definition: 1.AA [Fuel Combustion - Sectoral approach][Liquid Fuels][Emissions][CO2][kt][no source][no method][no target][no option][no type]
status: valid
status modified: 2017-02-13
accepted date: 2017-02-13
in scheme: emissions_variables_MMR

1.AA [Fuel Combustion - Sectoral approach][Liquid Fuels][Emissions][N2O][kt][no source][no method][no target][no option][no type]
type: Concept
definition: 1.AA [Fuel Combustion - Sectoral approach][Liquid Fuels][Emissions][N2O][kt][no source][no method][no target][no option][no type]
status: valid
status modified: 2017-02-13
accepted date: 2017-02-13
in scheme: emissions_variables_MMR

1.AA [Fuel Combustion - Sectoral approach][Other Fossil Fuels][Emissions][CH4][kt][no source][no method][no target][no option][no type]
type: Concept
definition: 1.AA [Fuel Combustion - Sectoral approach][Other Fossil Fuels][Emissions][CH4][kt][no source][no method][no target][no option][no type]
status: valid
status modified: 2017-02-13
accepted date: 2017-02-13
in scheme: emissions_variables_MMR

1.AA [Fuel Combustion - Sectoral approach][Other Fossil Fuels][Emissions][CO2][kt][no source][no method][no target][no option][no type]
type: Concept
definition: 1.AA [Fuel Combustion - Sectoral approach][Other Fossil Fuels][Emissions][CO2][kt][no source][no method][no target][no option][no type]
status: valid
status modified: 2017-02-13
accepted date: 2017-02-13
in scheme: emissions_variables_MMR

1.AA [Fuel Combustion - Sectoral approach][Other Fossil Fuels][Emissions][N2O][kt][no source][no method][no target][no option][no type]
type: Concept
definition: 1.AA [Fuel Combustion - Sectoral approach][Other Fossil Fuels][Emissions][N2O][kt][no source][no method][no target][no option][no type]
status: valid
status modified: 2017-02-13
accepted date: 2017-02-13
in scheme: emissions_variables_MMR

1.AA [Fuel Combustion - Sectoral approach][Peat][Emissions][CH4][kt][no source][no method][no target][no option][no type]
type: Concept
definition: 1.AA [Fuel Combustion - Sectoral approach][Peat][Emissions][CH4][kt][no source][no method][no target][no option][no type]
status: valid
status modified: 2017-02-13
accepted date: 2017-02-13
in scheme: emissions_variables_MMR

1.AA [Fuel Combustion - Sectoral approach][Peat][Emissions][CO2][kt][no source][no method][no target][no option][no type]
type: Concept
definition: 1.AA [Fuel Combustion - Sectoral approach][Peat][Emissions][CO2][kt][no source][no method][no target][no option][no type]
status: valid
status modified: 2017-02-13
accepted date: 2017-02-13
in scheme: emissions_variables_MMR

1.AA [Fuel Combustion - Sectoral approach][Peat][Emissions][N2O][kt][no source][no method][no target][no option][no type]
type: Concept
definition: 1.AA [Fuel Combustion - Sectoral approach][Peat][Emissions][N2O][kt][no source][no method][no target][no option][no type]
status: valid
status modified: 2017-02-13
accepted date: 2017-02-13
in scheme: emissions_variables_MMR

1.AA [Fuel Combustion - Sectoral approach][Solid Fuels][Emissions][CH4][kt][no source][no method][no target][no option][no type]
type: Concept
definition: 1.AA [Fuel Combustion - Sectoral approach][Solid Fuels][Emissions][CH4][kt][no source][no method][no target][no option][no type]
status: valid
status modified: 2017-02-13
accepted date: 2017-02-13
in scheme: emissions_variables_MMR

1.AA [Fuel Combustion - Sectoral approach][Solid Fuels][Emissions][CO2][kt][no source][no method][no target][no option][no type]
type: Concept
definition: 1.AA [Fuel Combustion - Sectoral approach][Solid Fuels][Emissions][CO2][kt][no source][no method][no target][no option][no type]
status: valid
status modified: 2017-02-13
accepted date: 2017-02-13
in scheme: emissions_variables_MMR

1.AA [Fuel Combustion - Sectoral approach][Solid Fuels][Emissions][N2O][kt][no source][no method][no target][no option][no type]
type: Concept
definition: 1.AA [Fuel Combustion - Sectoral approach][Solid Fuels][Emissions][N2O][kt][no source][no method][no target][no option][no type]
status: valid
status modified: 2017-02-13
accepted date: 2017-02-13
in scheme: emissions_variables_MMR

1.AB [Fuel Combustion - Reference Approach][Fuels][Emissions][C][kt][no source][no method][no target][no option][no type]
type: Concept
definition: 1.AB [Fuel Combustion - Reference Approach][Fuels][Emissions][C][kt][no source][no method][no target][no option][no type]
status: valid
status modified: 2017-02-13
accepted date: 2017-02-13
in scheme: emissions_variables_MMR

1.AB [Fuel Combustion - Reference Approach][Fuels][Emissions][CO2][kt][no source][no method][no target][no option][no type]
type: Concept
definition: 1.AB [Fuel Combustion - Reference Approach][Fuels][Emissions][CO2][kt][no source][no method][no target][no option][no type]
status: valid
status modified: 2017-02-13
accepted date: 2017-02-13
in scheme: emissions_variables_MMR

1.AB Anthracite [Fuel Combustion - Reference Approach][Anthracite][Emissions][C][kt][no source][no method][no target][no option][no type]
type: Concept
definition: 1.AB Anthracite [Fuel Combustion - Reference Approach][Anthracite][Emissions][C][kt][no source][no method][no target][no option][no type]
status: valid
status modified: 2017-02-13
accepted date: 2017-02-13
in scheme: emissions_variables_MMR

1.AB Anthracite [Fuel Combustion - Reference Approach][Anthracite][Emissions][CO2][kt][no source][no method][no target][no option][no type]
type: Concept
definition: 1.AB Anthracite [Fuel Combustion - Reference Approach][Anthracite][Emissions][CO2][kt][no source][no method][no target][no option][no type]
status: valid
status modified: 2017-02-13
accepted date: 2017-02-13
in scheme: emissions_variables_MMR

1.AB Biomass [Fuel Combustion - Reference Approach][Biomass][Emissions][C][kt][no source][no method][no target][no option][no type]
type: Concept
definition: 1.AB Biomass [Fuel Combustion - Reference Approach][Biomass][Emissions][C][kt][no source][no method][no target][no option][no type]
status: valid
status modified: 2017-02-13
accepted date: 2017-02-13
in scheme: emissions_variables_MMR

1.AB Biomass [Fuel Combustion - Reference Approach][Biomass][Emissions][CO2][kt][no source][no method][no target][no option][no type]
type: Concept
definition: 1.AB Biomass [Fuel Combustion - Reference Approach][Biomass][Emissions][CO2][kt][no source][no method][no target][no option][no type]
status: valid
status modified: 2017-02-13
accepted date: 2017-02-13
in scheme: emissions_variables_MMR

1.AB Bitumen [Fuel Combustion - Reference Approach][Bitumen][Emissions][C][kt][no source][no method][no target][no option][no type]
type: Concept
definition: 1.AB Bitumen [Fuel Combustion - Reference Approach][Bitumen][Emissions][C][kt][no source][no method][no target][no option][no type]
status: valid
status modified: 2017-02-13
accepted date: 2017-02-13
in scheme: emissions_variables_MMR

1.AB Bitumen [Fuel Combustion - Reference Approach][Bitumen][Emissions][CO2][kt][no source][no method][no target][no option][no type]
type: Concept
definition: 1.AB Bitumen [Fuel Combustion - Reference Approach][Bitumen][Emissions][CO2][kt][no source][no method][no target][no option][no type]
status: valid
status modified: 2017-02-13
accepted date: 2017-02-13
in scheme: emissions_variables_MMR

1.AB BKB and Patent Fuel [Fuel Combustion - Reference Approach][BKB and Patent Fuel][Emissions][C][kt][no source][no method][no target][no option][no type]
type: Concept
definition: 1.AB BKB and Patent Fuel [Fuel Combustion - Reference Approach][BKB and Patent Fuel][Emissions][C][kt][no source][no method][no target][no option][no type]
status: valid
status modified: 2017-02-13
accepted date: 2017-02-13
in scheme: emissions_variables_MMR

1.AB BKB and Patent Fuel [Fuel Combustion - Reference Approach][BKB and Patent Fuel][Emissions][CO2][kt][no source][no method][no target][no option][no type]
type: Concept
definition: 1.AB BKB and Patent Fuel [Fuel Combustion - Reference Approach][BKB and Patent Fuel][Emissions][CO2][kt][no source][no method][no target][no option][no type]
status: valid
status modified: 2017-02-13
accepted date: 2017-02-13
in scheme: emissions_variables_MMR

1.AB Coal Tar [Fuel Combustion - Reference Approach][Coal Tar][Emissions][C][kt][no source][no method][no target][no option][no type]
type: Concept
definition: 1.AB Coal Tar [Fuel Combustion - Reference Approach][Coal Tar][Emissions][C][kt][no source][no method][no target][no option][no type]
status: valid
status modified: 2017-02-13
accepted date: 2017-02-13
in scheme: emissions_variables_MMR

1.AB Coal Tar [Fuel Combustion - Reference Approach][Coal Tar][Emissions][CO2][kt][no source][no method][no target][no option][no type]
type: Concept
definition: 1.AB Coal Tar [Fuel Combustion - Reference Approach][Coal Tar][Emissions][CO2][kt][no source][no method][no target][no option][no type]
status: valid
status modified: 2017-02-13
accepted date: 2017-02-13
in scheme: emissions_variables_MMR

1.AB Coke Oven/Gas Coke [Fuel Combustion - Reference Approach][Coke Oven/Gas Coke][Emissions][C][kt][no source][no method][no target][no option][no type]
type: Concept
definition: 1.AB Coke Oven/Gas Coke [Fuel Combustion - Reference Approach][Coke Oven/Gas Coke][Emissions][C][kt][no source][no method][no target][no option][no type]
status: valid
status modified: 2017-02-13
accepted date: 2017-02-13
in scheme: emissions_variables_MMR

1.AB Coke Oven/Gas Coke [Fuel Combustion - Reference Approach][Coke Oven/Gas Coke][Emissions][CO2][kt][no source][no method][no target][no option][no type]
type: Concept
definition: 1.AB Coke Oven/Gas Coke [Fuel Combustion - Reference Approach][Coke Oven/Gas Coke][Emissions][CO2][kt][no source][no method][no target][no option][no type]
status: valid
status modified: 2017-02-13
accepted date: 2017-02-13
in scheme: emissions_variables_MMR

1.AB Coking Coal [Fuel Combustion - Reference Approach][Coking Coal][Emissions][C][kt][no source][no method][no target][no option][no type]
type: Concept
definition: 1.AB Coking Coal [Fuel Combustion - Reference Approach][Coking Coal][Emissions][C][kt][no source][no method][no target][no option][no type]
status: valid
status modified: 2017-02-13
accepted date: 2017-02-13
in scheme: emissions_variables_MMR

1.AB Coking Coal [Fuel Combustion - Reference Approach][Coking Coal][Emissions][CO2][kt][no source][no method][no target][no option][no type]
type: Concept
definition: 1.AB Coking Coal [Fuel Combustion - Reference Approach][Coking Coal][Emissions][CO2][kt][no source][no method][no target][no option][no type]
status: valid
status modified: 2017-02-13
accepted date: 2017-02-13
in scheme: emissions_variables_MMR

1.AB Crude Oil [Fuel Combustion - Reference Approach][Crude Oil][Emissions][C][kt][no source][no method][no target][no option][no type]
type: Concept
definition: 1.AB Crude Oil [Fuel Combustion - Reference Approach][Crude Oil][Emissions][C][kt][no source][no method][no target][no option][no type]
status: valid
status modified: 2017-02-13
accepted date: 2017-02-13
in scheme: emissions_variables_MMR

1.AB Crude Oil [Fuel Combustion - Reference Approach][Crude Oil][Emissions][CO2][kt][no source][no method][no target][no option][no type]
type: Concept
definition: 1.AB Crude Oil [Fuel Combustion - Reference Approach][Crude Oil][Emissions][CO2][kt][no source][no method][no target][no option][no type]
status: valid
status modified: 2017-02-13
accepted date: 2017-02-13
in scheme: emissions_variables_MMR

1.AB Ethane [Fuel Combustion - Reference Approach][Ethane][Emissions][C][kt][no source][no method][no target][no option][no type]
type: Concept
definition: 1.AB Ethane [Fuel Combustion - Reference Approach][Ethane][Emissions][C][kt][no source][no method][no target][no option][no type]
status: valid
status modified: 2017-02-13
accepted date: 2017-02-13
in scheme: emissions_variables_MMR

1.AB Ethane [Fuel Combustion - Reference Approach][Ethane][Emissions][CO2][kt][no source][no method][no target][no option][no type]
type: Concept
definition: 1.AB Ethane [Fuel Combustion - Reference Approach][Ethane][Emissions][CO2][kt][no source][no method][no target][no option][no type]
status: valid
status modified: 2017-02-13
accepted date: 2017-02-13
in scheme: emissions_variables_MMR

1.AB Gas / Diesel Oil [Fuel Combustion - Reference Approach][Gas/Diesel Oil][Emissions][C][kt][no source][no method][no target][no option][no type]
type: Concept
definition: 1.AB Gas / Diesel Oil [Fuel Combustion - Reference Approach][Gas/Diesel Oil][Emissions][C][kt][no source][no method][no target][no option][no type]
status: valid
status modified: 2017-02-13
accepted date: 2017-02-13
in scheme: emissions_variables_MMR

1.AB Gas / Diesel Oil [Fuel Combustion - Reference Approach][Gas/Diesel Oil][Emissions][CO2][kt][no source][no method][no target][no option][no type]
type: Concept
definition: 1.AB Gas / Diesel Oil [Fuel Combustion - Reference Approach][Gas/Diesel Oil][Emissions][CO2][kt][no source][no method][no target][no option][no type]
status: valid
status modified: 2017-02-13
accepted date: 2017-02-13
in scheme: emissions_variables_MMR

1.AB Gas Biomass [Fuel Combustion - Reference Approach][Gas Biomass][Emissions][C][kt][no source][no method][no target][no option][no type]
type: Concept
definition: 1.AB Gas Biomass [Fuel Combustion - Reference Approach][Gas Biomass][Emissions][C][kt][no source][no method][no target][no option][no type]
status: valid
status modified: 2017-02-13
accepted date: 2017-02-13
in scheme: emissions_variables_MMR

1.AB Gas Biomass [Fuel Combustion - Reference Approach][Gas Biomass][Emissions][CO2][kt][no source][no method][no target][no option][no type]
type: Concept
definition: 1.AB Gas Biomass [Fuel Combustion - Reference Approach][Gas Biomass][Emissions][CO2][kt][no source][no method][no target][no option][no type]
status: valid
status modified: 2017-02-13
accepted date: 2017-02-13
in scheme: emissions_variables_MMR

1.AB Gaseous Fuels [Fuel Combustion - Reference Approach][Gaseous Fuels][Emissions][C][kt][no source][no method][no target][no option][no type]
type: Concept
definition: 1.AB Gaseous Fuels [Fuel Combustion - Reference Approach][Gaseous Fuels][Emissions][C][kt][no source][no method][no target][no option][no type]
status: valid
status modified: 2017-02-13
accepted date: 2017-02-13
in scheme: emissions_variables_MMR

1.AB Gaseous Fuels [Fuel Combustion - Reference Approach][Gaseous Fuels][Emissions][CO2][kt][no source][no method][no target][no option][no type]
type: Concept
definition: 1.AB Gaseous Fuels [Fuel Combustion - Reference Approach][Gaseous Fuels][Emissions][CO2][kt][no source][no method][no target][no option][no type]
status: valid
status modified: 2017-02-13
accepted date: 2017-02-13
in scheme: emissions_variables_MMR

1.AB Gasoline [Fuel Combustion - Reference Approach][Gasoline][Emissions][C][kt][no source][no method][no target][no option][no type]
type: Concept
definition: 1.AB Gasoline [Fuel Combustion - Reference Approach][Gasoline][Emissions][C][kt][no source][no method][no target][no option][no type]
status: valid
status modified: 2017-02-13
accepted date: 2017-02-13
in scheme: emissions_variables_MMR

1.AB Gasoline [Fuel Combustion - Reference Approach][Gasoline][Emissions][CO2][kt][no source][no method][no target][no option][no type]
type: Concept
definition: 1.AB Gasoline [Fuel Combustion - Reference Approach][Gasoline][Emissions][CO2][kt][no source][no method][no target][no option][no type]
status: valid
status modified: 2017-02-13
accepted date: 2017-02-13
in scheme: emissions_variables_MMR

1.AB Jet Kerosene [Fuel Combustion - Reference Approach][Jet Kerosene][Emissions][C][kt][no source][no method][no target][no option][no type]
type: Concept
definition: 1.AB Jet Kerosene [Fuel Combustion - Reference Approach][Jet Kerosene][Emissions][C][kt][no source][no method][no target][no option][no type]
status: valid
status modified: 2017-02-13
accepted date: 2017-02-13
in scheme: emissions_variables_MMR

1.AB Jet Kerosene [Fuel Combustion - Reference Approach][Jet Kerosene][Emissions][CO2][kt][no source][no method][no target][no option][no type]
type: Concept
definition: 1.AB Jet Kerosene [Fuel Combustion - Reference Approach][Jet Kerosene][Emissions][CO2][kt][no source][no method][no target][no option][no type]
status: valid
status modified: 2017-02-13
accepted date: 2017-02-13
in scheme: emissions_variables_MMR

1.AB Lignite [Fuel Combustion - Reference Approach][Lignite][Emissions][C][kt][no source][no method][no target][no option][no type]
type: Concept
definition: 1.AB Lignite [Fuel Combustion - Reference Approach][Lignite][Emissions][C][kt][no source][no method][no target][no option][no type]
status: valid
status modified: 2017-02-13
accepted date: 2017-02-13
in scheme: emissions_variables_MMR

1.AB Lignite [Fuel Combustion - Reference Approach][Lignite][Emissions][CO2][kt][no source][no method][no target][no option][no type]
type: Concept
definition: 1.AB Lignite [Fuel Combustion - Reference Approach][Lignite][Emissions][CO2][kt][no source][no method][no target][no option][no type]
status: valid
status modified: 2017-02-13
accepted date: 2017-02-13
in scheme: emissions_variables_MMR

1.AB Liquid Biomass [Fuel Combustion - Reference Approach][Liquid Biomass][Emissions][C][kt][no source][no method][no target][no option][no type]
type: Concept
definition: 1.AB Liquid Biomass [Fuel Combustion - Reference Approach][Liquid Biomass][Emissions][C][kt][no source][no method][no target][no option][no type]
status: valid
status modified: 2017-02-13
accepted date: 2017-02-13
in scheme: emissions_variables_MMR

1.AB Liquid Biomass [Fuel Combustion - Reference Approach][Liquid Biomass][Emissions][CO2][kt][no source][no method][no target][no option][no type]
type: Concept
definition: 1.AB Liquid Biomass [Fuel Combustion - Reference Approach][Liquid Biomass][Emissions][CO2][kt][no source][no method][no target][no option][no type]
status: valid
status modified: 2017-02-13
accepted date: 2017-02-13
in scheme: emissions_variables_MMR

1.AB Liquid Fuels [Fuel Combustion - Reference Approach][Liquid Fuels][Emissions][C][kt][no source][no method][no target][no option][no type]
type: Concept
definition: 1.AB Liquid Fuels [Fuel Combustion - Reference Approach][Liquid Fuels][Emissions][C][kt][no source][no method][no target][no option][no type]
status: valid
status modified: 2017-02-13
accepted date: 2017-02-13
in scheme: emissions_variables_MMR

1.AB Liquid Fuels [Fuel Combustion - Reference Approach][Liquid Fuels][Emissions][CO2][kt][no source][no method][no target][no option][no type]
type: Concept
definition: 1.AB Liquid Fuels [Fuel Combustion - Reference Approach][Liquid Fuels][Emissions][CO2][kt][no source][no method][no target][no option][no type]
status: valid
status modified: 2017-02-13
accepted date: 2017-02-13
in scheme: emissions_variables_MMR

1.AB LPG [Fuel Combustion - Reference Approach][Liquefied Petroleum Gases (LPG)][Emissions][C][kt][no source][no method][no target][no option][no type]
type: Concept
definition: 1.AB LPG [Fuel Combustion - Reference Approach][Liquefied Petroleum Gases (LPG)][Emissions][C][kt][no source][no method][no target][no option][no type]
status: valid
status modified: 2017-02-13
accepted date: 2017-02-13
in scheme: emissions_variables_MMR

1.AB LPG [Fuel Combustion - Reference Approach][Liquefied Petroleum Gases (LPG)][Emissions][CO2][kt][no source][no method][no target][no option][no type]
type: Concept
definition: 1.AB LPG [Fuel Combustion - Reference Approach][Liquefied Petroleum Gases (LPG)][Emissions][CO2][kt][no source][no method][no target][no option][no type]
status: valid
status modified: 2017-02-13
accepted date: 2017-02-13
in scheme: emissions_variables_MMR

1.AB Lubricants [Fuel Combustion - Reference Approach][Lubricants][Emissions][C][kt][no source][no method][no target][no option][no type]
type: Concept
definition: 1.AB Lubricants [Fuel Combustion - Reference Approach][Lubricants][Emissions][C][kt][no source][no method][no target][no option][no type]
status: valid
status modified: 2017-02-13
accepted date: 2017-02-13
in scheme: emissions_variables_MMR

1.AB Lubricants [Fuel Combustion - Reference Approach][Lubricants][Emissions][CO2][kt][no source][no method][no target][no option][no type]
type: Concept
definition: 1.AB Lubricants [Fuel Combustion - Reference Approach][Lubricants][Emissions][CO2][kt][no source][no method][no target][no option][no type]
status: valid
status modified: 2017-02-13
accepted date: 2017-02-13
in scheme: emissions_variables_MMR

1.AB Naphtha [Fuel Combustion - Reference Approach][Naphtha][Emissions][C][kt][no source][no method][no target][no option][no type]
type: Concept
definition: 1.AB Naphtha [Fuel Combustion - Reference Approach][Naphtha][Emissions][C][kt][no source][no method][no target][no option][no type]
status: valid
status modified: 2017-02-13
accepted date: 2017-02-13
in scheme: emissions_variables_MMR

1.AB Naphtha [Fuel Combustion - Reference Approach][Naphtha][Emissions][CO2][kt][no source][no method][no target][no option][no type]
type: Concept
definition: 1.AB Naphtha [Fuel Combustion - Reference Approach][Naphtha][Emissions][CO2][kt][no source][no method][no target][no option][no type]
status: valid
status modified: 2017-02-13
accepted date: 2017-02-13
in scheme: emissions_variables_MMR

1.AB Natural Gas (Dry) [Fuel Combustion - Reference Approach][Natural Gas (Dry)][Emissions][C][kt][no source][no method][no target][no option][no type]
type: Concept
definition: 1.AB Natural Gas (Dry) [Fuel Combustion - Reference Approach][Natural Gas (Dry)][Emissions][C][kt][no source][no method][no target][no option][no type]
status: valid
status modified: 2017-02-13
accepted date: 2017-02-13
in scheme: emissions_variables_MMR

1.AB Natural Gas (Dry) [Fuel Combustion - Reference Approach][Natural Gas (Dry)][Emissions][CO2][kt][no source][no method][no target][no option][no type]
type: Concept
definition: 1.AB Natural Gas (Dry) [Fuel Combustion - Reference Approach][Natural Gas (Dry)][Emissions][CO2][kt][no source][no method][no target][no option][no type]
status: valid
status modified: 2017-02-13
accepted date: 2017-02-13
in scheme: emissions_variables_MMR

1.AB Natural Gas Liquids [Fuel Combustion - Reference Approach][Natural Gas Liquids][Emissions][C][kt][no source][no method][no target][no option][no type]
type: Concept
definition: 1.AB Natural Gas Liquids [Fuel Combustion - Reference Approach][Natural Gas Liquids][Emissions][C][kt][no source][no method][no target][no option][no type]
status: valid
status modified: 2017-02-13
accepted date: 2017-02-13
in scheme: emissions_variables_MMR

1.AB Natural Gas Liquids [Fuel Combustion - Reference Approach][Natural Gas Liquids][Emissions][CO2][kt][no source][no method][no target][no option][no type]
type: Concept
definition: 1.AB Natural Gas Liquids [Fuel Combustion - Reference Approach][Natural Gas Liquids][Emissions][CO2][kt][no source][no method][no target][no option][no type]
status: valid
status modified: 2017-02-13
accepted date: 2017-02-13
in scheme: emissions_variables_MMR

1.AB Oil Shale and Tar Sand [Fuel Combustion - Reference Approach][Oil Shale and Tar Sand][Emissions][C][kt][no source][no method][no target][no option][no type]
type: Concept
definition: 1.AB Oil Shale and Tar Sand [Fuel Combustion - Reference Approach][Oil Shale and Tar Sand][Emissions][C][kt][no source][no method][no target][no option][no type]
status: valid
status modified: 2017-02-13
accepted date: 2017-02-13
in scheme: emissions_variables_MMR

1.AB Oil Shale and Tar Sand [Fuel Combustion - Reference Approach][Oil Shale and Tar Sand][Emissions][CO2][kt][no source][no method][no target][no option][no type]
type: Concept
definition: 1.AB Oil Shale and Tar Sand [Fuel Combustion - Reference Approach][Oil Shale and Tar Sand][Emissions][CO2][kt][no source][no method][no target][no option][no type]
status: valid
status modified: 2017-02-13
accepted date: 2017-02-13
in scheme: emissions_variables_MMR

1.AB Orimulsion [Fuel Combustion - Reference Approach][Orimulsion][Emissions][C][kt][no source][no method][no target][no option][no type]
type: Concept
definition: 1.AB Orimulsion [Fuel Combustion - Reference Approach][Orimulsion][Emissions][C][kt][no source][no method][no target][no option][no type]
status: valid
status modified: 2017-02-13
accepted date: 2017-02-13
in scheme: emissions_variables_MMR

1.AB Orimulsion [Fuel Combustion - Reference Approach][Orimulsion][Emissions][CO2][kt][no source][no method][no target][no option][no type]
type: Concept
definition: 1.AB Orimulsion [Fuel Combustion - Reference Approach][Orimulsion][Emissions][CO2][kt][no source][no method][no target][no option][no type]
status: valid
status modified: 2017-02-13
accepted date: 2017-02-13
in scheme: emissions_variables_MMR

1.AB Other Bituminous Coal [Fuel Combustion - Reference Approach][Other Bituminous Coal][Emissions][C][kt][no source][no method][no target][no option][no type]
type: Concept
definition: 1.AB Other Bituminous Coal [Fuel Combustion - Reference Approach][Other Bituminous Coal][Emissions][C][kt][no source][no method][no target][no option][no type]
status: valid
status modified: 2017-02-13
accepted date: 2017-02-13
in scheme: emissions_variables_MMR

1.AB Other Bituminous Coal [Fuel Combustion - Reference Approach][Other Bituminous Coal][Emissions][CO2][kt][no source][no method][no target][no option][no type]
type: Concept
definition: 1.AB Other Bituminous Coal [Fuel Combustion - Reference Approach][Other Bituminous Coal][Emissions][CO2][kt][no source][no method][no target][no option][no type]
status: valid
status modified: 2017-02-13
accepted date: 2017-02-13
in scheme: emissions_variables_MMR

1.AB Other Fossil Fuels [Fuel Combustion - Reference Approach][Other Fossil Fuels][Emissions][C][kt][no source][no method][no target][no option][no type]
type: Concept
definition: 1.AB Other Fossil Fuels [Fuel Combustion - Reference Approach][Other Fossil Fuels][Emissions][C][kt][no source][no method][no target][no option][no type]
status: valid
status modified: 2017-02-13
accepted date: 2017-02-13
in scheme: emissions_variables_MMR

1.AB Other Gaseous Fossil [Fuel Combustion - Reference Approach][Other Gaseous Fossil][Emissions][C][kt][no source][no method][no target][no option][no type]
type: Concept
definition: 1.AB Other Gaseous Fossil [Fuel Combustion - Reference Approach][Other Gaseous Fossil][Emissions][C][kt][no source][no method][no target][no option][no type]
status: valid
status modified: 2017-02-13
accepted date: 2017-02-13
in scheme: emissions_variables_MMR

1.AB Other Gaseous Fossil [Fuel Combustion - Reference Approach][Other Gaseous Fossil][Emissions][CO2][kt][no source][no method][no target][no option][no type]
type: Concept
definition: 1.AB Other Gaseous Fossil [Fuel Combustion - Reference Approach][Other Gaseous Fossil][Emissions][CO2][kt][no source][no method][no target][no option][no type]
status: valid
status modified: 2017-02-13
accepted date: 2017-02-13
in scheme: emissions_variables_MMR

1.AB Other Kerosene [Fuel Combustion - Reference Approach][Other Kerosene][Emissions][C][kt][no source][no method][no target][no option][no type]
type: Concept
definition: 1.AB Other Kerosene [Fuel Combustion - Reference Approach][Other Kerosene][Emissions][C][kt][no source][no method][no target][no option][no type]
status: valid
status modified: 2017-02-13
accepted date: 2017-02-13
in scheme: emissions_variables_MMR

1.AB Other Kerosene [Fuel Combustion - Reference Approach][Other Kerosene][Emissions][CO2][kt][no source][no method][no target][no option][no type]
type: Concept
definition: 1.AB Other Kerosene [Fuel Combustion - Reference Approach][Other Kerosene][Emissions][CO2][kt][no source][no method][no target][no option][no type]
status: valid
status modified: 2017-02-13
accepted date: 2017-02-13
in scheme: emissions_variables_MMR

1.AB Other Liquid Fossil [Fuel Combustion - Reference Approach][Other Liquid Fossil][Emissions][C][kt][no source][no method][no target][no option][no type]
type: Concept
definition: 1.AB Other Liquid Fossil [Fuel Combustion - Reference Approach][Other Liquid Fossil][Emissions][C][kt][no source][no method][no target][no option][no type]
status: valid
status modified: 2017-02-13
accepted date: 2017-02-13
in scheme: emissions_variables_MMR

1.AB Other Liquid Fossil [Fuel Combustion - Reference Approach][Other Liquid Fossil][Emissions][CO2][kt][no source][no method][no target][no option][no type]
type: Concept
definition: 1.AB Other Liquid Fossil [Fuel Combustion - Reference Approach][Other Liquid Fossil][Emissions][CO2][kt][no source][no method][no target][no option][no type]
status: valid
status modified: 2017-02-13
accepted date: 2017-02-13
in scheme: emissions_variables_MMR

1.AB Other non-fossil fuels [Fuel Combustion - Reference Approach][Other non-fossil fuels (biogenic waste)][Emissions][C][kt][no source][no method][no target][no option][no type]
type: Concept
definition: 1.AB Other non-fossil fuels [Fuel Combustion - Reference Approach][Other non-fossil fuels (biogenic waste)][Emissions][C][kt][no source][no method][no target][no option][no type]
status: valid
status modified: 2017-02-13
accepted date: 2017-02-13
in scheme: emissions_variables_MMR

1.AB Other non-fossil fuels [Fuel Combustion - Reference Approach][Other non-fossil fuels (biogenic waste)][Emissions][CO2][kt][no source][no method][no target][no option][no type]
type: Concept
definition: 1.AB Other non-fossil fuels [Fuel Combustion - Reference Approach][Other non-fossil fuels (biogenic waste)][Emissions][CO2][kt][no source][no method][no target][no option][no type]
status: valid
status modified: 2017-02-13
accepted date: 2017-02-13
in scheme: emissions_variables_MMR

1.AB Other Oil [Fuel Combustion - Reference Approach][Other Oil][Emissions][C][kt][no source][no method][no target][no option][no type]
type: Concept
definition: 1.AB Other Oil [Fuel Combustion - Reference Approach][Other Oil][Emissions][C][kt][no source][no method][no target][no option][no type]
status: valid
status modified: 2017-02-13
accepted date: 2017-02-13
in scheme: emissions_variables_MMR

1.AB Other Oil [Fuel Combustion - Reference Approach][Other Oil][Emissions][CO2][kt][no source][no method][no target][no option][no type]
type: Concept
definition: 1.AB Other Oil [Fuel Combustion - Reference Approach][Other Oil][Emissions][CO2][kt][no source][no method][no target][no option][no type]
status: valid
status modified: 2017-02-13
accepted date: 2017-02-13
in scheme: emissions_variables_MMR

1.AB Other Solid Fossil [Fuel Combustion - Reference Approach][Other Solid Fossil][Emissions][C][kt][no source][no method][no target][no option][no type]
type: Concept
definition: 1.AB Other Solid Fossil [Fuel Combustion - Reference Approach][Other Solid Fossil][Emissions][C][kt][no source][no method][no target][no option][no type]
status: valid
status modified: 2017-02-13
accepted date: 2017-02-13
in scheme: emissions_variables_MMR

1.AB Other Solid Fossil [Fuel Combustion - Reference Approach][Other Solid Fossil][Emissions][CO2][kt][no source][no method][no target][no option][no type]
type: Concept
definition: 1.AB Other Solid Fossil [Fuel Combustion - Reference Approach][Other Solid Fossil][Emissions][CO2][kt][no source][no method][no target][no option][no type]
status: valid
status modified: 2017-02-13
accepted date: 2017-02-13
in scheme: emissions_variables_MMR

1.AB Peat [Fuel Combustion - Reference Approach][Peat][Emissions][C][kt][no source][no method][no target][no option][no type]
type: Concept
definition: 1.AB Peat [Fuel Combustion - Reference Approach][Peat][Emissions][C][kt][no source][no method][no target][no option][no type]
status: valid
status modified: 2017-02-13
accepted date: 2017-02-13
in scheme: emissions_variables_MMR

1.AB Peat [Fuel Combustion - Reference Approach][Peat][Emissions][CO2][kt][no source][no method][no target][no option][no type]
type: Concept
definition: 1.AB Peat [Fuel Combustion - Reference Approach][Peat][Emissions][CO2][kt][no source][no method][no target][no option][no type]
status: valid
status modified: 2017-02-13
accepted date: 2017-02-13
in scheme: emissions_variables_MMR

1.AB Petroleum Coke [Fuel Combustion - Reference Approach][Petroleum Coke][Emissions][C][kt][no source][no method][no target][no option][no type]
type: Concept
definition: 1.AB Petroleum Coke [Fuel Combustion - Reference Approach][Petroleum Coke][Emissions][C][kt][no source][no method][no target][no option][no type]
status: valid
status modified: 2017-02-13
accepted date: 2017-02-13
in scheme: emissions_variables_MMR

1.AB Petroleum Coke [Fuel Combustion - Reference Approach][Petroleum Coke][Emissions][CO2][kt][no source][no method][no target][no option][no type]
type: Concept
definition: 1.AB Petroleum Coke [Fuel Combustion - Reference Approach][Petroleum Coke][Emissions][CO2][kt][no source][no method][no target][no option][no type]
status: valid
status modified: 2017-02-13
accepted date: 2017-02-13
in scheme: emissions_variables_MMR

1.AB Refinery Feedstocks [Fuel Combustion - Reference Approach][Refinery Feedstocks][Emissions][C][kt][no source][no method][no target][no option][no type]
type: Concept
definition: 1.AB Refinery Feedstocks [Fuel Combustion - Reference Approach][Refinery Feedstocks][Emissions][C][kt][no source][no method][no target][no option][no type]
status: valid
status modified: 2017-02-13
accepted date: 2017-02-13
in scheme: emissions_variables_MMR

1.AB Refinery Feedstocks [Fuel Combustion - Reference Approach][Refinery Feedstocks][Emissions][CO2][kt][no source][no method][no target][no option][no type]
type: Concept
definition: 1.AB Refinery Feedstocks [Fuel Combustion - Reference Approach][Refinery Feedstocks][Emissions][CO2][kt][no source][no method][no target][no option][no type]
status: valid
status modified: 2017-02-13
accepted date: 2017-02-13
in scheme: emissions_variables_MMR

1.AB Residual Fuel Oil [Fuel Combustion - Reference Approach][Residual Fuel Oil][Emissions][C][kt][no source][no method][no target][no option][no type]
type: Concept
definition: 1.AB Residual Fuel Oil [Fuel Combustion - Reference Approach][Residual Fuel Oil][Emissions][C][kt][no source][no method][no target][no option][no type]
status: valid
status modified: 2017-02-13
accepted date: 2017-02-13
in scheme: emissions_variables_MMR

1.AB Residual Fuel Oil [Fuel Combustion - Reference Approach][Residual Fuel Oil][Emissions][CO2][kt][no source][no method][no target][no option][no type]
type: Concept
definition: 1.AB Residual Fuel Oil [Fuel Combustion - Reference Approach][Residual Fuel Oil][Emissions][CO2][kt][no source][no method][no target][no option][no type]
status: valid
status modified: 2017-02-13
accepted date: 2017-02-13
in scheme: emissions_variables_MMR

1.AB Shale Oil [Fuel Combustion - Reference Approach][Shale Oil][Emissions][C][kt][no source][no method][no target][no option][no type]
type: Concept
definition: 1.AB Shale Oil [Fuel Combustion - Reference Approach][Shale Oil][Emissions][C][kt][no source][no method][no target][no option][no type]
status: valid
status modified: 2017-02-13
accepted date: 2017-02-13
in scheme: emissions_variables_MMR

1.AB Shale Oil [Fuel Combustion - Reference Approach][Shale Oil][Emissions][CO2][kt][no source][no method][no target][no option][no type]
type: Concept
definition: 1.AB Shale Oil [Fuel Combustion - Reference Approach][Shale Oil][Emissions][CO2][kt][no source][no method][no target][no option][no type]
status: valid
status modified: 2017-02-13
accepted date: 2017-02-13
in scheme: emissions_variables_MMR

1.AB Solid Biomass [Fuel Combustion - Reference Approach][Solid Biomass][Emissions][C][kt][no source][no method][no target][no option][no type]
type: Concept
definition: 1.AB Solid Biomass [Fuel Combustion - Reference Approach][Solid Biomass][Emissions][C][kt][no source][no method][no target][no option][no type]
status: valid
status modified: 2017-02-13
accepted date: 2017-02-13
in scheme: emissions_variables_MMR

1.AB Solid Biomass [Fuel Combustion - Reference Approach][Solid Biomass][Emissions][CO2][kt][no source][no method][no target][no option][no type]
type: Concept
definition: 1.AB Solid Biomass [Fuel Combustion - Reference Approach][Solid Biomass][Emissions][CO2][kt][no source][no method][no target][no option][no type]
status: valid
status modified: 2017-02-13
accepted date: 2017-02-13
in scheme: emissions_variables_MMR

1.AB Solid Fuels [Fuel Combustion - Reference Approach][Solid Fuels][Emissions][C][kt][no source][no method][no target][no option][no type]
type: Concept
definition: 1.AB Solid Fuels [Fuel Combustion - Reference Approach][Solid Fuels][Emissions][C][kt][no source][no method][no target][no option][no type]
status: valid
status modified: 2017-02-13
accepted date: 2017-02-13
in scheme: emissions_variables_MMR

1.AB Solid Fuels [Fuel Combustion - Reference Approach][Solid Fuels][Emissions][CO2][kt][no source][no method][no target][no option][no type]
type: Concept
definition: 1.AB Solid Fuels [Fuel Combustion - Reference Approach][Solid Fuels][Emissions][CO2][kt][no source][no method][no target][no option][no type]
status: valid
status modified: 2017-02-13
accepted date: 2017-02-13
in scheme: emissions_variables_MMR

1.AB Sub-bituminous Coal [Fuel Combustion - Reference Approach][Sub-bituminous Coal][Emissions][C][kt][no source][no method][no target][no option][no type]
type: Concept
definition: 1.AB Sub-bituminous Coal [Fuel Combustion - Reference Approach][Sub-bituminous Coal][Emissions][C][kt][no source][no method][no target][no option][no type]
status: valid
status modified: 2017-02-13
accepted date: 2017-02-13
in scheme: emissions_variables_MMR

1.AB Sub-bituminous Coal [Fuel Combustion - Reference Approach][Sub-bituminous Coal][Emissions][CO2][kt][no source][no method][no target][no option][no type]
type: Concept
definition: 1.AB Sub-bituminous Coal [Fuel Combustion - Reference Approach][Sub-bituminous Coal][Emissions][CO2][kt][no source][no method][no target][no option][no type]
status: valid
status modified: 2017-02-13
accepted date: 2017-02-13
in scheme: emissions_variables_MMR

1.AB Waste [Fuel Combustion - Reference Approach][Waste (non-biomass fraction)][Emissions][C][kt][no source][no method][no target][no option][no type]
type: Concept
definition: 1.AB Waste [Fuel Combustion - Reference Approach][Waste (non-biomass fraction)][Emissions][C][kt][no source][no method][no target][no option][no type]
status: valid
status modified: 2017-02-13
accepted date: 2017-02-13
in scheme: emissions_variables_MMR

1.AC [Fuel Combustion - Reference Approach][Fossil fuels][Emissions][CO2][kt][no source][no method][no target][no option][no type]
type: Concept
definition: 1.AC [Fuel Combustion - Reference Approach][Fossil fuels][Emissions][CO2][kt][no source][no method][no target][no option][no type]
status: valid
status modified: 2017-02-13
accepted date: 2017-02-13
in scheme: emissions_variables_MMR

1.AC [Fuel Combustion - Sectoral approach][Fossil fuels][Emissions][CO2][kt][no source][no method][no target][no option][no type]
type: Concept
definition: 1.AC [Fuel Combustion - Sectoral approach][Fossil fuels][Emissions][CO2][kt][no source][no method][no target][no option][no type]
status: valid
status modified: 2017-02-13
accepted date: 2017-02-13
in scheme: emissions_variables_MMR

1.AC Other Fossil Fuels [Fuel Combustion - Reference Approach][Other Fossil Fuels and Waste][Emissions][CO2][kt][no source][no method][no target][no option][no type]
type: Concept
definition: 1.AC Other Fossil Fuels [Fuel Combustion - Reference Approach][Other Fossil Fuels and Waste][Emissions][CO2][kt][no source][no method][no target][no option][no type]
status: valid
status modified: 2017-02-13
accepted date: 2017-02-13
in scheme: emissions_variables_MMR

1.AC Other Fossil Fuels [Fuel Combustion - Reference Approach][Other Fossil Fuels][Emissions][CO2][kt][no source][no method][no target][no option][no type]
type: Concept
definition: 1.AC Other Fossil Fuels [Fuel Combustion - Reference Approach][Other Fossil Fuels][Emissions][CO2][kt][no source][no method][no target][no option][no type]
status: valid
status modified: 2017-02-13
accepted date: 2017-02-13
in scheme: emissions_variables_MMR

1.AC Other Fossil Fuels [Fuel Combustion - Reference Approach][Waste (non-biomass fraction)][Emissions][CO2][kt][no source][no method][no target][no option][no type]
type: Concept
definition: 1.AC Other Fossil Fuels [Fuel Combustion - Reference Approach][Waste (non-biomass fraction)][Emissions][CO2][kt][no source][no method][no target][no option][no type]
status: valid
status modified: 2017-02-13
accepted date: 2017-02-13
in scheme: emissions_variables_MMR

1.AD [Feedstocks, reductants and other non-energy use of fuels][Fuels][Emissions][CO2][kt][no source][no method][no target][no option][no type]
type: Concept
definition: 1.AD [Feedstocks, reductants and other non-energy use of fuels][Fuels][Emissions][CO2][kt][no source][no method][no target][no option][no type]
status: valid
status modified: 2017-02-13
accepted date: 2017-02-13
in scheme: emissions_variables_MMR

1.AD Anthracite [Feedstocks, reductants and other non-energy use of fuels][Anthracite][Emissions][CO2][kt][no source][no method][no target][no option][no type]
type: Concept
definition: 1.AD Anthracite [Feedstocks, reductants and other non-energy use of fuels][Anthracite][Emissions][CO2][kt][no source][no method][no target][no option][no type]
status: valid
status modified: 2017-02-13
accepted date: 2017-02-13
in scheme: emissions_variables_MMR

1.AD Bitumen [Feedstocks, reductants and other non-energy use of fuels][Bitumen][Emissions][CO2][kt][no source][no method][no target][no option][no type]
type: Concept
definition: 1.AD Bitumen [Feedstocks, reductants and other non-energy use of fuels][Bitumen][Emissions][CO2][kt][no source][no method][no target][no option][no type]
status: valid
status modified: 2017-02-13
accepted date: 2017-02-13
in scheme: emissions_variables_MMR

1.AD BKB and Patent Fuel [Feedstocks, reductants and other non-energy use of fuels][BKB and Patent Fuel][Emissions][CO2][kt][no source][no method][no target][no option][no type]
type: Concept
definition: 1.AD BKB and Patent Fuel [Feedstocks, reductants and other non-energy use of fuels][BKB and Patent Fuel][Emissions][CO2][kt][no source][no method][no target][no option][no type]
status: valid
status modified: 2017-02-13
accepted date: 2017-02-13
in scheme: emissions_variables_MMR

1.AD Coal Tar [Feedstocks, reductants and other non-energy use of fuels][Coal Tar][Emissions][CO2][kt][no source][no method][no target][no option][no type]
type: Concept
definition: 1.AD Coal Tar [Feedstocks, reductants and other non-energy use of fuels][Coal Tar][Emissions][CO2][kt][no source][no method][no target][no option][no type]
status: valid
status modified: 2017-02-13
accepted date: 2017-02-13
in scheme: emissions_variables_MMR

1.AD Coke Oven/Gas Coke [Feedstocks, reductants and other non-energy use of fuels][Coke Oven/Gas Coke][Emissions][CO2][kt][no source][no method][no target][no option][no type]
type: Concept
definition: 1.AD Coke Oven/Gas Coke [Feedstocks, reductants and other non-energy use of fuels][Coke Oven/Gas Coke][Emissions][CO2][kt][no source][no method][no target][no option][no type]
status: valid
status modified: 2017-02-13
accepted date: 2017-02-13
in scheme: emissions_variables_MMR

1.AD Coking Coal [Feedstocks, reductants and other non-energy use of fuels][Coking Coal][Emissions][CO2][kt][no source][no method][no target][no option][no type]
type: Concept
definition: 1.AD Coking Coal [Feedstocks, reductants and other non-energy use of fuels][Coking Coal][Emissions][CO2][kt][no source][no method][no target][no option][no type]
status: valid
status modified: 2017-02-13
accepted date: 2017-02-13
in scheme: emissions_variables_MMR

1.AD Crude Oil [Feedstocks, reductants and other non-energy use of fuels][Crude Oil][Emissions][CO2][kt][no source][no method][no target][no option][no type]
type: Concept
definition: 1.AD Crude Oil [Feedstocks, reductants and other non-energy use of fuels][Crude Oil][Emissions][CO2][kt][no source][no method][no target][no option][no type]
status: valid
status modified: 2017-02-13
accepted date: 2017-02-13
in scheme: emissions_variables_MMR

1.AD Ethane [Feedstocks, reductants and other non-energy use of fuels][Ethane][Emissions][CO2][kt][no source][no method][no target][no option][no type]
type: Concept
definition: 1.AD Ethane [Feedstocks, reductants and other non-energy use of fuels][Ethane][Emissions][CO2][kt][no source][no method][no target][no option][no type]
status: valid
status modified: 2017-02-13
accepted date: 2017-02-13
in scheme: emissions_variables_MMR

1.AD Gas / Diesel Oil [Feedstocks, reductants and other non-energy use of fuels][Gas/Diesel Oil][Emissions][CO2][kt][no source][no method][no target][no option][no type]
type: Concept
definition: 1.AD Gas / Diesel Oil [Feedstocks, reductants and other non-energy use of fuels][Gas/Diesel Oil][Emissions][CO2][kt][no source][no method][no target][no option][no type]
status: valid
status modified: 2017-02-13
accepted date: 2017-02-13
in scheme: emissions_variables_MMR

1.AD Gaseous Fuels [Feedstocks, reductants and other non-energy use of fuels][Gaseous Fuels][Emissions][CO2][kt][no source][no method][no target][no option][no type]
type: Concept
definition: 1.AD Gaseous Fuels [Feedstocks, reductants and other non-energy use of fuels][Gaseous Fuels][Emissions][CO2][kt][no source][no method][no target][no option][no type]
status: valid
status modified: 2017-02-13
accepted date: 2017-02-13
in scheme: emissions_variables_MMR

1.AD Gasoline [Feedstocks, reductants and other non-energy use of fuels][Gasoline][Emissions][CO2][kt][no source][no method][no target][no option][no type]
type: Concept
definition: 1.AD Gasoline [Feedstocks, reductants and other non-energy use of fuels][Gasoline][Emissions][CO2][kt][no source][no method][no target][no option][no type]
status: valid
status modified: 2017-02-13
accepted date: 2017-02-13
in scheme: emissions_variables_MMR

1.AD Jet Kerosene [Feedstocks, reductants and other non-energy use of fuels][Jet Kerosene][Emissions][CO2][kt][no source][no method][no target][no option][no type]
type: Concept
definition: 1.AD Jet Kerosene [Feedstocks, reductants and other non-energy use of fuels][Jet Kerosene][Emissions][CO2][kt][no source][no method][no target][no option][no type]
status: valid
status modified: 2017-02-13
accepted date: 2017-02-13
in scheme: emissions_variables_MMR

1.AD Lignite [Feedstocks, reductants and other non-energy use of fuels][Lignite][Emissions][CO2][kt][no source][no method][no target][no option][no type]
type: Concept
definition: 1.AD Lignite [Feedstocks, reductants and other non-energy use of fuels][Lignite][Emissions][CO2][kt][no source][no method][no target][no option][no type]
status: valid
status modified: 2017-02-13
accepted date: 2017-02-13
in scheme: emissions_variables_MMR

1.AD Liquefied Petroleum Gas [Feedstocks, reductants and other non-energy use of fuels][Liquefied Petroleum Gases (LPG)][Emissions][CO2][kt][no source][no method][no target][no option][no type]
type: Concept
definition: 1.AD Liquefied Petroleum Gas [Feedstocks, reductants and other non-energy use of fuels][Liquefied Petroleum Gases (LPG)][Emissions][CO2][kt][no source][no method][no target][no option][no type]
status: valid
status modified: 2017-02-13
accepted date: 2017-02-13
in scheme: emissions_variables_MMR

1.AD Liquid Fuels [Feedstocks, reductants and other non-energy use of fuels][Liquid Fuels][Emissions][CO2][kt][no source][no method][no target][no option][no type]
type: Concept
definition: 1.AD Liquid Fuels [Feedstocks, reductants and other non-energy use of fuels][Liquid Fuels][Emissions][CO2][kt][no source][no method][no target][no option][no type]
status: valid
status modified: 2017-02-13
accepted date: 2017-02-13
in scheme: emissions_variables_MMR

1.AD Lubricants [Feedstocks, reductants and other non-energy use of fuels][Lubricants][Emissions][CO2][kt][no source][no method][no target][no option][no type]
type: Concept
definition: 1.AD Lubricants [Feedstocks, reductants and other non-energy use of fuels][Lubricants][Emissions][CO2][kt][no source][no method][no target][no option][no type]
status: valid
status modified: 2017-02-13
accepted date: 2017-02-13
in scheme: emissions_variables_MMR

1.AD Naphtha [Feedstocks, reductants and other non-energy use of fuels][Naphtha][Emissions][CO2][kt][no source][no method][no target][no option][no type]
type: Concept
definition: 1.AD Naphtha [Feedstocks, reductants and other non-energy use of fuels][Naphtha][Emissions][CO2][kt][no source][no method][no target][no option][no type]
status: valid
status modified: 2017-02-13
accepted date: 2017-02-13
in scheme: emissions_variables_MMR

1.AD Natural Gas [Feedstocks, reductants and other non-energy use of fuels][Natural Gas (Dry)][Emissions][CO2][kt][no source][no method][no target][no option][no type]
type: Concept
definition: 1.AD Natural Gas [Feedstocks, reductants and other non-energy use of fuels][Natural Gas (Dry)][Emissions][CO2][kt][no source][no method][no target][no option][no type]
status: valid
status modified: 2017-02-13
accepted date: 2017-02-13
in scheme: emissions_variables_MMR

1.AD Natural Gas Liquids [Feedstocks, reductants and other non-energy use of fuels][Natural Gas Liquids][Emissions][CO2][kt][no source][no method][no target][no option][no type]
type: Concept
definition: 1.AD Natural Gas Liquids [Feedstocks, reductants and other non-energy use of fuels][Natural Gas Liquids][Emissions][CO2][kt][no source][no method][no target][no option][no type]
status: valid
status modified: 2017-02-13
accepted date: 2017-02-13
in scheme: emissions_variables_MMR

1.AD Oil Shale and Tar Sand [Feedstocks, reductants and other non-energy use of fuels][Oil Shale and Tar Sand][Emissions][CO2][kt][no source][no method][no target][no option][no type]
type: Concept
definition: 1.AD Oil Shale and Tar Sand [Feedstocks, reductants and other non-energy use of fuels][Oil Shale and Tar Sand][Emissions][CO2][kt][no source][no method][no target][no option][no type]
status: valid
status modified: 2017-02-13
accepted date: 2017-02-13
in scheme: emissions_variables_MMR

1.AD Orimulsion [Feedstocks, reductants and other non-energy use of fuels][Orimulsion][Emissions][CO2][kt][no source][no method][no target][no option][no type]
type: Concept
definition: 1.AD Orimulsion [Feedstocks, reductants and other non-energy use of fuels][Orimulsion][Emissions][CO2][kt][no source][no method][no target][no option][no type]
status: valid
status modified: 2017-02-13
accepted date: 2017-02-13
in scheme: emissions_variables_MMR

1.AD Other Bituminous Coal [Feedstocks, reductants and other non-energy use of fuels][Other Bituminous Coal][Emissions][CO2][kt][no source][no method][no target][no option][no type]
type: Concept
definition: 1.AD Other Bituminous Coal [Feedstocks, reductants and other non-energy use of fuels][Other Bituminous Coal][Emissions][CO2][kt][no source][no method][no target][no option][no type]
status: valid
status modified: 2017-02-13
accepted date: 2017-02-13
in scheme: emissions_variables_MMR

1.AD Other Fossil Fuels [Feedstocks, reductants and other non-energy use of fuels][Other Fossil Fuels][Emissions][CO2][kt][no source][no method][no target][no option][no type]
type: Concept
definition: 1.AD Other Fossil Fuels [Feedstocks, reductants and other non-energy use of fuels][Other Fossil Fuels][Emissions][CO2][kt][no source][no method][no target][no option][no type]
status: valid
status modified: 2017-02-13
accepted date: 2017-02-13
in scheme: emissions_variables_MMR

1.AD Other Gaseous Fossil [Feedstocks, reductants and other non-energy use of fuels][Other Gaseous Fossil][Emissions][CO2][kt][no source][no method][no target][no option][no type]
type: Concept
definition: 1.AD Other Gaseous Fossil [Feedstocks, reductants and other non-energy use of fuels][Other Gaseous Fossil][Emissions][CO2][kt][no source][no method][no target][no option][no type]
status: valid
status modified: 2017-02-13
accepted date: 2017-02-13
in scheme: emissions_variables_MMR

1.AD Other Kerosene [Feedstocks, reductants and other non-energy use of fuels][Other Kerosene][Emissions][CO2][kt][no source][no method][no target][no option][no type]
type: Concept
definition: 1.AD Other Kerosene [Feedstocks, reductants and other non-energy use of fuels][Other Kerosene][Emissions][CO2][kt][no source][no method][no target][no option][no type]
status: valid
status modified: 2017-02-13
accepted date: 2017-02-13
in scheme: emissions_variables_MMR

1.AD Other Liquid Fossil [Feedstocks, reductants and other non-energy use of fuels][Other Liquid Fossil][Emissions][CO2][kt][no source][no method][no target][no option][no type]
type: Concept
definition: 1.AD Other Liquid Fossil [Feedstocks, reductants and other non-energy use of fuels][Other Liquid Fossil][Emissions][CO2][kt][no source][no method][no target][no option][no type]
status: valid
status modified: 2017-02-13
accepted date: 2017-02-13
in scheme: emissions_variables_MMR

1.AD Other Oil [Feedstocks, reductants and other non-energy use of fuels][Other Oil][Emissions][CO2][kt][no source][no method][no target][no option][no type]
type: Concept
definition: 1.AD Other Oil [Feedstocks, reductants and other non-energy use of fuels][Other Oil][Emissions][CO2][kt][no source][no method][no target][no option][no type]
status: valid
status modified: 2017-02-13
accepted date: 2017-02-13
in scheme: emissions_variables_MMR

1.AD Other Solid Fossil [Feedstocks, reductants and other non-energy use of fuels][Other Solid Fossil][Emissions][CO2][kt][no source][no method][no target][no option][no type]
type: Concept
definition: 1.AD Other Solid Fossil [Feedstocks, reductants and other non-energy use of fuels][Other Solid Fossil][Emissions][CO2][kt][no source][no method][no target][no option][no type]
status: valid
status modified: 2017-02-13
accepted date: 2017-02-13
in scheme: emissions_variables_MMR

1.AD Petroleum Coke [Feedstocks, reductants and other non-energy use of fuels][Petroleum Coke][Emissions][CO2][kt][no source][no method][no target][no option][no type]
type: Concept
definition: 1.AD Petroleum Coke [Feedstocks, reductants and other non-energy use of fuels][Petroleum Coke][Emissions][CO2][kt][no source][no method][no target][no option][no type]
status: valid
status modified: 2017-02-13
accepted date: 2017-02-13
in scheme: emissions_variables_MMR

1.AD Refinery Feedstocks [Feedstocks, reductants and other non-energy use of fuels][Refinery Feedstocks][Emissions][CO2][kt][no source][no method][no target][no option][no type]
type: Concept
definition: 1.AD Refinery Feedstocks [Feedstocks, reductants and other non-energy use of fuels][Refinery Feedstocks][Emissions][CO2][kt][no source][no method][no target][no option][no type]
status: valid
status modified: 2017-02-13
accepted date: 2017-02-13
in scheme: emissions_variables_MMR

1.AD Residual Fuel Oil [Feedstocks, reductants and other non-energy use of fuels][Residual Fuel Oil][Emissions][CO2][kt][no source][no method][no target][no option][no type]
type: Concept
definition: 1.AD Residual Fuel Oil [Feedstocks, reductants and other non-energy use of fuels][Residual Fuel Oil][Emissions][CO2][kt][no source][no method][no target][no option][no type]
status: valid
status modified: 2017-02-13
accepted date: 2017-02-13
in scheme: emissions_variables_MMR

1.AD Shale Oil [Feedstocks, reductants and other non-energy use of fuels][Shale Oil][Emissions][CO2][kt][no source][no method][no target][no option][no type]
type: Concept
definition: 1.AD Shale Oil [Feedstocks, reductants and other non-energy use of fuels][Shale Oil][Emissions][CO2][kt][no source][no method][no target][no option][no type]
status: valid
status modified: 2017-02-13
accepted date: 2017-02-13
in scheme: emissions_variables_MMR

1.AD Solid Fuels [Feedstocks, reductants and other non-energy use of fuels][Solid Fuels][Emissions][CO2][kt][no source][no method][no target][no option][no type]
type: Concept
definition: 1.AD Solid Fuels [Feedstocks, reductants and other non-energy use of fuels][Solid Fuels][Emissions][CO2][kt][no source][no method][no target][no option][no type]
status: valid
status modified: 2017-02-13
accepted date: 2017-02-13
in scheme: emissions_variables_MMR

1.AD Sub-bituminous Coal [Feedstocks, reductants and other non-energy use of fuels][Sub-bituminous Coal][Emissions][CO2][kt][no source][no method][no target][no option][no type]
type: Concept
definition: 1.AD Sub-bituminous Coal [Feedstocks, reductants and other non-energy use of fuels][Sub-bituminous Coal][Emissions][CO2][kt][no source][no method][no target][no option][no type]
status: valid
status modified: 2017-02-13
accepted date: 2017-02-13
in scheme: emissions_variables_MMR

1.AD Waste [Feedstocks, reductants and other non-energy use of fuels][Waste (non-biomass fraction)][Emissions][CO2][kt][no source][no method][no target][no option][no type]
type: Concept
definition: 1.AD Waste [Feedstocks, reductants and other non-energy use of fuels][Waste (non-biomass fraction)][Emissions][CO2][kt][no source][no method][no target][no option][no type]
status: valid
status modified: 2017-02-13
accepted date: 2017-02-13
in scheme: emissions_variables_MMR

1.B [Fugitive Emissions from Fuels][Classification Root][Emissions][Aggregate GHGs][kt CO2 equivalent][no source][no method][no target][no option][no type]
type: Concept
definition: 1.B [Fugitive Emissions from Fuels][Classification Root][Emissions][Aggregate GHGs][kt CO2 equivalent][no source][no method][no target][no option][no type]
status: valid
status modified: 2017-02-13
accepted date: 2017-02-13
in scheme: emissions_variables_MMR

1.B [Fugitive Emissions from Fuels][Classification Root][Emissions][CH4][kt][no source][no method][no target][no option][no type]
type: Concept
definition: 1.B [Fugitive Emissions from Fuels][Classification Root][Emissions][CH4][kt][no source][no method][no target][no option][no type]
status: valid
status modified: 2017-02-13
accepted date: 2017-02-13
in scheme: emissions_variables_MMR

1.B [Fugitive Emissions from Fuels][Classification Root][Emissions][CO][kt][no source][no method][no target][no option][no type]
type: Concept
definition: 1.B [Fugitive Emissions from Fuels][Classification Root][Emissions][CO][kt][no source][no method][no target][no option][no type]
status: valid
status modified: 2017-02-13
accepted date: 2017-02-13
in scheme: emissions_variables_MMR

1.B [Fugitive Emissions from Fuels][Classification Root][Emissions][CO2][kt][no source][no method][no target][no option][no type]
type: Concept
definition: 1.B [Fugitive Emissions from Fuels][Classification Root][Emissions][CO2][kt][no source][no method][no target][no option][no type]
status: valid
status modified: 2017-02-13
accepted date: 2017-02-13
in scheme: emissions_variables_MMR

1.B [Fugitive Emissions from Fuels][Classification Root][Emissions][N2O][kt][no source][no method][no target][no option][no type]
type: Concept
definition: 1.B [Fugitive Emissions from Fuels][Classification Root][Emissions][N2O][kt][no source][no method][no target][no option][no type]
status: valid
status modified: 2017-02-13
accepted date: 2017-02-13
in scheme: emissions_variables_MMR

1.B [Fugitive Emissions from Fuels][Classification Root][Emissions][NMVOC][kt][no source][no method][no target][no option][no type]
type: Concept
definition: 1.B [Fugitive Emissions from Fuels][Classification Root][Emissions][NMVOC][kt][no source][no method][no target][no option][no type]
status: valid
status modified: 2017-02-13
accepted date: 2017-02-13
in scheme: emissions_variables_MMR

1.B [Fugitive Emissions from Fuels][Classification Root][Emissions][NOx][kt][no source][no method][no target][no option][no type]
type: Concept
definition: 1.B [Fugitive Emissions from Fuels][Classification Root][Emissions][NOx][kt][no source][no method][no target][no option][no type]
status: valid
status modified: 2017-02-13
accepted date: 2017-02-13
in scheme: emissions_variables_MMR

1.B [Fugitive Emissions from Fuels][Classification Root][Emissions][SO2][kt][no source][no method][no target][no option][no type]
type: Concept
definition: 1.B [Fugitive Emissions from Fuels][Classification Root][Emissions][SO2][kt][no source][no method][no target][no option][no type]
status: valid
status modified: 2017-02-13
accepted date: 2017-02-13
in scheme: emissions_variables_MMR

1.B.1 [Solid Fuels][Operation][Emissions][Aggregate GHGs][kt CO2 equivalent][no source][no method][no target][no option][no type]
type: Concept
definition: 1.B.1 [Solid Fuels][Operation][Emissions][Aggregate GHGs][kt CO2 equivalent][no source][no method][no target][no option][no type]
status: valid
status modified: 2017-02-13
accepted date: 2017-02-13
in scheme: emissions_variables_MMR

1.B.1 [Solid Fuels][Operation][Emissions][CH4][kt][no source][no method][no target][no option][no type]
type: Concept
definition: 1.B.1 [Solid Fuels][Operation][Emissions][CH4][kt][no source][no method][no target][no option][no type]
status: valid
status modified: 2017-02-13
accepted date: 2017-02-13
in scheme: emissions_variables_MMR

1.B.1 [Solid Fuels][Operation][Emissions][CO][kt][no source][no method][no target][no option][no type]
type: Concept
definition: 1.B.1 [Solid Fuels][Operation][Emissions][CO][kt][no source][no method][no target][no option][no type]
status: valid
status modified: 2017-02-13
accepted date: 2017-02-13
in scheme: emissions_variables_MMR

1.B.1 [Solid Fuels][Operation][Emissions][CO2][kt][no source][no method][no target][no option][no type]
type: Concept
definition: 1.B.1 [Solid Fuels][Operation][Emissions][CO2][kt][no source][no method][no target][no option][no type]
status: valid
status modified: 2017-02-13
accepted date: 2017-02-13
in scheme: emissions_variables_MMR

1.B.1 [Solid Fuels][Operation][Emissions][N2O][kt][no source][no method][no target][no option][no type]
type: Concept
definition: 1.B.1 [Solid Fuels][Operation][Emissions][N2O][kt][no source][no method][no target][no option][no type]
status: valid
status modified: 2017-02-13
accepted date: 2017-02-13
in scheme: emissions_variables_MMR

1.B.1 [Solid Fuels][Operation][Emissions][NMVOC][kt][no source][no method][no target][no option][no type]
type: Concept
definition: 1.B.1 [Solid Fuels][Operation][Emissions][NMVOC][kt][no source][no method][no target][no option][no type]
status: valid
status modified: 2017-02-13
accepted date: 2017-02-13
in scheme: emissions_variables_MMR

1.B.1 [Solid Fuels][Operation][Emissions][NOx][kt][no source][no method][no target][no option][no type]
type: Concept
definition: 1.B.1 [Solid Fuels][Operation][Emissions][NOx][kt][no source][no method][no target][no option][no type]
status: valid
status modified: 2017-02-13
accepted date: 2017-02-13
in scheme: emissions_variables_MMR

1.B.1 [Solid Fuels][Operation][Emissions][SO2][kt][no source][no method][no target][no option][no type]
type: Concept
definition: 1.B.1 [Solid Fuels][Operation][Emissions][SO2][kt][no source][no method][no target][no option][no type]
status: valid
status modified: 2017-02-13
accepted date: 2017-02-13
in scheme: emissions_variables_MMR

1.B.1.a [Coal Mining and Handling][Operation][Emissions][CH4][kt][no source][no method][no target][no option][no type]
type: Concept
definition: 1.B.1.a [Coal Mining and Handling][Operation][Emissions][CH4][kt][no source][no method][no target][no option][no type]
status: valid
status modified: 2017-02-13
accepted date: 2017-02-13
in scheme: emissions_variables_MMR

1.B.1.a [Coal Mining and Handling][Operation][Emissions][CO][kt][no source][no method][no target][no option][no type]
type: Concept
definition: 1.B.1.a [Coal Mining and Handling][Operation][Emissions][CO][kt][no source][no method][no target][no option][no type]
status: valid
status modified: 2017-02-13
accepted date: 2017-02-13
in scheme: emissions_variables_MMR

1.B.1.a [Coal Mining and Handling][Operation][Emissions][CO2][kt][no source][no method][no target][no option][no type]
type: Concept
definition: 1.B.1.a [Coal Mining and Handling][Operation][Emissions][CO2][kt][no source][no method][no target][no option][no type]
status: valid
status modified: 2017-02-13
accepted date: 2017-02-13
in scheme: emissions_variables_MMR

1.B.1.a [Coal Mining and Handling][Operation][Emissions][N2O][kt][no source][no method][no target][no option][no type]
type: Concept
definition: 1.B.1.a [Coal Mining and Handling][Operation][Emissions][N2O][kt][no source][no method][no target][no option][no type]
status: valid
status modified: 2017-02-13
accepted date: 2017-02-13
in scheme: emissions_variables_MMR

1.B.1.a [Coal Mining and Handling][Operation][Emissions][NMVOC][kt][no source][no method][no target][no option][no type]
type: Concept
definition: 1.B.1.a [Coal Mining and Handling][Operation][Emissions][NMVOC][kt][no source][no method][no target][no option][no type]
status: valid
status modified: 2017-02-13
accepted date: 2017-02-13
in scheme: emissions_variables_MMR

1.B.1.a [Coal Mining and Handling][Operation][Emissions][NOx][kt][no source][no method][no target][no option][no type]
type: Concept
definition: 1.B.1.a [Coal Mining and Handling][Operation][Emissions][NOx][kt][no source][no method][no target][no option][no type]
status: valid
status modified: 2017-02-13
accepted date: 2017-02-13
in scheme: emissions_variables_MMR

1.B.1.a.1 [Underground Mines][Operation][Emissions][CH4][kt][no source][no method][no target][no option][no type]
type: Concept
definition: 1.B.1.a.1 [Underground Mines][Operation][Emissions][CH4][kt][no source][no method][no target][no option][no type]
status: valid
status modified: 2017-02-13
accepted date: 2017-02-13
in scheme: emissions_variables_MMR

1.B.1.a.1 [Underground Mines][Operation][Emissions][CO2][kt][no source][no method][no target][no option][no type]
type: Concept
definition: 1.B.1.a.1 [Underground Mines][Operation][Emissions][CO2][kt][no source][no method][no target][no option][no type]
status: valid
status modified: 2017-02-13
accepted date: 2017-02-13
in scheme: emissions_variables_MMR

1.B.1.a.1.i [Underground Mines][Mining Activities][Emissions][CH4][kt][no source][no method][no target][no option][no type]
type: Concept
definition: 1.B.1.a.1.i [Underground Mines][Mining Activities][Emissions][CH4][kt][no source][no method][no target][no option][no type]
status: valid
status modified: 2017-02-13
accepted date: 2017-02-13
in scheme: emissions_variables_MMR

1.B.1.a.1.i [Underground Mines][Mining Activities][Emissions][CO2][kt][no source][no method][no target][no option][no type]
type: Concept
definition: 1.B.1.a.1.i [Underground Mines][Mining Activities][Emissions][CO2][kt][no source][no method][no target][no option][no type]
status: valid
status modified: 2017-02-13
accepted date: 2017-02-13
in scheme: emissions_variables_MMR

1.B.1.a.1.ii [Underground Mines][Post-Mining Activities][Emissions][CH4][kt][no source][no method][no target][no option][no type]
type: Concept
definition: 1.B.1.a.1.ii [Underground Mines][Post-Mining Activities][Emissions][CH4][kt][no source][no method][no target][no option][no type]
status: valid
status modified: 2017-02-13
accepted date: 2017-02-13
in scheme: emissions_variables_MMR

1.B.1.a.1.ii [Underground Mines][Post-Mining Activities][Emissions][CO2][kt][no source][no method][no target][no option][no type]
type: Concept
definition: 1.B.1.a.1.ii [Underground Mines][Post-Mining Activities][Emissions][CO2][kt][no source][no method][no target][no option][no type]
status: valid
status modified: 2017-02-13
accepted date: 2017-02-13
in scheme: emissions_variables_MMR

1.B.1.a.1.iii [Underground Mines][Abandoned Underground Mines][Emissions][CH4][kt][no source][no method][no target][no option][no type]
type: Concept
definition: 1.B.1.a.1.iii [Underground Mines][Abandoned Underground Mines][Emissions][CH4][kt][no source][no method][no target][no option][no type]
status: valid
status modified: 2017-02-13
accepted date: 2017-02-13
in scheme: emissions_variables_MMR

1.B.1.a.1.iii [Underground Mines][Abandoned Underground Mines][Emissions][CO2][kt][no source][no method][no target][no option][no type]
type: Concept
definition: 1.B.1.a.1.iii [Underground Mines][Abandoned Underground Mines][Emissions][CO2][kt][no source][no method][no target][no option][no type]
status: valid
status modified: 2017-02-13
accepted date: 2017-02-13
in scheme: emissions_variables_MMR

1.B.1.a.2 [Surface Mines][Operation][Emissions][CH4][kt][no source][no method][no target][no option][no type]
type: Concept
definition: 1.B.1.a.2 [Surface Mines][Operation][Emissions][CH4][kt][no source][no method][no target][no option][no type]
status: valid
status modified: 2017-02-13
accepted date: 2017-02-13
in scheme: emissions_variables_MMR

1.B.1.a.2 [Surface Mines][Operation][Emissions][CO2][kt][no source][no method][no target][no option][no type]
type: Concept
definition: 1.B.1.a.2 [Surface Mines][Operation][Emissions][CO2][kt][no source][no method][no target][no option][no type]
status: valid
status modified: 2017-02-13
accepted date: 2017-02-13
in scheme: emissions_variables_MMR

1.B.1.a.2.i [Surface Mines][Mining Activities][Emissions][CH4][kt][no source][no method][no target][no option][no type]
type: Concept
definition: 1.B.1.a.2.i [Surface Mines][Mining Activities][Emissions][CH4][kt][no source][no method][no target][no option][no type]
status: valid
status modified: 2017-02-13
accepted date: 2017-02-13
in scheme: emissions_variables_MMR

1.B.1.a.2.i [Surface Mines][Mining Activities][Emissions][CO2][kt][no source][no method][no target][no option][no type]
type: Concept
definition: 1.B.1.a.2.i [Surface Mines][Mining Activities][Emissions][CO2][kt][no source][no method][no target][no option][no type]
status: valid
status modified: 2017-02-13
accepted date: 2017-02-13
in scheme: emissions_variables_MMR

1.B.1.a.2.ii [Surface Mines][Post-Mining Activities][Emissions][CH4][kt][no source][no method][no target][no option][no type]
type: Concept
definition: 1.B.1.a.2.ii [Surface Mines][Post-Mining Activities][Emissions][CH4][kt][no source][no method][no target][no option][no type]
status: valid
status modified: 2017-02-13
accepted date: 2017-02-13
in scheme: emissions_variables_MMR

1.B.1.a.2.ii [Surface Mines][Post-Mining Activities][Emissions][CO2][kt][no source][no method][no target][no option][no type]
type: Concept
definition: 1.B.1.a.2.ii [Surface Mines][Post-Mining Activities][Emissions][CO2][kt][no source][no method][no target][no option][no type]
status: valid
status modified: 2017-02-13
accepted date: 2017-02-13
in scheme: emissions_variables_MMR

1.B.1.b [Solid Fuel Transformation][Operation][Emissions][CH4][kt][no source][no method][no target][no option][no type]
type: Concept
definition: 1.B.1.b [Solid Fuel Transformation][Operation][Emissions][CH4][kt][no source][no method][no target][no option][no type]
status: valid
status modified: 2017-02-13
accepted date: 2017-02-13
in scheme: emissions_variables_MMR

1.B.1.b [Solid Fuel Transformation][Operation][Emissions][CO][kt][no source][no method][no target][no option][no type]
type: Concept
definition: 1.B.1.b [Solid Fuel Transformation][Operation][Emissions][CO][kt][no source][no method][no target][no option][no type]
status: valid
status modified: 2017-02-13
accepted date: 2017-02-13
in scheme: emissions_variables_MMR

1.B.1.b [Solid Fuel Transformation][Operation][Emissions][CO2][kt][no source][no method][no target][no option][no type]
type: Concept
definition: 1.B.1.b [Solid Fuel Transformation][Operation][Emissions][CO2][kt][no source][no method][no target][no option][no type]
status: valid
status modified: 2017-02-13
accepted date: 2017-02-13
in scheme: emissions_variables_MMR

1.B.1.b [Solid Fuel Transformation][Operation][Emissions][N2O][kt][no source][no method][no target][no option][no type]
type: Concept
definition: 1.B.1.b [Solid Fuel Transformation][Operation][Emissions][N2O][kt][no source][no method][no target][no option][no type]
status: valid
status modified: 2017-02-13
accepted date: 2017-02-13
in scheme: emissions_variables_MMR

1.B.1.b [Solid Fuel Transformation][Operation][Emissions][NMVOC][kt][no source][no method][no target][no option][no type]
type: Concept
definition: 1.B.1.b [Solid Fuel Transformation][Operation][Emissions][NMVOC][kt][no source][no method][no target][no option][no type]
status: valid
status modified: 2017-02-13
accepted date: 2017-02-13
in scheme: emissions_variables_MMR

1.B.1.b [Solid Fuel Transformation][Operation][Emissions][NOx][kt][no source][no method][no target][no option][no type]
type: Concept
definition: 1.B.1.b [Solid Fuel Transformation][Operation][Emissions][NOx][kt][no source][no method][no target][no option][no type]
status: valid
status modified: 2017-02-13
accepted date: 2017-02-13
in scheme: emissions_variables_MMR

1.B.1.b [Solid Fuel Transformation][Operation][Emissions][SO2][kt][no source][no method][no target][no option][no type]
type: Concept
definition: 1.B.1.b [Solid Fuel Transformation][Operation][Emissions][SO2][kt][no source][no method][no target][no option][no type]
status: valid
status modified: 2017-02-13
accepted date: 2017-02-13
in scheme: emissions_variables_MMR

1.B.1.c [Other Solid fuel operation][Operation][Emissions][CH4][kt][no source][no method][no target][no option][no type]
type: Concept
definition: 1.B.1.c [Other Solid fuel operation][Operation][Emissions][CH4][kt][no source][no method][no target][no option][no type]
status: valid
status modified: 2017-02-13
accepted date: 2017-02-13
in scheme: emissions_variables_MMR

1.B.1.c [Other Solid fuel operation][Operation][Emissions][CO][kt][no source][no method][no target][no option][no type]
type: Concept
definition: 1.B.1.c [Other Solid fuel operation][Operation][Emissions][CO][kt][no source][no method][no target][no option][no type]
status: valid
status modified: 2017-02-13
accepted date: 2017-02-13
in scheme: emissions_variables_MMR

1.B.1.c [Other Solid fuel operation][Operation][Emissions][CO2][kt][no source][no method][no target][no option][no type]
type: Concept
definition: 1.B.1.c [Other Solid fuel operation][Operation][Emissions][CO2][kt][no source][no method][no target][no option][no type]
status: valid
status modified: 2017-02-13
accepted date: 2017-02-13
in scheme: emissions_variables_MMR

1.B.1.c [Other Solid fuel operation][Operation][Emissions][N2O][kt][no source][no method][no target][no option][no type]
type: Concept
definition: 1.B.1.c [Other Solid fuel operation][Operation][Emissions][N2O][kt][no source][no method][no target][no option][no type]
status: valid
status modified: 2017-02-13
accepted date: 2017-02-13
in scheme: emissions_variables_MMR

1.B.1.c [Other Solid fuel operation][Operation][Emissions][NMVOC][kt][no source][no method][no target][no option][no type]
type: Concept
definition: 1.B.1.c [Other Solid fuel operation][Operation][Emissions][NMVOC][kt][no source][no method][no target][no option][no type]
status: valid
status modified: 2017-02-13
accepted date: 2017-02-13
in scheme: emissions_variables_MMR

1.B.1.c [Other Solid fuel operation][Operation][Emissions][NOx][kt][no source][no method][no target][no option][no type]
type: Concept
definition: 1.B.1.c [Other Solid fuel operation][Operation][Emissions][NOx][kt][no source][no method][no target][no option][no type]
status: valid
status modified: 2017-02-13
accepted date: 2017-02-13
in scheme: emissions_variables_MMR

1.B.1.c [Other Solid fuel operation][Operation][Emissions][SO2][kt][no source][no method][no target][no option][no type]
type: Concept
definition: 1.B.1.c [Other Solid fuel operation][Operation][Emissions][SO2][kt][no source][no method][no target][no option][no type]
status: valid
status modified: 2017-02-13
accepted date: 2017-02-13
in scheme: emissions_variables_MMR

1.B.2 [Oil and Natural Gas and Other Emissions from Energy Production][Operation][Emissions][Aggregate GHGs][kt CO2 equivalent][no source][no method][no target][no option][no type]
type: Concept
definition: 1.B.2 [Oil and Natural Gas and Other Emissions from Energy Production][Operation][Emissions][Aggregate GHGs][kt CO2 equivalent][no source][no method][no target][no option][no type]
status: valid
status modified: 2017-02-13
accepted date: 2017-02-13
in scheme: emissions_variables_MMR

1.B.2 [Oil and Natural Gas and Other Emissions from Energy Production][Operation][Emissions][CH4][kt][no source][no method][no target][no option][no type]
type: Concept
definition: 1.B.2 [Oil and Natural Gas and Other Emissions from Energy Production][Operation][Emissions][CH4][kt][no source][no method][no target][no option][no type]
status: valid
status modified: 2017-02-13
accepted date: 2017-02-13
in scheme: emissions_variables_MMR

1.B.2 [Oil and Natural Gas and Other Emissions from Energy Production][Operation][Emissions][CO][kt][no source][no method][no target][no option][no type]
type: Concept
definition: 1.B.2 [Oil and Natural Gas and Other Emissions from Energy Production][Operation][Emissions][CO][kt][no source][no method][no target][no option][no type]
status: valid
status modified: 2017-02-13
accepted date: 2017-02-13
in scheme: emissions_variables_MMR

1.B.2 [Oil and Natural Gas and Other Emissions from Energy Production][Operation][Emissions][CO2][kt][no source][no method][no target][no option][no type]
type: Concept
definition: 1.B.2 [Oil and Natural Gas and Other Emissions from Energy Production][Operation][Emissions][CO2][kt][no source][no method][no target][no option][no type]
status: valid
status modified: 2017-02-13
accepted date: 2017-02-13
in scheme: emissions_variables_MMR

1.B.2 [Oil and Natural Gas and Other Emissions from Energy Production][Operation][Emissions][N2O][kt][no source][no method][no target][no option][no type]
type: Concept
definition: 1.B.2 [Oil and Natural Gas and Other Emissions from Energy Production][Operation][Emissions][N2O][kt][no source][no method][no target][no option][no type]
status: valid
status modified: 2017-02-13
accepted date: 2017-02-13
in scheme: emissions_variables_MMR

1.B.2 [Oil and Natural Gas and Other Emissions from Energy Production][Operation][Emissions][NMVOC][kt][no source][no method][no target][no option][no type]
type: Concept
definition: 1.B.2 [Oil and Natural Gas and Other Emissions from Energy Production][Operation][Emissions][NMVOC][kt][no source][no method][no target][no option][no type]
status: valid
status modified: 2017-02-13
accepted date: 2017-02-13
in scheme: emissions_variables_MMR

1.B.2 [Oil and Natural Gas and Other Emissions from Energy Production][Operation][Emissions][NOx][kt][no source][no method][no target][no option][no type]
type: Concept
definition: 1.B.2 [Oil and Natural Gas and Other Emissions from Energy Production][Operation][Emissions][NOx][kt][no source][no method][no target][no option][no type]
status: valid
status modified: 2017-02-13
accepted date: 2017-02-13
in scheme: emissions_variables_MMR

1.B.2 [Oil and Natural Gas and Other Emissions from Energy Production][Operation][Emissions][SO2][kt][no source][no method][no target][no option][no type]
type: Concept
definition: 1.B.2 [Oil and Natural Gas and Other Emissions from Energy Production][Operation][Emissions][SO2][kt][no source][no method][no target][no option][no type]
status: valid
status modified: 2017-02-13
accepted date: 2017-02-13
in scheme: emissions_variables_MMR

1.B.2.a [Oil][Operation][Emissions][CH4][kt][no source][no method][no target][no option][no type]
type: Concept
definition: 1.B.2.a [Oil][Operation][Emissions][CH4][kt][no source][no method][no target][no option][no type]
status: valid
status modified: 2017-02-13
accepted date: 2017-02-13
in scheme: emissions_variables_MMR

1.B.2.a [Oil][Operation][Emissions][CO][kt][no source][no method][no target][no option][no type]
type: Concept
definition: 1.B.2.a [Oil][Operation][Emissions][CO][kt][no source][no method][no target][no option][no type]
status: valid
status modified: 2017-02-13
accepted date: 2017-02-13
in scheme: emissions_variables_MMR

1.B.2.a [Oil][Operation][Emissions][CO2][kt][no source][no method][no target][no option][no type]
type: Concept
definition: 1.B.2.a [Oil][Operation][Emissions][CO2][kt][no source][no method][no target][no option][no type]
status: valid
status modified: 2017-02-13
accepted date: 2017-02-13
in scheme: emissions_variables_MMR

1.B.2.a [Oil][Operation][Emissions][N2O][kt][no source][no method][no target][no option][no type]
type: Concept
definition: 1.B.2.a [Oil][Operation][Emissions][N2O][kt][no source][no method][no target][no option][no type]
status: valid
status modified: 2017-02-13
accepted date: 2017-02-13
in scheme: emissions_variables_MMR

1.B.2.a [Oil][Operation][Emissions][NMVOC][kt][no source][no method][no target][no option][no type]
type: Concept
definition: 1.B.2.a [Oil][Operation][Emissions][NMVOC][kt][no source][no method][no target][no option][no type]
status: valid
status modified: 2017-02-13
accepted date: 2017-02-13
in scheme: emissions_variables_MMR

1.B.2.a [Oil][Operation][Emissions][NOx][kt][no source][no method][no target][no option][no type]
type: Concept
definition: 1.B.2.a [Oil][Operation][Emissions][NOx][kt][no source][no method][no target][no option][no type]
status: valid
status modified: 2017-02-13
accepted date: 2017-02-13
in scheme: emissions_variables_MMR

1.B.2.a [Oil][Operation][Emissions][SO2][kt][no source][no method][no target][no option][no type]
type: Concept
definition: 1.B.2.a [Oil][Operation][Emissions][SO2][kt][no source][no method][no target][no option][no type]
status: valid
status modified: 2017-02-13
accepted date: 2017-02-13
in scheme: emissions_variables_MMR

1.B.2.a.1 [Oil][Exploration][Emissions][CH4][kt][no source][no method][no target][no option][no type]
type: Concept
definition: 1.B.2.a.1 [Oil][Exploration][Emissions][CH4][kt][no source][no method][no target][no option][no type]
status: valid
status modified: 2017-02-13
accepted date: 2017-02-13
in scheme: emissions_variables_MMR

1.B.2.a.1 [Oil][Exploration][Emissions][CO2][kt][no source][no method][no target][no option][no type]
type: Concept
definition: 1.B.2.a.1 [Oil][Exploration][Emissions][CO2][kt][no source][no method][no target][no option][no type]
status: valid
status modified: 2017-02-13
accepted date: 2017-02-13
in scheme: emissions_variables_MMR

1.B.2.a.1 [Oil][Exploration][Emissions][N2O][kt][no source][no method][no target][no option][no type]
type: Concept
definition: 1.B.2.a.1 [Oil][Exploration][Emissions][N2O][kt][no source][no method][no target][no option][no type]
status: valid
status modified: 2017-02-13
accepted date: 2017-02-13
in scheme: emissions_variables_MMR

1.B.2.a.2 [Oil][Production][Emissions][CH4][kt][no source][no method][no target][no option][no type]
type: Concept
definition: 1.B.2.a.2 [Oil][Production][Emissions][CH4][kt][no source][no method][no target][no option][no type]
status: valid
status modified: 2017-02-13
accepted date: 2017-02-13
in scheme: emissions_variables_MMR

1.B.2.a.2 [Oil][Production][Emissions][CO2][kt][no source][no method][no target][no option][no type]
type: Concept
definition: 1.B.2.a.2 [Oil][Production][Emissions][CO2][kt][no source][no method][no target][no option][no type]
status: valid
status modified: 2017-02-13
accepted date: 2017-02-13
in scheme: emissions_variables_MMR

1.B.2.a.3 [Oil][Transport][Emissions][CH4][kt][no source][no method][no target][no option][no type]
type: Concept
definition: 1.B.2.a.3 [Oil][Transport][Emissions][CH4][kt][no source][no method][no target][no option][no type]
status: valid
status modified: 2017-02-13
accepted date: 2017-02-13
in scheme: emissions_variables_MMR

1.B.2.a.3 [Oil][Transport][Emissions][CO2][kt][no source][no method][no target][no option][no type]
type: Concept
definition: 1.B.2.a.3 [Oil][Transport][Emissions][CO2][kt][no source][no method][no target][no option][no type]
status: valid
status modified: 2017-02-13
accepted date: 2017-02-13
in scheme: emissions_variables_MMR

1.B.2.a.4 [Oil][Refining / Storage][Emissions][CH4][kt][no source][no method][no target][no option][no type]
type: Concept
definition: 1.B.2.a.4 [Oil][Refining / Storage][Emissions][CH4][kt][no source][no method][no target][no option][no type]
status: valid
status modified: 2017-02-13
accepted date: 2017-02-13
in scheme: emissions_variables_MMR

1.B.2.a.4 [Oil][Refining / Storage][Emissions][CO2][kt][no source][no method][no target][no option][no type]
type: Concept
definition: 1.B.2.a.4 [Oil][Refining / Storage][Emissions][CO2][kt][no source][no method][no target][no option][no type]
status: valid
status modified: 2017-02-13
accepted date: 2017-02-13
in scheme: emissions_variables_MMR

1.B.2.a.4 [Oil][Refining / Storage][Emissions][N2O][kt][no source][no method][no target][no option][no type]
type: Concept
definition: 1.B.2.a.4 [Oil][Refining / Storage][Emissions][N2O][kt][no source][no method][no target][no option][no type]
status: valid
status modified: 2017-02-13
accepted date: 2017-02-13
in scheme: emissions_variables_MMR

1.B.2.a.5 [Oil][Distribution of Oil Products][Emissions][CH4][kt][no source][no method][no target][no option][no type]
type: Concept
definition: 1.B.2.a.5 [Oil][Distribution of Oil Products][Emissions][CH4][kt][no source][no method][no target][no option][no type]
status: valid
status modified: 2017-02-13
accepted date: 2017-02-13
in scheme: emissions_variables_MMR

1.B.2.a.5 [Oil][Distribution of Oil Products][Emissions][CO2][kt][no source][no method][no target][no option][no type]
type: Concept
definition: 1.B.2.a.5 [Oil][Distribution of Oil Products][Emissions][CO2][kt][no source][no method][no target][no option][no type]
status: valid
status modified: 2017-02-13
accepted date: 2017-02-13
in scheme: emissions_variables_MMR

1.B.2.a.6 [Oil][Other operation on oil][Emissions][CH4][kt][no source][no method][no target][no option][no type]
type: Concept
definition: 1.B.2.a.6 [Oil][Other operation on oil][Emissions][CH4][kt][no source][no method][no target][no option][no type]
status: valid
status modified: 2017-02-13
accepted date: 2017-02-13
in scheme: emissions_variables_MMR

1.B.2.a.6 [Oil][Other operation on oil][Emissions][CO2][kt][no source][no method][no target][no option][no type]
type: Concept
definition: 1.B.2.a.6 [Oil][Other operation on oil][Emissions][CO2][kt][no source][no method][no target][no option][no type]
status: valid
status modified: 2017-02-13
accepted date: 2017-02-13
in scheme: emissions_variables_MMR

1.B.2.b [Natural Gas][Operation][Emissions][CH4][kt][no source][no method][no target][no option][no type]
type: Concept
definition: 1.B.2.b [Natural Gas][Operation][Emissions][CH4][kt][no source][no method][no target][no option][no type]
status: valid
status modified: 2017-02-13
accepted date: 2017-02-13
in scheme: emissions_variables_MMR

1.B.2.b [Natural Gas][Operation][Emissions][CO2][kt][no source][no method][no target][no option][no type]
type: Concept
definition: 1.B.2.b [Natural Gas][Operation][Emissions][CO2][kt][no source][no method][no target][no option][no type]
status: valid
status modified: 2017-02-13
accepted date: 2017-02-13
in scheme: emissions_variables_MMR

1.B.2.b [Natural Gas][Operation][Emissions][NMVOC][kt][no source][no method][no target][no option][no type]
type: Concept
definition: 1.B.2.b [Natural Gas][Operation][Emissions][NMVOC][kt][no source][no method][no target][no option][no type]
status: valid
status modified: 2017-02-13
accepted date: 2017-02-13
in scheme: emissions_variables_MMR

1.B.2.b [Natural Gas][Operation][Emissions][SO2][kt][no source][no method][no target][no option][no type]
type: Concept
definition: 1.B.2.b [Natural Gas][Operation][Emissions][SO2][kt][no source][no method][no target][no option][no type]
status: valid
status modified: 2017-02-13
accepted date: 2017-02-13
in scheme: emissions_variables_MMR

1.B.2.b.1 [Natural Gas][Exploration][Emissions][CH4][kt][no source][no method][no target][no option][no type]
type: Concept
definition: 1.B.2.b.1 [Natural Gas][Exploration][Emissions][CH4][kt][no source][no method][no target][no option][no type]
status: valid
status modified: 2017-02-13
accepted date: 2017-02-13
in scheme: emissions_variables_MMR

1.B.2.b.1 [Natural Gas][Exploration][Emissions][CO2][kt][no source][no method][no target][no option][no type]
type: Concept
definition: 1.B.2.b.1 [Natural Gas][Exploration][Emissions][CO2][kt][no source][no method][no target][no option][no type]
status: valid
status modified: 2017-02-13
accepted date: 2017-02-13
in scheme: emissions_variables_MMR

1.B.2.b.2 [Natural Gas][Production][Emissions][CH4][kt][no source][no method][no target][no option][no type]
type: Concept
definition: 1.B.2.b.2 [Natural Gas][Production][Emissions][CH4][kt][no source][no method][no target][no option][no type]
status: valid
status modified: 2017-02-13
accepted date: 2017-02-13
in scheme: emissions_variables_MMR

1.B.2.b.2 [Natural Gas][Production][Emissions][CO2][kt][no source][no method][no target][no option][no type]
type: Concept
definition: 1.B.2.b.2 [Natural Gas][Production][Emissions][CO2][kt][no source][no method][no target][no option][no type]
status: valid
status modified: 2017-02-13
accepted date: 2017-02-13
in scheme: emissions_variables_MMR

1.B.2.b.3 [Natural Gas][Processing][Emissions][CH4][kt][no source][no method][no target][no option][no type]
type: Concept
definition: 1.B.2.b.3 [Natural Gas][Processing][Emissions][CH4][kt][no source][no method][no target][no option][no type]
status: valid
status modified: 2017-02-13
accepted date: 2017-02-13
in scheme: emissions_variables_MMR

1.B.2.b.3 [Natural Gas][Processing][Emissions][CO2][kt][no source][no method][no target][no option][no type]
type: Concept
definition: 1.B.2.b.3 [Natural Gas][Processing][Emissions][CO2][kt][no source][no method][no target][no option][no type]
status: valid
status modified: 2017-02-13
accepted date: 2017-02-13
in scheme: emissions_variables_MMR

1.B.2.b.4 [Natural Gas][Transmission and storage][Emissions][CH4][kt][no source][no method][no target][no option][no type]
type: Concept
definition: 1.B.2.b.4 [Natural Gas][Transmission and storage][Emissions][CH4][kt][no source][no method][no target][no option][no type]
status: valid
status modified: 2017-02-13
accepted date: 2017-02-13
in scheme: emissions_variables_MMR

1.B.2.b.4 [Natural Gas][Transmission and storage][Emissions][CO2][kt][no source][no method][no target][no option][no type]
type: Concept
definition: 1.B.2.b.4 [Natural Gas][Transmission and storage][Emissions][CO2][kt][no source][no method][no target][no option][no type]
status: valid
status modified: 2017-02-13
accepted date: 2017-02-13
in scheme: emissions_variables_MMR

1.B.2.b.5 [Natural Gas][Distribution][Emissions][CH4][kt][no source][no method][no target][no option][no type]
type: Concept
definition: 1.B.2.b.5 [Natural Gas][Distribution][Emissions][CH4][kt][no source][no method][no target][no option][no type]
status: valid
status modified: 2017-02-13
accepted date: 2017-02-13
in scheme: emissions_variables_MMR

1.B.2.b.5 [Natural Gas][Distribution][Emissions][CO2][kt][no source][no method][no target][no option][no type]
type: Concept
definition: 1.B.2.b.5 [Natural Gas][Distribution][Emissions][CO2][kt][no source][no method][no target][no option][no type]
status: valid
status modified: 2017-02-13
accepted date: 2017-02-13
in scheme: emissions_variables_MMR

1.B.2.b.6 [Natural Gas][Other operations on natural gas][Emissions][CH4][kt][no source][no method][no target][no option][no type]
type: Concept
definition: 1.B.2.b.6 [Natural Gas][Other operations on natural gas][Emissions][CH4][kt][no source][no method][no target][no option][no type]
status: valid
status modified: 2017-02-13
accepted date: 2017-02-13
in scheme: emissions_variables_MMR

1.B.2.b.6 [Natural Gas][Other operations on natural gas][Emissions][CO2][kt][no source][no method][no target][no option][no type]
type: Concept
definition: 1.B.2.b.6 [Natural Gas][Other operations on natural gas][Emissions][CO2][kt][no source][no method][no target][no option][no type]
status: valid
status modified: 2017-02-13
accepted date: 2017-02-13
in scheme: emissions_variables_MMR

1.B.2.c [Venting and Flaring][Operation][Emissions][CH4][kt][no source][no method][no target][no option][no type]
type: Concept
definition: 1.B.2.c [Venting and Flaring][Operation][Emissions][CH4][kt][no source][no method][no target][no option][no type]
status: valid
status modified: 2017-02-13
accepted date: 2017-02-13
in scheme: emissions_variables_MMR

1.B.2.c [Venting and Flaring][Operation][Emissions][CO][kt][no source][no method][no target][no option][no type]
type: Concept
definition: 1.B.2.c [Venting and Flaring][Operation][Emissions][CO][kt][no source][no method][no target][no option][no type]
status: valid
status modified: 2017-02-13
accepted date: 2017-02-13
in scheme: emissions_variables_MMR

1.B.2.c [Venting and Flaring][Operation][Emissions][CO2][kt][no source][no method][no target][no option][no type]
type: Concept
definition: 1.B.2.c [Venting and Flaring][Operation][Emissions][CO2][kt][no source][no method][no target][no option][no type]
status: valid
status modified: 2017-02-13
accepted date: 2017-02-13
in scheme: emissions_variables_MMR

1.B.2.c [Venting and Flaring][Operation][Emissions][N2O][kt][no source][no method][no target][no option][no type]
type: Concept
definition: 1.B.2.c [Venting and Flaring][Operation][Emissions][N2O][kt][no source][no method][no target][no option][no type]
status: valid
status modified: 2017-02-13
accepted date: 2017-02-13
in scheme: emissions_variables_MMR

1.B.2.c [Venting and Flaring][Operation][Emissions][NMVOC][kt][no source][no method][no target][no option][no type]
type: Concept
definition: 1.B.2.c [Venting and Flaring][Operation][Emissions][NMVOC][kt][no source][no method][no target][no option][no type]
status: valid
status modified: 2017-02-13
accepted date: 2017-02-13
in scheme: emissions_variables_MMR

1.B.2.c [Venting and Flaring][Operation][Emissions][NOx][kt][no source][no method][no target][no option][no type]
type: Concept
definition: 1.B.2.c [Venting and Flaring][Operation][Emissions][NOx][kt][no source][no method][no target][no option][no type]
status: valid
status modified: 2017-02-13
accepted date: 2017-02-13
in scheme: emissions_variables_MMR

1.B.2.c [Venting and Flaring][Operation][Emissions][SO2][kt][no source][no method][no target][no option][no type]
type: Concept
definition: 1.B.2.c [Venting and Flaring][Operation][Emissions][SO2][kt][no source][no method][no target][no option][no type]
status: valid
status modified: 2017-02-13
accepted date: 2017-02-13
in scheme: emissions_variables_MMR

1.B.2.c.1 [Venting][Operation][Emissions][CH4][kt][no source][no method][no target][no option][no type]
type: Concept
definition: 1.B.2.c.1 [Venting][Operation][Emissions][CH4][kt][no source][no method][no target][no option][no type]
status: valid
status modified: 2017-02-13
accepted date: 2017-02-13
in scheme: emissions_variables_MMR

1.B.2.c.1 [Venting][Operation][Emissions][CO2][kt][no source][no method][no target][no option][no type]
type: Concept
definition: 1.B.2.c.1 [Venting][Operation][Emissions][CO2][kt][no source][no method][no target][no option][no type]
status: valid
status modified: 2017-02-13
accepted date: 2017-02-13
in scheme: emissions_variables_MMR

1.B.2.c.1.i [Venting][Oil][Emissions][CH4][kt][no source][no method][no target][no option][no type]
type: Concept
definition: 1.B.2.c.1.i [Venting][Oil][Emissions][CH4][kt][no source][no method][no target][no option][no type]
status: valid
status modified: 2017-02-13
accepted date: 2017-02-13
in scheme: emissions_variables_MMR

1.B.2.c.1.i [Venting][Oil][Emissions][CO2][kt][no source][no method][no target][no option][no type]
type: Concept
definition: 1.B.2.c.1.i [Venting][Oil][Emissions][CO2][kt][no source][no method][no target][no option][no type]
status: valid
status modified: 2017-02-13
accepted date: 2017-02-13
in scheme: emissions_variables_MMR

1.B.2.c.1.ii [Venting][Gas][Emissions][CH4][kt][no source][no method][no target][no option][no type]
type: Concept
definition: 1.B.2.c.1.ii [Venting][Gas][Emissions][CH4][kt][no source][no method][no target][no option][no type]
status: valid
status modified: 2017-02-13
accepted date: 2017-02-13
in scheme: emissions_variables_MMR

1.B.2.c.1.ii [Venting][Gas][Emissions][CO2][kt][no source][no method][no target][no option][no type]
type: Concept
definition: 1.B.2.c.1.ii [Venting][Gas][Emissions][CO2][kt][no source][no method][no target][no option][no type]
status: valid
status modified: 2017-02-13
accepted date: 2017-02-13
in scheme: emissions_variables_MMR

1.B.2.c.1.iii [Venting][Combined][Emissions][CH4][kt][no source][no method][no target][no option][no type]
type: Concept
definition: 1.B.2.c.1.iii [Venting][Combined][Emissions][CH4][kt][no source][no method][no target][no option][no type]
status: valid
status modified: 2017-02-13
accepted date: 2017-02-13
in scheme: emissions_variables_MMR

1.B.2.c.1.iii [Venting][Combined][Emissions][CO2][kt][no source][no method][no target][no option][no type]
type: Concept
definition: 1.B.2.c.1.iii [Venting][Combined][Emissions][CO2][kt][no source][no method][no target][no option][no type]
status: valid
status modified: 2017-02-13
accepted date: 2017-02-13
in scheme: emissions_variables_MMR

1.B.2.c.2 [Flaring][Operation][Emissions][CH4][kt][no source][no method][no target][no option][no type]
type: Concept
definition: 1.B.2.c.2 [Flaring][Operation][Emissions][CH4][kt][no source][no method][no target][no option][no type]
status: valid
status modified: 2017-02-13
accepted date: 2017-02-13
in scheme: emissions_variables_MMR

1.B.2.c.2 [Flaring][Operation][Emissions][CO2][kt][no source][no method][no target][no option][no type]
type: Concept
definition: 1.B.2.c.2 [Flaring][Operation][Emissions][CO2][kt][no source][no method][no target][no option][no type]
status: valid
status modified: 2017-02-13
accepted date: 2017-02-13
in scheme: emissions_variables_MMR

1.B.2.c.2 [Flaring][Operation][Emissions][N2O][kt][no source][no method][no target][no option][no type]
type: Concept
definition: 1.B.2.c.2 [Flaring][Operation][Emissions][N2O][kt][no source][no method][no target][no option][no type]
status: valid
status modified: 2017-02-13
accepted date: 2017-02-13
in scheme: emissions_variables_MMR

1.B.2.c.2.i [Flaring][Oil][Emissions][CH4][kt][no source][no method][no target][no option][no type]
type: Concept
definition: 1.B.2.c.2.i [Flaring][Oil][Emissions][CH4][kt][no source][no method][no target][no option][no type]
status: valid
status modified: 2017-02-13
accepted date: 2017-02-13
in scheme: emissions_variables_MMR

1.B.2.c.2.i [Flaring][Oil][Emissions][CO2][kt][no source][no method][no target][no option][no type]
type: Concept
definition: 1.B.2.c.2.i [Flaring][Oil][Emissions][CO2][kt][no source][no method][no target][no option][no type]
status: valid
status modified: 2017-02-13
accepted date: 2017-02-13
in scheme: emissions_variables_MMR

1.B.2.c.2.i [Flaring][Oil][Emissions][N2O][kt][no source][no method][no target][no option][no type]
type: Concept
definition: 1.B.2.c.2.i [Flaring][Oil][Emissions][N2O][kt][no source][no method][no target][no option][no type]
status: valid
status modified: 2017-02-13
accepted date: 2017-02-13
in scheme: emissions_variables_MMR

1.B.2.c.2.ii [Flaring][Gas][Emissions][CH4][kt][no source][no method][no target][no option][no type]
type: Concept
definition: 1.B.2.c.2.ii [Flaring][Gas][Emissions][CH4][kt][no source][no method][no target][no option][no type]
status: valid
status modified: 2017-02-13
accepted date: 2017-02-13
in scheme: emissions_variables_MMR

1.B.2.c.2.ii [Flaring][Gas][Emissions][CO2][kt][no source][no method][no target][no option][no type]
type: Concept
definition: 1.B.2.c.2.ii [Flaring][Gas][Emissions][CO2][kt][no source][no method][no target][no option][no type]
status: valid
status modified: 2017-02-13
accepted date: 2017-02-13
in scheme: emissions_variables_MMR

1.B.2.c.2.ii [Flaring][Gas][Emissions][N2O][kt][no source][no method][no target][no option][no type]
type: Concept
definition: 1.B.2.c.2.ii [Flaring][Gas][Emissions][N2O][kt][no source][no method][no target][no option][no type]
status: valid
status modified: 2017-02-13
accepted date: 2017-02-13
in scheme: emissions_variables_MMR

1.B.2.c.2.iii [Flaring][Combined][Emissions][CH4][kt][no source][no method][no target][no option][no type]
type: Concept
definition: 1.B.2.c.2.iii [Flaring][Combined][Emissions][CH4][kt][no source][no method][no target][no option][no type]
status: valid
status modified: 2017-02-13
accepted date: 2017-02-13
in scheme: emissions_variables_MMR

1.B.2.c.2.iii [Flaring][Combined][Emissions][CO2][kt][no source][no method][no target][no option][no type]
type: Concept
definition: 1.B.2.c.2.iii [Flaring][Combined][Emissions][CO2][kt][no source][no method][no target][no option][no type]
status: valid
status modified: 2017-02-13
accepted date: 2017-02-13
in scheme: emissions_variables_MMR

1.B.2.c.2.iii [Flaring][Combined][Emissions][N2O][kt][no source][no method][no target][no option][no type]
type: Concept
definition: 1.B.2.c.2.iii [Flaring][Combined][Emissions][N2O][kt][no source][no method][no target][no option][no type]
status: valid
status modified: 2017-02-13
accepted date: 2017-02-13
in scheme: emissions_variables_MMR

1.B.2.d [Other emissions from energy production][Operation][Emissions][CH4][kt][no source][no method][no target][no option][no type]
type: Concept
definition: 1.B.2.d [Other emissions from energy production][Operation][Emissions][CH4][kt][no source][no method][no target][no option][no type]
status: valid
status modified: 2017-02-13
accepted date: 2017-02-13
in scheme: emissions_variables_MMR

1.B.2.d [Other emissions from energy production][Operation][Emissions][CO][kt][no source][no method][no target][no option][no type]
type: Concept
definition: 1.B.2.d [Other emissions from energy production][Operation][Emissions][CO][kt][no source][no method][no target][no option][no type]
status: valid
status modified: 2017-02-13
accepted date: 2017-02-13
in scheme: emissions_variables_MMR

1.B.2.d [Other emissions from energy production][Operation][Emissions][CO2][kt][no source][no method][no target][no option][no type]
type: Concept
definition: 1.B.2.d [Other emissions from energy production][Operation][Emissions][CO2][kt][no source][no method][no target][no option][no type]
status: valid
status modified: 2017-02-13
accepted date: 2017-02-13
in scheme: emissions_variables_MMR

1.B.2.d [Other emissions from energy production][Operation][Emissions][N2O][kt][no source][no method][no target][no option][no type]
type: Concept
definition: 1.B.2.d [Other emissions from energy production][Operation][Emissions][N2O][kt][no source][no method][no target][no option][no type]
status: valid
status modified: 2017-02-13
accepted date: 2017-02-13
in scheme: emissions_variables_MMR

1.B.2.d [Other emissions from energy production][Operation][Emissions][NMVOC][kt][no source][no method][no target][no option][no type]
type: Concept
definition: 1.B.2.d [Other emissions from energy production][Operation][Emissions][NMVOC][kt][no source][no method][no target][no option][no type]
status: valid
status modified: 2017-02-13
accepted date: 2017-02-13
in scheme: emissions_variables_MMR

1.B.2.d [Other emissions from energy production][Operation][Emissions][NOx][kt][no source][no method][no target][no option][no type]
type: Concept
definition: 1.B.2.d [Other emissions from energy production][Operation][Emissions][NOx][kt][no source][no method][no target][no option][no type]
status: valid
status modified: 2017-02-13
accepted date: 2017-02-13
in scheme: emissions_variables_MMR

1.B.2.d [Other emissions from energy production][Operation][Emissions][SO2][kt][no source][no method][no target][no option][no type]
type: Concept
definition: 1.B.2.d [Other emissions from energy production][Operation][Emissions][SO2][kt][no source][no method][no target][no option][no type]
status: valid
status modified: 2017-02-13
accepted date: 2017-02-13
in scheme: emissions_variables_MMR

1.C [CO2 Transport and Storage][Fuels][Emissions][CO2][kt][no source][no method][no target][no option][no type]
type: Concept
definition: 1.C [CO2 Transport and Storage][Fuels][Emissions][CO2][kt][no source][no method][no target][no option][no type]
status: valid
status modified: 2017-02-13
accepted date: 2017-02-13
in scheme: emissions_variables_MMR

1.C Information Item [Total A][Fuels][Emissions][CO2][kt][no source][no method][no target][no option][Information item]
type: Concept
definition: 1.C Information Item [Total A][Fuels][Emissions][CO2][kt][no source][no method][no target][no option][Information item]
status: valid
status modified: 2017-02-13
accepted date: 2017-02-13
in scheme: emissions_variables_MMR

1.C Information Item [Total amount captured for storage][Fuels][Emissions][CO2][kt][no source][no method][no target][no option][Information item]
type: Concept
definition: 1.C Information Item [Total amount captured for storage][Fuels][Emissions][CO2][kt][no source][no method][no target][no option][Information item]
status: valid
status modified: 2017-02-13
accepted date: 2017-02-13
in scheme: emissions_variables_MMR

1.C Information Item [Total amount of CO2 injected at storage sites][Fuels][Emissions][CO2][kt][no source][no method][no target][no option][Information item]
type: Concept
definition: 1.C Information Item [Total amount of CO2 injected at storage sites][Fuels][Emissions][CO2][kt][no source][no method][no target][no option][Information item]
status: valid
status modified: 2017-02-13
accepted date: 2017-02-13
in scheme: emissions_variables_MMR

1.C Information Item [Total amount of exports for storage][Fuels][Emissions][CO2][kt][no source][no method][no target][no option][Information item]
type: Concept
definition: 1.C Information Item [Total amount of exports for storage][Fuels][Emissions][CO2][kt][no source][no method][no target][no option][Information item]
status: valid
status modified: 2017-02-13
accepted date: 2017-02-13
in scheme: emissions_variables_MMR

1.C Information Item [Total amount of imports for storage][Fuels][Emissions][CO2][kt][no source][no method][no target][no option][Information item]
type: Concept
definition: 1.C Information Item [Total amount of imports for storage][Fuels][Emissions][CO2][kt][no source][no method][no target][no option][Information item]
status: valid
status modified: 2017-02-13
accepted date: 2017-02-13
in scheme: emissions_variables_MMR

1.C Information Item [Total B][Fuels][Emissions][CO2][kt][no source][no method][no target][no option][Information item]
type: Concept
definition: 1.C Information Item [Total B][Fuels][Emissions][CO2][kt][no source][no method][no target][no option][Information item]
status: valid
status modified: 2017-02-13
accepted date: 2017-02-13
in scheme: emissions_variables_MMR

1.C Information Item [Total leakage from transport, injection and storage][Fuels][Emissions][CO2][kt][no source][no method][no target][no option][Information item]
type: Concept
definition: 1.C Information Item [Total leakage from transport, injection and storage][Fuels][Emissions][CO2][kt][no source][no method][no target][no option][Information item]
status: valid
status modified: 2017-02-13
accepted date: 2017-02-13
in scheme: emissions_variables_MMR

1.C Injection [Injection][Fuels][Emissions][CO2][kt][no source][no method][no target][no option][no type]
type: Concept
definition: 1.C Injection [Injection][Fuels][Emissions][CO2][kt][no source][no method][no target][no option][no type]
status: valid
status modified: 2017-02-13
accepted date: 2017-02-13
in scheme: emissions_variables_MMR

1.C Injection and Storage [Injection and Storage][Fuels][Emissions][CO2][kt][no source][no method][no target][no option][no type]
type: Concept
definition: 1.C Injection and Storage [Injection and Storage][Fuels][Emissions][CO2][kt][no source][no method][no target][no option][no type]
status: valid
status modified: 2017-02-13
accepted date: 2017-02-13
in scheme: emissions_variables_MMR

1.C Other [Other CO2 transport and storage][Fuels][Emissions][CO2][kt][no source][no method][no target][no option][no type]
type: Concept
definition: 1.C Other [Other CO2 transport and storage][Fuels][Emissions][CO2][kt][no source][no method][no target][no option][no type]
status: valid
status modified: 2017-02-13
accepted date: 2017-02-13
in scheme: emissions_variables_MMR

1.C Pipelines [Pipelines][Fuels][Emissions][CO2][kt][no source][no method][no target][no option][no type]
type: Concept
definition: 1.C Pipelines [Pipelines][Fuels][Emissions][CO2][kt][no source][no method][no target][no option][no type]
status: valid
status modified: 2017-02-13
accepted date: 2017-02-13
in scheme: emissions_variables_MMR

1.C Ships [Ships][Fuels][Emissions][CO2][kt][no source][no method][no target][no option][no type]
type: Concept
definition: 1.C Ships [Ships][Fuels][Emissions][CO2][kt][no source][no method][no target][no option][no type]
status: valid
status modified: 2017-02-13
accepted date: 2017-02-13
in scheme: emissions_variables_MMR

1.C Storage [Storage][Fuels][Emissions][CO2][kt][no source][no method][no target][no option][no type]
type: Concept
definition: 1.C Storage [Storage][Fuels][Emissions][CO2][kt][no source][no method][no target][no option][no type]
status: valid
status modified: 2017-02-13
accepted date: 2017-02-13
in scheme: emissions_variables_MMR

1.C Transport of CO2 [Transport of CO2][Fuels][Emissions][CO2][kt][no source][no method][no target][no option][no type]
type: Concept
definition: 1.C Transport of CO2 [Transport of CO2][Fuels][Emissions][CO2][kt][no source][no method][no target][no option][no type]
status: valid
status modified: 2017-02-13
accepted date: 2017-02-13
in scheme: emissions_variables_MMR

1.C Transport/Other [Other transport of CO2][Fuels][Emissions][CO2][kt][no source][no method][no target][no option][no type]
type: Concept
definition: 1.C Transport/Other [Other transport of CO2][Fuels][Emissions][CO2][kt][no source][no method][no target][no option][no type]
status: valid
status modified: 2017-02-13
accepted date: 2017-02-13
in scheme: emissions_variables_MMR

1.D.1 [International Bunkers][Fuels][Emissions][Aggregate GHGs][kt CO2 equivalent][no source][no method][no target][no option][Memo Item]
type: Concept
definition: 1.D.1 [International Bunkers][Fuels][Emissions][Aggregate GHGs][kt CO2 equivalent][no source][no method][no target][no option][Memo Item]
status: valid
status modified: 2017-02-13
accepted date: 2017-02-13
in scheme: emissions_variables_MMR

1.D.1 [International Bunkers][Fuels][Emissions][CH4][kt][no source][no method][no target][no option][Memo Item]
type: Concept
definition: 1.D.1 [International Bunkers][Fuels][Emissions][CH4][kt][no source][no method][no target][no option][Memo Item]
status: valid
status modified: 2017-02-13
accepted date: 2017-02-13
in scheme: emissions_variables_MMR

1.D.1 [International Bunkers][Fuels][Emissions][CO][kt][no source][no method][no target][no option][Memo Item]
type: Concept
definition: 1.D.1 [International Bunkers][Fuels][Emissions][CO][kt][no source][no method][no target][no option][Memo Item]
status: valid
status modified: 2017-02-13
accepted date: 2017-02-13
in scheme: emissions_variables_MMR

1.D.1 [International Bunkers][Fuels][Emissions][CO2][kt][no source][no method][no target][no option][Memo Item]
type: Concept
definition: 1.D.1 [International Bunkers][Fuels][Emissions][CO2][kt][no source][no method][no target][no option][Memo Item]
status: valid
status modified: 2017-02-13
accepted date: 2017-02-13
in scheme: emissions_variables_MMR

1.D.1 [International Bunkers][Fuels][Emissions][N2O][kt][no source][no method][no target][no option][Memo Item]
type: Concept
definition: 1.D.1 [International Bunkers][Fuels][Emissions][N2O][kt][no source][no method][no target][no option][Memo Item]
status: valid
status modified: 2017-02-13
accepted date: 2017-02-13
in scheme: emissions_variables_MMR

1.D.1 [International Bunkers][Fuels][Emissions][NMVOC][kt][no source][no method][no target][no option][Memo Item]
type: Concept
definition: 1.D.1 [International Bunkers][Fuels][Emissions][NMVOC][kt][no source][no method][no target][no option][Memo Item]
status: valid
status modified: 2017-02-13
accepted date: 2017-02-13
in scheme: emissions_variables_MMR

1.D.1 [International Bunkers][Fuels][Emissions][NOx][kt][no source][no method][no target][no option][Memo Item]
type: Concept
definition: 1.D.1 [International Bunkers][Fuels][Emissions][NOx][kt][no source][no method][no target][no option][Memo Item]
status: valid
status modified: 2017-02-13
accepted date: 2017-02-13
in scheme: emissions_variables_MMR

1.D.1 [International Bunkers][Fuels][Emissions][SO2][kt][no source][no method][no target][no option][Memo Item]
type: Concept
definition: 1.D.1 [International Bunkers][Fuels][Emissions][SO2][kt][no source][no method][no target][no option][Memo Item]
status: valid
status modified: 2017-02-13
accepted date: 2017-02-13
in scheme: emissions_variables_MMR

1.D.1.a [International Aviation][Fuels][Emissions][Aggregate GHGs][kt CO2 equivalent][no source][no method][no target][no option][Memo Item]
type: Concept
definition: 1.D.1.a [International Aviation][Fuels][Emissions][Aggregate GHGs][kt CO2 equivalent][no source][no method][no target][no option][Memo Item]
status: valid
status modified: 2017-02-13
accepted date: 2017-02-13
in scheme: emissions_variables_MMR

1.D.1.a [International Aviation][Fuels][Emissions][CH4][kt][no source][no method][no target][no option][Memo Item]
type: Concept
definition: 1.D.1.a [International Aviation][Fuels][Emissions][CH4][kt][no source][no method][no target][no option][Memo Item]
status: valid
status modified: 2017-02-13
accepted date: 2017-02-13
in scheme: emissions_variables_MMR

1.D.1.a [International Aviation][Fuels][Emissions][CO][kt][no source][no method][no target][no option][Memo Item]
type: Concept
definition: 1.D.1.a [International Aviation][Fuels][Emissions][CO][kt][no source][no method][no target][no option][Memo Item]
status: valid
status modified: 2017-02-13
accepted date: 2017-02-13
in scheme: emissions_variables_MMR

1.D.1.a [International Aviation][Fuels][Emissions][CO2][kt][no source][no method][no target][no option][Memo Item]
type: Concept
definition: 1.D.1.a [International Aviation][Fuels][Emissions][CO2][kt][no source][no method][no target][no option][Memo Item]
status: valid
status modified: 2017-02-13
accepted date: 2017-02-13
in scheme: emissions_variables_MMR

1.D.1.a [International Aviation][Fuels][Emissions][N2O][kt][no source][no method][no target][no option][Memo Item]
type: Concept
definition: 1.D.1.a [International Aviation][Fuels][Emissions][N2O][kt][no source][no method][no target][no option][Memo Item]
status: valid
status modified: 2017-02-13
accepted date: 2017-02-13
in scheme: emissions_variables_MMR

1.D.1.a [International Aviation][Fuels][Emissions][NMVOC][kt][no source][no method][no target][no option][Memo Item]
type: Concept
definition: 1.D.1.a [International Aviation][Fuels][Emissions][NMVOC][kt][no source][no method][no target][no option][Memo Item]
status: valid
status modified: 2017-02-13
accepted date: 2017-02-13
in scheme: emissions_variables_MMR

1.D.1.a [International Aviation][Fuels][Emissions][NOx][kt][no source][no method][no target][no option][Memo Item]
type: Concept
definition: 1.D.1.a [International Aviation][Fuels][Emissions][NOx][kt][no source][no method][no target][no option][Memo Item]
status: valid
status modified: 2017-02-13
accepted date: 2017-02-13
in scheme: emissions_variables_MMR

1.D.1.a [International Aviation][Fuels][Emissions][SO2][kt][no source][no method][no target][no option][Memo Item]
type: Concept
definition: 1.D.1.a [International Aviation][Fuels][Emissions][SO2][kt][no source][no method][no target][no option][Memo Item]
status: valid
status modified: 2017-02-13
accepted date: 2017-02-13
in scheme: emissions_variables_MMR

1.D.1.a Aviation Gasoline [International Aviation][Aviation Gasoline][Emissions][CH4][kt][no source][no method][no target][no option][Memo Item]
type: Concept
definition: 1.D.1.a Aviation Gasoline [International Aviation][Aviation Gasoline][Emissions][CH4][kt][no source][no method][no target][no option][Memo Item]
status: valid
status modified: 2017-02-13
accepted date: 2017-02-13
in scheme: emissions_variables_MMR

1.D.1.a Aviation Gasoline [International Aviation][Aviation Gasoline][Emissions][CO2][kt][no source][no method][no target][no option][Memo Item]
type: Concept
definition: 1.D.1.a Aviation Gasoline [International Aviation][Aviation Gasoline][Emissions][CO2][kt][no source][no method][no target][no option][Memo Item]
status: valid
status modified: 2017-02-13
accepted date: 2017-02-13
in scheme: emissions_variables_MMR

1.D.1.a Aviation Gasoline [International Aviation][Aviation Gasoline][Emissions][N2O][kt][no source][no method][no target][no option][Memo Item]
type: Concept
definition: 1.D.1.a Aviation Gasoline [International Aviation][Aviation Gasoline][Emissions][N2O][kt][no source][no method][no target][no option][Memo Item]
status: valid
status modified: 2017-02-13
accepted date: 2017-02-13
in scheme: emissions_variables_MMR

1.D.1.a Biomass [International Aviation][Biomass][Emissions][CH4][kt][no source][no method][no target][no option][Memo Item]
type: Concept
definition: 1.D.1.a Biomass [International Aviation][Biomass][Emissions][CH4][kt][no source][no method][no target][no option][Memo Item]
status: valid
status modified: 2017-02-13
accepted date: 2017-02-13
in scheme: emissions_variables_MMR

1.D.1.a Biomass [International Aviation][Biomass][Emissions][CO2][kt][no source][no method][no target][no option][Memo Item]
type: Concept
definition: 1.D.1.a Biomass [International Aviation][Biomass][Emissions][CO2][kt][no source][no method][no target][no option][Memo Item]
status: valid
status modified: 2017-02-13
accepted date: 2017-02-13
in scheme: emissions_variables_MMR

1.D.1.a Biomass [International Aviation][Biomass][Emissions][N2O][kt][no source][no method][no target][no option][Memo Item]
type: Concept
definition: 1.D.1.a Biomass [International Aviation][Biomass][Emissions][N2O][kt][no source][no method][no target][no option][Memo Item]
status: valid
status modified: 2017-02-13
accepted date: 2017-02-13
in scheme: emissions_variables_MMR

1.D.1.a Jet Kerosene [International Aviation][Jet Kerosene][Emissions][CH4][kt][no source][no method][no target][no option][Memo Item]
type: Concept
definition: 1.D.1.a Jet Kerosene [International Aviation][Jet Kerosene][Emissions][CH4][kt][no source][no method][no target][no option][Memo Item]
status: valid
status modified: 2017-02-13
accepted date: 2017-02-13
in scheme: emissions_variables_MMR

1.D.1.a Jet Kerosene [International Aviation][Jet Kerosene][Emissions][CO2][kt][no source][no method][no target][no option][Memo Item]
type: Concept
definition: 1.D.1.a Jet Kerosene [International Aviation][Jet Kerosene][Emissions][CO2][kt][no source][no method][no target][no option][Memo Item]
status: valid
status modified: 2017-02-13
accepted date: 2017-02-13
in scheme: emissions_variables_MMR

1.D.1.a Jet Kerosene [International Aviation][Jet Kerosene][Emissions][N2O][kt][no source][no method][no target][no option][Memo Item]
type: Concept
definition: 1.D.1.a Jet Kerosene [International Aviation][Jet Kerosene][Emissions][N2O][kt][no source][no method][no target][no option][Memo Item]
status: valid
status modified: 2017-02-13
accepted date: 2017-02-13
in scheme: emissions_variables_MMR

1.D.1.b [International Navigation][Fuels][Emissions][Aggregate GHGs][kt CO2 equivalent][no source][no method][no target][no option][Memo Item]
type: Concept
definition: 1.D.1.b [International Navigation][Fuels][Emissions][Aggregate GHGs][kt CO2 equivalent][no source][no method][no target][no option][Memo Item]
status: valid
status modified: 2017-02-13
accepted date: 2017-02-13
in scheme: emissions_variables_MMR

1.D.1.b [International Navigation][Fuels][Emissions][CH4][kt][no source][no method][no target][no option][Memo Item]
type: Concept
definition: 1.D.1.b [International Navigation][Fuels][Emissions][CH4][kt][no source][no method][no target][no option][Memo Item]
status: valid
status modified: 2017-02-13
accepted date: 2017-02-13
in scheme: emissions_variables_MMR

1.D.1.b [International Navigation][Fuels][Emissions][CO][kt][no source][no method][no target][no option][Memo Item]
type: Concept
definition: 1.D.1.b [International Navigation][Fuels][Emissions][CO][kt][no source][no method][no target][no option][Memo Item]
status: valid
status modified: 2017-02-13
accepted date: 2017-02-13
in scheme: emissions_variables_MMR

1.D.1.b [International Navigation][Fuels][Emissions][CO2][kt][no source][no method][no target][no option][Memo Item]
type: Concept
definition: 1.D.1.b [International Navigation][Fuels][Emissions][CO2][kt][no source][no method][no target][no option][Memo Item]
status: valid
status modified: 2017-02-13
accepted date: 2017-02-13
in scheme: emissions_variables_MMR

1.D.1.b [International Navigation][Fuels][Emissions][N2O][kt][no source][no method][no target][no option][Memo Item]
type: Concept
definition: 1.D.1.b [International Navigation][Fuels][Emissions][N2O][kt][no source][no method][no target][no option][Memo Item]
status: valid
status modified: 2017-02-13
accepted date: 2017-02-13
in scheme: emissions_variables_MMR

1.D.1.b [International Navigation][Fuels][Emissions][NMVOC][kt][no source][no method][no target][no option][Memo Item]
type: Concept
definition: 1.D.1.b [International Navigation][Fuels][Emissions][NMVOC][kt][no source][no method][no target][no option][Memo Item]
status: valid
status modified: 2017-02-13
accepted date: 2017-02-13
in scheme: emissions_variables_MMR

1.D.1.b [International Navigation][Fuels][Emissions][NOx][kt][no source][no method][no target][no option][Memo Item]
type: Concept
definition: 1.D.1.b [International Navigation][Fuels][Emissions][NOx][kt][no source][no method][no target][no option][Memo Item]
status: valid
status modified: 2017-02-13
accepted date: 2017-02-13
in scheme: emissions_variables_MMR

1.D.1.b [International Navigation][Fuels][Emissions][SO2][kt][no source][no method][no target][no option][Memo Item]
type: Concept
definition: 1.D.1.b [International Navigation][Fuels][Emissions][SO2][kt][no source][no method][no target][no option][Memo Item]
status: valid
status modified: 2017-02-13
accepted date: 2017-02-13
in scheme: emissions_variables_MMR

1.D.1.b Biomass [International Navigation][Biomass][Emissions][CH4][kt][no source][no method][no target][no option][Memo Item]
type: Concept
definition: 1.D.1.b Biomass [International Navigation][Biomass][Emissions][CH4][kt][no source][no method][no target][no option][Memo Item]
status: valid
status modified: 2017-02-13
accepted date: 2017-02-13
in scheme: emissions_variables_MMR

1.D.1.b Biomass [International Navigation][Biomass][Emissions][CO2][kt][no source][no method][no target][no option][Memo Item]
type: Concept
definition: 1.D.1.b Biomass [International Navigation][Biomass][Emissions][CO2][kt][no source][no method][no target][no option][Memo Item]
status: valid
status modified: 2017-02-13
accepted date: 2017-02-13
in scheme: emissions_variables_MMR

1.D.1.b Biomass [International Navigation][Biomass][Emissions][N2O][kt][no source][no method][no target][no option][Memo Item]
type: Concept
definition: 1.D.1.b Biomass [International Navigation][Biomass][Emissions][N2O][kt][no source][no method][no target][no option][Memo Item]
status: valid
status modified: 2017-02-13
accepted date: 2017-02-13
in scheme: emissions_variables_MMR

1.D.1.b Gas/Diesel Oil [International Navigation][Gas/Diesel Oil][Emissions][CH4][kt][no source][no method][no target][no option][Memo Item]
type: Concept
definition: 1.D.1.b Gas/Diesel Oil [International Navigation][Gas/Diesel Oil][Emissions][CH4][kt][no source][no method][no target][no option][Memo Item]
status: valid
status modified: 2017-02-13
accepted date: 2017-02-13
in scheme: emissions_variables_MMR

1.D.1.b Gas/Diesel Oil [International Navigation][Gas/Diesel Oil][Emissions][CO2][kt][no source][no method][no target][no option][Memo Item]
type: Concept
definition: 1.D.1.b Gas/Diesel Oil [International Navigation][Gas/Diesel Oil][Emissions][CO2][kt][no source][no method][no target][no option][Memo Item]
status: valid
status modified: 2017-02-13
accepted date: 2017-02-13
in scheme: emissions_variables_MMR

1.D.1.b Gas/Diesel Oil [International Navigation][Gas/Diesel Oil][Emissions][N2O][kt][no source][no method][no target][no option][Memo Item]
type: Concept
definition: 1.D.1.b Gas/Diesel Oil [International Navigation][Gas/Diesel Oil][Emissions][N2O][kt][no source][no method][no target][no option][Memo Item]
status: valid
status modified: 2017-02-13
accepted date: 2017-02-13
in scheme: emissions_variables_MMR

1.D.1.b Gaseous Fuels [International Navigation][Gaseous Fuels][Emissions][CH4][kt][no source][no method][no target][no option][Memo Item]
type: Concept
definition: 1.D.1.b Gaseous Fuels [International Navigation][Gaseous Fuels][Emissions][CH4][kt][no source][no method][no target][no option][Memo Item]
status: valid
status modified: 2017-02-13
accepted date: 2017-02-13
in scheme: emissions_variables_MMR

1.D.1.b Gaseous Fuels [International Navigation][Gaseous Fuels][Emissions][CO2][kt][no source][no method][no target][no option][Memo Item]
type: Concept
definition: 1.D.1.b Gaseous Fuels [International Navigation][Gaseous Fuels][Emissions][CO2][kt][no source][no method][no target][no option][Memo Item]
status: valid
status modified: 2017-02-13
accepted date: 2017-02-13
in scheme: emissions_variables_MMR

1.D.1.b Gaseous Fuels [International Navigation][Gaseous Fuels][Emissions][N2O][kt][no source][no method][no target][no option][Memo Item]
type: Concept
definition: 1.D.1.b Gaseous Fuels [International Navigation][Gaseous Fuels][Emissions][N2O][kt][no source][no method][no target][no option][Memo Item]
status: valid
status modified: 2017-02-13
accepted date: 2017-02-13
in scheme: emissions_variables_MMR

1.D.1.b Gasoline [International Navigation][Gasoline][Emissions][CH4][kt][no source][no method][no target][no option][Memo Item]
type: Concept
definition: 1.D.1.b Gasoline [International Navigation][Gasoline][Emissions][CH4][kt][no source][no method][no target][no option][Memo Item]
status: valid
status modified: 2017-02-13
accepted date: 2017-02-13
in scheme: emissions_variables_MMR

1.D.1.b Gasoline [International Navigation][Gasoline][Emissions][CO2][kt][no source][no method][no target][no option][Memo Item]
type: Concept
definition: 1.D.1.b Gasoline [International Navigation][Gasoline][Emissions][CO2][kt][no source][no method][no target][no option][Memo Item]
status: valid
status modified: 2017-02-13
accepted date: 2017-02-13
in scheme: emissions_variables_MMR

1.D.1.b Gasoline [International Navigation][Gasoline][Emissions][N2O][kt][no source][no method][no target][no option][Memo Item]
type: Concept
definition: 1.D.1.b Gasoline [International Navigation][Gasoline][Emissions][N2O][kt][no source][no method][no target][no option][Memo Item]
status: valid
status modified: 2017-02-13
accepted date: 2017-02-13
in scheme: emissions_variables_MMR

1.D.1.b Other Fossil Fuels [International Navigation][Other Fossil Fuels][Emissions][CH4][kt][no source][no method][no target][no option][Memo Item]
type: Concept
definition: 1.D.1.b Other Fossil Fuels [International Navigation][Other Fossil Fuels][Emissions][CH4][kt][no source][no method][no target][no option][Memo Item]
status: valid
status modified: 2017-02-13
accepted date: 2017-02-13
in scheme: emissions_variables_MMR

1.D.1.b Other Fossil Fuels [International Navigation][Other Fossil Fuels][Emissions][CO2][kt][no source][no method][no target][no option][Memo Item]
type: Concept
definition: 1.D.1.b Other Fossil Fuels [International Navigation][Other Fossil Fuels][Emissions][CO2][kt][no source][no method][no target][no option][Memo Item]
status: valid
status modified: 2017-02-13
accepted date: 2017-02-13
in scheme: emissions_variables_MMR

1.D.1.b Other Fossil Fuels [International Navigation][Other Fossil Fuels][Emissions][N2O][kt][no source][no method][no target][no option][Memo Item]
type: Concept
definition: 1.D.1.b Other Fossil Fuels [International Navigation][Other Fossil Fuels][Emissions][N2O][kt][no source][no method][no target][no option][Memo Item]
status: valid
status modified: 2017-02-13
accepted date: 2017-02-13
in scheme: emissions_variables_MMR

1.D.1.b Other Liquid Fuels [International Navigation][Other Liquid Fuels][Emissions][CH4][kt][no source][no method][no target][no option][Memo Item]
type: Concept
definition: 1.D.1.b Other Liquid Fuels [International Navigation][Other Liquid Fuels][Emissions][CH4][kt][no source][no method][no target][no option][Memo Item]
status: valid
status modified: 2017-02-13
accepted date: 2017-02-13
in scheme: emissions_variables_MMR

1.D.1.b Other Liquid Fuels [International Navigation][Other Liquid Fuels][Emissions][CO2][kt][no source][no method][no target][no option][Memo Item]
type: Concept
definition: 1.D.1.b Other Liquid Fuels [International Navigation][Other Liquid Fuels][Emissions][CO2][kt][no source][no method][no target][no option][Memo Item]
status: valid
status modified: 2017-02-13
accepted date: 2017-02-13
in scheme: emissions_variables_MMR

1.D.1.b Other Liquid Fuels [International Navigation][Other Liquid Fuels][Emissions][N2O][kt][no source][no method][no target][no option][Memo Item]
type: Concept
definition: 1.D.1.b Other Liquid Fuels [International Navigation][Other Liquid Fuels][Emissions][N2O][kt][no source][no method][no target][no option][Memo Item]
status: valid
status modified: 2017-02-13
accepted date: 2017-02-13
in scheme: emissions_variables_MMR

1.D.1.b Residual Fuel Oil [International Navigation][Residual Fuel Oil][Emissions][CH4][kt][no source][no method][no target][no option][Memo Item]
type: Concept
definition: 1.D.1.b Residual Fuel Oil [International Navigation][Residual Fuel Oil][Emissions][CH4][kt][no source][no method][no target][no option][Memo Item]
status: valid
status modified: 2017-02-13
accepted date: 2017-02-13
in scheme: emissions_variables_MMR

1.D.1.b Residual Fuel Oil [International Navigation][Residual Fuel Oil][Emissions][CO2][kt][no source][no method][no target][no option][Memo Item]
type: Concept
definition: 1.D.1.b Residual Fuel Oil [International Navigation][Residual Fuel Oil][Emissions][CO2][kt][no source][no method][no target][no option][Memo Item]
status: valid
status modified: 2017-02-13
accepted date: 2017-02-13
in scheme: emissions_variables_MMR

1.D.1.b Residual Fuel Oil [International Navigation][Residual Fuel Oil][Emissions][N2O][kt][no source][no method][no target][no option][Memo Item]
type: Concept
definition: 1.D.1.b Residual Fuel Oil [International Navigation][Residual Fuel Oil][Emissions][N2O][kt][no source][no method][no target][no option][Memo Item]
status: valid
status modified: 2017-02-13
accepted date: 2017-02-13
in scheme: emissions_variables_MMR

1.D.2 [Multilateral Operations][Fuels][Emissions][Aggregate GHGs][kt CO2 equivalent][no source][no method][no target][no option][Memo Item]
type: Concept
definition: 1.D.2 [Multilateral Operations][Fuels][Emissions][Aggregate GHGs][kt CO2 equivalent][no source][no method][no target][no option][Memo Item]
status: valid
status modified: 2017-02-13
accepted date: 2017-02-13
in scheme: emissions_variables_MMR

1.D.2 [Multilateral Operations][Fuels][Emissions][CH4][kt][no source][no method][no target][no option][Memo Item]
type: Concept
definition: 1.D.2 [Multilateral Operations][Fuels][Emissions][CH4][kt][no source][no method][no target][no option][Memo Item]
status: valid
status modified: 2017-02-13
accepted date: 2017-02-13
in scheme: emissions_variables_MMR

1.D.2 [Multilateral Operations][Fuels][Emissions][CO][kt][no source][no method][no target][no option][Memo Item]
type: Concept
definition: 1.D.2 [Multilateral Operations][Fuels][Emissions][CO][kt][no source][no method][no target][no option][Memo Item]
status: valid
status modified: 2017-02-13
accepted date: 2017-02-13
in scheme: emissions_variables_MMR

1.D.2 [Multilateral Operations][Fuels][Emissions][CO2][kt][no source][no method][no target][no option][Memo Item]
type: Concept
definition: 1.D.2 [Multilateral Operations][Fuels][Emissions][CO2][kt][no source][no method][no target][no option][Memo Item]
status: valid
status modified: 2017-02-13
accepted date: 2017-02-13
in scheme: emissions_variables_MMR

1.D.2 [Multilateral Operations][Fuels][Emissions][N2O][kt][no source][no method][no target][no option][Memo Item]
type: Concept
definition: 1.D.2 [Multilateral Operations][Fuels][Emissions][N2O][kt][no source][no method][no target][no option][Memo Item]
status: valid
status modified: 2017-02-13
accepted date: 2017-02-13
in scheme: emissions_variables_MMR

1.D.2 [Multilateral Operations][Fuels][Emissions][NMVOC][kt][no source][no method][no target][no option][Memo Item]
type: Concept
definition: 1.D.2 [Multilateral Operations][Fuels][Emissions][NMVOC][kt][no source][no method][no target][no option][Memo Item]
status: valid
status modified: 2017-02-13
accepted date: 2017-02-13
in scheme: emissions_variables_MMR

1.D.2 [Multilateral Operations][Fuels][Emissions][NOx][kt][no source][no method][no target][no option][Memo Item]
type: Concept
definition: 1.D.2 [Multilateral Operations][Fuels][Emissions][NOx][kt][no source][no method][no target][no option][Memo Item]
status: valid
status modified: 2017-02-13
accepted date: 2017-02-13
in scheme: emissions_variables_MMR

1.D.2 [Multilateral Operations][Fuels][Emissions][SO2][kt][no source][no method][no target][no option][Memo Item]
type: Concept
definition: 1.D.2 [Multilateral Operations][Fuels][Emissions][SO2][kt][no source][no method][no target][no option][Memo Item]
status: valid
status modified: 2017-02-13
accepted date: 2017-02-13
in scheme: emissions_variables_MMR

2 [Industrial Processes and Product Use][no classification][Emissions][Aggregate F-gases][t CO2 equivalent][no source][no method][no target][no option][no type]
type: Concept
definition: 2 [Industrial Processes and Product Use][no classification][Emissions][Aggregate F-gases][t CO2 equivalent][no source][no method][no target][no option][no type]
status: valid
status modified: 2017-02-13
accepted date: 2017-02-13
in scheme: emissions_variables_MMR

2 [Industrial Processes and Product Use][no classification][Emissions][Aggregate GHGs][kt CO2 equivalent][no source][no method][no target][no option][no type]
type: Concept
definition: 2 [Industrial Processes and Product Use][no classification][Emissions][Aggregate GHGs][kt CO2 equivalent][no source][no method][no target][no option][no type]
status: valid
status modified: 2017-02-13
accepted date: 2017-02-13
in scheme: emissions_variables_MMR

2 [Industrial Processes and Product Use][no classification][Emissions][C10F18][t][no source][no method][no target][no option][no type]
type: Concept
definition: 2 [Industrial Processes and Product Use][no classification][Emissions][C10F18][t][no source][no method][no target][no option][no type]
status: valid
status modified: 2017-02-13
accepted date: 2017-02-13
in scheme: emissions_variables_MMR

2 [Industrial Processes and Product Use][no classification][Emissions][C2F6][t][no source][no method][no target][no option][no type]
type: Concept
definition: 2 [Industrial Processes and Product Use][no classification][Emissions][C2F6][t][no source][no method][no target][no option][no type]
status: valid
status modified: 2017-02-13
accepted date: 2017-02-13
in scheme: emissions_variables_MMR

2 [Industrial Processes and Product Use][no classification][Emissions][C3F8][t][no source][no method][no target][no option][no type]
type: Concept
definition: 2 [Industrial Processes and Product Use][no classification][Emissions][C3F8][t][no source][no method][no target][no option][no type]
status: valid
status modified: 2017-02-13
accepted date: 2017-02-13
in scheme: emissions_variables_MMR

2 [Industrial Processes and Product Use][no classification][Emissions][C4F10][t][no source][no method][no target][no option][no type]
type: Concept
definition: 2 [Industrial Processes and Product Use][no classification][Emissions][C4F10][t][no source][no method][no target][no option][no type]
status: valid
status modified: 2017-02-13
accepted date: 2017-02-13
in scheme: emissions_variables_MMR

2 [Industrial Processes and Product Use][no classification][Emissions][C5F12][t][no source][no method][no target][no option][no type]
type: Concept
definition: 2 [Industrial Processes and Product Use][no classification][Emissions][C5F12][t][no source][no method][no target][no option][no type]
status: valid
status modified: 2017-02-13
accepted date: 2017-02-13
in scheme: emissions_variables_MMR

2 [Industrial Processes and Product Use][no classification][Emissions][C6F14][t][no source][no method][no target][no option][no type]
type: Concept
definition: 2 [Industrial Processes and Product Use][no classification][Emissions][C6F14][t][no source][no method][no target][no option][no type]
status: valid
status modified: 2017-02-13
accepted date: 2017-02-13
in scheme: emissions_variables_MMR

2 [Industrial Processes and Product Use][no classification][Emissions][c-C3F6][t][no source][no method][no target][no option][no type]
type: Concept
definition: 2 [Industrial Processes and Product Use][no classification][Emissions][c-C3F6][t][no source][no method][no target][no option][no type]
status: valid
status modified: 2017-02-13
accepted date: 2017-02-13
in scheme: emissions_variables_MMR

2 [Industrial Processes and Product Use][no classification][Emissions][c-C4F8][t][no source][no method][no target][no option][no type]
type: Concept
definition: 2 [Industrial Processes and Product Use][no classification][Emissions][c-C4F8][t][no source][no method][no target][no option][no type]
status: valid
status modified: 2017-02-13
accepted date: 2017-02-13
in scheme: emissions_variables_MMR

2 [Industrial Processes and Product Use][no classification][Emissions][CF4][t][no source][no method][no target][no option][no type]
type: Concept
definition: 2 [Industrial Processes and Product Use][no classification][Emissions][CF4][t][no source][no method][no target][no option][no type]
status: valid
status modified: 2017-02-13
accepted date: 2017-02-13
in scheme: emissions_variables_MMR

2 [Industrial Processes and Product Use][no classification][Emissions][CH4][kt][no source][no method][no target][no option][no type]
type: Concept
definition: 2 [Industrial Processes and Product Use][no classification][Emissions][CH4][kt][no source][no method][no target][no option][no type]
status: valid
status modified: 2017-02-13
accepted date: 2017-02-13
in scheme: emissions_variables_MMR

2 [Industrial Processes and Product Use][no classification][Emissions][CO][kt][no source][no method][no target][no option][no type]
type: Concept
definition: 2 [Industrial Processes and Product Use][no classification][Emissions][CO][kt][no source][no method][no target][no option][no type]
status: valid
status modified: 2017-02-13
accepted date: 2017-02-13
in scheme: emissions_variables_MMR

2 [Industrial Processes and Product Use][no classification][Emissions][CO2][kt][no source][no method][no target][no option][no type]
type: Concept
definition: 2 [Industrial Processes and Product Use][no classification][Emissions][CO2][kt][no source][no method][no target][no option][no type]
status: valid
status modified: 2017-02-13
accepted date: 2017-02-13
in scheme: emissions_variables_MMR

2 [Industrial Processes and Product Use][no classification][Emissions][HFC-125][t][no source][no method][no target][no option][no type]
type: Concept
definition: 2 [Industrial Processes and Product Use][no classification][Emissions][HFC-125][t][no source][no method][no target][no option][no type]
status: valid
status modified: 2017-02-13
accepted date: 2017-02-13
in scheme: emissions_variables_MMR

2 [Industrial Processes and Product Use][no classification][Emissions][HFC-134][t][no source][no method][no target][no option][no type]
type: Concept
definition: 2 [Industrial Processes and Product Use][no classification][Emissions][HFC-134][t][no source][no method][no target][no option][no type]
status: valid
status modified: 2017-02-13
accepted date: 2017-02-13
in scheme: emissions_variables_MMR

2 [Industrial Processes and Product Use][no classification][Emissions][HFC-134a][t][no source][no method][no target][no option][no type]
type: Concept
definition: 2 [Industrial Processes and Product Use][no classification][Emissions][HFC-134a][t][no source][no method][no target][no option][no type]
status: valid
status modified: 2017-02-13
accepted date: 2017-02-13
in scheme: emissions_variables_MMR

2 [Industrial Processes and Product Use][no classification][Emissions][HFC-143][t][no source][no method][no target][no option][no type]
type: Concept
definition: 2 [Industrial Processes and Product Use][no classification][Emissions][HFC-143][t][no source][no method][no target][no option][no type]
status: valid
status modified: 2017-02-13
accepted date: 2017-02-13
in scheme: emissions_variables_MMR

2 [Industrial Processes and Product Use][no classification][Emissions][HFC-143a][t][no source][no method][no target][no option][no type]
type: Concept
definition: 2 [Industrial Processes and Product Use][no classification][Emissions][HFC-143a][t][no source][no method][no target][no option][no type]
status: valid
status modified: 2017-02-13
accepted date: 2017-02-13
in scheme: emissions_variables_MMR

2 [Industrial Processes and Product Use][no classification][Emissions][HFC-152][t][no source][no method][no target][no option][no type]
type: Concept
definition: 2 [Industrial Processes and Product Use][no classification][Emissions][HFC-152][t][no source][no method][no target][no option][no type]
status: valid
status modified: 2017-02-13
accepted date: 2017-02-13
in scheme: emissions_variables_MMR

2 [Industrial Processes and Product Use][no classification][Emissions][HFC-152a][t][no source][no method][no target][no option][no type]
type: Concept
definition: 2 [Industrial Processes and Product Use][no classification][Emissions][HFC-152a][t][no source][no method][no target][no option][no type]
status: valid
status modified: 2017-02-13
accepted date: 2017-02-13
in scheme: emissions_variables_MMR

2 [Industrial Processes and Product Use][no classification][Emissions][HFC-161][t][no source][no method][no target][no option][no type]
type: Concept
definition: 2 [Industrial Processes and Product Use][no classification][Emissions][HFC-161][t][no source][no method][no target][no option][no type]
status: valid
status modified: 2017-02-13
accepted date: 2017-02-13
in scheme: emissions_variables_MMR

2 [Industrial Processes and Product Use][no classification][Emissions][HFC-227ea][t][no source][no method][no target][no option][no type]
type: Concept
definition: 2 [Industrial Processes and Product Use][no classification][Emissions][HFC-227ea][t][no source][no method][no target][no option][no type]
status: valid
status modified: 2017-02-13
accepted date: 2017-02-13
in scheme: emissions_variables_MMR

2 [Industrial Processes and Product Use][no classification][Emissions][HFC-23][t][no source][no method][no target][no option][no type]
type: Concept
definition: 2 [Industrial Processes and Product Use][no classification][Emissions][HFC-23][t][no source][no method][no target][no option][no type]
status: valid
status modified: 2017-02-13
accepted date: 2017-02-13
in scheme: emissions_variables_MMR

2 [Industrial Processes and Product Use][no classification][Emissions][HFC-236cb][t][no source][no method][no target][no option][no type]
type: Concept
definition: 2 [Industrial Processes and Product Use][no classification][Emissions][HFC-236cb][t][no source][no method][no target][no option][no type]
status: valid
status modified: 2017-02-13
accepted date: 2017-02-13
in scheme: emissions_variables_MMR

2 [Industrial Processes and Product Use][no classification][Emissions][HFC-236ea][t][no source][no method][no target][no option][no type]
type: Concept
definition: 2 [Industrial Processes and Product Use][no classification][Emissions][HFC-236ea][t][no source][no method][no target][no option][no type]
status: valid
status modified: 2017-02-13
accepted date: 2017-02-13
in scheme: emissions_variables_MMR

2 [Industrial Processes and Product Use][no classification][Emissions][HFC-236fa][t][no source][no method][no target][no option][no type]
type: Concept
definition: 2 [Industrial Processes and Product Use][no classification][Emissions][HFC-236fa][t][no source][no method][no target][no option][no type]
status: valid
status modified: 2017-02-13
accepted date: 2017-02-13
in scheme: emissions_variables_MMR

2 [Industrial Processes and Product Use][no classification][Emissions][HFC-245ca][t][no source][no method][no target][no option][no type]
type: Concept
definition: 2 [Industrial Processes and Product Use][no classification][Emissions][HFC-245ca][t][no source][no method][no target][no option][no type]
status: valid
status modified: 2017-02-13
accepted date: 2017-02-13
in scheme: emissions_variables_MMR

2 [Industrial Processes and Product Use][no classification][Emissions][HFC-245fa][t][no source][no method][no target][no option][no type]
type: Concept
definition: 2 [Industrial Processes and Product Use][no classification][Emissions][HFC-245fa][t][no source][no method][no target][no option][no type]
status: valid
status modified: 2017-02-13
accepted date: 2017-02-13
in scheme: emissions_variables_MMR

2 [Industrial Processes and Product Use][no classification][Emissions][HFC-32][t][no source][no method][no target][no option][no type]
type: Concept
definition: 2 [Industrial Processes and Product Use][no classification][Emissions][HFC-32][t][no source][no method][no target][no option][no type]
status: valid
status modified: 2017-02-13
accepted date: 2017-02-13
in scheme: emissions_variables_MMR

2 [Industrial Processes and Product Use][no classification][Emissions][HFC-365mfc][t][no source][no method][no target][no option][no type]
type: Concept
definition: 2 [Industrial Processes and Product Use][no classification][Emissions][HFC-365mfc][t][no source][no method][no target][no option][no type]
status: valid
status modified: 2017-02-13
accepted date: 2017-02-13
in scheme: emissions_variables_MMR

2 [Industrial Processes and Product Use][no classification][Emissions][HFC-41][t][no source][no method][no target][no option][no type]
type: Concept
definition: 2 [Industrial Processes and Product Use][no classification][Emissions][HFC-41][t][no source][no method][no target][no option][no type]
status: valid
status modified: 2017-02-13
accepted date: 2017-02-13
in scheme: emissions_variables_MMR

2 [Industrial Processes and Product Use][no classification][Emissions][HFC-43-10mee][t][no source][no method][no target][no option][no type]
type: Concept
definition: 2 [Industrial Processes and Product Use][no classification][Emissions][HFC-43-10mee][t][no source][no method][no target][no option][no type]
status: valid
status modified: 2017-02-13
accepted date: 2017-02-13
in scheme: emissions_variables_MMR

2 [Industrial Processes and Product Use][no classification][Emissions][HFCs and PFCs][kt CO2 equivalent][no source][no method][no target][no option][no type]
type: Concept
definition: 2 [Industrial Processes and Product Use][no classification][Emissions][HFCs and PFCs][kt CO2 equivalent][no source][no method][no target][no option][no type]
status: valid
status modified: 2017-02-13
accepted date: 2017-02-13
in scheme: emissions_variables_MMR

2 [Industrial Processes and Product Use][no classification][Emissions][HFCs][t CO2 equivalent][no source][no method][no target][no option][no type]
type: Concept
definition: 2 [Industrial Processes and Product Use][no classification][Emissions][HFCs][t CO2 equivalent][no source][no method][no target][no option][no type]
status: valid
status modified: 2017-02-13
accepted date: 2017-02-13
in scheme: emissions_variables_MMR

2 [Industrial Processes and Product Use][no classification][Emissions][N2O][kt][no source][no method][no target][no option][no type]
type: Concept
definition: 2 [Industrial Processes and Product Use][no classification][Emissions][N2O][kt][no source][no method][no target][no option][no type]
status: valid
status modified: 2017-02-13
accepted date: 2017-02-13
in scheme: emissions_variables_MMR

2 [Industrial Processes and Product Use][no classification][Emissions][NF3][kt][no source][no method][no target][no option][no type]
type: Concept
definition: 2 [Industrial Processes and Product Use][no classification][Emissions][NF3][kt][no source][no method][no target][no option][no type]
status: valid
status modified: 2017-02-13
accepted date: 2017-02-13
in scheme: emissions_variables_MMR

2 [Industrial Processes and Product Use][no classification][Emissions][NH3][kt][no source][no method][no target][no option][no type]
type: Concept
definition: 2 [Industrial Processes and Product Use][no classification][Emissions][NH3][kt][no source][no method][no target][no option][no type]
status: valid
status modified: 2017-02-13
accepted date: 2017-02-13
in scheme: emissions_variables_MMR

2 [Industrial Processes and Product Use][no classification][Emissions][NMVOC][kt][no source][no method][no target][no option][no type]
type: Concept
definition: 2 [Industrial Processes and Product Use][no classification][Emissions][NMVOC][kt][no source][no method][no target][no option][no type]
status: valid
status modified: 2017-02-13
accepted date: 2017-02-13
in scheme: emissions_variables_MMR

2 [Industrial Processes and Product Use][no classification][Emissions][NOx][kt][no source][no method][no target][no option][no type]
type: Concept
definition: 2 [Industrial Processes and Product Use][no classification][Emissions][NOx][kt][no source][no method][no target][no option][no type]
status: valid
status modified: 2017-02-13
accepted date: 2017-02-13
in scheme: emissions_variables_MMR

2 [Industrial Processes and Product Use][no classification][Emissions][PFCs][t CO2 equivalent][no source][no method][no target][no option][no type]
type: Concept
definition: 2 [Industrial Processes and Product Use][no classification][Emissions][PFCs][t CO2 equivalent][no source][no method][no target][no option][no type]
status: valid
status modified: 2017-02-13
accepted date: 2017-02-13
in scheme: emissions_variables_MMR

2 [Industrial Processes and Product Use][no classification][Emissions][SF6][kt][no source][no method][no target][no option][no type]
type: Concept
definition: 2 [Industrial Processes and Product Use][no classification][Emissions][SF6][kt][no source][no method][no target][no option][no type]
status: valid
status modified: 2017-02-13
accepted date: 2017-02-13
in scheme: emissions_variables_MMR

2 [Industrial Processes and Product Use][no classification][Emissions][SO2][kt][no source][no method][no target][no option][no type]
type: Concept
definition: 2 [Industrial Processes and Product Use][no classification][Emissions][SO2][kt][no source][no method][no target][no option][no type]
status: valid
status modified: 2017-02-13
accepted date: 2017-02-13
in scheme: emissions_variables_MMR

2 [Industrial Processes and Product Use][no classification][Emissions][Unspecified mix of HFCs and PFCs][t CO2 equivalent][no source][no method][no target][no option][no type]
type: Concept
definition: 2 [Industrial Processes and Product Use][no classification][Emissions][Unspecified mix of HFCs and PFCs][t CO2 equivalent][no source][no method][no target][no option][no type]
status: valid
status modified: 2017-02-13
accepted date: 2017-02-13
in scheme: emissions_variables_MMR

2 [Industrial Processes and Product Use][no classification][Emissions][Unspecified mix of HFCs][t CO2 equivalent][no source][no method][no target][no option][no type]
type: Concept
definition: 2 [Industrial Processes and Product Use][no classification][Emissions][Unspecified mix of HFCs][t CO2 equivalent][no source][no method][no target][no option][no type]
status: valid
status modified: 2017-02-13
accepted date: 2017-02-13
in scheme: emissions_variables_MMR

2 [Industrial Processes and Product Use][no classification][Emissions][Unspecified mix of PFCs][t CO2 equivalent][no source][no method][no target][no option][no type]
type: Concept
definition: 2 [Industrial Processes and Product Use][no classification][Emissions][Unspecified mix of PFCs][t CO2 equivalent][no source][no method][no target][no option][no type]
status: valid
status modified: 2017-02-13
accepted date: 2017-02-13
in scheme: emissions_variables_MMR

2.A [Mineral Industry][no classification][Emissions][Aggregate GHGs][kt CO2 equivalent][no source][no method][no target][no option][no type]
type: Concept
definition: 2.A [Mineral Industry][no classification][Emissions][Aggregate GHGs][kt CO2 equivalent][no source][no method][no target][no option][no type]
status: valid
status modified: 2017-02-13
accepted date: 2017-02-13
in scheme: emissions_variables_MMR

2.A [Mineral Industry][no classification][Emissions][CO][kt][no source][no method][no target][no option][no type]
type: Concept
definition: 2.A [Mineral Industry][no classification][Emissions][CO][kt][no source][no method][no target][no option][no type]
status: valid
status modified: 2017-02-13
accepted date: 2017-02-13
in scheme: emissions_variables_MMR

2.A [Mineral Industry][no classification][Emissions][CO2][kt][no source][no method][no target][no option][no type]
type: Concept
definition: 2.A [Mineral Industry][no classification][Emissions][CO2][kt][no source][no method][no target][no option][no type]
status: valid
status modified: 2017-02-13
accepted date: 2017-02-13
in scheme: emissions_variables_MMR

2.A [Mineral Industry][no classification][Emissions][NMVOC][kt][no source][no method][no target][no option][no type]
type: Concept
definition: 2.A [Mineral Industry][no classification][Emissions][NMVOC][kt][no source][no method][no target][no option][no type]
status: valid
status modified: 2017-02-13
accepted date: 2017-02-13
in scheme: emissions_variables_MMR

2.A [Mineral Industry][no classification][Emissions][NOx][kt][no source][no method][no target][no option][no type]
type: Concept
definition: 2.A [Mineral Industry][no classification][Emissions][NOx][kt][no source][no method][no target][no option][no type]
status: valid
status modified: 2017-02-13
accepted date: 2017-02-13
in scheme: emissions_variables_MMR

2.A [Mineral Industry][no classification][Emissions][SO2][kt][no source][no method][no target][no option][no type]
type: Concept
definition: 2.A [Mineral Industry][no classification][Emissions][SO2][kt][no source][no method][no target][no option][no type]
status: valid
status modified: 2017-02-13
accepted date: 2017-02-13
in scheme: emissions_variables_MMR

2.A.1 [Cement Production][no classification][Emissions][CO2][kt][no source][no method][no target][no option][no type]
type: Concept
definition: 2.A.1 [Cement Production][no classification][Emissions][CO2][kt][no source][no method][no target][no option][no type]
status: valid
status modified: 2017-02-13
accepted date: 2017-02-13
in scheme: emissions_variables_MMR

2.A.1 [Cement Production][no classification][Emissions][SO2][kt][no source][no method][no target][no option][no type]
type: Concept
definition: 2.A.1 [Cement Production][no classification][Emissions][SO2][kt][no source][no method][no target][no option][no type]
status: valid
status modified: 2017-02-13
accepted date: 2017-02-13
in scheme: emissions_variables_MMR

2.A.2 [Lime Production][no classification][Emissions][CO2][kt][no source][no method][no target][no option][no type]
type: Concept
definition: 2.A.2 [Lime Production][no classification][Emissions][CO2][kt][no source][no method][no target][no option][no type]
status: valid
status modified: 2017-02-13
accepted date: 2017-02-13
in scheme: emissions_variables_MMR

2.A.3 [Glass production][no classification][Emissions][CO2][kt][no source][no method][no target][no option][no type]
type: Concept
definition: 2.A.3 [Glass production][no classification][Emissions][CO2][kt][no source][no method][no target][no option][no type]
status: valid
status modified: 2017-02-13
accepted date: 2017-02-13
in scheme: emissions_variables_MMR

2.A.4 [Other Process Uses of Carbonates][no classification][Emissions][CO][kt][no source][no method][no target][no option][no type]
type: Concept
definition: 2.A.4 [Other Process Uses of Carbonates][no classification][Emissions][CO][kt][no source][no method][no target][no option][no type]
status: valid
status modified: 2017-02-13
accepted date: 2017-02-13
in scheme: emissions_variables_MMR

2.A.4 [Other Process Uses of Carbonates][no classification][Emissions][CO2][kt][no source][no method][no target][no option][no type]
type: Concept
definition: 2.A.4 [Other Process Uses of Carbonates][no classification][Emissions][CO2][kt][no source][no method][no target][no option][no type]
status: valid
status modified: 2017-02-13
accepted date: 2017-02-13
in scheme: emissions_variables_MMR

2.A.4 [Other Process Uses of Carbonates][no classification][Emissions][NMVOC][kt][no source][no method][no target][no option][no type]
type: Concept
definition: 2.A.4 [Other Process Uses of Carbonates][no classification][Emissions][NMVOC][kt][no source][no method][no target][no option][no type]
status: valid
status modified: 2017-02-13
accepted date: 2017-02-13
in scheme: emissions_variables_MMR

2.A.4 [Other Process Uses of Carbonates][no classification][Emissions][NOx][kt][no source][no method][no target][no option][no type]
type: Concept
definition: 2.A.4 [Other Process Uses of Carbonates][no classification][Emissions][NOx][kt][no source][no method][no target][no option][no type]
status: valid
status modified: 2017-02-13
accepted date: 2017-02-13
in scheme: emissions_variables_MMR

2.A.4 [Other Process Uses of Carbonates][no classification][Emissions][SO2][kt][no source][no method][no target][no option][no type]
type: Concept
definition: 2.A.4 [Other Process Uses of Carbonates][no classification][Emissions][SO2][kt][no source][no method][no target][no option][no type]
status: valid
status modified: 2017-02-13
accepted date: 2017-02-13
in scheme: emissions_variables_MMR

2.A.4.a [Ceramics][no classification][Emissions][CO][kt][no source][no method][no target][no option][no type]
type: Concept
definition: 2.A.4.a [Ceramics][no classification][Emissions][CO][kt][no source][no method][no target][no option][no type]
status: valid
status modified: 2017-02-13
accepted date: 2017-02-13
in scheme: emissions_variables_MMR

2.A.4.a [Ceramics][no classification][Emissions][CO2][kt][no source][no method][no target][no option][no type]
type: Concept
definition: 2.A.4.a [Ceramics][no classification][Emissions][CO2][kt][no source][no method][no target][no option][no type]
status: valid
status modified: 2017-02-13
accepted date: 2017-02-13
in scheme: emissions_variables_MMR

2.A.4.a [Ceramics][no classification][Emissions][NMVOC][kt][no source][no method][no target][no option][no type]
type: Concept
definition: 2.A.4.a [Ceramics][no classification][Emissions][NMVOC][kt][no source][no method][no target][no option][no type]
status: valid
status modified: 2017-02-13
accepted date: 2017-02-13
in scheme: emissions_variables_MMR

2.A.4.a [Ceramics][no classification][Emissions][NOx][kt][no source][no method][no target][no option][no type]
type: Concept
definition: 2.A.4.a [Ceramics][no classification][Emissions][NOx][kt][no source][no method][no target][no option][no type]
status: valid
status modified: 2017-02-13
accepted date: 2017-02-13
in scheme: emissions_variables_MMR

2.A.4.a [Ceramics][no classification][Emissions][SO2][kt][no source][no method][no target][no option][no type]
type: Concept
definition: 2.A.4.a [Ceramics][no classification][Emissions][SO2][kt][no source][no method][no target][no option][no type]
status: valid
status modified: 2017-02-13
accepted date: 2017-02-13
in scheme: emissions_variables_MMR

2.A.4.b [Other uses of Soda Ash][no classification][Emissions][CO][kt][no source][no method][no target][no option][no type]
type: Concept
definition: 2.A.4.b [Other uses of Soda Ash][no classification][Emissions][CO][kt][no source][no method][no target][no option][no type]
status: valid
status modified: 2017-02-13
accepted date: 2017-02-13
in scheme: emissions_variables_MMR

2.A.4.b [Other uses of Soda Ash][no classification][Emissions][CO2][kt][no source][no method][no target][no option][no type]
type: Concept
definition: 2.A.4.b [Other uses of Soda Ash][no classification][Emissions][CO2][kt][no source][no method][no target][no option][no type]
status: valid
status modified: 2017-02-13
accepted date: 2017-02-13
in scheme: emissions_variables_MMR

2.A.4.b [Other uses of Soda Ash][no classification][Emissions][NMVOC][kt][no source][no method][no target][no option][no type]
type: Concept
definition: 2.A.4.b [Other uses of Soda Ash][no classification][Emissions][NMVOC][kt][no source][no method][no target][no option][no type]
status: valid
status modified: 2017-02-13
accepted date: 2017-02-13
in scheme: emissions_variables_MMR

2.A.4.b [Other uses of Soda Ash][no classification][Emissions][NOx][kt][no source][no method][no target][no option][no type]
type: Concept
definition: 2.A.4.b [Other uses of Soda Ash][no classification][Emissions][NOx][kt][no source][no method][no target][no option][no type]
status: valid
status modified: 2017-02-13
accepted date: 2017-02-13
in scheme: emissions_variables_MMR

2.A.4.b [Other uses of Soda Ash][no classification][Emissions][SO2][kt][no source][no method][no target][no option][no type]
type: Concept
definition: 2.A.4.b [Other uses of Soda Ash][no classification][Emissions][SO2][kt][no source][no method][no target][no option][no type]
status: valid
status modified: 2017-02-13
accepted date: 2017-02-13
in scheme: emissions_variables_MMR

2.A.4.c [Non-metallurgical Magnesium Production][no classification][Emissions][CO][kt][no source][no method][no target][no option][no type]
type: Concept
definition: 2.A.4.c [Non-metallurgical Magnesium Production][no classification][Emissions][CO][kt][no source][no method][no target][no option][no type]
status: valid
status modified: 2017-02-13
accepted date: 2017-02-13
in scheme: emissions_variables_MMR

2.A.4.c [Non-metallurgical Magnesium Production][no classification][Emissions][CO2][kt][no source][no method][no target][no option][no type]
type: Concept
definition: 2.A.4.c [Non-metallurgical Magnesium Production][no classification][Emissions][CO2][kt][no source][no method][no target][no option][no type]
status: valid
status modified: 2017-02-13
accepted date: 2017-02-13
in scheme: emissions_variables_MMR

2.A.4.c [Non-metallurgical Magnesium Production][no classification][Emissions][NMVOC][kt][no source][no method][no target][no option][no type]
type: Concept
definition: 2.A.4.c [Non-metallurgical Magnesium Production][no classification][Emissions][NMVOC][kt][no source][no method][no target][no option][no type]
status: valid
status modified: 2017-02-13
accepted date: 2017-02-13
in scheme: emissions_variables_MMR

2.A.4.c [Non-metallurgical Magnesium Production][no classification][Emissions][NOx][kt][no source][no method][no target][no option][no type]
type: Concept
definition: 2.A.4.c [Non-metallurgical Magnesium Production][no classification][Emissions][NOx][kt][no source][no method][no target][no option][no type]
status: valid
status modified: 2017-02-13
accepted date: 2017-02-13
in scheme: emissions_variables_MMR

2.A.4.c [Non-metallurgical Magnesium Production][no classification][Emissions][SO2][kt][no source][no method][no target][no option][no type]
type: Concept
definition: 2.A.4.c [Non-metallurgical Magnesium Production][no classification][Emissions][SO2][kt][no source][no method][no target][no option][no type]
status: valid
status modified: 2017-02-13
accepted date: 2017-02-13
in scheme: emissions_variables_MMR

2.A.4.d [Other unspecified uses of carbonates][no classification][Emissions][CO][kt][no source][no method][no target][no option][no type]
type: Concept
definition: 2.A.4.d [Other unspecified uses of carbonates][no classification][Emissions][CO][kt][no source][no method][no target][no option][no type]
status: valid
status modified: 2017-02-13
accepted date: 2017-02-13
in scheme: emissions_variables_MMR

2.A.4.d [Other unspecified uses of carbonates][no classification][Emissions][CO2][kt][no source][no method][no target][no option][no type]
type: Concept
definition: 2.A.4.d [Other unspecified uses of carbonates][no classification][Emissions][CO2][kt][no source][no method][no target][no option][no type]
status: valid
status modified: 2017-02-13
accepted date: 2017-02-13
in scheme: emissions_variables_MMR

2.A.4.d [Other unspecified uses of carbonates][no classification][Emissions][NMVOC][kt][no source][no method][no target][no option][no type]
type: Concept
definition: 2.A.4.d [Other unspecified uses of carbonates][no classification][Emissions][NMVOC][kt][no source][no method][no target][no option][no type]
status: valid
status modified: 2017-02-13
accepted date: 2017-02-13
in scheme: emissions_variables_MMR

2.A.4.d [Other unspecified uses of carbonates][no classification][Emissions][NOx][kt][no source][no method][no target][no option][no type]
type: Concept
definition: 2.A.4.d [Other unspecified uses of carbonates][no classification][Emissions][NOx][kt][no source][no method][no target][no option][no type]
status: valid
status modified: 2017-02-13
accepted date: 2017-02-13
in scheme: emissions_variables_MMR

2.A.4.d [Other unspecified uses of carbonates][no classification][Emissions][SO2][kt][no source][no method][no target][no option][no type]
type: Concept
definition: 2.A.4.d [Other unspecified uses of carbonates][no classification][Emissions][SO2][kt][no source][no method][no target][no option][no type]
status: valid
status modified: 2017-02-13
accepted date: 2017-02-13
in scheme: emissions_variables_MMR

2.B [Chemical Industry][no classification][Emissions][Aggregate F-gases][t CO2 equivalent][no source][no method][no target][no option][no type]
type: Concept
definition: 2.B [Chemical Industry][no classification][Emissions][Aggregate F-gases][t CO2 equivalent][no source][no method][no target][no option][no type]
status: valid
status modified: 2017-02-13
accepted date: 2017-02-13
in scheme: emissions_variables_MMR

2.B [Chemical Industry][no classification][Emissions][Aggregate GHGs][kt CO2 equivalent][no source][no method][no target][no option][no type]
type: Concept
definition: 2.B [Chemical Industry][no classification][Emissions][Aggregate GHGs][kt CO2 equivalent][no source][no method][no target][no option][no type]
status: valid
status modified: 2017-02-13
accepted date: 2017-02-13
in scheme: emissions_variables_MMR

2.B [Chemical Industry][no classification][Emissions][C10F18][t][no source][no method][no target][no option][no type]
type: Concept
definition: 2.B [Chemical Industry][no classification][Emissions][C10F18][t][no source][no method][no target][no option][no type]
status: valid
status modified: 2017-02-13
accepted date: 2017-02-13
in scheme: emissions_variables_MMR

2.B [Chemical Industry][no classification][Emissions][C2F6][t][no source][no method][no target][no option][no type]
type: Concept
definition: 2.B [Chemical Industry][no classification][Emissions][C2F6][t][no source][no method][no target][no option][no type]
status: valid
status modified: 2017-02-13
accepted date: 2017-02-13
in scheme: emissions_variables_MMR

2.B [Chemical Industry][no classification][Emissions][C3F8][t][no source][no method][no target][no option][no type]
type: Concept
definition: 2.B [Chemical Industry][no classification][Emissions][C3F8][t][no source][no method][no target][no option][no type]
status: valid
status modified: 2017-02-13
accepted date: 2017-02-13
in scheme: emissions_variables_MMR

2.B [Chemical Industry][no classification][Emissions][C4F10][t][no source][no method][no target][no option][no type]
type: Concept
definition: 2.B [Chemical Industry][no classification][Emissions][C4F10][t][no source][no method][no target][no option][no type]
status: valid
status modified: 2017-02-13
accepted date: 2017-02-13
in scheme: emissions_variables_MMR

2.B [Chemical Industry][no classification][Emissions][C5F12][t][no source][no method][no target][no option][no type]
type: Concept
definition: 2.B [Chemical Industry][no classification][Emissions][C5F12][t][no source][no method][no target][no option][no type]
status: valid
status modified: 2017-02-13
accepted date: 2017-02-13
in scheme: emissions_variables_MMR

2.B [Chemical Industry][no classification][Emissions][C6F14][t][no source][no method][no target][no option][no type]
type: Concept
definition: 2.B [Chemical Industry][no classification][Emissions][C6F14][t][no source][no method][no target][no option][no type]
status: valid
status modified: 2017-02-13
accepted date: 2017-02-13
in scheme: emissions_variables_MMR

2.B [Chemical Industry][no classification][Emissions][c-C3F6][t][no source][no method][no target][no option][no type]
type: Concept
definition: 2.B [Chemical Industry][no classification][Emissions][c-C3F6][t][no source][no method][no target][no option][no type]
status: valid
status modified: 2017-02-13
accepted date: 2017-02-13
in scheme: emissions_variables_MMR

2.B [Chemical Industry][no classification][Emissions][c-C4F8][t][no source][no method][no target][no option][no type]
type: Concept
definition: 2.B [Chemical Industry][no classification][Emissions][c-C4F8][t][no source][no method][no target][no option][no type]
status: valid
status modified: 2017-02-13
accepted date: 2017-02-13
in scheme: emissions_variables_MMR

2.B [Chemical Industry][no classification][Emissions][CF4][t][no source][no method][no target][no option][no type]
type: Concept
definition: 2.B [Chemical Industry][no classification][Emissions][CF4][t][no source][no method][no target][no option][no type]
status: valid
status modified: 2017-02-13
accepted date: 2017-02-13
in scheme: emissions_variables_MMR

2.B [Chemical Industry][no classification][Emissions][CH4][kt][no source][no method][no target][no option][no type]
type: Concept
definition: 2.B [Chemical Industry][no classification][Emissions][CH4][kt][no source][no method][no target][no option][no type]
status: valid
status modified: 2017-02-13
accepted date: 2017-02-13
in scheme: emissions_variables_MMR

2.B [Chemical Industry][no classification][Emissions][CO][kt][no source][no method][no target][no option][no type]
type: Concept
definition: 2.B [Chemical Industry][no classification][Emissions][CO][kt][no source][no method][no target][no option][no type]
status: valid
status modified: 2017-02-13
accepted date: 2017-02-13
in scheme: emissions_variables_MMR

2.B [Chemical Industry][no classification][Emissions][CO2][kt][no source][no method][no target][no option][no type]
type: Concept
definition: 2.B [Chemical Industry][no classification][Emissions][CO2][kt][no source][no method][no target][no option][no type]
status: valid
status modified: 2017-02-13
accepted date: 2017-02-13
in scheme: emissions_variables_MMR

2.B [Chemical Industry][no classification][Emissions][HFC-125][t][no source][no method][no target][no option][no type]
type: Concept
definition: 2.B [Chemical Industry][no classification][Emissions][HFC-125][t][no source][no method][no target][no option][no type]
status: valid
status modified: 2017-02-13
accepted date: 2017-02-13
in scheme: emissions_variables_MMR

2.B [Chemical Industry][no classification][Emissions][HFC-134][t][no source][no method][no target][no option][no type]
type: Concept
definition: 2.B [Chemical Industry][no classification][Emissions][HFC-134][t][no source][no method][no target][no option][no type]
status: valid
status modified: 2017-02-13
accepted date: 2017-02-13
in scheme: emissions_variables_MMR

2.B [Chemical Industry][no classification][Emissions][HFC-134a][t][no source][no method][no target][no option][no type]
type: Concept
definition: 2.B [Chemical Industry][no classification][Emissions][HFC-134a][t][no source][no method][no target][no option][no type]
status: valid
status modified: 2017-02-13
accepted date: 2017-02-13
in scheme: emissions_variables_MMR

2.B [Chemical Industry][no classification][Emissions][HFC-143][t][no source][no method][no target][no option][no type]
type: Concept
definition: 2.B [Chemical Industry][no classification][Emissions][HFC-143][t][no source][no method][no target][no option][no type]
status: valid
status modified: 2017-02-13
accepted date: 2017-02-13
in scheme: emissions_variables_MMR

2.B [Chemical Industry][no classification][Emissions][HFC-143a][t][no source][no method][no target][no option][no type]
type: Concept
definition: 2.B [Chemical Industry][no classification][Emissions][HFC-143a][t][no source][no method][no target][no option][no type]
status: valid
status modified: 2017-02-13
accepted date: 2017-02-13
in scheme: emissions_variables_MMR

2.B [Chemical Industry][no classification][Emissions][HFC-152][t][no source][no method][no target][no option][no type]
type: Concept
definition: 2.B [Chemical Industry][no classification][Emissions][HFC-152][t][no source][no method][no target][no option][no type]
status: valid
status modified: 2017-02-13
accepted date: 2017-02-13
in scheme: emissions_variables_MMR

2.B [Chemical Industry][no classification][Emissions][HFC-152a][t][no source][no method][no target][no option][no type]
type: Concept
definition: 2.B [Chemical Industry][no classification][Emissions][HFC-152a][t][no source][no method][no target][no option][no type]
status: valid
status modified: 2017-02-13
accepted date: 2017-02-13
in scheme: emissions_variables_MMR

2.B [Chemical Industry][no classification][Emissions][HFC-161][t][no source][no method][no target][no option][no type]
type: Concept
definition: 2.B [Chemical Industry][no classification][Emissions][HFC-161][t][no source][no method][no target][no option][no type]
status: valid
status modified: 2017-02-13
accepted date: 2017-02-13
in scheme: emissions_variables_MMR

2.B [Chemical Industry][no classification][Emissions][HFC-227ea][t][no source][no method][no target][no option][no type]
type: Concept
definition: 2.B [Chemical Industry][no classification][Emissions][HFC-227ea][t][no source][no method][no target][no option][no type]
status: valid
status modified: 2017-02-13
accepted date: 2017-02-13
in scheme: emissions_variables_MMR

2.B [Chemical Industry][no classification][Emissions][HFC-23][t][no source][no method][no target][no option][no type]
type: Concept
definition: 2.B [Chemical Industry][no classification][Emissions][HFC-23][t][no source][no method][no target][no option][no type]
status: valid
status modified: 2017-02-13
accepted date: 2017-02-13
in scheme: emissions_variables_MMR

2.B [Chemical Industry][no classification][Emissions][HFC-236cb][t][no source][no method][no target][no option][no type]
type: Concept
definition: 2.B [Chemical Industry][no classification][Emissions][HFC-236cb][t][no source][no method][no target][no option][no type]
status: valid
status modified: 2017-02-13
accepted date: 2017-02-13
in scheme: emissions_variables_MMR

2.B [Chemical Industry][no classification][Emissions][HFC-236ea][t][no source][no method][no target][no option][no type]
type: Concept
definition: 2.B [Chemical Industry][no classification][Emissions][HFC-236ea][t][no source][no method][no target][no option][no type]
status: valid
status modified: 2017-02-13
accepted date: 2017-02-13
in scheme: emissions_variables_MMR

2.B [Chemical Industry][no classification][Emissions][HFC-236fa][t][no source][no method][no target][no option][no type]
type: Concept
definition: 2.B [Chemical Industry][no classification][Emissions][HFC-236fa][t][no source][no method][no target][no option][no type]
status: valid
status modified: 2017-02-13
accepted date: 2017-02-13
in scheme: emissions_variables_MMR

2.B [Chemical Industry][no classification][Emissions][HFC-245ca][t][no source][no method][no target][no option][no type]
type: Concept
definition: 2.B [Chemical Industry][no classification][Emissions][HFC-245ca][t][no source][no method][no target][no option][no type]
status: valid
status modified: 2017-02-13
accepted date: 2017-02-13
in scheme: emissions_variables_MMR

2.B [Chemical Industry][no classification][Emissions][HFC-245fa][t][no source][no method][no target][no option][no type]
type: Concept
definition: 2.B [Chemical Industry][no classification][Emissions][HFC-245fa][t][no source][no method][no target][no option][no type]
status: valid
status modified: 2017-02-13
accepted date: 2017-02-13
in scheme: emissions_variables_MMR

2.B [Chemical Industry][no classification][Emissions][HFC-32][t][no source][no method][no target][no option][no type]
type: Concept
definition: 2.B [Chemical Industry][no classification][Emissions][HFC-32][t][no source][no method][no target][no option][no type]
status: valid
status modified: 2017-02-13
accepted date: 2017-02-13
in scheme: emissions_variables_MMR

2.B [Chemical Industry][no classification][Emissions][HFC-365mfc][t][no source][no method][no target][no option][no type]
type: Concept
definition: 2.B [Chemical Industry][no classification][Emissions][HFC-365mfc][t][no source][no method][no target][no option][no type]
status: valid
status modified: 2017-02-13
accepted date: 2017-02-13
in scheme: emissions_variables_MMR

2.B [Chemical Industry][no classification][Emissions][HFC-41][t][no source][no method][no target][no option][no type]
type: Concept
definition: 2.B [Chemical Industry][no classification][Emissions][HFC-41][t][no source][no method][no target][no option][no type]
status: valid
status modified: 2017-02-13
accepted date: 2017-02-13
in scheme: emissions_variables_MMR

2.B [Chemical Industry][no classification][Emissions][HFC-43-10mee][t][no source][no method][no target][no option][no type]
type: Concept
definition: 2.B [Chemical Industry][no classification][Emissions][HFC-43-10mee][t][no source][no method][no target][no option][no type]
status: valid
status modified: 2017-02-13
accepted date: 2017-02-13
in scheme: emissions_variables_MMR

2.B [Chemical Industry][no classification][Emissions][HFCs][t CO2 equivalent][no source][no method][no target][no option][no type]
type: Concept
definition: 2.B [Chemical Industry][no classification][Emissions][HFCs][t CO2 equivalent][no source][no method][no target][no option][no type]
status: valid
status modified: 2017-02-13
accepted date: 2017-02-13
in scheme: emissions_variables_MMR

2.B [Chemical Industry][no classification][Emissions][N2O][kt][no source][no method][no target][no option][no type]
type: Concept
definition: 2.B [Chemical Industry][no classification][Emissions][N2O][kt][no source][no method][no target][no option][no type]
status: valid
status modified: 2017-02-13
accepted date: 2017-02-13
in scheme: emissions_variables_MMR

2.B [Chemical Industry][no classification][Emissions][NF3][kt][no source][no method][no target][no option][no type]
type: Concept
definition: 2.B [Chemical Industry][no classification][Emissions][NF3][kt][no source][no method][no target][no option][no type]
status: valid
status modified: 2017-02-13
accepted date: 2017-02-13
in scheme: emissions_variables_MMR

2.B [Chemical Industry][no classification][Emissions][NMVOC][kt][no source][no method][no target][no option][no type]
type: Concept
definition: 2.B [Chemical Industry][no classification][Emissions][NMVOC][kt][no source][no method][no target][no option][no type]
status: valid
status modified: 2017-02-13
accepted date: 2017-02-13
in scheme: emissions_variables_MMR

2.B [Chemical Industry][no classification][Emissions][NOx][kt][no source][no method][no target][no option][no type]
type: Concept
definition: 2.B [Chemical Industry][no classification][Emissions][NOx][kt][no source][no method][no target][no option][no type]
status: valid
status modified: 2017-02-13
accepted date: 2017-02-13
in scheme: emissions_variables_MMR

2.B [Chemical Industry][no classification][Emissions][PFCs][t CO2 equivalent][no source][no method][no target][no option][no type]
type: Concept
definition: 2.B [Chemical Industry][no classification][Emissions][PFCs][t CO2 equivalent][no source][no method][no target][no option][no type]
status: valid
status modified: 2017-02-13
accepted date: 2017-02-13
in scheme: emissions_variables_MMR

2.B [Chemical Industry][no classification][Emissions][SF6][kt][no source][no method][no target][no option][no type]
type: Concept
definition: 2.B [Chemical Industry][no classification][Emissions][SF6][kt][no source][no method][no target][no option][no type]
status: valid
status modified: 2017-02-13
accepted date: 2017-02-13
in scheme: emissions_variables_MMR

2.B [Chemical Industry][no classification][Emissions][SO2][kt][no source][no method][no target][no option][no type]
type: Concept
definition: 2.B [Chemical Industry][no classification][Emissions][SO2][kt][no source][no method][no target][no option][no type]
status: valid
status modified: 2017-02-13
accepted date: 2017-02-13
in scheme: emissions_variables_MMR

2.B [Chemical Industry][no classification][Emissions][Unspecified mix of HFCs and PFCs][t CO2 equivalent][no source][no method][no target][no option][no type]
type: Concept
definition: 2.B [Chemical Industry][no classification][Emissions][Unspecified mix of HFCs and PFCs][t CO2 equivalent][no source][no method][no target][no option][no type]
status: valid
status modified: 2017-02-13
accepted date: 2017-02-13
in scheme: emissions_variables_MMR

2.B [Chemical Industry][no classification][Emissions][Unspecified mix of HFCs][t CO2 equivalent][no source][no method][no target][no option][no type]
type: Concept
definition: 2.B [Chemical Industry][no classification][Emissions][Unspecified mix of HFCs][t CO2 equivalent][no source][no method][no target][no option][no type]
status: valid
status modified: 2017-02-13
accepted date: 2017-02-13
in scheme: emissions_variables_MMR

2.B [Chemical Industry][no classification][Emissions][Unspecified mix of PFCs][t CO2 equivalent][no source][no method][no target][no option][no type]
type: Concept
definition: 2.B [Chemical Industry][no classification][Emissions][Unspecified mix of PFCs][t CO2 equivalent][no source][no method][no target][no option][no type]
status: valid
status modified: 2017-02-13
accepted date: 2017-02-13
in scheme: emissions_variables_MMR

2.B.1 [Ammonia Production][no classification][Emissions][CH4][kt][no source][no method][no target][no option][no type]
type: Concept
definition: 2.B.1 [Ammonia Production][no classification][Emissions][CH4][kt][no source][no method][no target][no option][no type]
status: valid
status modified: 2017-02-13
accepted date: 2017-02-13
in scheme: emissions_variables_MMR

2.B.1 [Ammonia Production][no classification][Emissions][CO][kt][no source][no method][no target][no option][no type]
type: Concept
definition: 2.B.1 [Ammonia Production][no classification][Emissions][CO][kt][no source][no method][no target][no option][no type]
status: valid
status modified: 2017-02-13
accepted date: 2017-02-13
in scheme: emissions_variables_MMR

2.B.1 [Ammonia Production][no classification][Emissions][CO2][kt][no source][no method][no target][no option][no type]
type: Concept
definition: 2.B.1 [Ammonia Production][no classification][Emissions][CO2][kt][no source][no method][no target][no option][no type]
status: valid
status modified: 2017-02-13
accepted date: 2017-02-13
in scheme: emissions_variables_MMR

2.B.1 [Ammonia Production][no classification][Emissions][N2O][kt][no source][no method][no target][no option][no type]
type: Concept
definition: 2.B.1 [Ammonia Production][no classification][Emissions][N2O][kt][no source][no method][no target][no option][no type]
status: valid
status modified: 2017-02-13
accepted date: 2017-02-13
in scheme: emissions_variables_MMR

2.B.1 [Ammonia Production][no classification][Emissions][NMVOC][kt][no source][no method][no target][no option][no type]
type: Concept
definition: 2.B.1 [Ammonia Production][no classification][Emissions][NMVOC][kt][no source][no method][no target][no option][no type]
status: valid
status modified: 2017-02-13
accepted date: 2017-02-13
in scheme: emissions_variables_MMR

2.B.1 [Ammonia Production][no classification][Emissions][NOx][kt][no source][no method][no target][no option][no type]
type: Concept
definition: 2.B.1 [Ammonia Production][no classification][Emissions][NOx][kt][no source][no method][no target][no option][no type]
status: valid
status modified: 2017-02-13
accepted date: 2017-02-13
in scheme: emissions_variables_MMR

2.B.1 [Ammonia Production][no classification][Emissions][SO2][kt][no source][no method][no target][no option][no type]
type: Concept
definition: 2.B.1 [Ammonia Production][no classification][Emissions][SO2][kt][no source][no method][no target][no option][no type]
status: valid
status modified: 2017-02-13
accepted date: 2017-02-13
in scheme: emissions_variables_MMR

2.B.10 [Other chemical industry][no classification][Emissions][Aggregate F-gases][t CO2 equivalent][no source][no method][no target][no option][no type]
type: Concept
definition: 2.B.10 [Other chemical industry][no classification][Emissions][Aggregate F-gases][t CO2 equivalent][no source][no method][no target][no option][no type]
status: valid
status modified: 2017-02-13
accepted date: 2017-02-13
in scheme: emissions_variables_MMR

2.B.10 [Other chemical industry][no classification][Emissions][C10F18][t][no source][no method][no target][no option][no type]
type: Concept
definition: 2.B.10 [Other chemical industry][no classification][Emissions][C10F18][t][no source][no method][no target][no option][no type]
status: valid
status modified: 2017-02-13
accepted date: 2017-02-13
in scheme: emissions_variables_MMR

2.B.10 [Other chemical industry][no classification][Emissions][C2F6][t][no source][no method][no target][no option][no type]
type: Concept
definition: 2.B.10 [Other chemical industry][no classification][Emissions][C2F6][t][no source][no method][no target][no option][no type]
status: valid
status modified: 2017-02-13
accepted date: 2017-02-13
in scheme: emissions_variables_MMR

2.B.10 [Other chemical industry][no classification][Emissions][C3F8][t][no source][no method][no target][no option][no type]
type: Concept
definition: 2.B.10 [Other chemical industry][no classification][Emissions][C3F8][t][no source][no method][no target][no option][no type]
status: valid
status modified: 2017-02-13
accepted date: 2017-02-13
in scheme: emissions_variables_MMR

2.B.10 [Other chemical industry][no classification][Emissions][C4F10][t][no source][no method][no target][no option][no type]
type: Concept
definition: 2.B.10 [Other chemical industry][no classification][Emissions][C4F10][t][no source][no method][no target][no option][no type]
status: valid
status modified: 2017-02-13
accepted date: 2017-02-13
in scheme: emissions_variables_MMR

2.B.10 [Other chemical industry][no classification][Emissions][C5F12][t][no source][no method][no target][no option][no type]
type: Concept
definition: 2.B.10 [Other chemical industry][no classification][Emissions][C5F12][t][no source][no method][no target][no option][no type]
status: valid
status modified: 2017-02-13
accepted date: 2017-02-13
in scheme: emissions_variables_MMR

2.B.10 [Other chemical industry][no classification][Emissions][C6F14][t][no source][no method][no target][no option][no type]
type: Concept
definition: 2.B.10 [Other chemical industry][no classification][Emissions][C6F14][t][no source][no method][no target][no option][no type]
status: valid
status modified: 2017-02-13
accepted date: 2017-02-13
in scheme: emissions_variables_MMR

2.B.10 [Other chemical industry][no classification][Emissions][c-C3F6][t][no source][no method][no target][no option][no type]
type: Concept
definition: 2.B.10 [Other chemical industry][no classification][Emissions][c-C3F6][t][no source][no method][no target][no option][no type]
status: valid
status modified: 2017-02-13
accepted date: 2017-02-13
in scheme: emissions_variables_MMR

2.B.10 [Other chemical industry][no classification][Emissions][c-C4F8][t][no source][no method][no target][no option][no type]
type: Concept
definition: 2.B.10 [Other chemical industry][no classification][Emissions][c-C4F8][t][no source][no method][no target][no option][no type]
status: valid
status modified: 2017-02-13
accepted date: 2017-02-13
in scheme: emissions_variables_MMR

2.B.10 [Other chemical industry][no classification][Emissions][CF4][t][no source][no method][no target][no option][no type]
type: Concept
definition: 2.B.10 [Other chemical industry][no classification][Emissions][CF4][t][no source][no method][no target][no option][no type]
status: valid
status modified: 2017-02-13
accepted date: 2017-02-13
in scheme: emissions_variables_MMR

2.B.10 [Other chemical industry][no classification][Emissions][CH4][kt][no source][no method][no target][no option][no type]
type: Concept
definition: 2.B.10 [Other chemical industry][no classification][Emissions][CH4][kt][no source][no method][no target][no option][no type]
status: valid
status modified: 2017-02-13
accepted date: 2017-02-13
in scheme: emissions_variables_MMR

2.B.10 [Other chemical industry][no classification][Emissions][CO][kt][no source][no method][no target][no option][no type]
type: Concept
definition: 2.B.10 [Other chemical industry][no classification][Emissions][CO][kt][no source][no method][no target][no option][no type]
status: valid
status modified: 2017-02-13
accepted date: 2017-02-13
in scheme: emissions_variables_MMR

2.B.10 [Other chemical industry][no classification][Emissions][CO2][kt][no source][no method][no target][no option][no type]
type: Concept
definition: 2.B.10 [Other chemical industry][no classification][Emissions][CO2][kt][no source][no method][no target][no option][no type]
status: valid
status modified: 2017-02-13
accepted date: 2017-02-13
in scheme: emissions_variables_MMR

2.B.10 [Other chemical industry][no classification][Emissions][HFC-125][t][no source][no method][no target][no option][no type]
type: Concept
definition: 2.B.10 [Other chemical industry][no classification][Emissions][HFC-125][t][no source][no method][no target][no option][no type]
status: valid
status modified: 2017-02-13
accepted date: 2017-02-13
in scheme: emissions_variables_MMR

2.B.10 [Other chemical industry][no classification][Emissions][HFC-134][t][no source][no method][no target][no option][no type]
type: Concept
definition: 2.B.10 [Other chemical industry][no classification][Emissions][HFC-134][t][no source][no method][no target][no option][no type]
status: valid
status modified: 2017-02-13
accepted date: 2017-02-13
in scheme: emissions_variables_MMR

2.B.10 [Other chemical industry][no classification][Emissions][HFC-134a][t][no source][no method][no target][no option][no type]
type: Concept
definition: 2.B.10 [Other chemical industry][no classification][Emissions][HFC-134a][t][no source][no method][no target][no option][no type]
status: valid
status modified: 2017-02-13
accepted date: 2017-02-13
in scheme: emissions_variables_MMR

2.B.10 [Other chemical industry][no classification][Emissions][HFC-143][t][no source][no method][no target][no option][no type]
type: Concept
definition: 2.B.10 [Other chemical industry][no classification][Emissions][HFC-143][t][no source][no method][no target][no option][no type]
status: valid
status modified: 2017-02-13
accepted date: 2017-02-13
in scheme: emissions_variables_MMR

2.B.10 [Other chemical industry][no classification][Emissions][HFC-143a][t][no source][no method][no target][no option][no type]
type: Concept
definition: 2.B.10 [Other chemical industry][no classification][Emissions][HFC-143a][t][no source][no method][no target][no option][no type]
status: valid
status modified: 2017-02-13
accepted date: 2017-02-13
in scheme: emissions_variables_MMR

2.B.10 [Other chemical industry][no classification][Emissions][HFC-152][t][no source][no method][no target][no option][no type]
type: Concept
definition: 2.B.10 [Other chemical industry][no classification][Emissions][HFC-152][t][no source][no method][no target][no option][no type]
status: valid
status modified: 2017-02-13
accepted date: 2017-02-13
in scheme: emissions_variables_MMR

2.B.10 [Other chemical industry][no classification][Emissions][HFC-152a][t][no source][no method][no target][no option][no type]
type: Concept
definition: 2.B.10 [Other chemical industry][no classification][Emissions][HFC-152a][t][no source][no method][no target][no option][no type]
status: valid
status modified: 2017-02-13
accepted date: 2017-02-13
in scheme: emissions_variables_MMR

2.B.10 [Other chemical industry][no classification][Emissions][HFC-161][t][no source][no method][no target][no option][no type]
type: Concept
definition: 2.B.10 [Other chemical industry][no classification][Emissions][HFC-161][t][no source][no method][no target][no option][no type]
status: valid
status modified: 2017-02-13
accepted date: 2017-02-13
in scheme: emissions_variables_MMR

2.B.10 [Other chemical industry][no classification][Emissions][HFC-227ea][t][no source][no method][no target][no option][no type]
type: Concept
definition: 2.B.10 [Other chemical industry][no classification][Emissions][HFC-227ea][t][no source][no method][no target][no option][no type]
status: valid
status modified: 2017-02-13
accepted date: 2017-02-13
in scheme: emissions_variables_MMR

2.B.10 [Other chemical industry][no classification][Emissions][HFC-23][t][no source][no method][no target][no option][no type]
type: Concept
definition: 2.B.10 [Other chemical industry][no classification][Emissions][HFC-23][t][no source][no method][no target][no option][no type]
status: valid
status modified: 2017-02-13
accepted date: 2017-02-13
in scheme: emissions_variables_MMR

2.B.10 [Other chemical industry][no classification][Emissions][HFC-236cb][t][no source][no method][no target][no option][no type]
type: Concept
definition: 2.B.10 [Other chemical industry][no classification][Emissions][HFC-236cb][t][no source][no method][no target][no option][no type]
status: valid
status modified: 2017-02-13
accepted date: 2017-02-13
in scheme: emissions_variables_MMR

2.B.10 [Other chemical industry][no classification][Emissions][HFC-236ea][t][no source][no method][no target][no option][no type]
type: Concept
definition: 2.B.10 [Other chemical industry][no classification][Emissions][HFC-236ea][t][no source][no method][no target][no option][no type]
status: valid
status modified: 2017-02-13
accepted date: 2017-02-13
in scheme: emissions_variables_MMR

2.B.10 [Other chemical industry][no classification][Emissions][HFC-236fa][t][no source][no method][no target][no option][no type]
type: Concept
definition: 2.B.10 [Other chemical industry][no classification][Emissions][HFC-236fa][t][no source][no method][no target][no option][no type]
status: valid
status modified: 2017-02-13
accepted date: 2017-02-13
in scheme: emissions_variables_MMR

2.B.10 [Other chemical industry][no classification][Emissions][HFC-245ca][t][no source][no method][no target][no option][no type]
type: Concept
definition: 2.B.10 [Other chemical industry][no classification][Emissions][HFC-245ca][t][no source][no method][no target][no option][no type]
status: valid
status modified: 2017-02-13
accepted date: 2017-02-13
in scheme: emissions_variables_MMR

2.B.10 [Other chemical industry][no classification][Emissions][HFC-245fa][t][no source][no method][no target][no option][no type]
type: Concept
definition: 2.B.10 [Other chemical industry][no classification][Emissions][HFC-245fa][t][no source][no method][no target][no option][no type]
status: valid
status modified: 2017-02-13
accepted date: 2017-02-13
in scheme: emissions_variables_MMR

2.B.10 [Other chemical industry][no classification][Emissions][HFC-32][t][no source][no method][no target][no option][no type]
type: Concept
definition: 2.B.10 [Other chemical industry][no classification][Emissions][HFC-32][t][no source][no method][no target][no option][no type]
status: valid
status modified: 2017-02-13
accepted date: 2017-02-13
in scheme: emissions_variables_MMR

2.B.10 [Other chemical industry][no classification][Emissions][HFC-365mfc][t][no source][no method][no target][no option][no type]
type: Concept
definition: 2.B.10 [Other chemical industry][no classification][Emissions][HFC-365mfc][t][no source][no method][no target][no option][no type]
status: valid
status modified: 2017-02-13
accepted date: 2017-02-13
in scheme: emissions_variables_MMR

2.B.10 [Other chemical industry][no classification][Emissions][HFC-41][t][no source][no method][no target][no option][no type]
type: Concept
definition: 2.B.10 [Other chemical industry][no classification][Emissions][HFC-41][t][no source][no method][no target][no option][no type]
status: valid
status modified: 2017-02-13
accepted date: 2017-02-13
in scheme: emissions_variables_MMR

2.B.10 [Other chemical industry][no classification][Emissions][HFC-43-10mee][t][no source][no method][no target][no option][no type]
type: Concept
definition: 2.B.10 [Other chemical industry][no classification][Emissions][HFC-43-10mee][t][no source][no method][no target][no option][no type]
status: valid
status modified: 2017-02-13
accepted date: 2017-02-13
in scheme: emissions_variables_MMR

2.B.10 [Other chemical industry][no classification][Emissions][HFCs][t CO2 equivalent][no source][no method][no target][no option][no type]
type: Concept
definition: 2.B.10 [Other chemical industry][no classification][Emissions][HFCs][t CO2 equivalent][no source][no method][no target][no option][no type]
status: valid
status modified: 2017-02-13
accepted date: 2017-02-13
in scheme: emissions_variables_MMR

2.B.10 [Other chemical industry][no classification][Emissions][N2O][kt][no source][no method][no target][no option][no type]
type: Concept
definition: 2.B.10 [Other chemical industry][no classification][Emissions][N2O][kt][no source][no method][no target][no option][no type]
status: valid
status modified: 2017-02-13
accepted date: 2017-02-13
in scheme: emissions_variables_MMR

2.B.10 [Other chemical industry][no classification][Emissions][NF3][t][no source][no method][no target][no option][no type]
type: Concept
definition: 2.B.10 [Other chemical industry][no classification][Emissions][NF3][t][no source][no method][no target][no option][no type]
status: valid
status modified: 2017-02-13
accepted date: 2017-02-13
in scheme: emissions_variables_MMR

2.B.10 [Other chemical industry][no classification][Emissions][NMVOC][kt][no source][no method][no target][no option][no type]
type: Concept
definition: 2.B.10 [Other chemical industry][no classification][Emissions][NMVOC][kt][no source][no method][no target][no option][no type]
status: valid
status modified: 2017-02-13
accepted date: 2017-02-13
in scheme: emissions_variables_MMR

2.B.10 [Other chemical industry][no classification][Emissions][NOx][kt][no source][no method][no target][no option][no type]
type: Concept
definition: 2.B.10 [Other chemical industry][no classification][Emissions][NOx][kt][no source][no method][no target][no option][no type]
status: valid
status modified: 2017-02-13
accepted date: 2017-02-13
in scheme: emissions_variables_MMR

2.B.10 [Other chemical industry][no classification][Emissions][PFCs][t CO2 equivalent][no source][no method][no target][no option][no type]
type: Concept
definition: 2.B.10 [Other chemical industry][no classification][Emissions][PFCs][t CO2 equivalent][no source][no method][no target][no option][no type]
status: valid
status modified: 2017-02-13
accepted date: 2017-02-13
in scheme: emissions_variables_MMR

2.B.10 [Other chemical industry][no classification][Emissions][SF6][t][no source][no method][no target][no option][no type]
type: Concept
definition: 2.B.10 [Other chemical industry][no classification][Emissions][SF6][t][no source][no method][no target][no option][no type]
status: valid
status modified: 2017-02-13
accepted date: 2017-02-13
in scheme: emissions_variables_MMR

2.B.10 [Other chemical industry][no classification][Emissions][SO2][kt][no source][no method][no target][no option][no type]
type: Concept
definition: 2.B.10 [Other chemical industry][no classification][Emissions][SO2][kt][no source][no method][no target][no option][no type]
status: valid
status modified: 2017-02-13
accepted date: 2017-02-13
in scheme: emissions_variables_MMR

2.B.10 [Other chemical industry][no classification][Emissions][Unspecified mix of HFCs and PFCs][t CO2 equivalent][no source][no method][no target][no option][no type]
type: Concept
definition: 2.B.10 [Other chemical industry][no classification][Emissions][Unspecified mix of HFCs and PFCs][t CO2 equivalent][no source][no method][no target][no option][no type]
status: valid
status modified: 2017-02-13
accepted date: 2017-02-13
in scheme: emissions_variables_MMR

2.B.10 [Other chemical industry][no classification][Emissions][Unspecified mix of HFCs][t CO2 equivalent][no source][no method][no target][no option][no type]
type: Concept
definition: 2.B.10 [Other chemical industry][no classification][Emissions][Unspecified mix of HFCs][t CO2 equivalent][no source][no method][no target][no option][no type]
status: valid
status modified: 2017-02-13
accepted date: 2017-02-13
in scheme: emissions_variables_MMR

2.B.10 [Other chemical industry][no classification][Emissions][Unspecified mix of PFCs][t CO2 equivalent][no source][no method][no target][no option][no type]
type: Concept
definition: 2.B.10 [Other chemical industry][no classification][Emissions][Unspecified mix of PFCs][t CO2 equivalent][no source][no method][no target][no option][no type]
status: valid
status modified: 2017-02-13
accepted date: 2017-02-13
in scheme: emissions_variables_MMR

2.B.2 [Nitric Acid Production][no classification][Emissions][N2O][kt][no source][no method][no target][no option][no type]
type: Concept
definition: 2.B.2 [Nitric Acid Production][no classification][Emissions][N2O][kt][no source][no method][no target][no option][no type]
status: valid
status modified: 2017-02-13
accepted date: 2017-02-13
in scheme: emissions_variables_MMR

2.B.2 [Nitric Acid Production][no classification][Emissions][NOx][kt][no source][no method][no target][no option][no type]
type: Concept
definition: 2.B.2 [Nitric Acid Production][no classification][Emissions][NOx][kt][no source][no method][no target][no option][no type]
status: valid
status modified: 2017-02-13
accepted date: 2017-02-13
in scheme: emissions_variables_MMR

2.B.3 [Adipic Acid Production][no classification][Emissions][CO][kt][no source][no method][no target][no option][no type]
type: Concept
definition: 2.B.3 [Adipic Acid Production][no classification][Emissions][CO][kt][no source][no method][no target][no option][no type]
status: valid
status modified: 2017-02-13
accepted date: 2017-02-13
in scheme: emissions_variables_MMR

2.B.3 [Adipic Acid Production][no classification][Emissions][CO2][kt][no source][no method][no target][no option][no type]
type: Concept
definition: 2.B.3 [Adipic Acid Production][no classification][Emissions][CO2][kt][no source][no method][no target][no option][no type]
status: valid
status modified: 2017-02-13
accepted date: 2017-02-13
in scheme: emissions_variables_MMR

2.B.3 [Adipic Acid Production][no classification][Emissions][N2O][kt][no source][no method][no target][no option][no type]
type: Concept
definition: 2.B.3 [Adipic Acid Production][no classification][Emissions][N2O][kt][no source][no method][no target][no option][no type]
status: valid
status modified: 2017-02-13
accepted date: 2017-02-13
in scheme: emissions_variables_MMR

2.B.3 [Adipic Acid Production][no classification][Emissions][NMVOC][kt][no source][no method][no target][no option][no type]
type: Concept
definition: 2.B.3 [Adipic Acid Production][no classification][Emissions][NMVOC][kt][no source][no method][no target][no option][no type]
status: valid
status modified: 2017-02-13
accepted date: 2017-02-13
in scheme: emissions_variables_MMR

2.B.3 [Adipic Acid Production][no classification][Emissions][NOx][kt][no source][no method][no target][no option][no type]
type: Concept
definition: 2.B.3 [Adipic Acid Production][no classification][Emissions][NOx][kt][no source][no method][no target][no option][no type]
status: valid
status modified: 2017-02-13
accepted date: 2017-02-13
in scheme: emissions_variables_MMR

2.B.4 [Caprolactam, Glyoxal and Glyoxylic Acid Production][no classification][Emissions][CO2][kt][no source][no method][no target][no option][no type]
type: Concept
definition: 2.B.4 [Caprolactam, Glyoxal and Glyoxylic Acid Production][no classification][Emissions][CO2][kt][no source][no method][no target][no option][no type]
status: valid
status modified: 2017-02-13
accepted date: 2017-02-13
in scheme: emissions_variables_MMR

2.B.4 [Caprolactam, Glyoxal and Glyoxylic Acid Production][no classification][Emissions][N2O][kt][no source][no method][no target][no option][no type]
type: Concept
definition: 2.B.4 [Caprolactam, Glyoxal and Glyoxylic Acid Production][no classification][Emissions][N2O][kt][no source][no method][no target][no option][no type]
status: valid
status modified: 2017-02-13
accepted date: 2017-02-13
in scheme: emissions_variables_MMR

2.B.4 [Caprolactam, Glyoxal and Glyoxylic Acid Production][no classification][Emissions][NMVOC][kt][no source][no method][no target][no option][no type]
type: Concept
definition: 2.B.4 [Caprolactam, Glyoxal and Glyoxylic Acid Production][no classification][Emissions][NMVOC][kt][no source][no method][no target][no option][no type]
status: valid
status modified: 2017-02-13
accepted date: 2017-02-13
in scheme: emissions_variables_MMR

2.B.4 [Caprolactam, Glyoxal and Glyoxylic Acid Production][no classification][Emissions][SO2][kt][no source][no method][no target][no option][no type]
type: Concept
definition: 2.B.4 [Caprolactam, Glyoxal and Glyoxylic Acid Production][no classification][Emissions][SO2][kt][no source][no method][no target][no option][no type]
status: valid
status modified: 2017-02-13
accepted date: 2017-02-13
in scheme: emissions_variables_MMR

2.B.4.a [Caprolactam][no classification][Emissions][CO2][kt][no source][no method][no target][no option][no type]
type: Concept
definition: 2.B.4.a [Caprolactam][no classification][Emissions][CO2][kt][no source][no method][no target][no option][no type]
status: valid
status modified: 2017-02-13
accepted date: 2017-02-13
in scheme: emissions_variables_MMR

2.B.4.a [Caprolactam][no classification][Emissions][N2O][kt][no source][no method][no target][no option][no type]
type: Concept
definition: 2.B.4.a [Caprolactam][no classification][Emissions][N2O][kt][no source][no method][no target][no option][no type]
status: valid
status modified: 2017-02-13
accepted date: 2017-02-13
in scheme: emissions_variables_MMR

2.B.4.b [Glyoxal][no classification][Emissions][CO2][kt][no source][no method][no target][no option][no type]
type: Concept
definition: 2.B.4.b [Glyoxal][no classification][Emissions][CO2][kt][no source][no method][no target][no option][no type]
status: valid
status modified: 2017-02-13
accepted date: 2017-02-13
in scheme: emissions_variables_MMR

2.B.4.b [Glyoxal][no classification][Emissions][N2O][kt][no source][no method][no target][no option][no type]
type: Concept
definition: 2.B.4.b [Glyoxal][no classification][Emissions][N2O][kt][no source][no method][no target][no option][no type]
status: valid
status modified: 2017-02-13
accepted date: 2017-02-13
in scheme: emissions_variables_MMR

2.B.4.c [Glyoxylic Acid][no classification][Emissions][CO2][kt][no source][no method][no target][no option][no type]
type: Concept
definition: 2.B.4.c [Glyoxylic Acid][no classification][Emissions][CO2][kt][no source][no method][no target][no option][no type]
status: valid
status modified: 2017-02-13
accepted date: 2017-02-13
in scheme: emissions_variables_MMR

2.B.4.c [Glyoxylic Acid][no classification][Emissions][N2O][kt][no source][no method][no target][no option][no type]
type: Concept
definition: 2.B.4.c [Glyoxylic Acid][no classification][Emissions][N2O][kt][no source][no method][no target][no option][no type]
status: valid
status modified: 2017-02-13
accepted date: 2017-02-13
in scheme: emissions_variables_MMR

2.B.5 [Carbide Production][no classification][Emissions][CH4][kt][no source][no method][no target][no option][no type]
type: Concept
definition: 2.B.5 [Carbide Production][no classification][Emissions][CH4][kt][no source][no method][no target][no option][no type]
status: valid
status modified: 2017-02-13
accepted date: 2017-02-13
in scheme: emissions_variables_MMR

2.B.5 [Carbide Production][no classification][Emissions][CO][kt][no source][no method][no target][no option][no type]
type: Concept
definition: 2.B.5 [Carbide Production][no classification][Emissions][CO][kt][no source][no method][no target][no option][no type]
status: valid
status modified: 2017-02-13
accepted date: 2017-02-13
in scheme: emissions_variables_MMR

2.B.5 [Carbide Production][no classification][Emissions][CO2][kt][no source][no method][no target][no option][no type]
type: Concept
definition: 2.B.5 [Carbide Production][no classification][Emissions][CO2][kt][no source][no method][no target][no option][no type]
status: valid
status modified: 2017-02-13
accepted date: 2017-02-13
in scheme: emissions_variables_MMR

2.B.5 [Carbide Production][no classification][Emissions][NMVOC][kt][no source][no method][no target][no option][no type]
type: Concept
definition: 2.B.5 [Carbide Production][no classification][Emissions][NMVOC][kt][no source][no method][no target][no option][no type]
status: valid
status modified: 2017-02-13
accepted date: 2017-02-13
in scheme: emissions_variables_MMR

2.B.5 [Carbide Production][no classification][Emissions][NOx][kt][no source][no method][no target][no option][no type]
type: Concept
definition: 2.B.5 [Carbide Production][no classification][Emissions][NOx][kt][no source][no method][no target][no option][no type]
status: valid
status modified: 2017-02-13
accepted date: 2017-02-13
in scheme: emissions_variables_MMR

2.B.5 [Carbide Production][no classification][Emissions][SO2][kt][no source][no method][no target][no option][no type]
type: Concept
definition: 2.B.5 [Carbide Production][no classification][Emissions][SO2][kt][no source][no method][no target][no option][no type]
status: valid
status modified: 2017-02-13
accepted date: 2017-02-13
in scheme: emissions_variables_MMR

2.B.5.a [Silicon Carbide][no classification][Emissions][CH4][kt][no source][no method][no target][no option][no type]
type: Concept
definition: 2.B.5.a [Silicon Carbide][no classification][Emissions][CH4][kt][no source][no method][no target][no option][no type]
status: valid
status modified: 2017-02-13
accepted date: 2017-02-13
in scheme: emissions_variables_MMR

2.B.5.a [Silicon Carbide][no classification][Emissions][CO2][kt][no source][no method][no target][no option][no type]
type: Concept
definition: 2.B.5.a [Silicon Carbide][no classification][Emissions][CO2][kt][no source][no method][no target][no option][no type]
status: valid
status modified: 2017-02-13
accepted date: 2017-02-13
in scheme: emissions_variables_MMR

2.B.5.b [Calcium Carbide][no classification][Emissions][CH4][kt][no source][no method][no target][no option][no type]
type: Concept
definition: 2.B.5.b [Calcium Carbide][no classification][Emissions][CH4][kt][no source][no method][no target][no option][no type]
status: valid
status modified: 2017-02-13
accepted date: 2017-02-13
in scheme: emissions_variables_MMR

2.B.5.b [Calcium Carbide][no classification][Emissions][CO2][kt][no source][no method][no target][no option][no type]
type: Concept
definition: 2.B.5.b [Calcium Carbide][no classification][Emissions][CO2][kt][no source][no method][no target][no option][no type]
status: valid
status modified: 2017-02-13
accepted date: 2017-02-13
in scheme: emissions_variables_MMR

2.B.6 [Titanium Dioxide Production][no classification][Emissions][CO2][kt][no source][no method][no target][no option][no type]
type: Concept
definition: 2.B.6 [Titanium Dioxide Production][no classification][Emissions][CO2][kt][no source][no method][no target][no option][no type]
status: valid
status modified: 2017-02-13
accepted date: 2017-02-13
in scheme: emissions_variables_MMR

2.B.7 [Soda Ash Production][no classification][Emissions][CO2][kt][no source][no method][no target][no option][no type]
type: Concept
definition: 2.B.7 [Soda Ash Production][no classification][Emissions][CO2][kt][no source][no method][no target][no option][no type]
status: valid
status modified: 2017-02-13
accepted date: 2017-02-13
in scheme: emissions_variables_MMR

2.B.8 [Petrochemical and Carbon Black Production][no classification][Emissions][CH4][kt][no source][no method][no target][no option][no type]
type: Concept
definition: 2.B.8 [Petrochemical and Carbon Black Production][no classification][Emissions][CH4][kt][no source][no method][no target][no option][no type]
status: valid
status modified: 2017-02-13
accepted date: 2017-02-13
in scheme: emissions_variables_MMR

2.B.8 [Petrochemical and Carbon Black Production][no classification][Emissions][CO][kt][no source][no method][no target][no option][no type]
type: Concept
definition: 2.B.8 [Petrochemical and Carbon Black Production][no classification][Emissions][CO][kt][no source][no method][no target][no option][no type]
status: valid
status modified: 2017-02-13
accepted date: 2017-02-13
in scheme: emissions_variables_MMR

2.B.8 [Petrochemical and Carbon Black Production][no classification][Emissions][CO2][kt][no source][no method][no target][no option][no type]
type: Concept
definition: 2.B.8 [Petrochemical and Carbon Black Production][no classification][Emissions][CO2][kt][no source][no method][no target][no option][no type]
status: valid
status modified: 2017-02-13
accepted date: 2017-02-13
in scheme: emissions_variables_MMR

2.B.8 [Petrochemical and Carbon Black Production][no classification][Emissions][NMVOC][kt][no source][no method][no target][no option][no type]
type: Concept
definition: 2.B.8 [Petrochemical and Carbon Black Production][no classification][Emissions][NMVOC][kt][no source][no method][no target][no option][no type]
status: valid
status modified: 2017-02-13
accepted date: 2017-02-13
in scheme: emissions_variables_MMR

2.B.8 [Petrochemical and Carbon Black Production][no classification][Emissions][NOx][kt][no source][no method][no target][no option][no type]
type: Concept
definition: 2.B.8 [Petrochemical and Carbon Black Production][no classification][Emissions][NOx][kt][no source][no method][no target][no option][no type]
status: valid
status modified: 2017-02-13
accepted date: 2017-02-13
in scheme: emissions_variables_MMR

2.B.8 [Petrochemical and Carbon Black Production][no classification][Emissions][SO2][kt][no source][no method][no target][no option][no type]
type: Concept
definition: 2.B.8 [Petrochemical and Carbon Black Production][no classification][Emissions][SO2][kt][no source][no method][no target][no option][no type]
status: valid
status modified: 2017-02-13
accepted date: 2017-02-13
in scheme: emissions_variables_MMR

2.B.8.a [Methanol][no classification][Emissions][CH4][kt][no source][no method][no target][no option][no type]
type: Concept
definition: 2.B.8.a [Methanol][no classification][Emissions][CH4][kt][no source][no method][no target][no option][no type]
status: valid
status modified: 2017-02-13
accepted date: 2017-02-13
in scheme: emissions_variables_MMR

2.B.8.a [Methanol][no classification][Emissions][CO2][kt][no source][no method][no target][no option][no type]
type: Concept
definition: 2.B.8.a [Methanol][no classification][Emissions][CO2][kt][no source][no method][no target][no option][no type]
status: valid
status modified: 2017-02-13
accepted date: 2017-02-13
in scheme: emissions_variables_MMR

2.B.8.b [Ethylene][no classification][Emissions][CH4][kt][no source][no method][no target][no option][no type]
type: Concept
definition: 2.B.8.b [Ethylene][no classification][Emissions][CH4][kt][no source][no method][no target][no option][no type]
status: valid
status modified: 2017-02-13
accepted date: 2017-02-13
in scheme: emissions_variables_MMR

2.B.8.b [Ethylene][no classification][Emissions][CO2][kt][no source][no method][no target][no option][no type]
type: Concept
definition: 2.B.8.b [Ethylene][no classification][Emissions][CO2][kt][no source][no method][no target][no option][no type]
status: valid
status modified: 2017-02-13
accepted date: 2017-02-13
in scheme: emissions_variables_MMR

2.B.8.c [Ethylene Dichloride and Vinyl Chloride Monomer][no classification][Emissions][CH4][kt][no source][no method][no target][no option][no type]
type: Concept
definition: 2.B.8.c [Ethylene Dichloride and Vinyl Chloride Monomer][no classification][Emissions][CH4][kt][no source][no method][no target][no option][no type]
status: valid
status modified: 2017-02-13
accepted date: 2017-02-13
in scheme: emissions_variables_MMR

2.B.8.c [Ethylene Dichloride and Vinyl Chloride Monomer][no classification][Emissions][CO2][kt][no source][no method][no target][no option][no type]
type: Concept
definition: 2.B.8.c [Ethylene Dichloride and Vinyl Chloride Monomer][no classification][Emissions][CO2][kt][no source][no method][no target][no option][no type]
status: valid
status modified: 2017-02-13
accepted date: 2017-02-13
in scheme: emissions_variables_MMR

2.B.8.d [Ethylene Oxide][no classification][Emissions][CH4][kt][no source][no method][no target][no option][no type]
type: Concept
definition: 2.B.8.d [Ethylene Oxide][no classification][Emissions][CH4][kt][no source][no method][no target][no option][no type]
status: valid
status modified: 2017-02-13
accepted date: 2017-02-13
in scheme: emissions_variables_MMR

2.B.8.d [Ethylene Oxide][no classification][Emissions][CO2][kt][no source][no method][no target][no option][no type]
type: Concept
definition: 2.B.8.d [Ethylene Oxide][no classification][Emissions][CO2][kt][no source][no method][no target][no option][no type]
status: valid
status modified: 2017-02-13
accepted date: 2017-02-13
in scheme: emissions_variables_MMR

2.B.8.e [Acrylonitrile][no classification][Emissions][CH4][kt][no source][no method][no target][no option][no type]
type: Concept
definition: 2.B.8.e [Acrylonitrile][no classification][Emissions][CH4][kt][no source][no method][no target][no option][no type]
status: valid
status modified: 2017-02-13
accepted date: 2017-02-13
in scheme: emissions_variables_MMR

2.B.8.e [Acrylonitrile][no classification][Emissions][CO2][kt][no source][no method][no target][no option][no type]
type: Concept
definition: 2.B.8.e [Acrylonitrile][no classification][Emissions][CO2][kt][no source][no method][no target][no option][no type]
status: valid
status modified: 2017-02-13
accepted date: 2017-02-13
in scheme: emissions_variables_MMR

2.B.8.f [Carbon Black][no classification][Emissions][CH4][kt][no source][no method][no target][no option][no type]
type: Concept
definition: 2.B.8.f [Carbon Black][no classification][Emissions][CH4][kt][no source][no method][no target][no option][no type]
status: valid
status modified: 2017-02-13
accepted date: 2017-02-13
in scheme: emissions_variables_MMR

2.B.8.f [Carbon Black][no classification][Emissions][CO2][kt][no source][no method][no target][no option][no type]
type: Concept
definition: 2.B.8.f [Carbon Black][no classification][Emissions][CO2][kt][no source][no method][no target][no option][no type]
status: valid
status modified: 2017-02-13
accepted date: 2017-02-13
in scheme: emissions_variables_MMR

2.B.8.g [Other Other petrochemical production][no classification][Emissions][CH4][kt][no source][no method][no target][no option][no type]
type: Concept
definition: 2.B.8.g [Other Other petrochemical production][no classification][Emissions][CH4][kt][no source][no method][no target][no option][no type]
status: valid
status modified: 2017-02-13
accepted date: 2017-02-13
in scheme: emissions_variables_MMR

2.B.8.g [Other Other petrochemical production][no classification][Emissions][CO2][kt][no source][no method][no target][no option][no type]
type: Concept
definition: 2.B.8.g [Other Other petrochemical production][no classification][Emissions][CO2][kt][no source][no method][no target][no option][no type]
status: valid
status modified: 2017-02-13
accepted date: 2017-02-13
in scheme: emissions_variables_MMR

2.B.8.g [Other petrochemical production][no classification][Emissions][CH4][kt][no source][no method][no target][no option][no type]
type: Concept
definition: 2.B.8.g [Other petrochemical production][no classification][Emissions][CH4][kt][no source][no method][no target][no option][no type]
status: valid
status modified: 2017-02-13
accepted date: 2017-02-13
in scheme: emissions_variables_MMR

2.B.8.g [Other petrochemical production][no classification][Emissions][CO2][kt][no source][no method][no target][no option][no type]
type: Concept
definition: 2.B.8.g [Other petrochemical production][no classification][Emissions][CO2][kt][no source][no method][no target][no option][no type]
status: valid
status modified: 2017-02-13
accepted date: 2017-02-13
in scheme: emissions_variables_MMR

2.B.8.g [Styrene][no classification][Emissions][CH4][kt][no source][no method][no target][no option][no type]
type: Concept
definition: 2.B.8.g [Styrene][no classification][Emissions][CH4][kt][no source][no method][no target][no option][no type]
status: valid
status modified: 2017-02-13
accepted date: 2017-02-13
in scheme: emissions_variables_MMR

2.B.8.g [Styrene][no classification][Emissions][CO2][kt][no source][no method][no target][no option][no type]
type: Concept
definition: 2.B.8.g [Styrene][no classification][Emissions][CO2][kt][no source][no method][no target][no option][no type]
status: valid
status modified: 2017-02-13
accepted date: 2017-02-13
in scheme: emissions_variables_MMR

2.B.9 [Fluorochemical Production][no classification][Emissions][Aggregate F-gases][t CO2 equivalent][no source][no method][no target][no option][no type]
type: Concept
definition: 2.B.9 [Fluorochemical Production][no classification][Emissions][Aggregate F-gases][t CO2 equivalent][no source][no method][no target][no option][no type]
status: valid
status modified: 2017-02-13
accepted date: 2017-02-13
in scheme: emissions_variables_MMR

2.B.9 [Fluorochemical Production][no classification][Emissions][C10F18][t][no source][no method][no target][no option][no type]
type: Concept
definition: 2.B.9 [Fluorochemical Production][no classification][Emissions][C10F18][t][no source][no method][no target][no option][no type]
status: valid
status modified: 2017-02-13
accepted date: 2017-02-13
in scheme: emissions_variables_MMR

2.B.9 [Fluorochemical Production][no classification][Emissions][C2F6][t][no source][no method][no target][no option][no type]
type: Concept
definition: 2.B.9 [Fluorochemical Production][no classification][Emissions][C2F6][t][no source][no method][no target][no option][no type]
status: valid
status modified: 2017-02-13
accepted date: 2017-02-13
in scheme: emissions_variables_MMR

2.B.9 [Fluorochemical Production][no classification][Emissions][C3F8][t][no source][no method][no target][no option][no type]
type: Concept
definition: 2.B.9 [Fluorochemical Production][no classification][Emissions][C3F8][t][no source][no method][no target][no option][no type]
status: valid
status modified: 2017-02-13
accepted date: 2017-02-13
in scheme: emissions_variables_MMR

2.B.9 [Fluorochemical Production][no classification][Emissions][C4F10][t][no source][no method][no target][no option][no type]
type: Concept
definition: 2.B.9 [Fluorochemical Production][no classification][Emissions][C4F10][t][no source][no method][no target][no option][no type]
status: valid
status modified: 2017-02-13
accepted date: 2017-02-13
in scheme: emissions_variables_MMR

2.B.9 [Fluorochemical Production][no classification][Emissions][C5F12][t][no source][no method][no target][no option][no type]
type: Concept
definition: 2.B.9 [Fluorochemical Production][no classification][Emissions][C5F12][t][no source][no method][no target][no option][no type]
status: valid
status modified: 2017-02-13
accepted date: 2017-02-13
in scheme: emissions_variables_MMR

2.B.9 [Fluorochemical Production][no classification][Emissions][C6F14][t][no source][no method][no target][no option][no type]
type: Concept
definition: 2.B.9 [Fluorochemical Production][no classification][Emissions][C6F14][t][no source][no method][no target][no option][no type]
status: valid
status modified: 2017-02-13
accepted date: 2017-02-13
in scheme: emissions_variables_MMR

2.B.9 [Fluorochemical Production][no classification][Emissions][c-C3F6][t][no source][no method][no target][no option][no type]
type: Concept
definition: 2.B.9 [Fluorochemical Production][no classification][Emissions][c-C3F6][t][no source][no method][no target][no option][no type]
status: valid
status modified: 2017-02-13
accepted date: 2017-02-13
in scheme: emissions_variables_MMR

2.B.9 [Fluorochemical Production][no classification][Emissions][c-C4F8][t][no source][no method][no target][no option][no type]
type: Concept
definition: 2.B.9 [Fluorochemical Production][no classification][Emissions][c-C4F8][t][no source][no method][no target][no option][no type]
status: valid
status modified: 2017-02-13
accepted date: 2017-02-13
in scheme: emissions_variables_MMR

2.B.9 [Fluorochemical Production][no classification][Emissions][CF4][t][no source][no method][no target][no option][no type]
type: Concept
definition: 2.B.9 [Fluorochemical Production][no classification][Emissions][CF4][t][no source][no method][no target][no option][no type]
status: valid
status modified: 2017-02-13
accepted date: 2017-02-13
in scheme: emissions_variables_MMR

2.B.9 [Fluorochemical Production][no classification][Emissions][HFC-125][t][no source][no method][no target][no option][no type]
type: Concept
definition: 2.B.9 [Fluorochemical Production][no classification][Emissions][HFC-125][t][no source][no method][no target][no option][no type]
status: valid
status modified: 2017-02-13
accepted date: 2017-02-13
in scheme: emissions_variables_MMR

2.B.9 [Fluorochemical Production][no classification][Emissions][HFC-134][t][no source][no method][no target][no option][no type]
type: Concept
definition: 2.B.9 [Fluorochemical Production][no classification][Emissions][HFC-134][t][no source][no method][no target][no option][no type]
status: valid
status modified: 2017-02-13
accepted date: 2017-02-13
in scheme: emissions_variables_MMR

2.B.9 [Fluorochemical Production][no classification][Emissions][HFC-134a][t][no source][no method][no target][no option][no type]
type: Concept
definition: 2.B.9 [Fluorochemical Production][no classification][Emissions][HFC-134a][t][no source][no method][no target][no option][no type]
status: valid
status modified: 2017-02-13
accepted date: 2017-02-13
in scheme: emissions_variables_MMR

2.B.9 [Fluorochemical Production][no classification][Emissions][HFC-143][t][no source][no method][no target][no option][no type]
type: Concept
definition: 2.B.9 [Fluorochemical Production][no classification][Emissions][HFC-143][t][no source][no method][no target][no option][no type]
status: valid
status modified: 2017-02-13
accepted date: 2017-02-13
in scheme: emissions_variables_MMR

2.B.9 [Fluorochemical Production][no classification][Emissions][HFC-143a][t][no source][no method][no target][no option][no type]
type: Concept
definition: 2.B.9 [Fluorochemical Production][no classification][Emissions][HFC-143a][t][no source][no method][no target][no option][no type]
status: valid
status modified: 2017-02-13
accepted date: 2017-02-13
in scheme: emissions_variables_MMR

2.B.9 [Fluorochemical Production][no classification][Emissions][HFC-152][t][no source][no method][no target][no option][no type]
type: Concept
definition: 2.B.9 [Fluorochemical Production][no classification][Emissions][HFC-152][t][no source][no method][no target][no option][no type]
status: valid
status modified: 2017-02-13
accepted date: 2017-02-13
in scheme: emissions_variables_MMR

2.B.9 [Fluorochemical Production][no classification][Emissions][HFC-152a][t][no source][no method][no target][no option][no type]
type: Concept
definition: 2.B.9 [Fluorochemical Production][no classification][Emissions][HFC-152a][t][no source][no method][no target][no option][no type]
status: valid
status modified: 2017-02-13
accepted date: 2017-02-13
in scheme: emissions_variables_MMR

2.B.9 [Fluorochemical Production][no classification][Emissions][HFC-161][t][no source][no method][no target][no option][no type]
type: Concept
definition: 2.B.9 [Fluorochemical Production][no classification][Emissions][HFC-161][t][no source][no method][no target][no option][no type]
status: valid
status modified: 2017-02-13
accepted date: 2017-02-13
in scheme: emissions_variables_MMR

2.B.9 [Fluorochemical Production][no classification][Emissions][HFC-227ea][t][no source][no method][no target][no option][no type]
type: Concept
definition: 2.B.9 [Fluorochemical Production][no classification][Emissions][HFC-227ea][t][no source][no method][no target][no option][no type]
status: valid
status modified: 2017-02-13
accepted date: 2017-02-13
in scheme: emissions_variables_MMR

2.B.9 [Fluorochemical Production][no classification][Emissions][HFC-23][t][no source][no method][no target][no option][no type]
type: Concept
definition: 2.B.9 [Fluorochemical Production][no classification][Emissions][HFC-23][t][no source][no method][no target][no option][no type]
status: valid
status modified: 2017-02-13
accepted date: 2017-02-13
in scheme: emissions_variables_MMR

2.B.9 [Fluorochemical Production][no classification][Emissions][HFC-236cb][t][no source][no method][no target][no option][no type]
type: Concept
definition: 2.B.9 [Fluorochemical Production][no classification][Emissions][HFC-236cb][t][no source][no method][no target][no option][no type]
status: valid
status modified: 2017-02-13
accepted date: 2017-02-13
in scheme: emissions_variables_MMR

2.B.9 [Fluorochemical Production][no classification][Emissions][HFC-236ea][t][no source][no method][no target][no option][no type]
type: Concept
definition: 2.B.9 [Fluorochemical Production][no classification][Emissions][HFC-236ea][t][no source][no method][no target][no option][no type]
status: valid
status modified: 2017-02-13
accepted date: 2017-02-13
in scheme: emissions_variables_MMR

2.B.9 [Fluorochemical Production][no classification][Emissions][HFC-236fa][t][no source][no method][no target][no option][no type]
type: Concept
definition: 2.B.9 [Fluorochemical Production][no classification][Emissions][HFC-236fa][t][no source][no method][no target][no option][no type]
status: valid
status modified: 2017-02-13
accepted date: 2017-02-13
in scheme: emissions_variables_MMR

2.B.9 [Fluorochemical Production][no classification][Emissions][HFC-245ca][t][no source][no method][no target][no option][no type]
type: Concept
definition: 2.B.9 [Fluorochemical Production][no classification][Emissions][HFC-245ca][t][no source][no method][no target][no option][no type]
status: valid
status modified: 2017-02-13
accepted date: 2017-02-13
in scheme: emissions_variables_MMR

2.B.9 [Fluorochemical Production][no classification][Emissions][HFC-245fa][t][no source][no method][no target][no option][no type]
type: Concept
definition: 2.B.9 [Fluorochemical Production][no classification][Emissions][HFC-245fa][t][no source][no method][no target][no option][no type]
status: valid
status modified: 2017-02-13
accepted date: 2017-02-13
in scheme: emissions_variables_MMR

2.B.9 [Fluorochemical Production][no classification][Emissions][HFC-32][t][no source][no method][no target][no option][no type]
type: Concept
definition: 2.B.9 [Fluorochemical Production][no classification][Emissions][HFC-32][t][no source][no method][no target][no option][no type]
status: valid
status modified: 2017-02-13
accepted date: 2017-02-13
in scheme: emissions_variables_MMR

2.B.9 [Fluorochemical Production][no classification][Emissions][HFC-365mfc][t][no source][no method][no target][no option][no type]
type: Concept
definition: 2.B.9 [Fluorochemical Production][no classification][Emissions][HFC-365mfc][t][no source][no method][no target][no option][no type]
status: valid
status modified: 2017-02-13
accepted date: 2017-02-13
in scheme: emissions_variables_MMR

2.B.9 [Fluorochemical Production][no classification][Emissions][HFC-41][t][no source][no method][no target][no option][no type]
type: Concept
definition: 2.B.9 [Fluorochemical Production][no classification][Emissions][HFC-41][t][no source][no method][no target][no option][no type]
status: valid
status modified: 2017-02-13
accepted date: 2017-02-13
in scheme: emissions_variables_MMR

2.B.9 [Fluorochemical Production][no classification][Emissions][HFC-43-10mee][t][no source][no method][no target][no option][no type]
type: Concept
definition: 2.B.9 [Fluorochemical Production][no classification][Emissions][HFC-43-10mee][t][no source][no method][no target][no option][no type]
status: valid
status modified: 2017-02-13
accepted date: 2017-02-13
in scheme: emissions_variables_MMR

2.B.9 [Fluorochemical Production][no classification][Emissions][HFCs][kt CO2 equivalent][no source][no method][no target][no option][no type]
type: Concept
definition: 2.B.9 [Fluorochemical Production][no classification][Emissions][HFCs][kt CO2 equivalent][no source][no method][no target][no option][no type]
status: valid
status modified: 2017-02-13
accepted date: 2017-02-13
in scheme: emissions_variables_MMR

2.B.9 [Fluorochemical Production][no classification][Emissions][NF3][t][no source][no method][no target][no option][no type]
type: Concept
definition: 2.B.9 [Fluorochemical Production][no classification][Emissions][NF3][t][no source][no method][no target][no option][no type]
status: valid
status modified: 2017-02-13
accepted date: 2017-02-13
in scheme: emissions_variables_MMR

2.B.9 [Fluorochemical Production][no classification][Emissions][no gas][kt CO2 equivalent][no source][no method][no target][no option][no type]
type: Concept
definition: 2.B.9 [Fluorochemical Production][no classification][Emissions][no gas][kt CO2 equivalent][no source][no method][no target][no option][no type]
status: valid
status modified: 2017-02-13
accepted date: 2017-02-13
in scheme: emissions_variables_MMR

2.B.9 [Fluorochemical Production][no classification][Emissions][PFCs][kt CO2 equivalent][no source][no method][no target][no option][no type]
type: Concept
definition: 2.B.9 [Fluorochemical Production][no classification][Emissions][PFCs][kt CO2 equivalent][no source][no method][no target][no option][no type]
status: valid
status modified: 2017-02-13
accepted date: 2017-02-13
in scheme: emissions_variables_MMR

2.B.9 [Fluorochemical Production][no classification][Emissions][SF6][t][no source][no method][no target][no option][no type]
type: Concept
definition: 2.B.9 [Fluorochemical Production][no classification][Emissions][SF6][t][no source][no method][no target][no option][no type]
status: valid
status modified: 2017-02-13
accepted date: 2017-02-13
in scheme: emissions_variables_MMR

2.B.9 [Fluorochemical Production][no classification][Emissions][Unspecified mix of HFCs and PFCs][t CO2 equivalent][no source][no method][no target][no option][no type]
type: Concept
definition: 2.B.9 [Fluorochemical Production][no classification][Emissions][Unspecified mix of HFCs and PFCs][t CO2 equivalent][no source][no method][no target][no option][no type]
status: valid
status modified: 2017-02-13
accepted date: 2017-02-13
in scheme: emissions_variables_MMR

2.B.9 [Fluorochemical Production][no classification][Emissions][Unspecified mix of HFCs][t CO2 equivalent][no source][no method][no target][no option][no type]
type: Concept
definition: 2.B.9 [Fluorochemical Production][no classification][Emissions][Unspecified mix of HFCs][t CO2 equivalent][no source][no method][no target][no option][no type]
status: valid
status modified: 2017-02-13
accepted date: 2017-02-13
in scheme: emissions_variables_MMR

2.B.9 [Fluorochemical Production][no classification][Emissions][Unspecified mix of PFCs][t CO2 equivalent][no source][no method][no target][no option][no type]
type: Concept
definition: 2.B.9 [Fluorochemical Production][no classification][Emissions][Unspecified mix of PFCs][t CO2 equivalent][no source][no method][no target][no option][no type]
status: valid
status modified: 2017-02-13
accepted date: 2017-02-13
in scheme: emissions_variables_MMR

2.B.9.a [By-Product Emissions][no classification][Emissions][Aggregate F-gases][t CO2 equivalent][no source][no method][no target][no option][no type]
type: Concept
definition: 2.B.9.a [By-Product Emissions][no classification][Emissions][Aggregate F-gases][t CO2 equivalent][no source][no method][no target][no option][no type]
status: valid
status modified: 2017-02-13
accepted date: 2017-02-13
in scheme: emissions_variables_MMR

2.B.9.a [By-Product Emissions][no classification][Emissions][C10F18][t][no source][no method][no target][no option][no type]
type: Concept
definition: 2.B.9.a [By-Product Emissions][no classification][Emissions][C10F18][t][no source][no method][no target][no option][no type]
status: valid
status modified: 2017-02-13
accepted date: 2017-02-13
in scheme: emissions_variables_MMR

2.B.9.a [By-Product Emissions][no classification][Emissions][C2F6][t][no source][no method][no target][no option][no type]
type: Concept
definition: 2.B.9.a [By-Product Emissions][no classification][Emissions][C2F6][t][no source][no method][no target][no option][no type]
status: valid
status modified: 2017-02-13
accepted date: 2017-02-13
in scheme: emissions_variables_MMR

2.B.9.a [By-Product Emissions][no classification][Emissions][C3F8][t][no source][no method][no target][no option][no type]
type: Concept
definition: 2.B.9.a [By-Product Emissions][no classification][Emissions][C3F8][t][no source][no method][no target][no option][no type]
status: valid
status modified: 2017-02-13
accepted date: 2017-02-13
in scheme: emissions_variables_MMR

2.B.9.a [By-Product Emissions][no classification][Emissions][C4F10][t][no source][no method][no target][no option][no type]
type: Concept
definition: 2.B.9.a [By-Product Emissions][no classification][Emissions][C4F10][t][no source][no method][no target][no option][no type]
status: valid
status modified: 2017-02-13
accepted date: 2017-02-13
in scheme: emissions_variables_MMR

2.B.9.a [By-Product Emissions][no classification][Emissions][C5F12][t][no source][no method][no target][no option][no type]
type: Concept
definition: 2.B.9.a [By-Product Emissions][no classification][Emissions][C5F12][t][no source][no method][no target][no option][no type]
status: valid
status modified: 2017-02-13
accepted date: 2017-02-13
in scheme: emissions_variables_MMR

2.B.9.a [By-Product Emissions][no classification][Emissions][C6F14][t][no source][no method][no target][no option][no type]
type: Concept
definition: 2.B.9.a [By-Product Emissions][no classification][Emissions][C6F14][t][no source][no method][no target][no option][no type]
status: valid
status modified: 2017-02-13
accepted date: 2017-02-13
in scheme: emissions_variables_MMR

2.B.9.a [By-Product Emissions][no classification][Emissions][c-C3F6][t][no source][no method][no target][no option][no type]
type: Concept
definition: 2.B.9.a [By-Product Emissions][no classification][Emissions][c-C3F6][t][no source][no method][no target][no option][no type]
status: valid
status modified: 2017-02-13
accepted date: 2017-02-13
in scheme: emissions_variables_MMR

2.B.9.a [By-Product Emissions][no classification][Emissions][c-C4F8][t][no source][no method][no target][no option][no type]
type: Concept
definition: 2.B.9.a [By-Product Emissions][no classification][Emissions][c-C4F8][t][no source][no method][no target][no option][no type]
status: valid
status modified: 2017-02-13
accepted date: 2017-02-13
in scheme: emissions_variables_MMR

2.B.9.a [By-Product Emissions][no classification][Emissions][CF4][t][no source][no method][no target][no option][no type]
type: Concept
definition: 2.B.9.a [By-Product Emissions][no classification][Emissions][CF4][t][no source][no method][no target][no option][no type]
status: valid
status modified: 2017-02-13
accepted date: 2017-02-13
in scheme: emissions_variables_MMR

2.B.9.a [By-Product Emissions][no classification][Emissions][HFC-125][t][no source][no method][no target][no option][no type]
type: Concept
definition: 2.B.9.a [By-Product Emissions][no classification][Emissions][HFC-125][t][no source][no method][no target][no option][no type]
status: valid
status modified: 2017-02-13
accepted date: 2017-02-13
in scheme: emissions_variables_MMR

2.B.9.a [By-Product Emissions][no classification][Emissions][HFC-134][t][no source][no method][no target][no option][no type]
type: Concept
definition: 2.B.9.a [By-Product Emissions][no classification][Emissions][HFC-134][t][no source][no method][no target][no option][no type]
status: valid
status modified: 2017-02-13
accepted date: 2017-02-13
in scheme: emissions_variables_MMR

2.B.9.a [By-Product Emissions][no classification][Emissions][HFC-134a][t][no source][no method][no target][no option][no type]
type: Concept
definition: 2.B.9.a [By-Product Emissions][no classification][Emissions][HFC-134a][t][no source][no method][no target][no option][no type]
status: valid
status modified: 2017-02-13
accepted date: 2017-02-13
in scheme: emissions_variables_MMR

2.B.9.a [By-Product Emissions][no classification][Emissions][HFC-143][t][no source][no method][no target][no option][no type]
type: Concept
definition: 2.B.9.a [By-Product Emissions][no classification][Emissions][HFC-143][t][no source][no method][no target][no option][no type]
status: valid
status modified: 2017-02-13
accepted date: 2017-02-13
in scheme: emissions_variables_MMR

2.B.9.a [By-Product Emissions][no classification][Emissions][HFC-143a][t][no source][no method][no target][no option][no type]
type: Concept
definition: 2.B.9.a [By-Product Emissions][no classification][Emissions][HFC-143a][t][no source][no method][no target][no option][no type]
status: valid
status modified: 2017-02-13
accepted date: 2017-02-13
in scheme: emissions_variables_MMR

2.B.9.a [By-Product Emissions][no classification][Emissions][HFC-152][t][no source][no method][no target][no option][no type]
type: Concept
definition: 2.B.9.a [By-Product Emissions][no classification][Emissions][HFC-152][t][no source][no method][no target][no option][no type]
status: valid
status modified: 2017-02-13
accepted date: 2017-02-13
in scheme: emissions_variables_MMR

2.B.9.a [By-Product Emissions][no classification][Emissions][HFC-152a][t][no source][no method][no target][no option][no type]
type: Concept
definition: 2.B.9.a [By-Product Emissions][no classification][Emissions][HFC-152a][t][no source][no method][no target][no option][no type]
status: valid
status modified: 2017-02-13
accepted date: 2017-02-13
in scheme: emissions_variables_MMR

2.B.9.a [By-Product Emissions][no classification][Emissions][HFC-161][t][no source][no method][no target][no option][no type]
type: Concept
definition: 2.B.9.a [By-Product Emissions][no classification][Emissions][HFC-161][t][no source][no method][no target][no option][no type]
status: valid
status modified: 2017-02-13
accepted date: 2017-02-13
in scheme: emissions_variables_MMR

2.B.9.a [By-Product Emissions][no classification][Emissions][HFC-227ea][t][no source][no method][no target][no option][no type]
type: Concept
definition: 2.B.9.a [By-Product Emissions][no classification][Emissions][HFC-227ea][t][no source][no method][no target][no option][no type]
status: valid
status modified: 2017-02-13
accepted date: 2017-02-13
in scheme: emissions_variables_MMR

2.B.9.a [By-Product Emissions][no classification][Emissions][HFC-23][t][no source][no method][no target][no option][no type]
type: Concept
definition: 2.B.9.a [By-Product Emissions][no classification][Emissions][HFC-23][t][no source][no method][no target][no option][no type]
status: valid
status modified: 2017-02-13
accepted date: 2017-02-13
in scheme: emissions_variables_MMR

2.B.9.a [By-Product Emissions][no classification][Emissions][HFC-236cb][t][no source][no method][no target][no option][no type]
type: Concept
definition: 2.B.9.a [By-Product Emissions][no classification][Emissions][HFC-236cb][t][no source][no method][no target][no option][no type]
status: valid
status modified: 2017-02-13
accepted date: 2017-02-13
in scheme: emissions_variables_MMR

2.B.9.a [By-Product Emissions][no classification][Emissions][HFC-236ea][t][no source][no method][no target][no option][no type]
type: Concept
definition: 2.B.9.a [By-Product Emissions][no classification][Emissions][HFC-236ea][t][no source][no method][no target][no option][no type]
status: valid
status modified: 2017-02-13
accepted date: 2017-02-13
in scheme: emissions_variables_MMR

2.B.9.a [By-Product Emissions][no classification][Emissions][HFC-236fa][t][no source][no method][no target][no option][no type]
type: Concept
definition: 2.B.9.a [By-Product Emissions][no classification][Emissions][HFC-236fa][t][no source][no method][no target][no option][no type]
status: valid
status modified: 2017-02-13
accepted date: 2017-02-13
in scheme: emissions_variables_MMR

2.B.9.a [By-Product Emissions][no classification][Emissions][HFC-245ca][t][no source][no method][no target][no option][no type]
type: Concept
definition: 2.B.9.a [By-Product Emissions][no classification][Emissions][HFC-245ca][t][no source][no method][no target][no option][no type]
status: valid
status modified: 2017-02-13
accepted date: 2017-02-13
in scheme: emissions_variables_MMR

2.B.9.a [By-Product Emissions][no classification][Emissions][HFC-245fa][t][no source][no method][no target][no option][no type]
type: Concept
definition: 2.B.9.a [By-Product Emissions][no classification][Emissions][HFC-245fa][t][no source][no method][no target][no option][no type]
status: valid
status modified: 2017-02-13
accepted date: 2017-02-13
in scheme: emissions_variables_MMR

2.B.9.a [By-Product Emissions][no classification][Emissions][HFC-32][t][no source][no method][no target][no option][no type]
type: Concept
definition: 2.B.9.a [By-Product Emissions][no classification][Emissions][HFC-32][t][no source][no method][no target][no option][no type]
status: valid
status modified: 2017-02-13
accepted date: 2017-02-13
in scheme: emissions_variables_MMR

2.B.9.a [By-Product Emissions][no classification][Emissions][HFC-365mfc][t][no source][no method][no target][no option][no type]
type: Concept
definition: 2.B.9.a [By-Product Emissions][no classification][Emissions][HFC-365mfc][t][no source][no method][no target][no option][no type]
status: valid
status modified: 2017-02-13
accepted date: 2017-02-13
in scheme: emissions_variables_MMR

2.B.9.a [By-Product Emissions][no classification][Emissions][HFC-41][t][no source][no method][no target][no option][no type]
type: Concept
definition: 2.B.9.a [By-Product Emissions][no classification][Emissions][HFC-41][t][no source][no method][no target][no option][no type]
status: valid
status modified: 2017-02-13
accepted date: 2017-02-13
in scheme: emissions_variables_MMR

2.B.9.a [By-Product Emissions][no classification][Emissions][HFC-43-10mee][t][no source][no method][no target][no option][no type]
type: Concept
definition: 2.B.9.a [By-Product Emissions][no classification][Emissions][HFC-43-10mee][t][no source][no method][no target][no option][no type]
status: valid
status modified: 2017-02-13
accepted date: 2017-02-13
in scheme: emissions_variables_MMR

2.B.9.a [By-Product Emissions][no classification][Emissions][HFCs][kt CO2 equivalent][no source][no method][no target][no option][no type]
type: Concept
definition: 2.B.9.a [By-Product Emissions][no classification][Emissions][HFCs][kt CO2 equivalent][no source][no method][no target][no option][no type]
status: valid
status modified: 2017-02-13
accepted date: 2017-02-13
in scheme: emissions_variables_MMR

2.B.9.a [By-Product Emissions][no classification][Emissions][NF3][t][no source][no method][no target][no option][no type]
type: Concept
definition: 2.B.9.a [By-Product Emissions][no classification][Emissions][NF3][t][no source][no method][no target][no option][no type]
status: valid
status modified: 2017-02-13
accepted date: 2017-02-13
in scheme: emissions_variables_MMR

2.B.9.a [By-Product Emissions][no classification][Emissions][no gas][kt CO2 equivalent][no source][no method][no target][no option][no type]
type: Concept
definition: 2.B.9.a [By-Product Emissions][no classification][Emissions][no gas][kt CO2 equivalent][no source][no method][no target][no option][no type]
status: valid
status modified: 2017-02-13
accepted date: 2017-02-13
in scheme: emissions_variables_MMR

2.B.9.a [By-Product Emissions][no classification][Emissions][PFCs][kt CO2 equivalent][no source][no method][no target][no option][no type]
type: Concept
definition: 2.B.9.a [By-Product Emissions][no classification][Emissions][PFCs][kt CO2 equivalent][no source][no method][no target][no option][no type]
status: valid
status modified: 2017-02-13
accepted date: 2017-02-13
in scheme: emissions_variables_MMR

2.B.9.a [By-Product Emissions][no classification][Emissions][SF6][t][no source][no method][no target][no option][no type]
type: Concept
definition: 2.B.9.a [By-Product Emissions][no classification][Emissions][SF6][t][no source][no method][no target][no option][no type]
status: valid
status modified: 2017-02-13
accepted date: 2017-02-13
in scheme: emissions_variables_MMR

2.B.9.a [By-Product Emissions][no classification][Emissions][Unspecified mix of HFCs and PFCs][t CO2 equivalent][no source][no method][no target][no option][no type]
type: Concept
definition: 2.B.9.a [By-Product Emissions][no classification][Emissions][Unspecified mix of HFCs and PFCs][t CO2 equivalent][no source][no method][no target][no option][no type]
status: valid
status modified: 2017-02-13
accepted date: 2017-02-13
in scheme: emissions_variables_MMR

2.B.9.a [By-Product Emissions][no classification][Emissions][Unspecified mix of HFCs][t CO2 equivalent][no source][no method][no target][no option][no type]
type: Concept
definition: 2.B.9.a [By-Product Emissions][no classification][Emissions][Unspecified mix of HFCs][t CO2 equivalent][no source][no method][no target][no option][no type]
status: valid
status modified: 2017-02-13
accepted date: 2017-02-13
in scheme: emissions_variables_MMR

2.B.9.a [By-Product Emissions][no classification][Emissions][Unspecified mix of PFCs][t CO2 equivalent][no source][no method][no target][no option][no type]
type: Concept
definition: 2.B.9.a [By-Product Emissions][no classification][Emissions][Unspecified mix of PFCs][t CO2 equivalent][no source][no method][no target][no option][no type]
status: valid
status modified: 2017-02-13
accepted date: 2017-02-13
in scheme: emissions_variables_MMR

2.B.9.a.1 [Production of HCFC-22][no classification][Emissions][Aggregate F-gases][t CO2 equivalent][no source][no method][no target][no option][no type]
type: Concept
definition: 2.B.9.a.1 [Production of HCFC-22][no classification][Emissions][Aggregate F-gases][t CO2 equivalent][no source][no method][no target][no option][no type]
status: valid
status modified: 2017-02-13
accepted date: 2017-02-13
in scheme: emissions_variables_MMR

2.B.9.a.1 [Production of HCFC-22][no classification][Emissions][C10F18][t][no source][no method][no target][no option][no type]
type: Concept
definition: 2.B.9.a.1 [Production of HCFC-22][no classification][Emissions][C10F18][t][no source][no method][no target][no option][no type]
status: valid
status modified: 2017-02-13
accepted date: 2017-02-13
in scheme: emissions_variables_MMR

2.B.9.a.1 [Production of HCFC-22][no classification][Emissions][C2F6][t][no source][no method][no target][no option][no type]
type: Concept
definition: 2.B.9.a.1 [Production of HCFC-22][no classification][Emissions][C2F6][t][no source][no method][no target][no option][no type]
status: valid
status modified: 2017-02-13
accepted date: 2017-02-13
in scheme: emissions_variables_MMR

2.B.9.a.1 [Production of HCFC-22][no classification][Emissions][C3F8][t][no source][no method][no target][no option][no type]
type: Concept
definition: 2.B.9.a.1 [Production of HCFC-22][no classification][Emissions][C3F8][t][no source][no method][no target][no option][no type]
status: valid
status modified: 2017-02-13
accepted date: 2017-02-13
in scheme: emissions_variables_MMR

2.B.9.a.1 [Production of HCFC-22][no classification][Emissions][C4F10][t][no source][no method][no target][no option][no type]
type: Concept
definition: 2.B.9.a.1 [Production of HCFC-22][no classification][Emissions][C4F10][t][no source][no method][no target][no option][no type]
status: valid
status modified: 2017-02-13
accepted date: 2017-02-13
in scheme: emissions_variables_MMR

2.B.9.a.1 [Production of HCFC-22][no classification][Emissions][C5F12][t][no source][no method][no target][no option][no type]
type: Concept
definition: 2.B.9.a.1 [Production of HCFC-22][no classification][Emissions][C5F12][t][no source][no method][no target][no option][no type]
status: valid
status modified: 2017-02-13
accepted date: 2017-02-13
in scheme: emissions_variables_MMR

2.B.9.a.1 [Production of HCFC-22][no classification][Emissions][C6F14][t][no source][no method][no target][no option][no type]
type: Concept
definition: 2.B.9.a.1 [Production of HCFC-22][no classification][Emissions][C6F14][t][no source][no method][no target][no option][no type]
status: valid
status modified: 2017-02-13
accepted date: 2017-02-13
in scheme: emissions_variables_MMR

2.B.9.a.1 [Production of HCFC-22][no classification][Emissions][c-C3F6][t][no source][no method][no target][no option][no type]
type: Concept
definition: 2.B.9.a.1 [Production of HCFC-22][no classification][Emissions][c-C3F6][t][no source][no method][no target][no option][no type]
status: valid
status modified: 2017-02-13
accepted date: 2017-02-13
in scheme: emissions_variables_MMR

2.B.9.a.1 [Production of HCFC-22][no classification][Emissions][c-C4F8][t][no source][no method][no target][no option][no type]
type: Concept
definition: 2.B.9.a.1 [Production of HCFC-22][no classification][Emissions][c-C4F8][t][no source][no method][no target][no option][no type]
status: valid
status modified: 2017-02-13
accepted date: 2017-02-13
in scheme: emissions_variables_MMR

2.B.9.a.1 [Production of HCFC-22][no classification][Emissions][CF4][t][no source][no method][no target][no option][no type]
type: Concept
definition: 2.B.9.a.1 [Production of HCFC-22][no classification][Emissions][CF4][t][no source][no method][no target][no option][no type]
status: valid
status modified: 2017-02-13
accepted date: 2017-02-13
in scheme: emissions_variables_MMR

2.B.9.a.1 [Production of HCFC-22][no classification][Emissions][HFC-125][t][no source][no method][no target][no option][no type]
type: Concept
definition: 2.B.9.a.1 [Production of HCFC-22][no classification][Emissions][HFC-125][t][no source][no method][no target][no option][no type]
status: valid
status modified: 2017-02-13
accepted date: 2017-02-13
in scheme: emissions_variables_MMR

2.B.9.a.1 [Production of HCFC-22][no classification][Emissions][HFC-134][t][no source][no method][no target][no option][no type]
type: Concept
definition: 2.B.9.a.1 [Production of HCFC-22][no classification][Emissions][HFC-134][t][no source][no method][no target][no option][no type]
status: valid
status modified: 2017-02-13
accepted date: 2017-02-13
in scheme: emissions_variables_MMR

2.B.9.a.1 [Production of HCFC-22][no classification][Emissions][HFC-134a][t][no source][no method][no target][no option][no type]
type: Concept
definition: 2.B.9.a.1 [Production of HCFC-22][no classification][Emissions][HFC-134a][t][no source][no method][no target][no option][no type]
status: valid
status modified: 2017-02-13
accepted date: 2017-02-13
in scheme: emissions_variables_MMR

2.B.9.a.1 [Production of HCFC-22][no classification][Emissions][HFC-143][t][no source][no method][no target][no option][no type]
type: Concept
definition: 2.B.9.a.1 [Production of HCFC-22][no classification][Emissions][HFC-143][t][no source][no method][no target][no option][no type]
status: valid
status modified: 2017-02-13
accepted date: 2017-02-13
in scheme: emissions_variables_MMR

2.B.9.a.1 [Production of HCFC-22][no classification][Emissions][HFC-143a][t][no source][no method][no target][no option][no type]
type: Concept
definition: 2.B.9.a.1 [Production of HCFC-22][no classification][Emissions][HFC-143a][t][no source][no method][no target][no option][no type]
status: valid
status modified: 2017-02-13
accepted date: 2017-02-13
in scheme: emissions_variables_MMR

2.B.9.a.1 [Production of HCFC-22][no classification][Emissions][HFC-152][t][no source][no method][no target][no option][no type]
type: Concept
definition: 2.B.9.a.1 [Production of HCFC-22][no classification][Emissions][HFC-152][t][no source][no method][no target][no option][no type]
status: valid
status modified: 2017-02-13
accepted date: 2017-02-13
in scheme: emissions_variables_MMR

2.B.9.a.1 [Production of HCFC-22][no classification][Emissions][HFC-152a][t][no source][no method][no target][no option][no type]
type: Concept
definition: 2.B.9.a.1 [Production of HCFC-22][no classification][Emissions][HFC-152a][t][no source][no method][no target][no option][no type]
status: valid
status modified: 2017-02-13
accepted date: 2017-02-13
in scheme: emissions_variables_MMR

2.B.9.a.1 [Production of HCFC-22][no classification][Emissions][HFC-161][t][no source][no method][no target][no option][no type]
type: Concept
definition: 2.B.9.a.1 [Production of HCFC-22][no classification][Emissions][HFC-161][t][no source][no method][no target][no option][no type]
status: valid
status modified: 2017-02-13
accepted date: 2017-02-13
in scheme: emissions_variables_MMR

2.B.9.a.1 [Production of HCFC-22][no classification][Emissions][HFC-227ea][t][no source][no method][no target][no option][no type]
type: Concept
definition: 2.B.9.a.1 [Production of HCFC-22][no classification][Emissions][HFC-227ea][t][no source][no method][no target][no option][no type]
status: valid
status modified: 2017-02-13
accepted date: 2017-02-13
in scheme: emissions_variables_MMR

2.B.9.a.1 [Production of HCFC-22][no classification][Emissions][HFC-23][t][no source][no method][no target][no option][no type]
type: Concept
definition: 2.B.9.a.1 [Production of HCFC-22][no classification][Emissions][HFC-23][t][no source][no method][no target][no option][no type]
status: valid
status modified: 2017-02-13
accepted date: 2017-02-13
in scheme: emissions_variables_MMR

2.B.9.a.1 [Production of HCFC-22][no classification][Emissions][HFC-236cb][t][no source][no method][no target][no option][no type]
type: Concept
definition: 2.B.9.a.1 [Production of HCFC-22][no classification][Emissions][HFC-236cb][t][no source][no method][no target][no option][no type]
status: valid
status modified: 2017-02-13
accepted date: 2017-02-13
in scheme: emissions_variables_MMR

2.B.9.a.1 [Production of HCFC-22][no classification][Emissions][HFC-236ea][t][no source][no method][no target][no option][no type]
type: Concept
definition: 2.B.9.a.1 [Production of HCFC-22][no classification][Emissions][HFC-236ea][t][no source][no method][no target][no option][no type]
status: valid
status modified: 2017-02-13
accepted date: 2017-02-13
in scheme: emissions_variables_MMR

2.B.9.a.1 [Production of HCFC-22][no classification][Emissions][HFC-236fa][t][no source][no method][no target][no option][no type]
type: Concept
definition: 2.B.9.a.1 [Production of HCFC-22][no classification][Emissions][HFC-236fa][t][no source][no method][no target][no option][no type]
status: valid
status modified: 2017-02-13
accepted date: 2017-02-13
in scheme: emissions_variables_MMR

2.B.9.a.1 [Production of HCFC-22][no classification][Emissions][HFC-245ca][t][no source][no method][no target][no option][no type]
type: Concept
definition: 2.B.9.a.1 [Production of HCFC-22][no classification][Emissions][HFC-245ca][t][no source][no method][no target][no option][no type]
status: valid
status modified: 2017-02-13
accepted date: 2017-02-13
in scheme: emissions_variables_MMR

2.B.9.a.1 [Production of HCFC-22][no classification][Emissions][HFC-245fa][t][no source][no method][no target][no option][no type]
type: Concept
definition: 2.B.9.a.1 [Production of HCFC-22][no classification][Emissions][HFC-245fa][t][no source][no method][no target][no option][no type]
status: valid
status modified: 2017-02-13
accepted date: 2017-02-13
in scheme: emissions_variables_MMR

2.B.9.a.1 [Production of HCFC-22][no classification][Emissions][HFC-32][t][no source][no method][no target][no option][no type]
type: Concept
definition: 2.B.9.a.1 [Production of HCFC-22][no classification][Emissions][HFC-32][t][no source][no method][no target][no option][no type]
status: valid
status modified: 2017-02-13
accepted date: 2017-02-13
in scheme: emissions_variables_MMR

2.B.9.a.1 [Production of HCFC-22][no classification][Emissions][HFC-365mfc][t][no source][no method][no target][no option][no type]
type: Concept
definition: 2.B.9.a.1 [Production of HCFC-22][no classification][Emissions][HFC-365mfc][t][no source][no method][no target][no option][no type]
status: valid
status modified: 2017-02-13
accepted date: 2017-02-13
in scheme: emissions_variables_MMR

2.B.9.a.1 [Production of HCFC-22][no classification][Emissions][HFC-41][t][no source][no method][no target][no option][no type]
type: Concept
definition: 2.B.9.a.1 [Production of HCFC-22][no classification][Emissions][HFC-41][t][no source][no method][no target][no option][no type]
status: valid
status modified: 2017-02-13
accepted date: 2017-02-13
in scheme: emissions_variables_MMR

2.B.9.a.1 [Production of HCFC-22][no classification][Emissions][HFC-43-10mee][t][no source][no method][no target][no option][no type]
type: Concept
definition: 2.B.9.a.1 [Production of HCFC-22][no classification][Emissions][HFC-43-10mee][t][no source][no method][no target][no option][no type]
status: valid
status modified: 2017-02-13
accepted date: 2017-02-13
in scheme: emissions_variables_MMR

2.B.9.a.1 [Production of HCFC-22][no classification][Emissions][HFCs][t CO2 equivalent][no source][no method][no target][no option][no type]
type: Concept
definition: 2.B.9.a.1 [Production of HCFC-22][no classification][Emissions][HFCs][t CO2 equivalent][no source][no method][no target][no option][no type]
status: valid
status modified: 2017-02-13
accepted date: 2017-02-13
in scheme: emissions_variables_MMR

2.B.9.a.1 [Production of HCFC-22][no classification][Emissions][NF3][t][no source][no method][no target][no option][no type]
type: Concept
definition: 2.B.9.a.1 [Production of HCFC-22][no classification][Emissions][NF3][t][no source][no method][no target][no option][no type]
status: valid
status modified: 2017-02-13
accepted date: 2017-02-13
in scheme: emissions_variables_MMR

2.B.9.a.1 [Production of HCFC-22][no classification][Emissions][no gas][kt CO2 equivalent][no source][no method][no target][no option][no type]
type: Concept
definition: 2.B.9.a.1 [Production of HCFC-22][no classification][Emissions][no gas][kt CO2 equivalent][no source][no method][no target][no option][no type]
status: valid
status modified: 2017-02-13
accepted date: 2017-02-13
in scheme: emissions_variables_MMR

2.B.9.a.1 [Production of HCFC-22][no classification][Emissions][PFCs][t CO2 equivalent][no source][no method][no target][no option][no type]
type: Concept
definition: 2.B.9.a.1 [Production of HCFC-22][no classification][Emissions][PFCs][t CO2 equivalent][no source][no method][no target][no option][no type]
status: valid
status modified: 2017-02-13
accepted date: 2017-02-13
in scheme: emissions_variables_MMR

2.B.9.a.1 [Production of HCFC-22][no classification][Emissions][SF6][t][no source][no method][no target][no option][no type]
type: Concept
definition: 2.B.9.a.1 [Production of HCFC-22][no classification][Emissions][SF6][t][no source][no method][no target][no option][no type]
status: valid
status modified: 2017-02-13
accepted date: 2017-02-13
in scheme: emissions_variables_MMR

2.B.9.a.1 [Production of HCFC-22][no classification][Emissions][Unspecified mix of HFCs and PFCs][t CO2 equivalent][no source][no method][no target][no option][no type]
type: Concept
definition: 2.B.9.a.1 [Production of HCFC-22][no classification][Emissions][Unspecified mix of HFCs and PFCs][t CO2 equivalent][no source][no method][no target][no option][no type]
status: valid
status modified: 2017-02-13
accepted date: 2017-02-13
in scheme: emissions_variables_MMR

2.B.9.a.1 [Production of HCFC-22][no classification][Emissions][Unspecified mix of HFCs][t CO2 equivalent][no source][no method][no target][no option][no type]
type: Concept
definition: 2.B.9.a.1 [Production of HCFC-22][no classification][Emissions][Unspecified mix of HFCs][t CO2 equivalent][no source][no method][no target][no option][no type]
status: valid
status modified: 2017-02-13
accepted date: 2017-02-13
in scheme: emissions_variables_MMR

2.B.9.a.1 [Production of HCFC-22][no classification][Emissions][Unspecified mix of PFCs][t CO2 equivalent][no source][no method][no target][no option][no type]
type: Concept
definition: 2.B.9.a.1 [Production of HCFC-22][no classification][Emissions][Unspecified mix of PFCs][t CO2 equivalent][no source][no method][no target][no option][no type]
status: valid
status modified: 2017-02-13
accepted date: 2017-02-13
in scheme: emissions_variables_MMR

2.B.9.a.2 [Other Fluorochemical Production][no classification][Emissions][Aggregate F-gases][t CO2 equivalent][no source][no method][no target][no option][no type]
type: Concept
definition: 2.B.9.a.2 [Other Fluorochemical Production][no classification][Emissions][Aggregate F-gases][t CO2 equivalent][no source][no method][no target][no option][no type]
status: valid
status modified: 2017-02-13
accepted date: 2017-02-13
in scheme: emissions_variables_MMR

2.B.9.a.2 [Other Fluorochemical Production][no classification][Emissions][C10F18][t][no source][no method][no target][no option][no type]
type: Concept
definition: 2.B.9.a.2 [Other Fluorochemical Production][no classification][Emissions][C10F18][t][no source][no method][no target][no option][no type]
status: valid
status modified: 2017-02-13
accepted date: 2017-02-13
in scheme: emissions_variables_MMR

2.B.9.a.2 [Other Fluorochemical Production][no classification][Emissions][C2F6][t][no source][no method][no target][no option][no type]
type: Concept
definition: 2.B.9.a.2 [Other Fluorochemical Production][no classification][Emissions][C2F6][t][no source][no method][no target][no option][no type]
status: valid
status modified: 2017-02-13
accepted date: 2017-02-13
in scheme: emissions_variables_MMR

2.B.9.a.2 [Other Fluorochemical Production][no classification][Emissions][C3F8][t][no source][no method][no target][no option][no type]
type: Concept
definition: 2.B.9.a.2 [Other Fluorochemical Production][no classification][Emissions][C3F8][t][no source][no method][no target][no option][no type]
status: valid
status modified: 2017-02-13
accepted date: 2017-02-13
in scheme: emissions_variables_MMR

2.B.9.a.2 [Other Fluorochemical Production][no classification][Emissions][C4F10][t][no source][no method][no target][no option][no type]
type: Concept
definition: 2.B.9.a.2 [Other Fluorochemical Production][no classification][Emissions][C4F10][t][no source][no method][no target][no option][no type]
status: valid
status modified: 2017-02-13
accepted date: 2017-02-13
in scheme: emissions_variables_MMR

2.B.9.a.2 [Other Fluorochemical Production][no classification][Emissions][C5F12][t][no source][no method][no target][no option][no type]
type: Concept
definition: 2.B.9.a.2 [Other Fluorochemical Production][no classification][Emissions][C5F12][t][no source][no method][no target][no option][no type]
status: valid
status modified: 2017-02-13
accepted date: 2017-02-13
in scheme: emissions_variables_MMR

2.B.9.a.2 [Other Fluorochemical Production][no classification][Emissions][C6F14][t][no source][no method][no target][no option][no type]
type: Concept
definition: 2.B.9.a.2 [Other Fluorochemical Production][no classification][Emissions][C6F14][t][no source][no method][no target][no option][no type]
status: valid
status modified: 2017-02-13
accepted date: 2017-02-13
in scheme: emissions_variables_MMR

2.B.9.a.2 [Other Fluorochemical Production][no classification][Emissions][c-C3F6][t][no source][no method][no target][no option][no type]
type: Concept
definition: 2.B.9.a.2 [Other Fluorochemical Production][no classification][Emissions][c-C3F6][t][no source][no method][no target][no option][no type]
status: valid
status modified: 2017-02-13
accepted date: 2017-02-13
in scheme: emissions_variables_MMR

2.B.9.a.2 [Other Fluorochemical Production][no classification][Emissions][c-C4F8][t][no source][no method][no target][no option][no type]
type: Concept
definition: 2.B.9.a.2 [Other Fluorochemical Production][no classification][Emissions][c-C4F8][t][no source][no method][no target][no option][no type]
status: valid
status modified: 2017-02-13
accepted date: 2017-02-13
in scheme: emissions_variables_MMR

2.B.9.a.2 [Other Fluorochemical Production][no classification][Emissions][CF4][t][no source][no method][no target][no option][no type]
type: Concept
definition: 2.B.9.a.2 [Other Fluorochemical Production][no classification][Emissions][CF4][t][no source][no method][no target][no option][no type]
status: valid
status modified: 2017-02-13
accepted date: 2017-02-13
in scheme: emissions_variables_MMR

2.B.9.a.2 [Other Fluorochemical Production][no classification][Emissions][HFC-125][t][no source][no method][no target][no option][no type]
type: Concept
definition: 2.B.9.a.2 [Other Fluorochemical Production][no classification][Emissions][HFC-125][t][no source][no method][no target][no option][no type]
status: valid
status modified: 2017-02-13
accepted date: 2017-02-13
in scheme: emissions_variables_MMR

2.B.9.a.2 [Other Fluorochemical Production][no classification][Emissions][HFC-134][t][no source][no method][no target][no option][no type]
type: Concept
definition: 2.B.9.a.2 [Other Fluorochemical Production][no classification][Emissions][HFC-134][t][no source][no method][no target][no option][no type]
status: valid
status modified: 2017-02-13
accepted date: 2017-02-13
in scheme: emissions_variables_MMR

2.B.9.a.2 [Other Fluorochemical Production][no classification][Emissions][HFC-134a][t][no source][no method][no target][no option][no type]
type: Concept
definition: 2.B.9.a.2 [Other Fluorochemical Production][no classification][Emissions][HFC-134a][t][no source][no method][no target][no option][no type]
status: valid
status modified: 2017-02-13
accepted date: 2017-02-13
in scheme: emissions_variables_MMR

2.B.9.a.2 [Other Fluorochemical Production][no classification][Emissions][HFC-143][t][no source][no method][no target][no option][no type]
type: Concept
definition: 2.B.9.a.2 [Other Fluorochemical Production][no classification][Emissions][HFC-143][t][no source][no method][no target][no option][no type]
status: valid
status modified: 2017-02-13
accepted date: 2017-02-13
in scheme: emissions_variables_MMR

2.B.9.a.2 [Other Fluorochemical Production][no classification][Emissions][HFC-143a][t][no source][no method][no target][no option][no type]
type: Concept
definition: 2.B.9.a.2 [Other Fluorochemical Production][no classification][Emissions][HFC-143a][t][no source][no method][no target][no option][no type]
status: valid
status modified: 2017-02-13
accepted date: 2017-02-13
in scheme: emissions_variables_MMR

2.B.9.a.2 [Other Fluorochemical Production][no classification][Emissions][HFC-152][t][no source][no method][no target][no option][no type]
type: Concept
definition: 2.B.9.a.2 [Other Fluorochemical Production][no classification][Emissions][HFC-152][t][no source][no method][no target][no option][no type]
status: valid
status modified: 2017-02-13
accepted date: 2017-02-13
in scheme: emissions_variables_MMR

2.B.9.a.2 [Other Fluorochemical Production][no classification][Emissions][HFC-152a][t][no source][no method][no target][no option][no type]
type: Concept
definition: 2.B.9.a.2 [Other Fluorochemical Production][no classification][Emissions][HFC-152a][t][no source][no method][no target][no option][no type]
status: valid
status modified: 2017-02-13
accepted date: 2017-02-13
in scheme: emissions_variables_MMR

2.B.9.a.2 [Other Fluorochemical Production][no classification][Emissions][HFC-161][t][no source][no method][no target][no option][no type]
type: Concept
definition: 2.B.9.a.2 [Other Fluorochemical Production][no classification][Emissions][HFC-161][t][no source][no method][no target][no option][no type]
status: valid
status modified: 2017-02-13
accepted date: 2017-02-13
in scheme: emissions_variables_MMR

2.B.9.a.2 [Other Fluorochemical Production][no classification][Emissions][HFC-227ea][t][no source][no method][no target][no option][no type]
type: Concept
definition: 2.B.9.a.2 [Other Fluorochemical Production][no classification][Emissions][HFC-227ea][t][no source][no method][no target][no option][no type]
status: valid
status modified: 2017-02-13
accepted date: 2017-02-13
in scheme: emissions_variables_MMR

2.B.9.a.2 [Other Fluorochemical Production][no classification][Emissions][HFC-23][t][no source][no method][no target][no option][no type]
type: Concept
definition: 2.B.9.a.2 [Other Fluorochemical Production][no classification][Emissions][HFC-23][t][no source][no method][no target][no option][no type]
status: valid
status modified: 2017-02-13
accepted date: 2017-02-13
in scheme: emissions_variables_MMR

2.B.9.a.2 [Other Fluorochemical Production][no classification][Emissions][HFC-236cb][t][no source][no method][no target][no option][no type]
type: Concept
definition: 2.B.9.a.2 [Other Fluorochemical Production][no classification][Emissions][HFC-236cb][t][no source][no method][no target][no option][no type]
status: valid
status modified: 2017-02-13
accepted date: 2017-02-13
in scheme: emissions_variables_MMR

2.B.9.a.2 [Other Fluorochemical Production][no classification][Emissions][HFC-236ea][t][no source][no method][no target][no option][no type]
type: Concept
definition: 2.B.9.a.2 [Other Fluorochemical Production][no classification][Emissions][HFC-236ea][t][no source][no method][no target][no option][no type]
status: valid
status modified: 2017-02-13
accepted date: 2017-02-13
in scheme: emissions_variables_MMR

2.B.9.a.2 [Other Fluorochemical Production][no classification][Emissions][HFC-236fa][t][no source][no method][no target][no option][no type]
type: Concept
definition: 2.B.9.a.2 [Other Fluorochemical Production][no classification][Emissions][HFC-236fa][t][no source][no method][no target][no option][no type]
status: valid
status modified: 2017-02-13
accepted date: 2017-02-13
in scheme: emissions_variables_MMR

2.B.9.a.2 [Other Fluorochemical Production][no classification][Emissions][HFC-245ca][t][no source][no method][no target][no option][no type]
type: Concept
definition: 2.B.9.a.2 [Other Fluorochemical Production][no classification][Emissions][HFC-245ca][t][no source][no method][no target][no option][no type]
status: valid
status modified: 2017-02-13
accepted date: 2017-02-13
in scheme: emissions_variables_MMR

2.B.9.a.2 [Other Fluorochemical Production][no classification][Emissions][HFC-245fa][t][no source][no method][no target][no option][no type]
type: Concept
definition: 2.B.9.a.2 [Other Fluorochemical Production][no classification][Emissions][HFC-245fa][t][no source][no method][no target][no option][no type]
status: valid
status modified: 2017-02-13
accepted date: 2017-02-13
in scheme: emissions_variables_MMR

2.B.9.a.2 [Other Fluorochemical Production][no classification][Emissions][HFC-32][t][no source][no method][no target][no option][no type]
type: Concept
definition: 2.B.9.a.2 [Other Fluorochemical Production][no classification][Emissions][HFC-32][t][no source][no method][no target][no option][no type]
status: valid
status modified: 2017-02-13
accepted date: 2017-02-13
in scheme: emissions_variables_MMR

2.B.9.a.2 [Other Fluorochemical Production][no classification][Emissions][HFC-365mfc][t][no source][no method][no target][no option][no type]
type: Concept
definition: 2.B.9.a.2 [Other Fluorochemical Production][no classification][Emissions][HFC-365mfc][t][no source][no method][no target][no option][no type]
status: valid
status modified: 2017-02-13
accepted date: 2017-02-13
in scheme: emissions_variables_MMR

2.B.9.a.2 [Other Fluorochemical Production][no classification][Emissions][HFC-41][t][no source][no method][no target][no option][no type]
type: Concept
definition: 2.B.9.a.2 [Other Fluorochemical Production][no classification][Emissions][HFC-41][t][no source][no method][no target][no option][no type]
status: valid
status modified: 2017-02-13
accepted date: 2017-02-13
in scheme: emissions_variables_MMR

2.B.9.a.2 [Other Fluorochemical Production][no classification][Emissions][HFC-43-10mee][t][no source][no method][no target][no option][no type]
type: Concept
definition: 2.B.9.a.2 [Other Fluorochemical Production][no classification][Emissions][HFC-43-10mee][t][no source][no method][no target][no option][no type]
status: valid
status modified: 2017-02-13
accepted date: 2017-02-13
in scheme: emissions_variables_MMR

2.B.9.a.2 [Other Fluorochemical Production][no classification][Emissions][HFCs][kt CO2 equivalent][no source][no method][no target][no option][no type]
type: Concept
definition: 2.B.9.a.2 [Other Fluorochemical Production][no classification][Emissions][HFCs][kt CO2 equivalent][no source][no method][no target][no option][no type]
status: valid
status modified: 2017-02-13
accepted date: 2017-02-13
in scheme: emissions_variables_MMR

2.B.9.a.2 [Other Fluorochemical Production][no classification][Emissions][NF3][t][no source][no method][no target][no option][no type]
type: Concept
definition: 2.B.9.a.2 [Other Fluorochemical Production][no classification][Emissions][NF3][t][no source][no method][no target][no option][no type]
status: valid
status modified: 2017-02-13
accepted date: 2017-02-13
in scheme: emissions_variables_MMR

2.B.9.a.2 [Other Fluorochemical Production][no classification][Emissions][no gas][kt CO2 equivalent][no source][no method][no target][no option][no type]
type: Concept
definition: 2.B.9.a.2 [Other Fluorochemical Production][no classification][Emissions][no gas][kt CO2 equivalent][no source][no method][no target][no option][no type]
status: valid
status modified: 2017-02-13
accepted date: 2017-02-13
in scheme: emissions_variables_MMR

2.B.9.a.2 [Other Fluorochemical Production][no classification][Emissions][PFCs][kt CO2 equivalent][no source][no method][no target][no option][no type]
type: Concept
definition: 2.B.9.a.2 [Other Fluorochemical Production][no classification][Emissions][PFCs][kt CO2 equivalent][no source][no method][no target][no option][no type]
status: valid
status modified: 2017-02-13
accepted date: 2017-02-13
in scheme: emissions_variables_MMR

2.B.9.a.2 [Other Fluorochemical Production][no classification][Emissions][SF6][t][no source][no method][no target][no option][no type]
type: Concept
definition: 2.B.9.a.2 [Other Fluorochemical Production][no classification][Emissions][SF6][t][no source][no method][no target][no option][no type]
status: valid
status modified: 2017-02-13
accepted date: 2017-02-13
in scheme: emissions_variables_MMR

2.B.9.a.2 [Other Fluorochemical Production][no classification][Emissions][Unspecified mix of HFCs and PFCs][t CO2 equivalent][no source][no method][no target][no option][no type]
type: Concept
definition: 2.B.9.a.2 [Other Fluorochemical Production][no classification][Emissions][Unspecified mix of HFCs and PFCs][t CO2 equivalent][no source][no method][no target][no option][no type]
status: valid
status modified: 2017-02-13
accepted date: 2017-02-13
in scheme: emissions_variables_MMR

2.B.9.a.2 [Other Fluorochemical Production][no classification][Emissions][Unspecified mix of HFCs][t CO2 equivalent][no source][no method][no target][no option][no type]
type: Concept
definition: 2.B.9.a.2 [Other Fluorochemical Production][no classification][Emissions][Unspecified mix of HFCs][t CO2 equivalent][no source][no method][no target][no option][no type]
status: valid
status modified: 2017-02-13
accepted date: 2017-02-13
in scheme: emissions_variables_MMR

2.B.9.a.2 [Other Fluorochemical Production][no classification][Emissions][Unspecified mix of PFCs][t CO2 equivalent][no source][no method][no target][no option][no type]
type: Concept
definition: 2.B.9.a.2 [Other Fluorochemical Production][no classification][Emissions][Unspecified mix of PFCs][t CO2 equivalent][no source][no method][no target][no option][no type]
status: valid
status modified: 2017-02-13
accepted date: 2017-02-13
in scheme: emissions_variables_MMR

2.B.9.b [Fugitive Emissions][no classification][Emissions][Aggregate F-gases][t CO2 equivalent][no source][no method][no target][no option][no type]
type: Concept
definition: 2.B.9.b [Fugitive Emissions][no classification][Emissions][Aggregate F-gases][t CO2 equivalent][no source][no method][no target][no option][no type]
status: valid
status modified: 2017-02-13
accepted date: 2017-02-13
in scheme: emissions_variables_MMR

2.B.9.b [Fugitive Emissions][no classification][Emissions][C10F18][t][no source][no method][no target][no option][no type]
type: Concept
definition: 2.B.9.b [Fugitive Emissions][no classification][Emissions][C10F18][t][no source][no method][no target][no option][no type]
status: valid
status modified: 2017-02-13
accepted date: 2017-02-13
in scheme: emissions_variables_MMR

2.B.9.b [Fugitive Emissions][no classification][Emissions][C2F6][t][no source][no method][no target][no option][no type]
type: Concept
definition: 2.B.9.b [Fugitive Emissions][no classification][Emissions][C2F6][t][no source][no method][no target][no option][no type]
status: valid
status modified: 2017-02-13
accepted date: 2017-02-13
in scheme: emissions_variables_MMR

2.B.9.b [Fugitive Emissions][no classification][Emissions][C3F8][t][no source][no method][no target][no option][no type]
type: Concept
definition: 2.B.9.b [Fugitive Emissions][no classification][Emissions][C3F8][t][no source][no method][no target][no option][no type]
status: valid
status modified: 2017-02-13
accepted date: 2017-02-13
in scheme: emissions_variables_MMR

2.B.9.b [Fugitive Emissions][no classification][Emissions][C4F10][t][no source][no method][no target][no option][no type]
type: Concept
definition: 2.B.9.b [Fugitive Emissions][no classification][Emissions][C4F10][t][no source][no method][no target][no option][no type]
status: valid
status modified: 2017-02-13
accepted date: 2017-02-13
in scheme: emissions_variables_MMR

2.B.9.b [Fugitive Emissions][no classification][Emissions][C5F12][t][no source][no method][no target][no option][no type]
type: Concept
definition: 2.B.9.b [Fugitive Emissions][no classification][Emissions][C5F12][t][no source][no method][no target][no option][no type]
status: valid
status modified: 2017-02-13
accepted date: 2017-02-13
in scheme: emissions_variables_MMR

2.B.9.b [Fugitive Emissions][no classification][Emissions][C6F14][t][no source][no method][no target][no option][no type]
type: Concept
definition: 2.B.9.b [Fugitive Emissions][no classification][Emissions][C6F14][t][no source][no method][no target][no option][no type]
status: valid
status modified: 2017-02-13
accepted date: 2017-02-13
in scheme: emissions_variables_MMR

2.B.9.b [Fugitive Emissions][no classification][Emissions][c-C3F6][t][no source][no method][no target][no option][no type]
type: Concept
definition: 2.B.9.b [Fugitive Emissions][no classification][Emissions][c-C3F6][t][no source][no method][no target][no option][no type]
status: valid
status modified: 2017-02-13
accepted date: 2017-02-13
in scheme: emissions_variables_MMR

2.B.9.b [Fugitive Emissions][no classification][Emissions][c-C4F8][t][no source][no method][no target][no option][no type]
type: Concept
definition: 2.B.9.b [Fugitive Emissions][no classification][Emissions][c-C4F8][t][no source][no method][no target][no option][no type]
status: valid
status modified: 2017-02-13
accepted date: 2017-02-13
in scheme: emissions_variables_MMR

2.B.9.b [Fugitive Emissions][no classification][Emissions][CF4][t][no source][no method][no target][no option][no type]
type: Concept
definition: 2.B.9.b [Fugitive Emissions][no classification][Emissions][CF4][t][no source][no method][no target][no option][no type]
status: valid
status modified: 2017-02-13
accepted date: 2017-02-13
in scheme: emissions_variables_MMR

2.B.9.b [Fugitive Emissions][no classification][Emissions][HFC-125][t][no source][no method][no target][no option][no type]
type: Concept
definition: 2.B.9.b [Fugitive Emissions][no classification][Emissions][HFC-125][t][no source][no method][no target][no option][no type]
status: valid
status modified: 2017-02-13
accepted date: 2017-02-13
in scheme: emissions_variables_MMR

2.B.9.b [Fugitive Emissions][no classification][Emissions][HFC-134][t][no source][no method][no target][no option][no type]
type: Concept
definition: 2.B.9.b [Fugitive Emissions][no classification][Emissions][HFC-134][t][no source][no method][no target][no option][no type]
status: valid
status modified: 2017-02-13
accepted date: 2017-02-13
in scheme: emissions_variables_MMR

2.B.9.b [Fugitive Emissions][no classification][Emissions][HFC-134a][t][no source][no method][no target][no option][no type]
type: Concept
definition: 2.B.9.b [Fugitive Emissions][no classification][Emissions][HFC-134a][t][no source][no method][no target][no option][no type]
status: valid
status modified: 2017-02-13
accepted date: 2017-02-13
in scheme: emissions_variables_MMR

2.B.9.b [Fugitive Emissions][no classification][Emissions][HFC-143][t][no source][no method][no target][no option][no type]
type: Concept
definition: 2.B.9.b [Fugitive Emissions][no classification][Emissions][HFC-143][t][no source][no method][no target][no option][no type]
status: valid
status modified: 2017-02-13
accepted date: 2017-02-13
in scheme: emissions_variables_MMR

2.B.9.b [Fugitive Emissions][no classification][Emissions][HFC-143a][t][no source][no method][no target][no option][no type]
type: Concept
definition: 2.B.9.b [Fugitive Emissions][no classification][Emissions][HFC-143a][t][no source][no method][no target][no option][no type]
status: valid
status modified: 2017-02-13
accepted date: 2017-02-13
in scheme: emissions_variables_MMR

2.B.9.b [Fugitive Emissions][no classification][Emissions][HFC-152][t][no source][no method][no target][no option][no type]
type: Concept
definition: 2.B.9.b [Fugitive Emissions][no classification][Emissions][HFC-152][t][no source][no method][no target][no option][no type]
status: valid
status modified: 2017-02-13
accepted date: 2017-02-13
in scheme: emissions_variables_MMR

2.B.9.b [Fugitive Emissions][no classification][Emissions][HFC-152a][t][no source][no method][no target][no option][no type]
type: Concept
definition: 2.B.9.b [Fugitive Emissions][no classification][Emissions][HFC-152a][t][no source][no method][no target][no option][no type]
status: valid
status modified: 2017-02-13
accepted date: 2017-02-13
in scheme: emissions_variables_MMR

2.B.9.b [Fugitive Emissions][no classification][Emissions][HFC-161][t][no source][no method][no target][no option][no type]
type: Concept
definition: 2.B.9.b [Fugitive Emissions][no classification][Emissions][HFC-161][t][no source][no method][no target][no option][no type]
status: valid
status modified: 2017-02-13
accepted date: 2017-02-13
in scheme: emissions_variables_MMR

2.B.9.b [Fugitive Emissions][no classification][Emissions][HFC-227ea][t][no source][no method][no target][no option][no type]
type: Concept
definition: 2.B.9.b [Fugitive Emissions][no classification][Emissions][HFC-227ea][t][no source][no method][no target][no option][no type]
status: valid
status modified: 2017-02-13
accepted date: 2017-02-13
in scheme: emissions_variables_MMR

2.B.9.b [Fugitive Emissions][no classification][Emissions][HFC-23][t][no source][no method][no target][no option][no type]
type: Concept
definition: 2.B.9.b [Fugitive Emissions][no classification][Emissions][HFC-23][t][no source][no method][no target][no option][no type]
status: valid
status modified: 2017-02-13
accepted date: 2017-02-13
in scheme: emissions_variables_MMR

2.B.9.b [Fugitive Emissions][no classification][Emissions][HFC-236cb][t][no source][no method][no target][no option][no type]
type: Concept
definition: 2.B.9.b [Fugitive Emissions][no classification][Emissions][HFC-236cb][t][no source][no method][no target][no option][no type]
status: valid
status modified: 2017-02-13
accepted date: 2017-02-13
in scheme: emissions_variables_MMR

2.B.9.b [Fugitive Emissions][no classification][Emissions][HFC-236ea][t][no source][no method][no target][no option][no type]
type: Concept
definition: 2.B.9.b [Fugitive Emissions][no classification][Emissions][HFC-236ea][t][no source][no method][no target][no option][no type]
status: valid
status modified: 2017-02-13
accepted date: 2017-02-13
in scheme: emissions_variables_MMR

2.B.9.b [Fugitive Emissions][no classification][Emissions][HFC-236fa][t][no source][no method][no target][no option][no type]
type: Concept
definition: 2.B.9.b [Fugitive Emissions][no classification][Emissions][HFC-236fa][t][no source][no method][no target][no option][no type]
status: valid
status modified: 2017-02-13
accepted date: 2017-02-13
in scheme: emissions_variables_MMR

2.B.9.b [Fugitive Emissions][no classification][Emissions][HFC-245ca][t][no source][no method][no target][no option][no type]
type: Concept
definition: 2.B.9.b [Fugitive Emissions][no classification][Emissions][HFC-245ca][t][no source][no method][no target][no option][no type]
status: valid
status modified: 2017-02-13
accepted date: 2017-02-13
in scheme: emissions_variables_MMR

2.B.9.b [Fugitive Emissions][no classification][Emissions][HFC-245fa][t][no source][no method][no target][no option][no type]
type: Concept
definition: 2.B.9.b [Fugitive Emissions][no classification][Emissions][HFC-245fa][t][no source][no method][no target][no option][no type]
status: valid
status modified: 2017-02-13
accepted date: 2017-02-13
in scheme: emissions_variables_MMR

2.B.9.b [Fugitive Emissions][no classification][Emissions][HFC-32][t][no source][no method][no target][no option][no type]
type: Concept
definition: 2.B.9.b [Fugitive Emissions][no classification][Emissions][HFC-32][t][no source][no method][no target][no option][no type]
status: valid
status modified: 2017-02-13
accepted date: 2017-02-13
in scheme: emissions_variables_MMR

2.B.9.b [Fugitive Emissions][no classification][Emissions][HFC-365mfc][t][no source][no method][no target][no option][no type]
type: Concept
definition: 2.B.9.b [Fugitive Emissions][no classification][Emissions][HFC-365mfc][t][no source][no method][no target][no option][no type]
status: valid
status modified: 2017-02-13
accepted date: 2017-02-13
in scheme: emissions_variables_MMR

2.B.9.b [Fugitive Emissions][no classification][Emissions][HFC-41][t][no source][no method][no target][no option][no type]
type: Concept
definition: 2.B.9.b [Fugitive Emissions][no classification][Emissions][HFC-41][t][no source][no method][no target][no option][no type]
status: valid
status modified: 2017-02-13
accepted date: 2017-02-13
in scheme: emissions_variables_MMR

2.B.9.b [Fugitive Emissions][no classification][Emissions][HFC-43-10mee][t][no source][no method][no target][no option][no type]
type: Concept
definition: 2.B.9.b [Fugitive Emissions][no classification][Emissions][HFC-43-10mee][t][no source][no method][no target][no option][no type]
status: valid
status modified: 2017-02-13
accepted date: 2017-02-13
in scheme: emissions_variables_MMR

2.B.9.b [Fugitive Emissions][no classification][Emissions][HFCs][kt CO2 equivalent][no source][no method][no target][no option][no type]
type: Concept
definition: 2.B.9.b [Fugitive Emissions][no classification][Emissions][HFCs][kt CO2 equivalent][no source][no method][no target][no option][no type]
status: valid
status modified: 2017-02-13
accepted date: 2017-02-13
in scheme: emissions_variables_MMR

2.B.9.b [Fugitive Emissions][no classification][Emissions][NF3][t][no source][no method][no target][no option][no type]
type: Concept
definition: 2.B.9.b [Fugitive Emissions][no classification][Emissions][NF3][t][no source][no method][no target][no option][no type]
status: valid
status modified: 2017-02-13
accepted date: 2017-02-13
in scheme: emissions_variables_MMR

2.B.9.b [Fugitive Emissions][no classification][Emissions][no gas][kt CO2 equivalent][no source][no method][no target][no option][no type]
type: Concept
definition: 2.B.9.b [Fugitive Emissions][no classification][Emissions][no gas][kt CO2 equivalent][no source][no method][no target][no option][no type]
status: valid
status modified: 2017-02-13
accepted date: 2017-02-13
in scheme: emissions_variables_MMR

2.B.9.b [Fugitive Emissions][no classification][Emissions][PFCs][kt CO2 equivalent][no source][no method][no target][no option][no type]
type: Concept
definition: 2.B.9.b [Fugitive Emissions][no classification][Emissions][PFCs][kt CO2 equivalent][no source][no method][no target][no option][no type]
status: valid
status modified: 2017-02-13
accepted date: 2017-02-13
in scheme: emissions_variables_MMR

2.B.9.b [Fugitive Emissions][no classification][Emissions][SF6][t][no source][no method][no target][no option][no type]
type: Concept
definition: 2.B.9.b [Fugitive Emissions][no classification][Emissions][SF6][t][no source][no method][no target][no option][no type]
status: valid
status modified: 2017-02-13
accepted date: 2017-02-13
in scheme: emissions_variables_MMR

2.B.9.b [Fugitive Emissions][no classification][Emissions][Unspecified mix of HFCs and PFCs][t CO2 equivalent][no source][no method][no target][no option][no type]
type: Concept
definition: 2.B.9.b [Fugitive Emissions][no classification][Emissions][Unspecified mix of HFCs and PFCs][t CO2 equivalent][no source][no method][no target][no option][no type]
status: valid
status modified: 2017-02-13
accepted date: 2017-02-13
in scheme: emissions_variables_MMR

2.B.9.b [Fugitive Emissions][no classification][Emissions][Unspecified mix of HFCs][t CO2 equivalent][no source][no method][no target][no option][no type]
type: Concept
definition: 2.B.9.b [Fugitive Emissions][no classification][Emissions][Unspecified mix of HFCs][t CO2 equivalent][no source][no method][no target][no option][no type]
status: valid
status modified: 2017-02-13
accepted date: 2017-02-13
in scheme: emissions_variables_MMR

2.B.9.b [Fugitive Emissions][no classification][Emissions][Unspecified mix of PFCs][t CO2 equivalent][no source][no method][no target][no option][no type]
type: Concept
definition: 2.B.9.b [Fugitive Emissions][no classification][Emissions][Unspecified mix of PFCs][t CO2 equivalent][no source][no method][no target][no option][no type]
status: valid
status modified: 2017-02-13
accepted date: 2017-02-13
in scheme: emissions_variables_MMR

2.B.9.b.1 [Production of HFC-134a][no classification][Emissions][Aggregate F-gases][t CO2 equivalent][no source][no method][no target][no option][no type]
type: Concept
definition: 2.B.9.b.1 [Production of HFC-134a][no classification][Emissions][Aggregate F-gases][t CO2 equivalent][no source][no method][no target][no option][no type]
status: valid
status modified: 2017-02-13
accepted date: 2017-02-13
in scheme: emissions_variables_MMR

2.B.9.b.1 [Production of HFC-134a][no classification][Emissions][C10F18][t][no source][no method][no target][no option][no type]
type: Concept
definition: 2.B.9.b.1 [Production of HFC-134a][no classification][Emissions][C10F18][t][no source][no method][no target][no option][no type]
status: valid
status modified: 2017-02-13
accepted date: 2017-02-13
in scheme: emissions_variables_MMR

2.B.9.b.1 [Production of HFC-134a][no classification][Emissions][C2F6][t][no source][no method][no target][no option][no type]
type: Concept
definition: 2.B.9.b.1 [Production of HFC-134a][no classification][Emissions][C2F6][t][no source][no method][no target][no option][no type]
status: valid
status modified: 2017-02-13
accepted date: 2017-02-13
in scheme: emissions_variables_MMR

2.B.9.b.1 [Production of HFC-134a][no classification][Emissions][C3F8][t][no source][no method][no target][no option][no type]
type: Concept
definition: 2.B.9.b.1 [Production of HFC-134a][no classification][Emissions][C3F8][t][no source][no method][no target][no option][no type]
status: valid
status modified: 2017-02-13
accepted date: 2017-02-13
in scheme: emissions_variables_MMR

2.B.9.b.1 [Production of HFC-134a][no classification][Emissions][C4F10][t][no source][no method][no target][no option][no type]
type: Concept
definition: 2.B.9.b.1 [Production of HFC-134a][no classification][Emissions][C4F10][t][no source][no method][no target][no option][no type]
status: valid
status modified: 2017-02-13
accepted date: 2017-02-13
in scheme: emissions_variables_MMR

2.B.9.b.1 [Production of HFC-134a][no classification][Emissions][C5F12][t][no source][no method][no target][no option][no type]
type: Concept
definition: 2.B.9.b.1 [Production of HFC-134a][no classification][Emissions][C5F12][t][no source][no method][no target][no option][no type]
status: valid
status modified: 2017-02-13
accepted date: 2017-02-13
in scheme: emissions_variables_MMR

2.B.9.b.1 [Production of HFC-134a][no classification][Emissions][C6F14][t][no source][no method][no target][no option][no type]
type: Concept
definition: 2.B.9.b.1 [Production of HFC-134a][no classification][Emissions][C6F14][t][no source][no method][no target][no option][no type]
status: valid
status modified: 2017-02-13
accepted date: 2017-02-13
in scheme: emissions_variables_MMR

2.B.9.b.1 [Production of HFC-134a][no classification][Emissions][c-C3F6][t][no source][no method][no target][no option][no type]
type: Concept
definition: 2.B.9.b.1 [Production of HFC-134a][no classification][Emissions][c-C3F6][t][no source][no method][no target][no option][no type]
status: valid
status modified: 2017-02-13
accepted date: 2017-02-13
in scheme: emissions_variables_MMR

2.B.9.b.1 [Production of HFC-134a][no classification][Emissions][c-C4F8][t][no source][no method][no target][no option][no type]
type: Concept
definition: 2.B.9.b.1 [Production of HFC-134a][no classification][Emissions][c-C4F8][t][no source][no method][no target][no option][no type]
status: valid
status modified: 2017-02-13
accepted date: 2017-02-13
in scheme: emissions_variables_MMR

2.B.9.b.1 [Production of HFC-134a][no classification][Emissions][CF4][t][no source][no method][no target][no option][no type]
type: Concept
definition: 2.B.9.b.1 [Production of HFC-134a][no classification][Emissions][CF4][t][no source][no method][no target][no option][no type]
status: valid
status modified: 2017-02-13
accepted date: 2017-02-13
in scheme: emissions_variables_MMR

2.B.9.b.1 [Production of HFC-134a][no classification][Emissions][HFC-125][t][no source][no method][no target][no option][no type]
type: Concept
definition: 2.B.9.b.1 [Production of HFC-134a][no classification][Emissions][HFC-125][t][no source][no method][no target][no option][no type]
status: valid
status modified: 2017-02-13
accepted date: 2017-02-13
in scheme: emissions_variables_MMR

2.B.9.b.1 [Production of HFC-134a][no classification][Emissions][HFC-134][t][no source][no method][no target][no option][no type]
type: Concept
definition: 2.B.9.b.1 [Production of HFC-134a][no classification][Emissions][HFC-134][t][no source][no method][no target][no option][no type]
status: valid
status modified: 2017-02-13
accepted date: 2017-02-13
in scheme: emissions_variables_MMR

2.B.9.b.1 [Production of HFC-134a][no classification][Emissions][HFC-134a][t][no source][no method][no target][no option][no type]
type: Concept
definition: 2.B.9.b.1 [Production of HFC-134a][no classification][Emissions][HFC-134a][t][no source][no method][no target][no option][no type]
status: valid
status modified: 2017-02-13
accepted date: 2017-02-13
in scheme: emissions_variables_MMR

2.B.9.b.1 [Production of HFC-134a][no classification][Emissions][HFC-143][t][no source][no method][no target][no option][no type]
type: Concept
definition: 2.B.9.b.1 [Production of HFC-134a][no classification][Emissions][HFC-143][t][no source][no method][no target][no option][no type]
status: valid
status modified: 2017-02-13
accepted date: 2017-02-13
in scheme: emissions_variables_MMR

2.B.9.b.1 [Production of HFC-134a][no classification][Emissions][HFC-143a][t][no source][no method][no target][no option][no type]
type: Concept
definition: 2.B.9.b.1 [Production of HFC-134a][no classification][Emissions][HFC-143a][t][no source][no method][no target][no option][no type]
status: valid
status modified: 2017-02-13
accepted date: 2017-02-13
in scheme: emissions_variables_MMR

2.B.9.b.1 [Production of HFC-134a][no classification][Emissions][HFC-152][t][no source][no method][no target][no option][no type]
type: Concept
definition: 2.B.9.b.1 [Production of HFC-134a][no classification][Emissions][HFC-152][t][no source][no method][no target][no option][no type]
status: valid
status modified: 2017-02-13
accepted date: 2017-02-13
in scheme: emissions_variables_MMR

2.B.9.b.1 [Production of HFC-134a][no classification][Emissions][HFC-152a][t][no source][no method][no target][no option][no type]
type: Concept
definition: 2.B.9.b.1 [Production of HFC-134a][no classification][Emissions][HFC-152a][t][no source][no method][no target][no option][no type]
status: valid
status modified: 2017-02-13
accepted date: 2017-02-13
in scheme: emissions_variables_MMR

2.B.9.b.1 [Production of HFC-134a][no classification][Emissions][HFC-161][t][no source][no method][no target][no option][no type]
type: Concept
definition: 2.B.9.b.1 [Production of HFC-134a][no classification][Emissions][HFC-161][t][no source][no method][no target][no option][no type]
status: valid
status modified: 2017-02-13
accepted date: 2017-02-13
in scheme: emissions_variables_MMR

2.B.9.b.1 [Production of HFC-134a][no classification][Emissions][HFC-227ea][t][no source][no method][no target][no option][no type]
type: Concept
definition: 2.B.9.b.1 [Production of HFC-134a][no classification][Emissions][HFC-227ea][t][no source][no method][no target][no option][no type]
status: valid
status modified: 2017-02-13
accepted date: 2017-02-13
in scheme: emissions_variables_MMR

2.B.9.b.1 [Production of HFC-134a][no classification][Emissions][HFC-23][t][no source][no method][no target][no option][no type]
type: Concept
definition: 2.B.9.b.1 [Production of HFC-134a][no classification][Emissions][HFC-23][t][no source][no method][no target][no option][no type]
status: valid
status modified: 2017-02-13
accepted date: 2017-02-13
in scheme: emissions_variables_MMR

2.B.9.b.1 [Production of HFC-134a][no classification][Emissions][HFC-236cb][t][no source][no method][no target][no option][no type]
type: Concept
definition: 2.B.9.b.1 [Production of HFC-134a][no classification][Emissions][HFC-236cb][t][no source][no method][no target][no option][no type]
status: valid
status modified: 2017-02-13
accepted date: 2017-02-13
in scheme: emissions_variables_MMR

2.B.9.b.1 [Production of HFC-134a][no classification][Emissions][HFC-236ea][t][no source][no method][no target][no option][no type]
type: Concept
definition: 2.B.9.b.1 [Production of HFC-134a][no classification][Emissions][HFC-236ea][t][no source][no method][no target][no option][no type]
status: valid
status modified: 2017-02-13
accepted date: 2017-02-13
in scheme: emissions_variables_MMR

2.B.9.b.1 [Production of HFC-134a][no classification][Emissions][HFC-236fa][t][no source][no method][no target][no option][no type]
type: Concept
definition: 2.B.9.b.1 [Production of HFC-134a][no classification][Emissions][HFC-236fa][t][no source][no method][no target][no option][no type]
status: valid
status modified: 2017-02-13
accepted date: 2017-02-13
in scheme: emissions_variables_MMR

2.B.9.b.1 [Production of HFC-134a][no classification][Emissions][HFC-245ca][t][no source][no method][no target][no option][no type]
type: Concept
definition: 2.B.9.b.1 [Production of HFC-134a][no classification][Emissions][HFC-245ca][t][no source][no method][no target][no option][no type]
status: valid
status modified: 2017-02-13
accepted date: 2017-02-13
in scheme: emissions_variables_MMR

2.B.9.b.1 [Production of HFC-134a][no classification][Emissions][HFC-245fa][t][no source][no method][no target][no option][no type]
type: Concept
definition: 2.B.9.b.1 [Production of HFC-134a][no classification][Emissions][HFC-245fa][t][no source][no method][no target][no option][no type]
status: valid
status modified: 2017-02-13
accepted date: 2017-02-13
in scheme: emissions_variables_MMR

2.B.9.b.1 [Production of HFC-134a][no classification][Emissions][HFC-32][t][no source][no method][no target][no option][no type]
type: Concept
definition: 2.B.9.b.1 [Production of HFC-134a][no classification][Emissions][HFC-32][t][no source][no method][no target][no option][no type]
status: valid
status modified: 2017-02-13
accepted date: 2017-02-13
in scheme: emissions_variables_MMR

2.B.9.b.1 [Production of HFC-134a][no classification][Emissions][HFC-365mfc][t][no source][no method][no target][no option][no type]
type: Concept
definition: 2.B.9.b.1 [Production of HFC-134a][no classification][Emissions][HFC-365mfc][t][no source][no method][no target][no option][no type]
status: valid
status modified: 2017-02-13
accepted date: 2017-02-13
in scheme: emissions_variables_MMR

2.B.9.b.1 [Production of HFC-134a][no classification][Emissions][HFC-41][t][no source][no method][no target][no option][no type]
type: Concept
definition: 2.B.9.b.1 [Production of HFC-134a][no classification][Emissions][HFC-41][t][no source][no method][no target][no option][no type]
status: valid
status modified: 2017-02-13
accepted date: 2017-02-13
in scheme: emissions_variables_MMR

2.B.9.b.1 [Production of HFC-134a][no classification][Emissions][HFC-43-10mee][t][no source][no method][no target][no option][no type]
type: Concept
definition: 2.B.9.b.1 [Production of HFC-134a][no classification][Emissions][HFC-43-10mee][t][no source][no method][no target][no option][no type]
status: valid
status modified: 2017-02-13
accepted date: 2017-02-13
in scheme: emissions_variables_MMR

2.B.9.b.1 [Production of HFC-134a][no classification][Emissions][HFCs][t CO2 equivalent][no source][no method][no target][no option][no type]
type: Concept
definition: 2.B.9.b.1 [Production of HFC-134a][no classification][Emissions][HFCs][t CO2 equivalent][no source][no method][no target][no option][no type]
status: valid
status modified: 2017-02-13
accepted date: 2017-02-13
in scheme: emissions_variables_MMR

2.B.9.b.1 [Production of HFC-134a][no classification][Emissions][NF3][t][no source][no method][no target][no option][no type]
type: Concept
definition: 2.B.9.b.1 [Production of HFC-134a][no classification][Emissions][NF3][t][no source][no method][no target][no option][no type]
status: valid
status modified: 2017-02-13
accepted date: 2017-02-13
in scheme: emissions_variables_MMR

2.B.9.b.1 [Production of HFC-134a][no classification][Emissions][no gas][kt CO2 equivalent][no source][no method][no target][no option][no type]
type: Concept
definition: 2.B.9.b.1 [Production of HFC-134a][no classification][Emissions][no gas][kt CO2 equivalent][no source][no method][no target][no option][no type]
status: valid
status modified: 2017-02-13
accepted date: 2017-02-13
in scheme: emissions_variables_MMR

2.B.9.b.1 [Production of HFC-134a][no classification][Emissions][PFCs][t CO2 equivalent][no source][no method][no target][no option][no type]
type: Concept
definition: 2.B.9.b.1 [Production of HFC-134a][no classification][Emissions][PFCs][t CO2 equivalent][no source][no method][no target][no option][no type]
status: valid
status modified: 2017-02-13
accepted date: 2017-02-13
in scheme: emissions_variables_MMR

2.B.9.b.1 [Production of HFC-134a][no classification][Emissions][SF6][t][no source][no method][no target][no option][no type]
type: Concept
definition: 2.B.9.b.1 [Production of HFC-134a][no classification][Emissions][SF6][t][no source][no method][no target][no option][no type]
status: valid
status modified: 2017-02-13
accepted date: 2017-02-13
in scheme: emissions_variables_MMR

2.B.9.b.1 [Production of HFC-134a][no classification][Emissions][Unspecified mix of HFCs and PFCs][t CO2 equivalent][no source][no method][no target][no option][no type]
type: Concept
definition: 2.B.9.b.1 [Production of HFC-134a][no classification][Emissions][Unspecified mix of HFCs and PFCs][t CO2 equivalent][no source][no method][no target][no option][no type]
status: valid
status modified: 2017-02-13
accepted date: 2017-02-13
in scheme: emissions_variables_MMR

2.B.9.b.1 [Production of HFC-134a][no classification][Emissions][Unspecified mix of HFCs][t CO2 equivalent][no source][no method][no target][no option][no type]
type: Concept
definition: 2.B.9.b.1 [Production of HFC-134a][no classification][Emissions][Unspecified mix of HFCs][t CO2 equivalent][no source][no method][no target][no option][no type]
status: valid
status modified: 2017-02-13
accepted date: 2017-02-13
in scheme: emissions_variables_MMR

2.B.9.b.1 [Production of HFC-134a][no classification][Emissions][Unspecified mix of PFCs][t CO2 equivalent][no source][no method][no target][no option][no type]
type: Concept
definition: 2.B.9.b.1 [Production of HFC-134a][no classification][Emissions][Unspecified mix of PFCs][t CO2 equivalent][no source][no method][no target][no option][no type]
status: valid
status modified: 2017-02-13
accepted date: 2017-02-13
in scheme: emissions_variables_MMR

2.B.9.b.2 [Production of SF6][no classification][Emissions][Aggregate F-gases][t CO2 equivalent][no source][no method][no target][no option][no type]
type: Concept
definition: 2.B.9.b.2 [Production of SF6][no classification][Emissions][Aggregate F-gases][t CO2 equivalent][no source][no method][no target][no option][no type]
status: valid
status modified: 2017-02-13
accepted date: 2017-02-13
in scheme: emissions_variables_MMR

2.B.9.b.2 [Production of SF6][no classification][Emissions][C10F18][t][no source][no method][no target][no option][no type]
type: Concept
definition: 2.B.9.b.2 [Production of SF6][no classification][Emissions][C10F18][t][no source][no method][no target][no option][no type]
status: valid
status modified: 2017-02-13
accepted date: 2017-02-13
in scheme: emissions_variables_MMR

2.B.9.b.2 [Production of SF6][no classification][Emissions][C2F6][t][no source][no method][no target][no option][no type]
type: Concept
definition: 2.B.9.b.2 [Production of SF6][no classification][Emissions][C2F6][t][no source][no method][no target][no option][no type]
status: valid
status modified: 2017-02-13
accepted date: 2017-02-13
in scheme: emissions_variables_MMR

2.B.9.b.2 [Production of SF6][no classification][Emissions][C3F8][t][no source][no method][no target][no option][no type]
type: Concept
definition: 2.B.9.b.2 [Production of SF6][no classification][Emissions][C3F8][t][no source][no method][no target][no option][no type]
status: valid
status modified: 2017-02-13
accepted date: 2017-02-13
in scheme: emissions_variables_MMR

2.B.9.b.2 [Production of SF6][no classification][Emissions][C4F10][t][no source][no method][no target][no option][no type]
type: Concept
definition: 2.B.9.b.2 [Production of SF6][no classification][Emissions][C4F10][t][no source][no method][no target][no option][no type]
status: valid
status modified: 2017-02-13
accepted date: 2017-02-13
in scheme: emissions_variables_MMR

2.B.9.b.2 [Production of SF6][no classification][Emissions][C5F12][t][no source][no method][no target][no option][no type]
type: Concept
definition: 2.B.9.b.2 [Production of SF6][no classification][Emissions][C5F12][t][no source][no method][no target][no option][no type]
status: valid
status modified: 2017-02-13
accepted date: 2017-02-13
in scheme: emissions_variables_MMR

2.B.9.b.2 [Production of SF6][no classification][Emissions][C6F14][t][no source][no method][no target][no option][no type]
type: Concept
definition: 2.B.9.b.2 [Production of SF6][no classification][Emissions][C6F14][t][no source][no method][no target][no option][no type]
status: valid
status modified: 2017-02-13
accepted date: 2017-02-13
in scheme: emissions_variables_MMR

2.B.9.b.2 [Production of SF6][no classification][Emissions][c-C3F6][t][no source][no method][no target][no option][no type]
type: Concept
definition: 2.B.9.b.2 [Production of SF6][no classification][Emissions][c-C3F6][t][no source][no method][no target][no option][no type]
status: valid
status modified: 2017-02-13
accepted date: 2017-02-13
in scheme: emissions_variables_MMR

2.B.9.b.2 [Production of SF6][no classification][Emissions][c-C4F8][t][no source][no method][no target][no option][no type]
type: Concept
definition: 2.B.9.b.2 [Production of SF6][no classification][Emissions][c-C4F8][t][no source][no method][no target][no option][no type]
status: valid
status modified: 2017-02-13
accepted date: 2017-02-13
in scheme: emissions_variables_MMR

2.B.9.b.2 [Production of SF6][no classification][Emissions][CF4][t][no source][no method][no target][no option][no type]
type: Concept
definition: 2.B.9.b.2 [Production of SF6][no classification][Emissions][CF4][t][no source][no method][no target][no option][no type]
status: valid
status modified: 2017-02-13
accepted date: 2017-02-13
in scheme: emissions_variables_MMR

2.B.9.b.2 [Production of SF6][no classification][Emissions][HFC-125][t][no source][no method][no target][no option][no type]
type: Concept
definition: 2.B.9.b.2 [Production of SF6][no classification][Emissions][HFC-125][t][no source][no method][no target][no option][no type]
status: valid
status modified: 2017-02-13
accepted date: 2017-02-13
in scheme: emissions_variables_MMR

2.B.9.b.2 [Production of SF6][no classification][Emissions][HFC-134][t][no source][no method][no target][no option][no type]
type: Concept
definition: 2.B.9.b.2 [Production of SF6][no classification][Emissions][HFC-134][t][no source][no method][no target][no option][no type]
status: valid
status modified: 2017-02-13
accepted date: 2017-02-13
in scheme: emissions_variables_MMR

2.B.9.b.2 [Production of SF6][no classification][Emissions][HFC-134a][t][no source][no method][no target][no option][no type]
type: Concept
definition: 2.B.9.b.2 [Production of SF6][no classification][Emissions][HFC-134a][t][no source][no method][no target][no option][no type]
status: valid
status modified: 2017-02-13
accepted date: 2017-02-13
in scheme: emissions_variables_MMR

2.B.9.b.2 [Production of SF6][no classification][Emissions][HFC-143][t][no source][no method][no target][no option][no type]
type: Concept
definition: 2.B.9.b.2 [Production of SF6][no classification][Emissions][HFC-143][t][no source][no method][no target][no option][no type]
status: valid
status modified: 2017-02-13
accepted date: 2017-02-13
in scheme: emissions_variables_MMR

2.B.9.b.2 [Production of SF6][no classification][Emissions][HFC-143a][t][no source][no method][no target][no option][no type]
type: Concept
definition: 2.B.9.b.2 [Production of SF6][no classification][Emissions][HFC-143a][t][no source][no method][no target][no option][no type]
status: valid
status modified: 2017-02-13
accepted date: 2017-02-13
in scheme: emissions_variables_MMR

2.B.9.b.2 [Production of SF6][no classification][Emissions][HFC-152][t][no source][no method][no target][no option][no type]
type: Concept
definition: 2.B.9.b.2 [Production of SF6][no classification][Emissions][HFC-152][t][no source][no method][no target][no option][no type]
status: valid
status modified: 2017-02-13
accepted date: 2017-02-13
in scheme: emissions_variables_MMR

2.B.9.b.2 [Production of SF6][no classification][Emissions][HFC-152a][t][no source][no method][no target][no option][no type]
type: Concept
definition: 2.B.9.b.2 [Production of SF6][no classification][Emissions][HFC-152a][t][no source][no method][no target][no option][no type]
status: valid
status modified: 2017-02-13
accepted date: 2017-02-13
in scheme: emissions_variables_MMR

2.B.9.b.2 [Production of SF6][no classification][Emissions][HFC-161][t][no source][no method][no target][no option][no type]
type: Concept
definition: 2.B.9.b.2 [Production of SF6][no classification][Emissions][HFC-161][t][no source][no method][no target][no option][no type]
status: valid
status modified: 2017-02-13
accepted date: 2017-02-13
in scheme: emissions_variables_MMR

2.B.9.b.2 [Production of SF6][no classification][Emissions][HFC-227ea][t][no source][no method][no target][no option][no type]
type: Concept
definition: 2.B.9.b.2 [Production of SF6][no classification][Emissions][HFC-227ea][t][no source][no method][no target][no option][no type]
status: valid
status modified: 2017-02-13
accepted date: 2017-02-13
in scheme: emissions_variables_MMR

2.B.9.b.2 [Production of SF6][no classification][Emissions][HFC-23][t][no source][no method][no target][no option][no type]
type: Concept
definition: 2.B.9.b.2 [Production of SF6][no classification][Emissions][HFC-23][t][no source][no method][no target][no option][no type]
status: valid
status modified: 2017-02-13
accepted date: 2017-02-13
in scheme: emissions_variables_MMR

2.B.9.b.2 [Production of SF6][no classification][Emissions][HFC-236cb][t][no source][no method][no target][no option][no type]
type: Concept
definition: 2.B.9.b.2 [Production of SF6][no classification][Emissions][HFC-236cb][t][no source][no method][no target][no option][no type]
status: valid
status modified: 2017-02-13
accepted date: 2017-02-13
in scheme: emissions_variables_MMR

2.B.9.b.2 [Production of SF6][no classification][Emissions][HFC-236ea][t][no source][no method][no target][no option][no type]
type: Concept
definition: 2.B.9.b.2 [Production of SF6][no classification][Emissions][HFC-236ea][t][no source][no method][no target][no option][no type]
status: valid
status modified: 2017-02-13
accepted date: 2017-02-13
in scheme: emissions_variables_MMR

2.B.9.b.2 [Production of SF6][no classification][Emissions][HFC-236fa][t][no source][no method][no target][no option][no type]
type: Concept
definition: 2.B.9.b.2 [Production of SF6][no classification][Emissions][HFC-236fa][t][no source][no method][no target][no option][no type]
status: valid
status modified: 2017-02-13
accepted date: 2017-02-13
in scheme: emissions_variables_MMR

2.B.9.b.2 [Production of SF6][no classification][Emissions][HFC-245ca][t][no source][no method][no target][no option][no type]
type: Concept
definition: 2.B.9.b.2 [Production of SF6][no classification][Emissions][HFC-245ca][t][no source][no method][no target][no option][no type]
status: valid
status modified: 2017-02-13
accepted date: 2017-02-13
in scheme: emissions_variables_MMR

2.B.9.b.2 [Production of SF6][no classification][Emissions][HFC-245fa][t][no source][no method][no target][no option][no type]
type: Concept
definition: 2.B.9.b.2 [Production of SF6][no classification][Emissions][HFC-245fa][t][no source][no method][no target][no option][no type]
status: valid
status modified: 2017-02-13
accepted date: 2017-02-13
in scheme: emissions_variables_MMR

2.B.9.b.2 [Production of SF6][no classification][Emissions][HFC-32][t][no source][no method][no target][no option][no type]
type: Concept
definition: 2.B.9.b.2 [Production of SF6][no classification][Emissions][HFC-32][t][no source][no method][no target][no option][no type]
status: valid
status modified: 2017-02-13
accepted date: 2017-02-13
in scheme: emissions_variables_MMR

2.B.9.b.2 [Production of SF6][no classification][Emissions][HFC-365mfc][t][no source][no method][no target][no option][no type]
type: Concept
definition: 2.B.9.b.2 [Production of SF6][no classification][Emissions][HFC-365mfc][t][no source][no method][no target][no option][no type]
status: valid
status modified: 2017-02-13
accepted date: 2017-02-13
in scheme: emissions_variables_MMR

2.B.9.b.2 [Production of SF6][no classification][Emissions][HFC-41][t][no source][no method][no target][no option][no type]
type: Concept
definition: 2.B.9.b.2 [Production of SF6][no classification][Emissions][HFC-41][t][no source][no method][no target][no option][no type]
status: valid
status modified: 2017-02-13
accepted date: 2017-02-13
in scheme: emissions_variables_MMR

2.B.9.b.2 [Production of SF6][no classification][Emissions][HFC-43-10mee][t][no source][no method][no target][no option][no type]
type: Concept
definition: 2.B.9.b.2 [Production of SF6][no classification][Emissions][HFC-43-10mee][t][no source][no method][no target][no option][no type]
status: valid
status modified: 2017-02-13
accepted date: 2017-02-13
in scheme: emissions_variables_MMR

2.B.9.b.2 [Production of SF6][no classification][Emissions][HFCs][t CO2 equivalent][no source][no method][no target][no option][no type]
type: Concept
definition: 2.B.9.b.2 [Production of SF6][no classification][Emissions][HFCs][t CO2 equivalent][no source][no method][no target][no option][no type]
status: valid
status modified: 2017-02-13
accepted date: 2017-02-13
in scheme: emissions_variables_MMR

2.B.9.b.2 [Production of SF6][no classification][Emissions][NF3][t][no source][no method][no target][no option][no type]
type: Concept
definition: 2.B.9.b.2 [Production of SF6][no classification][Emissions][NF3][t][no source][no method][no target][no option][no type]
status: valid
status modified: 2017-02-13
accepted date: 2017-02-13
in scheme: emissions_variables_MMR

2.B.9.b.2 [Production of SF6][no classification][Emissions][no gas][kt CO2 equivalent][no source][no method][no target][no option][no type]
type: Concept
definition: 2.B.9.b.2 [Production of SF6][no classification][Emissions][no gas][kt CO2 equivalent][no source][no method][no target][no option][no type]
status: valid
status modified: 2017-02-13
accepted date: 2017-02-13
in scheme: emissions_variables_MMR

2.B.9.b.2 [Production of SF6][no classification][Emissions][PFCs][t CO2 equivalent][no source][no method][no target][no option][no type]
type: Concept
definition: 2.B.9.b.2 [Production of SF6][no classification][Emissions][PFCs][t CO2 equivalent][no source][no method][no target][no option][no type]
status: valid
status modified: 2017-02-13
accepted date: 2017-02-13
in scheme: emissions_variables_MMR

2.B.9.b.2 [Production of SF6][no classification][Emissions][SF6][t][no source][no method][no target][no option][no type]
type: Concept
definition: 2.B.9.b.2 [Production of SF6][no classification][Emissions][SF6][t][no source][no method][no target][no option][no type]
status: valid
status modified: 2017-02-13
accepted date: 2017-02-13
in scheme: emissions_variables_MMR

2.B.9.b.2 [Production of SF6][no classification][Emissions][Unspecified mix of HFCs and PFCs][t CO2 equivalent][no source][no method][no target][no option][no type]
type: Concept
definition: 2.B.9.b.2 [Production of SF6][no classification][Emissions][Unspecified mix of HFCs and PFCs][t CO2 equivalent][no source][no method][no target][no option][no type]
status: valid
status modified: 2017-02-13
accepted date: 2017-02-13
in scheme: emissions_variables_MMR

2.B.9.b.2 [Production of SF6][no classification][Emissions][Unspecified mix of HFCs][t CO2 equivalent][no source][no method][no target][no option][no type]
type: Concept
definition: 2.B.9.b.2 [Production of SF6][no classification][Emissions][Unspecified mix of HFCs][t CO2 equivalent][no source][no method][no target][no option][no type]
status: valid
status modified: 2017-02-13
accepted date: 2017-02-13
in scheme: emissions_variables_MMR

2.B.9.b.2 [Production of SF6][no classification][Emissions][Unspecified mix of PFCs][t CO2 equivalent][no source][no method][no target][no option][no type]
type: Concept
definition: 2.B.9.b.2 [Production of SF6][no classification][Emissions][Unspecified mix of PFCs][t CO2 equivalent][no source][no method][no target][no option][no type]
status: valid
status modified: 2017-02-13
accepted date: 2017-02-13
in scheme: emissions_variables_MMR

2.B.9.b.3 [Other fugitive emission][no classification][Emissions][Aggregate F-gases][t CO2 equivalent][no source][no method][no target][no option][no type]
type: Concept
definition: 2.B.9.b.3 [Other fugitive emission][no classification][Emissions][Aggregate F-gases][t CO2 equivalent][no source][no method][no target][no option][no type]
status: valid
status modified: 2017-02-13
accepted date: 2017-02-13
in scheme: emissions_variables_MMR

2.B.9.b.3 [Other fugitive emission][no classification][Emissions][C10F18][t][no source][no method][no target][no option][no type]
type: Concept
definition: 2.B.9.b.3 [Other fugitive emission][no classification][Emissions][C10F18][t][no source][no method][no target][no option][no type]
status: valid
status modified: 2017-02-13
accepted date: 2017-02-13
in scheme: emissions_variables_MMR

2.B.9.b.3 [Other fugitive emission][no classification][Emissions][C2F6][t][no source][no method][no target][no option][no type]
type: Concept
definition: 2.B.9.b.3 [Other fugitive emission][no classification][Emissions][C2F6][t][no source][no method][no target][no option][no type]
status: valid
status modified: 2017-02-13
accepted date: 2017-02-13
in scheme: emissions_variables_MMR

2.B.9.b.3 [Other fugitive emission][no classification][Emissions][C3F8][t][no source][no method][no target][no option][no type]
type: Concept
definition: 2.B.9.b.3 [Other fugitive emission][no classification][Emissions][C3F8][t][no source][no method][no target][no option][no type]
status: valid
status modified: 2017-02-13
accepted date: 2017-02-13
in scheme: emissions_variables_MMR

2.B.9.b.3 [Other fugitive emission][no classification][Emissions][C4F10][t][no source][no method][no target][no option][no type]
type: Concept
definition: 2.B.9.b.3 [Other fugitive emission][no classification][Emissions][C4F10][t][no source][no method][no target][no option][no type]
status: valid
status modified: 2017-02-13
accepted date: 2017-02-13
in scheme: emissions_variables_MMR

2.B.9.b.3 [Other fugitive emission][no classification][Emissions][C5F12][t][no source][no method][no target][no option][no type]
type: Concept
definition: 2.B.9.b.3 [Other fugitive emission][no classification][Emissions][C5F12][t][no source][no method][no target][no option][no type]
status: valid
status modified: 2017-02-13
accepted date: 2017-02-13
in scheme: emissions_variables_MMR

2.B.9.b.3 [Other fugitive emission][no classification][Emissions][C6F14][t][no source][no method][no target][no option][no type]
type: Concept
definition: 2.B.9.b.3 [Other fugitive emission][no classification][Emissions][C6F14][t][no source][no method][no target][no option][no type]
status: valid
status modified: 2017-02-13
accepted date: 2017-02-13
in scheme: emissions_variables_MMR

2.B.9.b.3 [Other fugitive emission][no classification][Emissions][c-C3F6][t][no source][no method][no target][no option][no type]
type: Concept
definition: 2.B.9.b.3 [Other fugitive emission][no classification][Emissions][c-C3F6][t][no source][no method][no target][no option][no type]
status: valid
status modified: 2017-02-13
accepted date: 2017-02-13
in scheme: emissions_variables_MMR

2.B.9.b.3 [Other fugitive emission][no classification][Emissions][c-C4F8][t][no source][no method][no target][no option][no type]
type: Concept
definition: 2.B.9.b.3 [Other fugitive emission][no classification][Emissions][c-C4F8][t][no source][no method][no target][no option][no type]
status: valid
status modified: 2017-02-13
accepted date: 2017-02-13
in scheme: emissions_variables_MMR

2.B.9.b.3 [Other fugitive emission][no classification][Emissions][CF4][t][no source][no method][no target][no option][no type]
type: Concept
definition: 2.B.9.b.3 [Other fugitive emission][no classification][Emissions][CF4][t][no source][no method][no target][no option][no type]
status: valid
status modified: 2017-02-13
accepted date: 2017-02-13
in scheme: emissions_variables_MMR

2.B.9.b.3 [Other fugitive emission][no classification][Emissions][HFC-125][t][no source][no method][no target][no option][no type]
type: Concept
definition: 2.B.9.b.3 [Other fugitive emission][no classification][Emissions][HFC-125][t][no source][no method][no target][no option][no type]
status: valid
status modified: 2017-02-13
accepted date: 2017-02-13
in scheme: emissions_variables_MMR

2.B.9.b.3 [Other fugitive emission][no classification][Emissions][HFC-134][t][no source][no method][no target][no option][no type]
type: Concept
definition: 2.B.9.b.3 [Other fugitive emission][no classification][Emissions][HFC-134][t][no source][no method][no target][no option][no type]
status: valid
status modified: 2017-02-13
accepted date: 2017-02-13
in scheme: emissions_variables_MMR

2.B.9.b.3 [Other fugitive emission][no classification][Emissions][HFC-134a][t][no source][no method][no target][no option][no type]
type: Concept
definition: 2.B.9.b.3 [Other fugitive emission][no classification][Emissions][HFC-134a][t][no source][no method][no target][no option][no type]
status: valid
status modified: 2017-02-13
accepted date: 2017-02-13
in scheme: emissions_variables_MMR

2.B.9.b.3 [Other fugitive emission][no classification][Emissions][HFC-143][t][no source][no method][no target][no option][no type]
type: Concept
definition: 2.B.9.b.3 [Other fugitive emission][no classification][Emissions][HFC-143][t][no source][no method][no target][no option][no type]
status: valid
status modified: 2017-02-13
accepted date: 2017-02-13
in scheme: emissions_variables_MMR

2.B.9.b.3 [Other fugitive emission][no classification][Emissions][HFC-143a][t][no source][no method][no target][no option][no type]
type: Concept
definition: 2.B.9.b.3 [Other fugitive emission][no classification][Emissions][HFC-143a][t][no source][no method][no target][no option][no type]
status: valid
status modified: 2017-02-13
accepted date: 2017-02-13
in scheme: emissions_variables_MMR

2.B.9.b.3 [Other fugitive emission][no classification][Emissions][HFC-152][t][no source][no method][no target][no option][no type]
type: Concept
definition: 2.B.9.b.3 [Other fugitive emission][no classification][Emissions][HFC-152][t][no source][no method][no target][no option][no type]
status: valid
status modified: 2017-02-13
accepted date: 2017-02-13
in scheme: emissions_variables_MMR

2.B.9.b.3 [Other fugitive emission][no classification][Emissions][HFC-152a][t][no source][no method][no target][no option][no type]
type: Concept
definition: 2.B.9.b.3 [Other fugitive emission][no classification][Emissions][HFC-152a][t][no source][no method][no target][no option][no type]
status: valid
status modified: 2017-02-13
accepted date: 2017-02-13
in scheme: emissions_variables_MMR

2.B.9.b.3 [Other fugitive emission][no classification][Emissions][HFC-161][t][no source][no method][no target][no option][no type]
type: Concept
definition: 2.B.9.b.3 [Other fugitive emission][no classification][Emissions][HFC-161][t][no source][no method][no target][no option][no type]
status: valid
status modified: 2017-02-13
accepted date: 2017-02-13
in scheme: emissions_variables_MMR

2.B.9.b.3 [Other fugitive emission][no classification][Emissions][HFC-227ea][t][no source][no method][no target][no option][no type]
type: Concept
definition: 2.B.9.b.3 [Other fugitive emission][no classification][Emissions][HFC-227ea][t][no source][no method][no target][no option][no type]
status: valid
status modified: 2017-02-13
accepted date: 2017-02-13
in scheme: emissions_variables_MMR

2.B.9.b.3 [Other fugitive emission][no classification][Emissions][HFC-23][t][no source][no method][no target][no option][no type]
type: Concept
definition: 2.B.9.b.3 [Other fugitive emission][no classification][Emissions][HFC-23][t][no source][no method][no target][no option][no type]
status: valid
status modified: 2017-02-13
accepted date: 2017-02-13
in scheme: emissions_variables_MMR

2.B.9.b.3 [Other fugitive emission][no classification][Emissions][HFC-236cb][t][no source][no method][no target][no option][no type]
type: Concept
definition: 2.B.9.b.3 [Other fugitive emission][no classification][Emissions][HFC-236cb][t][no source][no method][no target][no option][no type]
status: valid
status modified: 2017-02-13
accepted date: 2017-02-13
in scheme: emissions_variables_MMR

2.B.9.b.3 [Other fugitive emission][no classification][Emissions][HFC-236ea][t][no source][no method][no target][no option][no type]
type: Concept
definition: 2.B.9.b.3 [Other fugitive emission][no classification][Emissions][HFC-236ea][t][no source][no method][no target][no option][no type]
status: valid
status modified: 2017-02-13
accepted date: 2017-02-13
in scheme: emissions_variables_MMR

2.B.9.b.3 [Other fugitive emission][no classification][Emissions][HFC-236fa][t][no source][no method][no target][no option][no type]
type: Concept
definition: 2.B.9.b.3 [Other fugitive emission][no classification][Emissions][HFC-236fa][t][no source][no method][no target][no option][no type]
status: valid
status modified: 2017-02-13
accepted date: 2017-02-13
in scheme: emissions_variables_MMR

2.B.9.b.3 [Other fugitive emission][no classification][Emissions][HFC-245ca][t][no source][no method][no target][no option][no type]
type: Concept
definition: 2.B.9.b.3 [Other fugitive emission][no classification][Emissions][HFC-245ca][t][no source][no method][no target][no option][no type]
status: valid
status modified: 2017-02-13
accepted date: 2017-02-13
in scheme: emissions_variables_MMR

2.B.9.b.3 [Other fugitive emission][no classification][Emissions][HFC-245fa][t][no source][no method][no target][no option][no type]
type: Concept
definition: 2.B.9.b.3 [Other fugitive emission][no classification][Emissions][HFC-245fa][t][no source][no method][no target][no option][no type]
status: valid
status modified: 2017-02-13
accepted date: 2017-02-13
in scheme: emissions_variables_MMR

2.B.9.b.3 [Other fugitive emission][no classification][Emissions][HFC-32][t][no source][no method][no target][no option][no type]
type: Concept
definition: 2.B.9.b.3 [Other fugitive emission][no classification][Emissions][HFC-32][t][no source][no method][no target][no option][no type]
status: valid
status modified: 2017-02-13
accepted date: 2017-02-13
in scheme: emissions_variables_MMR

2.B.9.b.3 [Other fugitive emission][no classification][Emissions][HFC-365mfc][t][no source][no method][no target][no option][no type]
type: Concept
definition: 2.B.9.b.3 [Other fugitive emission][no classification][Emissions][HFC-365mfc][t][no source][no method][no target][no option][no type]
status: valid
status modified: 2017-02-13
accepted date: 2017-02-13
in scheme: emissions_variables_MMR

2.B.9.b.3 [Other fugitive emission][no classification][Emissions][HFC-41][t][no source][no method][no target][no option][no type]
type: Concept
definition: 2.B.9.b.3 [Other fugitive emission][no classification][Emissions][HFC-41][t][no source][no method][no target][no option][no type]
status: valid
status modified: 2017-02-13
accepted date: 2017-02-13
in scheme: emissions_variables_MMR

2.B.9.b.3 [Other fugitive emission][no classification][Emissions][HFC-43-10mee][t][no source][no method][no target][no option][no type]
type: Concept
definition: 2.B.9.b.3 [Other fugitive emission][no classification][Emissions][HFC-43-10mee][t][no source][no method][no target][no option][no type]
status: valid
status modified: 2017-02-13
accepted date: 2017-02-13
in scheme: emissions_variables_MMR

2.B.9.b.3 [Other fugitive emission][no classification][Emissions][HFCs][kt CO2 equivalent][no source][no method][no target][no option][no type]
type: Concept
definition: 2.B.9.b.3 [Other fugitive emission][no classification][Emissions][HFCs][kt CO2 equivalent][no source][no method][no target][no option][no type]
status: valid
status modified: 2017-02-13
accepted date: 2017-02-13
in scheme: emissions_variables_MMR

2.B.9.b.3 [Other fugitive emission][no classification][Emissions][NF3][t][no source][no method][no target][no option][no type]
type: Concept
definition: 2.B.9.b.3 [Other fugitive emission][no classification][Emissions][NF3][t][no source][no method][no target][no option][no type]
status: valid
status modified: 2017-02-13
accepted date: 2017-02-13
in scheme: emissions_variables_MMR

2.B.9.b.3 [Other fugitive emission][no classification][Emissions][no gas][kt CO2 equivalent][no source][no method][no target][no option][no type]
type: Concept
definition: 2.B.9.b.3 [Other fugitive emission][no classification][Emissions][no gas][kt CO2 equivalent][no source][no method][no target][no option][no type]
status: valid
status modified: 2017-02-13
accepted date: 2017-02-13
in scheme: emissions_variables_MMR

2.B.9.b.3 [Other fugitive emission][no classification][Emissions][PFCs][kt CO2 equivalent][no source][no method][no target][no option][no type]
type: Concept
definition: 2.B.9.b.3 [Other fugitive emission][no classification][Emissions][PFCs][kt CO2 equivalent][no source][no method][no target][no option][no type]
status: valid
status modified: 2017-02-13
accepted date: 2017-02-13
in scheme: emissions_variables_MMR

2.B.9.b.3 [Other fugitive emission][no classification][Emissions][SF6][t][no source][no method][no target][no option][no type]
type: Concept
definition: 2.B.9.b.3 [Other fugitive emission][no classification][Emissions][SF6][t][no source][no method][no target][no option][no type]
status: valid
status modified: 2017-02-13
accepted date: 2017-02-13
in scheme: emissions_variables_MMR

2.B.9.b.3 [Other fugitive emission][no classification][Emissions][Unspecified mix of HFCs and PFCs][t CO2 equivalent][no source][no method][no target][no option][no type]
type: Concept
definition: 2.B.9.b.3 [Other fugitive emission][no classification][Emissions][Unspecified mix of HFCs and PFCs][t CO2 equivalent][no source][no method][no target][no option][no type]
status: valid
status modified: 2017-02-13
accepted date: 2017-02-13
in scheme: emissions_variables_MMR

2.B.9.b.3 [Other fugitive emission][no classification][Emissions][Unspecified mix of HFCs][t CO2 equivalent][no source][no method][no target][no option][no type]
type: Concept
definition: 2.B.9.b.3 [Other fugitive emission][no classification][Emissions][Unspecified mix of HFCs][t CO2 equivalent][no source][no method][no target][no option][no type]
status: valid
status modified: 2017-02-13
accepted date: 2017-02-13
in scheme: emissions_variables_MMR

2.B.9.b.3 [Other fugitive emission][no classification][Emissions][Unspecified mix of PFCs][t CO2 equivalent][no source][no method][no target][no option][no type]
type: Concept
definition: 2.B.9.b.3 [Other fugitive emission][no classification][Emissions][Unspecified mix of PFCs][t CO2 equivalent][no source][no method][no target][no option][no type]
status: valid
status modified: 2017-02-13
accepted date: 2017-02-13
in scheme: emissions_variables_MMR

2.C [Metal Industry][no classification][Emissions][Aggregate F-gases][t CO2 equivalent][no source][no method][no target][no option][no type]
type: Concept
definition: 2.C [Metal Industry][no classification][Emissions][Aggregate F-gases][t CO2 equivalent][no source][no method][no target][no option][no type]
status: valid
status modified: 2017-02-13
accepted date: 2017-02-13
in scheme: emissions_variables_MMR

2.C [Metal Industry][no classification][Emissions][Aggregate GHGs][kt CO2 equivalent][no source][no method][no target][no option][no type]
type: Concept
definition: 2.C [Metal Industry][no classification][Emissions][Aggregate GHGs][kt CO2 equivalent][no source][no method][no target][no option][no type]
status: valid
status modified: 2017-02-13
accepted date: 2017-02-13
in scheme: emissions_variables_MMR

2.C [Metal Industry][no classification][Emissions][C10F18][t][no source][no method][no target][no option][no type]
type: Concept
definition: 2.C [Metal Industry][no classification][Emissions][C10F18][t][no source][no method][no target][no option][no type]
status: valid
status modified: 2017-02-13
accepted date: 2017-02-13
in scheme: emissions_variables_MMR

2.C [Metal Industry][no classification][Emissions][C2F6][t][no source][no method][no target][no option][no type]
type: Concept
definition: 2.C [Metal Industry][no classification][Emissions][C2F6][t][no source][no method][no target][no option][no type]
status: valid
status modified: 2017-02-13
accepted date: 2017-02-13
in scheme: emissions_variables_MMR

2.C [Metal Industry][no classification][Emissions][C3F8][t][no source][no method][no target][no option][no type]
type: Concept
definition: 2.C [Metal Industry][no classification][Emissions][C3F8][t][no source][no method][no target][no option][no type]
status: valid
status modified: 2017-02-13
accepted date: 2017-02-13
in scheme: emissions_variables_MMR

2.C [Metal Industry][no classification][Emissions][C4F10][t][no source][no method][no target][no option][no type]
type: Concept
definition: 2.C [Metal Industry][no classification][Emissions][C4F10][t][no source][no method][no target][no option][no type]
status: valid
status modified: 2017-02-13
accepted date: 2017-02-13
in scheme: emissions_variables_MMR

2.C [Metal Industry][no classification][Emissions][C5F12][t][no source][no method][no target][no option][no type]
type: Concept
definition: 2.C [Metal Industry][no classification][Emissions][C5F12][t][no source][no method][no target][no option][no type]
status: valid
status modified: 2017-02-13
accepted date: 2017-02-13
in scheme: emissions_variables_MMR

2.C [Metal Industry][no classification][Emissions][C6F14][t][no source][no method][no target][no option][no type]
type: Concept
definition: 2.C [Metal Industry][no classification][Emissions][C6F14][t][no source][no method][no target][no option][no type]
status: valid
status modified: 2017-02-13
accepted date: 2017-02-13
in scheme: emissions_variables_MMR

2.C [Metal Industry][no classification][Emissions][c-C3F6][t][no source][no method][no target][no option][no type]
type: Concept
definition: 2.C [Metal Industry][no classification][Emissions][c-C3F6][t][no source][no method][no target][no option][no type]
status: valid
status modified: 2017-02-13
accepted date: 2017-02-13
in scheme: emissions_variables_MMR

2.C [Metal Industry][no classification][Emissions][c-C4F8][t][no source][no method][no target][no option][no type]
type: Concept
definition: 2.C [Metal Industry][no classification][Emissions][c-C4F8][t][no source][no method][no target][no option][no type]
status: valid
status modified: 2017-02-13
accepted date: 2017-02-13
in scheme: emissions_variables_MMR

2.C [Metal Industry][no classification][Emissions][CF4][t][no source][no method][no target][no option][no type]
type: Concept
definition: 2.C [Metal Industry][no classification][Emissions][CF4][t][no source][no method][no target][no option][no type]
status: valid
status modified: 2017-02-13
accepted date: 2017-02-13
in scheme: emissions_variables_MMR

2.C [Metal Industry][no classification][Emissions][CH4][kt][no source][no method][no target][no option][no type]
type: Concept
definition: 2.C [Metal Industry][no classification][Emissions][CH4][kt][no source][no method][no target][no option][no type]
status: valid
status modified: 2017-02-13
accepted date: 2017-02-13
in scheme: emissions_variables_MMR

2.C [Metal Industry][no classification][Emissions][CO][kt][no source][no method][no target][no option][no type]
type: Concept
definition: 2.C [Metal Industry][no classification][Emissions][CO][kt][no source][no method][no target][no option][no type]
status: valid
status modified: 2017-02-13
accepted date: 2017-02-13
in scheme: emissions_variables_MMR

2.C [Metal Industry][no classification][Emissions][CO2][kt][no source][no method][no target][no option][no type]
type: Concept
definition: 2.C [Metal Industry][no classification][Emissions][CO2][kt][no source][no method][no target][no option][no type]
status: valid
status modified: 2017-02-13
accepted date: 2017-02-13
in scheme: emissions_variables_MMR

2.C [Metal Industry][no classification][Emissions][HFC-125][t][no source][no method][no target][no option][no type]
type: Concept
definition: 2.C [Metal Industry][no classification][Emissions][HFC-125][t][no source][no method][no target][no option][no type]
status: valid
status modified: 2017-02-13
accepted date: 2017-02-13
in scheme: emissions_variables_MMR

2.C [Metal Industry][no classification][Emissions][HFC-134][t][no source][no method][no target][no option][no type]
type: Concept
definition: 2.C [Metal Industry][no classification][Emissions][HFC-134][t][no source][no method][no target][no option][no type]
status: valid
status modified: 2017-02-13
accepted date: 2017-02-13
in scheme: emissions_variables_MMR

2.C [Metal Industry][no classification][Emissions][HFC-134a][t][no source][no method][no target][no option][no type]
type: Concept
definition: 2.C [Metal Industry][no classification][Emissions][HFC-134a][t][no source][no method][no target][no option][no type]
status: valid
status modified: 2017-02-13
accepted date: 2017-02-13
in scheme: emissions_variables_MMR

2.C [Metal Industry][no classification][Emissions][HFC-143][t][no source][no method][no target][no option][no type]
type: Concept
definition: 2.C [Metal Industry][no classification][Emissions][HFC-143][t][no source][no method][no target][no option][no type]
status: valid
status modified: 2017-02-13
accepted date: 2017-02-13
in scheme: emissions_variables_MMR

2.C [Metal Industry][no classification][Emissions][HFC-143a][t][no source][no method][no target][no option][no type]
type: Concept
definition: 2.C [Metal Industry][no classification][Emissions][HFC-143a][t][no source][no method][no target][no option][no type]
status: valid
status modified: 2017-02-13
accepted date: 2017-02-13
in scheme: emissions_variables_MMR

2.C [Metal Industry][no classification][Emissions][HFC-152][t][no source][no method][no target][no option][no type]
type: Concept
definition: 2.C [Metal Industry][no classification][Emissions][HFC-152][t][no source][no method][no target][no option][no type]
status: valid
status modified: 2017-02-13
accepted date: 2017-02-13
in scheme: emissions_variables_MMR

2.C [Metal Industry][no classification][Emissions][HFC-152a][t][no source][no method][no target][no option][no type]
type: Concept
definition: 2.C [Metal Industry][no classification][Emissions][HFC-152a][t][no source][no method][no target][no option][no type]
status: valid
status modified: 2017-02-13
accepted date: 2017-02-13
in scheme: emissions_variables_MMR

2.C [Metal Industry][no classification][Emissions][HFC-161][t][no source][no method][no target][no option][no type]
type: Concept
definition: 2.C [Metal Industry][no classification][Emissions][HFC-161][t][no source][no method][no target][no option][no type]
status: valid
status modified: 2017-02-13
accepted date: 2017-02-13
in scheme: emissions_variables_MMR

2.C [Metal Industry][no classification][Emissions][HFC-227ea][t][no source][no method][no target][no option][no type]
type: Concept
definition: 2.C [Metal Industry][no classification][Emissions][HFC-227ea][t][no source][no method][no target][no option][no type]
status: valid
status modified: 2017-02-13
accepted date: 2017-02-13
in scheme: emissions_variables_MMR

2.C [Metal Industry][no classification][Emissions][HFC-23][t][no source][no method][no target][no option][no type]
type: Concept
definition: 2.C [Metal Industry][no classification][Emissions][HFC-23][t][no source][no method][no target][no option][no type]
status: valid
status modified: 2017-02-13
accepted date: 2017-02-13
in scheme: emissions_variables_MMR

2.C [Metal Industry][no classification][Emissions][HFC-236cb][t][no source][no method][no target][no option][no type]
type: Concept
definition: 2.C [Metal Industry][no classification][Emissions][HFC-236cb][t][no source][no method][no target][no option][no type]
status: valid
status modified: 2017-02-13
accepted date: 2017-02-13
in scheme: emissions_variables_MMR

2.C [Metal Industry][no classification][Emissions][HFC-236ea][t][no source][no method][no target][no option][no type]
type: Concept
definition: 2.C [Metal Industry][no classification][Emissions][HFC-236ea][t][no source][no method][no target][no option][no type]
status: valid
status modified: 2017-02-13
accepted date: 2017-02-13
in scheme: emissions_variables_MMR

2.C [Metal Industry][no classification][Emissions][HFC-236fa][t][no source][no method][no target][no option][no type]
type: Concept
definition: 2.C [Metal Industry][no classification][Emissions][HFC-236fa][t][no source][no method][no target][no option][no type]
status: valid
status modified: 2017-02-13
accepted date: 2017-02-13
in scheme: emissions_variables_MMR

2.C [Metal Industry][no classification][Emissions][HFC-245ca][t][no source][no method][no target][no option][no type]
type: Concept
definition: 2.C [Metal Industry][no classification][Emissions][HFC-245ca][t][no source][no method][no target][no option][no type]
status: valid
status modified: 2017-02-13
accepted date: 2017-02-13
in scheme: emissions_variables_MMR

2.C [Metal Industry][no classification][Emissions][HFC-245fa][t][no source][no method][no target][no option][no type]
type: Concept
definition: 2.C [Metal Industry][no classification][Emissions][HFC-245fa][t][no source][no method][no target][no option][no type]
status: valid
status modified: 2017-02-13
accepted date: 2017-02-13
in scheme: emissions_variables_MMR

2.C [Metal Industry][no classification][Emissions][HFC-32][t][no source][no method][no target][no option][no type]
type: Concept
definition: 2.C [Metal Industry][no classification][Emissions][HFC-32][t][no source][no method][no target][no option][no type]
status: valid
status modified: 2017-02-13
accepted date: 2017-02-13
in scheme: emissions_variables_MMR

2.C [Metal Industry][no classification][Emissions][HFC-365mfc][t][no source][no method][no target][no option][no type]
type: Concept
definition: 2.C [Metal Industry][no classification][Emissions][HFC-365mfc][t][no source][no method][no target][no option][no type]
status: valid
status modified: 2017-02-13
accepted date: 2017-02-13
in scheme: emissions_variables_MMR

2.C [Metal Industry][no classification][Emissions][HFC-41][t][no source][no method][no target][no option][no type]
type: Concept
definition: 2.C [Metal Industry][no classification][Emissions][HFC-41][t][no source][no method][no target][no option][no type]
status: valid
status modified: 2017-02-13
accepted date: 2017-02-13
in scheme: emissions_variables_MMR

2.C [Metal Industry][no classification][Emissions][HFC-43-10mee][t][no source][no method][no target][no option][no type]
type: Concept
definition: 2.C [Metal Industry][no classification][Emissions][HFC-43-10mee][t][no source][no method][no target][no option][no type]
status: valid
status modified: 2017-02-13
accepted date: 2017-02-13
in scheme: emissions_variables_MMR

2.C [Metal Industry][no classification][Emissions][HFCs][t CO2 equivalent][no source][no method][no target][no option][no type]
type: Concept
definition: 2.C [Metal Industry][no classification][Emissions][HFCs][t CO2 equivalent][no source][no method][no target][no option][no type]
status: valid
status modified: 2017-02-13
accepted date: 2017-02-13
in scheme: emissions_variables_MMR

2.C [Metal Industry][no classification][Emissions][N2O][kt][no source][no method][no target][no option][no type]
type: Concept
definition: 2.C [Metal Industry][no classification][Emissions][N2O][kt][no source][no method][no target][no option][no type]
status: valid
status modified: 2017-02-13
accepted date: 2017-02-13
in scheme: emissions_variables_MMR

2.C [Metal Industry][no classification][Emissions][NF3][kt][no source][no method][no target][no option][no type]
type: Concept
definition: 2.C [Metal Industry][no classification][Emissions][NF3][kt][no source][no method][no target][no option][no type]
status: valid
status modified: 2017-02-13
accepted date: 2017-02-13
in scheme: emissions_variables_MMR

2.C [Metal Industry][no classification][Emissions][NMVOC][kt][no source][no method][no target][no option][no type]
type: Concept
definition: 2.C [Metal Industry][no classification][Emissions][NMVOC][kt][no source][no method][no target][no option][no type]
status: valid
status modified: 2017-02-13
accepted date: 2017-02-13
in scheme: emissions_variables_MMR

2.C [Metal Industry][no classification][Emissions][NOx][kt][no source][no method][no target][no option][no type]
type: Concept
definition: 2.C [Metal Industry][no classification][Emissions][NOx][kt][no source][no method][no target][no option][no type]
status: valid
status modified: 2017-02-13
accepted date: 2017-02-13
in scheme: emissions_variables_MMR

2.C [Metal Industry][no classification][Emissions][PFCs][t CO2 equivalent][no source][no method][no target][no option][no type]
type: Concept
definition: 2.C [Metal Industry][no classification][Emissions][PFCs][t CO2 equivalent][no source][no method][no target][no option][no type]
status: valid
status modified: 2017-02-13
accepted date: 2017-02-13
in scheme: emissions_variables_MMR

2.C [Metal Industry][no classification][Emissions][SF6][kt][no source][no method][no target][no option][no type]
type: Concept
definition: 2.C [Metal Industry][no classification][Emissions][SF6][kt][no source][no method][no target][no option][no type]
status: valid
status modified: 2017-02-13
accepted date: 2017-02-13
in scheme: emissions_variables_MMR

2.C [Metal Industry][no classification][Emissions][SO2][kt][no source][no method][no target][no option][no type]
type: Concept
definition: 2.C [Metal Industry][no classification][Emissions][SO2][kt][no source][no method][no target][no option][no type]
status: valid
status modified: 2017-02-13
accepted date: 2017-02-13
in scheme: emissions_variables_MMR

2.C [Metal Industry][no classification][Emissions][Unspecified mix of HFCs and PFCs][t CO2 equivalent][no source][no method][no target][no option][no type]
type: Concept
definition: 2.C [Metal Industry][no classification][Emissions][Unspecified mix of HFCs and PFCs][t CO2 equivalent][no source][no method][no target][no option][no type]
status: valid
status modified: 2017-02-13
accepted date: 2017-02-13
in scheme: emissions_variables_MMR

2.C [Metal Industry][no classification][Emissions][Unspecified mix of HFCs][t CO2 equivalent][no source][no method][no target][no option][no type]
type: Concept
definition: 2.C [Metal Industry][no classification][Emissions][Unspecified mix of HFCs][t CO2 equivalent][no source][no method][no target][no option][no type]
status: valid
status modified: 2017-02-13
accepted date: 2017-02-13
in scheme: emissions_variables_MMR

2.C [Metal Industry][no classification][Emissions][Unspecified mix of PFCs][t CO2 equivalent][no source][no method][no target][no option][no type]
type: Concept
definition: 2.C [Metal Industry][no classification][Emissions][Unspecified mix of PFCs][t CO2 equivalent][no source][no method][no target][no option][no type]
status: valid
status modified: 2017-02-13
accepted date: 2017-02-13
in scheme: emissions_variables_MMR

2.C.1 [Iron and Steel Production][no classification][Emissions][CH4][kt][no source][no method][no target][no option][no type]
type: Concept
definition: 2.C.1 [Iron and Steel Production][no classification][Emissions][CH4][kt][no source][no method][no target][no option][no type]
status: valid
status modified: 2017-02-13
accepted date: 2017-02-13
in scheme: emissions_variables_MMR

2.C.1 [Iron and Steel Production][no classification][Emissions][CO][kt][no source][no method][no target][no option][no type]
type: Concept
definition: 2.C.1 [Iron and Steel Production][no classification][Emissions][CO][kt][no source][no method][no target][no option][no type]
status: valid
status modified: 2017-02-13
accepted date: 2017-02-13
in scheme: emissions_variables_MMR

2.C.1 [Iron and Steel Production][no classification][Emissions][CO2][kt][no source][no method][no target][no option][no type]
type: Concept
definition: 2.C.1 [Iron and Steel Production][no classification][Emissions][CO2][kt][no source][no method][no target][no option][no type]
status: valid
status modified: 2017-02-13
accepted date: 2017-02-13
in scheme: emissions_variables_MMR

2.C.1 [Iron and Steel Production][no classification][Emissions][NMVOC][kt][no source][no method][no target][no option][no type]
type: Concept
definition: 2.C.1 [Iron and Steel Production][no classification][Emissions][NMVOC][kt][no source][no method][no target][no option][no type]
status: valid
status modified: 2017-02-13
accepted date: 2017-02-13
in scheme: emissions_variables_MMR

2.C.1 [Iron and Steel Production][no classification][Emissions][NOx][kt][no source][no method][no target][no option][no type]
type: Concept
definition: 2.C.1 [Iron and Steel Production][no classification][Emissions][NOx][kt][no source][no method][no target][no option][no type]
status: valid
status modified: 2017-02-13
accepted date: 2017-02-13
in scheme: emissions_variables_MMR

2.C.1 [Iron and Steel Production][no classification][Emissions][SO2][kt][no source][no method][no target][no option][no type]
type: Concept
definition: 2.C.1 [Iron and Steel Production][no classification][Emissions][SO2][kt][no source][no method][no target][no option][no type]
status: valid
status modified: 2017-02-13
accepted date: 2017-02-13
in scheme: emissions_variables_MMR

2.C.1.a [Steel][no classification][Emissions][CH4][kt][no source][no method][no target][no option][no type]
type: Concept
definition: 2.C.1.a [Steel][no classification][Emissions][CH4][kt][no source][no method][no target][no option][no type]
status: valid
status modified: 2017-02-13
accepted date: 2017-02-13
in scheme: emissions_variables_MMR

2.C.1.a [Steel][no classification][Emissions][CO2][kt][no source][no method][no target][no option][no type]
type: Concept
definition: 2.C.1.a [Steel][no classification][Emissions][CO2][kt][no source][no method][no target][no option][no type]
status: valid
status modified: 2017-02-13
accepted date: 2017-02-13
in scheme: emissions_variables_MMR

2.C.1.b [Pig Iron][no classification][Emissions][CH4][kt][no source][no method][no target][no option][no type]
type: Concept
definition: 2.C.1.b [Pig Iron][no classification][Emissions][CH4][kt][no source][no method][no target][no option][no type]
status: valid
status modified: 2017-02-13
accepted date: 2017-02-13
in scheme: emissions_variables_MMR

2.C.1.b [Pig Iron][no classification][Emissions][CO2][kt][no source][no method][no target][no option][no type]
type: Concept
definition: 2.C.1.b [Pig Iron][no classification][Emissions][CO2][kt][no source][no method][no target][no option][no type]
status: valid
status modified: 2017-02-13
accepted date: 2017-02-13
in scheme: emissions_variables_MMR

2.C.1.c [Direct Reduced Iron][no classification][Emissions][CH4][kt][no source][no method][no target][no option][no type]
type: Concept
definition: 2.C.1.c [Direct Reduced Iron][no classification][Emissions][CH4][kt][no source][no method][no target][no option][no type]
status: valid
status modified: 2017-02-13
accepted date: 2017-02-13
in scheme: emissions_variables_MMR

2.C.1.c [Direct Reduced Iron][no classification][Emissions][CO2][kt][no source][no method][no target][no option][no type]
type: Concept
definition: 2.C.1.c [Direct Reduced Iron][no classification][Emissions][CO2][kt][no source][no method][no target][no option][no type]
status: valid
status modified: 2017-02-13
accepted date: 2017-02-13
in scheme: emissions_variables_MMR

2.C.1.d [Sinter][no classification][Emissions][CH4][kt][no source][no method][no target][no option][no type]
type: Concept
definition: 2.C.1.d [Sinter][no classification][Emissions][CH4][kt][no source][no method][no target][no option][no type]
status: valid
status modified: 2017-02-13
accepted date: 2017-02-13
in scheme: emissions_variables_MMR

2.C.1.d [Sinter][no classification][Emissions][CO2][kt][no source][no method][no target][no option][no type]
type: Concept
definition: 2.C.1.d [Sinter][no classification][Emissions][CO2][kt][no source][no method][no target][no option][no type]
status: valid
status modified: 2017-02-13
accepted date: 2017-02-13
in scheme: emissions_variables_MMR

2.C.1.e [Pellet][no classification][Emissions][CH4][kt][no source][no method][no target][no option][no type]
type: Concept
definition: 2.C.1.e [Pellet][no classification][Emissions][CH4][kt][no source][no method][no target][no option][no type]
status: valid
status modified: 2017-02-13
accepted date: 2017-02-13
in scheme: emissions_variables_MMR

2.C.1.e [Pellet][no classification][Emissions][CO2][kt][no source][no method][no target][no option][no type]
type: Concept
definition: 2.C.1.e [Pellet][no classification][Emissions][CO2][kt][no source][no method][no target][no option][no type]
status: valid
status modified: 2017-02-13
accepted date: 2017-02-13
in scheme: emissions_variables_MMR

2.C.1.f [Other Iron and Steel Production][no classification][Emissions][CH4][kt][no source][no method][no target][no option][no type]
type: Concept
definition: 2.C.1.f [Other Iron and Steel Production][no classification][Emissions][CH4][kt][no source][no method][no target][no option][no type]
status: valid
status modified: 2017-02-13
accepted date: 2017-02-13
in scheme: emissions_variables_MMR

2.C.1.f [Other Iron and Steel Production][no classification][Emissions][CO2][kt][no source][no method][no target][no option][no type]
type: Concept
definition: 2.C.1.f [Other Iron and Steel Production][no classification][Emissions][CO2][kt][no source][no method][no target][no option][no type]
status: valid
status modified: 2017-02-13
accepted date: 2017-02-13
in scheme: emissions_variables_MMR

2.C.2 [Ferroalloys Production][no classification][Emissions][CH4][kt][no source][no method][no target][no option][no type]
type: Concept
definition: 2.C.2 [Ferroalloys Production][no classification][Emissions][CH4][kt][no source][no method][no target][no option][no type]
status: valid
status modified: 2017-02-13
accepted date: 2017-02-13
in scheme: emissions_variables_MMR

2.C.2 [Ferroalloys Production][no classification][Emissions][CO][kt][no source][no method][no target][no option][no type]
type: Concept
definition: 2.C.2 [Ferroalloys Production][no classification][Emissions][CO][kt][no source][no method][no target][no option][no type]
status: valid
status modified: 2017-02-13
accepted date: 2017-02-13
in scheme: emissions_variables_MMR

2.C.2 [Ferroalloys Production][no classification][Emissions][CO2][kt][no source][no method][no target][no option][no type]
type: Concept
definition: 2.C.2 [Ferroalloys Production][no classification][Emissions][CO2][kt][no source][no method][no target][no option][no type]
status: valid
status modified: 2017-02-13
accepted date: 2017-02-13
in scheme: emissions_variables_MMR

2.C.2 [Ferroalloys Production][no classification][Emissions][NMVOC][kt][no source][no method][no target][no option][no type]
type: Concept
definition: 2.C.2 [Ferroalloys Production][no classification][Emissions][NMVOC][kt][no source][no method][no target][no option][no type]
status: valid
status modified: 2017-02-13
accepted date: 2017-02-13
in scheme: emissions_variables_MMR

2.C.2 [Ferroalloys Production][no classification][Emissions][NOx][kt][no source][no method][no target][no option][no type]
type: Concept
definition: 2.C.2 [Ferroalloys Production][no classification][Emissions][NOx][kt][no source][no method][no target][no option][no type]
status: valid
status modified: 2017-02-13
accepted date: 2017-02-13
in scheme: emissions_variables_MMR

2.C.2 [Ferroalloys Production][no classification][Emissions][SO2][kt][no source][no method][no target][no option][no type]
type: Concept
definition: 2.C.2 [Ferroalloys Production][no classification][Emissions][SO2][kt][no source][no method][no target][no option][no type]
status: valid
status modified: 2017-02-13
accepted date: 2017-02-13
in scheme: emissions_variables_MMR

2.C.3 [Aluminium Production][no classification][Emissions][C10F18][t][no source][no method][no target][no option][no type]
type: Concept
definition: 2.C.3 [Aluminium Production][no classification][Emissions][C10F18][t][no source][no method][no target][no option][no type]
status: valid
status modified: 2017-02-13
accepted date: 2017-02-13
in scheme: emissions_variables_MMR

2.C.3 [Aluminium Production][no classification][Emissions][C2F6][t][no source][no method][no target][no option][no type]
type: Concept
definition: 2.C.3 [Aluminium Production][no classification][Emissions][C2F6][t][no source][no method][no target][no option][no type]
status: valid
status modified: 2017-02-13
accepted date: 2017-02-13
in scheme: emissions_variables_MMR

2.C.3 [Aluminium Production][no classification][Emissions][C3F8][t][no source][no method][no target][no option][no type]
type: Concept
definition: 2.C.3 [Aluminium Production][no classification][Emissions][C3F8][t][no source][no method][no target][no option][no type]
status: valid
status modified: 2017-02-13
accepted date: 2017-02-13
in scheme: emissions_variables_MMR

2.C.3 [Aluminium Production][no classification][Emissions][C4F10][t][no source][no method][no target][no option][no type]
type: Concept
definition: 2.C.3 [Aluminium Production][no classification][Emissions][C4F10][t][no source][no method][no target][no option][no type]
status: valid
status modified: 2017-02-13
accepted date: 2017-02-13
in scheme: emissions_variables_MMR

2.C.3 [Aluminium Production][no classification][Emissions][C5F12][t][no source][no method][no target][no option][no type]
type: Concept
definition: 2.C.3 [Aluminium Production][no classification][Emissions][C5F12][t][no source][no method][no target][no option][no type]
status: valid
status modified: 2017-02-13
accepted date: 2017-02-13
in scheme: emissions_variables_MMR

2.C.3 [Aluminium Production][no classification][Emissions][C6F14][t][no source][no method][no target][no option][no type]
type: Concept
definition: 2.C.3 [Aluminium Production][no classification][Emissions][C6F14][t][no source][no method][no target][no option][no type]
status: valid
status modified: 2017-02-13
accepted date: 2017-02-13
in scheme: emissions_variables_MMR

2.C.3 [Aluminium Production][no classification][Emissions][c-C3F6][t][no source][no method][no target][no option][no type]
type: Concept
definition: 2.C.3 [Aluminium Production][no classification][Emissions][c-C3F6][t][no source][no method][no target][no option][no type]
status: valid
status modified: 2017-02-13
accepted date: 2017-02-13
in scheme: emissions_variables_MMR

2.C.3 [Aluminium Production][no classification][Emissions][c-C4F8][t][no source][no method][no target][no option][no type]
type: Concept
definition: 2.C.3 [Aluminium Production][no classification][Emissions][c-C4F8][t][no source][no method][no target][no option][no type]
status: valid
status modified: 2017-02-13
accepted date: 2017-02-13
in scheme: emissions_variables_MMR

2.C.3 [Aluminium Production][no classification][Emissions][CF4][t][no source][no method][no target][no option][no type]
type: Concept
definition: 2.C.3 [Aluminium Production][no classification][Emissions][CF4][t][no source][no method][no target][no option][no type]
status: valid
status modified: 2017-02-13
accepted date: 2017-02-13
in scheme: emissions_variables_MMR

2.C.3 [Aluminium Production][no classification][Emissions][CO][kt][no source][no method][no target][no option][no type]
type: Concept
definition: 2.C.3 [Aluminium Production][no classification][Emissions][CO][kt][no source][no method][no target][no option][no type]
status: valid
status modified: 2017-02-13
accepted date: 2017-02-13
in scheme: emissions_variables_MMR

2.C.3 [Aluminium Production][no classification][Emissions][CO2][kt][no source][no method][no target][no option][no type]
type: Concept
definition: 2.C.3 [Aluminium Production][no classification][Emissions][CO2][kt][no source][no method][no target][no option][no type]
status: valid
status modified: 2017-02-13
accepted date: 2017-02-13
in scheme: emissions_variables_MMR

2.C.3 [Aluminium Production][no classification][Emissions][NMVOC][kt][no source][no method][no target][no option][no type]
type: Concept
definition: 2.C.3 [Aluminium Production][no classification][Emissions][NMVOC][kt][no source][no method][no target][no option][no type]
status: valid
status modified: 2017-02-13
accepted date: 2017-02-13
in scheme: emissions_variables_MMR

2.C.3 [Aluminium Production][no classification][Emissions][NOx][kt][no source][no method][no target][no option][no type]
type: Concept
definition: 2.C.3 [Aluminium Production][no classification][Emissions][NOx][kt][no source][no method][no target][no option][no type]
status: valid
status modified: 2017-02-13
accepted date: 2017-02-13
in scheme: emissions_variables_MMR

2.C.3 [Aluminium Production][no classification][Emissions][PFCs][kt CO2 equivalent][no source][no method][no target][no option][no type]
type: Concept
definition: 2.C.3 [Aluminium Production][no classification][Emissions][PFCs][kt CO2 equivalent][no source][no method][no target][no option][no type]
status: valid
status modified: 2017-02-13
accepted date: 2017-02-13
in scheme: emissions_variables_MMR

2.C.3 [Aluminium Production][no classification][Emissions][SF6][t][no source][no method][no target][no option][no type]
type: Concept
definition: 2.C.3 [Aluminium Production][no classification][Emissions][SF6][t][no source][no method][no target][no option][no type]
status: valid
status modified: 2017-02-13
accepted date: 2017-02-13
in scheme: emissions_variables_MMR

2.C.3 [Aluminium Production][no classification][Emissions][SO2][kt][no source][no method][no target][no option][no type]
type: Concept
definition: 2.C.3 [Aluminium Production][no classification][Emissions][SO2][kt][no source][no method][no target][no option][no type]
status: valid
status modified: 2017-02-13
accepted date: 2017-02-13
in scheme: emissions_variables_MMR

2.C.3 [Aluminium Production][no classification][Emissions][Unspecified mix of PFCs][kt CO2 equivalent][no source][no method][no target][no option][no type]
type: Concept
definition: 2.C.3 [Aluminium Production][no classification][Emissions][Unspecified mix of PFCs][kt CO2 equivalent][no source][no method][no target][no option][no type]
status: valid
status modified: 2017-02-13
accepted date: 2017-02-13
in scheme: emissions_variables_MMR

2.C.3.a [CO2 Emissions][no classification][Emissions][CO2][kt][no source][no method][no target][no option][no type]
type: Concept
definition: 2.C.3.a [CO2 Emissions][no classification][Emissions][CO2][kt][no source][no method][no target][no option][no type]
status: valid
status modified: 2017-02-13
accepted date: 2017-02-13
in scheme: emissions_variables_MMR

2.C.3.b [By-Product Production][no classification][Emissions][C10F18][t][no source][no method][no target][no option][no type]
type: Concept
definition: 2.C.3.b [By-Product Production][no classification][Emissions][C10F18][t][no source][no method][no target][no option][no type]
status: valid
status modified: 2017-02-13
accepted date: 2017-02-13
in scheme: emissions_variables_MMR

2.C.3.b [By-Product Production][no classification][Emissions][C2F6][t][no source][no method][no target][no option][no type]
type: Concept
definition: 2.C.3.b [By-Product Production][no classification][Emissions][C2F6][t][no source][no method][no target][no option][no type]
status: valid
status modified: 2017-02-13
accepted date: 2017-02-13
in scheme: emissions_variables_MMR

2.C.3.b [By-Product Production][no classification][Emissions][C3F8][t][no source][no method][no target][no option][no type]
type: Concept
definition: 2.C.3.b [By-Product Production][no classification][Emissions][C3F8][t][no source][no method][no target][no option][no type]
status: valid
status modified: 2017-02-13
accepted date: 2017-02-13
in scheme: emissions_variables_MMR

2.C.3.b [By-Product Production][no classification][Emissions][C4F10][t][no source][no method][no target][no option][no type]
type: Concept
definition: 2.C.3.b [By-Product Production][no classification][Emissions][C4F10][t][no source][no method][no target][no option][no type]
status: valid
status modified: 2017-02-13
accepted date: 2017-02-13
in scheme: emissions_variables_MMR

2.C.3.b [By-Product Production][no classification][Emissions][C5F12][t][no source][no method][no target][no option][no type]
type: Concept
definition: 2.C.3.b [By-Product Production][no classification][Emissions][C5F12][t][no source][no method][no target][no option][no type]
status: valid
status modified: 2017-02-13
accepted date: 2017-02-13
in scheme: emissions_variables_MMR

2.C.3.b [By-Product Production][no classification][Emissions][C6F14][t][no source][no method][no target][no option][no type]
type: Concept
definition: 2.C.3.b [By-Product Production][no classification][Emissions][C6F14][t][no source][no method][no target][no option][no type]
status: valid
status modified: 2017-02-13
accepted date: 2017-02-13
in scheme: emissions_variables_MMR

2.C.3.b [By-Product Production][no classification][Emissions][c-C3F6][t][no source][no method][no target][no option][no type]
type: Concept
definition: 2.C.3.b [By-Product Production][no classification][Emissions][c-C3F6][t][no source][no method][no target][no option][no type]
status: valid
status modified: 2017-02-13
accepted date: 2017-02-13
in scheme: emissions_variables_MMR

2.C.3.b [By-Product Production][no classification][Emissions][c-C4F8][t][no source][no method][no target][no option][no type]
type: Concept
definition: 2.C.3.b [By-Product Production][no classification][Emissions][c-C4F8][t][no source][no method][no target][no option][no type]
status: valid
status modified: 2017-02-13
accepted date: 2017-02-13
in scheme: emissions_variables_MMR

2.C.3.b [By-Product Production][no classification][Emissions][CF4][t][no source][no method][no target][no option][no type]
type: Concept
definition: 2.C.3.b [By-Product Production][no classification][Emissions][CF4][t][no source][no method][no target][no option][no type]
status: valid
status modified: 2017-02-13
accepted date: 2017-02-13
in scheme: emissions_variables_MMR

2.C.3.b [By-Product Production][no classification][Emissions][PFCs][t CO2 equivalent][no source][no method][no target][no option][no type]
type: Concept
definition: 2.C.3.b [By-Product Production][no classification][Emissions][PFCs][t CO2 equivalent][no source][no method][no target][no option][no type]
status: valid
status modified: 2017-02-13
accepted date: 2017-02-13
in scheme: emissions_variables_MMR

2.C.3.b [By-Product Production][no classification][Emissions][SF6][t][no source][no method][no target][no option][no type]
type: Concept
definition: 2.C.3.b [By-Product Production][no classification][Emissions][SF6][t][no source][no method][no target][no option][no type]
status: valid
status modified: 2017-02-13
accepted date: 2017-02-13
in scheme: emissions_variables_MMR

2.C.3.b [By-Product Production][no classification][Emissions][Unspecified mix of HFCs and PFCs][t CO2 equivalent][no source][no method][no target][no option][no type]
type: Concept
definition: 2.C.3.b [By-Product Production][no classification][Emissions][Unspecified mix of HFCs and PFCs][t CO2 equivalent][no source][no method][no target][no option][no type]
status: valid
status modified: 2017-02-13
accepted date: 2017-02-13
in scheme: emissions_variables_MMR

2.C.3.b [By-Product Production][no classification][Emissions][Unspecified mix of PFCs][t CO2 equivalent][no source][no method][no target][no option][no type]
type: Concept
definition: 2.C.3.b [By-Product Production][no classification][Emissions][Unspecified mix of PFCs][t CO2 equivalent][no source][no method][no target][no option][no type]
status: valid
status modified: 2017-02-13
accepted date: 2017-02-13
in scheme: emissions_variables_MMR

2.C.3.c [F-gases used in foundries][no classification][Emissions][C10F18][t][no source][no method][no target][no option][no type]
type: Concept
definition: 2.C.3.c [F-gases used in foundries][no classification][Emissions][C10F18][t][no source][no method][no target][no option][no type]
status: valid
status modified: 2017-02-13
accepted date: 2017-02-13
in scheme: emissions_variables_MMR

2.C.3.c [F-gases used in foundries][no classification][Emissions][C2F6][t][no source][no method][no target][no option][no type]
type: Concept
definition: 2.C.3.c [F-gases used in foundries][no classification][Emissions][C2F6][t][no source][no method][no target][no option][no type]
status: valid
status modified: 2017-02-13
accepted date: 2017-02-13
in scheme: emissions_variables_MMR

2.C.3.c [F-gases used in foundries][no classification][Emissions][C3F8][t][no source][no method][no target][no option][no type]
type: Concept
definition: 2.C.3.c [F-gases used in foundries][no classification][Emissions][C3F8][t][no source][no method][no target][no option][no type]
status: valid
status modified: 2017-02-13
accepted date: 2017-02-13
in scheme: emissions_variables_MMR

2.C.3.c [F-gases used in foundries][no classification][Emissions][C4F10][t][no source][no method][no target][no option][no type]
type: Concept
definition: 2.C.3.c [F-gases used in foundries][no classification][Emissions][C4F10][t][no source][no method][no target][no option][no type]
status: valid
status modified: 2017-02-13
accepted date: 2017-02-13
in scheme: emissions_variables_MMR

2.C.3.c [F-gases used in foundries][no classification][Emissions][C5F12][t][no source][no method][no target][no option][no type]
type: Concept
definition: 2.C.3.c [F-gases used in foundries][no classification][Emissions][C5F12][t][no source][no method][no target][no option][no type]
status: valid
status modified: 2017-02-13
accepted date: 2017-02-13
in scheme: emissions_variables_MMR

2.C.3.c [F-gases used in foundries][no classification][Emissions][C6F14][t][no source][no method][no target][no option][no type]
type: Concept
definition: 2.C.3.c [F-gases used in foundries][no classification][Emissions][C6F14][t][no source][no method][no target][no option][no type]
status: valid
status modified: 2017-02-13
accepted date: 2017-02-13
in scheme: emissions_variables_MMR

2.C.3.c [F-gases used in foundries][no classification][Emissions][c-C3F6][t][no source][no method][no target][no option][no type]
type: Concept
definition: 2.C.3.c [F-gases used in foundries][no classification][Emissions][c-C3F6][t][no source][no method][no target][no option][no type]
status: valid
status modified: 2017-02-13
accepted date: 2017-02-13
in scheme: emissions_variables_MMR

2.C.3.c [F-gases used in foundries][no classification][Emissions][c-C4F8][t][no source][no method][no target][no option][no type]
type: Concept
definition: 2.C.3.c [F-gases used in foundries][no classification][Emissions][c-C4F8][t][no source][no method][no target][no option][no type]
status: valid
status modified: 2017-02-13
accepted date: 2017-02-13
in scheme: emissions_variables_MMR

2.C.3.c [F-gases used in foundries][no classification][Emissions][CF4][t][no source][no method][no target][no option][no type]
type: Concept
definition: 2.C.3.c [F-gases used in foundries][no classification][Emissions][CF4][t][no source][no method][no target][no option][no type]
status: valid
status modified: 2017-02-13
accepted date: 2017-02-13
in scheme: emissions_variables_MMR

2.C.3.c [F-gases used in foundries][no classification][Emissions][PFCs][t CO2 equivalent][no source][no method][no target][no option][no type]
type: Concept
definition: 2.C.3.c [F-gases used in foundries][no classification][Emissions][PFCs][t CO2 equivalent][no source][no method][no target][no option][no type]
status: valid
status modified: 2017-02-13
accepted date: 2017-02-13
in scheme: emissions_variables_MMR

2.C.3.c [F-gases used in foundries][no classification][Emissions][SF6][t][no source][no method][no target][no option][no type]
type: Concept
definition: 2.C.3.c [F-gases used in foundries][no classification][Emissions][SF6][t][no source][no method][no target][no option][no type]
status: valid
status modified: 2017-02-13
accepted date: 2017-02-13
in scheme: emissions_variables_MMR

2.C.3.c [F-gases used in foundries][no classification][Emissions][Unspecified mix of HFCs and PFCs][t CO2 equivalent][no source][no method][no target][no option][no type]
type: Concept
definition: 2.C.3.c [F-gases used in foundries][no classification][Emissions][Unspecified mix of HFCs and PFCs][t CO2 equivalent][no source][no method][no target][no option][no type]
status: valid
status modified: 2017-02-13
accepted date: 2017-02-13
in scheme: emissions_variables_MMR

2.C.3.c [F-gases used in foundries][no classification][Emissions][Unspecified mix of PFCs][t CO2 equivalent][no source][no method][no target][no option][no type]
type: Concept
definition: 2.C.3.c [F-gases used in foundries][no classification][Emissions][Unspecified mix of PFCs][t CO2 equivalent][no source][no method][no target][no option][no type]
status: valid
status modified: 2017-02-13
accepted date: 2017-02-13
in scheme: emissions_variables_MMR

2.C.4 [Magnesium Production][no classification][Emissions][C10F18][t][no source][no method][no target][no option][no type]
type: Concept
definition: 2.C.4 [Magnesium Production][no classification][Emissions][C10F18][t][no source][no method][no target][no option][no type]
status: valid
status modified: 2017-02-13
accepted date: 2017-02-13
in scheme: emissions_variables_MMR

2.C.4 [Magnesium Production][no classification][Emissions][C2F6][t][no source][no method][no target][no option][no type]
type: Concept
definition: 2.C.4 [Magnesium Production][no classification][Emissions][C2F6][t][no source][no method][no target][no option][no type]
status: valid
status modified: 2017-02-13
accepted date: 2017-02-13
in scheme: emissions_variables_MMR

2.C.4 [Magnesium Production][no classification][Emissions][C3F8][t][no source][no method][no target][no option][no type]
type: Concept
definition: 2.C.4 [Magnesium Production][no classification][Emissions][C3F8][t][no source][no method][no target][no option][no type]
status: valid
status modified: 2017-02-13
accepted date: 2017-02-13
in scheme: emissions_variables_MMR

2.C.4 [Magnesium Production][no classification][Emissions][C4F10][t][no source][no method][no target][no option][no type]
type: Concept
definition: 2.C.4 [Magnesium Production][no classification][Emissions][C4F10][t][no source][no method][no target][no option][no type]
status: valid
status modified: 2017-02-13
accepted date: 2017-02-13
in scheme: emissions_variables_MMR

2.C.4 [Magnesium Production][no classification][Emissions][C5F12][t][no source][no method][no target][no option][no type]
type: Concept
definition: 2.C.4 [Magnesium Production][no classification][Emissions][C5F12][t][no source][no method][no target][no option][no type]
status: valid
status modified: 2017-02-13
accepted date: 2017-02-13
in scheme: emissions_variables_MMR

2.C.4 [Magnesium Production][no classification][Emissions][C6F14][t][no source][no method][no target][no option][no type]
type: Concept
definition: 2.C.4 [Magnesium Production][no classification][Emissions][C6F14][t][no source][no method][no target][no option][no type]
status: valid
status modified: 2017-02-13
accepted date: 2017-02-13
in scheme: emissions_variables_MMR

2.C.4 [Magnesium Production][no classification][Emissions][c-C3F6][t][no source][no method][no target][no option][no type]
type: Concept
definition: 2.C.4 [Magnesium Production][no classification][Emissions][c-C3F6][t][no source][no method][no target][no option][no type]
status: valid
status modified: 2017-02-13
accepted date: 2017-02-13
in scheme: emissions_variables_MMR

2.C.4 [Magnesium Production][no classification][Emissions][c-C4F8][t][no source][no method][no target][no option][no type]
type: Concept
definition: 2.C.4 [Magnesium Production][no classification][Emissions][c-C4F8][t][no source][no method][no target][no option][no type]
status: valid
status modified: 2017-02-13
accepted date: 2017-02-13
in scheme: emissions_variables_MMR

2.C.4 [Magnesium Production][no classification][Emissions][CF4][t][no source][no method][no target][no option][no type]
type: Concept
definition: 2.C.4 [Magnesium Production][no classification][Emissions][CF4][t][no source][no method][no target][no option][no type]
status: valid
status modified: 2017-02-13
accepted date: 2017-02-13
in scheme: emissions_variables_MMR

2.C.4 [Magnesium Production][no classification][Emissions][CO][kt][no source][no method][no target][no option][no type]
type: Concept
definition: 2.C.4 [Magnesium Production][no classification][Emissions][CO][kt][no source][no method][no target][no option][no type]
status: valid
status modified: 2017-02-13
accepted date: 2017-02-13
in scheme: emissions_variables_MMR

2.C.4 [Magnesium Production][no classification][Emissions][CO2][kt][no source][no method][no target][no option][no type]
type: Concept
definition: 2.C.4 [Magnesium Production][no classification][Emissions][CO2][kt][no source][no method][no target][no option][no type]
status: valid
status modified: 2017-02-13
accepted date: 2017-02-13
in scheme: emissions_variables_MMR

2.C.4 [Magnesium Production][no classification][Emissions][HFC-125][t][no source][no method][no target][no option][no type]
type: Concept
definition: 2.C.4 [Magnesium Production][no classification][Emissions][HFC-125][t][no source][no method][no target][no option][no type]
status: valid
status modified: 2017-02-13
accepted date: 2017-02-13
in scheme: emissions_variables_MMR

2.C.4 [Magnesium Production][no classification][Emissions][HFC-134][t][no source][no method][no target][no option][no type]
type: Concept
definition: 2.C.4 [Magnesium Production][no classification][Emissions][HFC-134][t][no source][no method][no target][no option][no type]
status: valid
status modified: 2017-02-13
accepted date: 2017-02-13
in scheme: emissions_variables_MMR

2.C.4 [Magnesium Production][no classification][Emissions][HFC-134a][t][no source][no method][no target][no option][no type]
type: Concept
definition: 2.C.4 [Magnesium Production][no classification][Emissions][HFC-134a][t][no source][no method][no target][no option][no type]
status: valid
status modified: 2017-02-13
accepted date: 2017-02-13
in scheme: emissions_variables_MMR

2.C.4 [Magnesium Production][no classification][Emissions][HFC-143][t][no source][no method][no target][no option][no type]
type: Concept
definition: 2.C.4 [Magnesium Production][no classification][Emissions][HFC-143][t][no source][no method][no target][no option][no type]
status: valid
status modified: 2017-02-13
accepted date: 2017-02-13
in scheme: emissions_variables_MMR

2.C.4 [Magnesium Production][no classification][Emissions][HFC-143a][t][no source][no method][no target][no option][no type]
type: Concept
definition: 2.C.4 [Magnesium Production][no classification][Emissions][HFC-143a][t][no source][no method][no target][no option][no type]
status: valid
status modified: 2017-02-13
accepted date: 2017-02-13
in scheme: emissions_variables_MMR

2.C.4 [Magnesium Production][no classification][Emissions][HFC-152][t][no source][no method][no target][no option][no type]
type: Concept
definition: 2.C.4 [Magnesium Production][no classification][Emissions][HFC-152][t][no source][no method][no target][no option][no type]
status: valid
status modified: 2017-02-13
accepted date: 2017-02-13
in scheme: emissions_variables_MMR

2.C.4 [Magnesium Production][no classification][Emissions][HFC-152a][t][no source][no method][no target][no option][no type]
type: Concept
definition: 2.C.4 [Magnesium Production][no classification][Emissions][HFC-152a][t][no source][no method][no target][no option][no type]
status: valid
status modified: 2017-02-13
accepted date: 2017-02-13
in scheme: emissions_variables_MMR

2.C.4 [Magnesium Production][no classification][Emissions][HFC-161][t][no source][no method][no target][no option][no type]
type: Concept
definition: 2.C.4 [Magnesium Production][no classification][Emissions][HFC-161][t][no source][no method][no target][no option][no type]
status: valid
status modified: 2017-02-13
accepted date: 2017-02-13
in scheme: emissions_variables_MMR

2.C.4 [Magnesium Production][no classification][Emissions][HFC-227ea][t][no source][no method][no target][no option][no type]
type: Concept
definition: 2.C.4 [Magnesium Production][no classification][Emissions][HFC-227ea][t][no source][no method][no target][no option][no type]
status: valid
status modified: 2017-02-13
accepted date: 2017-02-13
in scheme: emissions_variables_MMR

2.C.4 [Magnesium Production][no classification][Emissions][HFC-23][t][no source][no method][no target][no option][no type]
type: Concept
definition: 2.C.4 [Magnesium Production][no classification][Emissions][HFC-23][t][no source][no method][no target][no option][no type]
status: valid
status modified: 2017-02-13
accepted date: 2017-02-13
in scheme: emissions_variables_MMR

2.C.4 [Magnesium Production][no classification][Emissions][HFC-236cb][t][no source][no method][no target][no option][no type]
type: Concept
definition: 2.C.4 [Magnesium Production][no classification][Emissions][HFC-236cb][t][no source][no method][no target][no option][no type]
status: valid
status modified: 2017-02-13
accepted date: 2017-02-13
in scheme: emissions_variables_MMR

2.C.4 [Magnesium Production][no classification][Emissions][HFC-236ea][t][no source][no method][no target][no option][no type]
type: Concept
definition: 2.C.4 [Magnesium Production][no classification][Emissions][HFC-236ea][t][no source][no method][no target][no option][no type]
status: valid
status modified: 2017-02-13
accepted date: 2017-02-13
in scheme: emissions_variables_MMR

2.C.4 [Magnesium Production][no classification][Emissions][HFC-236fa][t][no source][no method][no target][no option][no type]
type: Concept
definition: 2.C.4 [Magnesium Production][no classification][Emissions][HFC-236fa][t][no source][no method][no target][no option][no type]
status: valid
status modified: 2017-02-13
accepted date: 2017-02-13
in scheme: emissions_variables_MMR

2.C.4 [Magnesium Production][no classification][Emissions][HFC-245ca][t][no source][no method][no target][no option][no type]
type: Concept
definition: 2.C.4 [Magnesium Production][no classification][Emissions][HFC-245ca][t][no source][no method][no target][no option][no type]
status: valid
status modified: 2017-02-13
accepted date: 2017-02-13
in scheme: emissions_variables_MMR

2.C.4 [Magnesium Production][no classification][Emissions][HFC-245fa][t][no source][no method][no target][no option][no type]
type: Concept
definition: 2.C.4 [Magnesium Production][no classification][Emissions][HFC-245fa][t][no source][no method][no target][no option][no type]
status: valid
status modified: 2017-02-13
accepted date: 2017-02-13
in scheme: emissions_variables_MMR

2.C.4 [Magnesium Production][no classification][Emissions][HFC-32][t][no source][no method][no target][no option][no type]
type: Concept
definition: 2.C.4 [Magnesium Production][no classification][Emissions][HFC-32][t][no source][no method][no target][no option][no type]
status: valid
status modified: 2017-02-13
accepted date: 2017-02-13
in scheme: emissions_variables_MMR

2.C.4 [Magnesium Production][no classification][Emissions][HFC-365mfc][t][no source][no method][no target][no option][no type]
type: Concept
definition: 2.C.4 [Magnesium Production][no classification][Emissions][HFC-365mfc][t][no source][no method][no target][no option][no type]
status: valid
status modified: 2017-02-13
accepted date: 2017-02-13
in scheme: emissions_variables_MMR

2.C.4 [Magnesium Production][no classification][Emissions][HFC-41][t][no source][no method][no target][no option][no type]
type: Concept
definition: 2.C.4 [Magnesium Production][no classification][Emissions][HFC-41][t][no source][no method][no target][no option][no type]
status: valid
status modified: 2017-02-13
accepted date: 2017-02-13
in scheme: emissions_variables_MMR

2.C.4 [Magnesium Production][no classification][Emissions][HFC-43-10mee][t][no source][no method][no target][no option][no type]
type: Concept
definition: 2.C.4 [Magnesium Production][no classification][Emissions][HFC-43-10mee][t][no source][no method][no target][no option][no type]
status: valid
status modified: 2017-02-13
accepted date: 2017-02-13
in scheme: emissions_variables_MMR

2.C.4 [Magnesium Production][no classification][Emissions][HFCs][t CO2 equivalent][no source][no method][no target][no option][no type]
type: Concept
definition: 2.C.4 [Magnesium Production][no classification][Emissions][HFCs][t CO2 equivalent][no source][no method][no target][no option][no type]
status: valid
status modified: 2017-02-13
accepted date: 2017-02-13
in scheme: emissions_variables_MMR

2.C.4 [Magnesium Production][no classification][Emissions][NMVOC][kt][no source][no method][no target][no option][no type]
type: Concept
definition: 2.C.4 [Magnesium Production][no classification][Emissions][NMVOC][kt][no source][no method][no target][no option][no type]
status: valid
status modified: 2017-02-13
accepted date: 2017-02-13
in scheme: emissions_variables_MMR

2.C.4 [Magnesium Production][no classification][Emissions][NOx][kt][no source][no method][no target][no option][no type]
type: Concept
definition: 2.C.4 [Magnesium Production][no classification][Emissions][NOx][kt][no source][no method][no target][no option][no type]
status: valid
status modified: 2017-02-13
accepted date: 2017-02-13
in scheme: emissions_variables_MMR

2.C.4 [Magnesium Production][no classification][Emissions][PFCs][t CO2 equivalent][no source][no method][no target][no option][no type]
type: Concept
definition: 2.C.4 [Magnesium Production][no classification][Emissions][PFCs][t CO2 equivalent][no source][no method][no target][no option][no type]
status: valid
status modified: 2017-02-13
accepted date: 2017-02-13
in scheme: emissions_variables_MMR

2.C.4 [Magnesium Production][no classification][Emissions][SF6][t][no source][no method][no target][no option][no type]
type: Concept
definition: 2.C.4 [Magnesium Production][no classification][Emissions][SF6][t][no source][no method][no target][no option][no type]
status: valid
status modified: 2017-02-13
accepted date: 2017-02-13
in scheme: emissions_variables_MMR

2.C.4 [Magnesium Production][no classification][Emissions][SO2][kt][no source][no method][no target][no option][no type]
type: Concept
definition: 2.C.4 [Magnesium Production][no classification][Emissions][SO2][kt][no source][no method][no target][no option][no type]
status: valid
status modified: 2017-02-13
accepted date: 2017-02-13
in scheme: emissions_variables_MMR

2.C.4 [Magnesium Production][no classification][Emissions][Unspecified mix of HFCs and PFCs][t CO2 equivalent][no source][no method][no target][no option][no type]
type: Concept
definition: 2.C.4 [Magnesium Production][no classification][Emissions][Unspecified mix of HFCs and PFCs][t CO2 equivalent][no source][no method][no target][no option][no type]
status: valid
status modified: 2017-02-13
accepted date: 2017-02-13
in scheme: emissions_variables_MMR

2.C.4 [Magnesium Production][no classification][Emissions][Unspecified mix of HFCs][t CO2 equivalent][no source][no method][no target][no option][no type]
type: Concept
definition: 2.C.4 [Magnesium Production][no classification][Emissions][Unspecified mix of HFCs][t CO2 equivalent][no source][no method][no target][no option][no type]
status: valid
status modified: 2017-02-13
accepted date: 2017-02-13
in scheme: emissions_variables_MMR

2.C.4 [Magnesium Production][no classification][Emissions][Unspecified mix of PFCs][t CO2 equivalent][no source][no method][no target][no option][no type]
type: Concept
definition: 2.C.4 [Magnesium Production][no classification][Emissions][Unspecified mix of PFCs][t CO2 equivalent][no source][no method][no target][no option][no type]
status: valid
status modified: 2017-02-13
accepted date: 2017-02-13
in scheme: emissions_variables_MMR

2.C.5 [Lead Production][no classification][Emissions][CO][kt][no source][no method][no target][no option][no type]
type: Concept
definition: 2.C.5 [Lead Production][no classification][Emissions][CO][kt][no source][no method][no target][no option][no type]
status: valid
status modified: 2017-02-13
accepted date: 2017-02-13
in scheme: emissions_variables_MMR

2.C.5 [Lead Production][no classification][Emissions][CO2][kt][no source][no method][no target][no option][no type]
type: Concept
definition: 2.C.5 [Lead Production][no classification][Emissions][CO2][kt][no source][no method][no target][no option][no type]
status: valid
status modified: 2017-02-13
accepted date: 2017-02-13
in scheme: emissions_variables_MMR

2.C.5 [Lead Production][no classification][Emissions][NMVOC][kt][no source][no method][no target][no option][no type]
type: Concept
definition: 2.C.5 [Lead Production][no classification][Emissions][NMVOC][kt][no source][no method][no target][no option][no type]
status: valid
status modified: 2017-02-13
accepted date: 2017-02-13
in scheme: emissions_variables_MMR

2.C.5 [Lead Production][no classification][Emissions][NOx][kt][no source][no method][no target][no option][no type]
type: Concept
definition: 2.C.5 [Lead Production][no classification][Emissions][NOx][kt][no source][no method][no target][no option][no type]
status: valid
status modified: 2017-02-13
accepted date: 2017-02-13
in scheme: emissions_variables_MMR

2.C.5 [Lead Production][no classification][Emissions][SO2][kt][no source][no method][no target][no option][no type]
type: Concept
definition: 2.C.5 [Lead Production][no classification][Emissions][SO2][kt][no source][no method][no target][no option][no type]
status: valid
status modified: 2017-02-13
accepted date: 2017-02-13
in scheme: emissions_variables_MMR

2.C.6 [Zinc Production][no classification][Emissions][CO][kt][no source][no method][no target][no option][no type]
type: Concept
definition: 2.C.6 [Zinc Production][no classification][Emissions][CO][kt][no source][no method][no target][no option][no type]
status: valid
status modified: 2017-02-13
accepted date: 2017-02-13
in scheme: emissions_variables_MMR

2.C.6 [Zinc Production][no classification][Emissions][CO2][kt][no source][no method][no target][no option][no type]
type: Concept
definition: 2.C.6 [Zinc Production][no classification][Emissions][CO2][kt][no source][no method][no target][no option][no type]
status: valid
status modified: 2017-02-13
accepted date: 2017-02-13
in scheme: emissions_variables_MMR

2.C.6 [Zinc Production][no classification][Emissions][NMVOC][kt][no source][no method][no target][no option][no type]
type: Concept
definition: 2.C.6 [Zinc Production][no classification][Emissions][NMVOC][kt][no source][no method][no target][no option][no type]
status: valid
status modified: 2017-02-13
accepted date: 2017-02-13
in scheme: emissions_variables_MMR

2.C.6 [Zinc Production][no classification][Emissions][NOx][kt][no source][no method][no target][no option][no type]
type: Concept
definition: 2.C.6 [Zinc Production][no classification][Emissions][NOx][kt][no source][no method][no target][no option][no type]
status: valid
status modified: 2017-02-13
accepted date: 2017-02-13
in scheme: emissions_variables_MMR

2.C.6 [Zinc Production][no classification][Emissions][SO2][kt][no source][no method][no target][no option][no type]
type: Concept
definition: 2.C.6 [Zinc Production][no classification][Emissions][SO2][kt][no source][no method][no target][no option][no type]
status: valid
status modified: 2017-02-13
accepted date: 2017-02-13
in scheme: emissions_variables_MMR

2.C.7 [Other Metal Industry][no classification][Emissions][Aggregate F-gases][t CO2 equivalent][no source][no method][no target][no option][no type]
type: Concept
definition: 2.C.7 [Other Metal Industry][no classification][Emissions][Aggregate F-gases][t CO2 equivalent][no source][no method][no target][no option][no type]
status: valid
status modified: 2017-02-13
accepted date: 2017-02-13
in scheme: emissions_variables_MMR

2.C.7 [Other Metal Industry][no classification][Emissions][C10F18][t][no source][no method][no target][no option][no type]
type: Concept
definition: 2.C.7 [Other Metal Industry][no classification][Emissions][C10F18][t][no source][no method][no target][no option][no type]
status: valid
status modified: 2017-02-13
accepted date: 2017-02-13
in scheme: emissions_variables_MMR

2.C.7 [Other Metal Industry][no classification][Emissions][C2F6][t][no source][no method][no target][no option][no type]
type: Concept
definition: 2.C.7 [Other Metal Industry][no classification][Emissions][C2F6][t][no source][no method][no target][no option][no type]
status: valid
status modified: 2017-02-13
accepted date: 2017-02-13
in scheme: emissions_variables_MMR

2.C.7 [Other Metal Industry][no classification][Emissions][C3F8][t][no source][no method][no target][no option][no type]
type: Concept
definition: 2.C.7 [Other Metal Industry][no classification][Emissions][C3F8][t][no source][no method][no target][no option][no type]
status: valid
status modified: 2017-02-13
accepted date: 2017-02-13
in scheme: emissions_variables_MMR

2.C.7 [Other Metal Industry][no classification][Emissions][C4F10][t][no source][no method][no target][no option][no type]
type: Concept
definition: 2.C.7 [Other Metal Industry][no classification][Emissions][C4F10][t][no source][no method][no target][no option][no type]
status: valid
status modified: 2017-02-13
accepted date: 2017-02-13
in scheme: emissions_variables_MMR

2.C.7 [Other Metal Industry][no classification][Emissions][C5F12][t][no source][no method][no target][no option][no type]
type: Concept
definition: 2.C.7 [Other Metal Industry][no classification][Emissions][C5F12][t][no source][no method][no target][no option][no type]
status: valid
status modified: 2017-02-13
accepted date: 2017-02-13
in scheme: emissions_variables_MMR

2.C.7 [Other Metal Industry][no classification][Emissions][C6F14][t][no source][no method][no target][no option][no type]
type: Concept
definition: 2.C.7 [Other Metal Industry][no classification][Emissions][C6F14][t][no source][no method][no target][no option][no type]
status: valid
status modified: 2017-02-13
accepted date: 2017-02-13
in scheme: emissions_variables_MMR

2.C.7 [Other Metal Industry][no classification][Emissions][c-C3F6][t][no source][no method][no target][no option][no type]
type: Concept
definition: 2.C.7 [Other Metal Industry][no classification][Emissions][c-C3F6][t][no source][no method][no target][no option][no type]
status: valid
status modified: 2017-02-13
accepted date: 2017-02-13
in scheme: emissions_variables_MMR

2.C.7 [Other Metal Industry][no classification][Emissions][c-C4F8][t][no source][no method][no target][no option][no type]
type: Concept
definition: 2.C.7 [Other Metal Industry][no classification][Emissions][c-C4F8][t][no source][no method][no target][no option][no type]
status: valid
status modified: 2017-02-13
accepted date: 2017-02-13
in scheme: emissions_variables_MMR

2.C.7 [Other Metal Industry][no classification][Emissions][CF4][t][no source][no method][no target][no option][no type]
type: Concept
definition: 2.C.7 [Other Metal Industry][no classification][Emissions][CF4][t][no source][no method][no target][no option][no type]
status: valid
status modified: 2017-02-13
accepted date: 2017-02-13
in scheme: emissions_variables_MMR

2.C.7 [Other Metal Industry][no classification][Emissions][CH4][kt][no source][no method][no target][no option][no type]
type: Concept
definition: 2.C.7 [Other Metal Industry][no classification][Emissions][CH4][kt][no source][no method][no target][no option][no type]
status: valid
status modified: 2017-02-13
accepted date: 2017-02-13
in scheme: emissions_variables_MMR

2.C.7 [Other Metal Industry][no classification][Emissions][CO][kt][no source][no method][no target][no option][no type]
type: Concept
definition: 2.C.7 [Other Metal Industry][no classification][Emissions][CO][kt][no source][no method][no target][no option][no type]
status: valid
status modified: 2017-02-13
accepted date: 2017-02-13
in scheme: emissions_variables_MMR

2.C.7 [Other Metal Industry][no classification][Emissions][CO2][kt][no source][no method][no target][no option][no type]
type: Concept
definition: 2.C.7 [Other Metal Industry][no classification][Emissions][CO2][kt][no source][no method][no target][no option][no type]
status: valid
status modified: 2017-02-13
accepted date: 2017-02-13
in scheme: emissions_variables_MMR

2.C.7 [Other Metal Industry][no classification][Emissions][HFC-125][t][no source][no method][no target][no option][no type]
type: Concept
definition: 2.C.7 [Other Metal Industry][no classification][Emissions][HFC-125][t][no source][no method][no target][no option][no type]
status: valid
status modified: 2017-02-13
accepted date: 2017-02-13
in scheme: emissions_variables_MMR

2.C.7 [Other Metal Industry][no classification][Emissions][HFC-134][t][no source][no method][no target][no option][no type]
type: Concept
definition: 2.C.7 [Other Metal Industry][no classification][Emissions][HFC-134][t][no source][no method][no target][no option][no type]
status: valid
status modified: 2017-02-13
accepted date: 2017-02-13
in scheme: emissions_variables_MMR

2.C.7 [Other Metal Industry][no classification][Emissions][HFC-134a][t][no source][no method][no target][no option][no type]
type: Concept
definition: 2.C.7 [Other Metal Industry][no classification][Emissions][HFC-134a][t][no source][no method][no target][no option][no type]
status: valid
status modified: 2017-02-13
accepted date: 2017-02-13
in scheme: emissions_variables_MMR

2.C.7 [Other Metal Industry][no classification][Emissions][HFC-143][t][no source][no method][no target][no option][no type]
type: Concept
definition: 2.C.7 [Other Metal Industry][no classification][Emissions][HFC-143][t][no source][no method][no target][no option][no type]
status: valid
status modified: 2017-02-13
accepted date: 2017-02-13
in scheme: emissions_variables_MMR

2.C.7 [Other Metal Industry][no classification][Emissions][HFC-143a][t][no source][no method][no target][no option][no type]
type: Concept
definition: 2.C.7 [Other Metal Industry][no classification][Emissions][HFC-143a][t][no source][no method][no target][no option][no type]
status: valid
status modified: 2017-02-13
accepted date: 2017-02-13
in scheme: emissions_variables_MMR

2.C.7 [Other Metal Industry][no classification][Emissions][HFC-152][t][no source][no method][no target][no option][no type]
type: Concept
definition: 2.C.7 [Other Metal Industry][no classification][Emissions][HFC-152][t][no source][no method][no target][no option][no type]
status: valid
status modified: 2017-02-13
accepted date: 2017-02-13
in scheme: emissions_variables_MMR

2.C.7 [Other Metal Industry][no classification][Emissions][HFC-152a][t][no source][no method][no target][no option][no type]
type: Concept
definition: 2.C.7 [Other Metal Industry][no classification][Emissions][HFC-152a][t][no source][no method][no target][no option][no type]
status: valid
status modified: 2017-02-13
accepted date: 2017-02-13
in scheme: emissions_variables_MMR

2.C.7 [Other Metal Industry][no classification][Emissions][HFC-161][t][no source][no method][no target][no option][no type]
type: Concept
definition: 2.C.7 [Other Metal Industry][no classification][Emissions][HFC-161][t][no source][no method][no target][no option][no type]
status: valid
status modified: 2017-02-13
accepted date: 2017-02-13
in scheme: emissions_variables_MMR

2.C.7 [Other Metal Industry][no classification][Emissions][HFC-227ea][t][no source][no method][no target][no option][no type]
type: Concept
definition: 2.C.7 [Other Metal Industry][no classification][Emissions][HFC-227ea][t][no source][no method][no target][no option][no type]
status: valid
status modified: 2017-02-13
accepted date: 2017-02-13
in scheme: emissions_variables_MMR

2.C.7 [Other Metal Industry][no classification][Emissions][HFC-23][t][no source][no method][no target][no option][no type]
type: Concept
definition: 2.C.7 [Other Metal Industry][no classification][Emissions][HFC-23][t][no source][no method][no target][no option][no type]
status: valid
status modified: 2017-02-13
accepted date: 2017-02-13
in scheme: emissions_variables_MMR

2.C.7 [Other Metal Industry][no classification][Emissions][HFC-236cb][t][no source][no method][no target][no option][no type]
type: Concept
definition: 2.C.7 [Other Metal Industry][no classification][Emissions][HFC-236cb][t][no source][no method][no target][no option][no type]
status: valid
status modified: 2017-02-13
accepted date: 2017-02-13
in scheme: emissions_variables_MMR

2.C.7 [Other Metal Industry][no classification][Emissions][HFC-236ea][t][no source][no method][no target][no option][no type]
type: Concept
definition: 2.C.7 [Other Metal Industry][no classification][Emissions][HFC-236ea][t][no source][no method][no target][no option][no type]
status: valid
status modified: 2017-02-13
accepted date: 2017-02-13
in scheme: emissions_variables_MMR

2.C.7 [Other Metal Industry][no classification][Emissions][HFC-236fa][t][no source][no method][no target][no option][no type]
type: Concept
definition: 2.C.7 [Other Metal Industry][no classification][Emissions][HFC-236fa][t][no source][no method][no target][no option][no type]
status: valid
status modified: 2017-02-13
accepted date: 2017-02-13
in scheme: emissions_variables_MMR

2.C.7 [Other Metal Industry][no classification][Emissions][HFC-245ca][t][no source][no method][no target][no option][no type]
type: Concept
definition: 2.C.7 [Other Metal Industry][no classification][Emissions][HFC-245ca][t][no source][no method][no target][no option][no type]
status: valid
status modified: 2017-02-13
accepted date: 2017-02-13
in scheme: emissions_variables_MMR

2.C.7 [Other Metal Industry][no classification][Emissions][HFC-245fa][t][no source][no method][no target][no option][no type]
type: Concept
definition: 2.C.7 [Other Metal Industry][no classification][Emissions][HFC-245fa][t][no source][no method][no target][no option][no type]
status: valid
status modified: 2017-02-13
accepted date: 2017-02-13
in scheme: emissions_variables_MMR

2.C.7 [Other Metal Industry][no classification][Emissions][HFC-32][t][no source][no method][no target][no option][no type]
type: Concept
definition: 2.C.7 [Other Metal Industry][no classification][Emissions][HFC-32][t][no source][no method][no target][no option][no type]
status: valid
status modified: 2017-02-13
accepted date: 2017-02-13
in scheme: emissions_variables_MMR

2.C.7 [Other Metal Industry][no classification][Emissions][HFC-365mfc][t][no source][no method][no target][no option][no type]
type: Concept
definition: 2.C.7 [Other Metal Industry][no classification][Emissions][HFC-365mfc][t][no source][no method][no target][no option][no type]
status: valid
status modified: 2017-02-13
accepted date: 2017-02-13
in scheme: emissions_variables_MMR

2.C.7 [Other Metal Industry][no classification][Emissions][HFC-41][t][no source][no method][no target][no option][no type]
type: Concept
definition: 2.C.7 [Other Metal Industry][no classification][Emissions][HFC-41][t][no source][no method][no target][no option][no type]
status: valid
status modified: 2017-02-13
accepted date: 2017-02-13
in scheme: emissions_variables_MMR

2.C.7 [Other Metal Industry][no classification][Emissions][HFC-43-10mee][t][no source][no method][no target][no option][no type]
type: Concept
definition: 2.C.7 [Other Metal Industry][no classification][Emissions][HFC-43-10mee][t][no source][no method][no target][no option][no type]
status: valid
status modified: 2017-02-13
accepted date: 2017-02-13
in scheme: emissions_variables_MMR

2.C.7 [Other Metal Industry][no classification][Emissions][HFCs][t CO2 equivalent][no source][no method][no target][no option][no type]
type: Concept
definition: 2.C.7 [Other Metal Industry][no classification][Emissions][HFCs][t CO2 equivalent][no source][no method][no target][no option][no type]
status: valid
status modified: 2017-02-13
accepted date: 2017-02-13
in scheme: emissions_variables_MMR

2.C.7 [Other Metal Industry][no classification][Emissions][N2O][kt][no source][no method][no target][no option][no type]
type: Concept
definition: 2.C.7 [Other Metal Industry][no classification][Emissions][N2O][kt][no source][no method][no target][no option][no type]
status: valid
status modified: 2017-02-13
accepted date: 2017-02-13
in scheme: emissions_variables_MMR

2.C.7 [Other Metal Industry][no classification][Emissions][NF3][kt][no source][no method][no target][no option][no type]
type: Concept
definition: 2.C.7 [Other Metal Industry][no classification][Emissions][NF3][kt][no source][no method][no target][no option][no type]
status: valid
status modified: 2017-02-13
accepted date: 2017-02-13
in scheme: emissions_variables_MMR

2.C.7 [Other Metal Industry][no classification][Emissions][NMVOC][kt][no source][no method][no target][no option][no type]
type: Concept
definition: 2.C.7 [Other Metal Industry][no classification][Emissions][NMVOC][kt][no source][no method][no target][no option][no type]
status: valid
status modified: 2017-02-13
accepted date: 2017-02-13
in scheme: emissions_variables_MMR

2.C.7 [Other Metal Industry][no classification][Emissions][NOx][kt][no source][no method][no target][no option][no type]
type: Concept
definition: 2.C.7 [Other Metal Industry][no classification][Emissions][NOx][kt][no source][no method][no target][no option][no type]
status: valid
status modified: 2017-02-13
accepted date: 2017-02-13
in scheme: emissions_variables_MMR

2.C.7 [Other Metal Industry][no classification][Emissions][PFCs][t CO2 equivalent][no source][no method][no target][no option][no type]
type: Concept
definition: 2.C.7 [Other Metal Industry][no classification][Emissions][PFCs][t CO2 equivalent][no source][no method][no target][no option][no type]
status: valid
status modified: 2017-02-13
accepted date: 2017-02-13
in scheme: emissions_variables_MMR

2.C.7 [Other Metal Industry][no classification][Emissions][SF6][kt][no source][no method][no target][no option][no type]
type: Concept
definition: 2.C.7 [Other Metal Industry][no classification][Emissions][SF6][kt][no source][no method][no target][no option][no type]
status: valid
status modified: 2017-02-13
accepted date: 2017-02-13
in scheme: emissions_variables_MMR

2.C.7 [Other Metal Industry][no classification][Emissions][SO2][kt][no source][no method][no target][no option][no type]
type: Concept
definition: 2.C.7 [Other Metal Industry][no classification][Emissions][SO2][kt][no source][no method][no target][no option][no type]
status: valid
status modified: 2017-02-13
accepted date: 2017-02-13
in scheme: emissions_variables_MMR

2.C.7 [Other Metal Industry][no classification][Emissions][Unspecified mix of HFCs and PFCs][t CO2 equivalent][no source][no method][no target][no option][no type]
type: Concept
definition: 2.C.7 [Other Metal Industry][no classification][Emissions][Unspecified mix of HFCs and PFCs][t CO2 equivalent][no source][no method][no target][no option][no type]
status: valid
status modified: 2017-02-13
accepted date: 2017-02-13
in scheme: emissions_variables_MMR

2.C.7 [Other Metal Industry][no classification][Emissions][Unspecified mix of HFCs][t CO2 equivalent][no source][no method][no target][no option][no type]
type: Concept
definition: 2.C.7 [Other Metal Industry][no classification][Emissions][Unspecified mix of HFCs][t CO2 equivalent][no source][no method][no target][no option][no type]
status: valid
status modified: 2017-02-13
accepted date: 2017-02-13
in scheme: emissions_variables_MMR

2.C.7 [Other Metal Industry][no classification][Emissions][Unspecified mix of PFCs][t CO2 equivalent][no source][no method][no target][no option][no type]
type: Concept
definition: 2.C.7 [Other Metal Industry][no classification][Emissions][Unspecified mix of PFCs][t CO2 equivalent][no source][no method][no target][no option][no type]
status: valid
status modified: 2017-02-13
accepted date: 2017-02-13
in scheme: emissions_variables_MMR

2.D [Non-energy Products from Fuels and Solvent Use][no classification][Emissions][Aggregate GHGs][kt CO2 equivalent][no source][no method][no target][no option][no type]
type: Concept
definition: 2.D [Non-energy Products from Fuels and Solvent Use][no classification][Emissions][Aggregate GHGs][kt CO2 equivalent][no source][no method][no target][no option][no type]
status: valid
status modified: 2017-02-13
accepted date: 2017-02-13
in scheme: emissions_variables_MMR

2.D [Non-energy Products from Fuels and Solvent Use][no classification][Emissions][CH4][kt][no source][no method][no target][no option][no type]
type: Concept
definition: 2.D [Non-energy Products from Fuels and Solvent Use][no classification][Emissions][CH4][kt][no source][no method][no target][no option][no type]
status: valid
status modified: 2017-02-13
accepted date: 2017-02-13
in scheme: emissions_variables_MMR

2.D [Non-energy Products from Fuels and Solvent Use][no classification][Emissions][CO][kt][no source][no method][no target][no option][no type]
type: Concept
definition: 2.D [Non-energy Products from Fuels and Solvent Use][no classification][Emissions][CO][kt][no source][no method][no target][no option][no type]
status: valid
status modified: 2017-02-13
accepted date: 2017-02-13
in scheme: emissions_variables_MMR

2.D [Non-energy Products from Fuels and Solvent Use][no classification][Emissions][CO2][kt][no source][no method][no target][no option][no type]
type: Concept
definition: 2.D [Non-energy Products from Fuels and Solvent Use][no classification][Emissions][CO2][kt][no source][no method][no target][no option][no type]
status: valid
status modified: 2017-02-13
accepted date: 2017-02-13
in scheme: emissions_variables_MMR

2.D [Non-energy Products from Fuels and Solvent Use][no classification][Emissions][N2O][kt][no source][no method][no target][no option][no type]
type: Concept
definition: 2.D [Non-energy Products from Fuels and Solvent Use][no classification][Emissions][N2O][kt][no source][no method][no target][no option][no type]
status: valid
status modified: 2017-02-13
accepted date: 2017-02-13
in scheme: emissions_variables_MMR

2.D [Non-energy Products from Fuels and Solvent Use][no classification][Emissions][NMVOC][kt][no source][no method][no target][no option][no type]
type: Concept
definition: 2.D [Non-energy Products from Fuels and Solvent Use][no classification][Emissions][NMVOC][kt][no source][no method][no target][no option][no type]
status: valid
status modified: 2017-02-13
accepted date: 2017-02-13
in scheme: emissions_variables_MMR

2.D [Non-energy Products from Fuels and Solvent Use][no classification][Emissions][NOx][kt][no source][no method][no target][no option][no type]
type: Concept
definition: 2.D [Non-energy Products from Fuels and Solvent Use][no classification][Emissions][NOx][kt][no source][no method][no target][no option][no type]
status: valid
status modified: 2017-02-13
accepted date: 2017-02-13
in scheme: emissions_variables_MMR

2.D [Non-energy Products from Fuels and Solvent Use][no classification][Emissions][SO2][kt][no source][no method][no target][no option][no type]
type: Concept
definition: 2.D [Non-energy Products from Fuels and Solvent Use][no classification][Emissions][SO2][kt][no source][no method][no target][no option][no type]
status: valid
status modified: 2017-02-13
accepted date: 2017-02-13
in scheme: emissions_variables_MMR

2.D.1 [Lubricant Use][no classification][Emissions][CH4][kt][no source][no method][no target][no option][no type]
type: Concept
definition: 2.D.1 [Lubricant Use][no classification][Emissions][CH4][kt][no source][no method][no target][no option][no type]
status: valid
status modified: 2017-02-13
accepted date: 2017-02-13
in scheme: emissions_variables_MMR

2.D.1 [Lubricant Use][no classification][Emissions][CO][kt][no source][no method][no target][no option][no type]
type: Concept
definition: 2.D.1 [Lubricant Use][no classification][Emissions][CO][kt][no source][no method][no target][no option][no type]
status: valid
status modified: 2017-02-13
accepted date: 2017-02-13
in scheme: emissions_variables_MMR

2.D.1 [Lubricant Use][no classification][Emissions][CO2][kt][no source][no method][no target][no option][no type]
type: Concept
definition: 2.D.1 [Lubricant Use][no classification][Emissions][CO2][kt][no source][no method][no target][no option][no type]
status: valid
status modified: 2017-02-13
accepted date: 2017-02-13
in scheme: emissions_variables_MMR

2.D.1 [Lubricant Use][no classification][Emissions][N2O][kt][no source][no method][no target][no option][no type]
type: Concept
definition: 2.D.1 [Lubricant Use][no classification][Emissions][N2O][kt][no source][no method][no target][no option][no type]
status: valid
status modified: 2017-02-13
accepted date: 2017-02-13
in scheme: emissions_variables_MMR

2.D.1 [Lubricant Use][no classification][Emissions][NMVOC][kt][no source][no method][no target][no option][no type]
type: Concept
definition: 2.D.1 [Lubricant Use][no classification][Emissions][NMVOC][kt][no source][no method][no target][no option][no type]
status: valid
status modified: 2017-02-13
accepted date: 2017-02-13
in scheme: emissions_variables_MMR

2.D.1 [Lubricant Use][no classification][Emissions][NOx][kt][no source][no method][no target][no option][no type]
type: Concept
definition: 2.D.1 [Lubricant Use][no classification][Emissions][NOx][kt][no source][no method][no target][no option][no type]
status: valid
status modified: 2017-02-13
accepted date: 2017-02-13
in scheme: emissions_variables_MMR

2.D.1 [Lubricant Use][no classification][Emissions][SO2][kt][no source][no method][no target][no option][no type]
type: Concept
definition: 2.D.1 [Lubricant Use][no classification][Emissions][SO2][kt][no source][no method][no target][no option][no type]
status: valid
status modified: 2017-02-13
accepted date: 2017-02-13
in scheme: emissions_variables_MMR

2.D.2 [Paraffin Wax Use][no classification][Emissions][CH4][kt][no source][no method][no target][no option][no type]
type: Concept
definition: 2.D.2 [Paraffin Wax Use][no classification][Emissions][CH4][kt][no source][no method][no target][no option][no type]
status: valid
status modified: 2017-02-13
accepted date: 2017-02-13
in scheme: emissions_variables_MMR

2.D.2 [Paraffin Wax Use][no classification][Emissions][CO][kt][no source][no method][no target][no option][no type]
type: Concept
definition: 2.D.2 [Paraffin Wax Use][no classification][Emissions][CO][kt][no source][no method][no target][no option][no type]
status: valid
status modified: 2017-02-13
accepted date: 2017-02-13
in scheme: emissions_variables_MMR

2.D.2 [Paraffin Wax Use][no classification][Emissions][CO2][kt][no source][no method][no target][no option][no type]
type: Concept
definition: 2.D.2 [Paraffin Wax Use][no classification][Emissions][CO2][kt][no source][no method][no target][no option][no type]
status: valid
status modified: 2017-02-13
accepted date: 2017-02-13
in scheme: emissions_variables_MMR

2.D.2 [Paraffin Wax Use][no classification][Emissions][N2O][kt][no source][no method][no target][no option][no type]
type: Concept
definition: 2.D.2 [Paraffin Wax Use][no classification][Emissions][N2O][kt][no source][no method][no target][no option][no type]
status: valid
status modified: 2017-02-13
accepted date: 2017-02-13
in scheme: emissions_variables_MMR

2.D.2 [Paraffin Wax Use][no classification][Emissions][NMVOC][kt][no source][no method][no target][no option][no type]
type: Concept
definition: 2.D.2 [Paraffin Wax Use][no classification][Emissions][NMVOC][kt][no source][no method][no target][no option][no type]
status: valid
status modified: 2017-02-13
accepted date: 2017-02-13
in scheme: emissions_variables_MMR

2.D.2 [Paraffin Wax Use][no classification][Emissions][NOx][kt][no source][no method][no target][no option][no type]
type: Concept
definition: 2.D.2 [Paraffin Wax Use][no classification][Emissions][NOx][kt][no source][no method][no target][no option][no type]
status: valid
status modified: 2017-02-13
accepted date: 2017-02-13
in scheme: emissions_variables_MMR

2.D.2 [Paraffin Wax Use][no classification][Emissions][SO2][kt][no source][no method][no target][no option][no type]
type: Concept
definition: 2.D.2 [Paraffin Wax Use][no classification][Emissions][SO2][kt][no source][no method][no target][no option][no type]
status: valid
status modified: 2017-02-13
accepted date: 2017-02-13
in scheme: emissions_variables_MMR

2.D.3 [Asphalt roofing][no classification][Emissions][CH4][kt][no source][no method][no target][no option][no type]
type: Concept
definition: 2.D.3 [Asphalt roofing][no classification][Emissions][CH4][kt][no source][no method][no target][no option][no type]
status: valid
status modified: 2017-02-13
accepted date: 2017-02-13
in scheme: emissions_variables_MMR

2.D.3 [Asphalt roofing][no classification][Emissions][CO][kt][no source][no method][no target][no option][no type]
type: Concept
definition: 2.D.3 [Asphalt roofing][no classification][Emissions][CO][kt][no source][no method][no target][no option][no type]
status: valid
status modified: 2017-02-13
accepted date: 2017-02-13
in scheme: emissions_variables_MMR

2.D.3 [Asphalt roofing][no classification][Emissions][CO2][kt][no source][no method][no target][no option][no type]
type: Concept
definition: 2.D.3 [Asphalt roofing][no classification][Emissions][CO2][kt][no source][no method][no target][no option][no type]
status: valid
status modified: 2017-02-13
accepted date: 2017-02-13
in scheme: emissions_variables_MMR

2.D.3 [Asphalt roofing][no classification][Emissions][N2O][kt][no source][no method][no target][no option][no type]
type: Concept
definition: 2.D.3 [Asphalt roofing][no classification][Emissions][N2O][kt][no source][no method][no target][no option][no type]
status: valid
status modified: 2017-02-13
accepted date: 2017-02-13
in scheme: emissions_variables_MMR

2.D.3 [Asphalt roofing][no classification][Emissions][NMVOC][kt][no source][no method][no target][no option][no type]
type: Concept
definition: 2.D.3 [Asphalt roofing][no classification][Emissions][NMVOC][kt][no source][no method][no target][no option][no type]
status: valid
status modified: 2017-02-13
accepted date: 2017-02-13
in scheme: emissions_variables_MMR

2.D.3 [Asphalt roofing][no classification][Emissions][NOx][kt][no source][no method][no target][no option][no type]
type: Concept
definition: 2.D.3 [Asphalt roofing][no classification][Emissions][NOx][kt][no source][no method][no target][no option][no type]
status: valid
status modified: 2017-02-13
accepted date: 2017-02-13
in scheme: emissions_variables_MMR

2.D.3 [Asphalt roofing][no classification][Emissions][SO2][kt][no source][no method][no target][no option][no type]
type: Concept
definition: 2.D.3 [Asphalt roofing][no classification][Emissions][SO2][kt][no source][no method][no target][no option][no type]
status: valid
status modified: 2017-02-13
accepted date: 2017-02-13
in scheme: emissions_variables_MMR

2.D.3 [Other non energy products][no classification][Emissions][CH4][kt][no source][no method][no target][no option][no type]
type: Concept
definition: 2.D.3 [Other non energy products][no classification][Emissions][CH4][kt][no source][no method][no target][no option][no type]
status: valid
status modified: 2017-02-13
accepted date: 2017-02-13
in scheme: emissions_variables_MMR

2.D.3 [Other non energy products][no classification][Emissions][CO][kt][no source][no method][no target][no option][no type]
type: Concept
definition: 2.D.3 [Other non energy products][no classification][Emissions][CO][kt][no source][no method][no target][no option][no type]
status: valid
status modified: 2017-02-13
accepted date: 2017-02-13
in scheme: emissions_variables_MMR

2.D.3 [Other non energy products][no classification][Emissions][CO2][kt][no source][no method][no target][no option][no type]
type: Concept
definition: 2.D.3 [Other non energy products][no classification][Emissions][CO2][kt][no source][no method][no target][no option][no type]
status: valid
status modified: 2017-02-13
accepted date: 2017-02-13
in scheme: emissions_variables_MMR

2.D.3 [Other non energy products][no classification][Emissions][N2O][kt][no source][no method][no target][no option][no type]
type: Concept
definition: 2.D.3 [Other non energy products][no classification][Emissions][N2O][kt][no source][no method][no target][no option][no type]
status: valid
status modified: 2017-02-13
accepted date: 2017-02-13
in scheme: emissions_variables_MMR

2.D.3 [Other non energy products][no classification][Emissions][NMVOC][kt][no source][no method][no target][no option][no type]
type: Concept
definition: 2.D.3 [Other non energy products][no classification][Emissions][NMVOC][kt][no source][no method][no target][no option][no type]
status: valid
status modified: 2017-02-13
accepted date: 2017-02-13
in scheme: emissions_variables_MMR

2.D.3 [Other non energy products][no classification][Emissions][NOx][kt][no source][no method][no target][no option][no type]
type: Concept
definition: 2.D.3 [Other non energy products][no classification][Emissions][NOx][kt][no source][no method][no target][no option][no type]
status: valid
status modified: 2017-02-13
accepted date: 2017-02-13
in scheme: emissions_variables_MMR

2.D.3 [Other non energy products][no classification][Emissions][SO2][kt][no source][no method][no target][no option][no type]
type: Concept
definition: 2.D.3 [Other non energy products][no classification][Emissions][SO2][kt][no source][no method][no target][no option][no type]
status: valid
status modified: 2017-02-13
accepted date: 2017-02-13
in scheme: emissions_variables_MMR

2.D.3 [Other Other non energy products][no classification][Emissions][CH4][kt][no source][no method][no target][no option][no type]
type: Concept
definition: 2.D.3 [Other Other non energy products][no classification][Emissions][CH4][kt][no source][no method][no target][no option][no type]
status: valid
status modified: 2017-02-13
accepted date: 2017-02-13
in scheme: emissions_variables_MMR

2.D.3 [Other Other non energy products][no classification][Emissions][CO][kt][no source][no method][no target][no option][no type]
type: Concept
definition: 2.D.3 [Other Other non energy products][no classification][Emissions][CO][kt][no source][no method][no target][no option][no type]
status: valid
status modified: 2017-02-13
accepted date: 2017-02-13
in scheme: emissions_variables_MMR

2.D.3 [Other Other non energy products][no classification][Emissions][CO2][kt][no source][no method][no target][no option][no type]
type: Concept
definition: 2.D.3 [Other Other non energy products][no classification][Emissions][CO2][kt][no source][no method][no target][no option][no type]
status: valid
status modified: 2017-02-13
accepted date: 2017-02-13
in scheme: emissions_variables_MMR

2.D.3 [Other Other non energy products][no classification][Emissions][N2O][kt][no source][no method][no target][no option][no type]
type: Concept
definition: 2.D.3 [Other Other non energy products][no classification][Emissions][N2O][kt][no source][no method][no target][no option][no type]
status: valid
status modified: 2017-02-13
accepted date: 2017-02-13
in scheme: emissions_variables_MMR

2.D.3 [Other Other non energy products][no classification][Emissions][NMVOC][kt][no source][no method][no target][no option][no type]
type: Concept
definition: 2.D.3 [Other Other non energy products][no classification][Emissions][NMVOC][kt][no source][no method][no target][no option][no type]
status: valid
status modified: 2017-02-13
accepted date: 2017-02-13
in scheme: emissions_variables_MMR

2.D.3 [Other Other non energy products][no classification][Emissions][NOx][kt][no source][no method][no target][no option][no type]
type: Concept
definition: 2.D.3 [Other Other non energy products][no classification][Emissions][NOx][kt][no source][no method][no target][no option][no type]
status: valid
status modified: 2017-02-13
accepted date: 2017-02-13
in scheme: emissions_variables_MMR

2.D.3 [Other Other non energy products][no classification][Emissions][SO2][kt][no source][no method][no target][no option][no type]
type: Concept
definition: 2.D.3 [Other Other non energy products][no classification][Emissions][SO2][kt][no source][no method][no target][no option][no type]
status: valid
status modified: 2017-02-13
accepted date: 2017-02-13
in scheme: emissions_variables_MMR

2.D.3 [Road paving with asphalt][no classification][Emissions][CH4][kt][no source][no method][no target][no option][no type]
type: Concept
definition: 2.D.3 [Road paving with asphalt][no classification][Emissions][CH4][kt][no source][no method][no target][no option][no type]
status: valid
status modified: 2017-02-13
accepted date: 2017-02-13
in scheme: emissions_variables_MMR

2.D.3 [Road paving with asphalt][no classification][Emissions][CO][kt][no source][no method][no target][no option][no type]
type: Concept
definition: 2.D.3 [Road paving with asphalt][no classification][Emissions][CO][kt][no source][no method][no target][no option][no type]
status: valid
status modified: 2017-02-13
accepted date: 2017-02-13
in scheme: emissions_variables_MMR

2.D.3 [Road paving with asphalt][no classification][Emissions][CO2][kt][no source][no method][no target][no option][no type]
type: Concept
definition: 2.D.3 [Road paving with asphalt][no classification][Emissions][CO2][kt][no source][no method][no target][no option][no type]
status: valid
status modified: 2017-02-13
accepted date: 2017-02-13
in scheme: emissions_variables_MMR

2.D.3 [Road paving with asphalt][no classification][Emissions][N2O][kt][no source][no method][no target][no option][no type]
type: Concept
definition: 2.D.3 [Road paving with asphalt][no classification][Emissions][N2O][kt][no source][no method][no target][no option][no type]
status: valid
status modified: 2017-02-13
accepted date: 2017-02-13
in scheme: emissions_variables_MMR

2.D.3 [Road paving with asphalt][no classification][Emissions][NMVOC][kt][no source][no method][no target][no option][no type]
type: Concept
definition: 2.D.3 [Road paving with asphalt][no classification][Emissions][NMVOC][kt][no source][no method][no target][no option][no type]
status: valid
status modified: 2017-02-13
accepted date: 2017-02-13
in scheme: emissions_variables_MMR

2.D.3 [Road paving with asphalt][no classification][Emissions][NOx][kt][no source][no method][no target][no option][no type]
type: Concept
definition: 2.D.3 [Road paving with asphalt][no classification][Emissions][NOx][kt][no source][no method][no target][no option][no type]
status: valid
status modified: 2017-02-13
accepted date: 2017-02-13
in scheme: emissions_variables_MMR

2.D.3 [Road paving with asphalt][no classification][Emissions][SO2][kt][no source][no method][no target][no option][no type]
type: Concept
definition: 2.D.3 [Road paving with asphalt][no classification][Emissions][SO2][kt][no source][no method][no target][no option][no type]
status: valid
status modified: 2017-02-13
accepted date: 2017-02-13
in scheme: emissions_variables_MMR

2.D.3 [Solvent use][no classification][Emissions][CH4][kt][no source][no method][no target][no option][no type]
type: Concept
definition: 2.D.3 [Solvent use][no classification][Emissions][CH4][kt][no source][no method][no target][no option][no type]
status: valid
status modified: 2017-02-13
accepted date: 2017-02-13
in scheme: emissions_variables_MMR

2.D.3 [Solvent use][no classification][Emissions][CO][kt][no source][no method][no target][no option][no type]
type: Concept
definition: 2.D.3 [Solvent use][no classification][Emissions][CO][kt][no source][no method][no target][no option][no type]
status: valid
status modified: 2017-02-13
accepted date: 2017-02-13
in scheme: emissions_variables_MMR

2.D.3 [Solvent use][no classification][Emissions][CO2][kt][no source][no method][no target][no option][no type]
type: Concept
definition: 2.D.3 [Solvent use][no classification][Emissions][CO2][kt][no source][no method][no target][no option][no type]
status: valid
status modified: 2017-02-13
accepted date: 2017-02-13
in scheme: emissions_variables_MMR

2.D.3 [Solvent use][no classification][Emissions][N2O][kt][no source][no method][no target][no option][no type]
type: Concept
definition: 2.D.3 [Solvent use][no classification][Emissions][N2O][kt][no source][no method][no target][no option][no type]
status: valid
status modified: 2017-02-13
accepted date: 2017-02-13
in scheme: emissions_variables_MMR

2.D.3 [Solvent use][no classification][Emissions][NMVOC][kt][no source][no method][no target][no option][no type]
type: Concept
definition: 2.D.3 [Solvent use][no classification][Emissions][NMVOC][kt][no source][no method][no target][no option][no type]
status: valid
status modified: 2017-02-13
accepted date: 2017-02-13
in scheme: emissions_variables_MMR

2.D.3 [Solvent use][no classification][Emissions][NOx][kt][no source][no method][no target][no option][no type]
type: Concept
definition: 2.D.3 [Solvent use][no classification][Emissions][NOx][kt][no source][no method][no target][no option][no type]
status: valid
status modified: 2017-02-13
accepted date: 2017-02-13
in scheme: emissions_variables_MMR

2.D.3 [Solvent use][no classification][Emissions][SO2][kt][no source][no method][no target][no option][no type]
type: Concept
definition: 2.D.3 [Solvent use][no classification][Emissions][SO2][kt][no source][no method][no target][no option][no type]
status: valid
status modified: 2017-02-13
accepted date: 2017-02-13
in scheme: emissions_variables_MMR

2.E [Electronics Industry][no classification][Emissions][Aggregate F-gases][t CO2 equivalent][no source][no method][no target][no option][no type]
type: Concept
definition: 2.E [Electronics Industry][no classification][Emissions][Aggregate F-gases][t CO2 equivalent][no source][no method][no target][no option][no type]
status: valid
status modified: 2017-02-13
accepted date: 2017-02-13
in scheme: emissions_variables_MMR

2.E [Electronics Industry][no classification][Emissions][Aggregate GHGs][kt CO2 equivalent][no source][no method][no target][no option][no type]
type: Concept
definition: 2.E [Electronics Industry][no classification][Emissions][Aggregate GHGs][kt CO2 equivalent][no source][no method][no target][no option][no type]
status: valid
status modified: 2017-02-13
accepted date: 2017-02-13
in scheme: emissions_variables_MMR

2.E [Electronics Industry][no classification][Emissions][C10F18][t][no source][no method][no target][no option][no type]
type: Concept
definition: 2.E [Electronics Industry][no classification][Emissions][C10F18][t][no source][no method][no target][no option][no type]
status: valid
status modified: 2017-02-13
accepted date: 2017-02-13
in scheme: emissions_variables_MMR

2.E [Electronics Industry][no classification][Emissions][C2F6][t][no source][no method][no target][no option][no type]
type: Concept
definition: 2.E [Electronics Industry][no classification][Emissions][C2F6][t][no source][no method][no target][no option][no type]
status: valid
status modified: 2017-02-13
accepted date: 2017-02-13
in scheme: emissions_variables_MMR

2.E [Electronics Industry][no classification][Emissions][C3F8][t][no source][no method][no target][no option][no type]
type: Concept
definition: 2.E [Electronics Industry][no classification][Emissions][C3F8][t][no source][no method][no target][no option][no type]
status: valid
status modified: 2017-02-13
accepted date: 2017-02-13
in scheme: emissions_variables_MMR

2.E [Electronics Industry][no classification][Emissions][C4F10][t][no source][no method][no target][no option][no type]
type: Concept
definition: 2.E [Electronics Industry][no classification][Emissions][C4F10][t][no source][no method][no target][no option][no type]
status: valid
status modified: 2017-02-13
accepted date: 2017-02-13
in scheme: emissions_variables_MMR

2.E [Electronics Industry][no classification][Emissions][C5F12][t][no source][no method][no target][no option][no type]
type: Concept
definition: 2.E [Electronics Industry][no classification][Emissions][C5F12][t][no source][no method][no target][no option][no type]
status: valid
status modified: 2017-02-13
accepted date: 2017-02-13
in scheme: emissions_variables_MMR

2.E [Electronics Industry][no classification][Emissions][C6F14][t][no source][no method][no target][no option][no type]
type: Concept
definition: 2.E [Electronics Industry][no classification][Emissions][C6F14][t][no source][no method][no target][no option][no type]
status: valid
status modified: 2017-02-13
accepted date: 2017-02-13
in scheme: emissions_variables_MMR

2.E [Electronics Industry][no classification][Emissions][c-C3F6][t][no source][no method][no target][no option][no type]
type: Concept
definition: 2.E [Electronics Industry][no classification][Emissions][c-C3F6][t][no source][no method][no target][no option][no type]
status: valid
status modified: 2017-02-13
accepted date: 2017-02-13
in scheme: emissions_variables_MMR

2.E [Electronics Industry][no classification][Emissions][c-C4F8][t][no source][no method][no target][no option][no type]
type: Concept
definition: 2.E [Electronics Industry][no classification][Emissions][c-C4F8][t][no source][no method][no target][no option][no type]
status: valid
status modified: 2017-02-13
accepted date: 2017-02-13
in scheme: emissions_variables_MMR

2.E [Electronics Industry][no classification][Emissions][CF4][t][no source][no method][no target][no option][no type]
type: Concept
definition: 2.E [Electronics Industry][no classification][Emissions][CF4][t][no source][no method][no target][no option][no type]
status: valid
status modified: 2017-02-13
accepted date: 2017-02-13
in scheme: emissions_variables_MMR

2.E [Electronics Industry][no classification][Emissions][HFC-125][t][no source][no method][no target][no option][no type]
type: Concept
definition: 2.E [Electronics Industry][no classification][Emissions][HFC-125][t][no source][no method][no target][no option][no type]
status: valid
status modified: 2017-02-13
accepted date: 2017-02-13
in scheme: emissions_variables_MMR

2.E [Electronics Industry][no classification][Emissions][HFC-134][t][no source][no method][no target][no option][no type]
type: Concept
definition: 2.E [Electronics Industry][no classification][Emissions][HFC-134][t][no source][no method][no target][no option][no type]
status: valid
status modified: 2017-02-13
accepted date: 2017-02-13
in scheme: emissions_variables_MMR

2.E [Electronics Industry][no classification][Emissions][HFC-134a][t][no source][no method][no target][no option][no type]
type: Concept
definition: 2.E [Electronics Industry][no classification][Emissions][HFC-134a][t][no source][no method][no target][no option][no type]
status: valid
status modified: 2017-02-13
accepted date: 2017-02-13
in scheme: emissions_variables_MMR

2.E [Electronics Industry][no classification][Emissions][HFC-143][t][no source][no method][no target][no option][no type]
type: Concept
definition: 2.E [Electronics Industry][no classification][Emissions][HFC-143][t][no source][no method][no target][no option][no type]
status: valid
status modified: 2017-02-13
accepted date: 2017-02-13
in scheme: emissions_variables_MMR

2.E [Electronics Industry][no classification][Emissions][HFC-143a][t][no source][no method][no target][no option][no type]
type: Concept
definition: 2.E [Electronics Industry][no classification][Emissions][HFC-143a][t][no source][no method][no target][no option][no type]
status: valid
status modified: 2017-02-13
accepted date: 2017-02-13
in scheme: emissions_variables_MMR

2.E [Electronics Industry][no classification][Emissions][HFC-152][t][no source][no method][no target][no option][no type]
type: Concept
definition: 2.E [Electronics Industry][no classification][Emissions][HFC-152][t][no source][no method][no target][no option][no type]
status: valid
status modified: 2017-02-13
accepted date: 2017-02-13
in scheme: emissions_variables_MMR

2.E [Electronics Industry][no classification][Emissions][HFC-152a][t][no source][no method][no target][no option][no type]
type: Concept
definition: 2.E [Electronics Industry][no classification][Emissions][HFC-152a][t][no source][no method][no target][no option][no type]
status: valid
status modified: 2017-02-13
accepted date: 2017-02-13
in scheme: emissions_variables_MMR

2.E [Electronics Industry][no classification][Emissions][HFC-161][t][no source][no method][no target][no option][no type]
type: Concept
definition: 2.E [Electronics Industry][no classification][Emissions][HFC-161][t][no source][no method][no target][no option][no type]
status: valid
status modified: 2017-02-13
accepted date: 2017-02-13
in scheme: emissions_variables_MMR

2.E [Electronics Industry][no classification][Emissions][HFC-227ea][t][no source][no method][no target][no option][no type]
type: Concept
definition: 2.E [Electronics Industry][no classification][Emissions][HFC-227ea][t][no source][no method][no target][no option][no type]
status: valid
status modified: 2017-02-13
accepted date: 2017-02-13
in scheme: emissions_variables_MMR

2.E [Electronics Industry][no classification][Emissions][HFC-23][t][no source][no method][no target][no option][no type]
type: Concept
definition: 2.E [Electronics Industry][no classification][Emissions][HFC-23][t][no source][no method][no target][no option][no type]
status: valid
status modified: 2017-02-13
accepted date: 2017-02-13
in scheme: emissions_variables_MMR

2.E [Electronics Industry][no classification][Emissions][HFC-236cb][t][no source][no method][no target][no option][no type]
type: Concept
definition: 2.E [Electronics Industry][no classification][Emissions][HFC-236cb][t][no source][no method][no target][no option][no type]
status: valid
status modified: 2017-02-13
accepted date: 2017-02-13
in scheme: emissions_variables_MMR

2.E [Electronics Industry][no classification][Emissions][HFC-236ea][t][no source][no method][no target][no option][no type]
type: Concept
definition: 2.E [Electronics Industry][no classification][Emissions][HFC-236ea][t][no source][no method][no target][no option][no type]
status: valid
status modified: 2017-02-13
accepted date: 2017-02-13
in scheme: emissions_variables_MMR

2.E [Electronics Industry][no classification][Emissions][HFC-236fa][t][no source][no method][no target][no option][no type]
type: Concept
definition: 2.E [Electronics Industry][no classification][Emissions][HFC-236fa][t][no source][no method][no target][no option][no type]
status: valid
status modified: 2017-02-13
accepted date: 2017-02-13
in scheme: emissions_variables_MMR

2.E [Electronics Industry][no classification][Emissions][HFC-245ca][t][no source][no method][no target][no option][no type]
type: Concept
definition: 2.E [Electronics Industry][no classification][Emissions][HFC-245ca][t][no source][no method][no target][no option][no type]
status: valid
status modified: 2017-02-13
accepted date: 2017-02-13
in scheme: emissions_variables_MMR

2.E [Electronics Industry][no classification][Emissions][HFC-245fa][t][no source][no method][no target][no option][no type]
type: Concept
definition: 2.E [Electronics Industry][no classification][Emissions][HFC-245fa][t][no source][no method][no target][no option][no type]
status: valid
status modified: 2017-02-13
accepted date: 2017-02-13
in scheme: emissions_variables_MMR

2.E [Electronics Industry][no classification][Emissions][HFC-32][t][no source][no method][no target][no option][no type]
type: Concept
definition: 2.E [Electronics Industry][no classification][Emissions][HFC-32][t][no source][no method][no target][no option][no type]
status: valid
status modified: 2017-02-13
accepted date: 2017-02-13
in scheme: emissions_variables_MMR

2.E [Electronics Industry][no classification][Emissions][HFC-365mfc][t][no source][no method][no target][no option][no type]
type: Concept
definition: 2.E [Electronics Industry][no classification][Emissions][HFC-365mfc][t][no source][no method][no target][no option][no type]
status: valid
status modified: 2017-02-13
accepted date: 2017-02-13
in scheme: emissions_variables_MMR

2.E [Electronics Industry][no classification][Emissions][HFC-41][t][no source][no method][no target][no option][no type]
type: Concept
definition: 2.E [Electronics Industry][no classification][Emissions][HFC-41][t][no source][no method][no target][no option][no type]
status: valid
status modified: 2017-02-13
accepted date: 2017-02-13
in scheme: emissions_variables_MMR

2.E [Electronics Industry][no classification][Emissions][HFC-43-10mee][t][no source][no method][no target][no option][no type]
type: Concept
definition: 2.E [Electronics Industry][no classification][Emissions][HFC-43-10mee][t][no source][no method][no target][no option][no type]
status: valid
status modified: 2017-02-13
accepted date: 2017-02-13
in scheme: emissions_variables_MMR

2.E [Electronics Industry][no classification][Emissions][HFCs][kt CO2 equivalent][no source][no method][no target][no option][no type]
type: Concept
definition: 2.E [Electronics Industry][no classification][Emissions][HFCs][kt CO2 equivalent][no source][no method][no target][no option][no type]
status: valid
status modified: 2017-02-13
accepted date: 2017-02-13
in scheme: emissions_variables_MMR

2.E [Electronics Industry][no classification][Emissions][NF3][t][no source][no method][no target][no option][no type]
type: Concept
definition: 2.E [Electronics Industry][no classification][Emissions][NF3][t][no source][no method][no target][no option][no type]
status: valid
status modified: 2017-02-13
accepted date: 2017-02-13
in scheme: emissions_variables_MMR

2.E [Electronics Industry][no classification][Emissions][PFCs][kt CO2 equivalent][no source][no method][no target][no option][no type]
type: Concept
definition: 2.E [Electronics Industry][no classification][Emissions][PFCs][kt CO2 equivalent][no source][no method][no target][no option][no type]
status: valid
status modified: 2017-02-13
accepted date: 2017-02-13
in scheme: emissions_variables_MMR

2.E [Electronics Industry][no classification][Emissions][SF6][t][no source][no method][no target][no option][no type]
type: Concept
definition: 2.E [Electronics Industry][no classification][Emissions][SF6][t][no source][no method][no target][no option][no type]
status: valid
status modified: 2017-02-13
accepted date: 2017-02-13
in scheme: emissions_variables_MMR

2.E [Electronics Industry][no classification][Emissions][Unspecified mix of HFCs and PFCs][t CO2 equivalent][no source][no method][no target][no option][no type]
type: Concept
definition: 2.E [Electronics Industry][no classification][Emissions][Unspecified mix of HFCs and PFCs][t CO2 equivalent][no source][no method][no target][no option][no type]
status: valid
status modified: 2017-02-13
accepted date: 2017-02-13
in scheme: emissions_variables_MMR

2.E [Electronics Industry][no classification][Emissions][Unspecified mix of HFCs][t CO2 equivalent][no source][no method][no target][no option][no type]
type: Concept
definition: 2.E [Electronics Industry][no classification][Emissions][Unspecified mix of HFCs][t CO2 equivalent][no source][no method][no target][no option][no type]
status: valid
status modified: 2017-02-13
accepted date: 2017-02-13
in scheme: emissions_variables_MMR

2.E [Electronics Industry][no classification][Emissions][Unspecified mix of PFCs][t CO2 equivalent][no source][no method][no target][no option][no type]
type: Concept
definition: 2.E [Electronics Industry][no classification][Emissions][Unspecified mix of PFCs][t CO2 equivalent][no source][no method][no target][no option][no type]
status: valid
status modified: 2017-02-13
accepted date: 2017-02-13
in scheme: emissions_variables_MMR

2.E.1 [Integrated Circuit or Semiconductor][no classification][Emissions][Aggregate F-gases][t CO2 equivalent][no source][no method][no target][no option][no type]
type: Concept
definition: 2.E.1 [Integrated Circuit or Semiconductor][no classification][Emissions][Aggregate F-gases][t CO2 equivalent][no source][no method][no target][no option][no type]
status: valid
status modified: 2017-02-13
accepted date: 2017-02-13
in scheme: emissions_variables_MMR

2.E.1 [Integrated Circuit or Semiconductor][no classification][Emissions][C10F18][t][no source][no method][no target][no option][no type]
type: Concept
definition: 2.E.1 [Integrated Circuit or Semiconductor][no classification][Emissions][C10F18][t][no source][no method][no target][no option][no type]
status: valid
status modified: 2017-02-13
accepted date: 2017-02-13
in scheme: emissions_variables_MMR

2.E.1 [Integrated Circuit or Semiconductor][no classification][Emissions][C2F6][t][no source][no method][no target][no option][no type]
type: Concept
definition: 2.E.1 [Integrated Circuit or Semiconductor][no classification][Emissions][C2F6][t][no source][no method][no target][no option][no type]
status: valid
status modified: 2017-02-13
accepted date: 2017-02-13
in scheme: emissions_variables_MMR

2.E.1 [Integrated Circuit or Semiconductor][no classification][Emissions][C3F8][t][no source][no method][no target][no option][no type]
type: Concept
definition: 2.E.1 [Integrated Circuit or Semiconductor][no classification][Emissions][C3F8][t][no source][no method][no target][no option][no type]
status: valid
status modified: 2017-02-13
accepted date: 2017-02-13
in scheme: emissions_variables_MMR

2.E.1 [Integrated Circuit or Semiconductor][no classification][Emissions][C4F10][t][no source][no method][no target][no option][no type]
type: Concept
definition: 2.E.1 [Integrated Circuit or Semiconductor][no classification][Emissions][C4F10][t][no source][no method][no target][no option][no type]
status: valid
status modified: 2017-02-13
accepted date: 2017-02-13
in scheme: emissions_variables_MMR

2.E.1 [Integrated Circuit or Semiconductor][no classification][Emissions][C5F12][t][no source][no method][no target][no option][no type]
type: Concept
definition: 2.E.1 [Integrated Circuit or Semiconductor][no classification][Emissions][C5F12][t][no source][no method][no target][no option][no type]
status: valid
status modified: 2017-02-13
accepted date: 2017-02-13
in scheme: emissions_variables_MMR

2.E.1 [Integrated Circuit or Semiconductor][no classification][Emissions][C6F14][t][no source][no method][no target][no option][no type]
type: Concept
definition: 2.E.1 [Integrated Circuit or Semiconductor][no classification][Emissions][C6F14][t][no source][no method][no target][no option][no type]
status: valid
status modified: 2017-02-13
accepted date: 2017-02-13
in scheme: emissions_variables_MMR

2.E.1 [Integrated Circuit or Semiconductor][no classification][Emissions][c-C3F6][t][no source][no method][no target][no option][no type]
type: Concept
definition: 2.E.1 [Integrated Circuit or Semiconductor][no classification][Emissions][c-C3F6][t][no source][no method][no target][no option][no type]
status: valid
status modified: 2017-02-13
accepted date: 2017-02-13
in scheme: emissions_variables_MMR

2.E.1 [Integrated Circuit or Semiconductor][no classification][Emissions][c-C4F8][t][no source][no method][no target][no option][no type]
type: Concept
definition: 2.E.1 [Integrated Circuit or Semiconductor][no classification][Emissions][c-C4F8][t][no source][no method][no target][no option][no type]
status: valid
status modified: 2017-02-13
accepted date: 2017-02-13
in scheme: emissions_variables_MMR

2.E.1 [Integrated Circuit or Semiconductor][no classification][Emissions][CF4][t][no source][no method][no target][no option][no type]
type: Concept
definition: 2.E.1 [Integrated Circuit or Semiconductor][no classification][Emissions][CF4][t][no source][no method][no target][no option][no type]
status: valid
status modified: 2017-02-13
accepted date: 2017-02-13
in scheme: emissions_variables_MMR

2.E.1 [Integrated Circuit or Semiconductor][no classification][Emissions][HFC-125][t][no source][no method][no target][no option][no type]
type: Concept
definition: 2.E.1 [Integrated Circuit or Semiconductor][no classification][Emissions][HFC-125][t][no source][no method][no target][no option][no type]
status: valid
status modified: 2017-02-13
accepted date: 2017-02-13
in scheme: emissions_variables_MMR

2.E.1 [Integrated Circuit or Semiconductor][no classification][Emissions][HFC-134][t][no source][no method][no target][no option][no type]
type: Concept
definition: 2.E.1 [Integrated Circuit or Semiconductor][no classification][Emissions][HFC-134][t][no source][no method][no target][no option][no type]
status: valid
status modified: 2017-02-13
accepted date: 2017-02-13
in scheme: emissions_variables_MMR

2.E.1 [Integrated Circuit or Semiconductor][no classification][Emissions][HFC-134a][t][no source][no method][no target][no option][no type]
type: Concept
definition: 2.E.1 [Integrated Circuit or Semiconductor][no classification][Emissions][HFC-134a][t][no source][no method][no target][no option][no type]
status: valid
status modified: 2017-02-13
accepted date: 2017-02-13
in scheme: emissions_variables_MMR

2.E.1 [Integrated Circuit or Semiconductor][no classification][Emissions][HFC-143][t][no source][no method][no target][no option][no type]
type: Concept
definition: 2.E.1 [Integrated Circuit or Semiconductor][no classification][Emissions][HFC-143][t][no source][no method][no target][no option][no type]
status: valid
status modified: 2017-02-13
accepted date: 2017-02-13
in scheme: emissions_variables_MMR

2.E.1 [Integrated Circuit or Semiconductor][no classification][Emissions][HFC-143a][t][no source][no method][no target][no option][no type]
type: Concept
definition: 2.E.1 [Integrated Circuit or Semiconductor][no classification][Emissions][HFC-143a][t][no source][no method][no target][no option][no type]
status: valid
status modified: 2017-02-13
accepted date: 2017-02-13
in scheme: emissions_variables_MMR

2.E.1 [Integrated Circuit or Semiconductor][no classification][Emissions][HFC-152][t][no source][no method][no target][no option][no type]
type: Concept
definition: 2.E.1 [Integrated Circuit or Semiconductor][no classification][Emissions][HFC-152][t][no source][no method][no target][no option][no type]
status: valid
status modified: 2017-02-13
accepted date: 2017-02-13
in scheme: emissions_variables_MMR

2.E.1 [Integrated Circuit or Semiconductor][no classification][Emissions][HFC-152a][t][no source][no method][no target][no option][no type]
type: Concept
definition: 2.E.1 [Integrated Circuit or Semiconductor][no classification][Emissions][HFC-152a][t][no source][no method][no target][no option][no type]
status: valid
status modified: 2017-02-13
accepted date: 2017-02-13
in scheme: emissions_variables_MMR

2.E.1 [Integrated Circuit or Semiconductor][no classification][Emissions][HFC-161][t][no source][no method][no target][no option][no type]
type: Concept
definition: 2.E.1 [Integrated Circuit or Semiconductor][no classification][Emissions][HFC-161][t][no source][no method][no target][no option][no type]
status: valid
status modified: 2017-02-13
accepted date: 2017-02-13
in scheme: emissions_variables_MMR

2.E.1 [Integrated Circuit or Semiconductor][no classification][Emissions][HFC-227ea][t][no source][no method][no target][no option][no type]
type: Concept
definition: 2.E.1 [Integrated Circuit or Semiconductor][no classification][Emissions][HFC-227ea][t][no source][no method][no target][no option][no type]
status: valid
status modified: 2017-02-13
accepted date: 2017-02-13
in scheme: emissions_variables_MMR

2.E.1 [Integrated Circuit or Semiconductor][no classification][Emissions][HFC-23][t][no source][no method][no target][no option][no type]
type: Concept
definition: 2.E.1 [Integrated Circuit or Semiconductor][no classification][Emissions][HFC-23][t][no source][no method][no target][no option][no type]
status: valid
status modified: 2017-02-13
accepted date: 2017-02-13
in scheme: emissions_variables_MMR

2.E.1 [Integrated Circuit or Semiconductor][no classification][Emissions][HFC-236cb][t][no source][no method][no target][no option][no type]
type: Concept
definition: 2.E.1 [Integrated Circuit or Semiconductor][no classification][Emissions][HFC-236cb][t][no source][no method][no target][no option][no type]
status: valid
status modified: 2017-02-13
accepted date: 2017-02-13
in scheme: emissions_variables_MMR

2.E.1 [Integrated Circuit or Semiconductor][no classification][Emissions][HFC-236ea][t][no source][no method][no target][no option][no type]
type: Concept
definition: 2.E.1 [Integrated Circuit or Semiconductor][no classification][Emissions][HFC-236ea][t][no source][no method][no target][no option][no type]
status: valid
status modified: 2017-02-13
accepted date: 2017-02-13
in scheme: emissions_variables_MMR

2.E.1 [Integrated Circuit or Semiconductor][no classification][Emissions][HFC-236fa][t][no source][no method][no target][no option][no type]
type: Concept
definition: 2.E.1 [Integrated Circuit or Semiconductor][no classification][Emissions][HFC-236fa][t][no source][no method][no target][no option][no type]
status: valid
status modified: 2017-02-13
accepted date: 2017-02-13
in scheme: emissions_variables_MMR

2.E.1 [Integrated Circuit or Semiconductor][no classification][Emissions][HFC-245ca][t][no source][no method][no target][no option][no type]
type: Concept
definition: 2.E.1 [Integrated Circuit or Semiconductor][no classification][Emissions][HFC-245ca][t][no source][no method][no target][no option][no type]
status: valid
status modified: 2017-02-13
accepted date: 2017-02-13
in scheme: emissions_variables_MMR

2.E.1 [Integrated Circuit or Semiconductor][no classification][Emissions][HFC-245fa][t][no source][no method][no target][no option][no type]
type: Concept
definition: 2.E.1 [Integrated Circuit or Semiconductor][no classification][Emissions][HFC-245fa][t][no source][no method][no target][no option][no type]
status: valid
status modified: 2017-02-13
accepted date: 2017-02-13
in scheme: emissions_variables_MMR

2.E.1 [Integrated Circuit or Semiconductor][no classification][Emissions][HFC-32][t][no source][no method][no target][no option][no type]
type: Concept
definition: 2.E.1 [Integrated Circuit or Semiconductor][no classification][Emissions][HFC-32][t][no source][no method][no target][no option][no type]
status: valid
status modified: 2017-02-13
accepted date: 2017-02-13
in scheme: emissions_variables_MMR

2.E.1 [Integrated Circuit or Semiconductor][no classification][Emissions][HFC-365mfc][t][no source][no method][no target][no option][no type]
type: Concept
definition: 2.E.1 [Integrated Circuit or Semiconductor][no classification][Emissions][HFC-365mfc][t][no source][no method][no target][no option][no type]
status: valid
status modified: 2017-02-13
accepted date: 2017-02-13
in scheme: emissions_variables_MMR

2.E.1 [Integrated Circuit or Semiconductor][no classification][Emissions][HFC-41][t][no source][no method][no target][no option][no type]
type: Concept
definition: 2.E.1 [Integrated Circuit or Semiconductor][no classification][Emissions][HFC-41][t][no source][no method][no target][no option][no type]
status: valid
status modified: 2017-02-13
accepted date: 2017-02-13
in scheme: emissions_variables_MMR

2.E.1 [Integrated Circuit or Semiconductor][no classification][Emissions][HFC-43-10mee][t][no source][no method][no target][no option][no type]
type: Concept
definition: 2.E.1 [Integrated Circuit or Semiconductor][no classification][Emissions][HFC-43-10mee][t][no source][no method][no target][no option][no type]
status: valid
status modified: 2017-02-13
accepted date: 2017-02-13
in scheme: emissions_variables_MMR

2.E.1 [Integrated Circuit or Semiconductor][no classification][Emissions][HFCs][t CO2 equivalent][no source][no method][no target][no option][no type]
type: Concept
definition: 2.E.1 [Integrated Circuit or Semiconductor][no classification][Emissions][HFCs][t CO2 equivalent][no source][no method][no target][no option][no type]
status: valid
status modified: 2017-02-13
accepted date: 2017-02-13
in scheme: emissions_variables_MMR

2.E.1 [Integrated Circuit or Semiconductor][no classification][Emissions][NF3][t][no source][no method][no target][no option][no type]
type: Concept
definition: 2.E.1 [Integrated Circuit or Semiconductor][no classification][Emissions][NF3][t][no source][no method][no target][no option][no type]
status: valid
status modified: 2017-02-13
accepted date: 2017-02-13
in scheme: emissions_variables_MMR

2.E.1 [Integrated Circuit or Semiconductor][no classification][Emissions][no gas][kt CO2 equivalent][no source][no method][no target][no option][no type]
type: Concept
definition: 2.E.1 [Integrated Circuit or Semiconductor][no classification][Emissions][no gas][kt CO2 equivalent][no source][no method][no target][no option][no type]
status: valid
status modified: 2017-02-13
accepted date: 2017-02-13
in scheme: emissions_variables_MMR

2.E.1 [Integrated Circuit or Semiconductor][no classification][Emissions][PFCs][t CO2 equivalent][no source][no method][no target][no option][no type]
type: Concept
definition: 2.E.1 [Integrated Circuit or Semiconductor][no classification][Emissions][PFCs][t CO2 equivalent][no source][no method][no target][no option][no type]
status: valid
status modified: 2017-02-13
accepted date: 2017-02-13
in scheme: emissions_variables_MMR

2.E.1 [Integrated Circuit or Semiconductor][no classification][Emissions][SF6][t][no source][no method][no target][no option][no type]
type: Concept
definition: 2.E.1 [Integrated Circuit or Semiconductor][no classification][Emissions][SF6][t][no source][no method][no target][no option][no type]
status: valid
status modified: 2017-02-13
accepted date: 2017-02-13
in scheme: emissions_variables_MMR

2.E.1 [Integrated Circuit or Semiconductor][no classification][Emissions][Unspecified mix of HFCs and PFCs][t CO2 equivalent][no source][no method][no target][no option][no type]
type: Concept
definition: 2.E.1 [Integrated Circuit or Semiconductor][no classification][Emissions][Unspecified mix of HFCs and PFCs][t CO2 equivalent][no source][no method][no target][no option][no type]
status: valid
status modified: 2017-02-13
accepted date: 2017-02-13
in scheme: emissions_variables_MMR

2.E.1 [Integrated Circuit or Semiconductor][no classification][Emissions][Unspecified mix of HFCs][t CO2 equivalent][no source][no method][no target][no option][no type]
type: Concept
definition: 2.E.1 [Integrated Circuit or Semiconductor][no classification][Emissions][Unspecified mix of HFCs][t CO2 equivalent][no source][no method][no target][no option][no type]
status: valid
status modified: 2017-02-13
accepted date: 2017-02-13
in scheme: emissions_variables_MMR

2.E.1 [Integrated Circuit or Semiconductor][no classification][Emissions][Unspecified mix of PFCs][t CO2 equivalent][no source][no method][no target][no option][no type]
type: Concept
definition: 2.E.1 [Integrated Circuit or Semiconductor][no classification][Emissions][Unspecified mix of PFCs][t CO2 equivalent][no source][no method][no target][no option][no type]
status: valid
status modified: 2017-02-13
accepted date: 2017-02-13
in scheme: emissions_variables_MMR

2.E.2 [TFT Flat Panel Display][no classification][Emissions][Aggregate F-gases][t CO2 equivalent][no source][no method][no target][no option][no type]
type: Concept
definition: 2.E.2 [TFT Flat Panel Display][no classification][Emissions][Aggregate F-gases][t CO2 equivalent][no source][no method][no target][no option][no type]
status: valid
status modified: 2017-02-13
accepted date: 2017-02-13
in scheme: emissions_variables_MMR

2.E.2 [TFT Flat Panel Display][no classification][Emissions][C10F18][t][no source][no method][no target][no option][no type]
type: Concept
definition: 2.E.2 [TFT Flat Panel Display][no classification][Emissions][C10F18][t][no source][no method][no target][no option][no type]
status: valid
status modified: 2017-02-13
accepted date: 2017-02-13
in scheme: emissions_variables_MMR

2.E.2 [TFT Flat Panel Display][no classification][Emissions][C2F6][t][no source][no method][no target][no option][no type]
type: Concept
definition: 2.E.2 [TFT Flat Panel Display][no classification][Emissions][C2F6][t][no source][no method][no target][no option][no type]
status: valid
status modified: 2017-02-13
accepted date: 2017-02-13
in scheme: emissions_variables_MMR

2.E.2 [TFT Flat Panel Display][no classification][Emissions][C3F8][t][no source][no method][no target][no option][no type]
type: Concept
definition: 2.E.2 [TFT Flat Panel Display][no classification][Emissions][C3F8][t][no source][no method][no target][no option][no type]
status: valid
status modified: 2017-02-13
accepted date: 2017-02-13
in scheme: emissions_variables_MMR

2.E.2 [TFT Flat Panel Display][no classification][Emissions][C4F10][t][no source][no method][no target][no option][no type]
type: Concept
definition: 2.E.2 [TFT Flat Panel Display][no classification][Emissions][C4F10][t][no source][no method][no target][no option][no type]
status: valid
status modified: 2017-02-13
accepted date: 2017-02-13
in scheme: emissions_variables_MMR

2.E.2 [TFT Flat Panel Display][no classification][Emissions][C5F12][t][no source][no method][no target][no option][no type]
type: Concept
definition: 2.E.2 [TFT Flat Panel Display][no classification][Emissions][C5F12][t][no source][no method][no target][no option][no type]
status: valid
status modified: 2017-02-13
accepted date: 2017-02-13
in scheme: emissions_variables_MMR

2.E.2 [TFT Flat Panel Display][no classification][Emissions][C6F14][t][no source][no method][no target][no option][no type]
type: Concept
definition: 2.E.2 [TFT Flat Panel Display][no classification][Emissions][C6F14][t][no source][no method][no target][no option][no type]
status: valid
status modified: 2017-02-13
accepted date: 2017-02-13
in scheme: emissions_variables_MMR

2.E.2 [TFT Flat Panel Display][no classification][Emissions][c-C3F6][t][no source][no method][no target][no option][no type]
type: Concept
definition: 2.E.2 [TFT Flat Panel Display][no classification][Emissions][c-C3F6][t][no source][no method][no target][no option][no type]
status: valid
status modified: 2017-02-13
accepted date: 2017-02-13
in scheme: emissions_variables_MMR

2.E.2 [TFT Flat Panel Display][no classification][Emissions][c-C4F8][t][no source][no method][no target][no option][no type]
type: Concept
definition: 2.E.2 [TFT Flat Panel Display][no classification][Emissions][c-C4F8][t][no source][no method][no target][no option][no type]
status: valid
status modified: 2017-02-13
accepted date: 2017-02-13
in scheme: emissions_variables_MMR

2.E.2 [TFT Flat Panel Display][no classification][Emissions][CF4][t][no source][no method][no target][no option][no type]
type: Concept
definition: 2.E.2 [TFT Flat Panel Display][no classification][Emissions][CF4][t][no source][no method][no target][no option][no type]
status: valid
status modified: 2017-02-13
accepted date: 2017-02-13
in scheme: emissions_variables_MMR

2.E.2 [TFT Flat Panel Display][no classification][Emissions][HFC-125][t][no source][no method][no target][no option][no type]
type: Concept
definition: 2.E.2 [TFT Flat Panel Display][no classification][Emissions][HFC-125][t][no source][no method][no target][no option][no type]
status: valid
status modified: 2017-02-13
accepted date: 2017-02-13
in scheme: emissions_variables_MMR

2.E.2 [TFT Flat Panel Display][no classification][Emissions][HFC-134][t][no source][no method][no target][no option][no type]
type: Concept
definition: 2.E.2 [TFT Flat Panel Display][no classification][Emissions][HFC-134][t][no source][no method][no target][no option][no type]
status: valid
status modified: 2017-02-13
accepted date: 2017-02-13
in scheme: emissions_variables_MMR

2.E.2 [TFT Flat Panel Display][no classification][Emissions][HFC-134a][t][no source][no method][no target][no option][no type]
type: Concept
definition: 2.E.2 [TFT Flat Panel Display][no classification][Emissions][HFC-134a][t][no source][no method][no target][no option][no type]
status: valid
status modified: 2017-02-13
accepted date: 2017-02-13
in scheme: emissions_variables_MMR

2.E.2 [TFT Flat Panel Display][no classification][Emissions][HFC-143][t][no source][no method][no target][no option][no type]
type: Concept
definition: 2.E.2 [TFT Flat Panel Display][no classification][Emissions][HFC-143][t][no source][no method][no target][no option][no type]
status: valid
status modified: 2017-02-13
accepted date: 2017-02-13
in scheme: emissions_variables_MMR

2.E.2 [TFT Flat Panel Display][no classification][Emissions][HFC-143a][t][no source][no method][no target][no option][no type]
type: Concept
definition: 2.E.2 [TFT Flat Panel Display][no classification][Emissions][HFC-143a][t][no source][no method][no target][no option][no type]
status: valid
status modified: 2017-02-13
accepted date: 2017-02-13
in scheme: emissions_variables_MMR

2.E.2 [TFT Flat Panel Display][no classification][Emissions][HFC-152][t][no source][no method][no target][no option][no type]
type: Concept
definition: 2.E.2 [TFT Flat Panel Display][no classification][Emissions][HFC-152][t][no source][no method][no target][no option][no type]
status: valid
status modified: 2017-02-13
accepted date: 2017-02-13
in scheme: emissions_variables_MMR

2.E.2 [TFT Flat Panel Display][no classification][Emissions][HFC-152a][t][no source][no method][no target][no option][no type]
type: Concept
definition: 2.E.2 [TFT Flat Panel Display][no classification][Emissions][HFC-152a][t][no source][no method][no target][no option][no type]
status: valid
status modified: 2017-02-13
accepted date: 2017-02-13
in scheme: emissions_variables_MMR

2.E.2 [TFT Flat Panel Display][no classification][Emissions][HFC-161][t][no source][no method][no target][no option][no type]
type: Concept
definition: 2.E.2 [TFT Flat Panel Display][no classification][Emissions][HFC-161][t][no source][no method][no target][no option][no type]
status: valid
status modified: 2017-02-13
accepted date: 2017-02-13
in scheme: emissions_variables_MMR

2.E.2 [TFT Flat Panel Display][no classification][Emissions][HFC-227ea][t][no source][no method][no target][no option][no type]
type: Concept
definition: 2.E.2 [TFT Flat Panel Display][no classification][Emissions][HFC-227ea][t][no source][no method][no target][no option][no type]
status: valid
status modified: 2017-02-13
accepted date: 2017-02-13
in scheme: emissions_variables_MMR

2.E.2 [TFT Flat Panel Display][no classification][Emissions][HFC-23][t][no source][no method][no target][no option][no type]
type: Concept
definition: 2.E.2 [TFT Flat Panel Display][no classification][Emissions][HFC-23][t][no source][no method][no target][no option][no type]
status: valid
status modified: 2017-02-13
accepted date: 2017-02-13
in scheme: emissions_variables_MMR

2.E.2 [TFT Flat Panel Display][no classification][Emissions][HFC-236cb][t][no source][no method][no target][no option][no type]
type: Concept
definition: 2.E.2 [TFT Flat Panel Display][no classification][Emissions][HFC-236cb][t][no source][no method][no target][no option][no type]
status: valid
status modified: 2017-02-13
accepted date: 2017-02-13
in scheme: emissions_variables_MMR

2.E.2 [TFT Flat Panel Display][no classification][Emissions][HFC-236ea][t][no source][no method][no target][no option][no type]
type: Concept
definition: 2.E.2 [TFT Flat Panel Display][no classification][Emissions][HFC-236ea][t][no source][no method][no target][no option][no type]
status: valid
status modified: 2017-02-13
accepted date: 2017-02-13
in scheme: emissions_variables_MMR

2.E.2 [TFT Flat Panel Display][no classification][Emissions][HFC-236fa][t][no source][no method][no target][no option][no type]
type: Concept
definition: 2.E.2 [TFT Flat Panel Display][no classification][Emissions][HFC-236fa][t][no source][no method][no target][no option][no type]
status: valid
status modified: 2017-02-13
accepted date: 2017-02-13
in scheme: emissions_variables_MMR

2.E.2 [TFT Flat Panel Display][no classification][Emissions][HFC-245ca][t][no source][no method][no target][no option][no type]
type: Concept
definition: 2.E.2 [TFT Flat Panel Display][no classification][Emissions][HFC-245ca][t][no source][no method][no target][no option][no type]
status: valid
status modified: 2017-02-13
accepted date: 2017-02-13
in scheme: emissions_variables_MMR

2.E.2 [TFT Flat Panel Display][no classification][Emissions][HFC-245fa][t][no source][no method][no target][no option][no type]
type: Concept
definition: 2.E.2 [TFT Flat Panel Display][no classification][Emissions][HFC-245fa][t][no source][no method][no target][no option][no type]
status: valid
status modified: 2017-02-13
accepted date: 2017-02-13
in scheme: emissions_variables_MMR

2.E.2 [TFT Flat Panel Display][no classification][Emissions][HFC-32][t][no source][no method][no target][no option][no type]
type: Concept
definition: 2.E.2 [TFT Flat Panel Display][no classification][Emissions][HFC-32][t][no source][no method][no target][no option][no type]
status: valid
status modified: 2017-02-13
accepted date: 2017-02-13
in scheme: emissions_variables_MMR

2.E.2 [TFT Flat Panel Display][no classification][Emissions][HFC-365mfc][t][no source][no method][no target][no option][no type]
type: Concept
definition: 2.E.2 [TFT Flat Panel Display][no classification][Emissions][HFC-365mfc][t][no source][no method][no target][no option][no type]
status: valid
status modified: 2017-02-13
accepted date: 2017-02-13
in scheme: emissions_variables_MMR

2.E.2 [TFT Flat Panel Display][no classification][Emissions][HFC-41][t][no source][no method][no target][no option][no type]
type: Concept
definition: 2.E.2 [TFT Flat Panel Display][no classification][Emissions][HFC-41][t][no source][no method][no target][no option][no type]
status: valid
status modified: 2017-02-13
accepted date: 2017-02-13
in scheme: emissions_variables_MMR

2.E.2 [TFT Flat Panel Display][no classification][Emissions][HFC-43-10mee][t][no source][no method][no target][no option][no type]
type: Concept
definition: 2.E.2 [TFT Flat Panel Display][no classification][Emissions][HFC-43-10mee][t][no source][no method][no target][no option][no type]
status: valid
status modified: 2017-02-13
accepted date: 2017-02-13
in scheme: emissions_variables_MMR

2.E.2 [TFT Flat Panel Display][no classification][Emissions][HFCs][t CO2 equivalent][no source][no method][no target][no option][no type]
type: Concept
definition: 2.E.2 [TFT Flat Panel Display][no classification][Emissions][HFCs][t CO2 equivalent][no source][no method][no target][no option][no type]
status: valid
status modified: 2017-02-13
accepted date: 2017-02-13
in scheme: emissions_variables_MMR

2.E.2 [TFT Flat Panel Display][no classification][Emissions][NF3][t][no source][no method][no target][no option][no type]
type: Concept
definition: 2.E.2 [TFT Flat Panel Display][no classification][Emissions][NF3][t][no source][no method][no target][no option][no type]
status: valid
status modified: 2017-02-13
accepted date: 2017-02-13
in scheme: emissions_variables_MMR

2.E.2 [TFT Flat Panel Display][no classification][Emissions][no gas][kt CO2 equivalent][no source][no method][no target][no option][no type]
type: Concept
definition: 2.E.2 [TFT Flat Panel Display][no classification][Emissions][no gas][kt CO2 equivalent][no source][no method][no target][no option][no type]
status: valid
status modified: 2017-02-13
accepted date: 2017-02-13
in scheme: emissions_variables_MMR

2.E.2 [TFT Flat Panel Display][no classification][Emissions][PFCs][t CO2 equivalent][no source][no method][no target][no option][no type]
type: Concept
definition: 2.E.2 [TFT Flat Panel Display][no classification][Emissions][PFCs][t CO2 equivalent][no source][no method][no target][no option][no type]
status: valid
status modified: 2017-02-13
accepted date: 2017-02-13
in scheme: emissions_variables_MMR

2.E.2 [TFT Flat Panel Display][no classification][Emissions][SF6][t][no source][no method][no target][no option][no type]
type: Concept
definition: 2.E.2 [TFT Flat Panel Display][no classification][Emissions][SF6][t][no source][no method][no target][no option][no type]
status: valid
status modified: 2017-02-13
accepted date: 2017-02-13
in scheme: emissions_variables_MMR

2.E.2 [TFT Flat Panel Display][no classification][Emissions][Unspecified mix of HFCs and PFCs][t CO2 equivalent][no source][no method][no target][no option][no type]
type: Concept
definition: 2.E.2 [TFT Flat Panel Display][no classification][Emissions][Unspecified mix of HFCs and PFCs][t CO2 equivalent][no source][no method][no target][no option][no type]
status: valid
status modified: 2017-02-13
accepted date: 2017-02-13
in scheme: emissions_variables_MMR

2.E.2 [TFT Flat Panel Display][no classification][Emissions][Unspecified mix of HFCs][t CO2 equivalent][no source][no method][no target][no option][no type]
type: Concept
definition: 2.E.2 [TFT Flat Panel Display][no classification][Emissions][Unspecified mix of HFCs][t CO2 equivalent][no source][no method][no target][no option][no type]
status: valid
status modified: 2017-02-13
accepted date: 2017-02-13
in scheme: emissions_variables_MMR

2.E.2 [TFT Flat Panel Display][no classification][Emissions][Unspecified mix of PFCs][t CO2 equivalent][no source][no method][no target][no option][no type]
type: Concept
definition: 2.E.2 [TFT Flat Panel Display][no classification][Emissions][Unspecified mix of PFCs][t CO2 equivalent][no source][no method][no target][no option][no type]
status: valid
status modified: 2017-02-13
accepted date: 2017-02-13
in scheme: emissions_variables_MMR

2.E.3 [Photovoltaics][no classification][Emissions][Aggregate F-gases][t CO2 equivalent][no source][no method][no target][no option][no type]
type: Concept
definition: 2.E.3 [Photovoltaics][no classification][Emissions][Aggregate F-gases][t CO2 equivalent][no source][no method][no target][no option][no type]
status: valid
status modified: 2017-02-13
accepted date: 2017-02-13
in scheme: emissions_variables_MMR

2.E.3 [Photovoltaics][no classification][Emissions][C10F18][t][no source][no method][no target][no option][no type]
type: Concept
definition: 2.E.3 [Photovoltaics][no classification][Emissions][C10F18][t][no source][no method][no target][no option][no type]
status: valid
status modified: 2017-02-13
accepted date: 2017-02-13
in scheme: emissions_variables_MMR

2.E.3 [Photovoltaics][no classification][Emissions][C2F6][t][no source][no method][no target][no option][no type]
type: Concept
definition: 2.E.3 [Photovoltaics][no classification][Emissions][C2F6][t][no source][no method][no target][no option][no type]
status: valid
status modified: 2017-02-13
accepted date: 2017-02-13
in scheme: emissions_variables_MMR

2.E.3 [Photovoltaics][no classification][Emissions][C3F8][t][no source][no method][no target][no option][no type]
type: Concept
definition: 2.E.3 [Photovoltaics][no classification][Emissions][C3F8][t][no source][no method][no target][no option][no type]
status: valid
status modified: 2017-02-13
accepted date: 2017-02-13
in scheme: emissions_variables_MMR

2.E.3 [Photovoltaics][no classification][Emissions][C4F10][t][no source][no method][no target][no option][no type]
type: Concept
definition: 2.E.3 [Photovoltaics][no classification][Emissions][C4F10][t][no source][no method][no target][no option][no type]
status: valid
status modified: 2017-02-13
accepted date: 2017-02-13
in scheme: emissions_variables_MMR

2.E.3 [Photovoltaics][no classification][Emissions][C5F12][t][no source][no method][no target][no option][no type]
type: Concept
definition: 2.E.3 [Photovoltaics][no classification][Emissions][C5F12][t][no source][no method][no target][no option][no type]
status: valid
status modified: 2017-02-13
accepted date: 2017-02-13
in scheme: emissions_variables_MMR

2.E.3 [Photovoltaics][no classification][Emissions][C6F14][t][no source][no method][no target][no option][no type]
type: Concept
definition: 2.E.3 [Photovoltaics][no classification][Emissions][C6F14][t][no source][no method][no target][no option][no type]
status: valid
status modified: 2017-02-13
accepted date: 2017-02-13
in scheme: emissions_variables_MMR

2.E.3 [Photovoltaics][no classification][Emissions][c-C3F6][t][no source][no method][no target][no option][no type]
type: Concept
definition: 2.E.3 [Photovoltaics][no classification][Emissions][c-C3F6][t][no source][no method][no target][no option][no type]
status: valid
status modified: 2017-02-13
accepted date: 2017-02-13
in scheme: emissions_variables_MMR

2.E.3 [Photovoltaics][no classification][Emissions][c-C4F8][t][no source][no method][no target][no option][no type]
type: Concept
definition: 2.E.3 [Photovoltaics][no classification][Emissions][c-C4F8][t][no source][no method][no target][no option][no type]
status: valid
status modified: 2017-02-13
accepted date: 2017-02-13
in scheme: emissions_variables_MMR

2.E.3 [Photovoltaics][no classification][Emissions][CF4][t][no source][no method][no target][no option][no type]
type: Concept
definition: 2.E.3 [Photovoltaics][no classification][Emissions][CF4][t][no source][no method][no target][no option][no type]
status: valid
status modified: 2017-02-13
accepted date: 2017-02-13
in scheme: emissions_variables_MMR

2.E.3 [Photovoltaics][no classification][Emissions][HFC-125][t][no source][no method][no target][no option][no type]
type: Concept
definition: 2.E.3 [Photovoltaics][no classification][Emissions][HFC-125][t][no source][no method][no target][no option][no type]
status: valid
status modified: 2017-02-13
accepted date: 2017-02-13
in scheme: emissions_variables_MMR

2.E.3 [Photovoltaics][no classification][Emissions][HFC-134][t][no source][no method][no target][no option][no type]
type: Concept
definition: 2.E.3 [Photovoltaics][no classification][Emissions][HFC-134][t][no source][no method][no target][no option][no type]
status: valid
status modified: 2017-02-13
accepted date: 2017-02-13
in scheme: emissions_variables_MMR

2.E.3 [Photovoltaics][no classification][Emissions][HFC-134a][t][no source][no method][no target][no option][no type]
type: Concept
definition: 2.E.3 [Photovoltaics][no classification][Emissions][HFC-134a][t][no source][no method][no target][no option][no type]
status: valid
status modified: 2017-02-13
accepted date: 2017-02-13
in scheme: emissions_variables_MMR

2.E.3 [Photovoltaics][no classification][Emissions][HFC-143][t][no source][no method][no target][no option][no type]
type: Concept
definition: 2.E.3 [Photovoltaics][no classification][Emissions][HFC-143][t][no source][no method][no target][no option][no type]
status: valid
status modified: 2017-02-13
accepted date: 2017-02-13
in scheme: emissions_variables_MMR

2.E.3 [Photovoltaics][no classification][Emissions][HFC-143a][t][no source][no method][no target][no option][no type]
type: Concept
definition: 2.E.3 [Photovoltaics][no classification][Emissions][HFC-143a][t][no source][no method][no target][no option][no type]
status: valid
status modified: 2017-02-13
accepted date: 2017-02-13
in scheme: emissions_variables_MMR

2.E.3 [Photovoltaics][no classification][Emissions][HFC-152][t][no source][no method][no target][no option][no type]
type: Concept
definition: 2.E.3 [Photovoltaics][no classification][Emissions][HFC-152][t][no source][no method][no target][no option][no type]
status: valid
status modified: 2017-02-13
accepted date: 2017-02-13
in scheme: emissions_variables_MMR

2.E.3 [Photovoltaics][no classification][Emissions][HFC-152a][t][no source][no method][no target][no option][no type]
type: Concept
definition: 2.E.3 [Photovoltaics][no classification][Emissions][HFC-152a][t][no source][no method][no target][no option][no type]
status: valid
status modified: 2017-02-13
accepted date: 2017-02-13
in scheme: emissions_variables_MMR

2.E.3 [Photovoltaics][no classification][Emissions][HFC-161][t][no source][no method][no target][no option][no type]
type: Concept
definition: 2.E.3 [Photovoltaics][no classification][Emissions][HFC-161][t][no source][no method][no target][no option][no type]
status: valid
status modified: 2017-02-13
accepted date: 2017-02-13
in scheme: emissions_variables_MMR

2.E.3 [Photovoltaics][no classification][Emissions][HFC-227ea][t][no source][no method][no target][no option][no type]
type: Concept
definition: 2.E.3 [Photovoltaics][no classification][Emissions][HFC-227ea][t][no source][no method][no target][no option][no type]
status: valid
status modified: 2017-02-13
accepted date: 2017-02-13
in scheme: emissions_variables_MMR

2.E.3 [Photovoltaics][no classification][Emissions][HFC-23][t][no source][no method][no target][no option][no type]
type: Concept
definition: 2.E.3 [Photovoltaics][no classification][Emissions][HFC-23][t][no source][no method][no target][no option][no type]
status: valid
status modified: 2017-02-13
accepted date: 2017-02-13
in scheme: emissions_variables_MMR

2.E.3 [Photovoltaics][no classification][Emissions][HFC-236cb][t][no source][no method][no target][no option][no type]
type: Concept
definition: 2.E.3 [Photovoltaics][no classification][Emissions][HFC-236cb][t][no source][no method][no target][no option][no type]
status: valid
status modified: 2017-02-13
accepted date: 2017-02-13
in scheme: emissions_variables_MMR

2.E.3 [Photovoltaics][no classification][Emissions][HFC-236ea][t][no source][no method][no target][no option][no type]
type: Concept
definition: 2.E.3 [Photovoltaics][no classification][Emissions][HFC-236ea][t][no source][no method][no target][no option][no type]
status: valid
status modified: 2017-02-13
accepted date: 2017-02-13
in scheme: emissions_variables_MMR

2.E.3 [Photovoltaics][no classification][Emissions][HFC-236fa][t][no source][no method][no target][no option][no type]
type: Concept
definition: 2.E.3 [Photovoltaics][no classification][Emissions][HFC-236fa][t][no source][no method][no target][no option][no type]
status: valid
status modified: 2017-02-13
accepted date: 2017-02-13
in scheme: emissions_variables_MMR

2.E.3 [Photovoltaics][no classification][Emissions][HFC-245ca][t][no source][no method][no target][no option][no type]
type: Concept
definition: 2.E.3 [Photovoltaics][no classification][Emissions][HFC-245ca][t][no source][no method][no target][no option][no type]
status: valid
status modified: 2017-02-13
accepted date: 2017-02-13
in scheme: emissions_variables_MMR

2.E.3 [Photovoltaics][no classification][Emissions][HFC-245fa][t][no source][no method][no target][no option][no type]
type: Concept
definition: 2.E.3 [Photovoltaics][no classification][Emissions][HFC-245fa][t][no source][no method][no target][no option][no type]
status: valid
status modified: 2017-02-13
accepted date: 2017-02-13
in scheme: emissions_variables_MMR

2.E.3 [Photovoltaics][no classification][Emissions][HFC-32][t][no source][no method][no target][no option][no type]
type: Concept
definition: 2.E.3 [Photovoltaics][no classification][Emissions][HFC-32][t][no source][no method][no target][no option][no type]
status: valid
status modified: 2017-02-13
accepted date: 2017-02-13
in scheme: emissions_variables_MMR

2.E.3 [Photovoltaics][no classification][Emissions][HFC-365mfc][t][no source][no method][no target][no option][no type]
type: Concept
definition: 2.E.3 [Photovoltaics][no classification][Emissions][HFC-365mfc][t][no source][no method][no target][no option][no type]
status: valid
status modified: 2017-02-13
accepted date: 2017-02-13
in scheme: emissions_variables_MMR

2.E.3 [Photovoltaics][no classification][Emissions][HFC-41][t][no source][no method][no target][no option][no type]
type: Concept
definition: 2.E.3 [Photovoltaics][no classification][Emissions][HFC-41][t][no source][no method][no target][no option][no type]
status: valid
status modified: 2017-02-13
accepted date: 2017-02-13
in scheme: emissions_variables_MMR

2.E.3 [Photovoltaics][no classification][Emissions][HFC-43-10mee][t][no source][no method][no target][no option][no type]
type: Concept
definition: 2.E.3 [Photovoltaics][no classification][Emissions][HFC-43-10mee][t][no source][no method][no target][no option][no type]
status: valid
status modified: 2017-02-13
accepted date: 2017-02-13
in scheme: emissions_variables_MMR

2.E.3 [Photovoltaics][no classification][Emissions][HFCs][t CO2 equivalent][no source][no method][no target][no option][no type]
type: Concept
definition: 2.E.3 [Photovoltaics][no classification][Emissions][HFCs][t CO2 equivalent][no source][no method][no target][no option][no type]
status: valid
status modified: 2017-02-13
accepted date: 2017-02-13
in scheme: emissions_variables_MMR

2.E.3 [Photovoltaics][no classification][Emissions][NF3][t][no source][no method][no target][no option][no type]
type: Concept
definition: 2.E.3 [Photovoltaics][no classification][Emissions][NF3][t][no source][no method][no target][no option][no type]
status: valid
status modified: 2017-02-13
accepted date: 2017-02-13
in scheme: emissions_variables_MMR

2.E.3 [Photovoltaics][no classification][Emissions][no gas][kt CO2 equivalent][no source][no method][no target][no option][no type]
type: Concept
definition: 2.E.3 [Photovoltaics][no classification][Emissions][no gas][kt CO2 equivalent][no source][no method][no target][no option][no type]
status: valid
status modified: 2017-02-13
accepted date: 2017-02-13
in scheme: emissions_variables_MMR

2.E.3 [Photovoltaics][no classification][Emissions][PFCs][t CO2 equivalent][no source][no method][no target][no option][no type]
type: Concept
definition: 2.E.3 [Photovoltaics][no classification][Emissions][PFCs][t CO2 equivalent][no source][no method][no target][no option][no type]
status: valid
status modified: 2017-02-13
accepted date: 2017-02-13
in scheme: emissions_variables_MMR

2.E.3 [Photovoltaics][no classification][Emissions][SF6][t][no source][no method][no target][no option][no type]
type: Concept
definition: 2.E.3 [Photovoltaics][no classification][Emissions][SF6][t][no source][no method][no target][no option][no type]
status: valid
status modified: 2017-02-13
accepted date: 2017-02-13
in scheme: emissions_variables_MMR

2.E.3 [Photovoltaics][no classification][Emissions][Unspecified mix of HFCs and PFCs][t CO2 equivalent][no source][no method][no target][no option][no type]
type: Concept
definition: 2.E.3 [Photovoltaics][no classification][Emissions][Unspecified mix of HFCs and PFCs][t CO2 equivalent][no source][no method][no target][no option][no type]
status: valid
status modified: 2017-02-13
accepted date: 2017-02-13
in scheme: emissions_variables_MMR

2.E.3 [Photovoltaics][no classification][Emissions][Unspecified mix of HFCs][t CO2 equivalent][no source][no method][no target][no option][no type]
type: Concept
definition: 2.E.3 [Photovoltaics][no classification][Emissions][Unspecified mix of HFCs][t CO2 equivalent][no source][no method][no target][no option][no type]
status: valid
status modified: 2017-02-13
accepted date: 2017-02-13
in scheme: emissions_variables_MMR

2.E.3 [Photovoltaics][no classification][Emissions][Unspecified mix of PFCs][t CO2 equivalent][no source][no method][no target][no option][no type]
type: Concept
definition: 2.E.3 [Photovoltaics][no classification][Emissions][Unspecified mix of PFCs][t CO2 equivalent][no source][no method][no target][no option][no type]
status: valid
status modified: 2017-02-13
accepted date: 2017-02-13
in scheme: emissions_variables_MMR

2.E.4 [Heat Transfer Fluid][no classification][Emissions][Aggregate F-gases][t CO2 equivalent][no source][no method][no target][no option][no type]
type: Concept
definition: 2.E.4 [Heat Transfer Fluid][no classification][Emissions][Aggregate F-gases][t CO2 equivalent][no source][no method][no target][no option][no type]
status: valid
status modified: 2017-02-13
accepted date: 2017-02-13
in scheme: emissions_variables_MMR

2.E.4 [Heat Transfer Fluid][no classification][Emissions][C10F18][t][no source][no method][no target][no option][no type]
type: Concept
definition: 2.E.4 [Heat Transfer Fluid][no classification][Emissions][C10F18][t][no source][no method][no target][no option][no type]
status: valid
status modified: 2017-02-13
accepted date: 2017-02-13
in scheme: emissions_variables_MMR

2.E.4 [Heat Transfer Fluid][no classification][Emissions][C2F6][t][no source][no method][no target][no option][no type]
type: Concept
definition: 2.E.4 [Heat Transfer Fluid][no classification][Emissions][C2F6][t][no source][no method][no target][no option][no type]
status: valid
status modified: 2017-02-13
accepted date: 2017-02-13
in scheme: emissions_variables_MMR

2.E.4 [Heat Transfer Fluid][no classification][Emissions][C3F8][t][no source][no method][no target][no option][no type]
type: Concept
definition: 2.E.4 [Heat Transfer Fluid][no classification][Emissions][C3F8][t][no source][no method][no target][no option][no type]
status: valid
status modified: 2017-02-13
accepted date: 2017-02-13
in scheme: emissions_variables_MMR

2.E.4 [Heat Transfer Fluid][no classification][Emissions][C4F10][t][no source][no method][no target][no option][no type]
type: Concept
definition: 2.E.4 [Heat Transfer Fluid][no classification][Emissions][C4F10][t][no source][no method][no target][no option][no type]
status: valid
status modified: 2017-02-13
accepted date: 2017-02-13
in scheme: emissions_variables_MMR

2.E.4 [Heat Transfer Fluid][no classification][Emissions][C5F12][t][no source][no method][no target][no option][no type]
type: Concept
definition: 2.E.4 [Heat Transfer Fluid][no classification][Emissions][C5F12][t][no source][no method][no target][no option][no type]
status: valid
status modified: 2017-02-13
accepted date: 2017-02-13
in scheme: emissions_variables_MMR

2.E.4 [Heat Transfer Fluid][no classification][Emissions][C6F14][t][no source][no method][no target][no option][no type]
type: Concept
definition: 2.E.4 [Heat Transfer Fluid][no classification][Emissions][C6F14][t][no source][no method][no target][no option][no type]
status: valid
status modified: 2017-02-13
accepted date: 2017-02-13
in scheme: emissions_variables_MMR

2.E.4 [Heat Transfer Fluid][no classification][Emissions][c-C3F6][t][no source][no method][no target][no option][no type]
type: Concept
definition: 2.E.4 [Heat Transfer Fluid][no classification][Emissions][c-C3F6][t][no source][no method][no target][no option][no type]
status: valid
status modified: 2017-02-13
accepted date: 2017-02-13
in scheme: emissions_variables_MMR

2.E.4 [Heat Transfer Fluid][no classification][Emissions][c-C4F8][t][no source][no method][no target][no option][no type]
type: Concept
definition: 2.E.4 [Heat Transfer Fluid][no classification][Emissions][c-C4F8][t][no source][no method][no target][no option][no type]
status: valid
status modified: 2017-02-13
accepted date: 2017-02-13
in scheme: emissions_variables_MMR

2.E.4 [Heat Transfer Fluid][no classification][Emissions][CF4][t][no source][no method][no target][no option][no type]
type: Concept
definition: 2.E.4 [Heat Transfer Fluid][no classification][Emissions][CF4][t][no source][no method][no target][no option][no type]
status: valid
status modified: 2017-02-13
accepted date: 2017-02-13
in scheme: emissions_variables_MMR

2.E.4 [Heat Transfer Fluid][no classification][Emissions][HFC-125][t][no source][no method][no target][no option][no type]
type: Concept
definition: 2.E.4 [Heat Transfer Fluid][no classification][Emissions][HFC-125][t][no source][no method][no target][no option][no type]
status: valid
status modified: 2017-02-13
accepted date: 2017-02-13
in scheme: emissions_variables_MMR

2.E.4 [Heat Transfer Fluid][no classification][Emissions][HFC-134][t][no source][no method][no target][no option][no type]
type: Concept
definition: 2.E.4 [Heat Transfer Fluid][no classification][Emissions][HFC-134][t][no source][no method][no target][no option][no type]
status: valid
status modified: 2017-02-13
accepted date: 2017-02-13
in scheme: emissions_variables_MMR

2.E.4 [Heat Transfer Fluid][no classification][Emissions][HFC-134a][t][no source][no method][no target][no option][no type]
type: Concept
definition: 2.E.4 [Heat Transfer Fluid][no classification][Emissions][HFC-134a][t][no source][no method][no target][no option][no type]
status: valid
status modified: 2017-02-13
accepted date: 2017-02-13
in scheme: emissions_variables_MMR

2.E.4 [Heat Transfer Fluid][no classification][Emissions][HFC-143][t][no source][no method][no target][no option][no type]
type: Concept
definition: 2.E.4 [Heat Transfer Fluid][no classification][Emissions][HFC-143][t][no source][no method][no target][no option][no type]
status: valid
status modified: 2017-02-13
accepted date: 2017-02-13
in scheme: emissions_variables_MMR

2.E.4 [Heat Transfer Fluid][no classification][Emissions][HFC-143a][t][no source][no method][no target][no option][no type]
type: Concept
definition: 2.E.4 [Heat Transfer Fluid][no classification][Emissions][HFC-143a][t][no source][no method][no target][no option][no type]
status: valid
status modified: 2017-02-13
accepted date: 2017-02-13
in scheme: emissions_variables_MMR

2.E.4 [Heat Transfer Fluid][no classification][Emissions][HFC-152][t][no source][no method][no target][no option][no type]
type: Concept
definition: 2.E.4 [Heat Transfer Fluid][no classification][Emissions][HFC-152][t][no source][no method][no target][no option][no type]
status: valid
status modified: 2017-02-13
accepted date: 2017-02-13
in scheme: emissions_variables_MMR

2.E.4 [Heat Transfer Fluid][no classification][Emissions][HFC-152a][t][no source][no method][no target][no option][no type]
type: Concept
definition: 2.E.4 [Heat Transfer Fluid][no classification][Emissions][HFC-152a][t][no source][no method][no target][no option][no type]
status: valid
status modified: 2017-02-13
accepted date: 2017-02-13
in scheme: emissions_variables_MMR

2.E.4 [Heat Transfer Fluid][no classification][Emissions][HFC-161][t][no source][no method][no target][no option][no type]
type: Concept
definition: 2.E.4 [Heat Transfer Fluid][no classification][Emissions][HFC-161][t][no source][no method][no target][no option][no type]
status: valid
status modified: 2017-02-13
accepted date: 2017-02-13
in scheme: emissions_variables_MMR

2.E.4 [Heat Transfer Fluid][no classification][Emissions][HFC-227ea][t][no source][no method][no target][no option][no type]
type: Concept
definition: 2.E.4 [Heat Transfer Fluid][no classification][Emissions][HFC-227ea][t][no source][no method][no target][no option][no type]
status: valid
status modified: 2017-02-13
accepted date: 2017-02-13
in scheme: emissions_variables_MMR

2.E.4 [Heat Transfer Fluid][no classification][Emissions][HFC-23][t][no source][no method][no target][no option][no type]
type: Concept
definition: 2.E.4 [Heat Transfer Fluid][no classification][Emissions][HFC-23][t][no source][no method][no target][no option][no type]
status: valid
status modified: 2017-02-13
accepted date: 2017-02-13
in scheme: emissions_variables_MMR

2.E.4 [Heat Transfer Fluid][no classification][Emissions][HFC-236cb][t][no source][no method][no target][no option][no type]
type: Concept
definition: 2.E.4 [Heat Transfer Fluid][no classification][Emissions][HFC-236cb][t][no source][no method][no target][no option][no type]
status: valid
status modified: 2017-02-13
accepted date: 2017-02-13
in scheme: emissions_variables_MMR

2.E.4 [Heat Transfer Fluid][no classification][Emissions][HFC-236ea][t][no source][no method][no target][no option][no type]
type: Concept
definition: 2.E.4 [Heat Transfer Fluid][no classification][Emissions][HFC-236ea][t][no source][no method][no target][no option][no type]
status: valid
status modified: 2017-02-13
accepted date: 2017-02-13
in scheme: emissions_variables_MMR

2.E.4 [Heat Transfer Fluid][no classification][Emissions][HFC-236fa][t][no source][no method][no target][no option][no type]
type: Concept
definition: 2.E.4 [Heat Transfer Fluid][no classification][Emissions][HFC-236fa][t][no source][no method][no target][no option][no type]
status: valid
status modified: 2017-02-13
accepted date: 2017-02-13
in scheme: emissions_variables_MMR

2.E.4 [Heat Transfer Fluid][no classification][Emissions][HFC-245ca][t][no source][no method][no target][no option][no type]
type: Concept
definition: 2.E.4 [Heat Transfer Fluid][no classification][Emissions][HFC-245ca][t][no source][no method][no target][no option][no type]
status: valid
status modified: 2017-02-13
accepted date: 2017-02-13
in scheme: emissions_variables_MMR

2.E.4 [Heat Transfer Fluid][no classification][Emissions][HFC-245fa][t][no source][no method][no target][no option][no type]
type: Concept
definition: 2.E.4 [Heat Transfer Fluid][no classification][Emissions][HFC-245fa][t][no source][no method][no target][no option][no type]
status: valid
status modified: 2017-02-13
accepted date: 2017-02-13
in scheme: emissions_variables_MMR

2.E.4 [Heat Transfer Fluid][no classification][Emissions][HFC-32][t][no source][no method][no target][no option][no type]
type: Concept
definition: 2.E.4 [Heat Transfer Fluid][no classification][Emissions][HFC-32][t][no source][no method][no target][no option][no type]
status: valid
status modified: 2017-02-13
accepted date: 2017-02-13
in scheme: emissions_variables_MMR

2.E.4 [Heat Transfer Fluid][no classification][Emissions][HFC-365mfc][t][no source][no method][no target][no option][no type]
type: Concept
definition: 2.E.4 [Heat Transfer Fluid][no classification][Emissions][HFC-365mfc][t][no source][no method][no target][no option][no type]
status: valid
status modified: 2017-02-13
accepted date: 2017-02-13
in scheme: emissions_variables_MMR

2.E.4 [Heat Transfer Fluid][no classification][Emissions][HFC-41][t][no source][no method][no target][no option][no type]
type: Concept
definition: 2.E.4 [Heat Transfer Fluid][no classification][Emissions][HFC-41][t][no source][no method][no target][no option][no type]
status: valid
status modified: 2017-02-13
accepted date: 2017-02-13
in scheme: emissions_variables_MMR

2.E.4 [Heat Transfer Fluid][no classification][Emissions][HFC-43-10mee][t][no source][no method][no target][no option][no type]
type: Concept
definition: 2.E.4 [Heat Transfer Fluid][no classification][Emissions][HFC-43-10mee][t][no source][no method][no target][no option][no type]
status: valid
status modified: 2017-02-13
accepted date: 2017-02-13
in scheme: emissions_variables_MMR

2.E.4 [Heat Transfer Fluid][no classification][Emissions][HFCs][t CO2 equivalent][no source][no method][no target][no option][no type]
type: Concept
definition: 2.E.4 [Heat Transfer Fluid][no classification][Emissions][HFCs][t CO2 equivalent][no source][no method][no target][no option][no type]
status: valid
status modified: 2017-02-13
accepted date: 2017-02-13
in scheme: emissions_variables_MMR

2.E.4 [Heat Transfer Fluid][no classification][Emissions][NF3][t][no source][no method][no target][no option][no type]
type: Concept
definition: 2.E.4 [Heat Transfer Fluid][no classification][Emissions][NF3][t][no source][no method][no target][no option][no type]
status: valid
status modified: 2017-02-13
accepted date: 2017-02-13
in scheme: emissions_variables_MMR

2.E.4 [Heat Transfer Fluid][no classification][Emissions][no gas][kt CO2 equivalent][no source][no method][no target][no option][no type]
type: Concept
definition: 2.E.4 [Heat Transfer Fluid][no classification][Emissions][no gas][kt CO2 equivalent][no source][no method][no target][no option][no type]
status: valid
status modified: 2017-02-13
accepted date: 2017-02-13
in scheme: emissions_variables_MMR

2.E.4 [Heat Transfer Fluid][no classification][Emissions][PFCs][t CO2 equivalent][no source][no method][no target][no option][no type]
type: Concept
definition: 2.E.4 [Heat Transfer Fluid][no classification][Emissions][PFCs][t CO2 equivalent][no source][no method][no target][no option][no type]
status: valid
status modified: 2017-02-13
accepted date: 2017-02-13
in scheme: emissions_variables_MMR

2.E.4 [Heat Transfer Fluid][no classification][Emissions][SF6][t][no source][no method][no target][no option][no type]
type: Concept
definition: 2.E.4 [Heat Transfer Fluid][no classification][Emissions][SF6][t][no source][no method][no target][no option][no type]
status: valid
status modified: 2017-02-13
accepted date: 2017-02-13
in scheme: emissions_variables_MMR

2.E.4 [Heat Transfer Fluid][no classification][Emissions][Unspecified mix of HFCs and PFCs][t CO2 equivalent][no source][no method][no target][no option][no type]
type: Concept
definition: 2.E.4 [Heat Transfer Fluid][no classification][Emissions][Unspecified mix of HFCs and PFCs][t CO2 equivalent][no source][no method][no target][no option][no type]
status: valid
status modified: 2017-02-13
accepted date: 2017-02-13
in scheme: emissions_variables_MMR

2.E.4 [Heat Transfer Fluid][no classification][Emissions][Unspecified mix of HFCs][t CO2 equivalent][no source][no method][no target][no option][no type]
type: Concept
definition: 2.E.4 [Heat Transfer Fluid][no classification][Emissions][Unspecified mix of HFCs][t CO2 equivalent][no source][no method][no target][no option][no type]
status: valid
status modified: 2017-02-13
accepted date: 2017-02-13
in scheme: emissions_variables_MMR

2.E.4 [Heat Transfer Fluid][no classification][Emissions][Unspecified mix of PFCs][t CO2 equivalent][no source][no method][no target][no option][no type]
type: Concept
definition: 2.E.4 [Heat Transfer Fluid][no classification][Emissions][Unspecified mix of PFCs][t CO2 equivalent][no source][no method][no target][no option][no type]
status: valid
status modified: 2017-02-13
accepted date: 2017-02-13
in scheme: emissions_variables_MMR

2.E.5 [Other electronics industry][no classification][Emissions][Aggregate F-gases][t CO2 equivalent][no source][no method][no target][no option][no type]
type: Concept
definition: 2.E.5 [Other electronics industry][no classification][Emissions][Aggregate F-gases][t CO2 equivalent][no source][no method][no target][no option][no type]
status: valid
status modified: 2017-02-13
accepted date: 2017-02-13
in scheme: emissions_variables_MMR

2.E.5 [Other electronics industry][no classification][Emissions][C10F18][t][no source][no method][no target][no option][no type]
type: Concept
definition: 2.E.5 [Other electronics industry][no classification][Emissions][C10F18][t][no source][no method][no target][no option][no type]
status: valid
status modified: 2017-02-13
accepted date: 2017-02-13
in scheme: emissions_variables_MMR

2.E.5 [Other electronics industry][no classification][Emissions][C2F6][t][no source][no method][no target][no option][no type]
type: Concept
definition: 2.E.5 [Other electronics industry][no classification][Emissions][C2F6][t][no source][no method][no target][no option][no type]
status: valid
status modified: 2017-02-13
accepted date: 2017-02-13
in scheme: emissions_variables_MMR

2.E.5 [Other electronics industry][no classification][Emissions][C3F8][t][no source][no method][no target][no option][no type]
type: Concept
definition: 2.E.5 [Other electronics industry][no classification][Emissions][C3F8][t][no source][no method][no target][no option][no type]
status: valid
status modified: 2017-02-13
accepted date: 2017-02-13
in scheme: emissions_variables_MMR

2.E.5 [Other electronics industry][no classification][Emissions][C4F10][t][no source][no method][no target][no option][no type]
type: Concept
definition: 2.E.5 [Other electronics industry][no classification][Emissions][C4F10][t][no source][no method][no target][no option][no type]
status: valid
status modified: 2017-02-13
accepted date: 2017-02-13
in scheme: emissions_variables_MMR

2.E.5 [Other electronics industry][no classification][Emissions][C5F12][t][no source][no method][no target][no option][no type]
type: Concept
definition: 2.E.5 [Other electronics industry][no classification][Emissions][C5F12][t][no source][no method][no target][no option][no type]
status: valid
status modified: 2017-02-13
accepted date: 2017-02-13
in scheme: emissions_variables_MMR

2.E.5 [Other electronics industry][no classification][Emissions][C6F14][t][no source][no method][no target][no option][no type]
type: Concept
definition: 2.E.5 [Other electronics industry][no classification][Emissions][C6F14][t][no source][no method][no target][no option][no type]
status: valid
status modified: 2017-02-13
accepted date: 2017-02-13
in scheme: emissions_variables_MMR

2.E.5 [Other electronics industry][no classification][Emissions][c-C3F6][t][no source][no method][no target][no option][no type]
type: Concept
definition: 2.E.5 [Other electronics industry][no classification][Emissions][c-C3F6][t][no source][no method][no target][no option][no type]
status: valid
status modified: 2017-02-13
accepted date: 2017-02-13
in scheme: emissions_variables_MMR

2.E.5 [Other electronics industry][no classification][Emissions][c-C4F8][t][no source][no method][no target][no option][no type]
type: Concept
definition: 2.E.5 [Other electronics industry][no classification][Emissions][c-C4F8][t][no source][no method][no target][no option][no type]
status: valid
status modified: 2017-02-13
accepted date: 2017-02-13
in scheme: emissions_variables_MMR

2.E.5 [Other electronics industry][no classification][Emissions][CF4][t][no source][no method][no target][no option][no type]
type: Concept
definition: 2.E.5 [Other electronics industry][no classification][Emissions][CF4][t][no source][no method][no target][no option][no type]
status: valid
status modified: 2017-02-13
accepted date: 2017-02-13
in scheme: emissions_variables_MMR

2.E.5 [Other electronics industry][no classification][Emissions][HFC-125][t][no source][no method][no target][no option][no type]
type: Concept
definition: 2.E.5 [Other electronics industry][no classification][Emissions][HFC-125][t][no source][no method][no target][no option][no type]
status: valid
status modified: 2017-02-13
accepted date: 2017-02-13
in scheme: emissions_variables_MMR

2.E.5 [Other electronics industry][no classification][Emissions][HFC-134][t][no source][no method][no target][no option][no type]
type: Concept
definition: 2.E.5 [Other electronics industry][no classification][Emissions][HFC-134][t][no source][no method][no target][no option][no type]
status: valid
status modified: 2017-02-13
accepted date: 2017-02-13
in scheme: emissions_variables_MMR

2.E.5 [Other electronics industry][no classification][Emissions][HFC-134a][t][no source][no method][no target][no option][no type]
type: Concept
definition: 2.E.5 [Other electronics industry][no classification][Emissions][HFC-134a][t][no source][no method][no target][no option][no type]
status: valid
status modified: 2017-02-13
accepted date: 2017-02-13
in scheme: emissions_variables_MMR

2.E.5 [Other electronics industry][no classification][Emissions][HFC-143][t][no source][no method][no target][no option][no type]
type: Concept
definition: 2.E.5 [Other electronics industry][no classification][Emissions][HFC-143][t][no source][no method][no target][no option][no type]
status: valid
status modified: 2017-02-13
accepted date: 2017-02-13
in scheme: emissions_variables_MMR

2.E.5 [Other electronics industry][no classification][Emissions][HFC-143a][t][no source][no method][no target][no option][no type]
type: Concept
definition: 2.E.5 [Other electronics industry][no classification][Emissions][HFC-143a][t][no source][no method][no target][no option][no type]
status: valid
status modified: 2017-02-13
accepted date: 2017-02-13
in scheme: emissions_variables_MMR

2.E.5 [Other electronics industry][no classification][Emissions][HFC-152][t][no source][no method][no target][no option][no type]
type: Concept
definition: 2.E.5 [Other electronics industry][no classification][Emissions][HFC-152][t][no source][no method][no target][no option][no type]
status: valid
status modified: 2017-02-13
accepted date: 2017-02-13
in scheme: emissions_variables_MMR

2.E.5 [Other electronics industry][no classification][Emissions][HFC-152a][t][no source][no method][no target][no option][no type]
type: Concept
definition: 2.E.5 [Other electronics industry][no classification][Emissions][HFC-152a][t][no source][no method][no target][no option][no type]
status: valid
status modified: 2017-02-13
accepted date: 2017-02-13
in scheme: emissions_variables_MMR

2.E.5 [Other electronics industry][no classification][Emissions][HFC-161][t][no source][no method][no target][no option][no type]
type: Concept
definition: 2.E.5 [Other electronics industry][no classification][Emissions][HFC-161][t][no source][no method][no target][no option][no type]
status: valid
status modified: 2017-02-13
accepted date: 2017-02-13
in scheme: emissions_variables_MMR

2.E.5 [Other electronics industry][no classification][Emissions][HFC-227ea][t][no source][no method][no target][no option][no type]
type: Concept
definition: 2.E.5 [Other electronics industry][no classification][Emissions][HFC-227ea][t][no source][no method][no target][no option][no type]
status: valid
status modified: 2017-02-13
accepted date: 2017-02-13
in scheme: emissions_variables_MMR

2.E.5 [Other electronics industry][no classification][Emissions][HFC-23][t][no source][no method][no target][no option][no type]
type: Concept
definition: 2.E.5 [Other electronics industry][no classification][Emissions][HFC-23][t][no source][no method][no target][no option][no type]
status: valid
status modified: 2017-02-13
accepted date: 2017-02-13
in scheme: emissions_variables_MMR

2.E.5 [Other electronics industry][no classification][Emissions][HFC-236cb][t][no source][no method][no target][no option][no type]
type: Concept
definition: 2.E.5 [Other electronics industry][no classification][Emissions][HFC-236cb][t][no source][no method][no target][no option][no type]
status: valid
status modified: 2017-02-13
accepted date: 2017-02-13
in scheme: emissions_variables_MMR

2.E.5 [Other electronics industry][no classification][Emissions][HFC-236ea][t][no source][no method][no target][no option][no type]
type: Concept
definition: 2.E.5 [Other electronics industry][no classification][Emissions][HFC-236ea][t][no source][no method][no target][no option][no type]
status: valid
status modified: 2017-02-13
accepted date: 2017-02-13
in scheme: emissions_variables_MMR

2.E.5 [Other electronics industry][no classification][Emissions][HFC-236fa][t][no source][no method][no target][no option][no type]
type: Concept
definition: 2.E.5 [Other electronics industry][no classification][Emissions][HFC-236fa][t][no source][no method][no target][no option][no type]
status: valid
status modified: 2017-02-13
accepted date: 2017-02-13
in scheme: emissions_variables_MMR

2.E.5 [Other electronics industry][no classification][Emissions][HFC-245ca][t][no source][no method][no target][no option][no type]
type: Concept
definition: 2.E.5 [Other electronics industry][no classification][Emissions][HFC-245ca][t][no source][no method][no target][no option][no type]
status: valid
status modified: 2017-02-13
accepted date: 2017-02-13
in scheme: emissions_variables_MMR

2.E.5 [Other electronics industry][no classification][Emissions][HFC-245fa][t][no source][no method][no target][no option][no type]
type: Concept
definition: 2.E.5 [Other electronics industry][no classification][Emissions][HFC-245fa][t][no source][no method][no target][no option][no type]
status: valid
status modified: 2017-02-13
accepted date: 2017-02-13
in scheme: emissions_variables_MMR

2.E.5 [Other electronics industry][no classification][Emissions][HFC-32][t][no source][no method][no target][no option][no type]
type: Concept
definition: 2.E.5 [Other electronics industry][no classification][Emissions][HFC-32][t][no source][no method][no target][no option][no type]
status: valid
status modified: 2017-02-13
accepted date: 2017-02-13
in scheme: emissions_variables_MMR

2.E.5 [Other electronics industry][no classification][Emissions][HFC-365mfc][t][no source][no method][no target][no option][no type]
type: Concept
definition: 2.E.5 [Other electronics industry][no classification][Emissions][HFC-365mfc][t][no source][no method][no target][no option][no type]
status: valid
status modified: 2017-02-13
accepted date: 2017-02-13
in scheme: emissions_variables_MMR

2.E.5 [Other electronics industry][no classification][Emissions][HFC-41][t][no source][no method][no target][no option][no type]
type: Concept
definition: 2.E.5 [Other electronics industry][no classification][Emissions][HFC-41][t][no source][no method][no target][no option][no type]
status: valid
status modified: 2017-02-13
accepted date: 2017-02-13
in scheme: emissions_variables_MMR

2.E.5 [Other electronics industry][no classification][Emissions][HFC-43-10mee][t][no source][no method][no target][no option][no type]
type: Concept
definition: 2.E.5 [Other electronics industry][no classification][Emissions][HFC-43-10mee][t][no source][no method][no target][no option][no type]
status: valid
status modified: 2017-02-13
accepted date: 2017-02-13
in scheme: emissions_variables_MMR

2.E.5 [Other electronics industry][no classification][Emissions][HFCs][kt CO2 equivalent][no source][no method][no target][no option][no type]
type: Concept
definition: 2.E.5 [Other electronics industry][no classification][Emissions][HFCs][kt CO2 equivalent][no source][no method][no target][no option][no type]
status: valid
status modified: 2017-02-13
accepted date: 2017-02-13
in scheme: emissions_variables_MMR

2.E.5 [Other electronics industry][no classification][Emissions][NF3][t][no source][no method][no target][no option][no type]
type: Concept
definition: 2.E.5 [Other electronics industry][no classification][Emissions][NF3][t][no source][no method][no target][no option][no type]
status: valid
status modified: 2017-02-13
accepted date: 2017-02-13
in scheme: emissions_variables_MMR

2.E.5 [Other electronics industry][no classification][Emissions][no gas][kt CO2 equivalent][no source][no method][no target][no option][no type]
type: Concept
definition: 2.E.5 [Other electronics industry][no classification][Emissions][no gas][kt CO2 equivalent][no source][no method][no target][no option][no type]
status: valid
status modified: 2017-02-13
accepted date: 2017-02-13
in scheme: emissions_variables_MMR

2.E.5 [Other electronics industry][no classification][Emissions][PFCs][kt CO2 equivalent][no source][no method][no target][no option][no type]
type: Concept
definition: 2.E.5 [Other electronics industry][no classification][Emissions][PFCs][kt CO2 equivalent][no source][no method][no target][no option][no type]
status: valid
status modified: 2017-02-13
accepted date: 2017-02-13
in scheme: emissions_variables_MMR

2.E.5 [Other electronics industry][no classification][Emissions][SF6][t][no source][no method][no target][no option][no type]
type: Concept
definition: 2.E.5 [Other electronics industry][no classification][Emissions][SF6][t][no source][no method][no target][no option][no type]
status: valid
status modified: 2017-02-13
accepted date: 2017-02-13
in scheme: emissions_variables_MMR

2.E.5 [Other electronics industry][no classification][Emissions][Unspecified mix of HFCs and PFCs][t CO2 equivalent][no source][no method][no target][no option][no type]
type: Concept
definition: 2.E.5 [Other electronics industry][no classification][Emissions][Unspecified mix of HFCs and PFCs][t CO2 equivalent][no source][no method][no target][no option][no type]
status: valid
status modified: 2017-02-13
accepted date: 2017-02-13
in scheme: emissions_variables_MMR

2.E.5 [Other electronics industry][no classification][Emissions][Unspecified mix of HFCs][t CO2 equivalent][no source][no method][no target][no option][no type]
type: Concept
definition: 2.E.5 [Other electronics industry][no classification][Emissions][Unspecified mix of HFCs][t CO2 equivalent][no source][no method][no target][no option][no type]
status: valid
status modified: 2017-02-13
accepted date: 2017-02-13
in scheme: emissions_variables_MMR

2.E.5 [Other electronics industry][no classification][Emissions][Unspecified mix of PFCs][t CO2 equivalent][no source][no method][no target][no option][no type]
type: Concept
definition: 2.E.5 [Other electronics industry][no classification][Emissions][Unspecified mix of PFCs][t CO2 equivalent][no source][no method][no target][no option][no type]
status: valid
status modified: 2017-02-13
accepted date: 2017-02-13
in scheme: emissions_variables_MMR

2.F [Product Uses as Substitutes for ODS][no classification][Emissions][Aggregate F-gases][t CO2 equivalent][no source][no method][no target][no option][no type]
type: Concept
definition: 2.F [Product Uses as Substitutes for ODS][no classification][Emissions][Aggregate F-gases][t CO2 equivalent][no source][no method][no target][no option][no type]
status: valid
status modified: 2017-02-13
accepted date: 2017-02-13
in scheme: emissions_variables_MMR

2.F [Product Uses as Substitutes for ODS][no classification][Emissions][Aggregate GHGs][kt CO2 equivalent][no source][no method][no target][no option][no type]
type: Concept
definition: 2.F [Product Uses as Substitutes for ODS][no classification][Emissions][Aggregate GHGs][kt CO2 equivalent][no source][no method][no target][no option][no type]
status: valid
status modified: 2017-02-13
accepted date: 2017-02-13
in scheme: emissions_variables_MMR

2.F [Product Uses as Substitutes for ODS][no classification][Emissions][C10F18][t][no source][no method][no target][no option][no type]
type: Concept
definition: 2.F [Product Uses as Substitutes for ODS][no classification][Emissions][C10F18][t][no source][no method][no target][no option][no type]
status: valid
status modified: 2017-02-13
accepted date: 2017-02-13
in scheme: emissions_variables_MMR

2.F [Product Uses as Substitutes for ODS][no classification][Emissions][C2F6][t][no source][no method][no target][no option][no type]
type: Concept
definition: 2.F [Product Uses as Substitutes for ODS][no classification][Emissions][C2F6][t][no source][no method][no target][no option][no type]
status: valid
status modified: 2017-02-13
accepted date: 2017-02-13
in scheme: emissions_variables_MMR

2.F [Product Uses as Substitutes for ODS][no classification][Emissions][C3F8][t][no source][no method][no target][no option][no type]
type: Concept
definition: 2.F [Product Uses as Substitutes for ODS][no classification][Emissions][C3F8][t][no source][no method][no target][no option][no type]
status: valid
status modified: 2017-02-13
accepted date: 2017-02-13
in scheme: emissions_variables_MMR

2.F [Product Uses as Substitutes for ODS][no classification][Emissions][C4F10][t][no source][no method][no target][no option][no type]
type: Concept
definition: 2.F [Product Uses as Substitutes for ODS][no classification][Emissions][C4F10][t][no source][no method][no target][no option][no type]
status: valid
status modified: 2017-02-13
accepted date: 2017-02-13
in scheme: emissions_variables_MMR

2.F [Product Uses as Substitutes for ODS][no classification][Emissions][C5F12][t][no source][no method][no target][no option][no type]
type: Concept
definition: 2.F [Product Uses as Substitutes for ODS][no classification][Emissions][C5F12][t][no source][no method][no target][no option][no type]
status: valid
status modified: 2017-02-13
accepted date: 2017-02-13
in scheme: emissions_variables_MMR

2.F [Product Uses as Substitutes for ODS][no classification][Emissions][C6F14][t][no source][no method][no target][no option][no type]
type: Concept
definition: 2.F [Product Uses as Substitutes for ODS][no classification][Emissions][C6F14][t][no source][no method][no target][no option][no type]
status: valid
status modified: 2017-02-13
accepted date: 2017-02-13
in scheme: emissions_variables_MMR

2.F [Product Uses as Substitutes for ODS][no classification][Emissions][c-C3F6][t][no source][no method][no target][no option][no type]
type: Concept
definition: 2.F [Product Uses as Substitutes for ODS][no classification][Emissions][c-C3F6][t][no source][no method][no target][no option][no type]
status: valid
status modified: 2017-02-13
accepted date: 2017-02-13
in scheme: emissions_variables_MMR

2.F [Product Uses as Substitutes for ODS][no classification][Emissions][c-C4F8][t][no source][no method][no target][no option][no type]
type: Concept
definition: 2.F [Product Uses as Substitutes for ODS][no classification][Emissions][c-C4F8][t][no source][no method][no target][no option][no type]
status: valid
status modified: 2017-02-13
accepted date: 2017-02-13
in scheme: emissions_variables_MMR

2.F [Product Uses as Substitutes for ODS][no classification][Emissions][CF4][t][no source][no method][no target][no option][no type]
type: Concept
definition: 2.F [Product Uses as Substitutes for ODS][no classification][Emissions][CF4][t][no source][no method][no target][no option][no type]
status: valid
status modified: 2017-02-13
accepted date: 2017-02-13
in scheme: emissions_variables_MMR

2.F [Product Uses as Substitutes for ODS][no classification][Emissions][HFC-125][t][no source][no method][no target][no option][no type]
type: Concept
definition: 2.F [Product Uses as Substitutes for ODS][no classification][Emissions][HFC-125][t][no source][no method][no target][no option][no type]
status: valid
status modified: 2017-02-13
accepted date: 2017-02-13
in scheme: emissions_variables_MMR

2.F [Product Uses as Substitutes for ODS][no classification][Emissions][HFC-134][t][no source][no method][no target][no option][no type]
type: Concept
definition: 2.F [Product Uses as Substitutes for ODS][no classification][Emissions][HFC-134][t][no source][no method][no target][no option][no type]
status: valid
status modified: 2017-02-13
accepted date: 2017-02-13
in scheme: emissions_variables_MMR

2.F [Product Uses as Substitutes for ODS][no classification][Emissions][HFC-134a][t][no source][no method][no target][no option][no type]
type: Concept
definition: 2.F [Product Uses as Substitutes for ODS][no classification][Emissions][HFC-134a][t][no source][no method][no target][no option][no type]
status: valid
status modified: 2017-02-13
accepted date: 2017-02-13
in scheme: emissions_variables_MMR

2.F [Product Uses as Substitutes for ODS][no classification][Emissions][HFC-143][t][no source][no method][no target][no option][no type]
type: Concept
definition: 2.F [Product Uses as Substitutes for ODS][no classification][Emissions][HFC-143][t][no source][no method][no target][no option][no type]
status: valid
status modified: 2017-02-13
accepted date: 2017-02-13
in scheme: emissions_variables_MMR

2.F [Product Uses as Substitutes for ODS][no classification][Emissions][HFC-143a][t][no source][no method][no target][no option][no type]
type: Concept
definition: 2.F [Product Uses as Substitutes for ODS][no classification][Emissions][HFC-143a][t][no source][no method][no target][no option][no type]
status: valid
status modified: 2017-02-13
accepted date: 2017-02-13
in scheme: emissions_variables_MMR

2.F [Product Uses as Substitutes for ODS][no classification][Emissions][HFC-152][t][no source][no method][no target][no option][no type]
type: Concept
definition: 2.F [Product Uses as Substitutes for ODS][no classification][Emissions][HFC-152][t][no source][no method][no target][no option][no type]
status: valid
status modified: 2017-02-13
accepted date: 2017-02-13
in scheme: emissions_variables_MMR

2.F [Product Uses as Substitutes for ODS][no classification][Emissions][HFC-152a][t][no source][no method][no target][no option][no type]
type: Concept
definition: 2.F [Product Uses as Substitutes for ODS][no classification][Emissions][HFC-152a][t][no source][no method][no target][no option][no type]
status: valid
status modified: 2017-02-13
accepted date: 2017-02-13
in scheme: emissions_variables_MMR

2.F [Product Uses as Substitutes for ODS][no classification][Emissions][HFC-161][t][no source][no method][no target][no option][no type]
type: Concept
definition: 2.F [Product Uses as Substitutes for ODS][no classification][Emissions][HFC-161][t][no source][no method][no target][no option][no type]
status: valid
status modified: 2017-02-13
accepted date: 2017-02-13
in scheme: emissions_variables_MMR

2.F [Product Uses as Substitutes for ODS][no classification][Emissions][HFC-227ea][t][no source][no method][no target][no option][no type]
type: Concept
definition: 2.F [Product Uses as Substitutes for ODS][no classification][Emissions][HFC-227ea][t][no source][no method][no target][no option][no type]
status: valid
status modified: 2017-02-13
accepted date: 2017-02-13
in scheme: emissions_variables_MMR

2.F [Product Uses as Substitutes for ODS][no classification][Emissions][HFC-23][t][no source][no method][no target][no option][no type]
type: Concept
definition: 2.F [Product Uses as Substitutes for ODS][no classification][Emissions][HFC-23][t][no source][no method][no target][no option][no type]
status: valid
status modified: 2017-02-13
accepted date: 2017-02-13
in scheme: emissions_variables_MMR

2.F [Product Uses as Substitutes for ODS][no classification][Emissions][HFC-236cb][t][no source][no method][no target][no option][no type]
type: Concept
definition: 2.F [Product Uses as Substitutes for ODS][no classification][Emissions][HFC-236cb][t][no source][no method][no target][no option][no type]
status: valid
status modified: 2017-02-13
accepted date: 2017-02-13
in scheme: emissions_variables_MMR

2.F [Product Uses as Substitutes for ODS][no classification][Emissions][HFC-236ea][t][no source][no method][no target][no option][no type]
type: Concept
definition: 2.F [Product Uses as Substitutes for ODS][no classification][Emissions][HFC-236ea][t][no source][no method][no target][no option][no type]
status: valid
status modified: 2017-02-13
accepted date: 2017-02-13
in scheme: emissions_variables_MMR

2.F [Product Uses as Substitutes for ODS][no classification][Emissions][HFC-236fa][t][no source][no method][no target][no option][no type]
type: Concept
definition: 2.F [Product Uses as Substitutes for ODS][no classification][Emissions][HFC-236fa][t][no source][no method][no target][no option][no type]
status: valid
status modified: 2017-02-13
accepted date: 2017-02-13
in scheme: emissions_variables_MMR

2.F [Product Uses as Substitutes for ODS][no classification][Emissions][HFC-245ca][t][no source][no method][no target][no option][no type]
type: Concept
definition: 2.F [Product Uses as Substitutes for ODS][no classification][Emissions][HFC-245ca][t][no source][no method][no target][no option][no type]
status: valid
status modified: 2017-02-13
accepted date: 2017-02-13
in scheme: emissions_variables_MMR

2.F [Product Uses as Substitutes for ODS][no classification][Emissions][HFC-245fa][t][no source][no method][no target][no option][no type]
type: Concept
definition: 2.F [Product Uses as Substitutes for ODS][no classification][Emissions][HFC-245fa][t][no source][no method][no target][no option][no type]
status: valid
status modified: 2017-02-13
accepted date: 2017-02-13
in scheme: emissions_variables_MMR

2.F [Product Uses as Substitutes for ODS][no classification][Emissions][HFC-32][t][no source][no method][no target][no option][no type]
type: Concept
definition: 2.F [Product Uses as Substitutes for ODS][no classification][Emissions][HFC-32][t][no source][no method][no target][no option][no type]
status: valid
status modified: 2017-02-13
accepted date: 2017-02-13
in scheme: emissions_variables_MMR

2.F [Product Uses as Substitutes for ODS][no classification][Emissions][HFC-365mfc][t][no source][no method][no target][no option][no type]
type: Concept
definition: 2.F [Product Uses as Substitutes for ODS][no classification][Emissions][HFC-365mfc][t][no source][no method][no target][no option][no type]
status: valid
status modified: 2017-02-13
accepted date: 2017-02-13
in scheme: emissions_variables_MMR

2.F [Product Uses as Substitutes for ODS][no classification][Emissions][HFC-41][t][no source][no method][no target][no option][no type]
type: Concept
definition: 2.F [Product Uses as Substitutes for ODS][no classification][Emissions][HFC-41][t][no source][no method][no target][no option][no type]
status: valid
status modified: 2017-02-13
accepted date: 2017-02-13
in scheme: emissions_variables_MMR

2.F [Product Uses as Substitutes for ODS][no classification][Emissions][HFC-43-10mee][t][no source][no method][no target][no option][no type]
type: Concept
definition: 2.F [Product Uses as Substitutes for ODS][no classification][Emissions][HFC-43-10mee][t][no source][no method][no target][no option][no type]
status: valid
status modified: 2017-02-13
accepted date: 2017-02-13
in scheme: emissions_variables_MMR

2.F [Product Uses as Substitutes for ODS][no classification][Emissions][HFCs and PFCs][t CO2 equivalent][no source][no method][no target][no option][no type]
type: Concept
definition: 2.F [Product Uses as Substitutes for ODS][no classification][Emissions][HFCs and PFCs][t CO2 equivalent][no source][no method][no target][no option][no type]
status: valid
status modified: 2017-02-13
accepted date: 2017-02-13
in scheme: emissions_variables_MMR

2.F [Product Uses as Substitutes for ODS][no classification][Emissions][HFCs][t CO2 equivalent][no source][no method][no target][no option][no type]
type: Concept
definition: 2.F [Product Uses as Substitutes for ODS][no classification][Emissions][HFCs][t CO2 equivalent][no source][no method][no target][no option][no type]
status: valid
status modified: 2017-02-13
accepted date: 2017-02-13
in scheme: emissions_variables_MMR

2.F [Product Uses as Substitutes for ODS][no classification][Emissions][NF3][t][no source][no method][no target][no option][no type]
type: Concept
definition: 2.F [Product Uses as Substitutes for ODS][no classification][Emissions][NF3][t][no source][no method][no target][no option][no type]
status: valid
status modified: 2017-02-13
accepted date: 2017-02-13
in scheme: emissions_variables_MMR

2.F [Product Uses as Substitutes for ODS][no classification][Emissions][PFCs][t CO2 equivalent][no source][no method][no target][no option][no type]
type: Concept
definition: 2.F [Product Uses as Substitutes for ODS][no classification][Emissions][PFCs][t CO2 equivalent][no source][no method][no target][no option][no type]
status: valid
status modified: 2017-02-13
accepted date: 2017-02-13
in scheme: emissions_variables_MMR

2.F [Product Uses as Substitutes for ODS][no classification][Emissions][SF6][t][no source][no method][no target][no option][no type]
type: Concept
definition: 2.F [Product Uses as Substitutes for ODS][no classification][Emissions][SF6][t][no source][no method][no target][no option][no type]
status: valid
status modified: 2017-02-13
accepted date: 2017-02-13
in scheme: emissions_variables_MMR

2.F [Product Uses as Substitutes for ODS][no classification][Emissions][Unspecified mix of HFCs and PFCs][t CO2 equivalent][no source][no method][no target][no option][no type]
type: Concept
definition: 2.F [Product Uses as Substitutes for ODS][no classification][Emissions][Unspecified mix of HFCs and PFCs][t CO2 equivalent][no source][no method][no target][no option][no type]
status: valid
status modified: 2017-02-13
accepted date: 2017-02-13
in scheme: emissions_variables_MMR

2.F [Product Uses as Substitutes for ODS][no classification][Emissions][Unspecified mix of HFCs][t CO2 equivalent][no source][no method][no target][no option][no type]
type: Concept
definition: 2.F [Product Uses as Substitutes for ODS][no classification][Emissions][Unspecified mix of HFCs][t CO2 equivalent][no source][no method][no target][no option][no type]
status: valid
status modified: 2017-02-13
accepted date: 2017-02-13
in scheme: emissions_variables_MMR

2.F [Product Uses as Substitutes for ODS][no classification][Emissions][Unspecified mix of PFCs][t CO2 equivalent][no source][no method][no target][no option][no type]
type: Concept
definition: 2.F [Product Uses as Substitutes for ODS][no classification][Emissions][Unspecified mix of PFCs][t CO2 equivalent][no source][no method][no target][no option][no type]
status: valid
status modified: 2017-02-13
accepted date: 2017-02-13
in scheme: emissions_variables_MMR

2.F.1 [Refrigeration and Air conditioning][no classification][Emissions][Aggregate F-gases][t CO2 equivalent][no source][no method][no target][no option][no type]
type: Concept
definition: 2.F.1 [Refrigeration and Air conditioning][no classification][Emissions][Aggregate F-gases][t CO2 equivalent][no source][no method][no target][no option][no type]
status: valid
status modified: 2017-02-13
accepted date: 2017-02-13
in scheme: emissions_variables_MMR

2.F.1 [Refrigeration and Air conditioning][no classification][Emissions][C10F18][t][no source][no method][no target][no option][no type]
type: Concept
definition: 2.F.1 [Refrigeration and Air conditioning][no classification][Emissions][C10F18][t][no source][no method][no target][no option][no type]
status: valid
status modified: 2017-02-13
accepted date: 2017-02-13
in scheme: emissions_variables_MMR

2.F.1 [Refrigeration and Air conditioning][no classification][Emissions][C2F6][t][no source][no method][no target][no option][no type]
type: Concept
definition: 2.F.1 [Refrigeration and Air conditioning][no classification][Emissions][C2F6][t][no source][no method][no target][no option][no type]
status: valid
status modified: 2017-02-13
accepted date: 2017-02-13
in scheme: emissions_variables_MMR

2.F.1 [Refrigeration and Air conditioning][no classification][Emissions][C3F8][t][no source][no method][no target][no option][no type]
type: Concept
definition: 2.F.1 [Refrigeration and Air conditioning][no classification][Emissions][C3F8][t][no source][no method][no target][no option][no type]
status: valid
status modified: 2017-02-13
accepted date: 2017-02-13
in scheme: emissions_variables_MMR

2.F.1 [Refrigeration and Air conditioning][no classification][Emissions][C4F10][t][no source][no method][no target][no option][no type]
type: Concept
definition: 2.F.1 [Refrigeration and Air conditioning][no classification][Emissions][C4F10][t][no source][no method][no target][no option][no type]
status: valid
status modified: 2017-02-13
accepted date: 2017-02-13
in scheme: emissions_variables_MMR

2.F.1 [Refrigeration and Air conditioning][no classification][Emissions][C5F12][t][no source][no method][no target][no option][no type]
type: Concept
definition: 2.F.1 [Refrigeration and Air conditioning][no classification][Emissions][C5F12][t][no source][no method][no target][no option][no type]
status: valid
status modified: 2017-02-13
accepted date: 2017-02-13
in scheme: emissions_variables_MMR

2.F.1 [Refrigeration and Air conditioning][no classification][Emissions][C6F14][t][no source][no method][no target][no option][no type]
type: Concept
definition: 2.F.1 [Refrigeration and Air conditioning][no classification][Emissions][C6F14][t][no source][no method][no target][no option][no type]
status: valid
status modified: 2017-02-13
accepted date: 2017-02-13
in scheme: emissions_variables_MMR

2.F.1 [Refrigeration and Air conditioning][no classification][Emissions][c-C3F6][t][no source][no method][no target][no option][no type]
type: Concept
definition: 2.F.1 [Refrigeration and Air conditioning][no classification][Emissions][c-C3F6][t][no source][no method][no target][no option][no type]
status: valid
status modified: 2017-02-13
accepted date: 2017-02-13
in scheme: emissions_variables_MMR

2.F.1 [Refrigeration and Air conditioning][no classification][Emissions][c-C4F8][t][no source][no method][no target][no option][no type]
type: Concept
definition: 2.F.1 [Refrigeration and Air conditioning][no classification][Emissions][c-C4F8][t][no source][no method][no target][no option][no type]
status: valid
status modified: 2017-02-13
accepted date: 2017-02-13
in scheme: emissions_variables_MMR

2.F.1 [Refrigeration and Air conditioning][no classification][Emissions][CF4][t][no source][no method][no target][no option][no type]
type: Concept
definition: 2.F.1 [Refrigeration and Air conditioning][no classification][Emissions][CF4][t][no source][no method][no target][no option][no type]
status: valid
status modified: 2017-02-13
accepted date: 2017-02-13
in scheme: emissions_variables_MMR

2.F.1 [Refrigeration and Air conditioning][no classification][Emissions][HFC-125][t][no source][no method][no target][no option][no type]
type: Concept
definition: 2.F.1 [Refrigeration and Air conditioning][no classification][Emissions][HFC-125][t][no source][no method][no target][no option][no type]
status: valid
status modified: 2017-02-13
accepted date: 2017-02-13
in scheme: emissions_variables_MMR

2.F.1 [Refrigeration and Air conditioning][no classification][Emissions][HFC-134][t][no source][no method][no target][no option][no type]
type: Concept
definition: 2.F.1 [Refrigeration and Air conditioning][no classification][Emissions][HFC-134][t][no source][no method][no target][no option][no type]
status: valid
status modified: 2017-02-13
accepted date: 2017-02-13
in scheme: emissions_variables_MMR

2.F.1 [Refrigeration and Air conditioning][no classification][Emissions][HFC-134a][t][no source][no method][no target][no option][no type]
type: Concept
definition: 2.F.1 [Refrigeration and Air conditioning][no classification][Emissions][HFC-134a][t][no source][no method][no target][no option][no type]
status: valid
status modified: 2017-02-13
accepted date: 2017-02-13
in scheme: emissions_variables_MMR

2.F.1 [Refrigeration and Air conditioning][no classification][Emissions][HFC-143][t][no source][no method][no target][no option][no type]
type: Concept
definition: 2.F.1 [Refrigeration and Air conditioning][no classification][Emissions][HFC-143][t][no source][no method][no target][no option][no type]
status: valid
status modified: 2017-02-13
accepted date: 2017-02-13
in scheme: emissions_variables_MMR

2.F.1 [Refrigeration and Air conditioning][no classification][Emissions][HFC-143a][t][no source][no method][no target][no option][no type]
type: Concept
definition: 2.F.1 [Refrigeration and Air conditioning][no classification][Emissions][HFC-143a][t][no source][no method][no target][no option][no type]
status: valid
status modified: 2017-02-13
accepted date: 2017-02-13
in scheme: emissions_variables_MMR

2.F.1 [Refrigeration and Air conditioning][no classification][Emissions][HFC-152][t][no source][no method][no target][no option][no type]
type: Concept
definition: 2.F.1 [Refrigeration and Air conditioning][no classification][Emissions][HFC-152][t][no source][no method][no target][no option][no type]
status: valid
status modified: 2017-02-13
accepted date: 2017-02-13
in scheme: emissions_variables_MMR

2.F.1 [Refrigeration and Air conditioning][no classification][Emissions][HFC-152a][t][no source][no method][no target][no option][no type]
type: Concept
definition: 2.F.1 [Refrigeration and Air conditioning][no classification][Emissions][HFC-152a][t][no source][no method][no target][no option][no type]
status: valid
status modified: 2017-02-13
accepted date: 2017-02-13
in scheme: emissions_variables_MMR

2.F.1 [Refrigeration and Air conditioning][no classification][Emissions][HFC-161][t][no source][no method][no target][no option][no type]
type: Concept
definition: 2.F.1 [Refrigeration and Air conditioning][no classification][Emissions][HFC-161][t][no source][no method][no target][no option][no type]
status: valid
status modified: 2017-02-13
accepted date: 2017-02-13
in scheme: emissions_variables_MMR

2.F.1 [Refrigeration and Air conditioning][no classification][Emissions][HFC-227ea][t][no source][no method][no target][no option][no type]
type: Concept
definition: 2.F.1 [Refrigeration and Air conditioning][no classification][Emissions][HFC-227ea][t][no source][no method][no target][no option][no type]
status: valid
status modified: 2017-02-13
accepted date: 2017-02-13
in scheme: emissions_variables_MMR

2.F.1 [Refrigeration and Air conditioning][no classification][Emissions][HFC-23][t][no source][no method][no target][no option][no type]
type: Concept
definition: 2.F.1 [Refrigeration and Air conditioning][no classification][Emissions][HFC-23][t][no source][no method][no target][no option][no type]
status: valid
status modified: 2017-02-13
accepted date: 2017-02-13
in scheme: emissions_variables_MMR

2.F.1 [Refrigeration and Air conditioning][no classification][Emissions][HFC-236cb][t][no source][no method][no target][no option][no type]
type: Concept
definition: 2.F.1 [Refrigeration and Air conditioning][no classification][Emissions][HFC-236cb][t][no source][no method][no target][no option][no type]
status: valid
status modified: 2017-02-13
accepted date: 2017-02-13
in scheme: emissions_variables_MMR

2.F.1 [Refrigeration and Air conditioning][no classification][Emissions][HFC-236ea][t][no source][no method][no target][no option][no type]
type: Concept
definition: 2.F.1 [Refrigeration and Air conditioning][no classification][Emissions][HFC-236ea][t][no source][no method][no target][no option][no type]
status: valid
status modified: 2017-02-13
accepted date: 2017-02-13
in scheme: emissions_variables_MMR

2.F.1 [Refrigeration and Air conditioning][no classification][Emissions][HFC-236fa][t][no source][no method][no target][no option][no type]
type: Concept
definition: 2.F.1 [Refrigeration and Air conditioning][no classification][Emissions][HFC-236fa][t][no source][no method][no target][no option][no type]
status: valid
status modified: 2017-02-13
accepted date: 2017-02-13
in scheme: emissions_variables_MMR

2.F.1 [Refrigeration and Air conditioning][no classification][Emissions][HFC-245ca][t][no source][no method][no target][no option][no type]
type: Concept
definition: 2.F.1 [Refrigeration and Air conditioning][no classification][Emissions][HFC-245ca][t][no source][no method][no target][no option][no type]
status: valid
status modified: 2017-02-13
accepted date: 2017-02-13
in scheme: emissions_variables_MMR

2.F.1 [Refrigeration and Air conditioning][no classification][Emissions][HFC-245fa][t][no source][no method][no target][no option][no type]
type: Concept
definition: 2.F.1 [Refrigeration and Air conditioning][no classification][Emissions][HFC-245fa][t][no source][no method][no target][no option][no type]
status: valid
status modified: 2017-02-13
accepted date: 2017-02-13
in scheme: emissions_variables_MMR

2.F.1 [Refrigeration and Air conditioning][no classification][Emissions][HFC-32][t][no source][no method][no target][no option][no type]
type: Concept
definition: 2.F.1 [Refrigeration and Air conditioning][no classification][Emissions][HFC-32][t][no source][no method][no target][no option][no type]
status: valid
status modified: 2017-02-13
accepted date: 2017-02-13
in scheme: emissions_variables_MMR

2.F.1 [Refrigeration and Air conditioning][no classification][Emissions][HFC-365mfc][t][no source][no method][no target][no option][no type]
type: Concept
definition: 2.F.1 [Refrigeration and Air conditioning][no classification][Emissions][HFC-365mfc][t][no source][no method][no target][no option][no type]
status: valid
status modified: 2017-02-13
accepted date: 2017-02-13
in scheme: emissions_variables_MMR

2.F.1 [Refrigeration and Air conditioning][no classification][Emissions][HFC-41][t][no source][no method][no target][no option][no type]
type: Concept
definition: 2.F.1 [Refrigeration and Air conditioning][no classification][Emissions][HFC-41][t][no source][no method][no target][no option][no type]
status: valid
status modified: 2017-02-13
accepted date: 2017-02-13
in scheme: emissions_variables_MMR

2.F.1 [Refrigeration and Air conditioning][no classification][Emissions][HFC-43-10mee][t][no source][no method][no target][no option][no type]
type: Concept
definition: 2.F.1 [Refrigeration and Air conditioning][no classification][Emissions][HFC-43-10mee][t][no source][no method][no target][no option][no type]
status: valid
status modified: 2017-02-13
accepted date: 2017-02-13
in scheme: emissions_variables_MMR

2.F.1 [Refrigeration and Air conditioning][no classification][Emissions][HFCs and PFCs][t CO2 equivalent][no source][no method][no target][no option][no type]
type: Concept
definition: 2.F.1 [Refrigeration and Air conditioning][no classification][Emissions][HFCs and PFCs][t CO2 equivalent][no source][no method][no target][no option][no type]
status: valid
status modified: 2017-02-13
accepted date: 2017-02-13
in scheme: emissions_variables_MMR

2.F.1 [Refrigeration and Air conditioning][no classification][Emissions][HFCs][t CO2 equivalent][no source][no method][no target][no option][no type]
type: Concept
definition: 2.F.1 [Refrigeration and Air conditioning][no classification][Emissions][HFCs][t CO2 equivalent][no source][no method][no target][no option][no type]
status: valid
status modified: 2017-02-13
accepted date: 2017-02-13
in scheme: emissions_variables_MMR

2.F.1 [Refrigeration and Air conditioning][no classification][Emissions][NF3][t][no source][no method][no target][no option][no type]
type: Concept
definition: 2.F.1 [Refrigeration and Air conditioning][no classification][Emissions][NF3][t][no source][no method][no target][no option][no type]
status: valid
status modified: 2017-02-13
accepted date: 2017-02-13
in scheme: emissions_variables_MMR

2.F.1 [Refrigeration and Air conditioning][no classification][Emissions][PFCs][t CO2 equivalent][no source][no method][no target][no option][no type]
type: Concept
definition: 2.F.1 [Refrigeration and Air conditioning][no classification][Emissions][PFCs][t CO2 equivalent][no source][no method][no target][no option][no type]
status: valid
status modified: 2017-02-13
accepted date: 2017-02-13
in scheme: emissions_variables_MMR

2.F.1 [Refrigeration and Air conditioning][no classification][Emissions][SF6][t][no source][no method][no target][no option][no type]
type: Concept
definition: 2.F.1 [Refrigeration and Air conditioning][no classification][Emissions][SF6][t][no source][no method][no target][no option][no type]
status: valid
status modified: 2017-02-13
accepted date: 2017-02-13
in scheme: emissions_variables_MMR

2.F.1 [Refrigeration and Air conditioning][no classification][Emissions][Unspecified mix of HFCs and PFCs][t CO2 equivalent][no source][no method][no target][no option][no type]
type: Concept
definition: 2.F.1 [Refrigeration and Air conditioning][no classification][Emissions][Unspecified mix of HFCs and PFCs][t CO2 equivalent][no source][no method][no target][no option][no type]
status: valid
status modified: 2017-02-13
accepted date: 2017-02-13
in scheme: emissions_variables_MMR

2.F.1 [Refrigeration and Air conditioning][no classification][Emissions][Unspecified mix of HFCs][t CO2 equivalent][no source][no method][no target][no option][no type]
type: Concept
definition: 2.F.1 [Refrigeration and Air conditioning][no classification][Emissions][Unspecified mix of HFCs][t CO2 equivalent][no source][no method][no target][no option][no type]
status: valid
status modified: 2017-02-13
accepted date: 2017-02-13
in scheme: emissions_variables_MMR

2.F.1 [Refrigeration and Air conditioning][no classification][Emissions][Unspecified mix of PFCs][t CO2 equivalent][no source][no method][no target][no option][no type]
type: Concept
definition: 2.F.1 [Refrigeration and Air conditioning][no classification][Emissions][Unspecified mix of PFCs][t CO2 equivalent][no source][no method][no target][no option][no type]
status: valid
status modified: 2017-02-13
accepted date: 2017-02-13
in scheme: emissions_variables_MMR

2.F.1.a [Commercial Refrigeration][no classification][Emissions][Aggregate F-gases][t CO2 equivalent][no source][no method][no target][no option][no type]
type: Concept
definition: 2.F.1.a [Commercial Refrigeration][no classification][Emissions][Aggregate F-gases][t CO2 equivalent][no source][no method][no target][no option][no type]
status: valid
status modified: 2017-02-13
accepted date: 2017-02-13
in scheme: emissions_variables_MMR

2.F.1.a [Commercial Refrigeration][no classification][Emissions][C10F18][t][From disposal][no method][no target][no option][no type]
type: Concept
definition: 2.F.1.a [Commercial Refrigeration][no classification][Emissions][C10F18][t][From disposal][no method][no target][no option][no type]
status: valid
status modified: 2017-02-13
accepted date: 2017-02-13
in scheme: emissions_variables_MMR

2.F.1.a [Commercial Refrigeration][no classification][Emissions][C10F18][t][From manufacturing][no method][no target][no option][no type]
type: Concept
definition: 2.F.1.a [Commercial Refrigeration][no classification][Emissions][C10F18][t][From manufacturing][no method][no target][no option][no type]
status: valid
status modified: 2017-02-13
accepted date: 2017-02-13
in scheme: emissions_variables_MMR

2.F.1.a [Commercial Refrigeration][no classification][Emissions][C10F18][t][From stocks][no method][no target][no option][no type]
type: Concept
definition: 2.F.1.a [Commercial Refrigeration][no classification][Emissions][C10F18][t][From stocks][no method][no target][no option][no type]
status: valid
status modified: 2017-02-13
accepted date: 2017-02-13
in scheme: emissions_variables_MMR

2.F.1.a [Commercial Refrigeration][no classification][Emissions][C10F18][t][no source][no method][no target][no option][no type]
type: Concept
definition: 2.F.1.a [Commercial Refrigeration][no classification][Emissions][C10F18][t][no source][no method][no target][no option][no type]
status: valid
status modified: 2017-02-13
accepted date: 2017-02-13
in scheme: emissions_variables_MMR

2.F.1.a [Commercial Refrigeration][no classification][Emissions][C2F6][t][From disposal][no method][no target][no option][no type]
type: Concept
definition: 2.F.1.a [Commercial Refrigeration][no classification][Emissions][C2F6][t][From disposal][no method][no target][no option][no type]
status: valid
status modified: 2017-02-13
accepted date: 2017-02-13
in scheme: emissions_variables_MMR

2.F.1.a [Commercial Refrigeration][no classification][Emissions][C2F6][t][From manufacturing][no method][no target][no option][no type]
type: Concept
definition: 2.F.1.a [Commercial Refrigeration][no classification][Emissions][C2F6][t][From manufacturing][no method][no target][no option][no type]
status: valid
status modified: 2017-02-13
accepted date: 2017-02-13
in scheme: emissions_variables_MMR

2.F.1.a [Commercial Refrigeration][no classification][Emissions][C2F6][t][From stocks][no method][no target][no option][no type]
type: Concept
definition: 2.F.1.a [Commercial Refrigeration][no classification][Emissions][C2F6][t][From stocks][no method][no target][no option][no type]
status: valid
status modified: 2017-02-13
accepted date: 2017-02-13
in scheme: emissions_variables_MMR

2.F.1.a [Commercial Refrigeration][no classification][Emissions][C2F6][t][no source][no method][no target][no option][no type]
type: Concept
definition: 2.F.1.a [Commercial Refrigeration][no classification][Emissions][C2F6][t][no source][no method][no target][no option][no type]
status: valid
status modified: 2017-02-13
accepted date: 2017-02-13
in scheme: emissions_variables_MMR

2.F.1.a [Commercial Refrigeration][no classification][Emissions][C3F8][t][From disposal][no method][no target][no option][no type]
type: Concept
definition: 2.F.1.a [Commercial Refrigeration][no classification][Emissions][C3F8][t][From disposal][no method][no target][no option][no type]
status: valid
status modified: 2017-02-13
accepted date: 2017-02-13
in scheme: emissions_variables_MMR

2.F.1.a [Commercial Refrigeration][no classification][Emissions][C3F8][t][From manufacturing][no method][no target][no option][no type]
type: Concept
definition: 2.F.1.a [Commercial Refrigeration][no classification][Emissions][C3F8][t][From manufacturing][no method][no target][no option][no type]
status: valid
status modified: 2017-02-13
accepted date: 2017-02-13
in scheme: emissions_variables_MMR

2.F.1.a [Commercial Refrigeration][no classification][Emissions][C3F8][t][From stocks][no method][no target][no option][no type]
type: Concept
definition: 2.F.1.a [Commercial Refrigeration][no classification][Emissions][C3F8][t][From stocks][no method][no target][no option][no type]
status: valid
status modified: 2017-02-13
accepted date: 2017-02-13
in scheme: emissions_variables_MMR

2.F.1.a [Commercial Refrigeration][no classification][Emissions][C3F8][t][no source][no method][no target][no option][no type]
type: Concept
definition: 2.F.1.a [Commercial Refrigeration][no classification][Emissions][C3F8][t][no source][no method][no target][no option][no type]
status: valid
status modified: 2017-02-13
accepted date: 2017-02-13
in scheme: emissions_variables_MMR

2.F.1.a [Commercial Refrigeration][no classification][Emissions][C4F10][t][From disposal][no method][no target][no option][no type]
type: Concept
definition: 2.F.1.a [Commercial Refrigeration][no classification][Emissions][C4F10][t][From disposal][no method][no target][no option][no type]
status: valid
status modified: 2017-02-13
accepted date: 2017-02-13
in scheme: emissions_variables_MMR

2.F.1.a [Commercial Refrigeration][no classification][Emissions][C4F10][t][From manufacturing][no method][no target][no option][no type]
type: Concept
definition: 2.F.1.a [Commercial Refrigeration][no classification][Emissions][C4F10][t][From manufacturing][no method][no target][no option][no type]
status: valid
status modified: 2017-02-13
accepted date: 2017-02-13
in scheme: emissions_variables_MMR

2.F.1.a [Commercial Refrigeration][no classification][Emissions][C4F10][t][From stocks][no method][no target][no option][no type]
type: Concept
definition: 2.F.1.a [Commercial Refrigeration][no classification][Emissions][C4F10][t][From stocks][no method][no target][no option][no type]
status: valid
status modified: 2017-02-13
accepted date: 2017-02-13
in scheme: emissions_variables_MMR

2.F.1.a [Commercial Refrigeration][no classification][Emissions][C4F10][t][no source][no method][no target][no option][no type]
type: Concept
definition: 2.F.1.a [Commercial Refrigeration][no classification][Emissions][C4F10][t][no source][no method][no target][no option][no type]
status: valid
status modified: 2017-02-13
accepted date: 2017-02-13
in scheme: emissions_variables_MMR

2.F.1.a [Commercial Refrigeration][no classification][Emissions][C5F12][t][From disposal][no method][no target][no option][no type]
type: Concept
definition: 2.F.1.a [Commercial Refrigeration][no classification][Emissions][C5F12][t][From disposal][no method][no target][no option][no type]
status: valid
status modified: 2017-02-13
accepted date: 2017-02-13
in scheme: emissions_variables_MMR

2.F.1.a [Commercial Refrigeration][no classification][Emissions][C5F12][t][From manufacturing][no method][no target][no option][no type]
type: Concept
definition: 2.F.1.a [Commercial Refrigeration][no classification][Emissions][C5F12][t][From manufacturing][no method][no target][no option][no type]
status: valid
status modified: 2017-02-13
accepted date: 2017-02-13
in scheme: emissions_variables_MMR

2.F.1.a [Commercial Refrigeration][no classification][Emissions][C5F12][t][From stocks][no method][no target][no option][no type]
type: Concept
definition: 2.F.1.a [Commercial Refrigeration][no classification][Emissions][C5F12][t][From stocks][no method][no target][no option][no type]
status: valid
status modified: 2017-02-13
accepted date: 2017-02-13
in scheme: emissions_variables_MMR

2.F.1.a [Commercial Refrigeration][no classification][Emissions][C5F12][t][no source][no method][no target][no option][no type]
type: Concept
definition: 2.F.1.a [Commercial Refrigeration][no classification][Emissions][C5F12][t][no source][no method][no target][no option][no type]
status: valid
status modified: 2017-02-13
accepted date: 2017-02-13
in scheme: emissions_variables_MMR

2.F.1.a [Commercial Refrigeration][no classification][Emissions][C6F14][t][From disposal][no method][no target][no option][no type]
type: Concept
definition: 2.F.1.a [Commercial Refrigeration][no classification][Emissions][C6F14][t][From disposal][no method][no target][no option][no type]
status: valid
status modified: 2017-02-13
accepted date: 2017-02-13
in scheme: emissions_variables_MMR

2.F.1.a [Commercial Refrigeration][no classification][Emissions][C6F14][t][From manufacturing][no method][no target][no option][no type]
type: Concept
definition: 2.F.1.a [Commercial Refrigeration][no classification][Emissions][C6F14][t][From manufacturing][no method][no target][no option][no type]
status: valid
status modified: 2017-02-13
accepted date: 2017-02-13
in scheme: emissions_variables_MMR

2.F.1.a [Commercial Refrigeration][no classification][Emissions][C6F14][t][From stocks][no method][no target][no option][no type]
type: Concept
definition: 2.F.1.a [Commercial Refrigeration][no classification][Emissions][C6F14][t][From stocks][no method][no target][no option][no type]
status: valid
status modified: 2017-02-13
accepted date: 2017-02-13
in scheme: emissions_variables_MMR

2.F.1.a [Commercial Refrigeration][no classification][Emissions][C6F14][t][no source][no method][no target][no option][no type]
type: Concept
definition: 2.F.1.a [Commercial Refrigeration][no classification][Emissions][C6F14][t][no source][no method][no target][no option][no type]
status: valid
status modified: 2017-02-13
accepted date: 2017-02-13
in scheme: emissions_variables_MMR

2.F.1.a [Commercial Refrigeration][no classification][Emissions][c-C3F6][t][From disposal][no method][no target][no option][no type]
type: Concept
definition: 2.F.1.a [Commercial Refrigeration][no classification][Emissions][c-C3F6][t][From disposal][no method][no target][no option][no type]
status: valid
status modified: 2017-02-13
accepted date: 2017-02-13
in scheme: emissions_variables_MMR

2.F.1.a [Commercial Refrigeration][no classification][Emissions][c-C3F6][t][From manufacturing][no method][no target][no option][no type]
type: Concept
definition: 2.F.1.a [Commercial Refrigeration][no classification][Emissions][c-C3F6][t][From manufacturing][no method][no target][no option][no type]
status: valid
status modified: 2017-02-13
accepted date: 2017-02-13
in scheme: emissions_variables_MMR

2.F.1.a [Commercial Refrigeration][no classification][Emissions][c-C3F6][t][From stocks][no method][no target][no option][no type]
type: Concept
definition: 2.F.1.a [Commercial Refrigeration][no classification][Emissions][c-C3F6][t][From stocks][no method][no target][no option][no type]
status: valid
status modified: 2017-02-13
accepted date: 2017-02-13
in scheme: emissions_variables_MMR

2.F.1.a [Commercial Refrigeration][no classification][Emissions][c-C3F6][t][no source][no method][no target][no option][no type]
type: Concept
definition: 2.F.1.a [Commercial Refrigeration][no classification][Emissions][c-C3F6][t][no source][no method][no target][no option][no type]
status: valid
status modified: 2017-02-13
accepted date: 2017-02-13
in scheme: emissions_variables_MMR

2.F.1.a [Commercial Refrigeration][no classification][Emissions][c-C4F8][t][From disposal][no method][no target][no option][no type]
type: Concept
definition: 2.F.1.a [Commercial Refrigeration][no classification][Emissions][c-C4F8][t][From disposal][no method][no target][no option][no type]
status: valid
status modified: 2017-02-13
accepted date: 2017-02-13
in scheme: emissions_variables_MMR

2.F.1.a [Commercial Refrigeration][no classification][Emissions][c-C4F8][t][From manufacturing][no method][no target][no option][no type]
type: Concept
definition: 2.F.1.a [Commercial Refrigeration][no classification][Emissions][c-C4F8][t][From manufacturing][no method][no target][no option][no type]
status: valid
status modified: 2017-02-13
accepted date: 2017-02-13
in scheme: emissions_variables_MMR

2.F.1.a [Commercial Refrigeration][no classification][Emissions][c-C4F8][t][From stocks][no method][no target][no option][no type]
type: Concept
definition: 2.F.1.a [Commercial Refrigeration][no classification][Emissions][c-C4F8][t][From stocks][no method][no target][no option][no type]
status: valid
status modified: 2017-02-13
accepted date: 2017-02-13
in scheme: emissions_variables_MMR

2.F.1.a [Commercial Refrigeration][no classification][Emissions][c-C4F8][t][no source][no method][no target][no option][no type]
type: Concept
definition: 2.F.1.a [Commercial Refrigeration][no classification][Emissions][c-C4F8][t][no source][no method][no target][no option][no type]
status: valid
status modified: 2017-02-13
accepted date: 2017-02-13
in scheme: emissions_variables_MMR

2.F.1.a [Commercial Refrigeration][no classification][Emissions][CF4][t][From disposal][no method][no target][no option][no type]
type: Concept
definition: 2.F.1.a [Commercial Refrigeration][no classification][Emissions][CF4][t][From disposal][no method][no target][no option][no type]
status: valid
status modified: 2017-02-13
accepted date: 2017-02-13
in scheme: emissions_variables_MMR

2.F.1.a [Commercial Refrigeration][no classification][Emissions][CF4][t][From manufacturing][no method][no target][no option][no type]
type: Concept
definition: 2.F.1.a [Commercial Refrigeration][no classification][Emissions][CF4][t][From manufacturing][no method][no target][no option][no type]
status: valid
status modified: 2017-02-13
accepted date: 2017-02-13
in scheme: emissions_variables_MMR

2.F.1.a [Commercial Refrigeration][no classification][Emissions][CF4][t][From stocks][no method][no target][no option][no type]
type: Concept
definition: 2.F.1.a [Commercial Refrigeration][no classification][Emissions][CF4][t][From stocks][no method][no target][no option][no type]
status: valid
status modified: 2017-02-13
accepted date: 2017-02-13
in scheme: emissions_variables_MMR

2.F.1.a [Commercial Refrigeration][no classification][Emissions][CF4][t][no source][no method][no target][no option][no type]
type: Concept
definition: 2.F.1.a [Commercial Refrigeration][no classification][Emissions][CF4][t][no source][no method][no target][no option][no type]
status: valid
status modified: 2017-02-13
accepted date: 2017-02-13
in scheme: emissions_variables_MMR

2.F.1.a [Commercial Refrigeration][no classification][Emissions][HFC-125][t][From disposal][no method][no target][no option][no type]
type: Concept
definition: 2.F.1.a [Commercial Refrigeration][no classification][Emissions][HFC-125][t][From disposal][no method][no target][no option][no type]
status: valid
status modified: 2017-02-13
accepted date: 2017-02-13
in scheme: emissions_variables_MMR

2.F.1.a [Commercial Refrigeration][no classification][Emissions][HFC-125][t][From manufacturing][no method][no target][no option][no type]
type: Concept
definition: 2.F.1.a [Commercial Refrigeration][no classification][Emissions][HFC-125][t][From manufacturing][no method][no target][no option][no type]
status: valid
status modified: 2017-02-13
accepted date: 2017-02-13
in scheme: emissions_variables_MMR

2.F.1.a [Commercial Refrigeration][no classification][Emissions][HFC-125][t][From stocks][no method][no target][no option][no type]
type: Concept
definition: 2.F.1.a [Commercial Refrigeration][no classification][Emissions][HFC-125][t][From stocks][no method][no target][no option][no type]
status: valid
status modified: 2017-02-13
accepted date: 2017-02-13
in scheme: emissions_variables_MMR

2.F.1.a [Commercial Refrigeration][no classification][Emissions][HFC-125][t][no source][no method][no target][no option][no type]
type: Concept
definition: 2.F.1.a [Commercial Refrigeration][no classification][Emissions][HFC-125][t][no source][no method][no target][no option][no type]
status: valid
status modified: 2017-02-13
accepted date: 2017-02-13
in scheme: emissions_variables_MMR

2.F.1.a [Commercial Refrigeration][no classification][Emissions][HFC-134][t][From disposal][no method][no target][no option][no type]
type: Concept
definition: 2.F.1.a [Commercial Refrigeration][no classification][Emissions][HFC-134][t][From disposal][no method][no target][no option][no type]
status: valid
status modified: 2017-02-13
accepted date: 2017-02-13
in scheme: emissions_variables_MMR

2.F.1.a [Commercial Refrigeration][no classification][Emissions][HFC-134][t][From manufacturing][no method][no target][no option][no type]
type: Concept
definition: 2.F.1.a [Commercial Refrigeration][no classification][Emissions][HFC-134][t][From manufacturing][no method][no target][no option][no type]
status: valid
status modified: 2017-02-13
accepted date: 2017-02-13
in scheme: emissions_variables_MMR

2.F.1.a [Commercial Refrigeration][no classification][Emissions][HFC-134][t][From stocks][no method][no target][no option][no type]
type: Concept
definition: 2.F.1.a [Commercial Refrigeration][no classification][Emissions][HFC-134][t][From stocks][no method][no target][no option][no type]
status: valid
status modified: 2017-02-13
accepted date: 2017-02-13
in scheme: emissions_variables_MMR

2.F.1.a [Commercial Refrigeration][no classification][Emissions][HFC-134][t][no source][no method][no target][no option][no type]
type: Concept
definition: 2.F.1.a [Commercial Refrigeration][no classification][Emissions][HFC-134][t][no source][no method][no target][no option][no type]
status: valid
status modified: 2017-02-13
accepted date: 2017-02-13
in scheme: emissions_variables_MMR

2.F.1.a [Commercial Refrigeration][no classification][Emissions][HFC-134a][t][From disposal][no method][no target][no option][no type]
type: Concept
definition: 2.F.1.a [Commercial Refrigeration][no classification][Emissions][HFC-134a][t][From disposal][no method][no target][no option][no type]
status: valid
status modified: 2017-02-13
accepted date: 2017-02-13
in scheme: emissions_variables_MMR

2.F.1.a [Commercial Refrigeration][no classification][Emissions][HFC-134a][t][From manufacturing][no method][no target][no option][no type]
type: Concept
definition: 2.F.1.a [Commercial Refrigeration][no classification][Emissions][HFC-134a][t][From manufacturing][no method][no target][no option][no type]
status: valid
status modified: 2017-02-13
accepted date: 2017-02-13
in scheme: emissions_variables_MMR

2.F.1.a [Commercial Refrigeration][no classification][Emissions][HFC-134a][t][From stocks][no method][no target][no option][no type]
type: Concept
definition: 2.F.1.a [Commercial Refrigeration][no classification][Emissions][HFC-134a][t][From stocks][no method][no target][no option][no type]
status: valid
status modified: 2017-02-13
accepted date: 2017-02-13
in scheme: emissions_variables_MMR

2.F.1.a [Commercial Refrigeration][no classification][Emissions][HFC-134a][t][no source][no method][no target][no option][no type]
type: Concept
definition: 2.F.1.a [Commercial Refrigeration][no classification][Emissions][HFC-134a][t][no source][no method][no target][no option][no type]
status: valid
status modified: 2017-02-13
accepted date: 2017-02-13
in scheme: emissions_variables_MMR

2.F.1.a [Commercial Refrigeration][no classification][Emissions][HFC-143][t][From disposal][no method][no target][no option][no type]
type: Concept
definition: 2.F.1.a [Commercial Refrigeration][no classification][Emissions][HFC-143][t][From disposal][no method][no target][no option][no type]
status: valid
status modified: 2017-02-13
accepted date: 2017-02-13
in scheme: emissions_variables_MMR

2.F.1.a [Commercial Refrigeration][no classification][Emissions][HFC-143][t][From manufacturing][no method][no target][no option][no type]
type: Concept
definition: 2.F.1.a [Commercial Refrigeration][no classification][Emissions][HFC-143][t][From manufacturing][no method][no target][no option][no type]
status: valid
status modified: 2017-02-13
accepted date: 2017-02-13
in scheme: emissions_variables_MMR

2.F.1.a [Commercial Refrigeration][no classification][Emissions][HFC-143][t][From stocks][no method][no target][no option][no type]
type: Concept
definition: 2.F.1.a [Commercial Refrigeration][no classification][Emissions][HFC-143][t][From stocks][no method][no target][no option][no type]
status: valid
status modified: 2017-02-13
accepted date: 2017-02-13
in scheme: emissions_variables_MMR

2.F.1.a [Commercial Refrigeration][no classification][Emissions][HFC-143][t][no source][no method][no target][no option][no type]
type: Concept
definition: 2.F.1.a [Commercial Refrigeration][no classification][Emissions][HFC-143][t][no source][no method][no target][no option][no type]
status: valid
status modified: 2017-02-13
accepted date: 2017-02-13
in scheme: emissions_variables_MMR

2.F.1.a [Commercial Refrigeration][no classification][Emissions][HFC-143a][t][From disposal][no method][no target][no option][no type]
type: Concept
definition: 2.F.1.a [Commercial Refrigeration][no classification][Emissions][HFC-143a][t][From disposal][no method][no target][no option][no type]
status: valid
status modified: 2017-02-13
accepted date: 2017-02-13
in scheme: emissions_variables_MMR

2.F.1.a [Commercial Refrigeration][no classification][Emissions][HFC-143a][t][From manufacturing][no method][no target][no option][no type]
type: Concept
definition: 2.F.1.a [Commercial Refrigeration][no classification][Emissions][HFC-143a][t][From manufacturing][no method][no target][no option][no type]
status: valid
status modified: 2017-02-13
accepted date: 2017-02-13
in scheme: emissions_variables_MMR

2.F.1.a [Commercial Refrigeration][no classification][Emissions][HFC-143a][t][From stocks][no method][no target][no option][no type]
type: Concept
definition: 2.F.1.a [Commercial Refrigeration][no classification][Emissions][HFC-143a][t][From stocks][no method][no target][no option][no type]
status: valid
status modified: 2017-02-13
accepted date: 2017-02-13
in scheme: emissions_variables_MMR

2.F.1.a [Commercial Refrigeration][no classification][Emissions][HFC-143a][t][no source][no method][no target][no option][no type]
type: Concept
definition: 2.F.1.a [Commercial Refrigeration][no classification][Emissions][HFC-143a][t][no source][no method][no target][no option][no type]
status: valid
status modified: 2017-02-13
accepted date: 2017-02-13
in scheme: emissions_variables_MMR

2.F.1.a [Commercial Refrigeration][no classification][Emissions][HFC-152][t][From disposal][no method][no target][no option][no type]
type: Concept
definition: 2.F.1.a [Commercial Refrigeration][no classification][Emissions][HFC-152][t][From disposal][no method][no target][no option][no type]
status: valid
status modified: 2017-02-13
accepted date: 2017-02-13
in scheme: emissions_variables_MMR

2.F.1.a [Commercial Refrigeration][no classification][Emissions][HFC-152][t][From manufacturing][no method][no target][no option][no type]
type: Concept
definition: 2.F.1.a [Commercial Refrigeration][no classification][Emissions][HFC-152][t][From manufacturing][no method][no target][no option][no type]
status: valid
status modified: 2017-02-13
accepted date: 2017-02-13
in scheme: emissions_variables_MMR

2.F.1.a [Commercial Refrigeration][no classification][Emissions][HFC-152][t][From stocks][no method][no target][no option][no type]
type: Concept
definition: 2.F.1.a [Commercial Refrigeration][no classification][Emissions][HFC-152][t][From stocks][no method][no target][no option][no type]
status: valid
status modified: 2017-02-13
accepted date: 2017-02-13
in scheme: emissions_variables_MMR

2.F.1.a [Commercial Refrigeration][no classification][Emissions][HFC-152][t][no source][no method][no target][no option][no type]
type: Concept
definition: 2.F.1.a [Commercial Refrigeration][no classification][Emissions][HFC-152][t][no source][no method][no target][no option][no type]
status: valid
status modified: 2017-02-13
accepted date: 2017-02-13
in scheme: emissions_variables_MMR

2.F.1.a [Commercial Refrigeration][no classification][Emissions][HFC-152a][t][From disposal][no method][no target][no option][no type]
type: Concept
definition: 2.F.1.a [Commercial Refrigeration][no classification][Emissions][HFC-152a][t][From disposal][no method][no target][no option][no type]
status: valid
status modified: 2017-02-13
accepted date: 2017-02-13
in scheme: emissions_variables_MMR

2.F.1.a [Commercial Refrigeration][no classification][Emissions][HFC-152a][t][From manufacturing][no method][no target][no option][no type]
type: Concept
definition: 2.F.1.a [Commercial Refrigeration][no classification][Emissions][HFC-152a][t][From manufacturing][no method][no target][no option][no type]
status: valid
status modified: 2017-02-13
accepted date: 2017-02-13
in scheme: emissions_variables_MMR

2.F.1.a [Commercial Refrigeration][no classification][Emissions][HFC-152a][t][From stocks][no method][no target][no option][no type]
type: Concept
definition: 2.F.1.a [Commercial Refrigeration][no classification][Emissions][HFC-152a][t][From stocks][no method][no target][no option][no type]
status: valid
status modified: 2017-02-13
accepted date: 2017-02-13
in scheme: emissions_variables_MMR

2.F.1.a [Commercial Refrigeration][no classification][Emissions][HFC-152a][t][no source][no method][no target][no option][no type]
type: Concept
definition: 2.F.1.a [Commercial Refrigeration][no classification][Emissions][HFC-152a][t][no source][no method][no target][no option][no type]
status: valid
status modified: 2017-02-13
accepted date: 2017-02-13
in scheme: emissions_variables_MMR

2.F.1.a [Commercial Refrigeration][no classification][Emissions][HFC-161][t][From disposal][no method][no target][no option][no type]
type: Concept
definition: 2.F.1.a [Commercial Refrigeration][no classification][Emissions][HFC-161][t][From disposal][no method][no target][no option][no type]
status: valid
status modified: 2017-02-13
accepted date: 2017-02-13
in scheme: emissions_variables_MMR

2.F.1.a [Commercial Refrigeration][no classification][Emissions][HFC-161][t][From manufacturing][no method][no target][no option][no type]
type: Concept
definition: 2.F.1.a [Commercial Refrigeration][no classification][Emissions][HFC-161][t][From manufacturing][no method][no target][no option][no type]
status: valid
status modified: 2017-02-13
accepted date: 2017-02-13
in scheme: emissions_variables_MMR

2.F.1.a [Commercial Refrigeration][no classification][Emissions][HFC-161][t][From stocks][no method][no target][no option][no type]
type: Concept
definition: 2.F.1.a [Commercial Refrigeration][no classification][Emissions][HFC-161][t][From stocks][no method][no target][no option][no type]
status: valid
status modified: 2017-02-13
accepted date: 2017-02-13
in scheme: emissions_variables_MMR

2.F.1.a [Commercial Refrigeration][no classification][Emissions][HFC-161][t][no source][no method][no target][no option][no type]
type: Concept
definition: 2.F.1.a [Commercial Refrigeration][no classification][Emissions][HFC-161][t][no source][no method][no target][no option][no type]
status: valid
status modified: 2017-02-13
accepted date: 2017-02-13
in scheme: emissions_variables_MMR

2.F.1.a [Commercial Refrigeration][no classification][Emissions][HFC-227ea][t][From disposal][no method][no target][no option][no type]
type: Concept
definition: 2.F.1.a [Commercial Refrigeration][no classification][Emissions][HFC-227ea][t][From disposal][no method][no target][no option][no type]
status: valid
status modified: 2017-02-13
accepted date: 2017-02-13
in scheme: emissions_variables_MMR

2.F.1.a [Commercial Refrigeration][no classification][Emissions][HFC-227ea][t][From manufacturing][no method][no target][no option][no type]
type: Concept
definition: 2.F.1.a [Commercial Refrigeration][no classification][Emissions][HFC-227ea][t][From manufacturing][no method][no target][no option][no type]
status: valid
status modified: 2017-02-13
accepted date: 2017-02-13
in scheme: emissions_variables_MMR

2.F.1.a [Commercial Refrigeration][no classification][Emissions][HFC-227ea][t][From stocks][no method][no target][no option][no type]
type: Concept
definition: 2.F.1.a [Commercial Refrigeration][no classification][Emissions][HFC-227ea][t][From stocks][no method][no target][no option][no type]
status: valid
status modified: 2017-02-13
accepted date: 2017-02-13
in scheme: emissions_variables_MMR

2.F.1.a [Commercial Refrigeration][no classification][Emissions][HFC-227ea][t][no source][no method][no target][no option][no type]
type: Concept
definition: 2.F.1.a [Commercial Refrigeration][no classification][Emissions][HFC-227ea][t][no source][no method][no target][no option][no type]
status: valid
status modified: 2017-02-13
accepted date: 2017-02-13
in scheme: emissions_variables_MMR

2.F.1.a [Commercial Refrigeration][no classification][Emissions][HFC-23][t][From disposal][no method][no target][no option][no type]
type: Concept
definition: 2.F.1.a [Commercial Refrigeration][no classification][Emissions][HFC-23][t][From disposal][no method][no target][no option][no type]
status: valid
status modified: 2017-02-13
accepted date: 2017-02-13
in scheme: emissions_variables_MMR

2.F.1.a [Commercial Refrigeration][no classification][Emissions][HFC-23][t][From manufacturing][no method][no target][no option][no type]
type: Concept
definition: 2.F.1.a [Commercial Refrigeration][no classification][Emissions][HFC-23][t][From manufacturing][no method][no target][no option][no type]
status: valid
status modified: 2017-02-13
accepted date: 2017-02-13
in scheme: emissions_variables_MMR

2.F.1.a [Commercial Refrigeration][no classification][Emissions][HFC-23][t][From stocks][no method][no target][no option][no type]
type: Concept
definition: 2.F.1.a [Commercial Refrigeration][no classification][Emissions][HFC-23][t][From stocks][no method][no target][no option][no type]
status: valid
status modified: 2017-02-13
accepted date: 2017-02-13
in scheme: emissions_variables_MMR

2.F.1.a [Commercial Refrigeration][no classification][Emissions][HFC-23][t][no source][no method][no target][no option][no type]
type: Concept
definition: 2.F.1.a [Commercial Refrigeration][no classification][Emissions][HFC-23][t][no source][no method][no target][no option][no type]
status: valid
status modified: 2017-02-13
accepted date: 2017-02-13
in scheme: emissions_variables_MMR

2.F.1.a [Commercial Refrigeration][no classification][Emissions][HFC-236cb][t][From disposal][no method][no target][no option][no type]
type: Concept
definition: 2.F.1.a [Commercial Refrigeration][no classification][Emissions][HFC-236cb][t][From disposal][no method][no target][no option][no type]
status: valid
status modified: 2017-02-13
accepted date: 2017-02-13
in scheme: emissions_variables_MMR

2.F.1.a [Commercial Refrigeration][no classification][Emissions][HFC-236cb][t][From manufacturing][no method][no target][no option][no type]
type: Concept
definition: 2.F.1.a [Commercial Refrigeration][no classification][Emissions][HFC-236cb][t][From manufacturing][no method][no target][no option][no type]
status: valid
status modified: 2017-02-13
accepted date: 2017-02-13
in scheme: emissions_variables_MMR

2.F.1.a [Commercial Refrigeration][no classification][Emissions][HFC-236cb][t][From stocks][no method][no target][no option][no type]
type: Concept
definition: 2.F.1.a [Commercial Refrigeration][no classification][Emissions][HFC-236cb][t][From stocks][no method][no target][no option][no type]
status: valid
status modified: 2017-02-13
accepted date: 2017-02-13
in scheme: emissions_variables_MMR

2.F.1.a [Commercial Refrigeration][no classification][Emissions][HFC-236cb][t][no source][no method][no target][no option][no type]
type: Concept
definition: 2.F.1.a [Commercial Refrigeration][no classification][Emissions][HFC-236cb][t][no source][no method][no target][no option][no type]
status: valid
status modified: 2017-02-13
accepted date: 2017-02-13
in scheme: emissions_variables_MMR

2.F.1.a [Commercial Refrigeration][no classification][Emissions][HFC-236ea][t][From disposal][no method][no target][no option][no type]
type: Concept
definition: 2.F.1.a [Commercial Refrigeration][no classification][Emissions][HFC-236ea][t][From disposal][no method][no target][no option][no type]
status: valid
status modified: 2017-02-13
accepted date: 2017-02-13
in scheme: emissions_variables_MMR

2.F.1.a [Commercial Refrigeration][no classification][Emissions][HFC-236ea][t][From manufacturing][no method][no target][no option][no type]
type: Concept
definition: 2.F.1.a [Commercial Refrigeration][no classification][Emissions][HFC-236ea][t][From manufacturing][no method][no target][no option][no type]
status: valid
status modified: 2017-02-13
accepted date: 2017-02-13
in scheme: emissions_variables_MMR

2.F.1.a [Commercial Refrigeration][no classification][Emissions][HFC-236ea][t][From stocks][no method][no target][no option][no type]
type: Concept
definition: 2.F.1.a [Commercial Refrigeration][no classification][Emissions][HFC-236ea][t][From stocks][no method][no target][no option][no type]
status: valid
status modified: 2017-02-13
accepted date: 2017-02-13
in scheme: emissions_variables_MMR

2.F.1.a [Commercial Refrigeration][no classification][Emissions][HFC-236ea][t][no source][no method][no target][no option][no type]
type: Concept
definition: 2.F.1.a [Commercial Refrigeration][no classification][Emissions][HFC-236ea][t][no source][no method][no target][no option][no type]
status: valid
status modified: 2017-02-13
accepted date: 2017-02-13
in scheme: emissions_variables_MMR

2.F.1.a [Commercial Refrigeration][no classification][Emissions][HFC-236fa][t][From disposal][no method][no target][no option][no type]
type: Concept
definition: 2.F.1.a [Commercial Refrigeration][no classification][Emissions][HFC-236fa][t][From disposal][no method][no target][no option][no type]
status: valid
status modified: 2017-02-13
accepted date: 2017-02-13
in scheme: emissions_variables_MMR

2.F.1.a [Commercial Refrigeration][no classification][Emissions][HFC-236fa][t][From manufacturing][no method][no target][no option][no type]
type: Concept
definition: 2.F.1.a [Commercial Refrigeration][no classification][Emissions][HFC-236fa][t][From manufacturing][no method][no target][no option][no type]
status: valid
status modified: 2017-02-13
accepted date: 2017-02-13
in scheme: emissions_variables_MMR

2.F.1.a [Commercial Refrigeration][no classification][Emissions][HFC-236fa][t][From stocks][no method][no target][no option][no type]
type: Concept
definition: 2.F.1.a [Commercial Refrigeration][no classification][Emissions][HFC-236fa][t][From stocks][no method][no target][no option][no type]
status: valid
status modified: 2017-02-13
accepted date: 2017-02-13
in scheme: emissions_variables_MMR

2.F.1.a [Commercial Refrigeration][no classification][Emissions][HFC-236fa][t][no source][no method][no target][no option][no type]
type: Concept
definition: 2.F.1.a [Commercial Refrigeration][no classification][Emissions][HFC-236fa][t][no source][no method][no target][no option][no type]
status: valid
status modified: 2017-02-13
accepted date: 2017-02-13
in scheme: emissions_variables_MMR

2.F.1.a [Commercial Refrigeration][no classification][Emissions][HFC-245ca][t][From disposal][no method][no target][no option][no type]
type: Concept
definition: 2.F.1.a [Commercial Refrigeration][no classification][Emissions][HFC-245ca][t][From disposal][no method][no target][no option][no type]
status: valid
status modified: 2017-02-13
accepted date: 2017-02-13
in scheme: emissions_variables_MMR

2.F.1.a [Commercial Refrigeration][no classification][Emissions][HFC-245ca][t][From manufacturing][no method][no target][no option][no type]
type: Concept
definition: 2.F.1.a [Commercial Refrigeration][no classification][Emissions][HFC-245ca][t][From manufacturing][no method][no target][no option][no type]
status: valid
status modified: 2017-02-13
accepted date: 2017-02-13
in scheme: emissions_variables_MMR

2.F.1.a [Commercial Refrigeration][no classification][Emissions][HFC-245ca][t][From stocks][no method][no target][no option][no type]
type: Concept
definition: 2.F.1.a [Commercial Refrigeration][no classification][Emissions][HFC-245ca][t][From stocks][no method][no target][no option][no type]
status: valid
status modified: 2017-02-13
accepted date: 2017-02-13
in scheme: emissions_variables_MMR

2.F.1.a [Commercial Refrigeration][no classification][Emissions][HFC-245ca][t][no source][no method][no target][no option][no type]
type: Concept
definition: 2.F.1.a [Commercial Refrigeration][no classification][Emissions][HFC-245ca][t][no source][no method][no target][no option][no type]
status: valid
status modified: 2017-02-13
accepted date: 2017-02-13
in scheme: emissions_variables_MMR

2.F.1.a [Commercial Refrigeration][no classification][Emissions][HFC-245fa][t][From disposal][no method][no target][no option][no type]
type: Concept
definition: 2.F.1.a [Commercial Refrigeration][no classification][Emissions][HFC-245fa][t][From disposal][no method][no target][no option][no type]
status: valid
status modified: 2017-02-13
accepted date: 2017-02-13
in scheme: emissions_variables_MMR

2.F.1.a [Commercial Refrigeration][no classification][Emissions][HFC-245fa][t][From manufacturing][no method][no target][no option][no type]
type: Concept
definition: 2.F.1.a [Commercial Refrigeration][no classification][Emissions][HFC-245fa][t][From manufacturing][no method][no target][no option][no type]
status: valid
status modified: 2017-02-13
accepted date: 2017-02-13
in scheme: emissions_variables_MMR

2.F.1.a [Commercial Refrigeration][no classification][Emissions][HFC-245fa][t][From stocks][no method][no target][no option][no type]
type: Concept
definition: 2.F.1.a [Commercial Refrigeration][no classification][Emissions][HFC-245fa][t][From stocks][no method][no target][no option][no type]
status: valid
status modified: 2017-02-13
accepted date: 2017-02-13
in scheme: emissions_variables_MMR

2.F.1.a [Commercial Refrigeration][no classification][Emissions][HFC-245fa][t][no source][no method][no target][no option][no type]
type: Concept
definition: 2.F.1.a [Commercial Refrigeration][no classification][Emissions][HFC-245fa][t][no source][no method][no target][no option][no type]
status: valid
status modified: 2017-02-13
accepted date: 2017-02-13
in scheme: emissions_variables_MMR

2.F.1.a [Commercial Refrigeration][no classification][Emissions][HFC-32][t][From disposal][no method][no target][no option][no type]
type: Concept
definition: 2.F.1.a [Commercial Refrigeration][no classification][Emissions][HFC-32][t][From disposal][no method][no target][no option][no type]
status: valid
status modified: 2017-02-13
accepted date: 2017-02-13
in scheme: emissions_variables_MMR

2.F.1.a [Commercial Refrigeration][no classification][Emissions][HFC-32][t][From manufacturing][no method][no target][no option][no type]
type: Concept
definition: 2.F.1.a [Commercial Refrigeration][no classification][Emissions][HFC-32][t][From manufacturing][no method][no target][no option][no type]
status: valid
status modified: 2017-02-13
accepted date: 2017-02-13
in scheme: emissions_variables_MMR

2.F.1.a [Commercial Refrigeration][no classification][Emissions][HFC-32][t][From stocks][no method][no target][no option][no type]
type: Concept
definition: 2.F.1.a [Commercial Refrigeration][no classification][Emissions][HFC-32][t][From stocks][no method][no target][no option][no type]
status: valid
status modified: 2017-02-13
accepted date: 2017-02-13
in scheme: emissions_variables_MMR

2.F.1.a [Commercial Refrigeration][no classification][Emissions][HFC-32][t][no source][no method][no target][no option][no type]
type: Concept
definition: 2.F.1.a [Commercial Refrigeration][no classification][Emissions][HFC-32][t][no source][no method][no target][no option][no type]
status: valid
status modified: 2017-02-13
accepted date: 2017-02-13
in scheme: emissions_variables_MMR

2.F.1.a [Commercial Refrigeration][no classification][Emissions][HFC-365mfc][t][From disposal][no method][no target][no option][no type]
type: Concept
definition: 2.F.1.a [Commercial Refrigeration][no classification][Emissions][HFC-365mfc][t][From disposal][no method][no target][no option][no type]
status: valid
status modified: 2017-02-13
accepted date: 2017-02-13
in scheme: emissions_variables_MMR

2.F.1.a [Commercial Refrigeration][no classification][Emissions][HFC-365mfc][t][From manufacturing][no method][no target][no option][no type]
type: Concept
definition: 2.F.1.a [Commercial Refrigeration][no classification][Emissions][HFC-365mfc][t][From manufacturing][no method][no target][no option][no type]
status: valid
status modified: 2017-02-13
accepted date: 2017-02-13
in scheme: emissions_variables_MMR

2.F.1.a [Commercial Refrigeration][no classification][Emissions][HFC-365mfc][t][From stocks][no method][no target][no option][no type]
type: Concept
definition: 2.F.1.a [Commercial Refrigeration][no classification][Emissions][HFC-365mfc][t][From stocks][no method][no target][no option][no type]
status: valid
status modified: 2017-02-13
accepted date: 2017-02-13
in scheme: emissions_variables_MMR

2.F.1.a [Commercial Refrigeration][no classification][Emissions][HFC-365mfc][t][no source][no method][no target][no option][no type]
type: Concept
definition: 2.F.1.a [Commercial Refrigeration][no classification][Emissions][HFC-365mfc][t][no source][no method][no target][no option][no type]
status: valid
status modified: 2017-02-13
accepted date: 2017-02-13
in scheme: emissions_variables_MMR

2.F.1.a [Commercial Refrigeration][no classification][Emissions][HFC-41][t][From disposal][no method][no target][no option][no type]
type: Concept
definition: 2.F.1.a [Commercial Refrigeration][no classification][Emissions][HFC-41][t][From disposal][no method][no target][no option][no type]
status: valid
status modified: 2017-02-13
accepted date: 2017-02-13
in scheme: emissions_variables_MMR

2.F.1.a [Commercial Refrigeration][no classification][Emissions][HFC-41][t][From manufacturing][no method][no target][no option][no type]
type: Concept
definition: 2.F.1.a [Commercial Refrigeration][no classification][Emissions][HFC-41][t][From manufacturing][no method][no target][no option][no type]
status: valid
status modified: 2017-02-13
accepted date: 2017-02-13
in scheme: emissions_variables_MMR

2.F.1.a [Commercial Refrigeration][no classification][Emissions][HFC-41][t][From stocks][no method][no target][no option][no type]
type: Concept
definition: 2.F.1.a [Commercial Refrigeration][no classification][Emissions][HFC-41][t][From stocks][no method][no target][no option][no type]
status: valid
status modified: 2017-02-13
accepted date: 2017-02-13
in scheme: emissions_variables_MMR

2.F.1.a [Commercial Refrigeration][no classification][Emissions][HFC-41][t][no source][no method][no target][no option][no type]
type: Concept
definition: 2.F.1.a [Commercial Refrigeration][no classification][Emissions][HFC-41][t][no source][no method][no target][no option][no type]
status: valid
status modified: 2017-02-13
accepted date: 2017-02-13
in scheme: emissions_variables_MMR

2.F.1.a [Commercial Refrigeration][no classification][Emissions][HFC-43-10mee][t][From disposal][no method][no target][no option][no type]
type: Concept
definition: 2.F.1.a [Commercial Refrigeration][no classification][Emissions][HFC-43-10mee][t][From disposal][no method][no target][no option][no type]
status: valid
status modified: 2017-02-13
accepted date: 2017-02-13
in scheme: emissions_variables_MMR

2.F.1.a [Commercial Refrigeration][no classification][Emissions][HFC-43-10mee][t][From manufacturing][no method][no target][no option][no type]
type: Concept
definition: 2.F.1.a [Commercial Refrigeration][no classification][Emissions][HFC-43-10mee][t][From manufacturing][no method][no target][no option][no type]
status: valid
status modified: 2017-02-13
accepted date: 2017-02-13
in scheme: emissions_variables_MMR

2.F.1.a [Commercial Refrigeration][no classification][Emissions][HFC-43-10mee][t][From stocks][no method][no target][no option][no type]
type: Concept
definition: 2.F.1.a [Commercial Refrigeration][no classification][Emissions][HFC-43-10mee][t][From stocks][no method][no target][no option][no type]
status: valid
status modified: 2017-02-13
accepted date: 2017-02-13
in scheme: emissions_variables_MMR

2.F.1.a [Commercial Refrigeration][no classification][Emissions][HFC-43-10mee][t][no source][no method][no target][no option][no type]
type: Concept
definition: 2.F.1.a [Commercial Refrigeration][no classification][Emissions][HFC-43-10mee][t][no source][no method][no target][no option][no type]
status: valid
status modified: 2017-02-13
accepted date: 2017-02-13
in scheme: emissions_variables_MMR

2.F.1.a [Commercial Refrigeration][no classification][Emissions][HFCs and PFCs][t CO2 equivalent][no source][no method][no target][no option][no type]
type: Concept
definition: 2.F.1.a [Commercial Refrigeration][no classification][Emissions][HFCs and PFCs][t CO2 equivalent][no source][no method][no target][no option][no type]
status: valid
status modified: 2017-02-13
accepted date: 2017-02-13
in scheme: emissions_variables_MMR

2.F.1.a [Commercial Refrigeration][no classification][Emissions][HFCs][t CO2 equivalent][no source][no method][no target][no option][no type]
type: Concept
definition: 2.F.1.a [Commercial Refrigeration][no classification][Emissions][HFCs][t CO2 equivalent][no source][no method][no target][no option][no type]
status: valid
status modified: 2017-02-13
accepted date: 2017-02-13
in scheme: emissions_variables_MMR

2.F.1.a [Commercial Refrigeration][no classification][Emissions][NF3][t][From disposal][no method][no target][no option][no type]
type: Concept
definition: 2.F.1.a [Commercial Refrigeration][no classification][Emissions][NF3][t][From disposal][no method][no target][no option][no type]
status: valid
status modified: 2017-02-13
accepted date: 2017-02-13
in scheme: emissions_variables_MMR

2.F.1.a [Commercial Refrigeration][no classification][Emissions][NF3][t][From manufacturing][no method][no target][no option][no type]
type: Concept
definition: 2.F.1.a [Commercial Refrigeration][no classification][Emissions][NF3][t][From manufacturing][no method][no target][no option][no type]
status: valid
status modified: 2017-02-13
accepted date: 2017-02-13
in scheme: emissions_variables_MMR

2.F.1.a [Commercial Refrigeration][no classification][Emissions][NF3][t][From stocks][no method][no target][no option][no type]
type: Concept
definition: 2.F.1.a [Commercial Refrigeration][no classification][Emissions][NF3][t][From stocks][no method][no target][no option][no type]
status: valid
status modified: 2017-02-13
accepted date: 2017-02-13
in scheme: emissions_variables_MMR

2.F.1.a [Commercial Refrigeration][no classification][Emissions][NF3][t][no source][no method][no target][no option][no type]
type: Concept
definition: 2.F.1.a [Commercial Refrigeration][no classification][Emissions][NF3][t][no source][no method][no target][no option][no type]
status: valid
status modified: 2017-02-13
accepted date: 2017-02-13
in scheme: emissions_variables_MMR

2.F.1.a [Commercial Refrigeration][no classification][Emissions][PFCs][t CO2 equivalent][no source][no method][no target][no option][no type]
type: Concept
definition: 2.F.1.a [Commercial Refrigeration][no classification][Emissions][PFCs][t CO2 equivalent][no source][no method][no target][no option][no type]
status: valid
status modified: 2017-02-13
accepted date: 2017-02-13
in scheme: emissions_variables_MMR

2.F.1.a [Commercial Refrigeration][no classification][Emissions][SF6][t][From disposal][no method][no target][no option][no type]
type: Concept
definition: 2.F.1.a [Commercial Refrigeration][no classification][Emissions][SF6][t][From disposal][no method][no target][no option][no type]
status: valid
status modified: 2017-02-13
accepted date: 2017-02-13
in scheme: emissions_variables_MMR

2.F.1.a [Commercial Refrigeration][no classification][Emissions][SF6][t][From manufacturing][no method][no target][no option][no type]
type: Concept
definition: 2.F.1.a [Commercial Refrigeration][no classification][Emissions][SF6][t][From manufacturing][no method][no target][no option][no type]
status: valid
status modified: 2017-02-13
accepted date: 2017-02-13
in scheme: emissions_variables_MMR

2.F.1.a [Commercial Refrigeration][no classification][Emissions][SF6][t][From stocks][no method][no target][no option][no type]
type: Concept
definition: 2.F.1.a [Commercial Refrigeration][no classification][Emissions][SF6][t][From stocks][no method][no target][no option][no type]
status: valid
status modified: 2017-02-13
accepted date: 2017-02-13
in scheme: emissions_variables_MMR

2.F.1.a [Commercial Refrigeration][no classification][Emissions][SF6][t][no source][no method][no target][no option][no type]
type: Concept
definition: 2.F.1.a [Commercial Refrigeration][no classification][Emissions][SF6][t][no source][no method][no target][no option][no type]
status: valid
status modified: 2017-02-13
accepted date: 2017-02-13
in scheme: emissions_variables_MMR

2.F.1.a [Commercial Refrigeration][no classification][Emissions][Unspecified mix of HFCs and PFCs][t CO2 equivalent][From disposal][no method][no target][no option][no type]
type: Concept
definition: 2.F.1.a [Commercial Refrigeration][no classification][Emissions][Unspecified mix of HFCs and PFCs][t CO2 equivalent][From disposal][no method][no target][no option][no type]
status: valid
status modified: 2017-02-13
accepted date: 2017-02-13
in scheme: emissions_variables_MMR

2.F.1.a [Commercial Refrigeration][no classification][Emissions][Unspecified mix of HFCs and PFCs][t CO2 equivalent][From manufacturing][no method][no target][no option][no type]
type: Concept
definition: 2.F.1.a [Commercial Refrigeration][no classification][Emissions][Unspecified mix of HFCs and PFCs][t CO2 equivalent][From manufacturing][no method][no target][no option][no type]
status: valid
status modified: 2017-02-13
accepted date: 2017-02-13
in scheme: emissions_variables_MMR

2.F.1.a [Commercial Refrigeration][no classification][Emissions][Unspecified mix of HFCs and PFCs][t CO2 equivalent][From stocks][no method][no target][no option][no type]
type: Concept
definition: 2.F.1.a [Commercial Refrigeration][no classification][Emissions][Unspecified mix of HFCs and PFCs][t CO2 equivalent][From stocks][no method][no target][no option][no type]
status: valid
status modified: 2017-02-13
accepted date: 2017-02-13
in scheme: emissions_variables_MMR

2.F.1.a [Commercial Refrigeration][no classification][Emissions][Unspecified mix of HFCs and PFCs][t CO2 equivalent][no source][no method][no target][no option][no type]
type: Concept
definition: 2.F.1.a [Commercial Refrigeration][no classification][Emissions][Unspecified mix of HFCs and PFCs][t CO2 equivalent][no source][no method][no target][no option][no type]
status: valid
status modified: 2017-02-13
accepted date: 2017-02-13
in scheme: emissions_variables_MMR

2.F.1.a [Commercial Refrigeration][no classification][Emissions][Unspecified mix of HFCs][t CO2 equivalent][From disposal][no method][no target][no option][no type]
type: Concept
definition: 2.F.1.a [Commercial Refrigeration][no classification][Emissions][Unspecified mix of HFCs][t CO2 equivalent][From disposal][no method][no target][no option][no type]
status: valid
status modified: 2017-02-13
accepted date: 2017-02-13
in scheme: emissions_variables_MMR

2.F.1.a [Commercial Refrigeration][no classification][Emissions][Unspecified mix of HFCs][t CO2 equivalent][From manufacturing][no method][no target][no option][no type]
type: Concept
definition: 2.F.1.a [Commercial Refrigeration][no classification][Emissions][Unspecified mix of HFCs][t CO2 equivalent][From manufacturing][no method][no target][no option][no type]
status: valid
status modified: 2017-02-13
accepted date: 2017-02-13
in scheme: emissions_variables_MMR

2.F.1.a [Commercial Refrigeration][no classification][Emissions][Unspecified mix of HFCs][t CO2 equivalent][From stocks][no method][no target][no option][no type]
type: Concept
definition: 2.F.1.a [Commercial Refrigeration][no classification][Emissions][Unspecified mix of HFCs][t CO2 equivalent][From stocks][no method][no target][no option][no type]
status: valid
status modified: 2017-02-13
accepted date: 2017-02-13
in scheme: emissions_variables_MMR

2.F.1.a [Commercial Refrigeration][no classification][Emissions][Unspecified mix of HFCs][t CO2 equivalent][no source][no method][no target][no option][no type]
type: Concept
definition: 2.F.1.a [Commercial Refrigeration][no classification][Emissions][Unspecified mix of HFCs][t CO2 equivalent][no source][no method][no target][no option][no type]
status: valid
status modified: 2017-02-13
accepted date: 2017-02-13
in scheme: emissions_variables_MMR

2.F.1.a [Commercial Refrigeration][no classification][Emissions][Unspecified mix of PFCs][t CO2 equivalent][From disposal][no method][no target][no option][no type]
type: Concept
definition: 2.F.1.a [Commercial Refrigeration][no classification][Emissions][Unspecified mix of PFCs][t CO2 equivalent][From disposal][no method][no target][no option][no type]
status: valid
status modified: 2017-02-13
accepted date: 2017-02-13
in scheme: emissions_variables_MMR

2.F.1.a [Commercial Refrigeration][no classification][Emissions][Unspecified mix of PFCs][t CO2 equivalent][From manufacturing][no method][no target][no option][no type]
type: Concept
definition: 2.F.1.a [Commercial Refrigeration][no classification][Emissions][Unspecified mix of PFCs][t CO2 equivalent][From manufacturing][no method][no target][no option][no type]
status: valid
status modified: 2017-02-13
accepted date: 2017-02-13
in scheme: emissions_variables_MMR

2.F.1.a [Commercial Refrigeration][no classification][Emissions][Unspecified mix of PFCs][t CO2 equivalent][From stocks][no method][no target][no option][no type]
type: Concept
definition: 2.F.1.a [Commercial Refrigeration][no classification][Emissions][Unspecified mix of PFCs][t CO2 equivalent][From stocks][no method][no target][no option][no type]
status: valid
status modified: 2017-02-13
accepted date: 2017-02-13
in scheme: emissions_variables_MMR

2.F.1.a [Commercial Refrigeration][no classification][Emissions][Unspecified mix of PFCs][t CO2 equivalent][no source][no method][no target][no option][no type]
type: Concept
definition: 2.F.1.a [Commercial Refrigeration][no classification][Emissions][Unspecified mix of PFCs][t CO2 equivalent][no source][no method][no target][no option][no type]
status: valid
status modified: 2017-02-13
accepted date: 2017-02-13
in scheme: emissions_variables_MMR

2.F.1.b [Domestic Refrigeration][no classification][Emissions][Aggregate F-gases][t CO2 equivalent][no source][no method][no target][no option][no type]
type: Concept
definition: 2.F.1.b [Domestic Refrigeration][no classification][Emissions][Aggregate F-gases][t CO2 equivalent][no source][no method][no target][no option][no type]
status: valid
status modified: 2017-02-13
accepted date: 2017-02-13
in scheme: emissions_variables_MMR

2.F.1.b [Domestic Refrigeration][no classification][Emissions][C10F18][t][From disposal][no method][no target][no option][no type]
type: Concept
definition: 2.F.1.b [Domestic Refrigeration][no classification][Emissions][C10F18][t][From disposal][no method][no target][no option][no type]
status: valid
status modified: 2017-02-13
accepted date: 2017-02-13
in scheme: emissions_variables_MMR

2.F.1.b [Domestic Refrigeration][no classification][Emissions][C10F18][t][From manufacturing][no method][no target][no option][no type]
type: Concept
definition: 2.F.1.b [Domestic Refrigeration][no classification][Emissions][C10F18][t][From manufacturing][no method][no target][no option][no type]
status: valid
status modified: 2017-02-13
accepted date: 2017-02-13
in scheme: emissions_variables_MMR

2.F.1.b [Domestic Refrigeration][no classification][Emissions][C10F18][t][From stocks][no method][no target][no option][no type]
type: Concept
definition: 2.F.1.b [Domestic Refrigeration][no classification][Emissions][C10F18][t][From stocks][no method][no target][no option][no type]
status: valid
status modified: 2017-02-13
accepted date: 2017-02-13
in scheme: emissions_variables_MMR

2.F.1.b [Domestic Refrigeration][no classification][Emissions][C10F18][t][no source][no method][no target][no option][no type]
type: Concept
definition: 2.F.1.b [Domestic Refrigeration][no classification][Emissions][C10F18][t][no source][no method][no target][no option][no type]
status: valid
status modified: 2017-02-13
accepted date: 2017-02-13
in scheme: emissions_variables_MMR

2.F.1.b [Domestic Refrigeration][no classification][Emissions][C2F6][t][From disposal][no method][no target][no option][no type]
type: Concept
definition: 2.F.1.b [Domestic Refrigeration][no classification][Emissions][C2F6][t][From disposal][no method][no target][no option][no type]
status: valid
status modified: 2017-02-13
accepted date: 2017-02-13
in scheme: emissions_variables_MMR

2.F.1.b [Domestic Refrigeration][no classification][Emissions][C2F6][t][From manufacturing][no method][no target][no option][no type]
type: Concept
definition: 2.F.1.b [Domestic Refrigeration][no classification][Emissions][C2F6][t][From manufacturing][no method][no target][no option][no type]
status: valid
status modified: 2017-02-13
accepted date: 2017-02-13
in scheme: emissions_variables_MMR

2.F.1.b [Domestic Refrigeration][no classification][Emissions][C2F6][t][From stocks][no method][no target][no option][no type]
type: Concept
definition: 2.F.1.b [Domestic Refrigeration][no classification][Emissions][C2F6][t][From stocks][no method][no target][no option][no type]
status: valid
status modified: 2017-02-13
accepted date: 2017-02-13
in scheme: emissions_variables_MMR

2.F.1.b [Domestic Refrigeration][no classification][Emissions][C2F6][t][no source][no method][no target][no option][no type]
type: Concept
definition: 2.F.1.b [Domestic Refrigeration][no classification][Emissions][C2F6][t][no source][no method][no target][no option][no type]
status: valid
status modified: 2017-02-13
accepted date: 2017-02-13
in scheme: emissions_variables_MMR

2.F.1.b [Domestic Refrigeration][no classification][Emissions][C3F8][t][From disposal][no method][no target][no option][no type]
type: Concept
definition: 2.F.1.b [Domestic Refrigeration][no classification][Emissions][C3F8][t][From disposal][no method][no target][no option][no type]
status: valid
status modified: 2017-02-13
accepted date: 2017-02-13
in scheme: emissions_variables_MMR

2.F.1.b [Domestic Refrigeration][no classification][Emissions][C3F8][t][From manufacturing][no method][no target][no option][no type]
type: Concept
definition: 2.F.1.b [Domestic Refrigeration][no classification][Emissions][C3F8][t][From manufacturing][no method][no target][no option][no type]
status: valid
status modified: 2017-02-13
accepted date: 2017-02-13
in scheme: emissions_variables_MMR

2.F.1.b [Domestic Refrigeration][no classification][Emissions][C3F8][t][From stocks][no method][no target][no option][no type]
type: Concept
definition: 2.F.1.b [Domestic Refrigeration][no classification][Emissions][C3F8][t][From stocks][no method][no target][no option][no type]
status: valid
status modified: 2017-02-13
accepted date: 2017-02-13
in scheme: emissions_variables_MMR

2.F.1.b [Domestic Refrigeration][no classification][Emissions][C3F8][t][no source][no method][no target][no option][no type]
type: Concept
definition: 2.F.1.b [Domestic Refrigeration][no classification][Emissions][C3F8][t][no source][no method][no target][no option][no type]
status: valid
status modified: 2017-02-13
accepted date: 2017-02-13
in scheme: emissions_variables_MMR

2.F.1.b [Domestic Refrigeration][no classification][Emissions][C4F10][t][From disposal][no method][no target][no option][no type]
type: Concept
definition: 2.F.1.b [Domestic Refrigeration][no classification][Emissions][C4F10][t][From disposal][no method][no target][no option][no type]
status: valid
status modified: 2017-02-13
accepted date: 2017-02-13
in scheme: emissions_variables_MMR

2.F.1.b [Domestic Refrigeration][no classification][Emissions][C4F10][t][From manufacturing][no method][no target][no option][no type]
type: Concept
definition: 2.F.1.b [Domestic Refrigeration][no classification][Emissions][C4F10][t][From manufacturing][no method][no target][no option][no type]
status: valid
status modified: 2017-02-13
accepted date: 2017-02-13
in scheme: emissions_variables_MMR

2.F.1.b [Domestic Refrigeration][no classification][Emissions][C4F10][t][From stocks][no method][no target][no option][no type]
type: Concept
definition: 2.F.1.b [Domestic Refrigeration][no classification][Emissions][C4F10][t][From stocks][no method][no target][no option][no type]
status: valid
status modified: 2017-02-13
accepted date: 2017-02-13
in scheme: emissions_variables_MMR

2.F.1.b [Domestic Refrigeration][no classification][Emissions][C4F10][t][no source][no method][no target][no option][no type]
type: Concept
definition: 2.F.1.b [Domestic Refrigeration][no classification][Emissions][C4F10][t][no source][no method][no target][no option][no type]
status: valid
status modified: 2017-02-13
accepted date: 2017-02-13
in scheme: emissions_variables_MMR

2.F.1.b [Domestic Refrigeration][no classification][Emissions][C5F12][t][From disposal][no method][no target][no option][no type]
type: Concept
definition: 2.F.1.b [Domestic Refrigeration][no classification][Emissions][C5F12][t][From disposal][no method][no target][no option][no type]
status: valid
status modified: 2017-02-13
accepted date: 2017-02-13
in scheme: emissions_variables_MMR

2.F.1.b [Domestic Refrigeration][no classification][Emissions][C5F12][t][From manufacturing][no method][no target][no option][no type]
type: Concept
definition: 2.F.1.b [Domestic Refrigeration][no classification][Emissions][C5F12][t][From manufacturing][no method][no target][no option][no type]
status: valid
status modified: 2017-02-13
accepted date: 2017-02-13
in scheme: emissions_variables_MMR

2.F.1.b [Domestic Refrigeration][no classification][Emissions][C5F12][t][From stocks][no method][no target][no option][no type]
type: Concept
definition: 2.F.1.b [Domestic Refrigeration][no classification][Emissions][C5F12][t][From stocks][no method][no target][no option][no type]
status: valid
status modified: 2017-02-13
accepted date: 2017-02-13
in scheme: emissions_variables_MMR

2.F.1.b [Domestic Refrigeration][no classification][Emissions][C5F12][t][no source][no method][no target][no option][no type]
type: Concept
definition: 2.F.1.b [Domestic Refrigeration][no classification][Emissions][C5F12][t][no source][no method][no target][no option][no type]
status: valid
status modified: 2017-02-13
accepted date: 2017-02-13
in scheme: emissions_variables_MMR

2.F.1.b [Domestic Refrigeration][no classification][Emissions][C6F14][t][From disposal][no method][no target][no option][no type]
type: Concept
definition: 2.F.1.b [Domestic Refrigeration][no classification][Emissions][C6F14][t][From disposal][no method][no target][no option][no type]
status: valid
status modified: 2017-02-13
accepted date: 2017-02-13
in scheme: emissions_variables_MMR

2.F.1.b [Domestic Refrigeration][no classification][Emissions][C6F14][t][From manufacturing][no method][no target][no option][no type]
type: Concept
definition: 2.F.1.b [Domestic Refrigeration][no classification][Emissions][C6F14][t][From manufacturing][no method][no target][no option][no type]
status: valid
status modified: 2017-02-13
accepted date: 2017-02-13
in scheme: emissions_variables_MMR

2.F.1.b [Domestic Refrigeration][no classification][Emissions][C6F14][t][From stocks][no method][no target][no option][no type]
type: Concept
definition: 2.F.1.b [Domestic Refrigeration][no classification][Emissions][C6F14][t][From stocks][no method][no target][no option][no type]
status: valid
status modified: 2017-02-13
accepted date: 2017-02-13
in scheme: emissions_variables_MMR

2.F.1.b [Domestic Refrigeration][no classification][Emissions][C6F14][t][no source][no method][no target][no option][no type]
type: Concept
definition: 2.F.1.b [Domestic Refrigeration][no classification][Emissions][C6F14][t][no source][no method][no target][no option][no type]
status: valid
status modified: 2017-02-13
accepted date: 2017-02-13
in scheme: emissions_variables_MMR

2.F.1.b [Domestic Refrigeration][no classification][Emissions][c-C3F6][t][From disposal][no method][no target][no option][no type]
type: Concept
definition: 2.F.1.b [Domestic Refrigeration][no classification][Emissions][c-C3F6][t][From disposal][no method][no target][no option][no type]
status: valid
status modified: 2017-02-13
accepted date: 2017-02-13
in scheme: emissions_variables_MMR

2.F.1.b [Domestic Refrigeration][no classification][Emissions][c-C3F6][t][From manufacturing][no method][no target][no option][no type]
type: Concept
definition: 2.F.1.b [Domestic Refrigeration][no classification][Emissions][c-C3F6][t][From manufacturing][no method][no target][no option][no type]
status: valid
status modified: 2017-02-13
accepted date: 2017-02-13
in scheme: emissions_variables_MMR

2.F.1.b [Domestic Refrigeration][no classification][Emissions][c-C3F6][t][From stocks][no method][no target][no option][no type]
type: Concept
definition: 2.F.1.b [Domestic Refrigeration][no classification][Emissions][c-C3F6][t][From stocks][no method][no target][no option][no type]
status: valid
status modified: 2017-02-13
accepted date: 2017-02-13
in scheme: emissions_variables_MMR

2.F.1.b [Domestic Refrigeration][no classification][Emissions][c-C3F6][t][no source][no method][no target][no option][no type]
type: Concept
definition: 2.F.1.b [Domestic Refrigeration][no classification][Emissions][c-C3F6][t][no source][no method][no target][no option][no type]
status: valid
status modified: 2017-02-13
accepted date: 2017-02-13
in scheme: emissions_variables_MMR

2.F.1.b [Domestic Refrigeration][no classification][Emissions][c-C4F8][t][From disposal][no method][no target][no option][no type]
type: Concept
definition: 2.F.1.b [Domestic Refrigeration][no classification][Emissions][c-C4F8][t][From disposal][no method][no target][no option][no type]
status: valid
status modified: 2017-02-13
accepted date: 2017-02-13
in scheme: emissions_variables_MMR

2.F.1.b [Domestic Refrigeration][no classification][Emissions][c-C4F8][t][From manufacturing][no method][no target][no option][no type]
type: Concept
definition: 2.F.1.b [Domestic Refrigeration][no classification][Emissions][c-C4F8][t][From manufacturing][no method][no target][no option][no type]
status: valid
status modified: 2017-02-13
accepted date: 2017-02-13
in scheme: emissions_variables_MMR

2.F.1.b [Domestic Refrigeration][no classification][Emissions][c-C4F8][t][From stocks][no method][no target][no option][no type]
type: Concept
definition: 2.F.1.b [Domestic Refrigeration][no classification][Emissions][c-C4F8][t][From stocks][no method][no target][no option][no type]
status: valid
status modified: 2017-02-13
accepted date: 2017-02-13
in scheme: emissions_variables_MMR

2.F.1.b [Domestic Refrigeration][no classification][Emissions][c-C4F8][t][no source][no method][no target][no option][no type]
type: Concept
definition: 2.F.1.b [Domestic Refrigeration][no classification][Emissions][c-C4F8][t][no source][no method][no target][no option][no type]
status: valid
status modified: 2017-02-13
accepted date: 2017-02-13
in scheme: emissions_variables_MMR

2.F.1.b [Domestic Refrigeration][no classification][Emissions][CF4][t][From disposal][no method][no target][no option][no type]
type: Concept
definition: 2.F.1.b [Domestic Refrigeration][no classification][Emissions][CF4][t][From disposal][no method][no target][no option][no type]
status: valid
status modified: 2017-02-13
accepted date: 2017-02-13
in scheme: emissions_variables_MMR

2.F.1.b [Domestic Refrigeration][no classification][Emissions][CF4][t][From manufacturing][no method][no target][no option][no type]
type: Concept
definition: 2.F.1.b [Domestic Refrigeration][no classification][Emissions][CF4][t][From manufacturing][no method][no target][no option][no type]
status: valid
status modified: 2017-02-13
accepted date: 2017-02-13
in scheme: emissions_variables_MMR

2.F.1.b [Domestic Refrigeration][no classification][Emissions][CF4][t][From stocks][no method][no target][no option][no type]
type: Concept
definition: 2.F.1.b [Domestic Refrigeration][no classification][Emissions][CF4][t][From stocks][no method][no target][no option][no type]
status: valid
status modified: 2017-02-13
accepted date: 2017-02-13
in scheme: emissions_variables_MMR

2.F.1.b [Domestic Refrigeration][no classification][Emissions][CF4][t][no source][no method][no target][no option][no type]
type: Concept
definition: 2.F.1.b [Domestic Refrigeration][no classification][Emissions][CF4][t][no source][no method][no target][no option][no type]
status: valid
status modified: 2017-02-13
accepted date: 2017-02-13
in scheme: emissions_variables_MMR

2.F.1.b [Domestic Refrigeration][no classification][Emissions][HFC-125][t][From disposal][no method][no target][no option][no type]
type: Concept
definition: 2.F.1.b [Domestic Refrigeration][no classification][Emissions][HFC-125][t][From disposal][no method][no target][no option][no type]
status: valid
status modified: 2017-02-13
accepted date: 2017-02-13
in scheme: emissions_variables_MMR

2.F.1.b [Domestic Refrigeration][no classification][Emissions][HFC-125][t][From manufacturing][no method][no target][no option][no type]
type: Concept
definition: 2.F.1.b [Domestic Refrigeration][no classification][Emissions][HFC-125][t][From manufacturing][no method][no target][no option][no type]
status: valid
status modified: 2017-02-13
accepted date: 2017-02-13
in scheme: emissions_variables_MMR

2.F.1.b [Domestic Refrigeration][no classification][Emissions][HFC-125][t][From stocks][no method][no target][no option][no type]
type: Concept
definition: 2.F.1.b [Domestic Refrigeration][no classification][Emissions][HFC-125][t][From stocks][no method][no target][no option][no type]
status: valid
status modified: 2017-02-13
accepted date: 2017-02-13
in scheme: emissions_variables_MMR

2.F.1.b [Domestic Refrigeration][no classification][Emissions][HFC-125][t][no source][no method][no target][no option][no type]
type: Concept
definition: 2.F.1.b [Domestic Refrigeration][no classification][Emissions][HFC-125][t][no source][no method][no target][no option][no type]
status: valid
status modified: 2017-02-13
accepted date: 2017-02-13
in scheme: emissions_variables_MMR

2.F.1.b [Domestic Refrigeration][no classification][Emissions][HFC-134][t][From disposal][no method][no target][no option][no type]
type: Concept
definition: 2.F.1.b [Domestic Refrigeration][no classification][Emissions][HFC-134][t][From disposal][no method][no target][no option][no type]
status: valid
status modified: 2017-02-13
accepted date: 2017-02-13
in scheme: emissions_variables_MMR

2.F.1.b [Domestic Refrigeration][no classification][Emissions][HFC-134][t][From manufacturing][no method][no target][no option][no type]
type: Concept
definition: 2.F.1.b [Domestic Refrigeration][no classification][Emissions][HFC-134][t][From manufacturing][no method][no target][no option][no type]
status: valid
status modified: 2017-02-13
accepted date: 2017-02-13
in scheme: emissions_variables_MMR

2.F.1.b [Domestic Refrigeration][no classification][Emissions][HFC-134][t][From stocks][no method][no target][no option][no type]
type: Concept
definition: 2.F.1.b [Domestic Refrigeration][no classification][Emissions][HFC-134][t][From stocks][no method][no target][no option][no type]
status: valid
status modified: 2017-02-13
accepted date: 2017-02-13
in scheme: emissions_variables_MMR

2.F.1.b [Domestic Refrigeration][no classification][Emissions][HFC-134][t][no source][no method][no target][no option][no type]
type: Concept
definition: 2.F.1.b [Domestic Refrigeration][no classification][Emissions][HFC-134][t][no source][no method][no target][no option][no type]
status: valid
status modified: 2017-02-13
accepted date: 2017-02-13
in scheme: emissions_variables_MMR

2.F.1.b [Domestic Refrigeration][no classification][Emissions][HFC-134a][t][From disposal][no method][no target][no option][no type]
type: Concept
definition: 2.F.1.b [Domestic Refrigeration][no classification][Emissions][HFC-134a][t][From disposal][no method][no target][no option][no type]
status: valid
status modified: 2017-02-13
accepted date: 2017-02-13
in scheme: emissions_variables_MMR

2.F.1.b [Domestic Refrigeration][no classification][Emissions][HFC-134a][t][From manufacturing][no method][no target][no option][no type]
type: Concept
definition: 2.F.1.b [Domestic Refrigeration][no classification][Emissions][HFC-134a][t][From manufacturing][no method][no target][no option][no type]
status: valid
status modified: 2017-02-13
accepted date: 2017-02-13
in scheme: emissions_variables_MMR

2.F.1.b [Domestic Refrigeration][no classification][Emissions][HFC-134a][t][From stocks][no method][no target][no option][no type]
type: Concept
definition: 2.F.1.b [Domestic Refrigeration][no classification][Emissions][HFC-134a][t][From stocks][no method][no target][no option][no type]
status: valid
status modified: 2017-02-13
accepted date: 2017-02-13
in scheme: emissions_variables_MMR

2.F.1.b [Domestic Refrigeration][no classification][Emissions][HFC-134a][t][no source][no method][no target][no option][no type]
type: Concept
definition: 2.F.1.b [Domestic Refrigeration][no classification][Emissions][HFC-134a][t][no source][no method][no target][no option][no type]
status: valid
status modified: 2017-02-13
accepted date: 2017-02-13
in scheme: emissions_variables_MMR

2.F.1.b [Domestic Refrigeration][no classification][Emissions][HFC-143][t][From disposal][no method][no target][no option][no type]
type: Concept
definition: 2.F.1.b [Domestic Refrigeration][no classification][Emissions][HFC-143][t][From disposal][no method][no target][no option][no type]
status: valid
status modified: 2017-02-13
accepted date: 2017-02-13
in scheme: emissions_variables_MMR

2.F.1.b [Domestic Refrigeration][no classification][Emissions][HFC-143][t][From manufacturing][no method][no target][no option][no type]
type: Concept
definition: 2.F.1.b [Domestic Refrigeration][no classification][Emissions][HFC-143][t][From manufacturing][no method][no target][no option][no type]
status: valid
status modified: 2017-02-13
accepted date: 2017-02-13
in scheme: emissions_variables_MMR

2.F.1.b [Domestic Refrigeration][no classification][Emissions][HFC-143][t][From stocks][no method][no target][no option][no type]
type: Concept
definition: 2.F.1.b [Domestic Refrigeration][no classification][Emissions][HFC-143][t][From stocks][no method][no target][no option][no type]
status: valid
status modified: 2017-02-13
accepted date: 2017-02-13
in scheme: emissions_variables_MMR

2.F.1.b [Domestic Refrigeration][no classification][Emissions][HFC-143][t][no source][no method][no target][no option][no type]
type: Concept
definition: 2.F.1.b [Domestic Refrigeration][no classification][Emissions][HFC-143][t][no source][no method][no target][no option][no type]
status: valid
status modified: 2017-02-13
accepted date: 2017-02-13
in scheme: emissions_variables_MMR

2.F.1.b [Domestic Refrigeration][no classification][Emissions][HFC-143a][t][From disposal][no method][no target][no option][no type]
type: Concept
definition: 2.F.1.b [Domestic Refrigeration][no classification][Emissions][HFC-143a][t][From disposal][no method][no target][no option][no type]
status: valid
status modified: 2017-02-13
accepted date: 2017-02-13
in scheme: emissions_variables_MMR

2.F.1.b [Domestic Refrigeration][no classification][Emissions][HFC-143a][t][From manufacturing][no method][no target][no option][no type]
type: Concept
definition: 2.F.1.b [Domestic Refrigeration][no classification][Emissions][HFC-143a][t][From manufacturing][no method][no target][no option][no type]
status: valid
status modified: 2017-02-13
accepted date: 2017-02-13
in scheme: emissions_variables_MMR

2.F.1.b [Domestic Refrigeration][no classification][Emissions][HFC-143a][t][From stocks][no method][no target][no option][no type]
type: Concept
definition: 2.F.1.b [Domestic Refrigeration][no classification][Emissions][HFC-143a][t][From stocks][no method][no target][no option][no type]
status: valid
status modified: 2017-02-13
accepted date: 2017-02-13
in scheme: emissions_variables_MMR

2.F.1.b [Domestic Refrigeration][no classification][Emissions][HFC-143a][t][no source][no method][no target][no option][no type]
type: Concept
definition: 2.F.1.b [Domestic Refrigeration][no classification][Emissions][HFC-143a][t][no source][no method][no target][no option][no type]
status: valid
status modified: 2017-02-13
accepted date: 2017-02-13
in scheme: emissions_variables_MMR

2.F.1.b [Domestic Refrigeration][no classification][Emissions][HFC-152][t][From disposal][no method][no target][no option][no type]
type: Concept
definition: 2.F.1.b [Domestic Refrigeration][no classification][Emissions][HFC-152][t][From disposal][no method][no target][no option][no type]
status: valid
status modified: 2017-02-13
accepted date: 2017-02-13
in scheme: emissions_variables_MMR

2.F.1.b [Domestic Refrigeration][no classification][Emissions][HFC-152][t][From manufacturing][no method][no target][no option][no type]
type: Concept
definition: 2.F.1.b [Domestic Refrigeration][no classification][Emissions][HFC-152][t][From manufacturing][no method][no target][no option][no type]
status: valid
status modified: 2017-02-13
accepted date: 2017-02-13
in scheme: emissions_variables_MMR

2.F.1.b [Domestic Refrigeration][no classification][Emissions][HFC-152][t][From stocks][no method][no target][no option][no type]
type: Concept
definition: 2.F.1.b [Domestic Refrigeration][no classification][Emissions][HFC-152][t][From stocks][no method][no target][no option][no type]
status: valid
status modified: 2017-02-13
accepted date: 2017-02-13
in scheme: emissions_variables_MMR

2.F.1.b [Domestic Refrigeration][no classification][Emissions][HFC-152][t][no source][no method][no target][no option][no type]
type: Concept
definition: 2.F.1.b [Domestic Refrigeration][no classification][Emissions][HFC-152][t][no source][no method][no target][no option][no type]
status: valid
status modified: 2017-02-13
accepted date: 2017-02-13
in scheme: emissions_variables_MMR

2.F.1.b [Domestic Refrigeration][no classification][Emissions][HFC-152a][t][From disposal][no method][no target][no option][no type]
type: Concept
definition: 2.F.1.b [Domestic Refrigeration][no classification][Emissions][HFC-152a][t][From disposal][no method][no target][no option][no type]
status: valid
status modified: 2017-02-13
accepted date: 2017-02-13
in scheme: emissions_variables_MMR

2.F.1.b [Domestic Refrigeration][no classification][Emissions][HFC-152a][t][From manufacturing][no method][no target][no option][no type]
type: Concept
definition: 2.F.1.b [Domestic Refrigeration][no classification][Emissions][HFC-152a][t][From manufacturing][no method][no target][no option][no type]
status: valid
status modified: 2017-02-13
accepted date: 2017-02-13
in scheme: emissions_variables_MMR

2.F.1.b [Domestic Refrigeration][no classification][Emissions][HFC-152a][t][From stocks][no method][no target][no option][no type]
type: Concept
definition: 2.F.1.b [Domestic Refrigeration][no classification][Emissions][HFC-152a][t][From stocks][no method][no target][no option][no type]
status: valid
status modified: 2017-02-13
accepted date: 2017-02-13
in scheme: emissions_variables_MMR

2.F.1.b [Domestic Refrigeration][no classification][Emissions][HFC-152a][t][no source][no method][no target][no option][no type]
type: Concept
definition: 2.F.1.b [Domestic Refrigeration][no classification][Emissions][HFC-152a][t][no source][no method][no target][no option][no type]
status: valid
status modified: 2017-02-13
accepted date: 2017-02-13
in scheme: emissions_variables_MMR

2.F.1.b [Domestic Refrigeration][no classification][Emissions][HFC-161][t][From disposal][no method][no target][no option][no type]
type: Concept
definition: 2.F.1.b [Domestic Refrigeration][no classification][Emissions][HFC-161][t][From disposal][no method][no target][no option][no type]
status: valid
status modified: 2017-02-13
accepted date: 2017-02-13
in scheme: emissions_variables_MMR

2.F.1.b [Domestic Refrigeration][no classification][Emissions][HFC-161][t][From manufacturing][no method][no target][no option][no type]
type: Concept
definition: 2.F.1.b [Domestic Refrigeration][no classification][Emissions][HFC-161][t][From manufacturing][no method][no target][no option][no type]
status: valid
status modified: 2017-02-13
accepted date: 2017-02-13
in scheme: emissions_variables_MMR

2.F.1.b [Domestic Refrigeration][no classification][Emissions][HFC-161][t][From stocks][no method][no target][no option][no type]
type: Concept
definition: 2.F.1.b [Domestic Refrigeration][no classification][Emissions][HFC-161][t][From stocks][no method][no target][no option][no type]
status: valid
status modified: 2017-02-13
accepted date: 2017-02-13
in scheme: emissions_variables_MMR

2.F.1.b [Domestic Refrigeration][no classification][Emissions][HFC-161][t][no source][no method][no target][no option][no type]
type: Concept
definition: 2.F.1.b [Domestic Refrigeration][no classification][Emissions][HFC-161][t][no source][no method][no target][no option][no type]
status: valid
status modified: 2017-02-13
accepted date: 2017-02-13
in scheme: emissions_variables_MMR

2.F.1.b [Domestic Refrigeration][no classification][Emissions][HFC-227ea][t][From disposal][no method][no target][no option][no type]
type: Concept
definition: 2.F.1.b [Domestic Refrigeration][no classification][Emissions][HFC-227ea][t][From disposal][no method][no target][no option][no type]
status: valid
status modified: 2017-02-13
accepted date: 2017-02-13
in scheme: emissions_variables_MMR

2.F.1.b [Domestic Refrigeration][no classification][Emissions][HFC-227ea][t][From manufacturing][no method][no target][no option][no type]
type: Concept
definition: 2.F.1.b [Domestic Refrigeration][no classification][Emissions][HFC-227ea][t][From manufacturing][no method][no target][no option][no type]
status: valid
status modified: 2017-02-13
accepted date: 2017-02-13
in scheme: emissions_variables_MMR

2.F.1.b [Domestic Refrigeration][no classification][Emissions][HFC-227ea][t][From stocks][no method][no target][no option][no type]
type: Concept
definition: 2.F.1.b [Domestic Refrigeration][no classification][Emissions][HFC-227ea][t][From stocks][no method][no target][no option][no type]
status: valid
status modified: 2017-02-13
accepted date: 2017-02-13
in scheme: emissions_variables_MMR

2.F.1.b [Domestic Refrigeration][no classification][Emissions][HFC-227ea][t][no source][no method][no target][no option][no type]
type: Concept
definition: 2.F.1.b [Domestic Refrigeration][no classification][Emissions][HFC-227ea][t][no source][no method][no target][no option][no type]
status: valid
status modified: 2017-02-13
accepted date: 2017-02-13
in scheme: emissions_variables_MMR

2.F.1.b [Domestic Refrigeration][no classification][Emissions][HFC-23][t][From disposal][no method][no target][no option][no type]
type: Concept
definition: 2.F.1.b [Domestic Refrigeration][no classification][Emissions][HFC-23][t][From disposal][no method][no target][no option][no type]
status: valid
status modified: 2017-02-13
accepted date: 2017-02-13
in scheme: emissions_variables_MMR

2.F.1.b [Domestic Refrigeration][no classification][Emissions][HFC-23][t][From manufacturing][no method][no target][no option][no type]
type: Concept
definition: 2.F.1.b [Domestic Refrigeration][no classification][Emissions][HFC-23][t][From manufacturing][no method][no target][no option][no type]
status: valid
status modified: 2017-02-13
accepted date: 2017-02-13
in scheme: emissions_variables_MMR

2.F.1.b [Domestic Refrigeration][no classification][Emissions][HFC-23][t][From stocks][no method][no target][no option][no type]
type: Concept
definition: 2.F.1.b [Domestic Refrigeration][no classification][Emissions][HFC-23][t][From stocks][no method][no target][no option][no type]
status: valid
status modified: 2017-02-13
accepted date: 2017-02-13
in scheme: emissions_variables_MMR

2.F.1.b [Domestic Refrigeration][no classification][Emissions][HFC-23][t][no source][no method][no target][no option][no type]
type: Concept
definition: 2.F.1.b [Domestic Refrigeration][no classification][Emissions][HFC-23][t][no source][no method][no target][no option][no type]
status: valid
status modified: 2017-02-13
accepted date: 2017-02-13
in scheme: emissions_variables_MMR

2.F.1.b [Domestic Refrigeration][no classification][Emissions][HFC-236cb][t][From disposal][no method][no target][no option][no type]
type: Concept
definition: 2.F.1.b [Domestic Refrigeration][no classification][Emissions][HFC-236cb][t][From disposal][no method][no target][no option][no type]
status: valid
status modified: 2017-02-13
accepted date: 2017-02-13
in scheme: emissions_variables_MMR

2.F.1.b [Domestic Refrigeration][no classification][Emissions][HFC-236cb][t][From manufacturing][no method][no target][no option][no type]
type: Concept
definition: 2.F.1.b [Domestic Refrigeration][no classification][Emissions][HFC-236cb][t][From manufacturing][no method][no target][no option][no type]
status: valid
status modified: 2017-02-13
accepted date: 2017-02-13
in scheme: emissions_variables_MMR

2.F.1.b [Domestic Refrigeration][no classification][Emissions][HFC-236cb][t][From stocks][no method][no target][no option][no type]
type: Concept
definition: 2.F.1.b [Domestic Refrigeration][no classification][Emissions][HFC-236cb][t][From stocks][no method][no target][no option][no type]
status: valid
status modified: 2017-02-13
accepted date: 2017-02-13
in scheme: emissions_variables_MMR

2.F.1.b [Domestic Refrigeration][no classification][Emissions][HFC-236cb][t][no source][no method][no target][no option][no type]
type: Concept
definition: 2.F.1.b [Domestic Refrigeration][no classification][Emissions][HFC-236cb][t][no source][no method][no target][no option][no type]
status: valid
status modified: 2017-02-13
accepted date: 2017-02-13
in scheme: emissions_variables_MMR

2.F.1.b [Domestic Refrigeration][no classification][Emissions][HFC-236ea][t][From disposal][no method][no target][no option][no type]
type: Concept
definition: 2.F.1.b [Domestic Refrigeration][no classification][Emissions][HFC-236ea][t][From disposal][no method][no target][no option][no type]
status: valid
status modified: 2017-02-13
accepted date: 2017-02-13
in scheme: emissions_variables_MMR

2.F.1.b [Domestic Refrigeration][no classification][Emissions][HFC-236ea][t][From manufacturing][no method][no target][no option][no type]
type: Concept
definition: 2.F.1.b [Domestic Refrigeration][no classification][Emissions][HFC-236ea][t][From manufacturing][no method][no target][no option][no type]
status: valid
status modified: 2017-02-13
accepted date: 2017-02-13
in scheme: emissions_variables_MMR

2.F.1.b [Domestic Refrigeration][no classification][Emissions][HFC-236ea][t][From stocks][no method][no target][no option][no type]
type: Concept
definition: 2.F.1.b [Domestic Refrigeration][no classification][Emissions][HFC-236ea][t][From stocks][no method][no target][no option][no type]
status: valid
status modified: 2017-02-13
accepted date: 2017-02-13
in scheme: emissions_variables_MMR

2.F.1.b [Domestic Refrigeration][no classification][Emissions][HFC-236ea][t][no source][no method][no target][no option][no type]
type: Concept
definition: 2.F.1.b [Domestic Refrigeration][no classification][Emissions][HFC-236ea][t][no source][no method][no target][no option][no type]
status: valid
status modified: 2017-02-13
accepted date: 2017-02-13
in scheme: emissions_variables_MMR

2.F.1.b [Domestic Refrigeration][no classification][Emissions][HFC-236fa][t][From disposal][no method][no target][no option][no type]
type: Concept
definition: 2.F.1.b [Domestic Refrigeration][no classification][Emissions][HFC-236fa][t][From disposal][no method][no target][no option][no type]
status: valid
status modified: 2017-02-13
accepted date: 2017-02-13
in scheme: emissions_variables_MMR

2.F.1.b [Domestic Refrigeration][no classification][Emissions][HFC-236fa][t][From manufacturing][no method][no target][no option][no type]
type: Concept
definition: 2.F.1.b [Domestic Refrigeration][no classification][Emissions][HFC-236fa][t][From manufacturing][no method][no target][no option][no type]
status: valid
status modified: 2017-02-13
accepted date: 2017-02-13
in scheme: emissions_variables_MMR

2.F.1.b [Domestic Refrigeration][no classification][Emissions][HFC-236fa][t][From stocks][no method][no target][no option][no type]
type: Concept
definition: 2.F.1.b [Domestic Refrigeration][no classification][Emissions][HFC-236fa][t][From stocks][no method][no target][no option][no type]
status: valid
status modified: 2017-02-13
accepted date: 2017-02-13
in scheme: emissions_variables_MMR

2.F.1.b [Domestic Refrigeration][no classification][Emissions][HFC-236fa][t][no source][no method][no target][no option][no type]
type: Concept
definition: 2.F.1.b [Domestic Refrigeration][no classification][Emissions][HFC-236fa][t][no source][no method][no target][no option][no type]
status: valid
status modified: 2017-02-13
accepted date: 2017-02-13
in scheme: emissions_variables_MMR

2.F.1.b [Domestic Refrigeration][no classification][Emissions][HFC-245ca][t][From disposal][no method][no target][no option][no type]
type: Concept
definition: 2.F.1.b [Domestic Refrigeration][no classification][Emissions][HFC-245ca][t][From disposal][no method][no target][no option][no type]
status: valid
status modified: 2017-02-13
accepted date: 2017-02-13
in scheme: emissions_variables_MMR

2.F.1.b [Domestic Refrigeration][no classification][Emissions][HFC-245ca][t][From manufacturing][no method][no target][no option][no type]
type: Concept
definition: 2.F.1.b [Domestic Refrigeration][no classification][Emissions][HFC-245ca][t][From manufacturing][no method][no target][no option][no type]
status: valid
status modified: 2017-02-13
accepted date: 2017-02-13
in scheme: emissions_variables_MMR

2.F.1.b [Domestic Refrigeration][no classification][Emissions][HFC-245ca][t][From stocks][no method][no target][no option][no type]
type: Concept
definition: 2.F.1.b [Domestic Refrigeration][no classification][Emissions][HFC-245ca][t][From stocks][no method][no target][no option][no type]
status: valid
status modified: 2017-02-13
accepted date: 2017-02-13
in scheme: emissions_variables_MMR

2.F.1.b [Domestic Refrigeration][no classification][Emissions][HFC-245ca][t][no source][no method][no target][no option][no type]
type: Concept
definition: 2.F.1.b [Domestic Refrigeration][no classification][Emissions][HFC-245ca][t][no source][no method][no target][no option][no type]
status: valid
status modified: 2017-02-13
accepted date: 2017-02-13
in scheme: emissions_variables_MMR

2.F.1.b [Domestic Refrigeration][no classification][Emissions][HFC-245fa][t][From disposal][no method][no target][no option][no type]
type: Concept
definition: 2.F.1.b [Domestic Refrigeration][no classification][Emissions][HFC-245fa][t][From disposal][no method][no target][no option][no type]
status: valid
status modified: 2017-02-13
accepted date: 2017-02-13
in scheme: emissions_variables_MMR

2.F.1.b [Domestic Refrigeration][no classification][Emissions][HFC-245fa][t][From manufacturing][no method][no target][no option][no type]
type: Concept
definition: 2.F.1.b [Domestic Refrigeration][no classification][Emissions][HFC-245fa][t][From manufacturing][no method][no target][no option][no type]
status: valid
status modified: 2017-02-13
accepted date: 2017-02-13
in scheme: emissions_variables_MMR

2.F.1.b [Domestic Refrigeration][no classification][Emissions][HFC-245fa][t][From stocks][no method][no target][no option][no type]
type: Concept
definition: 2.F.1.b [Domestic Refrigeration][no classification][Emissions][HFC-245fa][t][From stocks][no method][no target][no option][no type]
status: valid
status modified: 2017-02-13
accepted date: 2017-02-13
in scheme: emissions_variables_MMR

2.F.1.b [Domestic Refrigeration][no classification][Emissions][HFC-245fa][t][no source][no method][no target][no option][no type]
type: Concept
definition: 2.F.1.b [Domestic Refrigeration][no classification][Emissions][HFC-245fa][t][no source][no method][no target][no option][no type]
status: valid
status modified: 2017-02-13
accepted date: 2017-02-13
in scheme: emissions_variables_MMR

2.F.1.b [Domestic Refrigeration][no classification][Emissions][HFC-32][t][From disposal][no method][no target][no option][no type]
type: Concept
definition: 2.F.1.b [Domestic Refrigeration][no classification][Emissions][HFC-32][t][From disposal][no method][no target][no option][no type]
status: valid
status modified: 2017-02-13
accepted date: 2017-02-13
in scheme: emissions_variables_MMR

2.F.1.b [Domestic Refrigeration][no classification][Emissions][HFC-32][t][From manufacturing][no method][no target][no option][no type]
type: Concept
definition: 2.F.1.b [Domestic Refrigeration][no classification][Emissions][HFC-32][t][From manufacturing][no method][no target][no option][no type]
status: valid
status modified: 2017-02-13
accepted date: 2017-02-13
in scheme: emissions_variables_MMR

2.F.1.b [Domestic Refrigeration][no classification][Emissions][HFC-32][t][From stocks][no method][no target][no option][no type]
type: Concept
definition: 2.F.1.b [Domestic Refrigeration][no classification][Emissions][HFC-32][t][From stocks][no method][no target][no option][no type]
status: valid
status modified: 2017-02-13
accepted date: 2017-02-13
in scheme: emissions_variables_MMR

2.F.1.b [Domestic Refrigeration][no classification][Emissions][HFC-32][t][no source][no method][no target][no option][no type]
type: Concept
definition: 2.F.1.b [Domestic Refrigeration][no classification][Emissions][HFC-32][t][no source][no method][no target][no option][no type]
status: valid
status modified: 2017-02-13
accepted date: 2017-02-13
in scheme: emissions_variables_MMR

2.F.1.b [Domestic Refrigeration][no classification][Emissions][HFC-365mfc][t][From disposal][no method][no target][no option][no type]
type: Concept
definition: 2.F.1.b [Domestic Refrigeration][no classification][Emissions][HFC-365mfc][t][From disposal][no method][no target][no option][no type]
status: valid
status modified: 2017-02-13
accepted date: 2017-02-13
in scheme: emissions_variables_MMR

2.F.1.b [Domestic Refrigeration][no classification][Emissions][HFC-365mfc][t][From manufacturing][no method][no target][no option][no type]
type: Concept
definition: 2.F.1.b [Domestic Refrigeration][no classification][Emissions][HFC-365mfc][t][From manufacturing][no method][no target][no option][no type]
status: valid
status modified: 2017-02-13
accepted date: 2017-02-13
in scheme: emissions_variables_MMR

2.F.1.b [Domestic Refrigeration][no classification][Emissions][HFC-365mfc][t][From stocks][no method][no target][no option][no type]
type: Concept
definition: 2.F.1.b [Domestic Refrigeration][no classification][Emissions][HFC-365mfc][t][From stocks][no method][no target][no option][no type]
status: valid
status modified: 2017-02-13
accepted date: 2017-02-13
in scheme: emissions_variables_MMR

2.F.1.b [Domestic Refrigeration][no classification][Emissions][HFC-365mfc][t][no source][no method][no target][no option][no type]
type: Concept
definition: 2.F.1.b [Domestic Refrigeration][no classification][Emissions][HFC-365mfc][t][no source][no method][no target][no option][no type]
status: valid
status modified: 2017-02-13
accepted date: 2017-02-13
in scheme: emissions_variables_MMR

2.F.1.b [Domestic Refrigeration][no classification][Emissions][HFC-41][t][From disposal][no method][no target][no option][no type]
type: Concept
definition: 2.F.1.b [Domestic Refrigeration][no classification][Emissions][HFC-41][t][From disposal][no method][no target][no option][no type]
status: valid
status modified: 2017-02-13
accepted date: 2017-02-13
in scheme: emissions_variables_MMR

2.F.1.b [Domestic Refrigeration][no classification][Emissions][HFC-41][t][From manufacturing][no method][no target][no option][no type]
type: Concept
definition: 2.F.1.b [Domestic Refrigeration][no classification][Emissions][HFC-41][t][From manufacturing][no method][no target][no option][no type]
status: valid
status modified: 2017-02-13
accepted date: 2017-02-13
in scheme: emissions_variables_MMR

2.F.1.b [Domestic Refrigeration][no classification][Emissions][HFC-41][t][From stocks][no method][no target][no option][no type]
type: Concept
definition: 2.F.1.b [Domestic Refrigeration][no classification][Emissions][HFC-41][t][From stocks][no method][no target][no option][no type]
status: valid
status modified: 2017-02-13
accepted date: 2017-02-13
in scheme: emissions_variables_MMR

2.F.1.b [Domestic Refrigeration][no classification][Emissions][HFC-41][t][no source][no method][no target][no option][no type]
type: Concept
definition: 2.F.1.b [Domestic Refrigeration][no classification][Emissions][HFC-41][t][no source][no method][no target][no option][no type]
status: valid
status modified: 2017-02-13
accepted date: 2017-02-13
in scheme: emissions_variables_MMR

2.F.1.b [Domestic Refrigeration][no classification][Emissions][HFC-43-10mee][t][From disposal][no method][no target][no option][no type]
type: Concept
definition: 2.F.1.b [Domestic Refrigeration][no classification][Emissions][HFC-43-10mee][t][From disposal][no method][no target][no option][no type]
status: valid
status modified: 2017-02-13
accepted date: 2017-02-13
in scheme: emissions_variables_MMR

2.F.1.b [Domestic Refrigeration][no classification][Emissions][HFC-43-10mee][t][From manufacturing][no method][no target][no option][no type]
type: Concept
definition: 2.F.1.b [Domestic Refrigeration][no classification][Emissions][HFC-43-10mee][t][From manufacturing][no method][no target][no option][no type]
status: valid
status modified: 2017-02-13
accepted date: 2017-02-13
in scheme: emissions_variables_MMR

2.F.1.b [Domestic Refrigeration][no classification][Emissions][HFC-43-10mee][t][From stocks][no method][no target][no option][no type]
type: Concept
definition: 2.F.1.b [Domestic Refrigeration][no classification][Emissions][HFC-43-10mee][t][From stocks][no method][no target][no option][no type]
status: valid
status modified: 2017-02-13
accepted date: 2017-02-13
in scheme: emissions_variables_MMR

2.F.1.b [Domestic Refrigeration][no classification][Emissions][HFC-43-10mee][t][no source][no method][no target][no option][no type]
type: Concept
definition: 2.F.1.b [Domestic Refrigeration][no classification][Emissions][HFC-43-10mee][t][no source][no method][no target][no option][no type]
status: valid
status modified: 2017-02-13
accepted date: 2017-02-13
in scheme: emissions_variables_MMR

2.F.1.b [Domestic Refrigeration][no classification][Emissions][HFCs and PFCs][t CO2 equivalent][no source][no method][no target][no option][no type]
type: Concept
definition: 2.F.1.b [Domestic Refrigeration][no classification][Emissions][HFCs and PFCs][t CO2 equivalent][no source][no method][no target][no option][no type]
status: valid
status modified: 2017-02-13
accepted date: 2017-02-13
in scheme: emissions_variables_MMR

2.F.1.b [Domestic Refrigeration][no classification][Emissions][HFCs][t CO2 equivalent][no source][no method][no target][no option][no type]
type: Concept
definition: 2.F.1.b [Domestic Refrigeration][no classification][Emissions][HFCs][t CO2 equivalent][no source][no method][no target][no option][no type]
status: valid
status modified: 2017-02-13
accepted date: 2017-02-13
in scheme: emissions_variables_MMR

2.F.1.b [Domestic Refrigeration][no classification][Emissions][NF3][t][From disposal][no method][no target][no option][no type]
type: Concept
definition: 2.F.1.b [Domestic Refrigeration][no classification][Emissions][NF3][t][From disposal][no method][no target][no option][no type]
status: valid
status modified: 2017-02-13
accepted date: 2017-02-13
in scheme: emissions_variables_MMR

2.F.1.b [Domestic Refrigeration][no classification][Emissions][NF3][t][From manufacturing][no method][no target][no option][no type]
type: Concept
definition: 2.F.1.b [Domestic Refrigeration][no classification][Emissions][NF3][t][From manufacturing][no method][no target][no option][no type]
status: valid
status modified: 2017-02-13
accepted date: 2017-02-13
in scheme: emissions_variables_MMR

2.F.1.b [Domestic Refrigeration][no classification][Emissions][NF3][t][From stocks][no method][no target][no option][no type]
type: Concept
definition: 2.F.1.b [Domestic Refrigeration][no classification][Emissions][NF3][t][From stocks][no method][no target][no option][no type]
status: valid
status modified: 2017-02-13
accepted date: 2017-02-13
in scheme: emissions_variables_MMR

2.F.1.b [Domestic Refrigeration][no classification][Emissions][NF3][t][no source][no method][no target][no option][no type]
type: Concept
definition: 2.F.1.b [Domestic Refrigeration][no classification][Emissions][NF3][t][no source][no method][no target][no option][no type]
status: valid
status modified: 2017-02-13
accepted date: 2017-02-13
in scheme: emissions_variables_MMR

2.F.1.b [Domestic Refrigeration][no classification][Emissions][PFCs][t CO2 equivalent][no source][no method][no target][no option][no type]
type: Concept
definition: 2.F.1.b [Domestic Refrigeration][no classification][Emissions][PFCs][t CO2 equivalent][no source][no method][no target][no option][no type]
status: valid
status modified: 2017-02-13
accepted date: 2017-02-13
in scheme: emissions_variables_MMR

2.F.1.b [Domestic Refrigeration][no classification][Emissions][SF6][t][From disposal][no method][no target][no option][no type]
type: Concept
definition: 2.F.1.b [Domestic Refrigeration][no classification][Emissions][SF6][t][From disposal][no method][no target][no option][no type]
status: valid
status modified: 2017-02-13
accepted date: 2017-02-13
in scheme: emissions_variables_MMR

2.F.1.b [Domestic Refrigeration][no classification][Emissions][SF6][t][From manufacturing][no method][no target][no option][no type]
type: Concept
definition: 2.F.1.b [Domestic Refrigeration][no classification][Emissions][SF6][t][From manufacturing][no method][no target][no option][no type]
status: valid
status modified: 2017-02-13
accepted date: 2017-02-13
in scheme: emissions_variables_MMR

2.F.1.b [Domestic Refrigeration][no classification][Emissions][SF6][t][From stocks][no method][no target][no option][no type]
type: Concept
definition: 2.F.1.b [Domestic Refrigeration][no classification][Emissions][SF6][t][From stocks][no method][no target][no option][no type]
status: valid
status modified: 2017-02-13
accepted date: 2017-02-13
in scheme: emissions_variables_MMR

2.F.1.b [Domestic Refrigeration][no classification][Emissions][SF6][t][no source][no method][no target][no option][no type]
type: Concept
definition: 2.F.1.b [Domestic Refrigeration][no classification][Emissions][SF6][t][no source][no method][no target][no option][no type]
status: valid
status modified: 2017-02-13
accepted date: 2017-02-13
in scheme: emissions_variables_MMR

2.F.1.b [Domestic Refrigeration][no classification][Emissions][Unspecified mix of HFCs and PFCs][t CO2 equivalent][From disposal][no method][no target][no option][no type]
type: Concept
definition: 2.F.1.b [Domestic Refrigeration][no classification][Emissions][Unspecified mix of HFCs and PFCs][t CO2 equivalent][From disposal][no method][no target][no option][no type]
status: valid
status modified: 2017-02-13
accepted date: 2017-02-13
in scheme: emissions_variables_MMR

2.F.1.b [Domestic Refrigeration][no classification][Emissions][Unspecified mix of HFCs and PFCs][t CO2 equivalent][From manufacturing][no method][no target][no option][no type]
type: Concept
definition: 2.F.1.b [Domestic Refrigeration][no classification][Emissions][Unspecified mix of HFCs and PFCs][t CO2 equivalent][From manufacturing][no method][no target][no option][no type]
status: valid
status modified: 2017-02-13
accepted date: 2017-02-13
in scheme: emissions_variables_MMR

2.F.1.b [Domestic Refrigeration][no classification][Emissions][Unspecified mix of HFCs and PFCs][t CO2 equivalent][From stocks][no method][no target][no option][no type]
type: Concept
definition: 2.F.1.b [Domestic Refrigeration][no classification][Emissions][Unspecified mix of HFCs and PFCs][t CO2 equivalent][From stocks][no method][no target][no option][no type]
status: valid
status modified: 2017-02-13
accepted date: 2017-02-13
in scheme: emissions_variables_MMR

2.F.1.b [Domestic Refrigeration][no classification][Emissions][Unspecified mix of HFCs and PFCs][t CO2 equivalent][no source][no method][no target][no option][no type]
type: Concept
definition: 2.F.1.b [Domestic Refrigeration][no classification][Emissions][Unspecified mix of HFCs and PFCs][t CO2 equivalent][no source][no method][no target][no option][no type]
status: valid
status modified: 2017-02-13
accepted date: 2017-02-13
in scheme: emissions_variables_MMR

2.F.1.b [Domestic Refrigeration][no classification][Emissions][Unspecified mix of HFCs][t CO2 equivalent][From disposal][no method][no target][no option][no type]
type: Concept
definition: 2.F.1.b [Domestic Refrigeration][no classification][Emissions][Unspecified mix of HFCs][t CO2 equivalent][From disposal][no method][no target][no option][no type]
status: valid
status modified: 2017-02-13
accepted date: 2017-02-13
in scheme: emissions_variables_MMR

2.F.1.b [Domestic Refrigeration][no classification][Emissions][Unspecified mix of HFCs][t CO2 equivalent][From manufacturing][no method][no target][no option][no type]
type: Concept
definition: 2.F.1.b [Domestic Refrigeration][no classification][Emissions][Unspecified mix of HFCs][t CO2 equivalent][From manufacturing][no method][no target][no option][no type]
status: valid
status modified: 2017-02-13
accepted date: 2017-02-13
in scheme: emissions_variables_MMR

2.F.1.b [Domestic Refrigeration][no classification][Emissions][Unspecified mix of HFCs][t CO2 equivalent][From stocks][no method][no target][no option][no type]
type: Concept
definition: 2.F.1.b [Domestic Refrigeration][no classification][Emissions][Unspecified mix of HFCs][t CO2 equivalent][From stocks][no method][no target][no option][no type]
status: valid
status modified: 2017-02-13
accepted date: 2017-02-13
in scheme: emissions_variables_MMR

2.F.1.b [Domestic Refrigeration][no classification][Emissions][Unspecified mix of HFCs][t CO2 equivalent][no source][no method][no target][no option][no type]
type: Concept
definition: 2.F.1.b [Domestic Refrigeration][no classification][Emissions][Unspecified mix of HFCs][t CO2 equivalent][no source][no method][no target][no option][no type]
status: valid
status modified: 2017-02-13
accepted date: 2017-02-13
in scheme: emissions_variables_MMR

2.F.1.b [Domestic Refrigeration][no classification][Emissions][Unspecified mix of PFCs][t CO2 equivalent][From disposal][no method][no target][no option][no type]
type: Concept
definition: 2.F.1.b [Domestic Refrigeration][no classification][Emissions][Unspecified mix of PFCs][t CO2 equivalent][From disposal][no method][no target][no option][no type]
status: valid
status modified: 2017-02-13
accepted date: 2017-02-13
in scheme: emissions_variables_MMR

2.F.1.b [Domestic Refrigeration][no classification][Emissions][Unspecified mix of PFCs][t CO2 equivalent][From manufacturing][no method][no target][no option][no type]
type: Concept
definition: 2.F.1.b [Domestic Refrigeration][no classification][Emissions][Unspecified mix of PFCs][t CO2 equivalent][From manufacturing][no method][no target][no option][no type]
status: valid
status modified: 2017-02-13
accepted date: 2017-02-13
in scheme: emissions_variables_MMR

2.F.1.b [Domestic Refrigeration][no classification][Emissions][Unspecified mix of PFCs][t CO2 equivalent][From stocks][no method][no target][no option][no type]
type: Concept
definition: 2.F.1.b [Domestic Refrigeration][no classification][Emissions][Unspecified mix of PFCs][t CO2 equivalent][From stocks][no method][no target][no option][no type]
status: valid
status modified: 2017-02-13
accepted date: 2017-02-13
in scheme: emissions_variables_MMR

2.F.1.b [Domestic Refrigeration][no classification][Emissions][Unspecified mix of PFCs][t CO2 equivalent][no source][no method][no target][no option][no type]
type: Concept
definition: 2.F.1.b [Domestic Refrigeration][no classification][Emissions][Unspecified mix of PFCs][t CO2 equivalent][no source][no method][no target][no option][no type]
status: valid
status modified: 2017-02-13
accepted date: 2017-02-13
in scheme: emissions_variables_MMR

2.F.1.c [Industrial Refrigeration][no classification][Emissions][Aggregate F-gases][t CO2 equivalent][no source][no method][no target][no option][no type]
type: Concept
definition: 2.F.1.c [Industrial Refrigeration][no classification][Emissions][Aggregate F-gases][t CO2 equivalent][no source][no method][no target][no option][no type]
status: valid
status modified: 2017-02-13
accepted date: 2017-02-13
in scheme: emissions_variables_MMR

2.F.1.c [Industrial Refrigeration][no classification][Emissions][C10F18][t][From disposal][no method][no target][no option][no type]
type: Concept
definition: 2.F.1.c [Industrial Refrigeration][no classification][Emissions][C10F18][t][From disposal][no method][no target][no option][no type]
status: valid
status modified: 2017-02-13
accepted date: 2017-02-13
in scheme: emissions_variables_MMR

2.F.1.c [Industrial Refrigeration][no classification][Emissions][C10F18][t][From manufacturing][no method][no target][no option][no type]
type: Concept
definition: 2.F.1.c [Industrial Refrigeration][no classification][Emissions][C10F18][t][From manufacturing][no method][no target][no option][no type]
status: valid
status modified: 2017-02-13
accepted date: 2017-02-13
in scheme: emissions_variables_MMR

2.F.1.c [Industrial Refrigeration][no classification][Emissions][C10F18][t][From stocks][no method][no target][no option][no type]
type: Concept
definition: 2.F.1.c [Industrial Refrigeration][no classification][Emissions][C10F18][t][From stocks][no method][no target][no option][no type]
status: valid
status modified: 2017-02-13
accepted date: 2017-02-13
in scheme: emissions_variables_MMR

2.F.1.c [Industrial Refrigeration][no classification][Emissions][C10F18][t][no source][no method][no target][no option][no type]
type: Concept
definition: 2.F.1.c [Industrial Refrigeration][no classification][Emissions][C10F18][t][no source][no method][no target][no option][no type]
status: valid
status modified: 2017-02-13
accepted date: 2017-02-13
in scheme: emissions_variables_MMR

2.F.1.c [Industrial Refrigeration][no classification][Emissions][C2F6][t][From disposal][no method][no target][no option][no type]
type: Concept
definition: 2.F.1.c [Industrial Refrigeration][no classification][Emissions][C2F6][t][From disposal][no method][no target][no option][no type]
status: valid
status modified: 2017-02-13
accepted date: 2017-02-13
in scheme: emissions_variables_MMR

2.F.1.c [Industrial Refrigeration][no classification][Emissions][C2F6][t][From manufacturing][no method][no target][no option][no type]
type: Concept
definition: 2.F.1.c [Industrial Refrigeration][no classification][Emissions][C2F6][t][From manufacturing][no method][no target][no option][no type]
status: valid
status modified: 2017-02-13
accepted date: 2017-02-13
in scheme: emissions_variables_MMR

2.F.1.c [Industrial Refrigeration][no classification][Emissions][C2F6][t][From stocks][no method][no target][no option][no type]
type: Concept
definition: 2.F.1.c [Industrial Refrigeration][no classification][Emissions][C2F6][t][From stocks][no method][no target][no option][no type]
status: valid
status modified: 2017-02-13
accepted date: 2017-02-13
in scheme: emissions_variables_MMR

2.F.1.c [Industrial Refrigeration][no classification][Emissions][C2F6][t][no source][no method][no target][no option][no type]
type: Concept
definition: 2.F.1.c [Industrial Refrigeration][no classification][Emissions][C2F6][t][no source][no method][no target][no option][no type]
status: valid
status modified: 2017-02-13
accepted date: 2017-02-13
in scheme: emissions_variables_MMR

2.F.1.c [Industrial Refrigeration][no classification][Emissions][C3F8][t][From disposal][no method][no target][no option][no type]
type: Concept
definition: 2.F.1.c [Industrial Refrigeration][no classification][Emissions][C3F8][t][From disposal][no method][no target][no option][no type]
status: valid
status modified: 2017-02-13
accepted date: 2017-02-13
in scheme: emissions_variables_MMR

2.F.1.c [Industrial Refrigeration][no classification][Emissions][C3F8][t][From manufacturing][no method][no target][no option][no type]
type: Concept
definition: 2.F.1.c [Industrial Refrigeration][no classification][Emissions][C3F8][t][From manufacturing][no method][no target][no option][no type]
status: valid
status modified: 2017-02-13
accepted date: 2017-02-13
in scheme: emissions_variables_MMR

2.F.1.c [Industrial Refrigeration][no classification][Emissions][C3F8][t][From stocks][no method][no target][no option][no type]
type: Concept
definition: 2.F.1.c [Industrial Refrigeration][no classification][Emissions][C3F8][t][From stocks][no method][no target][no option][no type]
status: valid
status modified: 2017-02-13
accepted date: 2017-02-13
in scheme: emissions_variables_MMR

2.F.1.c [Industrial Refrigeration][no classification][Emissions][C3F8][t][no source][no method][no target][no option][no type]
type: Concept
definition: 2.F.1.c [Industrial Refrigeration][no classification][Emissions][C3F8][t][no source][no method][no target][no option][no type]
status: valid
status modified: 2017-02-13
accepted date: 2017-02-13
in scheme: emissions_variables_MMR

2.F.1.c [Industrial Refrigeration][no classification][Emissions][C4F10][t][From disposal][no method][no target][no option][no type]
type: Concept
definition: 2.F.1.c [Industrial Refrigeration][no classification][Emissions][C4F10][t][From disposal][no method][no target][no option][no type]
status: valid
status modified: 2017-02-13
accepted date: 2017-02-13
in scheme: emissions_variables_MMR

2.F.1.c [Industrial Refrigeration][no classification][Emissions][C4F10][t][From manufacturing][no method][no target][no option][no type]
type: Concept
definition: 2.F.1.c [Industrial Refrigeration][no classification][Emissions][C4F10][t][From manufacturing][no method][no target][no option][no type]
status: valid
status modified: 2017-02-13
accepted date: 2017-02-13
in scheme: emissions_variables_MMR

2.F.1.c [Industrial Refrigeration][no classification][Emissions][C4F10][t][From stocks][no method][no target][no option][no type]
type: Concept
definition: 2.F.1.c [Industrial Refrigeration][no classification][Emissions][C4F10][t][From stocks][no method][no target][no option][no type]
status: valid
status modified: 2017-02-13
accepted date: 2017-02-13
in scheme: emissions_variables_MMR

2.F.1.c [Industrial Refrigeration][no classification][Emissions][C4F10][t][no source][no method][no target][no option][no type]
type: Concept
definition: 2.F.1.c [Industrial Refrigeration][no classification][Emissions][C4F10][t][no source][no method][no target][no option][no type]
status: valid
status modified: 2017-02-13
accepted date: 2017-02-13
in scheme: emissions_variables_MMR

2.F.1.c [Industrial Refrigeration][no classification][Emissions][C5F12][t][From disposal][no method][no target][no option][no type]
type: Concept
definition: 2.F.1.c [Industrial Refrigeration][no classification][Emissions][C5F12][t][From disposal][no method][no target][no option][no type]
status: valid
status modified: 2017-02-13
accepted date: 2017-02-13
in scheme: emissions_variables_MMR

2.F.1.c [Industrial Refrigeration][no classification][Emissions][C5F12][t][From manufacturing][no method][no target][no option][no type]
type: Concept
definition: 2.F.1.c [Industrial Refrigeration][no classification][Emissions][C5F12][t][From manufacturing][no method][no target][no option][no type]
status: valid
status modified: 2017-02-13
accepted date: 2017-02-13
in scheme: emissions_variables_MMR

2.F.1.c [Industrial Refrigeration][no classification][Emissions][C5F12][t][From stocks][no method][no target][no option][no type]
type: Concept
definition: 2.F.1.c [Industrial Refrigeration][no classification][Emissions][C5F12][t][From stocks][no method][no target][no option][no type]
status: valid
status modified: 2017-02-13
accepted date: 2017-02-13
in scheme: emissions_variables_MMR

2.F.1.c [Industrial Refrigeration][no classification][Emissions][C5F12][t][no source][no method][no target][no option][no type]
type: Concept
definition: 2.F.1.c [Industrial Refrigeration][no classification][Emissions][C5F12][t][no source][no method][no target][no option][no type]
status: valid
status modified: 2017-02-13
accepted date: 2017-02-13
in scheme: emissions_variables_MMR

2.F.1.c [Industrial Refrigeration][no classification][Emissions][C6F14][t][From disposal][no method][no target][no option][no type]
type: Concept
definition: 2.F.1.c [Industrial Refrigeration][no classification][Emissions][C6F14][t][From disposal][no method][no target][no option][no type]
status: valid
status modified: 2017-02-13
accepted date: 2017-02-13
in scheme: emissions_variables_MMR

2.F.1.c [Industrial Refrigeration][no classification][Emissions][C6F14][t][From manufacturing][no method][no target][no option][no type]
type: Concept
definition: 2.F.1.c [Industrial Refrigeration][no classification][Emissions][C6F14][t][From manufacturing][no method][no target][no option][no type]
status: valid
status modified: 2017-02-13
accepted date: 2017-02-13
in scheme: emissions_variables_MMR

2.F.1.c [Industrial Refrigeration][no classification][Emissions][C6F14][t][From stocks][no method][no target][no option][no type]
type: Concept
definition: 2.F.1.c [Industrial Refrigeration][no classification][Emissions][C6F14][t][From stocks][no method][no target][no option][no type]
status: valid
status modified: 2017-02-13
accepted date: 2017-02-13
in scheme: emissions_variables_MMR

2.F.1.c [Industrial Refrigeration][no classification][Emissions][C6F14][t][no source][no method][no target][no option][no type]
type: Concept
definition: 2.F.1.c [Industrial Refrigeration][no classification][Emissions][C6F14][t][no source][no method][no target][no option][no type]
status: valid
status modified: 2017-02-13
accepted date: 2017-02-13
in scheme: emissions_variables_MMR

2.F.1.c [Industrial Refrigeration][no classification][Emissions][c-C3F6][t][From disposal][no method][no target][no option][no type]
type: Concept
definition: 2.F.1.c [Industrial Refrigeration][no classification][Emissions][c-C3F6][t][From disposal][no method][no target][no option][no type]
status: valid
status modified: 2017-02-13
accepted date: 2017-02-13
in scheme: emissions_variables_MMR

2.F.1.c [Industrial Refrigeration][no classification][Emissions][c-C3F6][t][From manufacturing][no method][no target][no option][no type]
type: Concept
definition: 2.F.1.c [Industrial Refrigeration][no classification][Emissions][c-C3F6][t][From manufacturing][no method][no target][no option][no type]
status: valid
status modified: 2017-02-13
accepted date: 2017-02-13
in scheme: emissions_variables_MMR

2.F.1.c [Industrial Refrigeration][no classification][Emissions][c-C3F6][t][From stocks][no method][no target][no option][no type]
type: Concept
definition: 2.F.1.c [Industrial Refrigeration][no classification][Emissions][c-C3F6][t][From stocks][no method][no target][no option][no type]
status: valid
status modified: 2017-02-13
accepted date: 2017-02-13
in scheme: emissions_variables_MMR

2.F.1.c [Industrial Refrigeration][no classification][Emissions][c-C3F6][t][no source][no method][no target][no option][no type]
type: Concept
definition: 2.F.1.c [Industrial Refrigeration][no classification][Emissions][c-C3F6][t][no source][no method][no target][no option][no type]
status: valid
status modified: 2017-02-13
accepted date: 2017-02-13
in scheme: emissions_variables_MMR

2.F.1.c [Industrial Refrigeration][no classification][Emissions][c-C4F8][t][From disposal][no method][no target][no option][no type]
type: Concept
definition: 2.F.1.c [Industrial Refrigeration][no classification][Emissions][c-C4F8][t][From disposal][no method][no target][no option][no type]
status: valid
status modified: 2017-02-13
accepted date: 2017-02-13
in scheme: emissions_variables_MMR

2.F.1.c [Industrial Refrigeration][no classification][Emissions][c-C4F8][t][From manufacturing][no method][no target][no option][no type]
type: Concept
definition: 2.F.1.c [Industrial Refrigeration][no classification][Emissions][c-C4F8][t][From manufacturing][no method][no target][no option][no type]
status: valid
status modified: 2017-02-13
accepted date: 2017-02-13
in scheme: emissions_variables_MMR

2.F.1.c [Industrial Refrigeration][no classification][Emissions][c-C4F8][t][From stocks][no method][no target][no option][no type]
type: Concept
definition: 2.F.1.c [Industrial Refrigeration][no classification][Emissions][c-C4F8][t][From stocks][no method][no target][no option][no type]
status: valid
status modified: 2017-02-13
accepted date: 2017-02-13
in scheme: emissions_variables_MMR

2.F.1.c [Industrial Refrigeration][no classification][Emissions][c-C4F8][t][no source][no method][no target][no option][no type]
type: Concept
definition: 2.F.1.c [Industrial Refrigeration][no classification][Emissions][c-C4F8][t][no source][no method][no target][no option][no type]
status: valid
status modified: 2017-02-13
accepted date: 2017-02-13
in scheme: emissions_variables_MMR

2.F.1.c [Industrial Refrigeration][no classification][Emissions][CF4][t][From disposal][no method][no target][no option][no type]
type: Concept
definition: 2.F.1.c [Industrial Refrigeration][no classification][Emissions][CF4][t][From disposal][no method][no target][no option][no type]
status: valid
status modified: 2017-02-13
accepted date: 2017-02-13
in scheme: emissions_variables_MMR

2.F.1.c [Industrial Refrigeration][no classification][Emissions][CF4][t][From manufacturing][no method][no target][no option][no type]
type: Concept
definition: 2.F.1.c [Industrial Refrigeration][no classification][Emissions][CF4][t][From manufacturing][no method][no target][no option][no type]
status: valid
status modified: 2017-02-13
accepted date: 2017-02-13
in scheme: emissions_variables_MMR

2.F.1.c [Industrial Refrigeration][no classification][Emissions][CF4][t][From stocks][no method][no target][no option][no type]
type: Concept
definition: 2.F.1.c [Industrial Refrigeration][no classification][Emissions][CF4][t][From stocks][no method][no target][no option][no type]
status: valid
status modified: 2017-02-13
accepted date: 2017-02-13
in scheme: emissions_variables_MMR

2.F.1.c [Industrial Refrigeration][no classification][Emissions][CF4][t][no source][no method][no target][no option][no type]
type: Concept
definition: 2.F.1.c [Industrial Refrigeration][no classification][Emissions][CF4][t][no source][no method][no target][no option][no type]
status: valid
status modified: 2017-02-13
accepted date: 2017-02-13
in scheme: emissions_variables_MMR

2.F.1.c [Industrial Refrigeration][no classification][Emissions][HFC-125][t][From disposal][no method][no target][no option][no type]
type: Concept
definition: 2.F.1.c [Industrial Refrigeration][no classification][Emissions][HFC-125][t][From disposal][no method][no target][no option][no type]
status: valid
status modified: 2017-02-13
accepted date: 2017-02-13
in scheme: emissions_variables_MMR

2.F.1.c [Industrial Refrigeration][no classification][Emissions][HFC-125][t][From manufacturing][no method][no target][no option][no type]
type: Concept
definition: 2.F.1.c [Industrial Refrigeration][no classification][Emissions][HFC-125][t][From manufacturing][no method][no target][no option][no type]
status: valid
status modified: 2017-02-13
accepted date: 2017-02-13
in scheme: emissions_variables_MMR

2.F.1.c [Industrial Refrigeration][no classification][Emissions][HFC-125][t][From stocks][no method][no target][no option][no type]
type: Concept
definition: 2.F.1.c [Industrial Refrigeration][no classification][Emissions][HFC-125][t][From stocks][no method][no target][no option][no type]
status: valid
status modified: 2017-02-13
accepted date: 2017-02-13
in scheme: emissions_variables_MMR

2.F.1.c [Industrial Refrigeration][no classification][Emissions][HFC-125][t][no source][no method][no target][no option][no type]
type: Concept
definition: 2.F.1.c [Industrial Refrigeration][no classification][Emissions][HFC-125][t][no source][no method][no target][no option][no type]
status: valid
status modified: 2017-02-13
accepted date: 2017-02-13
in scheme: emissions_variables_MMR

2.F.1.c [Industrial Refrigeration][no classification][Emissions][HFC-134][t][From disposal][no method][no target][no option][no type]
type: Concept
definition: 2.F.1.c [Industrial Refrigeration][no classification][Emissions][HFC-134][t][From disposal][no method][no target][no option][no type]
status: valid
status modified: 2017-02-13
accepted date: 2017-02-13
in scheme: emissions_variables_MMR

2.F.1.c [Industrial Refrigeration][no classification][Emissions][HFC-134][t][From manufacturing][no method][no target][no option][no type]
type: Concept
definition: 2.F.1.c [Industrial Refrigeration][no classification][Emissions][HFC-134][t][From manufacturing][no method][no target][no option][no type]
status: valid
status modified: 2017-02-13
accepted date: 2017-02-13
in scheme: emissions_variables_MMR

2.F.1.c [Industrial Refrigeration][no classification][Emissions][HFC-134][t][From stocks][no method][no target][no option][no type]
type: Concept
definition: 2.F.1.c [Industrial Refrigeration][no classification][Emissions][HFC-134][t][From stocks][no method][no target][no option][no type]
status: valid
status modified: 2017-02-13
accepted date: 2017-02-13
in scheme: emissions_variables_MMR

2.F.1.c [Industrial Refrigeration][no classification][Emissions][HFC-134][t][no source][no method][no target][no option][no type]
type: Concept
definition: 2.F.1.c [Industrial Refrigeration][no classification][Emissions][HFC-134][t][no source][no method][no target][no option][no type]
status: valid
status modified: 2017-02-13
accepted date: 2017-02-13
in scheme: emissions_variables_MMR

2.F.1.c [Industrial Refrigeration][no classification][Emissions][HFC-134a][t][From disposal][no method][no target][no option][no type]
type: Concept
definition: 2.F.1.c [Industrial Refrigeration][no classification][Emissions][HFC-134a][t][From disposal][no method][no target][no option][no type]
status: valid
status modified: 2017-02-13
accepted date: 2017-02-13
in scheme: emissions_variables_MMR

2.F.1.c [Industrial Refrigeration][no classification][Emissions][HFC-134a][t][From manufacturing][no method][no target][no option][no type]
type: Concept
definition: 2.F.1.c [Industrial Refrigeration][no classification][Emissions][HFC-134a][t][From manufacturing][no method][no target][no option][no type]
status: valid
status modified: 2017-02-13
accepted date: 2017-02-13
in scheme: emissions_variables_MMR

2.F.1.c [Industrial Refrigeration][no classification][Emissions][HFC-134a][t][From stocks][no method][no target][no option][no type]
type: Concept
definition: 2.F.1.c [Industrial Refrigeration][no classification][Emissions][HFC-134a][t][From stocks][no method][no target][no option][no type]
status: valid
status modified: 2017-02-13
accepted date: 2017-02-13
in scheme: emissions_variables_MMR

2.F.1.c [Industrial Refrigeration][no classification][Emissions][HFC-134a][t][no source][no method][no target][no option][no type]
type: Concept
definition: 2.F.1.c [Industrial Refrigeration][no classification][Emissions][HFC-134a][t][no source][no method][no target][no option][no type]
status: valid
status modified: 2017-02-13
accepted date: 2017-02-13
in scheme: emissions_variables_MMR

2.F.1.c [Industrial Refrigeration][no classification][Emissions][HFC-143][t][From disposal][no method][no target][no option][no type]
type: Concept
definition: 2.F.1.c [Industrial Refrigeration][no classification][Emissions][HFC-143][t][From disposal][no method][no target][no option][no type]
status: valid
status modified: 2017-02-13
accepted date: 2017-02-13
in scheme: emissions_variables_MMR

2.F.1.c [Industrial Refrigeration][no classification][Emissions][HFC-143][t][From manufacturing][no method][no target][no option][no type]
type: Concept
definition: 2.F.1.c [Industrial Refrigeration][no classification][Emissions][HFC-143][t][From manufacturing][no method][no target][no option][no type]
status: valid
status modified: 2017-02-13
accepted date: 2017-02-13
in scheme: emissions_variables_MMR

2.F.1.c [Industrial Refrigeration][no classification][Emissions][HFC-143][t][From stocks][no method][no target][no option][no type]
type: Concept
definition: 2.F.1.c [Industrial Refrigeration][no classification][Emissions][HFC-143][t][From stocks][no method][no target][no option][no type]
status: valid
status modified: 2017-02-13
accepted date: 2017-02-13
in scheme: emissions_variables_MMR

2.F.1.c [Industrial Refrigeration][no classification][Emissions][HFC-143][t][no source][no method][no target][no option][no type]
type: Concept
definition: 2.F.1.c [Industrial Refrigeration][no classification][Emissions][HFC-143][t][no source][no method][no target][no option][no type]
status: valid
status modified: 2017-02-13
accepted date: 2017-02-13
in scheme: emissions_variables_MMR

2.F.1.c [Industrial Refrigeration][no classification][Emissions][HFC-143a][t][From disposal][no method][no target][no option][no type]
type: Concept
definition: 2.F.1.c [Industrial Refrigeration][no classification][Emissions][HFC-143a][t][From disposal][no method][no target][no option][no type]
status: valid
status modified: 2017-02-13
accepted date: 2017-02-13
in scheme: emissions_variables_MMR

2.F.1.c [Industrial Refrigeration][no classification][Emissions][HFC-143a][t][From manufacturing][no method][no target][no option][no type]
type: Concept
definition: 2.F.1.c [Industrial Refrigeration][no classification][Emissions][HFC-143a][t][From manufacturing][no method][no target][no option][no type]
status: valid
status modified: 2017-02-13
accepted date: 2017-02-13
in scheme: emissions_variables_MMR

2.F.1.c [Industrial Refrigeration][no classification][Emissions][HFC-143a][t][From stocks][no method][no target][no option][no type]
type: Concept
definition: 2.F.1.c [Industrial Refrigeration][no classification][Emissions][HFC-143a][t][From stocks][no method][no target][no option][no type]
status: valid
status modified: 2017-02-13
accepted date: 2017-02-13
in scheme: emissions_variables_MMR

2.F.1.c [Industrial Refrigeration][no classification][Emissions][HFC-143a][t][no source][no method][no target][no option][no type]
type: Concept
definition: 2.F.1.c [Industrial Refrigeration][no classification][Emissions][HFC-143a][t][no source][no method][no target][no option][no type]
status: valid
status modified: 2017-02-13
accepted date: 2017-02-13
in scheme: emissions_variables_MMR

2.F.1.c [Industrial Refrigeration][no classification][Emissions][HFC-152][t][From disposal][no method][no target][no option][no type]
type: Concept
definition: 2.F.1.c [Industrial Refrigeration][no classification][Emissions][HFC-152][t][From disposal][no method][no target][no option][no type]
status: valid
status modified: 2017-02-13
accepted date: 2017-02-13
in scheme: emissions_variables_MMR

2.F.1.c [Industrial Refrigeration][no classification][Emissions][HFC-152][t][From manufacturing][no method][no target][no option][no type]
type: Concept
definition: 2.F.1.c [Industrial Refrigeration][no classification][Emissions][HFC-152][t][From manufacturing][no method][no target][no option][no type]
status: valid
status modified: 2017-02-13
accepted date: 2017-02-13
in scheme: emissions_variables_MMR

2.F.1.c [Industrial Refrigeration][no classification][Emissions][HFC-152][t][From stocks][no method][no target][no option][no type]
type: Concept
definition: 2.F.1.c [Industrial Refrigeration][no classification][Emissions][HFC-152][t][From stocks][no method][no target][no option][no type]
status: valid
status modified: 2017-02-13
accepted date: 2017-02-13
in scheme: emissions_variables_MMR

2.F.1.c [Industrial Refrigeration][no classification][Emissions][HFC-152][t][no source][no method][no target][no option][no type]
type: Concept
definition: 2.F.1.c [Industrial Refrigeration][no classification][Emissions][HFC-152][t][no source][no method][no target][no option][no type]
status: valid
status modified: 2017-02-13
accepted date: 2017-02-13
in scheme: emissions_variables_MMR

2.F.1.c [Industrial Refrigeration][no classification][Emissions][HFC-152a][t][From disposal][no method][no target][no option][no type]
type: Concept
definition: 2.F.1.c [Industrial Refrigeration][no classification][Emissions][HFC-152a][t][From disposal][no method][no target][no option][no type]
status: valid
status modified: 2017-02-13
accepted date: 2017-02-13
in scheme: emissions_variables_MMR

2.F.1.c [Industrial Refrigeration][no classification][Emissions][HFC-152a][t][From manufacturing][no method][no target][no option][no type]
type: Concept
definition: 2.F.1.c [Industrial Refrigeration][no classification][Emissions][HFC-152a][t][From manufacturing][no method][no target][no option][no type]
status: valid
status modified: 2017-02-13
accepted date: 2017-02-13
in scheme: emissions_variables_MMR

2.F.1.c [Industrial Refrigeration][no classification][Emissions][HFC-152a][t][From stocks][no method][no target][no option][no type]
type: Concept
definition: 2.F.1.c [Industrial Refrigeration][no classification][Emissions][HFC-152a][t][From stocks][no method][no target][no option][no type]
status: valid
status modified: 2017-02-13
accepted date: 2017-02-13
in scheme: emissions_variables_MMR

2.F.1.c [Industrial Refrigeration][no classification][Emissions][HFC-152a][t][no source][no method][no target][no option][no type]
type: Concept
definition: 2.F.1.c [Industrial Refrigeration][no classification][Emissions][HFC-152a][t][no source][no method][no target][no option][no type]
status: valid
status modified: 2017-02-13
accepted date: 2017-02-13
in scheme: emissions_variables_MMR

2.F.1.c [Industrial Refrigeration][no classification][Emissions][HFC-161][t][From disposal][no method][no target][no option][no type]
type: Concept
definition: 2.F.1.c [Industrial Refrigeration][no classification][Emissions][HFC-161][t][From disposal][no method][no target][no option][no type]
status: valid
status modified: 2017-02-13
accepted date: 2017-02-13
in scheme: emissions_variables_MMR

2.F.1.c [Industrial Refrigeration][no classification][Emissions][HFC-161][t][From manufacturing][no method][no target][no option][no type]
type: Concept
definition: 2.F.1.c [Industrial Refrigeration][no classification][Emissions][HFC-161][t][From manufacturing][no method][no target][no option][no type]
status: valid
status modified: 2017-02-13
accepted date: 2017-02-13
in scheme: emissions_variables_MMR

2.F.1.c [Industrial Refrigeration][no classification][Emissions][HFC-161][t][From stocks][no method][no target][no option][no type]
type: Concept
definition: 2.F.1.c [Industrial Refrigeration][no classification][Emissions][HFC-161][t][From stocks][no method][no target][no option][no type]
status: valid
status modified: 2017-02-13
accepted date: 2017-02-13
in scheme: emissions_variables_MMR

2.F.1.c [Industrial Refrigeration][no classification][Emissions][HFC-161][t][no source][no method][no target][no option][no type]
type: Concept
definition: 2.F.1.c [Industrial Refrigeration][no classification][Emissions][HFC-161][t][no source][no method][no target][no option][no type]
status: valid
status modified: 2017-02-13
accepted date: 2017-02-13
in scheme: emissions_variables_MMR

2.F.1.c [Industrial Refrigeration][no classification][Emissions][HFC-227ea][t][From disposal][no method][no target][no option][no type]
type: Concept
definition: 2.F.1.c [Industrial Refrigeration][no classification][Emissions][HFC-227ea][t][From disposal][no method][no target][no option][no type]
status: valid
status modified: 2017-02-13
accepted date: 2017-02-13
in scheme: emissions_variables_MMR

2.F.1.c [Industrial Refrigeration][no classification][Emissions][HFC-227ea][t][From manufacturing][no method][no target][no option][no type]
type: Concept
definition: 2.F.1.c [Industrial Refrigeration][no classification][Emissions][HFC-227ea][t][From manufacturing][no method][no target][no option][no type]
status: valid
status modified: 2017-02-13
accepted date: 2017-02-13
in scheme: emissions_variables_MMR

2.F.1.c [Industrial Refrigeration][no classification][Emissions][HFC-227ea][t][From stocks][no method][no target][no option][no type]
type: Concept
definition: 2.F.1.c [Industrial Refrigeration][no classification][Emissions][HFC-227ea][t][From stocks][no method][no target][no option][no type]
status: valid
status modified: 2017-02-13
accepted date: 2017-02-13
in scheme: emissions_variables_MMR

2.F.1.c [Industrial Refrigeration][no classification][Emissions][HFC-227ea][t][no source][no method][no target][no option][no type]
type: Concept
definition: 2.F.1.c [Industrial Refrigeration][no classification][Emissions][HFC-227ea][t][no source][no method][no target][no option][no type]
status: valid
status modified: 2017-02-13
accepted date: 2017-02-13
in scheme: emissions_variables_MMR

2.F.1.c [Industrial Refrigeration][no classification][Emissions][HFC-23][t][From disposal][no method][no target][no option][no type]
type: Concept
definition: 2.F.1.c [Industrial Refrigeration][no classification][Emissions][HFC-23][t][From disposal][no method][no target][no option][no type]
status: valid
status modified: 2017-02-13
accepted date: 2017-02-13
in scheme: emissions_variables_MMR

2.F.1.c [Industrial Refrigeration][no classification][Emissions][HFC-23][t][From manufacturing][no method][no target][no option][no type]
type: Concept
definition: 2.F.1.c [Industrial Refrigeration][no classification][Emissions][HFC-23][t][From manufacturing][no method][no target][no option][no type]
status: valid
status modified: 2017-02-13
accepted date: 2017-02-13
in scheme: emissions_variables_MMR

2.F.1.c [Industrial Refrigeration][no classification][Emissions][HFC-23][t][From stocks][no method][no target][no option][no type]
type: Concept
definition: 2.F.1.c [Industrial Refrigeration][no classification][Emissions][HFC-23][t][From stocks][no method][no target][no option][no type]
status: valid
status modified: 2017-02-13
accepted date: 2017-02-13
in scheme: emissions_variables_MMR

2.F.1.c [Industrial Refrigeration][no classification][Emissions][HFC-23][t][no source][no method][no target][no option][no type]
type: Concept
definition: 2.F.1.c [Industrial Refrigeration][no classification][Emissions][HFC-23][t][no source][no method][no target][no option][no type]
status: valid
status modified: 2017-02-13
accepted date: 2017-02-13
in scheme: emissions_variables_MMR

2.F.1.c [Industrial Refrigeration][no classification][Emissions][HFC-236cb][t][From disposal][no method][no target][no option][no type]
type: Concept
definition: 2.F.1.c [Industrial Refrigeration][no classification][Emissions][HFC-236cb][t][From disposal][no method][no target][no option][no type]
status: valid
status modified: 2017-02-13
accepted date: 2017-02-13
in scheme: emissions_variables_MMR

2.F.1.c [Industrial Refrigeration][no classification][Emissions][HFC-236cb][t][From manufacturing][no method][no target][no option][no type]
type: Concept
definition: 2.F.1.c [Industrial Refrigeration][no classification][Emissions][HFC-236cb][t][From manufacturing][no method][no target][no option][no type]
status: valid
status modified: 2017-02-13
accepted date: 2017-02-13
in scheme: emissions_variables_MMR

2.F.1.c [Industrial Refrigeration][no classification][Emissions][HFC-236cb][t][From stocks][no method][no target][no option][no type]
type: Concept
definition: 2.F.1.c [Industrial Refrigeration][no classification][Emissions][HFC-236cb][t][From stocks][no method][no target][no option][no type]
status: valid
status modified: 2017-02-13
accepted date: 2017-02-13
in scheme: emissions_variables_MMR

2.F.1.c [Industrial Refrigeration][no classification][Emissions][HFC-236cb][t][no source][no method][no target][no option][no type]
type: Concept
definition: 2.F.1.c [Industrial Refrigeration][no classification][Emissions][HFC-236cb][t][no source][no method][no target][no option][no type]
status: valid
status modified: 2017-02-13
accepted date: 2017-02-13
in scheme: emissions_variables_MMR

2.F.1.c [Industrial Refrigeration][no classification][Emissions][HFC-236ea][t][From disposal][no method][no target][no option][no type]
type: Concept
definition: 2.F.1.c [Industrial Refrigeration][no classification][Emissions][HFC-236ea][t][From disposal][no method][no target][no option][no type]
status: valid
status modified: 2017-02-13
accepted date: 2017-02-13
in scheme: emissions_variables_MMR

2.F.1.c [Industrial Refrigeration][no classification][Emissions][HFC-236ea][t][From manufacturing][no method][no target][no option][no type]
type: Concept
definition: 2.F.1.c [Industrial Refrigeration][no classification][Emissions][HFC-236ea][t][From manufacturing][no method][no target][no option][no type]
status: valid
status modified: 2017-02-13
accepted date: 2017-02-13
in scheme: emissions_variables_MMR

2.F.1.c [Industrial Refrigeration][no classification][Emissions][HFC-236ea][t][From stocks][no method][no target][no option][no type]
type: Concept
definition: 2.F.1.c [Industrial Refrigeration][no classification][Emissions][HFC-236ea][t][From stocks][no method][no target][no option][no type]
status: valid
status modified: 2017-02-13
accepted date: 2017-02-13
in scheme: emissions_variables_MMR

2.F.1.c [Industrial Refrigeration][no classification][Emissions][HFC-236ea][t][no source][no method][no target][no option][no type]
type: Concept
definition: 2.F.1.c [Industrial Refrigeration][no classification][Emissions][HFC-236ea][t][no source][no method][no target][no option][no type]
status: valid
status modified: 2017-02-13
accepted date: 2017-02-13
in scheme: emissions_variables_MMR

2.F.1.c [Industrial Refrigeration][no classification][Emissions][HFC-236fa][t][From disposal][no method][no target][no option][no type]
type: Concept
definition: 2.F.1.c [Industrial Refrigeration][no classification][Emissions][HFC-236fa][t][From disposal][no method][no target][no option][no type]
status: valid
status modified: 2017-02-13
accepted date: 2017-02-13
in scheme: emissions_variables_MMR

2.F.1.c [Industrial Refrigeration][no classification][Emissions][HFC-236fa][t][From manufacturing][no method][no target][no option][no type]
type: Concept
definition: 2.F.1.c [Industrial Refrigeration][no classification][Emissions][HFC-236fa][t][From manufacturing][no method][no target][no option][no type]
status: valid
status modified: 2017-02-13
accepted date: 2017-02-13
in scheme: emissions_variables_MMR

2.F.1.c [Industrial Refrigeration][no classification][Emissions][HFC-236fa][t][From stocks][no method][no target][no option][no type]
type: Concept
definition: 2.F.1.c [Industrial Refrigeration][no classification][Emissions][HFC-236fa][t][From stocks][no method][no target][no option][no type]
status: valid
status modified: 2017-02-13
accepted date: 2017-02-13
in scheme: emissions_variables_MMR

2.F.1.c [Industrial Refrigeration][no classification][Emissions][HFC-236fa][t][no source][no method][no target][no option][no type]
type: Concept
definition: 2.F.1.c [Industrial Refrigeration][no classification][Emissions][HFC-236fa][t][no source][no method][no target][no option][no type]
status: valid
status modified: 2017-02-13
accepted date: 2017-02-13
in scheme: emissions_variables_MMR

2.F.1.c [Industrial Refrigeration][no classification][Emissions][HFC-245ca][t][From disposal][no method][no target][no option][no type]
type: Concept
definition: 2.F.1.c [Industrial Refrigeration][no classification][Emissions][HFC-245ca][t][From disposal][no method][no target][no option][no type]
status: valid
status modified: 2017-02-13
accepted date: 2017-02-13
in scheme: emissions_variables_MMR

2.F.1.c [Industrial Refrigeration][no classification][Emissions][HFC-245ca][t][From manufacturing][no method][no target][no option][no type]
type: Concept
definition: 2.F.1.c [Industrial Refrigeration][no classification][Emissions][HFC-245ca][t][From manufacturing][no method][no target][no option][no type]
status: valid
status modified: 2017-02-13
accepted date: 2017-02-13
in scheme: emissions_variables_MMR

2.F.1.c [Industrial Refrigeration][no classification][Emissions][HFC-245ca][t][From stocks][no method][no target][no option][no type]
type: Concept
definition: 2.F.1.c [Industrial Refrigeration][no classification][Emissions][HFC-245ca][t][From stocks][no method][no target][no option][no type]
status: valid
status modified: 2017-02-13
accepted date: 2017-02-13
in scheme: emissions_variables_MMR

2.F.1.c [Industrial Refrigeration][no classification][Emissions][HFC-245ca][t][no source][no method][no target][no option][no type]
type: Concept
definition: 2.F.1.c [Industrial Refrigeration][no classification][Emissions][HFC-245ca][t][no source][no method][no target][no option][no type]
status: valid
status modified: 2017-02-13
accepted date: 2017-02-13
in scheme: emissions_variables_MMR

2.F.1.c [Industrial Refrigeration][no classification][Emissions][HFC-245fa][t][From disposal][no method][no target][no option][no type]
type: Concept
definition: 2.F.1.c [Industrial Refrigeration][no classification][Emissions][HFC-245fa][t][From disposal][no method][no target][no option][no type]
status: valid
status modified: 2017-02-13
accepted date: 2017-02-13
in scheme: emissions_variables_MMR

2.F.1.c [Industrial Refrigeration][no classification][Emissions][HFC-245fa][t][From manufacturing][no method][no target][no option][no type]
type: Concept
definition: 2.F.1.c [Industrial Refrigeration][no classification][Emissions][HFC-245fa][t][From manufacturing][no method][no target][no option][no type]
status: valid
status modified: 2017-02-13
accepted date: 2017-02-13
in scheme: emissions_variables_MMR

2.F.1.c [Industrial Refrigeration][no classification][Emissions][HFC-245fa][t][From stocks][no method][no target][no option][no type]
type: Concept
definition: 2.F.1.c [Industrial Refrigeration][no classification][Emissions][HFC-245fa][t][From stocks][no method][no target][no option][no type]
status: valid
status modified: 2017-02-13
accepted date: 2017-02-13
in scheme: emissions_variables_MMR

2.F.1.c [Industrial Refrigeration][no classification][Emissions][HFC-245fa][t][no source][no method][no target][no option][no type]
type: Concept
definition: 2.F.1.c [Industrial Refrigeration][no classification][Emissions][HFC-245fa][t][no source][no method][no target][no option][no type]
status: valid
status modified: 2017-02-13
accepted date: 2017-02-13
in scheme: emissions_variables_MMR

2.F.1.c [Industrial Refrigeration][no classification][Emissions][HFC-32][t][From disposal][no method][no target][no option][no type]
type: Concept
definition: 2.F.1.c [Industrial Refrigeration][no classification][Emissions][HFC-32][t][From disposal][no method][no target][no option][no type]
status: valid
status modified: 2017-02-13
accepted date: 2017-02-13
in scheme: emissions_variables_MMR

2.F.1.c [Industrial Refrigeration][no classification][Emissions][HFC-32][t][From manufacturing][no method][no target][no option][no type]
type: Concept
definition: 2.F.1.c [Industrial Refrigeration][no classification][Emissions][HFC-32][t][From manufacturing][no method][no target][no option][no type]
status: valid
status modified: 2017-02-13
accepted date: 2017-02-13
in scheme: emissions_variables_MMR

2.F.1.c [Industrial Refrigeration][no classification][Emissions][HFC-32][t][From stocks][no method][no target][no option][no type]
type: Concept
definition: 2.F.1.c [Industrial Refrigeration][no classification][Emissions][HFC-32][t][From stocks][no method][no target][no option][no type]
status: valid
status modified: 2017-02-13
accepted date: 2017-02-13
in scheme: emissions_variables_MMR

2.F.1.c [Industrial Refrigeration][no classification][Emissions][HFC-32][t][no source][no method][no target][no option][no type]
type: Concept
definition: 2.F.1.c [Industrial Refrigeration][no classification][Emissions][HFC-32][t][no source][no method][no target][no option][no type]
status: valid
status modified: 2017-02-13
accepted date: 2017-02-13
in scheme: emissions_variables_MMR

2.F.1.c [Industrial Refrigeration][no classification][Emissions][HFC-365mfc][t][From disposal][no method][no target][no option][no type]
type: Concept
definition: 2.F.1.c [Industrial Refrigeration][no classification][Emissions][HFC-365mfc][t][From disposal][no method][no target][no option][no type]
status: valid
status modified: 2017-02-13
accepted date: 2017-02-13
in scheme: emissions_variables_MMR

2.F.1.c [Industrial Refrigeration][no classification][Emissions][HFC-365mfc][t][From manufacturing][no method][no target][no option][no type]
type: Concept
definition: 2.F.1.c [Industrial Refrigeration][no classification][Emissions][HFC-365mfc][t][From manufacturing][no method][no target][no option][no type]
status: valid
status modified: 2017-02-13
accepted date: 2017-02-13
in scheme: emissions_variables_MMR

2.F.1.c [Industrial Refrigeration][no classification][Emissions][HFC-365mfc][t][From stocks][no method][no target][no option][no type]
type: Concept
definition: 2.F.1.c [Industrial Refrigeration][no classification][Emissions][HFC-365mfc][t][From stocks][no method][no target][no option][no type]
status: valid
status modified: 2017-02-13
accepted date: 2017-02-13
in scheme: emissions_variables_MMR

2.F.1.c [Industrial Refrigeration][no classification][Emissions][HFC-365mfc][t][no source][no method][no target][no option][no type]
type: Concept
definition: 2.F.1.c [Industrial Refrigeration][no classification][Emissions][HFC-365mfc][t][no source][no method][no target][no option][no type]
status: valid
status modified: 2017-02-13
accepted date: 2017-02-13
in scheme: emissions_variables_MMR

2.F.1.c [Industrial Refrigeration][no classification][Emissions][HFC-41][t][From disposal][no method][no target][no option][no type]
type: Concept
definition: 2.F.1.c [Industrial Refrigeration][no classification][Emissions][HFC-41][t][From disposal][no method][no target][no option][no type]
status: valid
status modified: 2017-02-13
accepted date: 2017-02-13
in scheme: emissions_variables_MMR

2.F.1.c [Industrial Refrigeration][no classification][Emissions][HFC-41][t][From manufacturing][no method][no target][no option][no type]
type: Concept
definition: 2.F.1.c [Industrial Refrigeration][no classification][Emissions][HFC-41][t][From manufacturing][no method][no target][no option][no type]
status: valid
status modified: 2017-02-13
accepted date: 2017-02-13
in scheme: emissions_variables_MMR

2.F.1.c [Industrial Refrigeration][no classification][Emissions][HFC-41][t][From stocks][no method][no target][no option][no type]
type: Concept
definition: 2.F.1.c [Industrial Refrigeration][no classification][Emissions][HFC-41][t][From stocks][no method][no target][no option][no type]
status: valid
status modified: 2017-02-13
accepted date: 2017-02-13
in scheme: emissions_variables_MMR

2.F.1.c [Industrial Refrigeration][no classification][Emissions][HFC-41][t][no source][no method][no target][no option][no type]
type: Concept
definition: 2.F.1.c [Industrial Refrigeration][no classification][Emissions][HFC-41][t][no source][no method][no target][no option][no type]
status: valid
status modified: 2017-02-13
accepted date: 2017-02-13
in scheme: emissions_variables_MMR

2.F.1.c [Industrial Refrigeration][no classification][Emissions][HFC-43-10mee][t][From disposal][no method][no target][no option][no type]
type: Concept
definition: 2.F.1.c [Industrial Refrigeration][no classification][Emissions][HFC-43-10mee][t][From disposal][no method][no target][no option][no type]
status: valid
status modified: 2017-02-13
accepted date: 2017-02-13
in scheme: emissions_variables_MMR

2.F.1.c [Industrial Refrigeration][no classification][Emissions][HFC-43-10mee][t][From manufacturing][no method][no target][no option][no type]
type: Concept
definition: 2.F.1.c [Industrial Refrigeration][no classification][Emissions][HFC-43-10mee][t][From manufacturing][no method][no target][no option][no type]
status: valid
status modified: 2017-02-13
accepted date: 2017-02-13
in scheme: emissions_variables_MMR

2.F.1.c [Industrial Refrigeration][no classification][Emissions][HFC-43-10mee][t][From stocks][no method][no target][no option][no type]
type: Concept
definition: 2.F.1.c [Industrial Refrigeration][no classification][Emissions][HFC-43-10mee][t][From stocks][no method][no target][no option][no type]
status: valid
status modified: 2017-02-13
accepted date: 2017-02-13
in scheme: emissions_variables_MMR

2.F.1.c [Industrial Refrigeration][no classification][Emissions][HFC-43-10mee][t][no source][no method][no target][no option][no type]
type: Concept
definition: 2.F.1.c [Industrial Refrigeration][no classification][Emissions][HFC-43-10mee][t][no source][no method][no target][no option][no type]
status: valid
status modified: 2017-02-13
accepted date: 2017-02-13
in scheme: emissions_variables_MMR

2.F.1.c [Industrial Refrigeration][no classification][Emissions][HFCs and PFCs][t CO2 equivalent][no source][no method][no target][no option][no type]
type: Concept
definition: 2.F.1.c [Industrial Refrigeration][no classification][Emissions][HFCs and PFCs][t CO2 equivalent][no source][no method][no target][no option][no type]
status: valid
status modified: 2017-02-13
accepted date: 2017-02-13
in scheme: emissions_variables_MMR

2.F.1.c [Industrial Refrigeration][no classification][Emissions][HFCs][t CO2 equivalent][no source][no method][no target][no option][no type]
type: Concept
definition: 2.F.1.c [Industrial Refrigeration][no classification][Emissions][HFCs][t CO2 equivalent][no source][no method][no target][no option][no type]
status: valid
status modified: 2017-02-13
accepted date: 2017-02-13
in scheme: emissions_variables_MMR

2.F.1.c [Industrial Refrigeration][no classification][Emissions][NF3][t][From disposal][no method][no target][no option][no type]
type: Concept
definition: 2.F.1.c [Industrial Refrigeration][no classification][Emissions][NF3][t][From disposal][no method][no target][no option][no type]
status: valid
status modified: 2017-02-13
accepted date: 2017-02-13
in scheme: emissions_variables_MMR

2.F.1.c [Industrial Refrigeration][no classification][Emissions][NF3][t][From manufacturing][no method][no target][no option][no type]
type: Concept
definition: 2.F.1.c [Industrial Refrigeration][no classification][Emissions][NF3][t][From manufacturing][no method][no target][no option][no type]
status: valid
status modified: 2017-02-13
accepted date: 2017-02-13
in scheme: emissions_variables_MMR

2.F.1.c [Industrial Refrigeration][no classification][Emissions][NF3][t][From stocks][no method][no target][no option][no type]
type: Concept
definition: 2.F.1.c [Industrial Refrigeration][no classification][Emissions][NF3][t][From stocks][no method][no target][no option][no type]
status: valid
status modified: 2017-02-13
accepted date: 2017-02-13
in scheme: emissions_variables_MMR

2.F.1.c [Industrial Refrigeration][no classification][Emissions][NF3][t][no source][no method][no target][no option][no type]
type: Concept
definition: 2.F.1.c [Industrial Refrigeration][no classification][Emissions][NF3][t][no source][no method][no target][no option][no type]
status: valid
status modified: 2017-02-13
accepted date: 2017-02-13
in scheme: emissions_variables_MMR

2.F.1.c [Industrial Refrigeration][no classification][Emissions][PFCs][t CO2 equivalent][no source][no method][no target][no option][no type]
type: Concept
definition: 2.F.1.c [Industrial Refrigeration][no classification][Emissions][PFCs][t CO2 equivalent][no source][no method][no target][no option][no type]
status: valid
status modified: 2017-02-13
accepted date: 2017-02-13
in scheme: emissions_variables_MMR

2.F.1.c [Industrial Refrigeration][no classification][Emissions][SF6][t][From disposal][no method][no target][no option][no type]
type: Concept
definition: 2.F.1.c [Industrial Refrigeration][no classification][Emissions][SF6][t][From disposal][no method][no target][no option][no type]
status: valid
status modified: 2017-02-13
accepted date: 2017-02-13
in scheme: emissions_variables_MMR

2.F.1.c [Industrial Refrigeration][no classification][Emissions][SF6][t][From manufacturing][no method][no target][no option][no type]
type: Concept
definition: 2.F.1.c [Industrial Refrigeration][no classification][Emissions][SF6][t][From manufacturing][no method][no target][no option][no type]
status: valid
status modified: 2017-02-13
accepted date: 2017-02-13
in scheme: emissions_variables_MMR

2.F.1.c [Industrial Refrigeration][no classification][Emissions][SF6][t][From stocks][no method][no target][no option][no type]
type: Concept
definition: 2.F.1.c [Industrial Refrigeration][no classification][Emissions][SF6][t][From stocks][no method][no target][no option][no type]
status: valid
status modified: 2017-02-13
accepted date: 2017-02-13
in scheme: emissions_variables_MMR

2.F.1.c [Industrial Refrigeration][no classification][Emissions][SF6][t][no source][no method][no target][no option][no type]
type: Concept
definition: 2.F.1.c [Industrial Refrigeration][no classification][Emissions][SF6][t][no source][no method][no target][no option][no type]
status: valid
status modified: 2017-02-13
accepted date: 2017-02-13
in scheme: emissions_variables_MMR

2.F.1.c [Industrial Refrigeration][no classification][Emissions][Unspecified mix of HFCs and PFCs][t CO2 equivalent][From disposal][no method][no target][no option][no type]
type: Concept
definition: 2.F.1.c [Industrial Refrigeration][no classification][Emissions][Unspecified mix of HFCs and PFCs][t CO2 equivalent][From disposal][no method][no target][no option][no type]
status: valid
status modified: 2017-02-13
accepted date: 2017-02-13
in scheme: emissions_variables_MMR

2.F.1.c [Industrial Refrigeration][no classification][Emissions][Unspecified mix of HFCs and PFCs][t CO2 equivalent][From manufacturing][no method][no target][no option][no type]
type: Concept
definition: 2.F.1.c [Industrial Refrigeration][no classification][Emissions][Unspecified mix of HFCs and PFCs][t CO2 equivalent][From manufacturing][no method][no target][no option][no type]
status: valid
status modified: 2017-02-13
accepted date: 2017-02-13
in scheme: emissions_variables_MMR

2.F.1.c [Industrial Refrigeration][no classification][Emissions][Unspecified mix of HFCs and PFCs][t CO2 equivalent][From stocks][no method][no target][no option][no type]
type: Concept
definition: 2.F.1.c [Industrial Refrigeration][no classification][Emissions][Unspecified mix of HFCs and PFCs][t CO2 equivalent][From stocks][no method][no target][no option][no type]
status: valid
status modified: 2017-02-13
accepted date: 2017-02-13
in scheme: emissions_variables_MMR

2.F.1.c [Industrial Refrigeration][no classification][Emissions][Unspecified mix of HFCs and PFCs][t CO2 equivalent][no source][no method][no target][no option][no type]
type: Concept
definition: 2.F.1.c [Industrial Refrigeration][no classification][Emissions][Unspecified mix of HFCs and PFCs][t CO2 equivalent][no source][no method][no target][no option][no type]
status: valid
status modified: 2017-02-13
accepted date: 2017-02-13
in scheme: emissions_variables_MMR

2.F.1.c [Industrial Refrigeration][no classification][Emissions][Unspecified mix of HFCs][t CO2 equivalent][From disposal][no method][no target][no option][no type]
type: Concept
definition: 2.F.1.c [Industrial Refrigeration][no classification][Emissions][Unspecified mix of HFCs][t CO2 equivalent][From disposal][no method][no target][no option][no type]
status: valid
status modified: 2017-02-13
accepted date: 2017-02-13
in scheme: emissions_variables_MMR

2.F.1.c [Industrial Refrigeration][no classification][Emissions][Unspecified mix of HFCs][t CO2 equivalent][From manufacturing][no method][no target][no option][no type]
type: Concept
definition: 2.F.1.c [Industrial Refrigeration][no classification][Emissions][Unspecified mix of HFCs][t CO2 equivalent][From manufacturing][no method][no target][no option][no type]
status: valid
status modified: 2017-02-13
accepted date: 2017-02-13
in scheme: emissions_variables_MMR

2.F.1.c [Industrial Refrigeration][no classification][Emissions][Unspecified mix of HFCs][t CO2 equivalent][From stocks][no method][no target][no option][no type]
type: Concept
definition: 2.F.1.c [Industrial Refrigeration][no classification][Emissions][Unspecified mix of HFCs][t CO2 equivalent][From stocks][no method][no target][no option][no type]
status: valid
status modified: 2017-02-13
accepted date: 2017-02-13
in scheme: emissions_variables_MMR

2.F.1.c [Industrial Refrigeration][no classification][Emissions][Unspecified mix of HFCs][t CO2 equivalent][no source][no method][no target][no option][no type]
type: Concept
definition: 2.F.1.c [Industrial Refrigeration][no classification][Emissions][Unspecified mix of HFCs][t CO2 equivalent][no source][no method][no target][no option][no type]
status: valid
status modified: 2017-02-13
accepted date: 2017-02-13
in scheme: emissions_variables_MMR

2.F.1.c [Industrial Refrigeration][no classification][Emissions][Unspecified mix of PFCs][t CO2 equivalent][From disposal][no method][no target][no option][no type]
type: Concept
definition: 2.F.1.c [Industrial Refrigeration][no classification][Emissions][Unspecified mix of PFCs][t CO2 equivalent][From disposal][no method][no target][no option][no type]
status: valid
status modified: 2017-02-13
accepted date: 2017-02-13
in scheme: emissions_variables_MMR

2.F.1.c [Industrial Refrigeration][no classification][Emissions][Unspecified mix of PFCs][t CO2 equivalent][From manufacturing][no method][no target][no option][no type]
type: Concept
definition: 2.F.1.c [Industrial Refrigeration][no classification][Emissions][Unspecified mix of PFCs][t CO2 equivalent][From manufacturing][no method][no target][no option][no type]
status: valid
status modified: 2017-02-13
accepted date: 2017-02-13
in scheme: emissions_variables_MMR

2.F.1.c [Industrial Refrigeration][no classification][Emissions][Unspecified mix of PFCs][t CO2 equivalent][From stocks][no method][no target][no option][no type]
type: Concept
definition: 2.F.1.c [Industrial Refrigeration][no classification][Emissions][Unspecified mix of PFCs][t CO2 equivalent][From stocks][no method][no target][no option][no type]
status: valid
status modified: 2017-02-13
accepted date: 2017-02-13
in scheme: emissions_variables_MMR

2.F.1.c [Industrial Refrigeration][no classification][Emissions][Unspecified mix of PFCs][t CO2 equivalent][no source][no method][no target][no option][no type]
type: Concept
definition: 2.F.1.c [Industrial Refrigeration][no classification][Emissions][Unspecified mix of PFCs][t CO2 equivalent][no source][no method][no target][no option][no type]
status: valid
status modified: 2017-02-13
accepted date: 2017-02-13
in scheme: emissions_variables_MMR

2.F.1.d [Transport Refrigeration][no classification][Emissions][Aggregate F-gases][t CO2 equivalent][no source][no method][no target][no option][no type]
type: Concept
definition: 2.F.1.d [Transport Refrigeration][no classification][Emissions][Aggregate F-gases][t CO2 equivalent][no source][no method][no target][no option][no type]
status: valid
status modified: 2017-02-13
accepted date: 2017-02-13
in scheme: emissions_variables_MMR

2.F.1.d [Transport Refrigeration][no classification][Emissions][C10F18][t][From disposal][no method][no target][no option][no type]
type: Concept
definition: 2.F.1.d [Transport Refrigeration][no classification][Emissions][C10F18][t][From disposal][no method][no target][no option][no type]
status: valid
status modified: 2017-02-13
accepted date: 2017-02-13
in scheme: emissions_variables_MMR

2.F.1.d [Transport Refrigeration][no classification][Emissions][C10F18][t][From manufacturing][no method][no target][no option][no type]
type: Concept
definition: 2.F.1.d [Transport Refrigeration][no classification][Emissions][C10F18][t][From manufacturing][no method][no target][no option][no type]
status: valid
status modified: 2017-02-13
accepted date: 2017-02-13
in scheme: emissions_variables_MMR

2.F.1.d [Transport Refrigeration][no classification][Emissions][C10F18][t][From stocks][no method][no target][no option][no type]
type: Concept
definition: 2.F.1.d [Transport Refrigeration][no classification][Emissions][C10F18][t][From stocks][no method][no target][no option][no type]
status: valid
status modified: 2017-02-13
accepted date: 2017-02-13
in scheme: emissions_variables_MMR

2.F.1.d [Transport Refrigeration][no classification][Emissions][C10F18][t][no source][no method][no target][no option][no type]
type: Concept
definition: 2.F.1.d [Transport Refrigeration][no classification][Emissions][C10F18][t][no source][no method][no target][no option][no type]
status: valid
status modified: 2017-02-13
accepted date: 2017-02-13
in scheme: emissions_variables_MMR

2.F.1.d [Transport Refrigeration][no classification][Emissions][C2F6][t][From disposal][no method][no target][no option][no type]
type: Concept
definition: 2.F.1.d [Transport Refrigeration][no classification][Emissions][C2F6][t][From disposal][no method][no target][no option][no type]
status: valid
status modified: 2017-02-13
accepted date: 2017-02-13
in scheme: emissions_variables_MMR

2.F.1.d [Transport Refrigeration][no classification][Emissions][C2F6][t][From manufacturing][no method][no target][no option][no type]
type: Concept
definition: 2.F.1.d [Transport Refrigeration][no classification][Emissions][C2F6][t][From manufacturing][no method][no target][no option][no type]
status: valid
status modified: 2017-02-13
accepted date: 2017-02-13
in scheme: emissions_variables_MMR

2.F.1.d [Transport Refrigeration][no classification][Emissions][C2F6][t][From stocks][no method][no target][no option][no type]
type: Concept
definition: 2.F.1.d [Transport Refrigeration][no classification][Emissions][C2F6][t][From stocks][no method][no target][no option][no type]
status: valid
status modified: 2017-02-13
accepted date: 2017-02-13
in scheme: emissions_variables_MMR

2.F.1.d [Transport Refrigeration][no classification][Emissions][C2F6][t][no source][no method][no target][no option][no type]
type: Concept
definition: 2.F.1.d [Transport Refrigeration][no classification][Emissions][C2F6][t][no source][no method][no target][no option][no type]
status: valid
status modified: 2017-02-13
accepted date: 2017-02-13
in scheme: emissions_variables_MMR

2.F.1.d [Transport Refrigeration][no classification][Emissions][C3F8][t][From disposal][no method][no target][no option][no type]
type: Concept
definition: 2.F.1.d [Transport Refrigeration][no classification][Emissions][C3F8][t][From disposal][no method][no target][no option][no type]
status: valid
status modified: 2017-02-13
accepted date: 2017-02-13
in scheme: emissions_variables_MMR

2.F.1.d [Transport Refrigeration][no classification][Emissions][C3F8][t][From manufacturing][no method][no target][no option][no type]
type: Concept
definition: 2.F.1.d [Transport Refrigeration][no classification][Emissions][C3F8][t][From manufacturing][no method][no target][no option][no type]
status: valid
status modified: 2017-02-13
accepted date: 2017-02-13
in scheme: emissions_variables_MMR

2.F.1.d [Transport Refrigeration][no classification][Emissions][C3F8][t][From stocks][no method][no target][no option][no type]
type: Concept
definition: 2.F.1.d [Transport Refrigeration][no classification][Emissions][C3F8][t][From stocks][no method][no target][no option][no type]
status: valid
status modified: 2017-02-13
accepted date: 2017-02-13
in scheme: emissions_variables_MMR

2.F.1.d [Transport Refrigeration][no classification][Emissions][C3F8][t][no source][no method][no target][no option][no type]
type: Concept
definition: 2.F.1.d [Transport Refrigeration][no classification][Emissions][C3F8][t][no source][no method][no target][no option][no type]
status: valid
status modified: 2017-02-13
accepted date: 2017-02-13
in scheme: emissions_variables_MMR

2.F.1.d [Transport Refrigeration][no classification][Emissions][C4F10][t][From disposal][no method][no target][no option][no type]
type: Concept
definition: 2.F.1.d [Transport Refrigeration][no classification][Emissions][C4F10][t][From disposal][no method][no target][no option][no type]
status: valid
status modified: 2017-02-13
accepted date: 2017-02-13
in scheme: emissions_variables_MMR

2.F.1.d [Transport Refrigeration][no classification][Emissions][C4F10][t][From manufacturing][no method][no target][no option][no type]
type: Concept
definition: 2.F.1.d [Transport Refrigeration][no classification][Emissions][C4F10][t][From manufacturing][no method][no target][no option][no type]
status: valid
status modified: 2017-02-13
accepted date: 2017-02-13
in scheme: emissions_variables_MMR

2.F.1.d [Transport Refrigeration][no classification][Emissions][C4F10][t][From stocks][no method][no target][no option][no type]
type: Concept
definition: 2.F.1.d [Transport Refrigeration][no classification][Emissions][C4F10][t][From stocks][no method][no target][no option][no type]
status: valid
status modified: 2017-02-13
accepted date: 2017-02-13
in scheme: emissions_variables_MMR

2.F.1.d [Transport Refrigeration][no classification][Emissions][C4F10][t][no source][no method][no target][no option][no type]
type: Concept
definition: 2.F.1.d [Transport Refrigeration][no classification][Emissions][C4F10][t][no source][no method][no target][no option][no type]
status: valid
status modified: 2017-02-13
accepted date: 2017-02-13
in scheme: emissions_variables_MMR

2.F.1.d [Transport Refrigeration][no classification][Emissions][C5F12][t][From disposal][no method][no target][no option][no type]
type: Concept
definition: 2.F.1.d [Transport Refrigeration][no classification][Emissions][C5F12][t][From disposal][no method][no target][no option][no type]
status: valid
status modified: 2017-02-13
accepted date: 2017-02-13
in scheme: emissions_variables_MMR

2.F.1.d [Transport Refrigeration][no classification][Emissions][C5F12][t][From manufacturing][no method][no target][no option][no type]
type: Concept
definition: 2.F.1.d [Transport Refrigeration][no classification][Emissions][C5F12][t][From manufacturing][no method][no target][no option][no type]
status: valid
status modified: 2017-02-13
accepted date: 2017-02-13
in scheme: emissions_variables_MMR

2.F.1.d [Transport Refrigeration][no classification][Emissions][C5F12][t][From stocks][no method][no target][no option][no type]
type: Concept
definition: 2.F.1.d [Transport Refrigeration][no classification][Emissions][C5F12][t][From stocks][no method][no target][no option][no type]
status: valid
status modified: 2017-02-13
accepted date: 2017-02-13
in scheme: emissions_variables_MMR

2.F.1.d [Transport Refrigeration][no classification][Emissions][C5F12][t][no source][no method][no target][no option][no type]
type: Concept
definition: 2.F.1.d [Transport Refrigeration][no classification][Emissions][C5F12][t][no source][no method][no target][no option][no type]
status: valid
status modified: 2017-02-13
accepted date: 2017-02-13
in scheme: emissions_variables_MMR

2.F.1.d [Transport Refrigeration][no classification][Emissions][C6F14][t][From disposal][no method][no target][no option][no type]
type: Concept
definition: 2.F.1.d [Transport Refrigeration][no classification][Emissions][C6F14][t][From disposal][no method][no target][no option][no type]
status: valid
status modified: 2017-02-13
accepted date: 2017-02-13
in scheme: emissions_variables_MMR

2.F.1.d [Transport Refrigeration][no classification][Emissions][C6F14][t][From manufacturing][no method][no target][no option][no type]
type: Concept
definition: 2.F.1.d [Transport Refrigeration][no classification][Emissions][C6F14][t][From manufacturing][no method][no target][no option][no type]
status: valid
status modified: 2017-02-13
accepted date: 2017-02-13
in scheme: emissions_variables_MMR

2.F.1.d [Transport Refrigeration][no classification][Emissions][C6F14][t][From stocks][no method][no target][no option][no type]
type: Concept
definition: 2.F.1.d [Transport Refrigeration][no classification][Emissions][C6F14][t][From stocks][no method][no target][no option][no type]
status: valid
status modified: 2017-02-13
accepted date: 2017-02-13
in scheme: emissions_variables_MMR

2.F.1.d [Transport Refrigeration][no classification][Emissions][C6F14][t][no source][no method][no target][no option][no type]
type: Concept
definition: 2.F.1.d [Transport Refrigeration][no classification][Emissions][C6F14][t][no source][no method][no target][no option][no type]
status: valid
status modified: 2017-02-13
accepted date: 2017-02-13
in scheme: emissions_variables_MMR

2.F.1.d [Transport Refrigeration][no classification][Emissions][c-C3F6][t][From disposal][no method][no target][no option][no type]
type: Concept
definition: 2.F.1.d [Transport Refrigeration][no classification][Emissions][c-C3F6][t][From disposal][no method][no target][no option][no type]
status: valid
status modified: 2017-02-13
accepted date: 2017-02-13
in scheme: emissions_variables_MMR

2.F.1.d [Transport Refrigeration][no classification][Emissions][c-C3F6][t][From manufacturing][no method][no target][no option][no type]
type: Concept
definition: 2.F.1.d [Transport Refrigeration][no classification][Emissions][c-C3F6][t][From manufacturing][no method][no target][no option][no type]
status: valid
status modified: 2017-02-13
accepted date: 2017-02-13
in scheme: emissions_variables_MMR

2.F.1.d [Transport Refrigeration][no classification][Emissions][c-C3F6][t][From stocks][no method][no target][no option][no type]
type: Concept
definition: 2.F.1.d [Transport Refrigeration][no classification][Emissions][c-C3F6][t][From stocks][no method][no target][no option][no type]
status: valid
status modified: 2017-02-13
accepted date: 2017-02-13
in scheme: emissions_variables_MMR

2.F.1.d [Transport Refrigeration][no classification][Emissions][c-C3F6][t][no source][no method][no target][no option][no type]
type: Concept
definition: 2.F.1.d [Transport Refrigeration][no classification][Emissions][c-C3F6][t][no source][no method][no target][no option][no type]
status: valid
status modified: 2017-02-13
accepted date: 2017-02-13
in scheme: emissions_variables_MMR

2.F.1.d [Transport Refrigeration][no classification][Emissions][c-C4F8][t][From disposal][no method][no target][no option][no type]
type: Concept
definition: 2.F.1.d [Transport Refrigeration][no classification][Emissions][c-C4F8][t][From disposal][no method][no target][no option][no type]
status: valid
status modified: 2017-02-13
accepted date: 2017-02-13
in scheme: emissions_variables_MMR

2.F.1.d [Transport Refrigeration][no classification][Emissions][c-C4F8][t][From manufacturing][no method][no target][no option][no type]
type: Concept
definition: 2.F.1.d [Transport Refrigeration][no classification][Emissions][c-C4F8][t][From manufacturing][no method][no target][no option][no type]
status: valid
status modified: 2017-02-13
accepted date: 2017-02-13
in scheme: emissions_variables_MMR

2.F.1.d [Transport Refrigeration][no classification][Emissions][c-C4F8][t][From stocks][no method][no target][no option][no type]
type: Concept
definition: 2.F.1.d [Transport Refrigeration][no classification][Emissions][c-C4F8][t][From stocks][no method][no target][no option][no type]
status: valid
status modified: 2017-02-13
accepted date: 2017-02-13
in scheme: emissions_variables_MMR

2.F.1.d [Transport Refrigeration][no classification][Emissions][c-C4F8][t][no source][no method][no target][no option][no type]
type: Concept
definition: 2.F.1.d [Transport Refrigeration][no classification][Emissions][c-C4F8][t][no source][no method][no target][no option][no type]
status: valid
status modified: 2017-02-13
accepted date: 2017-02-13
in scheme: emissions_variables_MMR

2.F.1.d [Transport Refrigeration][no classification][Emissions][CF4][t][From disposal][no method][no target][no option][no type]
type: Concept
definition: 2.F.1.d [Transport Refrigeration][no classification][Emissions][CF4][t][From disposal][no method][no target][no option][no type]
status: valid
status modified: 2017-02-13
accepted date: 2017-02-13
in scheme: emissions_variables_MMR

2.F.1.d [Transport Refrigeration][no classification][Emissions][CF4][t][From manufacturing][no method][no target][no option][no type]
type: Concept
definition: 2.F.1.d [Transport Refrigeration][no classification][Emissions][CF4][t][From manufacturing][no method][no target][no option][no type]
status: valid
status modified: 2017-02-13
accepted date: 2017-02-13
in scheme: emissions_variables_MMR

2.F.1.d [Transport Refrigeration][no classification][Emissions][CF4][t][From stocks][no method][no target][no option][no type]
type: Concept
definition: 2.F.1.d [Transport Refrigeration][no classification][Emissions][CF4][t][From stocks][no method][no target][no option][no type]
status: valid
status modified: 2017-02-13
accepted date: 2017-02-13
in scheme: emissions_variables_MMR

2.F.1.d [Transport Refrigeration][no classification][Emissions][CF4][t][no source][no method][no target][no option][no type]
type: Concept
definition: 2.F.1.d [Transport Refrigeration][no classification][Emissions][CF4][t][no source][no method][no target][no option][no type]
status: valid
status modified: 2017-02-13
accepted date: 2017-02-13
in scheme: emissions_variables_MMR

2.F.1.d [Transport Refrigeration][no classification][Emissions][HFC-125][t][From disposal][no method][no target][no option][no type]
type: Concept
definition: 2.F.1.d [Transport Refrigeration][no classification][Emissions][HFC-125][t][From disposal][no method][no target][no option][no type]
status: valid
status modified: 2017-02-13
accepted date: 2017-02-13
in scheme: emissions_variables_MMR

2.F.1.d [Transport Refrigeration][no classification][Emissions][HFC-125][t][From manufacturing][no method][no target][no option][no type]
type: Concept
definition: 2.F.1.d [Transport Refrigeration][no classification][Emissions][HFC-125][t][From manufacturing][no method][no target][no option][no type]
status: valid
status modified: 2017-02-13
accepted date: 2017-02-13
in scheme: emissions_variables_MMR

2.F.1.d [Transport Refrigeration][no classification][Emissions][HFC-125][t][From stocks][no method][no target][no option][no type]
type: Concept
definition: 2.F.1.d [Transport Refrigeration][no classification][Emissions][HFC-125][t][From stocks][no method][no target][no option][no type]
status: valid
status modified: 2017-02-13
accepted date: 2017-02-13
in scheme: emissions_variables_MMR

2.F.1.d [Transport Refrigeration][no classification][Emissions][HFC-125][t][no source][no method][no target][no option][no type]
type: Concept
definition: 2.F.1.d [Transport Refrigeration][no classification][Emissions][HFC-125][t][no source][no method][no target][no option][no type]
status: valid
status modified: 2017-02-13
accepted date: 2017-02-13
in scheme: emissions_variables_MMR

2.F.1.d [Transport Refrigeration][no classification][Emissions][HFC-134][t][From disposal][no method][no target][no option][no type]
type: Concept
definition: 2.F.1.d [Transport Refrigeration][no classification][Emissions][HFC-134][t][From disposal][no method][no target][no option][no type]
status: valid
status modified: 2017-02-13
accepted date: 2017-02-13
in scheme: emissions_variables_MMR

2.F.1.d [Transport Refrigeration][no classification][Emissions][HFC-134][t][From manufacturing][no method][no target][no option][no type]
type: Concept
definition: 2.F.1.d [Transport Refrigeration][no classification][Emissions][HFC-134][t][From manufacturing][no method][no target][no option][no type]
status: valid
status modified: 2017-02-13
accepted date: 2017-02-13
in scheme: emissions_variables_MMR

2.F.1.d [Transport Refrigeration][no classification][Emissions][HFC-134][t][From stocks][no method][no target][no option][no type]
type: Concept
definition: 2.F.1.d [Transport Refrigeration][no classification][Emissions][HFC-134][t][From stocks][no method][no target][no option][no type]
status: valid
status modified: 2017-02-13
accepted date: 2017-02-13
in scheme: emissions_variables_MMR

2.F.1.d [Transport Refrigeration][no classification][Emissions][HFC-134][t][no source][no method][no target][no option][no type]
type: Concept
definition: 2.F.1.d [Transport Refrigeration][no classification][Emissions][HFC-134][t][no source][no method][no target][no option][no type]
status: valid
status modified: 2017-02-13
accepted date: 2017-02-13
in scheme: emissions_variables_MMR

2.F.1.d [Transport Refrigeration][no classification][Emissions][HFC-134a][t][From disposal][no method][no target][no option][no type]
type: Concept
definition: 2.F.1.d [Transport Refrigeration][no classification][Emissions][HFC-134a][t][From disposal][no method][no target][no option][no type]
status: valid
status modified: 2017-02-13
accepted date: 2017-02-13
in scheme: emissions_variables_MMR

2.F.1.d [Transport Refrigeration][no classification][Emissions][HFC-134a][t][From manufacturing][no method][no target][no option][no type]
type: Concept
definition: 2.F.1.d [Transport Refrigeration][no classification][Emissions][HFC-134a][t][From manufacturing][no method][no target][no option][no type]
status: valid
status modified: 2017-02-13
accepted date: 2017-02-13
in scheme: emissions_variables_MMR

2.F.1.d [Transport Refrigeration][no classification][Emissions][HFC-134a][t][From stocks][no method][no target][no option][no type]
type: Concept
definition: 2.F.1.d [Transport Refrigeration][no classification][Emissions][HFC-134a][t][From stocks][no method][no target][no option][no type]
status: valid
status modified: 2017-02-13
accepted date: 2017-02-13
in scheme: emissions_variables_MMR

2.F.1.d [Transport Refrigeration][no classification][Emissions][HFC-134a][t][no source][no method][no target][no option][no type]
type: Concept
definition: 2.F.1.d [Transport Refrigeration][no classification][Emissions][HFC-134a][t][no source][no method][no target][no option][no type]
status: valid
status modified: 2017-02-13
accepted date: 2017-02-13
in scheme: emissions_variables_MMR

2.F.1.d [Transport Refrigeration][no classification][Emissions][HFC-143][t][From disposal][no method][no target][no option][no type]
type: Concept
definition: 2.F.1.d [Transport Refrigeration][no classification][Emissions][HFC-143][t][From disposal][no method][no target][no option][no type]
status: valid
status modified: 2017-02-13
accepted date: 2017-02-13
in scheme: emissions_variables_MMR

2.F.1.d [Transport Refrigeration][no classification][Emissions][HFC-143][t][From manufacturing][no method][no target][no option][no type]
type: Concept
definition: 2.F.1.d [Transport Refrigeration][no classification][Emissions][HFC-143][t][From manufacturing][no method][no target][no option][no type]
status: valid
status modified: 2017-02-13
accepted date: 2017-02-13
in scheme: emissions_variables_MMR

2.F.1.d [Transport Refrigeration][no classification][Emissions][HFC-143][t][From stocks][no method][no target][no option][no type]
type: Concept
definition: 2.F.1.d [Transport Refrigeration][no classification][Emissions][HFC-143][t][From stocks][no method][no target][no option][no type]
status: valid
status modified: 2017-02-13
accepted date: 2017-02-13
in scheme: emissions_variables_MMR

2.F.1.d [Transport Refrigeration][no classification][Emissions][HFC-143][t][no source][no method][no target][no option][no type]
type: Concept
definition: 2.F.1.d [Transport Refrigeration][no classification][Emissions][HFC-143][t][no source][no method][no target][no option][no type]
status: valid
status modified: 2017-02-13
accepted date: 2017-02-13
in scheme: emissions_variables_MMR

2.F.1.d [Transport Refrigeration][no classification][Emissions][HFC-143a][t][From disposal][no method][no target][no option][no type]
type: Concept
definition: 2.F.1.d [Transport Refrigeration][no classification][Emissions][HFC-143a][t][From disposal][no method][no target][no option][no type]
status: valid
status modified: 2017-02-13
accepted date: 2017-02-13
in scheme: emissions_variables_MMR

2.F.1.d [Transport Refrigeration][no classification][Emissions][HFC-143a][t][From manufacturing][no method][no target][no option][no type]
type: Concept
definition: 2.F.1.d [Transport Refrigeration][no classification][Emissions][HFC-143a][t][From manufacturing][no method][no target][no option][no type]
status: valid
status modified: 2017-02-13
accepted date: 2017-02-13
in scheme: emissions_variables_MMR

2.F.1.d [Transport Refrigeration][no classification][Emissions][HFC-143a][t][From stocks][no method][no target][no option][no type]
type: Concept
definition: 2.F.1.d [Transport Refrigeration][no classification][Emissions][HFC-143a][t][From stocks][no method][no target][no option][no type]
status: valid
status modified: 2017-02-13
accepted date: 2017-02-13
in scheme: emissions_variables_MMR

2.F.1.d [Transport Refrigeration][no classification][Emissions][HFC-143a][t][no source][no method][no target][no option][no type]
type: Concept
definition: 2.F.1.d [Transport Refrigeration][no classification][Emissions][HFC-143a][t][no source][no method][no target][no option][no type]
status: valid
status modified: 2017-02-13
accepted date: 2017-02-13
in scheme: emissions_variables_MMR

2.F.1.d [Transport Refrigeration][no classification][Emissions][HFC-152][t][From disposal][no method][no target][no option][no type]
type: Concept
definition: 2.F.1.d [Transport Refrigeration][no classification][Emissions][HFC-152][t][From disposal][no method][no target][no option][no type]
status: valid
status modified: 2017-02-13
accepted date: 2017-02-13
in scheme: emissions_variables_MMR

2.F.1.d [Transport Refrigeration][no classification][Emissions][HFC-152][t][From manufacturing][no method][no target][no option][no type]
type: Concept
definition: 2.F.1.d [Transport Refrigeration][no classification][Emissions][HFC-152][t][From manufacturing][no method][no target][no option][no type]
status: valid
status modified: 2017-02-13
accepted date: 2017-02-13
in scheme: emissions_variables_MMR

2.F.1.d [Transport Refrigeration][no classification][Emissions][HFC-152][t][From stocks][no method][no target][no option][no type]
type: Concept
definition: 2.F.1.d [Transport Refrigeration][no classification][Emissions][HFC-152][t][From stocks][no method][no target][no option][no type]
status: valid
status modified: 2017-02-13
accepted date: 2017-02-13
in scheme: emissions_variables_MMR

2.F.1.d [Transport Refrigeration][no classification][Emissions][HFC-152][t][no source][no method][no target][no option][no type]
type: Concept
definition: 2.F.1.d [Transport Refrigeration][no classification][Emissions][HFC-152][t][no source][no method][no target][no option][no type]
status: valid
status modified: 2017-02-13
accepted date: 2017-02-13
in scheme: emissions_variables_MMR

2.F.1.d [Transport Refrigeration][no classification][Emissions][HFC-152a][t][From disposal][no method][no target][no option][no type]
type: Concept
definition: 2.F.1.d [Transport Refrigeration][no classification][Emissions][HFC-152a][t][From disposal][no method][no target][no option][no type]
status: valid
status modified: 2017-02-13
accepted date: 2017-02-13
in scheme: emissions_variables_MMR

2.F.1.d [Transport Refrigeration][no classification][Emissions][HFC-152a][t][From manufacturing][no method][no target][no option][no type]
type: Concept
definition: 2.F.1.d [Transport Refrigeration][no classification][Emissions][HFC-152a][t][From manufacturing][no method][no target][no option][no type]
status: valid
status modified: 2017-02-13
accepted date: 2017-02-13
in scheme: emissions_variables_MMR

2.F.1.d [Transport Refrigeration][no classification][Emissions][HFC-152a][t][From stocks][no method][no target][no option][no type]
type: Concept
definition: 2.F.1.d [Transport Refrigeration][no classification][Emissions][HFC-152a][t][From stocks][no method][no target][no option][no type]
status: valid
status modified: 2017-02-13
accepted date: 2017-02-13
in scheme: emissions_variables_MMR

2.F.1.d [Transport Refrigeration][no classification][Emissions][HFC-152a][t][no source][no method][no target][no option][no type]
type: Concept
definition: 2.F.1.d [Transport Refrigeration][no classification][Emissions][HFC-152a][t][no source][no method][no target][no option][no type]
status: valid
status modified: 2017-02-13
accepted date: 2017-02-13
in scheme: emissions_variables_MMR

2.F.1.d [Transport Refrigeration][no classification][Emissions][HFC-161][t][From disposal][no method][no target][no option][no type]
type: Concept
definition: 2.F.1.d [Transport Refrigeration][no classification][Emissions][HFC-161][t][From disposal][no method][no target][no option][no type]
status: valid
status modified: 2017-02-13
accepted date: 2017-02-13
in scheme: emissions_variables_MMR

2.F.1.d [Transport Refrigeration][no classification][Emissions][HFC-161][t][From manufacturing][no method][no target][no option][no type]
type: Concept
definition: 2.F.1.d [Transport Refrigeration][no classification][Emissions][HFC-161][t][From manufacturing][no method][no target][no option][no type]
status: valid
status modified: 2017-02-13
accepted date: 2017-02-13
in scheme: emissions_variables_MMR

2.F.1.d [Transport Refrigeration][no classification][Emissions][HFC-161][t][From stocks][no method][no target][no option][no type]
type: Concept
definition: 2.F.1.d [Transport Refrigeration][no classification][Emissions][HFC-161][t][From stocks][no method][no target][no option][no type]
status: valid
status modified: 2017-02-13
accepted date: 2017-02-13
in scheme: emissions_variables_MMR

2.F.1.d [Transport Refrigeration][no classification][Emissions][HFC-161][t][no source][no method][no target][no option][no type]
type: Concept
definition: 2.F.1.d [Transport Refrigeration][no classification][Emissions][HFC-161][t][no source][no method][no target][no option][no type]
status: valid
status modified: 2017-02-13
accepted date: 2017-02-13
in scheme: emissions_variables_MMR

2.F.1.d [Transport Refrigeration][no classification][Emissions][HFC-227ea][t][From disposal][no method][no target][no option][no type]
type: Concept
definition: 2.F.1.d [Transport Refrigeration][no classification][Emissions][HFC-227ea][t][From disposal][no method][no target][no option][no type]
status: valid
status modified: 2017-02-13
accepted date: 2017-02-13
in scheme: emissions_variables_MMR

2.F.1.d [Transport Refrigeration][no classification][Emissions][HFC-227ea][t][From manufacturing][no method][no target][no option][no type]
type: Concept
definition: 2.F.1.d [Transport Refrigeration][no classification][Emissions][HFC-227ea][t][From manufacturing][no method][no target][no option][no type]
status: valid
status modified: 2017-02-13
accepted date: 2017-02-13
in scheme: emissions_variables_MMR

2.F.1.d [Transport Refrigeration][no classification][Emissions][HFC-227ea][t][From stocks][no method][no target][no option][no type]
type: Concept
definition: 2.F.1.d [Transport Refrigeration][no classification][Emissions][HFC-227ea][t][From stocks][no method][no target][no option][no type]
status: valid
status modified: 2017-02-13
accepted date: 2017-02-13
in scheme: emissions_variables_MMR

2.F.1.d [Transport Refrigeration][no classification][Emissions][HFC-227ea][t][no source][no method][no target][no option][no type]
type: Concept
definition: 2.F.1.d [Transport Refrigeration][no classification][Emissions][HFC-227ea][t][no source][no method][no target][no option][no type]
status: valid
status modified: 2017-02-13
accepted date: 2017-02-13
in scheme: emissions_variables_MMR

2.F.1.d [Transport Refrigeration][no classification][Emissions][HFC-23][t][From disposal][no method][no target][no option][no type]
type: Concept
definition: 2.F.1.d [Transport Refrigeration][no classification][Emissions][HFC-23][t][From disposal][no method][no target][no option][no type]
status: valid
status modified: 2017-02-13
accepted date: 2017-02-13
in scheme: emissions_variables_MMR

2.F.1.d [Transport Refrigeration][no classification][Emissions][HFC-23][t][From manufacturing][no method][no target][no option][no type]
type: Concept
definition: 2.F.1.d [Transport Refrigeration][no classification][Emissions][HFC-23][t][From manufacturing][no method][no target][no option][no type]
status: valid
status modified: 2017-02-13
accepted date: 2017-02-13
in scheme: emissions_variables_MMR

2.F.1.d [Transport Refrigeration][no classification][Emissions][HFC-23][t][From stocks][no method][no target][no option][no type]
type: Concept
definition: 2.F.1.d [Transport Refrigeration][no classification][Emissions][HFC-23][t][From stocks][no method][no target][no option][no type]
status: valid
status modified: 2017-02-13
accepted date: 2017-02-13
in scheme: emissions_variables_MMR

2.F.1.d [Transport Refrigeration][no classification][Emissions][HFC-23][t][no source][no method][no target][no option][no type]
type: Concept
definition: 2.F.1.d [Transport Refrigeration][no classification][Emissions][HFC-23][t][no source][no method][no target][no option][no type]
status: valid
status modified: 2017-02-13
accepted date: 2017-02-13
in scheme: emissions_variables_MMR

2.F.1.d [Transport Refrigeration][no classification][Emissions][HFC-236cb][t][From disposal][no method][no target][no option][no type]
type: Concept
definition: 2.F.1.d [Transport Refrigeration][no classification][Emissions][HFC-236cb][t][From disposal][no method][no target][no option][no type]
status: valid
status modified: 2017-02-13
accepted date: 2017-02-13
in scheme: emissions_variables_MMR

2.F.1.d [Transport Refrigeration][no classification][Emissions][HFC-236cb][t][From manufacturing][no method][no target][no option][no type]
type: Concept
definition: 2.F.1.d [Transport Refrigeration][no classification][Emissions][HFC-236cb][t][From manufacturing][no method][no target][no option][no type]
status: valid
status modified: 2017-02-13
accepted date: 2017-02-13
in scheme: emissions_variables_MMR

2.F.1.d [Transport Refrigeration][no classification][Emissions][HFC-236cb][t][From stocks][no method][no target][no option][no type]
type: Concept
definition: 2.F.1.d [Transport Refrigeration][no classification][Emissions][HFC-236cb][t][From stocks][no method][no target][no option][no type]
status: valid
status modified: 2017-02-13
accepted date: 2017-02-13
in scheme: emissions_variables_MMR

2.F.1.d [Transport Refrigeration][no classification][Emissions][HFC-236cb][t][no source][no method][no target][no option][no type]
type: Concept
definition: 2.F.1.d [Transport Refrigeration][no classification][Emissions][HFC-236cb][t][no source][no method][no target][no option][no type]
status: valid
status modified: 2017-02-13
accepted date: 2017-02-13
in scheme: emissions_variables_MMR

2.F.1.d [Transport Refrigeration][no classification][Emissions][HFC-236ea][t][From disposal][no method][no target][no option][no type]
type: Concept
definition: 2.F.1.d [Transport Refrigeration][no classification][Emissions][HFC-236ea][t][From disposal][no method][no target][no option][no type]
status: valid
status modified: 2017-02-13
accepted date: 2017-02-13
in scheme: emissions_variables_MMR

2.F.1.d [Transport Refrigeration][no classification][Emissions][HFC-236ea][t][From manufacturing][no method][no target][no option][no type]
type: Concept
definition: 2.F.1.d [Transport Refrigeration][no classification][Emissions][HFC-236ea][t][From manufacturing][no method][no target][no option][no type]
status: valid
status modified: 2017-02-13
accepted date: 2017-02-13
in scheme: emissions_variables_MMR

2.F.1.d [Transport Refrigeration][no classification][Emissions][HFC-236ea][t][From stocks][no method][no target][no option][no type]
type: Concept
definition: 2.F.1.d [Transport Refrigeration][no classification][Emissions][HFC-236ea][t][From stocks][no method][no target][no option][no type]
status: valid
status modified: 2017-02-13
accepted date: 2017-02-13
in scheme: emissions_variables_MMR

2.F.1.d [Transport Refrigeration][no classification][Emissions][HFC-236ea][t][no source][no method][no target][no option][no type]
type: Concept
definition: 2.F.1.d [Transport Refrigeration][no classification][Emissions][HFC-236ea][t][no source][no method][no target][no option][no type]
status: valid
status modified: 2017-02-13
accepted date: 2017-02-13
in scheme: emissions_variables_MMR

2.F.1.d [Transport Refrigeration][no classification][Emissions][HFC-236fa][t][From disposal][no method][no target][no option][no type]
type: Concept
definition: 2.F.1.d [Transport Refrigeration][no classification][Emissions][HFC-236fa][t][From disposal][no method][no target][no option][no type]
status: valid
status modified: 2017-02-13
accepted date: 2017-02-13
in scheme: emissions_variables_MMR

2.F.1.d [Transport Refrigeration][no classification][Emissions][HFC-236fa][t][From manufacturing][no method][no target][no option][no type]
type: Concept
definition: 2.F.1.d [Transport Refrigeration][no classification][Emissions][HFC-236fa][t][From manufacturing][no method][no target][no option][no type]
status: valid
status modified: 2017-02-13
accepted date: 2017-02-13
in scheme: emissions_variables_MMR

2.F.1.d [Transport Refrigeration][no classification][Emissions][HFC-236fa][t][From stocks][no method][no target][no option][no type]
type: Concept
definition: 2.F.1.d [Transport Refrigeration][no classification][Emissions][HFC-236fa][t][From stocks][no method][no target][no option][no type]
status: valid
status modified: 2017-02-13
accepted date: 2017-02-13
in scheme: emissions_variables_MMR

2.F.1.d [Transport Refrigeration][no classification][Emissions][HFC-236fa][t][no source][no method][no target][no option][no type]
type: Concept
definition: 2.F.1.d [Transport Refrigeration][no classification][Emissions][HFC-236fa][t][no source][no method][no target][no option][no type]
status: valid
status modified: 2017-02-13
accepted date: 2017-02-13
in scheme: emissions_variables_MMR

2.F.1.d [Transport Refrigeration][no classification][Emissions][HFC-245ca][t][From disposal][no method][no target][no option][no type]
type: Concept
definition: 2.F.1.d [Transport Refrigeration][no classification][Emissions][HFC-245ca][t][From disposal][no method][no target][no option][no type]
status: valid
status modified: 2017-02-13
accepted date: 2017-02-13
in scheme: emissions_variables_MMR

2.F.1.d [Transport Refrigeration][no classification][Emissions][HFC-245ca][t][From manufacturing][no method][no target][no option][no type]
type: Concept
definition: 2.F.1.d [Transport Refrigeration][no classification][Emissions][HFC-245ca][t][From manufacturing][no method][no target][no option][no type]
status: valid
status modified: 2017-02-13
accepted date: 2017-02-13
in scheme: emissions_variables_MMR

2.F.1.d [Transport Refrigeration][no classification][Emissions][HFC-245ca][t][From stocks][no method][no target][no option][no type]
type: Concept
definition: 2.F.1.d [Transport Refrigeration][no classification][Emissions][HFC-245ca][t][From stocks][no method][no target][no option][no type]
status: valid
status modified: 2017-02-13
accepted date: 2017-02-13
in scheme: emissions_variables_MMR

2.F.1.d [Transport Refrigeration][no classification][Emissions][HFC-245ca][t][no source][no method][no target][no option][no type]
type: Concept
definition: 2.F.1.d [Transport Refrigeration][no classification][Emissions][HFC-245ca][t][no source][no method][no target][no option][no type]
status: valid
status modified: 2017-02-13
accepted date: 2017-02-13
in scheme: emissions_variables_MMR

2.F.1.d [Transport Refrigeration][no classification][Emissions][HFC-245fa][t][From disposal][no method][no target][no option][no type]
type: Concept
definition: 2.F.1.d [Transport Refrigeration][no classification][Emissions][HFC-245fa][t][From disposal][no method][no target][no option][no type]
status: valid
status modified: 2017-02-13
accepted date: 2017-02-13
in scheme: emissions_variables_MMR

2.F.1.d [Transport Refrigeration][no classification][Emissions][HFC-245fa][t][From manufacturing][no method][no target][no option][no type]
type: Concept
definition: 2.F.1.d [Transport Refrigeration][no classification][Emissions][HFC-245fa][t][From manufacturing][no method][no target][no option][no type]
status: valid
status modified: 2017-02-13
accepted date: 2017-02-13
in scheme: emissions_variables_MMR

2.F.1.d [Transport Refrigeration][no classification][Emissions][HFC-245fa][t][From stocks][no method][no target][no option][no type]
type: Concept
definition: 2.F.1.d [Transport Refrigeration][no classification][Emissions][HFC-245fa][t][From stocks][no method][no target][no option][no type]
status: valid
status modified: 2017-02-13
accepted date: 2017-02-13
in scheme: emissions_variables_MMR

2.F.1.d [Transport Refrigeration][no classification][Emissions][HFC-245fa][t][no source][no method][no target][no option][no type]
type: Concept
definition: 2.F.1.d [Transport Refrigeration][no classification][Emissions][HFC-245fa][t][no source][no method][no target][no option][no type]
status: valid
status modified: 2017-02-13
accepted date: 2017-02-13
in scheme: emissions_variables_MMR

2.F.1.d [Transport Refrigeration][no classification][Emissions][HFC-32][t][From disposal][no method][no target][no option][no type]
type: Concept
definition: 2.F.1.d [Transport Refrigeration][no classification][Emissions][HFC-32][t][From disposal][no method][no target][no option][no type]
status: valid
status modified: 2017-02-13
accepted date: 2017-02-13
in scheme: emissions_variables_MMR

2.F.1.d [Transport Refrigeration][no classification][Emissions][HFC-32][t][From manufacturing][no method][no target][no option][no type]
type: Concept
definition: 2.F.1.d [Transport Refrigeration][no classification][Emissions][HFC-32][t][From manufacturing][no method][no target][no option][no type]
status: valid
status modified: 2017-02-13
accepted date: 2017-02-13
in scheme: emissions_variables_MMR

2.F.1.d [Transport Refrigeration][no classification][Emissions][HFC-32][t][From stocks][no method][no target][no option][no type]
type: Concept
definition: 2.F.1.d [Transport Refrigeration][no classification][Emissions][HFC-32][t][From stocks][no method][no target][no option][no type]
status: valid
status modified: 2017-02-13
accepted date: 2017-02-13
in scheme: emissions_variables_MMR

2.F.1.d [Transport Refrigeration][no classification][Emissions][HFC-32][t][no source][no method][no target][no option][no type]
type: Concept
definition: 2.F.1.d [Transport Refrigeration][no classification][Emissions][HFC-32][t][no source][no method][no target][no option][no type]
status: valid
status modified: 2017-02-13
accepted date: 2017-02-13
in scheme: emissions_variables_MMR

2.F.1.d [Transport Refrigeration][no classification][Emissions][HFC-365mfc][t][From disposal][no method][no target][no option][no type]
type: Concept
definition: 2.F.1.d [Transport Refrigeration][no classification][Emissions][HFC-365mfc][t][From disposal][no method][no target][no option][no type]
status: valid
status modified: 2017-02-13
accepted date: 2017-02-13
in scheme: emissions_variables_MMR

2.F.1.d [Transport Refrigeration][no classification][Emissions][HFC-365mfc][t][From manufacturing][no method][no target][no option][no type]
type: Concept
definition: 2.F.1.d [Transport Refrigeration][no classification][Emissions][HFC-365mfc][t][From manufacturing][no method][no target][no option][no type]
status: valid
status modified: 2017-02-13
accepted date: 2017-02-13
in scheme: emissions_variables_MMR

2.F.1.d [Transport Refrigeration][no classification][Emissions][HFC-365mfc][t][From stocks][no method][no target][no option][no type]
type: Concept
definition: 2.F.1.d [Transport Refrigeration][no classification][Emissions][HFC-365mfc][t][From stocks][no method][no target][no option][no type]
status: valid
status modified: 2017-02-13
accepted date: 2017-02-13
in scheme: emissions_variables_MMR

2.F.1.d [Transport Refrigeration][no classification][Emissions][HFC-365mfc][t][no source][no method][no target][no option][no type]
type: Concept
definition: 2.F.1.d [Transport Refrigeration][no classification][Emissions][HFC-365mfc][t][no source][no method][no target][no option][no type]
status: valid
status modified: 2017-02-13
accepted date: 2017-02-13
in scheme: emissions_variables_MMR

2.F.1.d [Transport Refrigeration][no classification][Emissions][HFC-41][t][From disposal][no method][no target][no option][no type]
type: Concept
definition: 2.F.1.d [Transport Refrigeration][no classification][Emissions][HFC-41][t][From disposal][no method][no target][no option][no type]
status: valid
status modified: 2017-02-13
accepted date: 2017-02-13
in scheme: emissions_variables_MMR

2.F.1.d [Transport Refrigeration][no classification][Emissions][HFC-41][t][From manufacturing][no method][no target][no option][no type]
type: Concept
definition: 2.F.1.d [Transport Refrigeration][no classification][Emissions][HFC-41][t][From manufacturing][no method][no target][no option][no type]
status: valid
status modified: 2017-02-13
accepted date: 2017-02-13
in scheme: emissions_variables_MMR

2.F.1.d [Transport Refrigeration][no classification][Emissions][HFC-41][t][From stocks][no method][no target][no option][no type]
type: Concept
definition: 2.F.1.d [Transport Refrigeration][no classification][Emissions][HFC-41][t][From stocks][no method][no target][no option][no type]
status: valid
status modified: 2017-02-13
accepted date: 2017-02-13
in scheme: emissions_variables_MMR

2.F.1.d [Transport Refrigeration][no classification][Emissions][HFC-41][t][no source][no method][no target][no option][no type]
type: Concept
definition: 2.F.1.d [Transport Refrigeration][no classification][Emissions][HFC-41][t][no source][no method][no target][no option][no type]
status: valid
status modified: 2017-02-13
accepted date: 2017-02-13
in scheme: emissions_variables_MMR

2.F.1.d [Transport Refrigeration][no classification][Emissions][HFC-43-10mee][t][From disposal][no method][no target][no option][no type]
type: Concept
definition: 2.F.1.d [Transport Refrigeration][no classification][Emissions][HFC-43-10mee][t][From disposal][no method][no target][no option][no type]
status: valid
status modified: 2017-02-13
accepted date: 2017-02-13
in scheme: emissions_variables_MMR

2.F.1.d [Transport Refrigeration][no classification][Emissions][HFC-43-10mee][t][From manufacturing][no method][no target][no option][no type]
type: Concept
definition: 2.F.1.d [Transport Refrigeration][no classification][Emissions][HFC-43-10mee][t][From manufacturing][no method][no target][no option][no type]
status: valid
status modified: 2017-02-13
accepted date: 2017-02-13
in scheme: emissions_variables_MMR

2.F.1.d [Transport Refrigeration][no classification][Emissions][HFC-43-10mee][t][From stocks][no method][no target][no option][no type]
type: Concept
definition: 2.F.1.d [Transport Refrigeration][no classification][Emissions][HFC-43-10mee][t][From stocks][no method][no target][no option][no type]
status: valid
status modified: 2017-02-13
accepted date: 2017-02-13
in scheme: emissions_variables_MMR

2.F.1.d [Transport Refrigeration][no classification][Emissions][HFC-43-10mee][t][no source][no method][no target][no option][no type]
type: Concept
definition: 2.F.1.d [Transport Refrigeration][no classification][Emissions][HFC-43-10mee][t][no source][no method][no target][no option][no type]
status: valid
status modified: 2017-02-13
accepted date: 2017-02-13
in scheme: emissions_variables_MMR

2.F.1.d [Transport Refrigeration][no classification][Emissions][HFCs and PFCs][t CO2 equivalent][no source][no method][no target][no option][no type]
type: Concept
definition: 2.F.1.d [Transport Refrigeration][no classification][Emissions][HFCs and PFCs][t CO2 equivalent][no source][no method][no target][no option][no type]
status: valid
status modified: 2017-02-13
accepted date: 2017-02-13
in scheme: emissions_variables_MMR

2.F.1.d [Transport Refrigeration][no classification][Emissions][HFCs][t CO2 equivalent][no source][no method][no target][no option][no type]
type: Concept
definition: 2.F.1.d [Transport Refrigeration][no classification][Emissions][HFCs][t CO2 equivalent][no source][no method][no target][no option][no type]
status: valid
status modified: 2017-02-13
accepted date: 2017-02-13
in scheme: emissions_variables_MMR

2.F.1.d [Transport Refrigeration][no classification][Emissions][NF3][t][From disposal][no method][no target][no option][no type]
type: Concept
definition: 2.F.1.d [Transport Refrigeration][no classification][Emissions][NF3][t][From disposal][no method][no target][no option][no type]
status: valid
status modified: 2017-02-13
accepted date: 2017-02-13
in scheme: emissions_variables_MMR

2.F.1.d [Transport Refrigeration][no classification][Emissions][NF3][t][From manufacturing][no method][no target][no option][no type]
type: Concept
definition: 2.F.1.d [Transport Refrigeration][no classification][Emissions][NF3][t][From manufacturing][no method][no target][no option][no type]
status: valid
status modified: 2017-02-13
accepted date: 2017-02-13
in scheme: emissions_variables_MMR

2.F.1.d [Transport Refrigeration][no classification][Emissions][NF3][t][From stocks][no method][no target][no option][no type]
type: Concept
definition: 2.F.1.d [Transport Refrigeration][no classification][Emissions][NF3][t][From stocks][no method][no target][no option][no type]
status: valid
status modified: 2017-02-13
accepted date: 2017-02-13
in scheme: emissions_variables_MMR

2.F.1.d [Transport Refrigeration][no classification][Emissions][NF3][t][no source][no method][no target][no option][no type]
type: Concept
definition: 2.F.1.d [Transport Refrigeration][no classification][Emissions][NF3][t][no source][no method][no target][no option][no type]
status: valid
status modified: 2017-02-13
accepted date: 2017-02-13
in scheme: emissions_variables_MMR

2.F.1.d [Transport Refrigeration][no classification][Emissions][PFCs][t CO2 equivalent][no source][no method][no target][no option][no type]
type: Concept
definition: 2.F.1.d [Transport Refrigeration][no classification][Emissions][PFCs][t CO2 equivalent][no source][no method][no target][no option][no type]
status: valid
status modified: 2017-02-13
accepted date: 2017-02-13
in scheme: emissions_variables_MMR

2.F.1.d [Transport Refrigeration][no classification][Emissions][SF6][t][From disposal][no method][no target][no option][no type]
type: Concept
definition: 2.F.1.d [Transport Refrigeration][no classification][Emissions][SF6][t][From disposal][no method][no target][no option][no type]
status: valid
status modified: 2017-02-13
accepted date: 2017-02-13
in scheme: emissions_variables_MMR

2.F.1.d [Transport Refrigeration][no classification][Emissions][SF6][t][From manufacturing][no method][no target][no option][no type]
type: Concept
definition: 2.F.1.d [Transport Refrigeration][no classification][Emissions][SF6][t][From manufacturing][no method][no target][no option][no type]
status: valid
status modified: 2017-02-13
accepted date: 2017-02-13
in scheme: emissions_variables_MMR

2.F.1.d [Transport Refrigeration][no classification][Emissions][SF6][t][From stocks][no method][no target][no option][no type]
type: Concept
definition: 2.F.1.d [Transport Refrigeration][no classification][Emissions][SF6][t][From stocks][no method][no target][no option][no type]
status: valid
status modified: 2017-02-13
accepted date: 2017-02-13
in scheme: emissions_variables_MMR

2.F.1.d [Transport Refrigeration][no classification][Emissions][SF6][t][no source][no method][no target][no option][no type]
type: Concept
definition: 2.F.1.d [Transport Refrigeration][no classification][Emissions][SF6][t][no source][no method][no target][no option][no type]
status: valid
status modified: 2017-02-13
accepted date: 2017-02-13
in scheme: emissions_variables_MMR

2.F.1.d [Transport Refrigeration][no classification][Emissions][Unspecified mix of HFCs and PFCs][t CO2 equivalent][From disposal][no method][no target][no option][no type]
type: Concept
definition: 2.F.1.d [Transport Refrigeration][no classification][Emissions][Unspecified mix of HFCs and PFCs][t CO2 equivalent][From disposal][no method][no target][no option][no type]
status: valid
status modified: 2017-02-13
accepted date: 2017-02-13
in scheme: emissions_variables_MMR

2.F.1.d [Transport Refrigeration][no classification][Emissions][Unspecified mix of HFCs and PFCs][t CO2 equivalent][From manufacturing][no method][no target][no option][no type]
type: Concept
definition: 2.F.1.d [Transport Refrigeration][no classification][Emissions][Unspecified mix of HFCs and PFCs][t CO2 equivalent][From manufacturing][no method][no target][no option][no type]
status: valid
status modified: 2017-02-13
accepted date: 2017-02-13
in scheme: emissions_variables_MMR

2.F.1.d [Transport Refrigeration][no classification][Emissions][Unspecified mix of HFCs and PFCs][t CO2 equivalent][From stocks][no method][no target][no option][no type]
type: Concept
definition: 2.F.1.d [Transport Refrigeration][no classification][Emissions][Unspecified mix of HFCs and PFCs][t CO2 equivalent][From stocks][no method][no target][no option][no type]
status: valid
status modified: 2017-02-13
accepted date: 2017-02-13
in scheme: emissions_variables_MMR

2.F.1.d [Transport Refrigeration][no classification][Emissions][Unspecified mix of HFCs and PFCs][t CO2 equivalent][no source][no method][no target][no option][no type]
type: Concept
definition: 2.F.1.d [Transport Refrigeration][no classification][Emissions][Unspecified mix of HFCs and PFCs][t CO2 equivalent][no source][no method][no target][no option][no type]
status: valid
status modified: 2017-02-13
accepted date: 2017-02-13
in scheme: emissions_variables_MMR

2.F.1.d [Transport Refrigeration][no classification][Emissions][Unspecified mix of HFCs][t CO2 equivalent][From disposal][no method][no target][no option][no type]
type: Concept
definition: 2.F.1.d [Transport Refrigeration][no classification][Emissions][Unspecified mix of HFCs][t CO2 equivalent][From disposal][no method][no target][no option][no type]
status: valid
status modified: 2017-02-13
accepted date: 2017-02-13
in scheme: emissions_variables_MMR

2.F.1.d [Transport Refrigeration][no classification][Emissions][Unspecified mix of HFCs][t CO2 equivalent][From manufacturing][no method][no target][no option][no type]
type: Concept
definition: 2.F.1.d [Transport Refrigeration][no classification][Emissions][Unspecified mix of HFCs][t CO2 equivalent][From manufacturing][no method][no target][no option][no type]
status: valid
status modified: 2017-02-13
accepted date: 2017-02-13
in scheme: emissions_variables_MMR

2.F.1.d [Transport Refrigeration][no classification][Emissions][Unspecified mix of HFCs][t CO2 equivalent][From stocks][no method][no target][no option][no type]
type: Concept
definition: 2.F.1.d [Transport Refrigeration][no classification][Emissions][Unspecified mix of HFCs][t CO2 equivalent][From stocks][no method][no target][no option][no type]
status: valid
status modified: 2017-02-13
accepted date: 2017-02-13
in scheme: emissions_variables_MMR

2.F.1.d [Transport Refrigeration][no classification][Emissions][Unspecified mix of HFCs][t CO2 equivalent][no source][no method][no target][no option][no type]
type: Concept
definition: 2.F.1.d [Transport Refrigeration][no classification][Emissions][Unspecified mix of HFCs][t CO2 equivalent][no source][no method][no target][no option][no type]
status: valid
status modified: 2017-02-13
accepted date: 2017-02-13
in scheme: emissions_variables_MMR

2.F.1.d [Transport Refrigeration][no classification][Emissions][Unspecified mix of PFCs][t CO2 equivalent][From disposal][no method][no target][no option][no type]
type: Concept
definition: 2.F.1.d [Transport Refrigeration][no classification][Emissions][Unspecified mix of PFCs][t CO2 equivalent][From disposal][no method][no target][no option][no type]
status: valid
status modified: 2017-02-13
accepted date: 2017-02-13
in scheme: emissions_variables_MMR

2.F.1.d [Transport Refrigeration][no classification][Emissions][Unspecified mix of PFCs][t CO2 equivalent][From manufacturing][no method][no target][no option][no type]
type: Concept
definition: 2.F.1.d [Transport Refrigeration][no classification][Emissions][Unspecified mix of PFCs][t CO2 equivalent][From manufacturing][no method][no target][no option][no type]
status: valid
status modified: 2017-02-13
accepted date: 2017-02-13
in scheme: emissions_variables_MMR

2.F.1.d [Transport Refrigeration][no classification][Emissions][Unspecified mix of PFCs][t CO2 equivalent][From stocks][no method][no target][no option][no type]
type: Concept
definition: 2.F.1.d [Transport Refrigeration][no classification][Emissions][Unspecified mix of PFCs][t CO2 equivalent][From stocks][no method][no target][no option][no type]
status: valid
status modified: 2017-02-13
accepted date: 2017-02-13
in scheme: emissions_variables_MMR

2.F.1.d [Transport Refrigeration][no classification][Emissions][Unspecified mix of PFCs][t CO2 equivalent][no source][no method][no target][no option][no type]
type: Concept
definition: 2.F.1.d [Transport Refrigeration][no classification][Emissions][Unspecified mix of PFCs][t CO2 equivalent][no source][no method][no target][no option][no type]
status: valid
status modified: 2017-02-13
accepted date: 2017-02-13
in scheme: emissions_variables_MMR

2.F.1.e [Mobile Air-Conditioning][no classification][Emissions][Aggregate F-gases][t CO2 equivalent][no source][no method][no target][no option][no type]
type: Concept
definition: 2.F.1.e [Mobile Air-Conditioning][no classification][Emissions][Aggregate F-gases][t CO2 equivalent][no source][no method][no target][no option][no type]
status: valid
status modified: 2017-02-13
accepted date: 2017-02-13
in scheme: emissions_variables_MMR

2.F.1.e [Mobile Air-Conditioning][no classification][Emissions][C10F18][t][From disposal][no method][no target][no option][no type]
type: Concept
definition: 2.F.1.e [Mobile Air-Conditioning][no classification][Emissions][C10F18][t][From disposal][no method][no target][no option][no type]
status: valid
status modified: 2017-02-13
accepted date: 2017-02-13
in scheme: emissions_variables_MMR

2.F.1.e [Mobile Air-Conditioning][no classification][Emissions][C10F18][t][From manufacturing][no method][no target][no option][no type]
type: Concept
definition: 2.F.1.e [Mobile Air-Conditioning][no classification][Emissions][C10F18][t][From manufacturing][no method][no target][no option][no type]
status: valid
status modified: 2017-02-13
accepted date: 2017-02-13
in scheme: emissions_variables_MMR

2.F.1.e [Mobile Air-Conditioning][no classification][Emissions][C10F18][t][From stocks][no method][no target][no option][no type]
type: Concept
definition: 2.F.1.e [Mobile Air-Conditioning][no classification][Emissions][C10F18][t][From stocks][no method][no target][no option][no type]
status: valid
status modified: 2017-02-13
accepted date: 2017-02-13
in scheme: emissions_variables_MMR

2.F.1.e [Mobile Air-Conditioning][no classification][Emissions][C10F18][t][no source][no method][no target][no option][no type]
type: Concept
definition: 2.F.1.e [Mobile Air-Conditioning][no classification][Emissions][C10F18][t][no source][no method][no target][no option][no type]
status: valid
status modified: 2017-02-13
accepted date: 2017-02-13
in scheme: emissions_variables_MMR

2.F.1.e [Mobile Air-Conditioning][no classification][Emissions][C2F6][t][From disposal][no method][no target][no option][no type]
type: Concept
definition: 2.F.1.e [Mobile Air-Conditioning][no classification][Emissions][C2F6][t][From disposal][no method][no target][no option][no type]
status: valid
status modified: 2017-02-13
accepted date: 2017-02-13
in scheme: emissions_variables_MMR

2.F.1.e [Mobile Air-Conditioning][no classification][Emissions][C2F6][t][From manufacturing][no method][no target][no option][no type]
type: Concept
definition: 2.F.1.e [Mobile Air-Conditioning][no classification][Emissions][C2F6][t][From manufacturing][no method][no target][no option][no type]
status: valid
status modified: 2017-02-13
accepted date: 2017-02-13
in scheme: emissions_variables_MMR

2.F.1.e [Mobile Air-Conditioning][no classification][Emissions][C2F6][t][From stocks][no method][no target][no option][no type]
type: Concept
definition: 2.F.1.e [Mobile Air-Conditioning][no classification][Emissions][C2F6][t][From stocks][no method][no target][no option][no type]
status: valid
status modified: 2017-02-13
accepted date: 2017-02-13
in scheme: emissions_variables_MMR

2.F.1.e [Mobile Air-Conditioning][no classification][Emissions][C2F6][t][no source][no method][no target][no option][no type]
type: Concept
definition: 2.F.1.e [Mobile Air-Conditioning][no classification][Emissions][C2F6][t][no source][no method][no target][no option][no type]
status: valid
status modified: 2017-02-13
accepted date: 2017-02-13
in scheme: emissions_variables_MMR

2.F.1.e [Mobile Air-Conditioning][no classification][Emissions][C3F8][t][From disposal][no method][no target][no option][no type]
type: Concept
definition: 2.F.1.e [Mobile Air-Conditioning][no classification][Emissions][C3F8][t][From disposal][no method][no target][no option][no type]
status: valid
status modified: 2017-02-13
accepted date: 2017-02-13
in scheme: emissions_variables_MMR

2.F.1.e [Mobile Air-Conditioning][no classification][Emissions][C3F8][t][From manufacturing][no method][no target][no option][no type]
type: Concept
definition: 2.F.1.e [Mobile Air-Conditioning][no classification][Emissions][C3F8][t][From manufacturing][no method][no target][no option][no type]
status: valid
status modified: 2017-02-13
accepted date: 2017-02-13
in scheme: emissions_variables_MMR

2.F.1.e [Mobile Air-Conditioning][no classification][Emissions][C3F8][t][From stocks][no method][no target][no option][no type]
type: Concept
definition: 2.F.1.e [Mobile Air-Conditioning][no classification][Emissions][C3F8][t][From stocks][no method][no target][no option][no type]
status: valid
status modified: 2017-02-13
accepted date: 2017-02-13
in scheme: emissions_variables_MMR

2.F.1.e [Mobile Air-Conditioning][no classification][Emissions][C3F8][t][no source][no method][no target][no option][no type]
type: Concept
definition: 2.F.1.e [Mobile Air-Conditioning][no classification][Emissions][C3F8][t][no source][no method][no target][no option][no type]
status: valid
status modified: 2017-02-13
accepted date: 2017-02-13
in scheme: emissions_variables_MMR

2.F.1.e [Mobile Air-Conditioning][no classification][Emissions][C4F10][t][From disposal][no method][no target][no option][no type]
type: Concept
definition: 2.F.1.e [Mobile Air-Conditioning][no classification][Emissions][C4F10][t][From disposal][no method][no target][no option][no type]
status: valid
status modified: 2017-02-13
accepted date: 2017-02-13
in scheme: emissions_variables_MMR

2.F.1.e [Mobile Air-Conditioning][no classification][Emissions][C4F10][t][From manufacturing][no method][no target][no option][no type]
type: Concept
definition: 2.F.1.e [Mobile Air-Conditioning][no classification][Emissions][C4F10][t][From manufacturing][no method][no target][no option][no type]
status: valid
status modified: 2017-02-13
accepted date: 2017-02-13
in scheme: emissions_variables_MMR

2.F.1.e [Mobile Air-Conditioning][no classification][Emissions][C4F10][t][From stocks][no method][no target][no option][no type]
type: Concept
definition: 2.F.1.e [Mobile Air-Conditioning][no classification][Emissions][C4F10][t][From stocks][no method][no target][no option][no type]
status: valid
status modified: 2017-02-13
accepted date: 2017-02-13
in scheme: emissions_variables_MMR

2.F.1.e [Mobile Air-Conditioning][no classification][Emissions][C4F10][t][no source][no method][no target][no option][no type]
type: Concept
definition: 2.F.1.e [Mobile Air-Conditioning][no classification][Emissions][C4F10][t][no source][no method][no target][no option][no type]
status: valid
status modified: 2017-02-13
accepted date: 2017-02-13
in scheme: emissions_variables_MMR

2.F.1.e [Mobile Air-Conditioning][no classification][Emissions][C5F12][t][From disposal][no method][no target][no option][no type]
type: Concept
definition: 2.F.1.e [Mobile Air-Conditioning][no classification][Emissions][C5F12][t][From disposal][no method][no target][no option][no type]
status: valid
status modified: 2017-02-13
accepted date: 2017-02-13
in scheme: emissions_variables_MMR

2.F.1.e [Mobile Air-Conditioning][no classification][Emissions][C5F12][t][From manufacturing][no method][no target][no option][no type]
type: Concept
definition: 2.F.1.e [Mobile Air-Conditioning][no classification][Emissions][C5F12][t][From manufacturing][no method][no target][no option][no type]
status: valid
status modified: 2017-02-13
accepted date: 2017-02-13
in scheme: emissions_variables_MMR

2.F.1.e [Mobile Air-Conditioning][no classification][Emissions][C5F12][t][From stocks][no method][no target][no option][no type]
type: Concept
definition: 2.F.1.e [Mobile Air-Conditioning][no classification][Emissions][C5F12][t][From stocks][no method][no target][no option][no type]
status: valid
status modified: 2017-02-13
accepted date: 2017-02-13
in scheme: emissions_variables_MMR

2.F.1.e [Mobile Air-Conditioning][no classification][Emissions][C5F12][t][no source][no method][no target][no option][no type]
type: Concept
definition: 2.F.1.e [Mobile Air-Conditioning][no classification][Emissions][C5F12][t][no source][no method][no target][no option][no type]
status: valid
status modified: 2017-02-13
accepted date: 2017-02-13
in scheme: emissions_variables_MMR

2.F.1.e [Mobile Air-Conditioning][no classification][Emissions][C6F14][t][From disposal][no method][no target][no option][no type]
type: Concept
definition: 2.F.1.e [Mobile Air-Conditioning][no classification][Emissions][C6F14][t][From disposal][no method][no target][no option][no type]
status: valid
status modified: 2017-02-13
accepted date: 2017-02-13
in scheme: emissions_variables_MMR

2.F.1.e [Mobile Air-Conditioning][no classification][Emissions][C6F14][t][From manufacturing][no method][no target][no option][no type]
type: Concept
definition: 2.F.1.e [Mobile Air-Conditioning][no classification][Emissions][C6F14][t][From manufacturing][no method][no target][no option][no type]
status: valid
status modified: 2017-02-13
accepted date: 2017-02-13
in scheme: emissions_variables_MMR

2.F.1.e [Mobile Air-Conditioning][no classification][Emissions][C6F14][t][From stocks][no method][no target][no option][no type]
type: Concept
definition: 2.F.1.e [Mobile Air-Conditioning][no classification][Emissions][C6F14][t][From stocks][no method][no target][no option][no type]
status: valid
status modified: 2017-02-13
accepted date: 2017-02-13
in scheme: emissions_variables_MMR

2.F.1.e [Mobile Air-Conditioning][no classification][Emissions][C6F14][t][no source][no method][no target][no option][no type]
type: Concept
definition: 2.F.1.e [Mobile Air-Conditioning][no classification][Emissions][C6F14][t][no source][no method][no target][no option][no type]
status: valid
status modified: 2017-02-13
accepted date: 2017-02-13
in scheme: emissions_variables_MMR

2.F.1.e [Mobile Air-Conditioning][no classification][Emissions][c-C3F6][t][From disposal][no method][no target][no option][no type]
type: Concept
definition: 2.F.1.e [Mobile Air-Conditioning][no classification][Emissions][c-C3F6][t][From disposal][no method][no target][no option][no type]
status: valid
status modified: 2017-02-13
accepted date: 2017-02-13
in scheme: emissions_variables_MMR

2.F.1.e [Mobile Air-Conditioning][no classification][Emissions][c-C3F6][t][From manufacturing][no method][no target][no option][no type]
type: Concept
definition: 2.F.1.e [Mobile Air-Conditioning][no classification][Emissions][c-C3F6][t][From manufacturing][no method][no target][no option][no type]
status: valid
status modified: 2017-02-13
accepted date: 2017-02-13
in scheme: emissions_variables_MMR

2.F.1.e [Mobile Air-Conditioning][no classification][Emissions][c-C3F6][t][From stocks][no method][no target][no option][no type]
type: Concept
definition: 2.F.1.e [Mobile Air-Conditioning][no classification][Emissions][c-C3F6][t][From stocks][no method][no target][no option][no type]
status: valid
status modified: 2017-02-13
accepted date: 2017-02-13
in scheme: emissions_variables_MMR

2.F.1.e [Mobile Air-Conditioning][no classification][Emissions][c-C3F6][t][no source][no method][no target][no option][no type]
type: Concept
definition: 2.F.1.e [Mobile Air-Conditioning][no classification][Emissions][c-C3F6][t][no source][no method][no target][no option][no type]
status: valid
status modified: 2017-02-13
accepted date: 2017-02-13
in scheme: emissions_variables_MMR

2.F.1.e [Mobile Air-Conditioning][no classification][Emissions][c-C4F8][t][From disposal][no method][no target][no option][no type]
type: Concept
definition: 2.F.1.e [Mobile Air-Conditioning][no classification][Emissions][c-C4F8][t][From disposal][no method][no target][no option][no type]
status: valid
status modified: 2017-02-13
accepted date: 2017-02-13
in scheme: emissions_variables_MMR

2.F.1.e [Mobile Air-Conditioning][no classification][Emissions][c-C4F8][t][From manufacturing][no method][no target][no option][no type]
type: Concept
definition: 2.F.1.e [Mobile Air-Conditioning][no classification][Emissions][c-C4F8][t][From manufacturing][no method][no target][no option][no type]
status: valid
status modified: 2017-02-13
accepted date: 2017-02-13
in scheme: emissions_variables_MMR

2.F.1.e [Mobile Air-Conditioning][no classification][Emissions][c-C4F8][t][From stocks][no method][no target][no option][no type]
type: Concept
definition: 2.F.1.e [Mobile Air-Conditioning][no classification][Emissions][c-C4F8][t][From stocks][no method][no target][no option][no type]
status: valid
status modified: 2017-02-13
accepted date: 2017-02-13
in scheme: emissions_variables_MMR

2.F.1.e [Mobile Air-Conditioning][no classification][Emissions][c-C4F8][t][no source][no method][no target][no option][no type]
type: Concept
definition: 2.F.1.e [Mobile Air-Conditioning][no classification][Emissions][c-C4F8][t][no source][no method][no target][no option][no type]
status: valid
status modified: 2017-02-13
accepted date: 2017-02-13
in scheme: emissions_variables_MMR

2.F.1.e [Mobile Air-Conditioning][no classification][Emissions][CF4][t][From disposal][no method][no target][no option][no type]
type: Concept
definition: 2.F.1.e [Mobile Air-Conditioning][no classification][Emissions][CF4][t][From disposal][no method][no target][no option][no type]
status: valid
status modified: 2017-02-13
accepted date: 2017-02-13
in scheme: emissions_variables_MMR

2.F.1.e [Mobile Air-Conditioning][no classification][Emissions][CF4][t][From manufacturing][no method][no target][no option][no type]
type: Concept
definition: 2.F.1.e [Mobile Air-Conditioning][no classification][Emissions][CF4][t][From manufacturing][no method][no target][no option][no type]
status: valid
status modified: 2017-02-13
accepted date: 2017-02-13
in scheme: emissions_variables_MMR

2.F.1.e [Mobile Air-Conditioning][no classification][Emissions][CF4][t][From stocks][no method][no target][no option][no type]
type: Concept
definition: 2.F.1.e [Mobile Air-Conditioning][no classification][Emissions][CF4][t][From stocks][no method][no target][no option][no type]
status: valid
status modified: 2017-02-13
accepted date: 2017-02-13
in scheme: emissions_variables_MMR

2.F.1.e [Mobile Air-Conditioning][no classification][Emissions][CF4][t][no source][no method][no target][no option][no type]
type: Concept
definition: 2.F.1.e [Mobile Air-Conditioning][no classification][Emissions][CF4][t][no source][no method][no target][no option][no type]
status: valid
status modified: 2017-02-13
accepted date: 2017-02-13
in scheme: emissions_variables_MMR

2.F.1.e [Mobile Air-Conditioning][no classification][Emissions][HFC-125][t][From disposal][no method][no target][no option][no type]
type: Concept
definition: 2.F.1.e [Mobile Air-Conditioning][no classification][Emissions][HFC-125][t][From disposal][no method][no target][no option][no type]
status: valid
status modified: 2017-02-13
accepted date: 2017-02-13
in scheme: emissions_variables_MMR

2.F.1.e [Mobile Air-Conditioning][no classification][Emissions][HFC-125][t][From manufacturing][no method][no target][no option][no type]
type: Concept
definition: 2.F.1.e [Mobile Air-Conditioning][no classification][Emissions][HFC-125][t][From manufacturing][no method][no target][no option][no type]
status: valid
status modified: 2017-02-13
accepted date: 2017-02-13
in scheme: emissions_variables_MMR

2.F.1.e [Mobile Air-Conditioning][no classification][Emissions][HFC-125][t][From stocks][no method][no target][no option][no type]
type: Concept
definition: 2.F.1.e [Mobile Air-Conditioning][no classification][Emissions][HFC-125][t][From stocks][no method][no target][no option][no type]
status: valid
status modified: 2017-02-13
accepted date: 2017-02-13
in scheme: emissions_variables_MMR

2.F.1.e [Mobile Air-Conditioning][no classification][Emissions][HFC-125][t][no source][no method][no target][no option][no type]
type: Concept
definition: 2.F.1.e [Mobile Air-Conditioning][no classification][Emissions][HFC-125][t][no source][no method][no target][no option][no type]
status: valid
status modified: 2017-02-13
accepted date: 2017-02-13
in scheme: emissions_variables_MMR

2.F.1.e [Mobile Air-Conditioning][no classification][Emissions][HFC-134][t][From disposal][no method][no target][no option][no type]
type: Concept
definition: 2.F.1.e [Mobile Air-Conditioning][no classification][Emissions][HFC-134][t][From disposal][no method][no target][no option][no type]
status: valid
status modified: 2017-02-13
accepted date: 2017-02-13
in scheme: emissions_variables_MMR

2.F.1.e [Mobile Air-Conditioning][no classification][Emissions][HFC-134][t][From manufacturing][no method][no target][no option][no type]
type: Concept
definition: 2.F.1.e [Mobile Air-Conditioning][no classification][Emissions][HFC-134][t][From manufacturing][no method][no target][no option][no type]
status: valid
status modified: 2017-02-13
accepted date: 2017-02-13
in scheme: emissions_variables_MMR

2.F.1.e [Mobile Air-Conditioning][no classification][Emissions][HFC-134][t][From stocks][no method][no target][no option][no type]
type: Concept
definition: 2.F.1.e [Mobile Air-Conditioning][no classification][Emissions][HFC-134][t][From stocks][no method][no target][no option][no type]
status: valid
status modified: 2017-02-13
accepted date: 2017-02-13
in scheme: emissions_variables_MMR

2.F.1.e [Mobile Air-Conditioning][no classification][Emissions][HFC-134][t][no source][no method][no target][no option][no type]
type: Concept
definition: 2.F.1.e [Mobile Air-Conditioning][no classification][Emissions][HFC-134][t][no source][no method][no target][no option][no type]
status: valid
status modified: 2017-02-13
accepted date: 2017-02-13
in scheme: emissions_variables_MMR

2.F.1.e [Mobile Air-Conditioning][no classification][Emissions][HFC-134a][t][From disposal][no method][no target][no option][no type]
type: Concept
definition: 2.F.1.e [Mobile Air-Conditioning][no classification][Emissions][HFC-134a][t][From disposal][no method][no target][no option][no type]
status: valid
status modified: 2017-02-13
accepted date: 2017-02-13
in scheme: emissions_variables_MMR

2.F.1.e [Mobile Air-Conditioning][no classification][Emissions][HFC-134a][t][From manufacturing][no method][no target][no option][no type]
type: Concept
definition: 2.F.1.e [Mobile Air-Conditioning][no classification][Emissions][HFC-134a][t][From manufacturing][no method][no target][no option][no type]
status: valid
status modified: 2017-02-13
accepted date: 2017-02-13
in scheme: emissions_variables_MMR

2.F.1.e [Mobile Air-Conditioning][no classification][Emissions][HFC-134a][t][From stocks][no method][no target][no option][no type]
type: Concept
definition: 2.F.1.e [Mobile Air-Conditioning][no classification][Emissions][HFC-134a][t][From stocks][no method][no target][no option][no type]
status: valid
status modified: 2017-02-13
accepted date: 2017-02-13
in scheme: emissions_variables_MMR

2.F.1.e [Mobile Air-Conditioning][no classification][Emissions][HFC-134a][t][no source][no method][no target][no option][no type]
type: Concept
definition: 2.F.1.e [Mobile Air-Conditioning][no classification][Emissions][HFC-134a][t][no source][no method][no target][no option][no type]
status: valid
status modified: 2017-02-13
accepted date: 2017-02-13
in scheme: emissions_variables_MMR

2.F.1.e [Mobile Air-Conditioning][no classification][Emissions][HFC-143][t][From disposal][no method][no target][no option][no type]
type: Concept
definition: 2.F.1.e [Mobile Air-Conditioning][no classification][Emissions][HFC-143][t][From disposal][no method][no target][no option][no type]
status: valid
status modified: 2017-02-13
accepted date: 2017-02-13
in scheme: emissions_variables_MMR

2.F.1.e [Mobile Air-Conditioning][no classification][Emissions][HFC-143][t][From manufacturing][no method][no target][no option][no type]
type: Concept
definition: 2.F.1.e [Mobile Air-Conditioning][no classification][Emissions][HFC-143][t][From manufacturing][no method][no target][no option][no type]
status: valid
status modified: 2017-02-13
accepted date: 2017-02-13
in scheme: emissions_variables_MMR

2.F.1.e [Mobile Air-Conditioning][no classification][Emissions][HFC-143][t][From stocks][no method][no target][no option][no type]
type: Concept
definition: 2.F.1.e [Mobile Air-Conditioning][no classification][Emissions][HFC-143][t][From stocks][no method][no target][no option][no type]
status: valid
status modified: 2017-02-13
accepted date: 2017-02-13
in scheme: emissions_variables_MMR

2.F.1.e [Mobile Air-Conditioning][no classification][Emissions][HFC-143][t][no source][no method][no target][no option][no type]
type: Concept
definition: 2.F.1.e [Mobile Air-Conditioning][no classification][Emissions][HFC-143][t][no source][no method][no target][no option][no type]
status: valid
status modified: 2017-02-13
accepted date: 2017-02-13
in scheme: emissions_variables_MMR

2.F.1.e [Mobile Air-Conditioning][no classification][Emissions][HFC-143a][t][From disposal][no method][no target][no option][no type]
type: Concept
definition: 2.F.1.e [Mobile Air-Conditioning][no classification][Emissions][HFC-143a][t][From disposal][no method][no target][no option][no type]
status: valid
status modified: 2017-02-13
accepted date: 2017-02-13
in scheme: emissions_variables_MMR

2.F.1.e [Mobile Air-Conditioning][no classification][Emissions][HFC-143a][t][From manufacturing][no method][no target][no option][no type]
type: Concept
definition: 2.F.1.e [Mobile Air-Conditioning][no classification][Emissions][HFC-143a][t][From manufacturing][no method][no target][no option][no type]
status: valid
status modified: 2017-02-13
accepted date: 2017-02-13
in scheme: emissions_variables_MMR

2.F.1.e [Mobile Air-Conditioning][no classification][Emissions][HFC-143a][t][From stocks][no method][no target][no option][no type]
type: Concept
definition: 2.F.1.e [Mobile Air-Conditioning][no classification][Emissions][HFC-143a][t][From stocks][no method][no target][no option][no type]
status: valid
status modified: 2017-02-13
accepted date: 2017-02-13
in scheme: emissions_variables_MMR

2.F.1.e [Mobile Air-Conditioning][no classification][Emissions][HFC-143a][t][no source][no method][no target][no option][no type]
type: Concept
definition: 2.F.1.e [Mobile Air-Conditioning][no classification][Emissions][HFC-143a][t][no source][no method][no target][no option][no type]
status: valid
status modified: 2017-02-13
accepted date: 2017-02-13
in scheme: emissions_variables_MMR

2.F.1.e [Mobile Air-Conditioning][no classification][Emissions][HFC-152][t][From disposal][no method][no target][no option][no type]
type: Concept
definition: 2.F.1.e [Mobile Air-Conditioning][no classification][Emissions][HFC-152][t][From disposal][no method][no target][no option][no type]
status: valid
status modified: 2017-02-13
accepted date: 2017-02-13
in scheme: emissions_variables_MMR

2.F.1.e [Mobile Air-Conditioning][no classification][Emissions][HFC-152][t][From manufacturing][no method][no target][no option][no type]
type: Concept
definition: 2.F.1.e [Mobile Air-Conditioning][no classification][Emissions][HFC-152][t][From manufacturing][no method][no target][no option][no type]
status: valid
status modified: 2017-02-13
accepted date: 2017-02-13
in scheme: emissions_variables_MMR

2.F.1.e [Mobile Air-Conditioning][no classification][Emissions][HFC-152][t][From stocks][no method][no target][no option][no type]
type: Concept
definition: 2.F.1.e [Mobile Air-Conditioning][no classification][Emissions][HFC-152][t][From stocks][no method][no target][no option][no type]
status: valid
status modified: 2017-02-13
accepted date: 2017-02-13
in scheme: emissions_variables_MMR

2.F.1.e [Mobile Air-Conditioning][no classification][Emissions][HFC-152][t][no source][no method][no target][no option][no type]
type: Concept
definition: 2.F.1.e [Mobile Air-Conditioning][no classification][Emissions][HFC-152][t][no source][no method][no target][no option][no type]
status: valid
status modified: 2017-02-13
accepted date: 2017-02-13
in scheme: emissions_variables_MMR

2.F.1.e [Mobile Air-Conditioning][no classification][Emissions][HFC-152a][t][From disposal][no method][no target][no option][no type]
type: Concept
definition: 2.F.1.e [Mobile Air-Conditioning][no classification][Emissions][HFC-152a][t][From disposal][no method][no target][no option][no type]
status: valid
status modified: 2017-02-13
accepted date: 2017-02-13
in scheme: emissions_variables_MMR

2.F.1.e [Mobile Air-Conditioning][no classification][Emissions][HFC-152a][t][From manufacturing][no method][no target][no option][no type]
type: Concept
definition: 2.F.1.e [Mobile Air-Conditioning][no classification][Emissions][HFC-152a][t][From manufacturing][no method][no target][no option][no type]
status: valid
status modified: 2017-02-13
accepted date: 2017-02-13
in scheme: emissions_variables_MMR

2.F.1.e [Mobile Air-Conditioning][no classification][Emissions][HFC-152a][t][From stocks][no method][no target][no option][no type]
type: Concept
definition: 2.F.1.e [Mobile Air-Conditioning][no classification][Emissions][HFC-152a][t][From stocks][no method][no target][no option][no type]
status: valid
status modified: 2017-02-13
accepted date: 2017-02-13
in scheme: emissions_variables_MMR

2.F.1.e [Mobile Air-Conditioning][no classification][Emissions][HFC-152a][t][no source][no method][no target][no option][no type]
type: Concept
definition: 2.F.1.e [Mobile Air-Conditioning][no classification][Emissions][HFC-152a][t][no source][no method][no target][no option][no type]
status: valid
status modified: 2017-02-13
accepted date: 2017-02-13
in scheme: emissions_variables_MMR

2.F.1.e [Mobile Air-Conditioning][no classification][Emissions][HFC-161][t][From disposal][no method][no target][no option][no type]
type: Concept
definition: 2.F.1.e [Mobile Air-Conditioning][no classification][Emissions][HFC-161][t][From disposal][no method][no target][no option][no type]
status: valid
status modified: 2017-02-13
accepted date: 2017-02-13
in scheme: emissions_variables_MMR

2.F.1.e [Mobile Air-Conditioning][no classification][Emissions][HFC-161][t][From manufacturing][no method][no target][no option][no type]
type: Concept
definition: 2.F.1.e [Mobile Air-Conditioning][no classification][Emissions][HFC-161][t][From manufacturing][no method][no target][no option][no type]
status: valid
status modified: 2017-02-13
accepted date: 2017-02-13
in scheme: emissions_variables_MMR

2.F.1.e [Mobile Air-Conditioning][no classification][Emissions][HFC-161][t][From stocks][no method][no target][no option][no type]
type: Concept
definition: 2.F.1.e [Mobile Air-Conditioning][no classification][Emissions][HFC-161][t][From stocks][no method][no target][no option][no type]
status: valid
status modified: 2017-02-13
accepted date: 2017-02-13
in scheme: emissions_variables_MMR

2.F.1.e [Mobile Air-Conditioning][no classification][Emissions][HFC-161][t][no source][no method][no target][no option][no type]
type: Concept
definition: 2.F.1.e [Mobile Air-Conditioning][no classification][Emissions][HFC-161][t][no source][no method][no target][no option][no type]
status: valid
status modified: 2017-02-13
accepted date: 2017-02-13
in scheme: emissions_variables_MMR

2.F.1.e [Mobile Air-Conditioning][no classification][Emissions][HFC-227ea][t][From disposal][no method][no target][no option][no type]
type: Concept
definition: 2.F.1.e [Mobile Air-Conditioning][no classification][Emissions][HFC-227ea][t][From disposal][no method][no target][no option][no type]
status: valid
status modified: 2017-02-13
accepted date: 2017-02-13
in scheme: emissions_variables_MMR

2.F.1.e [Mobile Air-Conditioning][no classification][Emissions][HFC-227ea][t][From manufacturing][no method][no target][no option][no type]
type: Concept
definition: 2.F.1.e [Mobile Air-Conditioning][no classification][Emissions][HFC-227ea][t][From manufacturing][no method][no target][no option][no type]
status: valid
status modified: 2017-02-13
accepted date: 2017-02-13
in scheme: emissions_variables_MMR

2.F.1.e [Mobile Air-Conditioning][no classification][Emissions][HFC-227ea][t][From stocks][no method][no target][no option][no type]
type: Concept
definition: 2.F.1.e [Mobile Air-Conditioning][no classification][Emissions][HFC-227ea][t][From stocks][no method][no target][no option][no type]
status: valid
status modified: 2017-02-13
accepted date: 2017-02-13
in scheme: emissions_variables_MMR

2.F.1.e [Mobile Air-Conditioning][no classification][Emissions][HFC-227ea][t][no source][no method][no target][no option][no type]
type: Concept
definition: 2.F.1.e [Mobile Air-Conditioning][no classification][Emissions][HFC-227ea][t][no source][no method][no target][no option][no type]
status: valid
status modified: 2017-02-13
accepted date: 2017-02-13
in scheme: emissions_variables_MMR

2.F.1.e [Mobile Air-Conditioning][no classification][Emissions][HFC-23][t][From disposal][no method][no target][no option][no type]
type: Concept
definition: 2.F.1.e [Mobile Air-Conditioning][no classification][Emissions][HFC-23][t][From disposal][no method][no target][no option][no type]
status: valid
status modified: 2017-02-13
accepted date: 2017-02-13
in scheme: emissions_variables_MMR

2.F.1.e [Mobile Air-Conditioning][no classification][Emissions][HFC-23][t][From manufacturing][no method][no target][no option][no type]
type: Concept
definition: 2.F.1.e [Mobile Air-Conditioning][no classification][Emissions][HFC-23][t][From manufacturing][no method][no target][no option][no type]
status: valid
status modified: 2017-02-13
accepted date: 2017-02-13
in scheme: emissions_variables_MMR

2.F.1.e [Mobile Air-Conditioning][no classification][Emissions][HFC-23][t][From stocks][no method][no target][no option][no type]
type: Concept
definition: 2.F.1.e [Mobile Air-Conditioning][no classification][Emissions][HFC-23][t][From stocks][no method][no target][no option][no type]
status: valid
status modified: 2017-02-13
accepted date: 2017-02-13
in scheme: emissions_variables_MMR

2.F.1.e [Mobile Air-Conditioning][no classification][Emissions][HFC-23][t][no source][no method][no target][no option][no type]
type: Concept
definition: 2.F.1.e [Mobile Air-Conditioning][no classification][Emissions][HFC-23][t][no source][no method][no target][no option][no type]
status: valid
status modified: 2017-02-13
accepted date: 2017-02-13
in scheme: emissions_variables_MMR

2.F.1.e [Mobile Air-Conditioning][no classification][Emissions][HFC-236cb][t][From disposal][no method][no target][no option][no type]
type: Concept
definition: 2.F.1.e [Mobile Air-Conditioning][no classification][Emissions][HFC-236cb][t][From disposal][no method][no target][no option][no type]
status: valid
status modified: 2017-02-13
accepted date: 2017-02-13
in scheme: emissions_variables_MMR

2.F.1.e [Mobile Air-Conditioning][no classification][Emissions][HFC-236cb][t][From manufacturing][no method][no target][no option][no type]
type: Concept
definition: 2.F.1.e [Mobile Air-Conditioning][no classification][Emissions][HFC-236cb][t][From manufacturing][no method][no target][no option][no type]
status: valid
status modified: 2017-02-13
accepted date: 2017-02-13
in scheme: emissions_variables_MMR

2.F.1.e [Mobile Air-Conditioning][no classification][Emissions][HFC-236cb][t][From stocks][no method][no target][no option][no type]
type: Concept
definition: 2.F.1.e [Mobile Air-Conditioning][no classification][Emissions][HFC-236cb][t][From stocks][no method][no target][no option][no type]
status: valid
status modified: 2017-02-13
accepted date: 2017-02-13
in scheme: emissions_variables_MMR

2.F.1.e [Mobile Air-Conditioning][no classification][Emissions][HFC-236cb][t][no source][no method][no target][no option][no type]
type: Concept
definition: 2.F.1.e [Mobile Air-Conditioning][no classification][Emissions][HFC-236cb][t][no source][no method][no target][no option][no type]
status: valid
status modified: 2017-02-13
accepted date: 2017-02-13
in scheme: emissions_variables_MMR

2.F.1.e [Mobile Air-Conditioning][no classification][Emissions][HFC-236ea][t][From disposal][no method][no target][no option][no type]
type: Concept
definition: 2.F.1.e [Mobile Air-Conditioning][no classification][Emissions][HFC-236ea][t][From disposal][no method][no target][no option][no type]
status: valid
status modified: 2017-02-13
accepted date: 2017-02-13
in scheme: emissions_variables_MMR

2.F.1.e [Mobile Air-Conditioning][no classification][Emissions][HFC-236ea][t][From manufacturing][no method][no target][no option][no type]
type: Concept
definition: 2.F.1.e [Mobile Air-Conditioning][no classification][Emissions][HFC-236ea][t][From manufacturing][no method][no target][no option][no type]
status: valid
status modified: 2017-02-13
accepted date: 2017-02-13
in scheme: emissions_variables_MMR

2.F.1.e [Mobile Air-Conditioning][no classification][Emissions][HFC-236ea][t][From stocks][no method][no target][no option][no type]
type: Concept
definition: 2.F.1.e [Mobile Air-Conditioning][no classification][Emissions][HFC-236ea][t][From stocks][no method][no target][no option][no type]
status: valid
status modified: 2017-02-13
accepted date: 2017-02-13
in scheme: emissions_variables_MMR

2.F.1.e [Mobile Air-Conditioning][no classification][Emissions][HFC-236ea][t][no source][no method][no target][no option][no type]
type: Concept
definition: 2.F.1.e [Mobile Air-Conditioning][no classification][Emissions][HFC-236ea][t][no source][no method][no target][no option][no type]
status: valid
status modified: 2017-02-13
accepted date: 2017-02-13
in scheme: emissions_variables_MMR

2.F.1.e [Mobile Air-Conditioning][no classification][Emissions][HFC-236fa][t][From disposal][no method][no target][no option][no type]
type: Concept
definition: 2.F.1.e [Mobile Air-Conditioning][no classification][Emissions][HFC-236fa][t][From disposal][no method][no target][no option][no type]
status: valid
status modified: 2017-02-13
accepted date: 2017-02-13
in scheme: emissions_variables_MMR

2.F.1.e [Mobile Air-Conditioning][no classification][Emissions][HFC-236fa][t][From manufacturing][no method][no target][no option][no type]
type: Concept
definition: 2.F.1.e [Mobile Air-Conditioning][no classification][Emissions][HFC-236fa][t][From manufacturing][no method][no target][no option][no type]
status: valid
status modified: 2017-02-13
accepted date: 2017-02-13
in scheme: emissions_variables_MMR

2.F.1.e [Mobile Air-Conditioning][no classification][Emissions][HFC-236fa][t][From stocks][no method][no target][no option][no type]
type: Concept
definition: 2.F.1.e [Mobile Air-Conditioning][no classification][Emissions][HFC-236fa][t][From stocks][no method][no target][no option][no type]
status: valid
status modified: 2017-02-13
accepted date: 2017-02-13
in scheme: emissions_variables_MMR

2.F.1.e [Mobile Air-Conditioning][no classification][Emissions][HFC-236fa][t][no source][no method][no target][no option][no type]
type: Concept
definition: 2.F.1.e [Mobile Air-Conditioning][no classification][Emissions][HFC-236fa][t][no source][no method][no target][no option][no type]
status: valid
status modified: 2017-02-13
accepted date: 2017-02-13
in scheme: emissions_variables_MMR

2.F.1.e [Mobile Air-Conditioning][no classification][Emissions][HFC-245ca][t][From disposal][no method][no target][no option][no type]
type: Concept
definition: 2.F.1.e [Mobile Air-Conditioning][no classification][Emissions][HFC-245ca][t][From disposal][no method][no target][no option][no type]
status: valid
status modified: 2017-02-13
accepted date: 2017-02-13
in scheme: emissions_variables_MMR

2.F.1.e [Mobile Air-Conditioning][no classification][Emissions][HFC-245ca][t][From manufacturing][no method][no target][no option][no type]
type: Concept
definition: 2.F.1.e [Mobile Air-Conditioning][no classification][Emissions][HFC-245ca][t][From manufacturing][no method][no target][no option][no type]
status: valid
status modified: 2017-02-13
accepted date: 2017-02-13
in scheme: emissions_variables_MMR

2.F.1.e [Mobile Air-Conditioning][no classification][Emissions][HFC-245ca][t][From stocks][no method][no target][no option][no type]
type: Concept
definition: 2.F.1.e [Mobile Air-Conditioning][no classification][Emissions][HFC-245ca][t][From stocks][no method][no target][no option][no type]
status: valid
status modified: 2017-02-13
accepted date: 2017-02-13
in scheme: emissions_variables_MMR

2.F.1.e [Mobile Air-Conditioning][no classification][Emissions][HFC-245ca][t][no source][no method][no target][no option][no type]
type: Concept
definition: 2.F.1.e [Mobile Air-Conditioning][no classification][Emissions][HFC-245ca][t][no source][no method][no target][no option][no type]
status: valid
status modified: 2017-02-13
accepted date: 2017-02-13
in scheme: emissions_variables_MMR

2.F.1.e [Mobile Air-Conditioning][no classification][Emissions][HFC-245fa][t][From disposal][no method][no target][no option][no type]
type: Concept
definition: 2.F.1.e [Mobile Air-Conditioning][no classification][Emissions][HFC-245fa][t][From disposal][no method][no target][no option][no type]
status: valid
status modified: 2017-02-13
accepted date: 2017-02-13
in scheme: emissions_variables_MMR

2.F.1.e [Mobile Air-Conditioning][no classification][Emissions][HFC-245fa][t][From manufacturing][no method][no target][no option][no type]
type: Concept
definition: 2.F.1.e [Mobile Air-Conditioning][no classification][Emissions][HFC-245fa][t][From manufacturing][no method][no target][no option][no type]
status: valid
status modified: 2017-02-13
accepted date: 2017-02-13
in scheme: emissions_variables_MMR

2.F.1.e [Mobile Air-Conditioning][no classification][Emissions][HFC-245fa][t][From stocks][no method][no target][no option][no type]
type: Concept
definition: 2.F.1.e [Mobile Air-Conditioning][no classification][Emissions][HFC-245fa][t][From stocks][no method][no target][no option][no type]
status: valid
status modified: 2017-02-13
accepted date: 2017-02-13
in scheme: emissions_variables_MMR

2.F.1.e [Mobile Air-Conditioning][no classification][Emissions][HFC-245fa][t][no source][no method][no target][no option][no type]
type: Concept
definition: 2.F.1.e [Mobile Air-Conditioning][no classification][Emissions][HFC-245fa][t][no source][no method][no target][no option][no type]
status: valid
status modified: 2017-02-13
accepted date: 2017-02-13
in scheme: emissions_variables_MMR

2.F.1.e [Mobile Air-Conditioning][no classification][Emissions][HFC-32][t][From disposal][no method][no target][no option][no type]
type: Concept
definition: 2.F.1.e [Mobile Air-Conditioning][no classification][Emissions][HFC-32][t][From disposal][no method][no target][no option][no type]
status: valid
status modified: 2017-02-13
accepted date: 2017-02-13
in scheme: emissions_variables_MMR

2.F.1.e [Mobile Air-Conditioning][no classification][Emissions][HFC-32][t][From manufacturing][no method][no target][no option][no type]
type: Concept
definition: 2.F.1.e [Mobile Air-Conditioning][no classification][Emissions][HFC-32][t][From manufacturing][no method][no target][no option][no type]
status: valid
status modified: 2017-02-13
accepted date: 2017-02-13
in scheme: emissions_variables_MMR

2.F.1.e [Mobile Air-Conditioning][no classification][Emissions][HFC-32][t][From stocks][no method][no target][no option][no type]
type: Concept
definition: 2.F.1.e [Mobile Air-Conditioning][no classification][Emissions][HFC-32][t][From stocks][no method][no target][no option][no type]
status: valid
status modified: 2017-02-13
accepted date: 2017-02-13
in scheme: emissions_variables_MMR

2.F.1.e [Mobile Air-Conditioning][no classification][Emissions][HFC-32][t][no source][no method][no target][no option][no type]
type: Concept
definition: 2.F.1.e [Mobile Air-Conditioning][no classification][Emissions][HFC-32][t][no source][no method][no target][no option][no type]
status: valid
status modified: 2017-02-13
accepted date: 2017-02-13
in scheme: emissions_variables_MMR

2.F.1.e [Mobile Air-Conditioning][no classification][Emissions][HFC-365mfc][t][From disposal][no method][no target][no option][no type]
type: Concept
definition: 2.F.1.e [Mobile Air-Conditioning][no classification][Emissions][HFC-365mfc][t][From disposal][no method][no target][no option][no type]
status: valid
status modified: 2017-02-13
accepted date: 2017-02-13
in scheme: emissions_variables_MMR

2.F.1.e [Mobile Air-Conditioning][no classification][Emissions][HFC-365mfc][t][From manufacturing][no method][no target][no option][no type]
type: Concept
definition: 2.F.1.e [Mobile Air-Conditioning][no classification][Emissions][HFC-365mfc][t][From manufacturing][no method][no target][no option][no type]
status: valid
status modified: 2017-02-13
accepted date: 2017-02-13
in scheme: emissions_variables_MMR

2.F.1.e [Mobile Air-Conditioning][no classification][Emissions][HFC-365mfc][t][From stocks][no method][no target][no option][no type]
type: Concept
definition: 2.F.1.e [Mobile Air-Conditioning][no classification][Emissions][HFC-365mfc][t][From stocks][no method][no target][no option][no type]
status: valid
status modified: 2017-02-13
accepted date: 2017-02-13
in scheme: emissions_variables_MMR

2.F.1.e [Mobile Air-Conditioning][no classification][Emissions][HFC-365mfc][t][no source][no method][no target][no option][no type]
type: Concept
definition: 2.F.1.e [Mobile Air-Conditioning][no classification][Emissions][HFC-365mfc][t][no source][no method][no target][no option][no type]
status: valid
status modified: 2017-02-13
accepted date: 2017-02-13
in scheme: emissions_variables_MMR

2.F.1.e [Mobile Air-Conditioning][no classification][Emissions][HFC-41][t][From disposal][no method][no target][no option][no type]
type: Concept
definition: 2.F.1.e [Mobile Air-Conditioning][no classification][Emissions][HFC-41][t][From disposal][no method][no target][no option][no type]
status: valid
status modified: 2017-02-13
accepted date: 2017-02-13
in scheme: emissions_variables_MMR

2.F.1.e [Mobile Air-Conditioning][no classification][Emissions][HFC-41][t][From manufacturing][no method][no target][no option][no type]
type: Concept
definition: 2.F.1.e [Mobile Air-Conditioning][no classification][Emissions][HFC-41][t][From manufacturing][no method][no target][no option][no type]
status: valid
status modified: 2017-02-13
accepted date: 2017-02-13
in scheme: emissions_variables_MMR

2.F.1.e [Mobile Air-Conditioning][no classification][Emissions][HFC-41][t][From stocks][no method][no target][no option][no type]
type: Concept
definition: 2.F.1.e [Mobile Air-Conditioning][no classification][Emissions][HFC-41][t][From stocks][no method][no target][no option][no type]
status: valid
status modified: 2017-02-13
accepted date: 2017-02-13
in scheme: emissions_variables_MMR

2.F.1.e [Mobile Air-Conditioning][no classification][Emissions][HFC-41][t][no source][no method][no target][no option][no type]
type: Concept
definition: 2.F.1.e [Mobile Air-Conditioning][no classification][Emissions][HFC-41][t][no source][no method][no target][no option][no type]
status: valid
status modified: 2017-02-13
accepted date: 2017-02-13
in scheme: emissions_variables_MMR

2.F.1.e [Mobile Air-Conditioning][no classification][Emissions][HFC-43-10mee][t][From disposal][no method][no target][no option][no type]
type: Concept
definition: 2.F.1.e [Mobile Air-Conditioning][no classification][Emissions][HFC-43-10mee][t][From disposal][no method][no target][no option][no type]
status: valid
status modified: 2017-02-13
accepted date: 2017-02-13
in scheme: emissions_variables_MMR

2.F.1.e [Mobile Air-Conditioning][no classification][Emissions][HFC-43-10mee][t][From manufacturing][no method][no target][no option][no type]
type: Concept
definition: 2.F.1.e [Mobile Air-Conditioning][no classification][Emissions][HFC-43-10mee][t][From manufacturing][no method][no target][no option][no type]
status: valid
status modified: 2017-02-13
accepted date: 2017-02-13
in scheme: emissions_variables_MMR

2.F.1.e [Mobile Air-Conditioning][no classification][Emissions][HFC-43-10mee][t][From stocks][no method][no target][no option][no type]
type: Concept
definition: 2.F.1.e [Mobile Air-Conditioning][no classification][Emissions][HFC-43-10mee][t][From stocks][no method][no target][no option][no type]
status: valid
status modified: 2017-02-13
accepted date: 2017-02-13
in scheme: emissions_variables_MMR

2.F.1.e [Mobile Air-Conditioning][no classification][Emissions][HFC-43-10mee][t][no source][no method][no target][no option][no type]
type: Concept
definition: 2.F.1.e [Mobile Air-Conditioning][no classification][Emissions][HFC-43-10mee][t][no source][no method][no target][no option][no type]
status: valid
status modified: 2017-02-13
accepted date: 2017-02-13
in scheme: emissions_variables_MMR

2.F.1.e [Mobile Air-Conditioning][no classification][Emissions][HFCs and PFCs][t CO2 equivalent][no source][no method][no target][no option][no type]
type: Concept
definition: 2.F.1.e [Mobile Air-Conditioning][no classification][Emissions][HFCs and PFCs][t CO2 equivalent][no source][no method][no target][no option][no type]
status: valid
status modified: 2017-02-13
accepted date: 2017-02-13
in scheme: emissions_variables_MMR

2.F.1.e [Mobile Air-Conditioning][no classification][Emissions][HFCs][t CO2 equivalent][no source][no method][no target][no option][no type]
type: Concept
definition: 2.F.1.e [Mobile Air-Conditioning][no classification][Emissions][HFCs][t CO2 equivalent][no source][no method][no target][no option][no type]
status: valid
status modified: 2017-02-13
accepted date: 2017-02-13
in scheme: emissions_variables_MMR

2.F.1.e [Mobile Air-Conditioning][no classification][Emissions][NF3][t][From disposal][no method][no target][no option][no type]
type: Concept
definition: 2.F.1.e [Mobile Air-Conditioning][no classification][Emissions][NF3][t][From disposal][no method][no target][no option][no type]
status: valid
status modified: 2017-02-13
accepted date: 2017-02-13
in scheme: emissions_variables_MMR

2.F.1.e [Mobile Air-Conditioning][no classification][Emissions][NF3][t][From manufacturing][no method][no target][no option][no type]
type: Concept
definition: 2.F.1.e [Mobile Air-Conditioning][no classification][Emissions][NF3][t][From manufacturing][no method][no target][no option][no type]
status: valid
status modified: 2017-02-13
accepted date: 2017-02-13
in scheme: emissions_variables_MMR

2.F.1.e [Mobile Air-Conditioning][no classification][Emissions][NF3][t][From stocks][no method][no target][no option][no type]
type: Concept
definition: 2.F.1.e [Mobile Air-Conditioning][no classification][Emissions][NF3][t][From stocks][no method][no target][no option][no type]
status: valid
status modified: 2017-02-13
accepted date: 2017-02-13
in scheme: emissions_variables_MMR

2.F.1.e [Mobile Air-Conditioning][no classification][Emissions][NF3][t][no source][no method][no target][no option][no type]
type: Concept
definition: 2.F.1.e [Mobile Air-Conditioning][no classification][Emissions][NF3][t][no source][no method][no target][no option][no type]
status: valid
status modified: 2017-02-13
accepted date: 2017-02-13
in scheme: emissions_variables_MMR

2.F.1.e [Mobile Air-Conditioning][no classification][Emissions][PFCs][t CO2 equivalent][no source][no method][no target][no option][no type]
type: Concept
definition: 2.F.1.e [Mobile Air-Conditioning][no classification][Emissions][PFCs][t CO2 equivalent][no source][no method][no target][no option][no type]
status: valid
status modified: 2017-02-13
accepted date: 2017-02-13
in scheme: emissions_variables_MMR

2.F.1.e [Mobile Air-Conditioning][no classification][Emissions][SF6][t][From disposal][no method][no target][no option][no type]
type: Concept
definition: 2.F.1.e [Mobile Air-Conditioning][no classification][Emissions][SF6][t][From disposal][no method][no target][no option][no type]
status: valid
status modified: 2017-02-13
accepted date: 2017-02-13
in scheme: emissions_variables_MMR

2.F.1.e [Mobile Air-Conditioning][no classification][Emissions][SF6][t][From manufacturing][no method][no target][no option][no type]
type: Concept
definition: 2.F.1.e [Mobile Air-Conditioning][no classification][Emissions][SF6][t][From manufacturing][no method][no target][no option][no type]
status: valid
status modified: 2017-02-13
accepted date: 2017-02-13
in scheme: emissions_variables_MMR

2.F.1.e [Mobile Air-Conditioning][no classification][Emissions][SF6][t][From stocks][no method][no target][no option][no type]
type: Concept
definition: 2.F.1.e [Mobile Air-Conditioning][no classification][Emissions][SF6][t][From stocks][no method][no target][no option][no type]
status: valid
status modified: 2017-02-13
accepted date: 2017-02-13
in scheme: emissions_variables_MMR

2.F.1.e [Mobile Air-Conditioning][no classification][Emissions][SF6][t][no source][no method][no target][no option][no type]
type: Concept
definition: 2.F.1.e [Mobile Air-Conditioning][no classification][Emissions][SF6][t][no source][no method][no target][no option][no type]
status: valid
status modified: 2017-02-13
accepted date: 2017-02-13
in scheme: emissions_variables_MMR

2.F.1.e [Mobile Air-Conditioning][no classification][Emissions][Unspecified mix of HFCs and PFCs][t CO2 equivalent][From disposal][no method][no target][no option][no type]
type: Concept
definition: 2.F.1.e [Mobile Air-Conditioning][no classification][Emissions][Unspecified mix of HFCs and PFCs][t CO2 equivalent][From disposal][no method][no target][no option][no type]
status: valid
status modified: 2017-02-13
accepted date: 2017-02-13
in scheme: emissions_variables_MMR

2.F.1.e [Mobile Air-Conditioning][no classification][Emissions][Unspecified mix of HFCs and PFCs][t CO2 equivalent][From manufacturing][no method][no target][no option][no type]
type: Concept
definition: 2.F.1.e [Mobile Air-Conditioning][no classification][Emissions][Unspecified mix of HFCs and PFCs][t CO2 equivalent][From manufacturing][no method][no target][no option][no type]
status: valid
status modified: 2017-02-13
accepted date: 2017-02-13
in scheme: emissions_variables_MMR

2.F.1.e [Mobile Air-Conditioning][no classification][Emissions][Unspecified mix of HFCs and PFCs][t CO2 equivalent][From stocks][no method][no target][no option][no type]
type: Concept
definition: 2.F.1.e [Mobile Air-Conditioning][no classification][Emissions][Unspecified mix of HFCs and PFCs][t CO2 equivalent][From stocks][no method][no target][no option][no type]
status: valid
status modified: 2017-02-13
accepted date: 2017-02-13
in scheme: emissions_variables_MMR

2.F.1.e [Mobile Air-Conditioning][no classification][Emissions][Unspecified mix of HFCs and PFCs][t CO2 equivalent][no source][no method][no target][no option][no type]
type: Concept
definition: 2.F.1.e [Mobile Air-Conditioning][no classification][Emissions][Unspecified mix of HFCs and PFCs][t CO2 equivalent][no source][no method][no target][no option][no type]
status: valid
status modified: 2017-02-13
accepted date: 2017-02-13
in scheme: emissions_variables_MMR

2.F.1.e [Mobile Air-Conditioning][no classification][Emissions][Unspecified mix of HFCs][t CO2 equivalent][From disposal][no method][no target][no option][no type]
type: Concept
definition: 2.F.1.e [Mobile Air-Conditioning][no classification][Emissions][Unspecified mix of HFCs][t CO2 equivalent][From disposal][no method][no target][no option][no type]
status: valid
status modified: 2017-02-13
accepted date: 2017-02-13
in scheme: emissions_variables_MMR

2.F.1.e [Mobile Air-Conditioning][no classification][Emissions][Unspecified mix of HFCs][t CO2 equivalent][From manufacturing][no method][no target][no option][no type]
type: Concept
definition: 2.F.1.e [Mobile Air-Conditioning][no classification][Emissions][Unspecified mix of HFCs][t CO2 equivalent][From manufacturing][no method][no target][no option][no type]
status: valid
status modified: 2017-02-13
accepted date: 2017-02-13
in scheme: emissions_variables_MMR

2.F.1.e [Mobile Air-Conditioning][no classification][Emissions][Unspecified mix of HFCs][t CO2 equivalent][From stocks][no method][no target][no option][no type]
type: Concept
definition: 2.F.1.e [Mobile Air-Conditioning][no classification][Emissions][Unspecified mix of HFCs][t CO2 equivalent][From stocks][no method][no target][no option][no type]
status: valid
status modified: 2017-02-13
accepted date: 2017-02-13
in scheme: emissions_variables_MMR

2.F.1.e [Mobile Air-Conditioning][no classification][Emissions][Unspecified mix of HFCs][t CO2 equivalent][no source][no method][no target][no option][no type]
type: Concept
definition: 2.F.1.e [Mobile Air-Conditioning][no classification][Emissions][Unspecified mix of HFCs][t CO2 equivalent][no source][no method][no target][no option][no type]
status: valid
status modified: 2017-02-13
accepted date: 2017-02-13
in scheme: emissions_variables_MMR

2.F.1.e [Mobile Air-Conditioning][no classification][Emissions][Unspecified mix of PFCs][t CO2 equivalent][From disposal][no method][no target][no option][no type]
type: Concept
definition: 2.F.1.e [Mobile Air-Conditioning][no classification][Emissions][Unspecified mix of PFCs][t CO2 equivalent][From disposal][no method][no target][no option][no type]
status: valid
status modified: 2017-02-13
accepted date: 2017-02-13
in scheme: emissions_variables_MMR

2.F.1.e [Mobile Air-Conditioning][no classification][Emissions][Unspecified mix of PFCs][t CO2 equivalent][From manufacturing][no method][no target][no option][no type]
type: Concept
definition: 2.F.1.e [Mobile Air-Conditioning][no classification][Emissions][Unspecified mix of PFCs][t CO2 equivalent][From manufacturing][no method][no target][no option][no type]
status: valid
status modified: 2017-02-13
accepted date: 2017-02-13
in scheme: emissions_variables_MMR

2.F.1.e [Mobile Air-Conditioning][no classification][Emissions][Unspecified mix of PFCs][t CO2 equivalent][From stocks][no method][no target][no option][no type]
type: Concept
definition: 2.F.1.e [Mobile Air-Conditioning][no classification][Emissions][Unspecified mix of PFCs][t CO2 equivalent][From stocks][no method][no target][no option][no type]
status: valid
status modified: 2017-02-13
accepted date: 2017-02-13
in scheme: emissions_variables_MMR

2.F.1.e [Mobile Air-Conditioning][no classification][Emissions][Unspecified mix of PFCs][t CO2 equivalent][no source][no method][no target][no option][no type]
type: Concept
definition: 2.F.1.e [Mobile Air-Conditioning][no classification][Emissions][Unspecified mix of PFCs][t CO2 equivalent][no source][no method][no target][no option][no type]
status: valid
status modified: 2017-02-13
accepted date: 2017-02-13
in scheme: emissions_variables_MMR

2.F.1.f [Stationary Air-Conditioning][no classification][Emissions][Aggregate F-gases][t CO2 equivalent][no source][no method][no target][no option][no type]
type: Concept
definition: 2.F.1.f [Stationary Air-Conditioning][no classification][Emissions][Aggregate F-gases][t CO2 equivalent][no source][no method][no target][no option][no type]
status: valid
status modified: 2017-02-13
accepted date: 2017-02-13
in scheme: emissions_variables_MMR

2.F.1.f [Stationary Air-Conditioning][no classification][Emissions][C10F18][t][From disposal][no method][no target][no option][no type]
type: Concept
definition: 2.F.1.f [Stationary Air-Conditioning][no classification][Emissions][C10F18][t][From disposal][no method][no target][no option][no type]
status: valid
status modified: 2017-02-13
accepted date: 2017-02-13
in scheme: emissions_variables_MMR

2.F.1.f [Stationary Air-Conditioning][no classification][Emissions][C10F18][t][From manufacturing][no method][no target][no option][no type]
type: Concept
definition: 2.F.1.f [Stationary Air-Conditioning][no classification][Emissions][C10F18][t][From manufacturing][no method][no target][no option][no type]
status: valid
status modified: 2017-02-13
accepted date: 2017-02-13
in scheme: emissions_variables_MMR

2.F.1.f [Stationary Air-Conditioning][no classification][Emissions][C10F18][t][From stocks][no method][no target][no option][no type]
type: Concept
definition: 2.F.1.f [Stationary Air-Conditioning][no classification][Emissions][C10F18][t][From stocks][no method][no target][no option][no type]
status: valid
status modified: 2017-02-13
accepted date: 2017-02-13
in scheme: emissions_variables_MMR

2.F.1.f [Stationary Air-Conditioning][no classification][Emissions][C10F18][t][no source][no method][no target][no option][no type]
type: Concept
definition: 2.F.1.f [Stationary Air-Conditioning][no classification][Emissions][C10F18][t][no source][no method][no target][no option][no type]
status: valid
status modified: 2017-02-13
accepted date: 2017-02-13
in scheme: emissions_variables_MMR

2.F.1.f [Stationary Air-Conditioning][no classification][Emissions][C2F6][t][From disposal][no method][no target][no option][no type]
type: Concept
definition: 2.F.1.f [Stationary Air-Conditioning][no classification][Emissions][C2F6][t][From disposal][no method][no target][no option][no type]
status: valid
status modified: 2017-02-13
accepted date: 2017-02-13
in scheme: emissions_variables_MMR

2.F.1.f [Stationary Air-Conditioning][no classification][Emissions][C2F6][t][From manufacturing][no method][no target][no option][no type]
type: Concept
definition: 2.F.1.f [Stationary Air-Conditioning][no classification][Emissions][C2F6][t][From manufacturing][no method][no target][no option][no type]
status: valid
status modified: 2017-02-13
accepted date: 2017-02-13
in scheme: emissions_variables_MMR

2.F.1.f [Stationary Air-Conditioning][no classification][Emissions][C2F6][t][From stocks][no method][no target][no option][no type]
type: Concept
definition: 2.F.1.f [Stationary Air-Conditioning][no classification][Emissions][C2F6][t][From stocks][no method][no target][no option][no type]
status: valid
status modified: 2017-02-13
accepted date: 2017-02-13
in scheme: emissions_variables_MMR

2.F.1.f [Stationary Air-Conditioning][no classification][Emissions][C2F6][t][no source][no method][no target][no option][no type]
type: Concept
definition: 2.F.1.f [Stationary Air-Conditioning][no classification][Emissions][C2F6][t][no source][no method][no target][no option][no type]
status: valid
status modified: 2017-02-13
accepted date: 2017-02-13
in scheme: emissions_variables_MMR

2.F.1.f [Stationary Air-Conditioning][no classification][Emissions][C3F8][t][From disposal][no method][no target][no option][no type]
type: Concept
definition: 2.F.1.f [Stationary Air-Conditioning][no classification][Emissions][C3F8][t][From disposal][no method][no target][no option][no type]
status: valid
status modified: 2017-02-13
accepted date: 2017-02-13
in scheme: emissions_variables_MMR

2.F.1.f [Stationary Air-Conditioning][no classification][Emissions][C3F8][t][From manufacturing][no method][no target][no option][no type]
type: Concept
definition: 2.F.1.f [Stationary Air-Conditioning][no classification][Emissions][C3F8][t][From manufacturing][no method][no target][no option][no type]
status: valid
status modified: 2017-02-13
accepted date: 2017-02-13
in scheme: emissions_variables_MMR

2.F.1.f [Stationary Air-Conditioning][no classification][Emissions][C3F8][t][From stocks][no method][no target][no option][no type]
type: Concept
definition: 2.F.1.f [Stationary Air-Conditioning][no classification][Emissions][C3F8][t][From stocks][no method][no target][no option][no type]
status: valid
status modified: 2017-02-13
accepted date: 2017-02-13
in scheme: emissions_variables_MMR

2.F.1.f [Stationary Air-Conditioning][no classification][Emissions][C3F8][t][no source][no method][no target][no option][no type]
type: Concept
definition: 2.F.1.f [Stationary Air-Conditioning][no classification][Emissions][C3F8][t][no source][no method][no target][no option][no type]
status: valid
status modified: 2017-02-13
accepted date: 2017-02-13
in scheme: emissions_variables_MMR

2.F.1.f [Stationary Air-Conditioning][no classification][Emissions][C4F10][t][From disposal][no method][no target][no option][no type]
type: Concept
definition: 2.F.1.f [Stationary Air-Conditioning][no classification][Emissions][C4F10][t][From disposal][no method][no target][no option][no type]
status: valid
status modified: 2017-02-13
accepted date: 2017-02-13
in scheme: emissions_variables_MMR

2.F.1.f [Stationary Air-Conditioning][no classification][Emissions][C4F10][t][From manufacturing][no method][no target][no option][no type]
type: Concept
definition: 2.F.1.f [Stationary Air-Conditioning][no classification][Emissions][C4F10][t][From manufacturing][no method][no target][no option][no type]
status: valid
status modified: 2017-02-13
accepted date: 2017-02-13
in scheme: emissions_variables_MMR

2.F.1.f [Stationary Air-Conditioning][no classification][Emissions][C4F10][t][From stocks][no method][no target][no option][no type]
type: Concept
definition: 2.F.1.f [Stationary Air-Conditioning][no classification][Emissions][C4F10][t][From stocks][no method][no target][no option][no type]
status: valid
status modified: 2017-02-13
accepted date: 2017-02-13
in scheme: emissions_variables_MMR

2.F.1.f [Stationary Air-Conditioning][no classification][Emissions][C4F10][t][no source][no method][no target][no option][no type]
type: Concept
definition: 2.F.1.f [Stationary Air-Conditioning][no classification][Emissions][C4F10][t][no source][no method][no target][no option][no type]
status: valid
status modified: 2017-02-13
accepted date: 2017-02-13
in scheme: emissions_variables_MMR

2.F.1.f [Stationary Air-Conditioning][no classification][Emissions][C5F12][t][From disposal][no method][no target][no option][no type]
type: Concept
definition: 2.F.1.f [Stationary Air-Conditioning][no classification][Emissions][C5F12][t][From disposal][no method][no target][no option][no type]
status: valid
status modified: 2017-02-13
accepted date: 2017-02-13
in scheme: emissions_variables_MMR

2.F.1.f [Stationary Air-Conditioning][no classification][Emissions][C5F12][t][From manufacturing][no method][no target][no option][no type]
type: Concept
definition: 2.F.1.f [Stationary Air-Conditioning][no classification][Emissions][C5F12][t][From manufacturing][no method][no target][no option][no type]
status: valid
status modified: 2017-02-13
accepted date: 2017-02-13
in scheme: emissions_variables_MMR

2.F.1.f [Stationary Air-Conditioning][no classification][Emissions][C5F12][t][From stocks][no method][no target][no option][no type]
type: Concept
definition: 2.F.1.f [Stationary Air-Conditioning][no classification][Emissions][C5F12][t][From stocks][no method][no target][no option][no type]
status: valid
status modified: 2017-02-13
accepted date: 2017-02-13
in scheme: emissions_variables_MMR

2.F.1.f [Stationary Air-Conditioning][no classification][Emissions][C5F12][t][no source][no method][no target][no option][no type]
type: Concept
definition: 2.F.1.f [Stationary Air-Conditioning][no classification][Emissions][C5F12][t][no source][no method][no target][no option][no type]
status: valid
status modified: 2017-02-13
accepted date: 2017-02-13
in scheme: emissions_variables_MMR

2.F.1.f [Stationary Air-Conditioning][no classification][Emissions][C6F14][t][From disposal][no method][no target][no option][no type]
type: Concept
definition: 2.F.1.f [Stationary Air-Conditioning][no classification][Emissions][C6F14][t][From disposal][no method][no target][no option][no type]
status: valid
status modified: 2017-02-13
accepted date: 2017-02-13
in scheme: emissions_variables_MMR

2.F.1.f [Stationary Air-Conditioning][no classification][Emissions][C6F14][t][From manufacturing][no method][no target][no option][no type]
type: Concept
definition: 2.F.1.f [Stationary Air-Conditioning][no classification][Emissions][C6F14][t][From manufacturing][no method][no target][no option][no type]
status: valid
status modified: 2017-02-13
accepted date: 2017-02-13
in scheme: emissions_variables_MMR

2.F.1.f [Stationary Air-Conditioning][no classification][Emissions][C6F14][t][From stocks][no method][no target][no option][no type]
type: Concept
definition: 2.F.1.f [Stationary Air-Conditioning][no classification][Emissions][C6F14][t][From stocks][no method][no target][no option][no type]
status: valid
status modified: 2017-02-13
accepted date: 2017-02-13
in scheme: emissions_variables_MMR

2.F.1.f [Stationary Air-Conditioning][no classification][Emissions][C6F14][t][no source][no method][no target][no option][no type]
type: Concept
definition: 2.F.1.f [Stationary Air-Conditioning][no classification][Emissions][C6F14][t][no source][no method][no target][no option][no type]
status: valid
status modified: 2017-02-13
accepted date: 2017-02-13
in scheme: emissions_variables_MMR

2.F.1.f [Stationary Air-Conditioning][no classification][Emissions][c-C3F6][t][From disposal][no method][no target][no option][no type]
type: Concept
definition: 2.F.1.f [Stationary Air-Conditioning][no classification][Emissions][c-C3F6][t][From disposal][no method][no target][no option][no type]
status: valid
status modified: 2017-02-13
accepted date: 2017-02-13
in scheme: emissions_variables_MMR

2.F.1.f [Stationary Air-Conditioning][no classification][Emissions][c-C3F6][t][From manufacturing][no method][no target][no option][no type]
type: Concept
definition: 2.F.1.f [Stationary Air-Conditioning][no classification][Emissions][c-C3F6][t][From manufacturing][no method][no target][no option][no type]
status: valid
status modified: 2017-02-13
accepted date: 2017-02-13
in scheme: emissions_variables_MMR

2.F.1.f [Stationary Air-Conditioning][no classification][Emissions][c-C3F6][t][From stocks][no method][no target][no option][no type]
type: Concept
definition: 2.F.1.f [Stationary Air-Conditioning][no classification][Emissions][c-C3F6][t][From stocks][no method][no target][no option][no type]
status: valid
status modified: 2017-02-13
accepted date: 2017-02-13
in scheme: emissions_variables_MMR

2.F.1.f [Stationary Air-Conditioning][no classification][Emissions][c-C3F6][t][no source][no method][no target][no option][no type]
type: Concept
definition: 2.F.1.f [Stationary Air-Conditioning][no classification][Emissions][c-C3F6][t][no source][no method][no target][no option][no type]
status: valid
status modified: 2017-02-13
accepted date: 2017-02-13
in scheme: emissions_variables_MMR

2.F.1.f [Stationary Air-Conditioning][no classification][Emissions][c-C4F8][t][From disposal][no method][no target][no option][no type]
type: Concept
definition: 2.F.1.f [Stationary Air-Conditioning][no classification][Emissions][c-C4F8][t][From disposal][no method][no target][no option][no type]
status: valid
status modified: 2017-02-13
accepted date: 2017-02-13
in scheme: emissions_variables_MMR

2.F.1.f [Stationary Air-Conditioning][no classification][Emissions][c-C4F8][t][From manufacturing][no method][no target][no option][no type]
type: Concept
definition: 2.F.1.f [Stationary Air-Conditioning][no classification][Emissions][c-C4F8][t][From manufacturing][no method][no target][no option][no type]
status: valid
status modified: 2017-02-13
accepted date: 2017-02-13
in scheme: emissions_variables_MMR

2.F.1.f [Stationary Air-Conditioning][no classification][Emissions][c-C4F8][t][From stocks][no method][no target][no option][no type]
type: Concept
definition: 2.F.1.f [Stationary Air-Conditioning][no classification][Emissions][c-C4F8][t][From stocks][no method][no target][no option][no type]
status: valid
status modified: 2017-02-13
accepted date: 2017-02-13
in scheme: emissions_variables_MMR

2.F.1.f [Stationary Air-Conditioning][no classification][Emissions][c-C4F8][t][no source][no method][no target][no option][no type]
type: Concept
definition: 2.F.1.f [Stationary Air-Conditioning][no classification][Emissions][c-C4F8][t][no source][no method][no target][no option][no type]
status: valid
status modified: 2017-02-13
accepted date: 2017-02-13
in scheme: emissions_variables_MMR

2.F.1.f [Stationary Air-Conditioning][no classification][Emissions][CF4][t][From disposal][no method][no target][no option][no type]
type: Concept
definition: 2.F.1.f [Stationary Air-Conditioning][no classification][Emissions][CF4][t][From disposal][no method][no target][no option][no type]
status: valid
status modified: 2017-02-13
accepted date: 2017-02-13
in scheme: emissions_variables_MMR

2.F.1.f [Stationary Air-Conditioning][no classification][Emissions][CF4][t][From manufacturing][no method][no target][no option][no type]
type: Concept
definition: 2.F.1.f [Stationary Air-Conditioning][no classification][Emissions][CF4][t][From manufacturing][no method][no target][no option][no type]
status: valid
status modified: 2017-02-13
accepted date: 2017-02-13
in scheme: emissions_variables_MMR

2.F.1.f [Stationary Air-Conditioning][no classification][Emissions][CF4][t][From stocks][no method][no target][no option][no type]
type: Concept
definition: 2.F.1.f [Stationary Air-Conditioning][no classification][Emissions][CF4][t][From stocks][no method][no target][no option][no type]
status: valid
status modified: 2017-02-13
accepted date: 2017-02-13
in scheme: emissions_variables_MMR

2.F.1.f [Stationary Air-Conditioning][no classification][Emissions][CF4][t][no source][no method][no target][no option][no type]
type: Concept
definition: 2.F.1.f [Stationary Air-Conditioning][no classification][Emissions][CF4][t][no source][no method][no target][no option][no type]
status: valid
status modified: 2017-02-13
accepted date: 2017-02-13
in scheme: emissions_variables_MMR

2.F.1.f [Stationary Air-Conditioning][no classification][Emissions][HFC-125][t][From disposal][no method][no target][no option][no type]
type: Concept
definition: 2.F.1.f [Stationary Air-Conditioning][no classification][Emissions][HFC-125][t][From disposal][no method][no target][no option][no type]
status: valid
status modified: 2017-02-13
accepted date: 2017-02-13
in scheme: emissions_variables_MMR

2.F.1.f [Stationary Air-Conditioning][no classification][Emissions][HFC-125][t][From manufacturing][no method][no target][no option][no type]
type: Concept
definition: 2.F.1.f [Stationary Air-Conditioning][no classification][Emissions][HFC-125][t][From manufacturing][no method][no target][no option][no type]
status: valid
status modified: 2017-02-13
accepted date: 2017-02-13
in scheme: emissions_variables_MMR

2.F.1.f [Stationary Air-Conditioning][no classification][Emissions][HFC-125][t][From stocks][no method][no target][no option][no type]
type: Concept
definition: 2.F.1.f [Stationary Air-Conditioning][no classification][Emissions][HFC-125][t][From stocks][no method][no target][no option][no type]
status: valid
status modified: 2017-02-13
accepted date: 2017-02-13
in scheme: emissions_variables_MMR

2.F.1.f [Stationary Air-Conditioning][no classification][Emissions][HFC-125][t][no source][no method][no target][no option][no type]
type: Concept
definition: 2.F.1.f [Stationary Air-Conditioning][no classification][Emissions][HFC-125][t][no source][no method][no target][no option][no type]
status: valid
status modified: 2017-02-13
accepted date: 2017-02-13
in scheme: emissions_variables_MMR

2.F.1.f [Stationary Air-Conditioning][no classification][Emissions][HFC-134][t][From disposal][no method][no target][no option][no type]
type: Concept
definition: 2.F.1.f [Stationary Air-Conditioning][no classification][Emissions][HFC-134][t][From disposal][no method][no target][no option][no type]
status: valid
status modified: 2017-02-13
accepted date: 2017-02-13
in scheme: emissions_variables_MMR

2.F.1.f [Stationary Air-Conditioning][no classification][Emissions][HFC-134][t][From manufacturing][no method][no target][no option][no type]
type: Concept
definition: 2.F.1.f [Stationary Air-Conditioning][no classification][Emissions][HFC-134][t][From manufacturing][no method][no target][no option][no type]
status: valid
status modified: 2017-02-13
accepted date: 2017-02-13
in scheme: emissions_variables_MMR

2.F.1.f [Stationary Air-Conditioning][no classification][Emissions][HFC-134][t][From stocks][no method][no target][no option][no type]
type: Concept
definition: 2.F.1.f [Stationary Air-Conditioning][no classification][Emissions][HFC-134][t][From stocks][no method][no target][no option][no type]
status: valid
status modified: 2017-02-13
accepted date: 2017-02-13
in scheme: emissions_variables_MMR

2.F.1.f [Stationary Air-Conditioning][no classification][Emissions][HFC-134][t][no source][no method][no target][no option][no type]
type: Concept
definition: 2.F.1.f [Stationary Air-Conditioning][no classification][Emissions][HFC-134][t][no source][no method][no target][no option][no type]
status: valid
status modified: 2017-02-13
accepted date: 2017-02-13
in scheme: emissions_variables_MMR

2.F.1.f [Stationary Air-Conditioning][no classification][Emissions][HFC-134a][t][From disposal][no method][no target][no option][no type]
type: Concept
definition: 2.F.1.f [Stationary Air-Conditioning][no classification][Emissions][HFC-134a][t][From disposal][no method][no target][no option][no type]
status: valid
status modified: 2017-02-13
accepted date: 2017-02-13
in scheme: emissions_variables_MMR

2.F.1.f [Stationary Air-Conditioning][no classification][Emissions][HFC-134a][t][From manufacturing][no method][no target][no option][no type]
type: Concept
definition: 2.F.1.f [Stationary Air-Conditioning][no classification][Emissions][HFC-134a][t][From manufacturing][no method][no target][no option][no type]
status: valid
status modified: 2017-02-13
accepted date: 2017-02-13
in scheme: emissions_variables_MMR

2.F.1.f [Stationary Air-Conditioning][no classification][Emissions][HFC-134a][t][From stocks][no method][no target][no option][no type]
type: Concept
definition: 2.F.1.f [Stationary Air-Conditioning][no classification][Emissions][HFC-134a][t][From stocks][no method][no target][no option][no type]
status: valid
status modified: 2017-02-13
accepted date: 2017-02-13
in scheme: emissions_variables_MMR

2.F.1.f [Stationary Air-Conditioning][no classification][Emissions][HFC-134a][t][no source][no method][no target][no option][no type]
type: Concept
definition: 2.F.1.f [Stationary Air-Conditioning][no classification][Emissions][HFC-134a][t][no source][no method][no target][no option][no type]
status: valid
status modified: 2017-02-13
accepted date: 2017-02-13
in scheme: emissions_variables_MMR

2.F.1.f [Stationary Air-Conditioning][no classification][Emissions][HFC-143][t][From disposal][no method][no target][no option][no type]
type: Concept
definition: 2.F.1.f [Stationary Air-Conditioning][no classification][Emissions][HFC-143][t][From disposal][no method][no target][no option][no type]
status: valid
status modified: 2017-02-13
accepted date: 2017-02-13
in scheme: emissions_variables_MMR

2.F.1.f [Stationary Air-Conditioning][no classification][Emissions][HFC-143][t][From manufacturing][no method][no target][no option][no type]
type: Concept
definition: 2.F.1.f [Stationary Air-Conditioning][no classification][Emissions][HFC-143][t][From manufacturing][no method][no target][no option][no type]
status: valid
status modified: 2017-02-13
accepted date: 2017-02-13
in scheme: emissions_variables_MMR

2.F.1.f [Stationary Air-Conditioning][no classification][Emissions][HFC-143][t][From stocks][no method][no target][no option][no type]
type: Concept
definition: 2.F.1.f [Stationary Air-Conditioning][no classification][Emissions][HFC-143][t][From stocks][no method][no target][no option][no type]
status: valid
status modified: 2017-02-13
accepted date: 2017-02-13
in scheme: emissions_variables_MMR

2.F.1.f [Stationary Air-Conditioning][no classification][Emissions][HFC-143][t][no source][no method][no target][no option][no type]
type: Concept
definition: 2.F.1.f [Stationary Air-Conditioning][no classification][Emissions][HFC-143][t][no source][no method][no target][no option][no type]
status: valid
status modified: 2017-02-13
accepted date: 2017-02-13
in scheme: emissions_variables_MMR

2.F.1.f [Stationary Air-Conditioning][no classification][Emissions][HFC-143a][t][From disposal][no method][no target][no option][no type]
type: Concept
definition: 2.F.1.f [Stationary Air-Conditioning][no classification][Emissions][HFC-143a][t][From disposal][no method][no target][no option][no type]
status: valid
status modified: 2017-02-13
accepted date: 2017-02-13
in scheme: emissions_variables_MMR

2.F.1.f [Stationary Air-Conditioning][no classification][Emissions][HFC-143a][t][From manufacturing][no method][no target][no option][no type]
type: Concept
definition: 2.F.1.f [Stationary Air-Conditioning][no classification][Emissions][HFC-143a][t][From manufacturing][no method][no target][no option][no type]
status: valid
status modified: 2017-02-13
accepted date: 2017-02-13
in scheme: emissions_variables_MMR

2.F.1.f [Stationary Air-Conditioning][no classification][Emissions][HFC-143a][t][From stocks][no method][no target][no option][no type]
type: Concept
definition: 2.F.1.f [Stationary Air-Conditioning][no classification][Emissions][HFC-143a][t][From stocks][no method][no target][no option][no type]
status: valid
status modified: 2017-02-13
accepted date: 2017-02-13
in scheme: emissions_variables_MMR

2.F.1.f [Stationary Air-Conditioning][no classification][Emissions][HFC-143a][t][no source][no method][no target][no option][no type]
type: Concept
definition: 2.F.1.f [Stationary Air-Conditioning][no classification][Emissions][HFC-143a][t][no source][no method][no target][no option][no type]
status: valid
status modified: 2017-02-13
accepted date: 2017-02-13
in scheme: emissions_variables_MMR

2.F.1.f [Stationary Air-Conditioning][no classification][Emissions][HFC-152][t][From disposal][no method][no target][no option][no type]
type: Concept
definition: 2.F.1.f [Stationary Air-Conditioning][no classification][Emissions][HFC-152][t][From disposal][no method][no target][no option][no type]
status: valid
status modified: 2017-02-13
accepted date: 2017-02-13
in scheme: emissions_variables_MMR

2.F.1.f [Stationary Air-Conditioning][no classification][Emissions][HFC-152][t][From manufacturing][no method][no target][no option][no type]
type: Concept
definition: 2.F.1.f [Stationary Air-Conditioning][no classification][Emissions][HFC-152][t][From manufacturing][no method][no target][no option][no type]
status: valid
status modified: 2017-02-13
accepted date: 2017-02-13
in scheme: emissions_variables_MMR

2.F.1.f [Stationary Air-Conditioning][no classification][Emissions][HFC-152][t][From stocks][no method][no target][no option][no type]
type: Concept
definition: 2.F.1.f [Stationary Air-Conditioning][no classification][Emissions][HFC-152][t][From stocks][no method][no target][no option][no type]
status: valid
status modified: 2017-02-13
accepted date: 2017-02-13
in scheme: emissions_variables_MMR

2.F.1.f [Stationary Air-Conditioning][no classification][Emissions][HFC-152][t][no source][no method][no target][no option][no type]
type: Concept
definition: 2.F.1.f [Stationary Air-Conditioning][no classification][Emissions][HFC-152][t][no source][no method][no target][no option][no type]
status: valid
status modified: 2017-02-13
accepted date: 2017-02-13
in scheme: emissions_variables_MMR

2.F.1.f [Stationary Air-Conditioning][no classification][Emissions][HFC-152a][t][From disposal][no method][no target][no option][no type]
type: Concept
definition: 2.F.1.f [Stationary Air-Conditioning][no classification][Emissions][HFC-152a][t][From disposal][no method][no target][no option][no type]
status: valid
status modified: 2017-02-13
accepted date: 2017-02-13
in scheme: emissions_variables_MMR

2.F.1.f [Stationary Air-Conditioning][no classification][Emissions][HFC-152a][t][From manufacturing][no method][no target][no option][no type]
type: Concept
definition: 2.F.1.f [Stationary Air-Conditioning][no classification][Emissions][HFC-152a][t][From manufacturing][no method][no target][no option][no type]
status: valid
status modified: 2017-02-13
accepted date: 2017-02-13
in scheme: emissions_variables_MMR

2.F.1.f [Stationary Air-Conditioning][no classification][Emissions][HFC-152a][t][From stocks][no method][no target][no option][no type]
type: Concept
definition: 2.F.1.f [Stationary Air-Conditioning][no classification][Emissions][HFC-152a][t][From stocks][no method][no target][no option][no type]
status: valid
status modified: 2017-02-13
accepted date: 2017-02-13
in scheme: emissions_variables_MMR

2.F.1.f [Stationary Air-Conditioning][no classification][Emissions][HFC-152a][t][no source][no method][no target][no option][no type]
type: Concept
definition: 2.F.1.f [Stationary Air-Conditioning][no classification][Emissions][HFC-152a][t][no source][no method][no target][no option][no type]
status: valid
status modified: 2017-02-13
accepted date: 2017-02-13
in scheme: emissions_variables_MMR

2.F.1.f [Stationary Air-Conditioning][no classification][Emissions][HFC-161][t][From disposal][no method][no target][no option][no type]
type: Concept
definition: 2.F.1.f [Stationary Air-Conditioning][no classification][Emissions][HFC-161][t][From disposal][no method][no target][no option][no type]
status: valid
status modified: 2017-02-13
accepted date: 2017-02-13
in scheme: emissions_variables_MMR

2.F.1.f [Stationary Air-Conditioning][no classification][Emissions][HFC-161][t][From manufacturing][no method][no target][no option][no type]
type: Concept
definition: 2.F.1.f [Stationary Air-Conditioning][no classification][Emissions][HFC-161][t][From manufacturing][no method][no target][no option][no type]
status: valid
status modified: 2017-02-13
accepted date: 2017-02-13
in scheme: emissions_variables_MMR

2.F.1.f [Stationary Air-Conditioning][no classification][Emissions][HFC-161][t][From stocks][no method][no target][no option][no type]
type: Concept
definition: 2.F.1.f [Stationary Air-Conditioning][no classification][Emissions][HFC-161][t][From stocks][no method][no target][no option][no type]
status: valid
status modified: 2017-02-13
accepted date: 2017-02-13
in scheme: emissions_variables_MMR

2.F.1.f [Stationary Air-Conditioning][no classification][Emissions][HFC-161][t][no source][no method][no target][no option][no type]
type: Concept
definition: 2.F.1.f [Stationary Air-Conditioning][no classification][Emissions][HFC-161][t][no source][no method][no target][no option][no type]
status: valid
status modified: 2017-02-13
accepted date: 2017-02-13
in scheme: emissions_variables_MMR

2.F.1.f [Stationary Air-Conditioning][no classification][Emissions][HFC-227ea][t][From disposal][no method][no target][no option][no type]
type: Concept
definition: 2.F.1.f [Stationary Air-Conditioning][no classification][Emissions][HFC-227ea][t][From disposal][no method][no target][no option][no type]
status: valid
status modified: 2017-02-13
accepted date: 2017-02-13
in scheme: emissions_variables_MMR

2.F.1.f [Stationary Air-Conditioning][no classification][Emissions][HFC-227ea][t][From manufacturing][no method][no target][no option][no type]
type: Concept
definition: 2.F.1.f [Stationary Air-Conditioning][no classification][Emissions][HFC-227ea][t][From manufacturing][no method][no target][no option][no type]
status: valid
status modified: 2017-02-13
accepted date: 2017-02-13
in scheme: emissions_variables_MMR

2.F.1.f [Stationary Air-Conditioning][no classification][Emissions][HFC-227ea][t][From stocks][no method][no target][no option][no type]
type: Concept
definition: 2.F.1.f [Stationary Air-Conditioning][no classification][Emissions][HFC-227ea][t][From stocks][no method][no target][no option][no type]
status: valid
status modified: 2017-02-13
accepted date: 2017-02-13
in scheme: emissions_variables_MMR

2.F.1.f [Stationary Air-Conditioning][no classification][Emissions][HFC-227ea][t][no source][no method][no target][no option][no type]
type: Concept
definition: 2.F.1.f [Stationary Air-Conditioning][no classification][Emissions][HFC-227ea][t][no source][no method][no target][no option][no type]
status: valid
status modified: 2017-02-13
accepted date: 2017-02-13
in scheme: emissions_variables_MMR

2.F.1.f [Stationary Air-Conditioning][no classification][Emissions][HFC-23][t][From disposal][no method][no target][no option][no type]
type: Concept
definition: 2.F.1.f [Stationary Air-Conditioning][no classification][Emissions][HFC-23][t][From disposal][no method][no target][no option][no type]
status: valid
status modified: 2017-02-13
accepted date: 2017-02-13
in scheme: emissions_variables_MMR

2.F.1.f [Stationary Air-Conditioning][no classification][Emissions][HFC-23][t][From manufacturing][no method][no target][no option][no type]
type: Concept
definition: 2.F.1.f [Stationary Air-Conditioning][no classification][Emissions][HFC-23][t][From manufacturing][no method][no target][no option][no type]
status: valid
status modified: 2017-02-13
accepted date: 2017-02-13
in scheme: emissions_variables_MMR

2.F.1.f [Stationary Air-Conditioning][no classification][Emissions][HFC-23][t][From stocks][no method][no target][no option][no type]
type: Concept
definition: 2.F.1.f [Stationary Air-Conditioning][no classification][Emissions][HFC-23][t][From stocks][no method][no target][no option][no type]
status: valid
status modified: 2017-02-13
accepted date: 2017-02-13
in scheme: emissions_variables_MMR

2.F.1.f [Stationary Air-Conditioning][no classification][Emissions][HFC-23][t][no source][no method][no target][no option][no type]
type: Concept
definition: 2.F.1.f [Stationary Air-Conditioning][no classification][Emissions][HFC-23][t][no source][no method][no target][no option][no type]
status: valid
status modified: 2017-02-13
accepted date: 2017-02-13
in scheme: emissions_variables_MMR

2.F.1.f [Stationary Air-Conditioning][no classification][Emissions][HFC-236cb][t][From disposal][no method][no target][no option][no type]
type: Concept
definition: 2.F.1.f [Stationary Air-Conditioning][no classification][Emissions][HFC-236cb][t][From disposal][no method][no target][no option][no type]
status: valid
status modified: 2017-02-13
accepted date: 2017-02-13
in scheme: emissions_variables_MMR

2.F.1.f [Stationary Air-Conditioning][no classification][Emissions][HFC-236cb][t][From manufacturing][no method][no target][no option][no type]
type: Concept
definition: 2.F.1.f [Stationary Air-Conditioning][no classification][Emissions][HFC-236cb][t][From manufacturing][no method][no target][no option][no type]
status: valid
status modified: 2017-02-13
accepted date: 2017-02-13
in scheme: emissions_variables_MMR

2.F.1.f [Stationary Air-Conditioning][no classification][Emissions][HFC-236cb][t][From stocks][no method][no target][no option][no type]
type: Concept
definition: 2.F.1.f [Stationary Air-Conditioning][no classification][Emissions][HFC-236cb][t][From stocks][no method][no target][no option][no type]
status: valid
status modified: 2017-02-13
accepted date: 2017-02-13
in scheme: emissions_variables_MMR

2.F.1.f [Stationary Air-Conditioning][no classification][Emissions][HFC-236cb][t][no source][no method][no target][no option][no type]
type: Concept
definition: 2.F.1.f [Stationary Air-Conditioning][no classification][Emissions][HFC-236cb][t][no source][no method][no target][no option][no type]
status: valid
status modified: 2017-02-13
accepted date: 2017-02-13
in scheme: emissions_variables_MMR

2.F.1.f [Stationary Air-Conditioning][no classification][Emissions][HFC-236ea][t][From disposal][no method][no target][no option][no type]
type: Concept
definition: 2.F.1.f [Stationary Air-Conditioning][no classification][Emissions][HFC-236ea][t][From disposal][no method][no target][no option][no type]
status: valid
status modified: 2017-02-13
accepted date: 2017-02-13
in scheme: emissions_variables_MMR

2.F.1.f [Stationary Air-Conditioning][no classification][Emissions][HFC-236ea][t][From manufacturing][no method][no target][no option][no type]
type: Concept
definition: 2.F.1.f [Stationary Air-Conditioning][no classification][Emissions][HFC-236ea][t][From manufacturing][no method][no target][no option][no type]
status: valid
status modified: 2017-02-13
accepted date: 2017-02-13
in scheme: emissions_variables_MMR

2.F.1.f [Stationary Air-Conditioning][no classification][Emissions][HFC-236ea][t][From stocks][no method][no target][no option][no type]
type: Concept
definition: 2.F.1.f [Stationary Air-Conditioning][no classification][Emissions][HFC-236ea][t][From stocks][no method][no target][no option][no type]
status: valid
status modified: 2017-02-13
accepted date: 2017-02-13
in scheme: emissions_variables_MMR

2.F.1.f [Stationary Air-Conditioning][no classification][Emissions][HFC-236ea][t][no source][no method][no target][no option][no type]
type: Concept
definition: 2.F.1.f [Stationary Air-Conditioning][no classification][Emissions][HFC-236ea][t][no source][no method][no target][no option][no type]
status: valid
status modified: 2017-02-13
accepted date: 2017-02-13
in scheme: emissions_variables_MMR

2.F.1.f [Stationary Air-Conditioning][no classification][Emissions][HFC-236fa][t][From disposal][no method][no target][no option][no type]
type: Concept
definition: 2.F.1.f [Stationary Air-Conditioning][no classification][Emissions][HFC-236fa][t][From disposal][no method][no target][no option][no type]
status: valid
status modified: 2017-02-13
accepted date: 2017-02-13
in scheme: emissions_variables_MMR

2.F.1.f [Stationary Air-Conditioning][no classification][Emissions][HFC-236fa][t][From manufacturing][no method][no target][no option][no type]
type: Concept
definition: 2.F.1.f [Stationary Air-Conditioning][no classification][Emissions][HFC-236fa][t][From manufacturing][no method][no target][no option][no type]
status: valid
status modified: 2017-02-13
accepted date: 2017-02-13
in scheme: emissions_variables_MMR

2.F.1.f [Stationary Air-Conditioning][no classification][Emissions][HFC-236fa][t][From stocks][no method][no target][no option][no type]
type: Concept
definition: 2.F.1.f [Stationary Air-Conditioning][no classification][Emissions][HFC-236fa][t][From stocks][no method][no target][no option][no type]
status: valid
status modified: 2017-02-13
accepted date: 2017-02-13
in scheme: emissions_variables_MMR

2.F.1.f [Stationary Air-Conditioning][no classification][Emissions][HFC-236fa][t][no source][no method][no target][no option][no type]
type: Concept
definition: 2.F.1.f [Stationary Air-Conditioning][no classification][Emissions][HFC-236fa][t][no source][no method][no target][no option][no type]
status: valid
status modified: 2017-02-13
accepted date: 2017-02-13
in scheme: emissions_variables_MMR

2.F.1.f [Stationary Air-Conditioning][no classification][Emissions][HFC-245ca][t][From disposal][no method][no target][no option][no type]
type: Concept
definition: 2.F.1.f [Stationary Air-Conditioning][no classification][Emissions][HFC-245ca][t][From disposal][no method][no target][no option][no type]
status: valid
status modified: 2017-02-13
accepted date: 2017-02-13
in scheme: emissions_variables_MMR

2.F.1.f [Stationary Air-Conditioning][no classification][Emissions][HFC-245ca][t][From manufacturing][no method][no target][no option][no type]
type: Concept
definition: 2.F.1.f [Stationary Air-Conditioning][no classification][Emissions][HFC-245ca][t][From manufacturing][no method][no target][no option][no type]
status: valid
status modified: 2017-02-13
accepted date: 2017-02-13
in scheme: emissions_variables_MMR

2.F.1.f [Stationary Air-Conditioning][no classification][Emissions][HFC-245ca][t][From stocks][no method][no target][no option][no type]
type: Concept
definition: 2.F.1.f [Stationary Air-Conditioning][no classification][Emissions][HFC-245ca][t][From stocks][no method][no target][no option][no type]
status: valid
status modified: 2017-02-13
accepted date: 2017-02-13
in scheme: emissions_variables_MMR

2.F.1.f [Stationary Air-Conditioning][no classification][Emissions][HFC-245ca][t][no source][no method][no target][no option][no type]
type: Concept
definition: 2.F.1.f [Stationary Air-Conditioning][no classification][Emissions][HFC-245ca][t][no source][no method][no target][no option][no type]
status: valid
status modified: 2017-02-13
accepted date: 2017-02-13
in scheme: emissions_variables_MMR

2.F.1.f [Stationary Air-Conditioning][no classification][Emissions][HFC-245fa][t][From disposal][no method][no target][no option][no type]
type: Concept
definition: 2.F.1.f [Stationary Air-Conditioning][no classification][Emissions][HFC-245fa][t][From disposal][no method][no target][no option][no type]
status: valid
status modified: 2017-02-13
accepted date: 2017-02-13
in scheme: emissions_variables_MMR

2.F.1.f [Stationary Air-Conditioning][no classification][Emissions][HFC-245fa][t][From manufacturing][no method][no target][no option][no type]
type: Concept
definition: 2.F.1.f [Stationary Air-Conditioning][no classification][Emissions][HFC-245fa][t][From manufacturing][no method][no target][no option][no type]
status: valid
status modified: 2017-02-13
accepted date: 2017-02-13
in scheme: emissions_variables_MMR

2.F.1.f [Stationary Air-Conditioning][no classification][Emissions][HFC-245fa][t][From stocks][no method][no target][no option][no type]
type: Concept
definition: 2.F.1.f [Stationary Air-Conditioning][no classification][Emissions][HFC-245fa][t][From stocks][no method][no target][no option][no type]
status: valid
status modified: 2017-02-13
accepted date: 2017-02-13
in scheme: emissions_variables_MMR

2.F.1.f [Stationary Air-Conditioning][no classification][Emissions][HFC-245fa][t][no source][no method][no target][no option][no type]
type: Concept
definition: 2.F.1.f [Stationary Air-Conditioning][no classification][Emissions][HFC-245fa][t][no source][no method][no target][no option][no type]
status: valid
status modified: 2017-02-13
accepted date: 2017-02-13
in scheme: emissions_variables_MMR

2.F.1.f [Stationary Air-Conditioning][no classification][Emissions][HFC-32][t][From disposal][no method][no target][no option][no type]
type: Concept
definition: 2.F.1.f [Stationary Air-Conditioning][no classification][Emissions][HFC-32][t][From disposal][no method][no target][no option][no type]
status: valid
status modified: 2017-02-13
accepted date: 2017-02-13
in scheme: emissions_variables_MMR

2.F.1.f [Stationary Air-Conditioning][no classification][Emissions][HFC-32][t][From manufacturing][no method][no target][no option][no type]
type: Concept
definition: 2.F.1.f [Stationary Air-Conditioning][no classification][Emissions][HFC-32][t][From manufacturing][no method][no target][no option][no type]
status: valid
status modified: 2017-02-13
accepted date: 2017-02-13
in scheme: emissions_variables_MMR

2.F.1.f [Stationary Air-Conditioning][no classification][Emissions][HFC-32][t][From stocks][no method][no target][no option][no type]
type: Concept
definition: 2.F.1.f [Stationary Air-Conditioning][no classification][Emissions][HFC-32][t][From stocks][no method][no target][no option][no type]
status: valid
status modified: 2017-02-13
accepted date: 2017-02-13
in scheme: emissions_variables_MMR

2.F.1.f [Stationary Air-Conditioning][no classification][Emissions][HFC-32][t][no source][no method][no target][no option][no type]
type: Concept
definition: 2.F.1.f [Stationary Air-Conditioning][no classification][Emissions][HFC-32][t][no source][no method][no target][no option][no type]
status: valid
status modified: 2017-02-13
accepted date: 2017-02-13
in scheme: emissions_variables_MMR

2.F.1.f [Stationary Air-Conditioning][no classification][Emissions][HFC-365mfc][t][From disposal][no method][no target][no option][no type]
type: Concept
definition: 2.F.1.f [Stationary Air-Conditioning][no classification][Emissions][HFC-365mfc][t][From disposal][no method][no target][no option][no type]
status: valid
status modified: 2017-02-13
accepted date: 2017-02-13
in scheme: emissions_variables_MMR

2.F.1.f [Stationary Air-Conditioning][no classification][Emissions][HFC-365mfc][t][From manufacturing][no method][no target][no option][no type]
type: Concept
definition: 2.F.1.f [Stationary Air-Conditioning][no classification][Emissions][HFC-365mfc][t][From manufacturing][no method][no target][no option][no type]
status: valid
status modified: 2017-02-13
accepted date: 2017-02-13
in scheme: emissions_variables_MMR

2.F.1.f [Stationary Air-Conditioning][no classification][Emissions][HFC-365mfc][t][From stocks][no method][no target][no option][no type]
type: Concept
definition: 2.F.1.f [Stationary Air-Conditioning][no classification][Emissions][HFC-365mfc][t][From stocks][no method][no target][no option][no type]
status: valid
status modified: 2017-02-13
accepted date: 2017-02-13
in scheme: emissions_variables_MMR

2.F.1.f [Stationary Air-Conditioning][no classification][Emissions][HFC-365mfc][t][no source][no method][no target][no option][no type]
type: Concept
definition: 2.F.1.f [Stationary Air-Conditioning][no classification][Emissions][HFC-365mfc][t][no source][no method][no target][no option][no type]
status: valid
status modified: 2017-02-13
accepted date: 2017-02-13
in scheme: emissions_variables_MMR

2.F.1.f [Stationary Air-Conditioning][no classification][Emissions][HFC-41][t][From disposal][no method][no target][no option][no type]
type: Concept
definition: 2.F.1.f [Stationary Air-Conditioning][no classification][Emissions][HFC-41][t][From disposal][no method][no target][no option][no type]
status: valid
status modified: 2017-02-13
accepted date: 2017-02-13
in scheme: emissions_variables_MMR

2.F.1.f [Stationary Air-Conditioning][no classification][Emissions][HFC-41][t][From manufacturing][no method][no target][no option][no type]
type: Concept
definition: 2.F.1.f [Stationary Air-Conditioning][no classification][Emissions][HFC-41][t][From manufacturing][no method][no target][no option][no type]
status: valid
status modified: 2017-02-13
accepted date: 2017-02-13
in scheme: emissions_variables_MMR

2.F.1.f [Stationary Air-Conditioning][no classification][Emissions][HFC-41][t][From stocks][no method][no target][no option][no type]
type: Concept
definition: 2.F.1.f [Stationary Air-Conditioning][no classification][Emissions][HFC-41][t][From stocks][no method][no target][no option][no type]
status: valid
status modified: 2017-02-13
accepted date: 2017-02-13
in scheme: emissions_variables_MMR

2.F.1.f [Stationary Air-Conditioning][no classification][Emissions][HFC-41][t][no source][no method][no target][no option][no type]
type: Concept
definition: 2.F.1.f [Stationary Air-Conditioning][no classification][Emissions][HFC-41][t][no source][no method][no target][no option][no type]
status: valid
status modified: 2017-02-13
accepted date: 2017-02-13
in scheme: emissions_variables_MMR

2.F.1.f [Stationary Air-Conditioning][no classification][Emissions][HFC-43-10mee][t][From disposal][no method][no target][no option][no type]
type: Concept
definition: 2.F.1.f [Stationary Air-Conditioning][no classification][Emissions][HFC-43-10mee][t][From disposal][no method][no target][no option][no type]
status: valid
status modified: 2017-02-13
accepted date: 2017-02-13
in scheme: emissions_variables_MMR

2.F.1.f [Stationary Air-Conditioning][no classification][Emissions][HFC-43-10mee][t][From manufacturing][no method][no target][no option][no type]
type: Concept
definition: 2.F.1.f [Stationary Air-Conditioning][no classification][Emissions][HFC-43-10mee][t][From manufacturing][no method][no target][no option][no type]
status: valid
status modified: 2017-02-13
accepted date: 2017-02-13
in scheme: emissions_variables_MMR

2.F.1.f [Stationary Air-Conditioning][no classification][Emissions][HFC-43-10mee][t][From stocks][no method][no target][no option][no type]
type: Concept
definition: 2.F.1.f [Stationary Air-Conditioning][no classification][Emissions][HFC-43-10mee][t][From stocks][no method][no target][no option][no type]
status: valid
status modified: 2017-02-13
accepted date: 2017-02-13
in scheme: emissions_variables_MMR

2.F.1.f [Stationary Air-Conditioning][no classification][Emissions][HFC-43-10mee][t][no source][no method][no target][no option][no type]
type: Concept
definition: 2.F.1.f [Stationary Air-Conditioning][no classification][Emissions][HFC-43-10mee][t][no source][no method][no target][no option][no type]
status: valid
status modified: 2017-02-13
accepted date: 2017-02-13
in scheme: emissions_variables_MMR

2.F.1.f [Stationary Air-Conditioning][no classification][Emissions][HFCs and PFCs][t CO2 equivalent][no source][no method][no target][no option][no type]
type: Concept
definition: 2.F.1.f [Stationary Air-Conditioning][no classification][Emissions][HFCs and PFCs][t CO2 equivalent][no source][no method][no target][no option][no type]
status: valid
status modified: 2017-02-13
accepted date: 2017-02-13
in scheme: emissions_variables_MMR

2.F.1.f [Stationary Air-Conditioning][no classification][Emissions][HFCs][t CO2 equivalent][no source][no method][no target][no option][no type]
type: Concept
definition: 2.F.1.f [Stationary Air-Conditioning][no classification][Emissions][HFCs][t CO2 equivalent][no source][no method][no target][no option][no type]
status: valid
status modified: 2017-02-13
accepted date: 2017-02-13
in scheme: emissions_variables_MMR

2.F.1.f [Stationary Air-Conditioning][no classification][Emissions][NF3][t][From disposal][no method][no target][no option][no type]
type: Concept
definition: 2.F.1.f [Stationary Air-Conditioning][no classification][Emissions][NF3][t][From disposal][no method][no target][no option][no type]
status: valid
status modified: 2017-02-13
accepted date: 2017-02-13
in scheme: emissions_variables_MMR

2.F.1.f [Stationary Air-Conditioning][no classification][Emissions][NF3][t][From manufacturing][no method][no target][no option][no type]
type: Concept
definition: 2.F.1.f [Stationary Air-Conditioning][no classification][Emissions][NF3][t][From manufacturing][no method][no target][no option][no type]
status: valid
status modified: 2017-02-13
accepted date: 2017-02-13
in scheme: emissions_variables_MMR

2.F.1.f [Stationary Air-Conditioning][no classification][Emissions][NF3][t][From stocks][no method][no target][no option][no type]
type: Concept
definition: 2.F.1.f [Stationary Air-Conditioning][no classification][Emissions][NF3][t][From stocks][no method][no target][no option][no type]
status: valid
status modified: 2017-02-13
accepted date: 2017-02-13
in scheme: emissions_variables_MMR

2.F.1.f [Stationary Air-Conditioning][no classification][Emissions][NF3][t][no source][no method][no target][no option][no type]
type: Concept
definition: 2.F.1.f [Stationary Air-Conditioning][no classification][Emissions][NF3][t][no source][no method][no target][no option][no type]
status: valid
status modified: 2017-02-13
accepted date: 2017-02-13
in scheme: emissions_variables_MMR

2.F.1.f [Stationary Air-Conditioning][no classification][Emissions][PFCs][t CO2 equivalent][no source][no method][no target][no option][no type]
type: Concept
definition: 2.F.1.f [Stationary Air-Conditioning][no classification][Emissions][PFCs][t CO2 equivalent][no source][no method][no target][no option][no type]
status: valid
status modified: 2017-02-13
accepted date: 2017-02-13
in scheme: emissions_variables_MMR

2.F.1.f [Stationary Air-Conditioning][no classification][Emissions][SF6][t][From disposal][no method][no target][no option][no type]
type: Concept
definition: 2.F.1.f [Stationary Air-Conditioning][no classification][Emissions][SF6][t][From disposal][no method][no target][no option][no type]
status: valid
status modified: 2017-02-13
accepted date: 2017-02-13
in scheme: emissions_variables_MMR

2.F.1.f [Stationary Air-Conditioning][no classification][Emissions][SF6][t][From manufacturing][no method][no target][no option][no type]
type: Concept
definition: 2.F.1.f [Stationary Air-Conditioning][no classification][Emissions][SF6][t][From manufacturing][no method][no target][no option][no type]
status: valid
status modified: 2017-02-13
accepted date: 2017-02-13
in scheme: emissions_variables_MMR

2.F.1.f [Stationary Air-Conditioning][no classification][Emissions][SF6][t][From stocks][no method][no target][no option][no type]
type: Concept
definition: 2.F.1.f [Stationary Air-Conditioning][no classification][Emissions][SF6][t][From stocks][no method][no target][no option][no type]
status: valid
status modified: 2017-02-13
accepted date: 2017-02-13
in scheme: emissions_variables_MMR

2.F.1.f [Stationary Air-Conditioning][no classification][Emissions][SF6][t][no source][no method][no target][no option][no type]
type: Concept
definition: 2.F.1.f [Stationary Air-Conditioning][no classification][Emissions][SF6][t][no source][no method][no target][no option][no type]
status: valid
status modified: 2017-02-13
accepted date: 2017-02-13
in scheme: emissions_variables_MMR

2.F.1.f [Stationary Air-Conditioning][no classification][Emissions][Unspecified mix of HFCs and PFCs][t CO2 equivalent][From disposal][no method][no target][no option][no type]
type: Concept
definition: 2.F.1.f [Stationary Air-Conditioning][no classification][Emissions][Unspecified mix of HFCs and PFCs][t CO2 equivalent][From disposal][no method][no target][no option][no type]
status: valid
status modified: 2017-02-13
accepted date: 2017-02-13
in scheme: emissions_variables_MMR

2.F.1.f [Stationary Air-Conditioning][no classification][Emissions][Unspecified mix of HFCs and PFCs][t CO2 equivalent][From manufacturing][no method][no target][no option][no type]
type: Concept
definition: 2.F.1.f [Stationary Air-Conditioning][no classification][Emissions][Unspecified mix of HFCs and PFCs][t CO2 equivalent][From manufacturing][no method][no target][no option][no type]
status: valid
status modified: 2017-02-13
accepted date: 2017-02-13
in scheme: emissions_variables_MMR

2.F.1.f [Stationary Air-Conditioning][no classification][Emissions][Unspecified mix of HFCs and PFCs][t CO2 equivalent][From stocks][no method][no target][no option][no type]
type: Concept
definition: 2.F.1.f [Stationary Air-Conditioning][no classification][Emissions][Unspecified mix of HFCs and PFCs][t CO2 equivalent][From stocks][no method][no target][no option][no type]
status: valid
status modified: 2017-02-13
accepted date: 2017-02-13
in scheme: emissions_variables_MMR

2.F.1.f [Stationary Air-Conditioning][no classification][Emissions][Unspecified mix of HFCs and PFCs][t CO2 equivalent][no source][no method][no target][no option][no type]
type: Concept
definition: 2.F.1.f [Stationary Air-Conditioning][no classification][Emissions][Unspecified mix of HFCs and PFCs][t CO2 equivalent][no source][no method][no target][no option][no type]
status: valid
status modified: 2017-02-13
accepted date: 2017-02-13
in scheme: emissions_variables_MMR

2.F.1.f [Stationary Air-Conditioning][no classification][Emissions][Unspecified mix of HFCs][t CO2 equivalent][From disposal][no method][no target][no option][no type]
type: Concept
definition: 2.F.1.f [Stationary Air-Conditioning][no classification][Emissions][Unspecified mix of HFCs][t CO2 equivalent][From disposal][no method][no target][no option][no type]
status: valid
status modified: 2017-02-13
accepted date: 2017-02-13
in scheme: emissions_variables_MMR

2.F.1.f [Stationary Air-Conditioning][no classification][Emissions][Unspecified mix of HFCs][t CO2 equivalent][From manufacturing][no method][no target][no option][no type]
type: Concept
definition: 2.F.1.f [Stationary Air-Conditioning][no classification][Emissions][Unspecified mix of HFCs][t CO2 equivalent][From manufacturing][no method][no target][no option][no type]
status: valid
status modified: 2017-02-13
accepted date: 2017-02-13
in scheme: emissions_variables_MMR

2.F.1.f [Stationary Air-Conditioning][no classification][Emissions][Unspecified mix of HFCs][t CO2 equivalent][From stocks][no method][no target][no option][no type]
type: Concept
definition: 2.F.1.f [Stationary Air-Conditioning][no classification][Emissions][Unspecified mix of HFCs][t CO2 equivalent][From stocks][no method][no target][no option][no type]
status: valid
status modified: 2017-02-13
accepted date: 2017-02-13
in scheme: emissions_variables_MMR

2.F.1.f [Stationary Air-Conditioning][no classification][Emissions][Unspecified mix of HFCs][t CO2 equivalent][no source][no method][no target][no option][no type]
type: Concept
definition: 2.F.1.f [Stationary Air-Conditioning][no classification][Emissions][Unspecified mix of HFCs][t CO2 equivalent][no source][no method][no target][no option][no type]
status: valid
status modified: 2017-02-13
accepted date: 2017-02-13
in scheme: emissions_variables_MMR

2.F.1.f [Stationary Air-Conditioning][no classification][Emissions][Unspecified mix of PFCs][t CO2 equivalent][From disposal][no method][no target][no option][no type]
type: Concept
definition: 2.F.1.f [Stationary Air-Conditioning][no classification][Emissions][Unspecified mix of PFCs][t CO2 equivalent][From disposal][no method][no target][no option][no type]
status: valid
status modified: 2017-02-13
accepted date: 2017-02-13
in scheme: emissions_variables_MMR

2.F.1.f [Stationary Air-Conditioning][no classification][Emissions][Unspecified mix of PFCs][t CO2 equivalent][From manufacturing][no method][no target][no option][no type]
type: Concept
definition: 2.F.1.f [Stationary Air-Conditioning][no classification][Emissions][Unspecified mix of PFCs][t CO2 equivalent][From manufacturing][no method][no target][no option][no type]
status: valid
status modified: 2017-02-13
accepted date: 2017-02-13
in scheme: emissions_variables_MMR

2.F.1.f [Stationary Air-Conditioning][no classification][Emissions][Unspecified mix of PFCs][t CO2 equivalent][From stocks][no method][no target][no option][no type]
type: Concept
definition: 2.F.1.f [Stationary Air-Conditioning][no classification][Emissions][Unspecified mix of PFCs][t CO2 equivalent][From stocks][no method][no target][no option][no type]
status: valid
status modified: 2017-02-13
accepted date: 2017-02-13
in scheme: emissions_variables_MMR

2.F.1.f [Stationary Air-Conditioning][no classification][Emissions][Unspecified mix of PFCs][t CO2 equivalent][no source][no method][no target][no option][no type]
type: Concept
definition: 2.F.1.f [Stationary Air-Conditioning][no classification][Emissions][Unspecified mix of PFCs][t CO2 equivalent][no source][no method][no target][no option][no type]
status: valid
status modified: 2017-02-13
accepted date: 2017-02-13
in scheme: emissions_variables_MMR

2.F.2 [Foam Blowing Agents][no classification][Emissions][Aggregate F-gases][t CO2 equivalent][no source][no method][no target][no option][no type]
type: Concept
definition: 2.F.2 [Foam Blowing Agents][no classification][Emissions][Aggregate F-gases][t CO2 equivalent][no source][no method][no target][no option][no type]
status: valid
status modified: 2017-02-13
accepted date: 2017-02-13
in scheme: emissions_variables_MMR

2.F.2 [Foam Blowing Agents][no classification][Emissions][C10F18][t][no source][no method][no target][no option][no type]
type: Concept
definition: 2.F.2 [Foam Blowing Agents][no classification][Emissions][C10F18][t][no source][no method][no target][no option][no type]
status: valid
status modified: 2017-02-13
accepted date: 2017-02-13
in scheme: emissions_variables_MMR

2.F.2 [Foam Blowing Agents][no classification][Emissions][C2F6][t][no source][no method][no target][no option][no type]
type: Concept
definition: 2.F.2 [Foam Blowing Agents][no classification][Emissions][C2F6][t][no source][no method][no target][no option][no type]
status: valid
status modified: 2017-02-13
accepted date: 2017-02-13
in scheme: emissions_variables_MMR

2.F.2 [Foam Blowing Agents][no classification][Emissions][C3F8][t][no source][no method][no target][no option][no type]
type: Concept
definition: 2.F.2 [Foam Blowing Agents][no classification][Emissions][C3F8][t][no source][no method][no target][no option][no type]
status: valid
status modified: 2017-02-13
accepted date: 2017-02-13
in scheme: emissions_variables_MMR

2.F.2 [Foam Blowing Agents][no classification][Emissions][C4F10][t][no source][no method][no target][no option][no type]
type: Concept
definition: 2.F.2 [Foam Blowing Agents][no classification][Emissions][C4F10][t][no source][no method][no target][no option][no type]
status: valid
status modified: 2017-02-13
accepted date: 2017-02-13
in scheme: emissions_variables_MMR

2.F.2 [Foam Blowing Agents][no classification][Emissions][C5F12][t][no source][no method][no target][no option][no type]
type: Concept
definition: 2.F.2 [Foam Blowing Agents][no classification][Emissions][C5F12][t][no source][no method][no target][no option][no type]
status: valid
status modified: 2017-02-13
accepted date: 2017-02-13
in scheme: emissions_variables_MMR

2.F.2 [Foam Blowing Agents][no classification][Emissions][C6F14][t][no source][no method][no target][no option][no type]
type: Concept
definition: 2.F.2 [Foam Blowing Agents][no classification][Emissions][C6F14][t][no source][no method][no target][no option][no type]
status: valid
status modified: 2017-02-13
accepted date: 2017-02-13
in scheme: emissions_variables_MMR

2.F.2 [Foam Blowing Agents][no classification][Emissions][c-C3F6][t][no source][no method][no target][no option][no type]
type: Concept
definition: 2.F.2 [Foam Blowing Agents][no classification][Emissions][c-C3F6][t][no source][no method][no target][no option][no type]
status: valid
status modified: 2017-02-13
accepted date: 2017-02-13
in scheme: emissions_variables_MMR

2.F.2 [Foam Blowing Agents][no classification][Emissions][c-C4F8][t][no source][no method][no target][no option][no type]
type: Concept
definition: 2.F.2 [Foam Blowing Agents][no classification][Emissions][c-C4F8][t][no source][no method][no target][no option][no type]
status: valid
status modified: 2017-02-13
accepted date: 2017-02-13
in scheme: emissions_variables_MMR

2.F.2 [Foam Blowing Agents][no classification][Emissions][CF4][t][no source][no method][no target][no option][no type]
type: Concept
definition: 2.F.2 [Foam Blowing Agents][no classification][Emissions][CF4][t][no source][no method][no target][no option][no type]
status: valid
status modified: 2017-02-13
accepted date: 2017-02-13
in scheme: emissions_variables_MMR

2.F.2 [Foam Blowing Agents][no classification][Emissions][HFC-125][t][no source][no method][no target][no option][no type]
type: Concept
definition: 2.F.2 [Foam Blowing Agents][no classification][Emissions][HFC-125][t][no source][no method][no target][no option][no type]
status: valid
status modified: 2017-02-13
accepted date: 2017-02-13
in scheme: emissions_variables_MMR

2.F.2 [Foam Blowing Agents][no classification][Emissions][HFC-134][t][no source][no method][no target][no option][no type]
type: Concept
definition: 2.F.2 [Foam Blowing Agents][no classification][Emissions][HFC-134][t][no source][no method][no target][no option][no type]
status: valid
status modified: 2017-02-13
accepted date: 2017-02-13
in scheme: emissions_variables_MMR

2.F.2 [Foam Blowing Agents][no classification][Emissions][HFC-134a][t][no source][no method][no target][no option][no type]
type: Concept
definition: 2.F.2 [Foam Blowing Agents][no classification][Emissions][HFC-134a][t][no source][no method][no target][no option][no type]
status: valid
status modified: 2017-02-13
accepted date: 2017-02-13
in scheme: emissions_variables_MMR

2.F.2 [Foam Blowing Agents][no classification][Emissions][HFC-143][t][no source][no method][no target][no option][no type]
type: Concept
definition: 2.F.2 [Foam Blowing Agents][no classification][Emissions][HFC-143][t][no source][no method][no target][no option][no type]
status: valid
status modified: 2017-02-13
accepted date: 2017-02-13
in scheme: emissions_variables_MMR

2.F.2 [Foam Blowing Agents][no classification][Emissions][HFC-143a][t][no source][no method][no target][no option][no type]
type: Concept
definition: 2.F.2 [Foam Blowing Agents][no classification][Emissions][HFC-143a][t][no source][no method][no target][no option][no type]
status: valid
status modified: 2017-02-13
accepted date: 2017-02-13
in scheme: emissions_variables_MMR

2.F.2 [Foam Blowing Agents][no classification][Emissions][HFC-152][t][no source][no method][no target][no option][no type]
type: Concept
definition: 2.F.2 [Foam Blowing Agents][no classification][Emissions][HFC-152][t][no source][no method][no target][no option][no type]
status: valid
status modified: 2017-02-13
accepted date: 2017-02-13
in scheme: emissions_variables_MMR

2.F.2 [Foam Blowing Agents][no classification][Emissions][HFC-152a][t][no source][no method][no target][no option][no type]
type: Concept
definition: 2.F.2 [Foam Blowing Agents][no classification][Emissions][HFC-152a][t][no source][no method][no target][no option][no type]
status: valid
status modified: 2017-02-13
accepted date: 2017-02-13
in scheme: emissions_variables_MMR

2.F.2 [Foam Blowing Agents][no classification][Emissions][HFC-161][t][no source][no method][no target][no option][no type]
type: Concept
definition: 2.F.2 [Foam Blowing Agents][no classification][Emissions][HFC-161][t][no source][no method][no target][no option][no type]
status: valid
status modified: 2017-02-13
accepted date: 2017-02-13
in scheme: emissions_variables_MMR

2.F.2 [Foam Blowing Agents][no classification][Emissions][HFC-227ea][t][no source][no method][no target][no option][no type]
type: Concept
definition: 2.F.2 [Foam Blowing Agents][no classification][Emissions][HFC-227ea][t][no source][no method][no target][no option][no type]
status: valid
status modified: 2017-02-13
accepted date: 2017-02-13
in scheme: emissions_variables_MMR

2.F.2 [Foam Blowing Agents][no classification][Emissions][HFC-23][t][no source][no method][no target][no option][no type]
type: Concept
definition: 2.F.2 [Foam Blowing Agents][no classification][Emissions][HFC-23][t][no source][no method][no target][no option][no type]
status: valid
status modified: 2017-02-13
accepted date: 2017-02-13
in scheme: emissions_variables_MMR

2.F.2 [Foam Blowing Agents][no classification][Emissions][HFC-236cb][t][no source][no method][no target][no option][no type]
type: Concept
definition: 2.F.2 [Foam Blowing Agents][no classification][Emissions][HFC-236cb][t][no source][no method][no target][no option][no type]
status: valid
status modified: 2017-02-13
accepted date: 2017-02-13
in scheme: emissions_variables_MMR

2.F.2 [Foam Blowing Agents][no classification][Emissions][HFC-236ea][t][no source][no method][no target][no option][no type]
type: Concept
definition: 2.F.2 [Foam Blowing Agents][no classification][Emissions][HFC-236ea][t][no source][no method][no target][no option][no type]
status: valid
status modified: 2017-02-13
accepted date: 2017-02-13
in scheme: emissions_variables_MMR

2.F.2 [Foam Blowing Agents][no classification][Emissions][HFC-236fa][t][no source][no method][no target][no option][no type]
type: Concept
definition: 2.F.2 [Foam Blowing Agents][no classification][Emissions][HFC-236fa][t][no source][no method][no target][no option][no type]
status: valid
status modified: 2017-02-13
accepted date: 2017-02-13
in scheme: emissions_variables_MMR

2.F.2 [Foam Blowing Agents][no classification][Emissions][HFC-245ca][t][no source][no method][no target][no option][no type]
type: Concept
definition: 2.F.2 [Foam Blowing Agents][no classification][Emissions][HFC-245ca][t][no source][no method][no target][no option][no type]
status: valid
status modified: 2017-02-13
accepted date: 2017-02-13
in scheme: emissions_variables_MMR

2.F.2 [Foam Blowing Agents][no classification][Emissions][HFC-245fa][t][no source][no method][no target][no option][no type]
type: Concept
definition: 2.F.2 [Foam Blowing Agents][no classification][Emissions][HFC-245fa][t][no source][no method][no target][no option][no type]
status: valid
status modified: 2017-02-13
accepted date: 2017-02-13
in scheme: emissions_variables_MMR

2.F.2 [Foam Blowing Agents][no classification][Emissions][HFC-32][t][no source][no method][no target][no option][no type]
type: Concept
definition: 2.F.2 [Foam Blowing Agents][no classification][Emissions][HFC-32][t][no source][no method][no target][no option][no type]
status: valid
status modified: 2017-02-13
accepted date: 2017-02-13
in scheme: emissions_variables_MMR

2.F.2 [Foam Blowing Agents][no classification][Emissions][HFC-365mfc][t][no source][no method][no target][no option][no type]
type: Concept
definition: 2.F.2 [Foam Blowing Agents][no classification][Emissions][HFC-365mfc][t][no source][no method][no target][no option][no type]
status: valid
status modified: 2017-02-13
accepted date: 2017-02-13
in scheme: emissions_variables_MMR

2.F.2 [Foam Blowing Agents][no classification][Emissions][HFC-41][t][no source][no method][no target][no option][no type]
type: Concept
definition: 2.F.2 [Foam Blowing Agents][no classification][Emissions][HFC-41][t][no source][no method][no target][no option][no type]
status: valid
status modified: 2017-02-13
accepted date: 2017-02-13
in scheme: emissions_variables_MMR

2.F.2 [Foam Blowing Agents][no classification][Emissions][HFC-43-10mee][t][no source][no method][no target][no option][no type]
type: Concept
definition: 2.F.2 [Foam Blowing Agents][no classification][Emissions][HFC-43-10mee][t][no source][no method][no target][no option][no type]
status: valid
status modified: 2017-02-13
accepted date: 2017-02-13
in scheme: emissions_variables_MMR

2.F.2 [Foam Blowing Agents][no classification][Emissions][HFCs and PFCs][t CO2 equivalent][no source][no method][no target][no option][no type]
type: Concept
definition: 2.F.2 [Foam Blowing Agents][no classification][Emissions][HFCs and PFCs][t CO2 equivalent][no source][no method][no target][no option][no type]
status: valid
status modified: 2017-02-13
accepted date: 2017-02-13
in scheme: emissions_variables_MMR

2.F.2 [Foam Blowing Agents][no classification][Emissions][HFCs][t CO2 equivalent][no source][no method][no target][no option][no type]
type: Concept
definition: 2.F.2 [Foam Blowing Agents][no classification][Emissions][HFCs][t CO2 equivalent][no source][no method][no target][no option][no type]
status: valid
status modified: 2017-02-13
accepted date: 2017-02-13
in scheme: emissions_variables_MMR

2.F.2 [Foam Blowing Agents][no classification][Emissions][NF3][t][no source][no method][no target][no option][no type]
type: Concept
definition: 2.F.2 [Foam Blowing Agents][no classification][Emissions][NF3][t][no source][no method][no target][no option][no type]
status: valid
status modified: 2017-02-13
accepted date: 2017-02-13
in scheme: emissions_variables_MMR

2.F.2 [Foam Blowing Agents][no classification][Emissions][PFCs][t CO2 equivalent][no source][no method][no target][no option][no type]
type: Concept
definition: 2.F.2 [Foam Blowing Agents][no classification][Emissions][PFCs][t CO2 equivalent][no source][no method][no target][no option][no type]
status: valid
status modified: 2017-02-13
accepted date: 2017-02-13
in scheme: emissions_variables_MMR

2.F.2 [Foam Blowing Agents][no classification][Emissions][SF6][t][no source][no method][no target][no option][no type]
type: Concept
definition: 2.F.2 [Foam Blowing Agents][no classification][Emissions][SF6][t][no source][no method][no target][no option][no type]
status: valid
status modified: 2017-02-13
accepted date: 2017-02-13
in scheme: emissions_variables_MMR

2.F.2 [Foam Blowing Agents][no classification][Emissions][Unspecified mix of HFCs and PFCs][t CO2 equivalent][no source][no method][no target][no option][no type]
type: Concept
definition: 2.F.2 [Foam Blowing Agents][no classification][Emissions][Unspecified mix of HFCs and PFCs][t CO2 equivalent][no source][no method][no target][no option][no type]
status: valid
status modified: 2017-02-13
accepted date: 2017-02-13
in scheme: emissions_variables_MMR

2.F.2 [Foam Blowing Agents][no classification][Emissions][Unspecified mix of HFCs][t CO2 equivalent][no source][no method][no target][no option][no type]
type: Concept
definition: 2.F.2 [Foam Blowing Agents][no classification][Emissions][Unspecified mix of HFCs][t CO2 equivalent][no source][no method][no target][no option][no type]
status: valid
status modified: 2017-02-13
accepted date: 2017-02-13
in scheme: emissions_variables_MMR

2.F.2 [Foam Blowing Agents][no classification][Emissions][Unspecified mix of PFCs][t CO2 equivalent][no source][no method][no target][no option][no type]
type: Concept
definition: 2.F.2 [Foam Blowing Agents][no classification][Emissions][Unspecified mix of PFCs][t CO2 equivalent][no source][no method][no target][no option][no type]
status: valid
status modified: 2017-02-13
accepted date: 2017-02-13
in scheme: emissions_variables_MMR

2.F.2.a [Closed Cells][no classification][Emissions][Aggregate F-gases][t CO2 equivalent][no source][no method][no target][no option][no type]
type: Concept
definition: 2.F.2.a [Closed Cells][no classification][Emissions][Aggregate F-gases][t CO2 equivalent][no source][no method][no target][no option][no type]
status: valid
status modified: 2017-02-13
accepted date: 2017-02-13
in scheme: emissions_variables_MMR

2.F.2.a [Closed Cells][no classification][Emissions][C10F18][t][From disposal][no method][no target][no option][no type]
type: Concept
definition: 2.F.2.a [Closed Cells][no classification][Emissions][C10F18][t][From disposal][no method][no target][no option][no type]
status: valid
status modified: 2017-02-13
accepted date: 2017-02-13
in scheme: emissions_variables_MMR

2.F.2.a [Closed Cells][no classification][Emissions][C10F18][t][From manufacturing][no method][no target][no option][no type]
type: Concept
definition: 2.F.2.a [Closed Cells][no classification][Emissions][C10F18][t][From manufacturing][no method][no target][no option][no type]
status: valid
status modified: 2017-02-13
accepted date: 2017-02-13
in scheme: emissions_variables_MMR

2.F.2.a [Closed Cells][no classification][Emissions][C10F18][t][From stocks][no method][no target][no option][no type]
type: Concept
definition: 2.F.2.a [Closed Cells][no classification][Emissions][C10F18][t][From stocks][no method][no target][no option][no type]
status: valid
status modified: 2017-02-13
accepted date: 2017-02-13
in scheme: emissions_variables_MMR

2.F.2.a [Closed Cells][no classification][Emissions][C10F18][t][no source][no method][no target][no option][no type]
type: Concept
definition: 2.F.2.a [Closed Cells][no classification][Emissions][C10F18][t][no source][no method][no target][no option][no type]
status: valid
status modified: 2017-02-13
accepted date: 2017-02-13
in scheme: emissions_variables_MMR

2.F.2.a [Closed Cells][no classification][Emissions][C2F6][t][From disposal][no method][no target][no option][no type]
type: Concept
definition: 2.F.2.a [Closed Cells][no classification][Emissions][C2F6][t][From disposal][no method][no target][no option][no type]
status: valid
status modified: 2017-02-13
accepted date: 2017-02-13
in scheme: emissions_variables_MMR

2.F.2.a [Closed Cells][no classification][Emissions][C2F6][t][From manufacturing][no method][no target][no option][no type]
type: Concept
definition: 2.F.2.a [Closed Cells][no classification][Emissions][C2F6][t][From manufacturing][no method][no target][no option][no type]
status: valid
status modified: 2017-02-13
accepted date: 2017-02-13
in scheme: emissions_variables_MMR

2.F.2.a [Closed Cells][no classification][Emissions][C2F6][t][From stocks][no method][no target][no option][no type]
type: Concept
definition: 2.F.2.a [Closed Cells][no classification][Emissions][C2F6][t][From stocks][no method][no target][no option][no type]
status: valid
status modified: 2017-02-13
accepted date: 2017-02-13
in scheme: emissions_variables_MMR

2.F.2.a [Closed Cells][no classification][Emissions][C2F6][t][no source][no method][no target][no option][no type]
type: Concept
definition: 2.F.2.a [Closed Cells][no classification][Emissions][C2F6][t][no source][no method][no target][no option][no type]
status: valid
status modified: 2017-02-13
accepted date: 2017-02-13
in scheme: emissions_variables_MMR

2.F.2.a [Closed Cells][no classification][Emissions][C3F8][t][From disposal][no method][no target][no option][no type]
type: Concept
definition: 2.F.2.a [Closed Cells][no classification][Emissions][C3F8][t][From disposal][no method][no target][no option][no type]
status: valid
status modified: 2017-02-13
accepted date: 2017-02-13
in scheme: emissions_variables_MMR

2.F.2.a [Closed Cells][no classification][Emissions][C3F8][t][From manufacturing][no method][no target][no option][no type]
type: Concept
definition: 2.F.2.a [Closed Cells][no classification][Emissions][C3F8][t][From manufacturing][no method][no target][no option][no type]
status: valid
status modified: 2017-02-13
accepted date: 2017-02-13
in scheme: emissions_variables_MMR

2.F.2.a [Closed Cells][no classification][Emissions][C3F8][t][From stocks][no method][no target][no option][no type]
type: Concept
definition: 2.F.2.a [Closed Cells][no classification][Emissions][C3F8][t][From stocks][no method][no target][no option][no type]
status: valid
status modified: 2017-02-13
accepted date: 2017-02-13
in scheme: emissions_variables_MMR

2.F.2.a [Closed Cells][no classification][Emissions][C3F8][t][no source][no method][no target][no option][no type]
type: Concept
definition: 2.F.2.a [Closed Cells][no classification][Emissions][C3F8][t][no source][no method][no target][no option][no type]
status: valid
status modified: 2017-02-13
accepted date: 2017-02-13
in scheme: emissions_variables_MMR

2.F.2.a [Closed Cells][no classification][Emissions][C4F10][t][From disposal][no method][no target][no option][no type]
type: Concept
definition: 2.F.2.a [Closed Cells][no classification][Emissions][C4F10][t][From disposal][no method][no target][no option][no type]
status: valid
status modified: 2017-02-13
accepted date: 2017-02-13
in scheme: emissions_variables_MMR

2.F.2.a [Closed Cells][no classification][Emissions][C4F10][t][From manufacturing][no method][no target][no option][no type]
type: Concept
definition: 2.F.2.a [Closed Cells][no classification][Emissions][C4F10][t][From manufacturing][no method][no target][no option][no type]
status: valid
status modified: 2017-02-13
accepted date: 2017-02-13
in scheme: emissions_variables_MMR

2.F.2.a [Closed Cells][no classification][Emissions][C4F10][t][From stocks][no method][no target][no option][no type]
type: Concept
definition: 2.F.2.a [Closed Cells][no classification][Emissions][C4F10][t][From stocks][no method][no target][no option][no type]
status: valid
status modified: 2017-02-13
accepted date: 2017-02-13
in scheme: emissions_variables_MMR

2.F.2.a [Closed Cells][no classification][Emissions][C4F10][t][no source][no method][no target][no option][no type]
type: Concept
definition: 2.F.2.a [Closed Cells][no classification][Emissions][C4F10][t][no source][no method][no target][no option][no type]
status: valid
status modified: 2017-02-13
accepted date: 2017-02-13
in scheme: emissions_variables_MMR

2.F.2.a [Closed Cells][no classification][Emissions][C5F12][t][From disposal][no method][no target][no option][no type]
type: Concept
definition: 2.F.2.a [Closed Cells][no classification][Emissions][C5F12][t][From disposal][no method][no target][no option][no type]
status: valid
status modified: 2017-02-13
accepted date: 2017-02-13
in scheme: emissions_variables_MMR

2.F.2.a [Closed Cells][no classification][Emissions][C5F12][t][From manufacturing][no method][no target][no option][no type]
type: Concept
definition: 2.F.2.a [Closed Cells][no classification][Emissions][C5F12][t][From manufacturing][no method][no target][no option][no type]
status: valid
status modified: 2017-02-13
accepted date: 2017-02-13
in scheme: emissions_variables_MMR

2.F.2.a [Closed Cells][no classification][Emissions][C5F12][t][From stocks][no method][no target][no option][no type]
type: Concept
definition: 2.F.2.a [Closed Cells][no classification][Emissions][C5F12][t][From stocks][no method][no target][no option][no type]
status: valid
status modified: 2017-02-13
accepted date: 2017-02-13
in scheme: emissions_variables_MMR

2.F.2.a [Closed Cells][no classification][Emissions][C5F12][t][no source][no method][no target][no option][no type]
type: Concept
definition: 2.F.2.a [Closed Cells][no classification][Emissions][C5F12][t][no source][no method][no target][no option][no type]
status: valid
status modified: 2017-02-13
accepted date: 2017-02-13
in scheme: emissions_variables_MMR

2.F.2.a [Closed Cells][no classification][Emissions][C6F14][t][From disposal][no method][no target][no option][no type]
type: Concept
definition: 2.F.2.a [Closed Cells][no classification][Emissions][C6F14][t][From disposal][no method][no target][no option][no type]
status: valid
status modified: 2017-02-13
accepted date: 2017-02-13
in scheme: emissions_variables_MMR

2.F.2.a [Closed Cells][no classification][Emissions][C6F14][t][From manufacturing][no method][no target][no option][no type]
type: Concept
definition: 2.F.2.a [Closed Cells][no classification][Emissions][C6F14][t][From manufacturing][no method][no target][no option][no type]
status: valid
status modified: 2017-02-13
accepted date: 2017-02-13
in scheme: emissions_variables_MMR

2.F.2.a [Closed Cells][no classification][Emissions][C6F14][t][From stocks][no method][no target][no option][no type]
type: Concept
definition: 2.F.2.a [Closed Cells][no classification][Emissions][C6F14][t][From stocks][no method][no target][no option][no type]
status: valid
status modified: 2017-02-13
accepted date: 2017-02-13
in scheme: emissions_variables_MMR

2.F.2.a [Closed Cells][no classification][Emissions][C6F14][t][no source][no method][no target][no option][no type]
type: Concept
definition: 2.F.2.a [Closed Cells][no classification][Emissions][C6F14][t][no source][no method][no target][no option][no type]
status: valid
status modified: 2017-02-13
accepted date: 2017-02-13
in scheme: emissions_variables_MMR

2.F.2.a [Closed Cells][no classification][Emissions][c-C3F6][t][From disposal][no method][no target][no option][no type]
type: Concept
definition: 2.F.2.a [Closed Cells][no classification][Emissions][c-C3F6][t][From disposal][no method][no target][no option][no type]
status: valid
status modified: 2017-02-13
accepted date: 2017-02-13
in scheme: emissions_variables_MMR

2.F.2.a [Closed Cells][no classification][Emissions][c-C3F6][t][From manufacturing][no method][no target][no option][no type]
type: Concept
definition: 2.F.2.a [Closed Cells][no classification][Emissions][c-C3F6][t][From manufacturing][no method][no target][no option][no type]
status: valid
status modified: 2017-02-13
accepted date: 2017-02-13
in scheme: emissions_variables_MMR

2.F.2.a [Closed Cells][no classification][Emissions][c-C3F6][t][From stocks][no method][no target][no option][no type]
type: Concept
definition: 2.F.2.a [Closed Cells][no classification][Emissions][c-C3F6][t][From stocks][no method][no target][no option][no type]
status: valid
status modified: 2017-02-13
accepted date: 2017-02-13
in scheme: emissions_variables_MMR

2.F.2.a [Closed Cells][no classification][Emissions][c-C3F6][t][no source][no method][no target][no option][no type]
type: Concept
definition: 2.F.2.a [Closed Cells][no classification][Emissions][c-C3F6][t][no source][no method][no target][no option][no type]
status: valid
status modified: 2017-02-13
accepted date: 2017-02-13
in scheme: emissions_variables_MMR

2.F.2.a [Closed Cells][no classification][Emissions][c-C4F8][t][From disposal][no method][no target][no option][no type]
type: Concept
definition: 2.F.2.a [Closed Cells][no classification][Emissions][c-C4F8][t][From disposal][no method][no target][no option][no type]
status: valid
status modified: 2017-02-13
accepted date: 2017-02-13
in scheme: emissions_variables_MMR

2.F.2.a [Closed Cells][no classification][Emissions][c-C4F8][t][From manufacturing][no method][no target][no option][no type]
type: Concept
definition: 2.F.2.a [Closed Cells][no classification][Emissions][c-C4F8][t][From manufacturing][no method][no target][no option][no type]
status: valid
status modified: 2017-02-13
accepted date: 2017-02-13
in scheme: emissions_variables_MMR

2.F.2.a [Closed Cells][no classification][Emissions][c-C4F8][t][From stocks][no method][no target][no option][no type]
type: Concept
definition: 2.F.2.a [Closed Cells][no classification][Emissions][c-C4F8][t][From stocks][no method][no target][no option][no type]
status: valid
status modified: 2017-02-13
accepted date: 2017-02-13
in scheme: emissions_variables_MMR

2.F.2.a [Closed Cells][no classification][Emissions][c-C4F8][t][no source][no method][no target][no option][no type]
type: Concept
definition: 2.F.2.a [Closed Cells][no classification][Emissions][c-C4F8][t][no source][no method][no target][no option][no type]
status: valid
status modified: 2017-02-13
accepted date: 2017-02-13
in scheme: emissions_variables_MMR

2.F.2.a [Closed Cells][no classification][Emissions][CF4][t][From disposal][no method][no target][no option][no type]
type: Concept
definition: 2.F.2.a [Closed Cells][no classification][Emissions][CF4][t][From disposal][no method][no target][no option][no type]
status: valid
status modified: 2017-02-13
accepted date: 2017-02-13
in scheme: emissions_variables_MMR

2.F.2.a [Closed Cells][no classification][Emissions][CF4][t][From manufacturing][no method][no target][no option][no type]
type: Concept
definition: 2.F.2.a [Closed Cells][no classification][Emissions][CF4][t][From manufacturing][no method][no target][no option][no type]
status: valid
status modified: 2017-02-13
accepted date: 2017-02-13
in scheme: emissions_variables_MMR

2.F.2.a [Closed Cells][no classification][Emissions][CF4][t][From stocks][no method][no target][no option][no type]
type: Concept
definition: 2.F.2.a [Closed Cells][no classification][Emissions][CF4][t][From stocks][no method][no target][no option][no type]
status: valid
status modified: 2017-02-13
accepted date: 2017-02-13
in scheme: emissions_variables_MMR

2.F.2.a [Closed Cells][no classification][Emissions][CF4][t][no source][no method][no target][no option][no type]
type: Concept
definition: 2.F.2.a [Closed Cells][no classification][Emissions][CF4][t][no source][no method][no target][no option][no type]
status: valid
status modified: 2017-02-13
accepted date: 2017-02-13
in scheme: emissions_variables_MMR

2.F.2.a [Closed Cells][no classification][Emissions][HFC-125][t][From disposal][no method][no target][no option][no type]
type: Concept
definition: 2.F.2.a [Closed Cells][no classification][Emissions][HFC-125][t][From disposal][no method][no target][no option][no type]
status: valid
status modified: 2017-02-13
accepted date: 2017-02-13
in scheme: emissions_variables_MMR

2.F.2.a [Closed Cells][no classification][Emissions][HFC-125][t][From manufacturing][no method][no target][no option][no type]
type: Concept
definition: 2.F.2.a [Closed Cells][no classification][Emissions][HFC-125][t][From manufacturing][no method][no target][no option][no type]
status: valid
status modified: 2017-02-13
accepted date: 2017-02-13
in scheme: emissions_variables_MMR

2.F.2.a [Closed Cells][no classification][Emissions][HFC-125][t][From stocks][no method][no target][no option][no type]
type: Concept
definition: 2.F.2.a [Closed Cells][no classification][Emissions][HFC-125][t][From stocks][no method][no target][no option][no type]
status: valid
status modified: 2017-02-13
accepted date: 2017-02-13
in scheme: emissions_variables_MMR

2.F.2.a [Closed Cells][no classification][Emissions][HFC-125][t][no source][no method][no target][no option][no type]
type: Concept
definition: 2.F.2.a [Closed Cells][no classification][Emissions][HFC-125][t][no source][no method][no target][no option][no type]
status: valid
status modified: 2017-02-13
accepted date: 2017-02-13
in scheme: emissions_variables_MMR

2.F.2.a [Closed Cells][no classification][Emissions][HFC-134][t][From disposal][no method][no target][no option][no type]
type: Concept
definition: 2.F.2.a [Closed Cells][no classification][Emissions][HFC-134][t][From disposal][no method][no target][no option][no type]
status: valid
status modified: 2017-02-13
accepted date: 2017-02-13
in scheme: emissions_variables_MMR

2.F.2.a [Closed Cells][no classification][Emissions][HFC-134][t][From manufacturing][no method][no target][no option][no type]
type: Concept
definition: 2.F.2.a [Closed Cells][no classification][Emissions][HFC-134][t][From manufacturing][no method][no target][no option][no type]
status: valid
status modified: 2017-02-13
accepted date: 2017-02-13
in scheme: emissions_variables_MMR

2.F.2.a [Closed Cells][no classification][Emissions][HFC-134][t][From stocks][no method][no target][no option][no type]
type: Concept
definition: 2.F.2.a [Closed Cells][no classification][Emissions][HFC-134][t][From stocks][no method][no target][no option][no type]
status: valid
status modified: 2017-02-13
accepted date: 2017-02-13
in scheme: emissions_variables_MMR

2.F.2.a [Closed Cells][no classification][Emissions][HFC-134][t][no source][no method][no target][no option][no type]
type: Concept
definition: 2.F.2.a [Closed Cells][no classification][Emissions][HFC-134][t][no source][no method][no target][no option][no type]
status: valid
status modified: 2017-02-13
accepted date: 2017-02-13
in scheme: emissions_variables_MMR

2.F.2.a [Closed Cells][no classification][Emissions][HFC-134a][t][From disposal][no method][no target][no option][no type]
type: Concept
definition: 2.F.2.a [Closed Cells][no classification][Emissions][HFC-134a][t][From disposal][no method][no target][no option][no type]
status: valid
status modified: 2017-02-13
accepted date: 2017-02-13
in scheme: emissions_variables_MMR

2.F.2.a [Closed Cells][no classification][Emissions][HFC-134a][t][From manufacturing][no method][no target][no option][no type]
type: Concept
definition: 2.F.2.a [Closed Cells][no classification][Emissions][HFC-134a][t][From manufacturing][no method][no target][no option][no type]
status: valid
status modified: 2017-02-13
accepted date: 2017-02-13
in scheme: emissions_variables_MMR

2.F.2.a [Closed Cells][no classification][Emissions][HFC-134a][t][From stocks][no method][no target][no option][no type]
type: Concept
definition: 2.F.2.a [Closed Cells][no classification][Emissions][HFC-134a][t][From stocks][no method][no target][no option][no type]
status: valid
status modified: 2017-02-13
accepted date: 2017-02-13
in scheme: emissions_variables_MMR

2.F.2.a [Closed Cells][no classification][Emissions][HFC-134a][t][no source][no method][no target][no option][no type]
type: Concept
definition: 2.F.2.a [Closed Cells][no classification][Emissions][HFC-134a][t][no source][no method][no target][no option][no type]
status: valid
status modified: 2017-02-13
accepted date: 2017-02-13
in scheme: emissions_variables_MMR

2.F.2.a [Closed Cells][no classification][Emissions][HFC-143][t][From disposal][no method][no target][no option][no type]
type: Concept
definition: 2.F.2.a [Closed Cells][no classification][Emissions][HFC-143][t][From disposal][no method][no target][no option][no type]
status: valid
status modified: 2017-02-13
accepted date: 2017-02-13
in scheme: emissions_variables_MMR

2.F.2.a [Closed Cells][no classification][Emissions][HFC-143][t][From manufacturing][no method][no target][no option][no type]
type: Concept
definition: 2.F.2.a [Closed Cells][no classification][Emissions][HFC-143][t][From manufacturing][no method][no target][no option][no type]
status: valid
status modified: 2017-02-13
accepted date: 2017-02-13
in scheme: emissions_variables_MMR

2.F.2.a [Closed Cells][no classification][Emissions][HFC-143][t][From stocks][no method][no target][no option][no type]
type: Concept
definition: 2.F.2.a [Closed Cells][no classification][Emissions][HFC-143][t][From stocks][no method][no target][no option][no type]
status: valid
status modified: 2017-02-13
accepted date: 2017-02-13
in scheme: emissions_variables_MMR

2.F.2.a [Closed Cells][no classification][Emissions][HFC-143][t][no source][no method][no target][no option][no type]
type: Concept
definition: 2.F.2.a [Closed Cells][no classification][Emissions][HFC-143][t][no source][no method][no target][no option][no type]
status: valid
status modified: 2017-02-13
accepted date: 2017-02-13
in scheme: emissions_variables_MMR

2.F.2.a [Closed Cells][no classification][Emissions][HFC-143a][t][From disposal][no method][no target][no option][no type]
type: Concept
definition: 2.F.2.a [Closed Cells][no classification][Emissions][HFC-143a][t][From disposal][no method][no target][no option][no type]
status: valid
status modified: 2017-02-13
accepted date: 2017-02-13
in scheme: emissions_variables_MMR

2.F.2.a [Closed Cells][no classification][Emissions][HFC-143a][t][From manufacturing][no method][no target][no option][no type]
type: Concept
definition: 2.F.2.a [Closed Cells][no classification][Emissions][HFC-143a][t][From manufacturing][no method][no target][no option][no type]
status: valid
status modified: 2017-02-13
accepted date: 2017-02-13
in scheme: emissions_variables_MMR

2.F.2.a [Closed Cells][no classification][Emissions][HFC-143a][t][From stocks][no method][no target][no option][no type]
type: Concept
definition: 2.F.2.a [Closed Cells][no classification][Emissions][HFC-143a][t][From stocks][no method][no target][no option][no type]
status: valid
status modified: 2017-02-13
accepted date: 2017-02-13
in scheme: emissions_variables_MMR

2.F.2.a [Closed Cells][no classification][Emissions][HFC-143a][t][no source][no method][no target][no option][no type]
type: Concept
definition: 2.F.2.a [Closed Cells][no classification][Emissions][HFC-143a][t][no source][no method][no target][no option][no type]
status: valid
status modified: 2017-02-13
accepted date: 2017-02-13
in scheme: emissions_variables_MMR

2.F.2.a [Closed Cells][no classification][Emissions][HFC-152][t][From disposal][no method][no target][no option][no type]
type: Concept
definition: 2.F.2.a [Closed Cells][no classification][Emissions][HFC-152][t][From disposal][no method][no target][no option][no type]
status: valid
status modified: 2017-02-13
accepted date: 2017-02-13
in scheme: emissions_variables_MMR

2.F.2.a [Closed Cells][no classification][Emissions][HFC-152][t][From manufacturing][no method][no target][no option][no type]
type: Concept
definition: 2.F.2.a [Closed Cells][no classification][Emissions][HFC-152][t][From manufacturing][no method][no target][no option][no type]
status: valid
status modified: 2017-02-13
accepted date: 2017-02-13
in scheme: emissions_variables_MMR

2.F.2.a [Closed Cells][no classification][Emissions][HFC-152][t][From stocks][no method][no target][no option][no type]
type: Concept
definition: 2.F.2.a [Closed Cells][no classification][Emissions][HFC-152][t][From stocks][no method][no target][no option][no type]
status: valid
status modified: 2017-02-13
accepted date: 2017-02-13
in scheme: emissions_variables_MMR

2.F.2.a [Closed Cells][no classification][Emissions][HFC-152][t][no source][no method][no target][no option][no type]
type: Concept
definition: 2.F.2.a [Closed Cells][no classification][Emissions][HFC-152][t][no source][no method][no target][no option][no type]
status: valid
status modified: 2017-02-13
accepted date: 2017-02-13
in scheme: emissions_variables_MMR

2.F.2.a [Closed Cells][no classification][Emissions][HFC-152a][t][From disposal][no method][no target][no option][no type]
type: Concept
definition: 2.F.2.a [Closed Cells][no classification][Emissions][HFC-152a][t][From disposal][no method][no target][no option][no type]
status: valid
status modified: 2017-02-13
accepted date: 2017-02-13
in scheme: emissions_variables_MMR

2.F.2.a [Closed Cells][no classification][Emissions][HFC-152a][t][From manufacturing][no method][no target][no option][no type]
type: Concept
definition: 2.F.2.a [Closed Cells][no classification][Emissions][HFC-152a][t][From manufacturing][no method][no target][no option][no type]
status: valid
status modified: 2017-02-13
accepted date: 2017-02-13
in scheme: emissions_variables_MMR

2.F.2.a [Closed Cells][no classification][Emissions][HFC-152a][t][From stocks][no method][no target][no option][no type]
type: Concept
definition: 2.F.2.a [Closed Cells][no classification][Emissions][HFC-152a][t][From stocks][no method][no target][no option][no type]
status: valid
status modified: 2017-02-13
accepted date: 2017-02-13
in scheme: emissions_variables_MMR

2.F.2.a [Closed Cells][no classification][Emissions][HFC-152a][t][no source][no method][no target][no option][no type]
type: Concept
definition: 2.F.2.a [Closed Cells][no classification][Emissions][HFC-152a][t][no source][no method][no target][no option][no type]
status: valid
status modified: 2017-02-13
accepted date: 2017-02-13
in scheme: emissions_variables_MMR

2.F.2.a [Closed Cells][no classification][Emissions][HFC-161][t][From disposal][no method][no target][no option][no type]
type: Concept
definition: 2.F.2.a [Closed Cells][no classification][Emissions][HFC-161][t][From disposal][no method][no target][no option][no type]
status: valid
status modified: 2017-02-13
accepted date: 2017-02-13
in scheme: emissions_variables_MMR

2.F.2.a [Closed Cells][no classification][Emissions][HFC-161][t][From manufacturing][no method][no target][no option][no type]
type: Concept
definition: 2.F.2.a [Closed Cells][no classification][Emissions][HFC-161][t][From manufacturing][no method][no target][no option][no type]
status: valid
status modified: 2017-02-13
accepted date: 2017-02-13
in scheme: emissions_variables_MMR

2.F.2.a [Closed Cells][no classification][Emissions][HFC-161][t][From stocks][no method][no target][no option][no type]
type: Concept
definition: 2.F.2.a [Closed Cells][no classification][Emissions][HFC-161][t][From stocks][no method][no target][no option][no type]
status: valid
status modified: 2017-02-13
accepted date: 2017-02-13
in scheme: emissions_variables_MMR

2.F.2.a [Closed Cells][no classification][Emissions][HFC-161][t][no source][no method][no target][no option][no type]
type: Concept
definition: 2.F.2.a [Closed Cells][no classification][Emissions][HFC-161][t][no source][no method][no target][no option][no type]
status: valid
status modified: 2017-02-13
accepted date: 2017-02-13
in scheme: emissions_variables_MMR

2.F.2.a [Closed Cells][no classification][Emissions][HFC-227ea][t][From disposal][no method][no target][no option][no type]
type: Concept
definition: 2.F.2.a [Closed Cells][no classification][Emissions][HFC-227ea][t][From disposal][no method][no target][no option][no type]
status: valid
status modified: 2017-02-13
accepted date: 2017-02-13
in scheme: emissions_variables_MMR

2.F.2.a [Closed Cells][no classification][Emissions][HFC-227ea][t][From manufacturing][no method][no target][no option][no type]
type: Concept
definition: 2.F.2.a [Closed Cells][no classification][Emissions][HFC-227ea][t][From manufacturing][no method][no target][no option][no type]
status: valid
status modified: 2017-02-13
accepted date: 2017-02-13
in scheme: emissions_variables_MMR

2.F.2.a [Closed Cells][no classification][Emissions][HFC-227ea][t][From stocks][no method][no target][no option][no type]
type: Concept
definition: 2.F.2.a [Closed Cells][no classification][Emissions][HFC-227ea][t][From stocks][no method][no target][no option][no type]
status: valid
status modified: 2017-02-13
accepted date: 2017-02-13
in scheme: emissions_variables_MMR

2.F.2.a [Closed Cells][no classification][Emissions][HFC-227ea][t][no source][no method][no target][no option][no type]
type: Concept
definition: 2.F.2.a [Closed Cells][no classification][Emissions][HFC-227ea][t][no source][no method][no target][no option][no type]
status: valid
status modified: 2017-02-13
accepted date: 2017-02-13
in scheme: emissions_variables_MMR

2.F.2.a [Closed Cells][no classification][Emissions][HFC-23][t][From disposal][no method][no target][no option][no type]
type: Concept
definition: 2.F.2.a [Closed Cells][no classification][Emissions][HFC-23][t][From disposal][no method][no target][no option][no type]
status: valid
status modified: 2017-02-13
accepted date: 2017-02-13
in scheme: emissions_variables_MMR

2.F.2.a [Closed Cells][no classification][Emissions][HFC-23][t][From manufacturing][no method][no target][no option][no type]
type: Concept
definition: 2.F.2.a [Closed Cells][no classification][Emissions][HFC-23][t][From manufacturing][no method][no target][no option][no type]
status: valid
status modified: 2017-02-13
accepted date: 2017-02-13
in scheme: emissions_variables_MMR

2.F.2.a [Closed Cells][no classification][Emissions][HFC-23][t][From stocks][no method][no target][no option][no type]
type: Concept
definition: 2.F.2.a [Closed Cells][no classification][Emissions][HFC-23][t][From stocks][no method][no target][no option][no type]
status: valid
status modified: 2017-02-13
accepted date: 2017-02-13
in scheme: emissions_variables_MMR

2.F.2.a [Closed Cells][no classification][Emissions][HFC-23][t][no source][no method][no target][no option][no type]
type: Concept
definition: 2.F.2.a [Closed Cells][no classification][Emissions][HFC-23][t][no source][no method][no target][no option][no type]
status: valid
status modified: 2017-02-13
accepted date: 2017-02-13
in scheme: emissions_variables_MMR

2.F.2.a [Closed Cells][no classification][Emissions][HFC-236cb][t][From disposal][no method][no target][no option][no type]
type: Concept
definition: 2.F.2.a [Closed Cells][no classification][Emissions][HFC-236cb][t][From disposal][no method][no target][no option][no type]
status: valid
status modified: 2017-02-13
accepted date: 2017-02-13
in scheme: emissions_variables_MMR

2.F.2.a [Closed Cells][no classification][Emissions][HFC-236cb][t][From manufacturing][no method][no target][no option][no type]
type: Concept
definition: 2.F.2.a [Closed Cells][no classification][Emissions][HFC-236cb][t][From manufacturing][no method][no target][no option][no type]
status: valid
status modified: 2017-02-13
accepted date: 2017-02-13
in scheme: emissions_variables_MMR

2.F.2.a [Closed Cells][no classification][Emissions][HFC-236cb][t][From stocks][no method][no target][no option][no type]
type: Concept
definition: 2.F.2.a [Closed Cells][no classification][Emissions][HFC-236cb][t][From stocks][no method][no target][no option][no type]
status: valid
status modified: 2017-02-13
accepted date: 2017-02-13
in scheme: emissions_variables_MMR

2.F.2.a [Closed Cells][no classification][Emissions][HFC-236cb][t][no source][no method][no target][no option][no type]
type: Concept
definition: 2.F.2.a [Closed Cells][no classification][Emissions][HFC-236cb][t][no source][no method][no target][no option][no type]
status: valid
status modified: 2017-02-13
accepted date: 2017-02-13
in scheme: emissions_variables_MMR

2.F.2.a [Closed Cells][no classification][Emissions][HFC-236ea][t][From disposal][no method][no target][no option][no type]
type: Concept
definition: 2.F.2.a [Closed Cells][no classification][Emissions][HFC-236ea][t][From disposal][no method][no target][no option][no type]
status: valid
status modified: 2017-02-13
accepted date: 2017-02-13
in scheme: emissions_variables_MMR

2.F.2.a [Closed Cells][no classification][Emissions][HFC-236ea][t][From manufacturing][no method][no target][no option][no type]
type: Concept
definition: 2.F.2.a [Closed Cells][no classification][Emissions][HFC-236ea][t][From manufacturing][no method][no target][no option][no type]
status: valid
status modified: 2017-02-13
accepted date: 2017-02-13
in scheme: emissions_variables_MMR

2.F.2.a [Closed Cells][no classification][Emissions][HFC-236ea][t][From stocks][no method][no target][no option][no type]
type: Concept
definition: 2.F.2.a [Closed Cells][no classification][Emissions][HFC-236ea][t][From stocks][no method][no target][no option][no type]
status: valid
status modified: 2017-02-13
accepted date: 2017-02-13
in scheme: emissions_variables_MMR

2.F.2.a [Closed Cells][no classification][Emissions][HFC-236ea][t][no source][no method][no target][no option][no type]
type: Concept
definition: 2.F.2.a [Closed Cells][no classification][Emissions][HFC-236ea][t][no source][no method][no target][no option][no type]
status: valid
status modified: 2017-02-13
accepted date: 2017-02-13
in scheme: emissions_variables_MMR

2.F.2.a [Closed Cells][no classification][Emissions][HFC-236fa][t][From disposal][no method][no target][no option][no type]
type: Concept
definition: 2.F.2.a [Closed Cells][no classification][Emissions][HFC-236fa][t][From disposal][no method][no target][no option][no type]
status: valid
status modified: 2017-02-13
accepted date: 2017-02-13
in scheme: emissions_variables_MMR

2.F.2.a [Closed Cells][no classification][Emissions][HFC-236fa][t][From manufacturing][no method][no target][no option][no type]
type: Concept
definition: 2.F.2.a [Closed Cells][no classification][Emissions][HFC-236fa][t][From manufacturing][no method][no target][no option][no type]
status: valid
status modified: 2017-02-13
accepted date: 2017-02-13
in scheme: emissions_variables_MMR

2.F.2.a [Closed Cells][no classification][Emissions][HFC-236fa][t][From stocks][no method][no target][no option][no type]
type: Concept
definition: 2.F.2.a [Closed Cells][no classification][Emissions][HFC-236fa][t][From stocks][no method][no target][no option][no type]
status: valid
status modified: 2017-02-13
accepted date: 2017-02-13
in scheme: emissions_variables_MMR

2.F.2.a [Closed Cells][no classification][Emissions][HFC-236fa][t][no source][no method][no target][no option][no type]
type: Concept
definition: 2.F.2.a [Closed Cells][no classification][Emissions][HFC-236fa][t][no source][no method][no target][no option][no type]
status: valid
status modified: 2017-02-13
accepted date: 2017-02-13
in scheme: emissions_variables_MMR

2.F.2.a [Closed Cells][no classification][Emissions][HFC-245ca][t][From disposal][no method][no target][no option][no type]
type: Concept
definition: 2.F.2.a [Closed Cells][no classification][Emissions][HFC-245ca][t][From disposal][no method][no target][no option][no type]
status: valid
status modified: 2017-02-13
accepted date: 2017-02-13
in scheme: emissions_variables_MMR

2.F.2.a [Closed Cells][no classification][Emissions][HFC-245ca][t][From manufacturing][no method][no target][no option][no type]
type: Concept
definition: 2.F.2.a [Closed Cells][no classification][Emissions][HFC-245ca][t][From manufacturing][no method][no target][no option][no type]
status: valid
status modified: 2017-02-13
accepted date: 2017-02-13
in scheme: emissions_variables_MMR

2.F.2.a [Closed Cells][no classification][Emissions][HFC-245ca][t][From stocks][no method][no target][no option][no type]
type: Concept
definition: 2.F.2.a [Closed Cells][no classification][Emissions][HFC-245ca][t][From stocks][no method][no target][no option][no type]
status: valid
status modified: 2017-02-13
accepted date: 2017-02-13
in scheme: emissions_variables_MMR

2.F.2.a [Closed Cells][no classification][Emissions][HFC-245ca][t][no source][no method][no target][no option][no type]
type: Concept
definition: 2.F.2.a [Closed Cells][no classification][Emissions][HFC-245ca][t][no source][no method][no target][no option][no type]
status: valid
status modified: 2017-02-13
accepted date: 2017-02-13
in scheme: emissions_variables_MMR

2.F.2.a [Closed Cells][no classification][Emissions][HFC-245fa][t][From disposal][no method][no target][no option][no type]
type: Concept
definition: 2.F.2.a [Closed Cells][no classification][Emissions][HFC-245fa][t][From disposal][no method][no target][no option][no type]
status: valid
status modified: 2017-02-13
accepted date: 2017-02-13
in scheme: emissions_variables_MMR

2.F.2.a [Closed Cells][no classification][Emissions][HFC-245fa][t][From manufacturing][no method][no target][no option][no type]
type: Concept
definition: 2.F.2.a [Closed Cells][no classification][Emissions][HFC-245fa][t][From manufacturing][no method][no target][no option][no type]
status: valid
status modified: 2017-02-13
accepted date: 2017-02-13
in scheme: emissions_variables_MMR

2.F.2.a [Closed Cells][no classification][Emissions][HFC-245fa][t][From stocks][no method][no target][no option][no type]
type: Concept
definition: 2.F.2.a [Closed Cells][no classification][Emissions][HFC-245fa][t][From stocks][no method][no target][no option][no type]
status: valid
status modified: 2017-02-13
accepted date: 2017-02-13
in scheme: emissions_variables_MMR

2.F.2.a [Closed Cells][no classification][Emissions][HFC-245fa][t][no source][no method][no target][no option][no type]
type: Concept
definition: 2.F.2.a [Closed Cells][no classification][Emissions][HFC-245fa][t][no source][no method][no target][no option][no type]
status: valid
status modified: 2017-02-13
accepted date: 2017-02-13
in scheme: emissions_variables_MMR

2.F.2.a [Closed Cells][no classification][Emissions][HFC-32][t][From disposal][no method][no target][no option][no type]
type: Concept
definition: 2.F.2.a [Closed Cells][no classification][Emissions][HFC-32][t][From disposal][no method][no target][no option][no type]
status: valid
status modified: 2017-02-13
accepted date: 2017-02-13
in scheme: emissions_variables_MMR

2.F.2.a [Closed Cells][no classification][Emissions][HFC-32][t][From manufacturing][no method][no target][no option][no type]
type: Concept
definition: 2.F.2.a [Closed Cells][no classification][Emissions][HFC-32][t][From manufacturing][no method][no target][no option][no type]
status: valid
status modified: 2017-02-13
accepted date: 2017-02-13
in scheme: emissions_variables_MMR

2.F.2.a [Closed Cells][no classification][Emissions][HFC-32][t][From stocks][no method][no target][no option][no type]
type: Concept
definition: 2.F.2.a [Closed Cells][no classification][Emissions][HFC-32][t][From stocks][no method][no target][no option][no type]
status: valid
status modified: 2017-02-13
accepted date: 2017-02-13
in scheme: emissions_variables_MMR

2.F.2.a [Closed Cells][no classification][Emissions][HFC-32][t][no source][no method][no target][no option][no type]
type: Concept
definition: 2.F.2.a [Closed Cells][no classification][Emissions][HFC-32][t][no source][no method][no target][no option][no type]
status: valid
status modified: 2017-02-13
accepted date: 2017-02-13
in scheme: emissions_variables_MMR

2.F.2.a [Closed Cells][no classification][Emissions][HFC-365mfc][t][From disposal][no method][no target][no option][no type]
type: Concept
definition: 2.F.2.a [Closed Cells][no classification][Emissions][HFC-365mfc][t][From disposal][no method][no target][no option][no type]
status: valid
status modified: 2017-02-13
accepted date: 2017-02-13
in scheme: emissions_variables_MMR

2.F.2.a [Closed Cells][no classification][Emissions][HFC-365mfc][t][From manufacturing][no method][no target][no option][no type]
type: Concept
definition: 2.F.2.a [Closed Cells][no classification][Emissions][HFC-365mfc][t][From manufacturing][no method][no target][no option][no type]
status: valid
status modified: 2017-02-13
accepted date: 2017-02-13
in scheme: emissions_variables_MMR

2.F.2.a [Closed Cells][no classification][Emissions][HFC-365mfc][t][From stocks][no method][no target][no option][no type]
type: Concept
definition: 2.F.2.a [Closed Cells][no classification][Emissions][HFC-365mfc][t][From stocks][no method][no target][no option][no type]
status: valid
status modified: 2017-02-13
accepted date: 2017-02-13
in scheme: emissions_variables_MMR

2.F.2.a [Closed Cells][no classification][Emissions][HFC-365mfc][t][no source][no method][no target][no option][no type]
type: Concept
definition: 2.F.2.a [Closed Cells][no classification][Emissions][HFC-365mfc][t][no source][no method][no target][no option][no type]
status: valid
status modified: 2017-02-13
accepted date: 2017-02-13
in scheme: emissions_variables_MMR

2.F.2.a [Closed Cells][no classification][Emissions][HFC-41][t][From disposal][no method][no target][no option][no type]
type: Concept
definition: 2.F.2.a [Closed Cells][no classification][Emissions][HFC-41][t][From disposal][no method][no target][no option][no type]
status: valid
status modified: 2017-02-13
accepted date: 2017-02-13
in scheme: emissions_variables_MMR

2.F.2.a [Closed Cells][no classification][Emissions][HFC-41][t][From manufacturing][no method][no target][no option][no type]
type: Concept
definition: 2.F.2.a [Closed Cells][no classification][Emissions][HFC-41][t][From manufacturing][no method][no target][no option][no type]
status: valid
status modified: 2017-02-13
accepted date: 2017-02-13
in scheme: emissions_variables_MMR

2.F.2.a [Closed Cells][no classification][Emissions][HFC-41][t][From stocks][no method][no target][no option][no type]
type: Concept
definition: 2.F.2.a [Closed Cells][no classification][Emissions][HFC-41][t][From stocks][no method][no target][no option][no type]
status: valid
status modified: 2017-02-13
accepted date: 2017-02-13
in scheme: emissions_variables_MMR

2.F.2.a [Closed Cells][no classification][Emissions][HFC-41][t][no source][no method][no target][no option][no type]
type: Concept
definition: 2.F.2.a [Closed Cells][no classification][Emissions][HFC-41][t][no source][no method][no target][no option][no type]
status: valid
status modified: 2017-02-13
accepted date: 2017-02-13
in scheme: emissions_variables_MMR

2.F.2.a [Closed Cells][no classification][Emissions][HFC-43-10mee][t][From disposal][no method][no target][no option][no type]
type: Concept
definition: 2.F.2.a [Closed Cells][no classification][Emissions][HFC-43-10mee][t][From disposal][no method][no target][no option][no type]
status: valid
status modified: 2017-02-13
accepted date: 2017-02-13
in scheme: emissions_variables_MMR

2.F.2.a [Closed Cells][no classification][Emissions][HFC-43-10mee][t][From manufacturing][no method][no target][no option][no type]
type: Concept
definition: 2.F.2.a [Closed Cells][no classification][Emissions][HFC-43-10mee][t][From manufacturing][no method][no target][no option][no type]
status: valid
status modified: 2017-02-13
accepted date: 2017-02-13
in scheme: emissions_variables_MMR

2.F.2.a [Closed Cells][no classification][Emissions][HFC-43-10mee][t][From stocks][no method][no target][no option][no type]
type: Concept
definition: 2.F.2.a [Closed Cells][no classification][Emissions][HFC-43-10mee][t][From stocks][no method][no target][no option][no type]
status: valid
status modified: 2017-02-13
accepted date: 2017-02-13
in scheme: emissions_variables_MMR

2.F.2.a [Closed Cells][no classification][Emissions][HFC-43-10mee][t][no source][no method][no target][no option][no type]
type: Concept
definition: 2.F.2.a [Closed Cells][no classification][Emissions][HFC-43-10mee][t][no source][no method][no target][no option][no type]
status: valid
status modified: 2017-02-13
accepted date: 2017-02-13
in scheme: emissions_variables_MMR

2.F.2.a [Closed Cells][no classification][Emissions][HFCs and PFCs][t CO2 equivalent][no source][no method][no target][no option][no type]
type: Concept
definition: 2.F.2.a [Closed Cells][no classification][Emissions][HFCs and PFCs][t CO2 equivalent][no source][no method][no target][no option][no type]
status: valid
status modified: 2017-02-13
accepted date: 2017-02-13
in scheme: emissions_variables_MMR

2.F.2.a [Closed Cells][no classification][Emissions][HFCs][t CO2 equivalent][no source][no method][no target][no option][no type]
type: Concept
definition: 2.F.2.a [Closed Cells][no classification][Emissions][HFCs][t CO2 equivalent][no source][no method][no target][no option][no type]
status: valid
status modified: 2017-02-13
accepted date: 2017-02-13
in scheme: emissions_variables_MMR

2.F.2.a [Closed Cells][no classification][Emissions][NF3][t][From disposal][no method][no target][no option][no type]
type: Concept
definition: 2.F.2.a [Closed Cells][no classification][Emissions][NF3][t][From disposal][no method][no target][no option][no type]
status: valid
status modified: 2017-02-13
accepted date: 2017-02-13
in scheme: emissions_variables_MMR

2.F.2.a [Closed Cells][no classification][Emissions][NF3][t][From manufacturing][no method][no target][no option][no type]
type: Concept
definition: 2.F.2.a [Closed Cells][no classification][Emissions][NF3][t][From manufacturing][no method][no target][no option][no type]
status: valid
status modified: 2017-02-13
accepted date: 2017-02-13
in scheme: emissions_variables_MMR

2.F.2.a [Closed Cells][no classification][Emissions][NF3][t][From stocks][no method][no target][no option][no type]
type: Concept
definition: 2.F.2.a [Closed Cells][no classification][Emissions][NF3][t][From stocks][no method][no target][no option][no type]
status: valid
status modified: 2017-02-13
accepted date: 2017-02-13
in scheme: emissions_variables_MMR

2.F.2.a [Closed Cells][no classification][Emissions][NF3][t][no source][no method][no target][no option][no type]
type: Concept
definition: 2.F.2.a [Closed Cells][no classification][Emissions][NF3][t][no source][no method][no target][no option][no type]
status: valid
status modified: 2017-02-13
accepted date: 2017-02-13
in scheme: emissions_variables_MMR

2.F.2.a [Closed Cells][no classification][Emissions][PFCs][t CO2 equivalent][no source][no method][no target][no option][no type]
type: Concept
definition: 2.F.2.a [Closed Cells][no classification][Emissions][PFCs][t CO2 equivalent][no source][no method][no target][no option][no type]
status: valid
status modified: 2017-02-13
accepted date: 2017-02-13
in scheme: emissions_variables_MMR

2.F.2.a [Closed Cells][no classification][Emissions][SF6][t][From disposal][no method][no target][no option][no type]
type: Concept
definition: 2.F.2.a [Closed Cells][no classification][Emissions][SF6][t][From disposal][no method][no target][no option][no type]
status: valid
status modified: 2017-02-13
accepted date: 2017-02-13
in scheme: emissions_variables_MMR

2.F.2.a [Closed Cells][no classification][Emissions][SF6][t][From manufacturing][no method][no target][no option][no type]
type: Concept
definition: 2.F.2.a [Closed Cells][no classification][Emissions][SF6][t][From manufacturing][no method][no target][no option][no type]
status: valid
status modified: 2017-02-13
accepted date: 2017-02-13
in scheme: emissions_variables_MMR

2.F.2.a [Closed Cells][no classification][Emissions][SF6][t][From stocks][no method][no target][no option][no type]
type: Concept
definition: 2.F.2.a [Closed Cells][no classification][Emissions][SF6][t][From stocks][no method][no target][no option][no type]
status: valid
status modified: 2017-02-13
accepted date: 2017-02-13
in scheme: emissions_variables_MMR

2.F.2.a [Closed Cells][no classification][Emissions][SF6][t][no source][no method][no target][no option][no type]
type: Concept
definition: 2.F.2.a [Closed Cells][no classification][Emissions][SF6][t][no source][no method][no target][no option][no type]
status: valid
status modified: 2017-02-13
accepted date: 2017-02-13
in scheme: emissions_variables_MMR

2.F.2.a [Closed Cells][no classification][Emissions][Unspecified mix of HFCs and PFCs][t CO2 equivalent][From disposal][no method][no target][no option][no type]
type: Concept
definition: 2.F.2.a [Closed Cells][no classification][Emissions][Unspecified mix of HFCs and PFCs][t CO2 equivalent][From disposal][no method][no target][no option][no type]
status: valid
status modified: 2017-02-13
accepted date: 2017-02-13
in scheme: emissions_variables_MMR

2.F.2.a [Closed Cells][no classification][Emissions][Unspecified mix of HFCs and PFCs][t CO2 equivalent][From manufacturing][no method][no target][no option][no type]
type: Concept
definition: 2.F.2.a [Closed Cells][no classification][Emissions][Unspecified mix of HFCs and PFCs][t CO2 equivalent][From manufacturing][no method][no target][no option][no type]
status: valid
status modified: 2017-02-13
accepted date: 2017-02-13
in scheme: emissions_variables_MMR

2.F.2.a [Closed Cells][no classification][Emissions][Unspecified mix of HFCs and PFCs][t CO2 equivalent][From stocks][no method][no target][no option][no type]
type: Concept
definition: 2.F.2.a [Closed Cells][no classification][Emissions][Unspecified mix of HFCs and PFCs][t CO2 equivalent][From stocks][no method][no target][no option][no type]
status: valid
status modified: 2017-02-13
accepted date: 2017-02-13
in scheme: emissions_variables_MMR

2.F.2.a [Closed Cells][no classification][Emissions][Unspecified mix of HFCs and PFCs][t CO2 equivalent][no source][no method][no target][no option][no type]
type: Concept
definition: 2.F.2.a [Closed Cells][no classification][Emissions][Unspecified mix of HFCs and PFCs][t CO2 equivalent][no source][no method][no target][no option][no type]
status: valid
status modified: 2017-02-13
accepted date: 2017-02-13
in scheme: emissions_variables_MMR

2.F.2.a [Closed Cells][no classification][Emissions][Unspecified mix of HFCs][t CO2 equivalent][From disposal][no method][no target][no option][no type]
type: Concept
definition: 2.F.2.a [Closed Cells][no classification][Emissions][Unspecified mix of HFCs][t CO2 equivalent][From disposal][no method][no target][no option][no type]
status: valid
status modified: 2017-02-13
accepted date: 2017-02-13
in scheme: emissions_variables_MMR

2.F.2.a [Closed Cells][no classification][Emissions][Unspecified mix of HFCs][t CO2 equivalent][From manufacturing][no method][no target][no option][no type]
type: Concept
definition: 2.F.2.a [Closed Cells][no classification][Emissions][Unspecified mix of HFCs][t CO2 equivalent][From manufacturing][no method][no target][no option][no type]
status: valid
status modified: 2017-02-13
accepted date: 2017-02-13
in scheme: emissions_variables_MMR

2.F.2.a [Closed Cells][no classification][Emissions][Unspecified mix of HFCs][t CO2 equivalent][From stocks][no method][no target][no option][no type]
type: Concept
definition: 2.F.2.a [Closed Cells][no classification][Emissions][Unspecified mix of HFCs][t CO2 equivalent][From stocks][no method][no target][no option][no type]
status: valid
status modified: 2017-02-13
accepted date: 2017-02-13
in scheme: emissions_variables_MMR

2.F.2.a [Closed Cells][no classification][Emissions][Unspecified mix of HFCs][t CO2 equivalent][no source][no method][no target][no option][no type]
type: Concept
definition: 2.F.2.a [Closed Cells][no classification][Emissions][Unspecified mix of HFCs][t CO2 equivalent][no source][no method][no target][no option][no type]
status: valid
status modified: 2017-02-13
accepted date: 2017-02-13
in scheme: emissions_variables_MMR

2.F.2.a [Closed Cells][no classification][Emissions][Unspecified mix of PFCs][t CO2 equivalent][From disposal][no method][no target][no option][no type]
type: Concept
definition: 2.F.2.a [Closed Cells][no classification][Emissions][Unspecified mix of PFCs][t CO2 equivalent][From disposal][no method][no target][no option][no type]
status: valid
status modified: 2017-02-13
accepted date: 2017-02-13
in scheme: emissions_variables_MMR

2.F.2.a [Closed Cells][no classification][Emissions][Unspecified mix of PFCs][t CO2 equivalent][From manufacturing][no method][no target][no option][no type]
type: Concept
definition: 2.F.2.a [Closed Cells][no classification][Emissions][Unspecified mix of PFCs][t CO2 equivalent][From manufacturing][no method][no target][no option][no type]
status: valid
status modified: 2017-02-13
accepted date: 2017-02-13
in scheme: emissions_variables_MMR

2.F.2.a [Closed Cells][no classification][Emissions][Unspecified mix of PFCs][t CO2 equivalent][From stocks][no method][no target][no option][no type]
type: Concept
definition: 2.F.2.a [Closed Cells][no classification][Emissions][Unspecified mix of PFCs][t CO2 equivalent][From stocks][no method][no target][no option][no type]
status: valid
status modified: 2017-02-13
accepted date: 2017-02-13
in scheme: emissions_variables_MMR

2.F.2.a [Closed Cells][no classification][Emissions][Unspecified mix of PFCs][t CO2 equivalent][no source][no method][no target][no option][no type]
type: Concept
definition: 2.F.2.a [Closed Cells][no classification][Emissions][Unspecified mix of PFCs][t CO2 equivalent][no source][no method][no target][no option][no type]
status: valid
status modified: 2017-02-13
accepted date: 2017-02-13
in scheme: emissions_variables_MMR

2.F.2.b [Fire Protection][no classification][Emissions][C10F18][t][From disposal][no method][no target][no option][no type]
type: Concept
definition: 2.F.2.b [Fire Protection][no classification][Emissions][C10F18][t][From disposal][no method][no target][no option][no type]
status: valid
status modified: 2017-02-13
accepted date: 2017-02-13
in scheme: emissions_variables_MMR

2.F.2.b [Fire Protection][no classification][Emissions][C10F18][t][From manufacturing][no method][no target][no option][no type]
type: Concept
definition: 2.F.2.b [Fire Protection][no classification][Emissions][C10F18][t][From manufacturing][no method][no target][no option][no type]
status: valid
status modified: 2017-02-13
accepted date: 2017-02-13
in scheme: emissions_variables_MMR

2.F.2.b [Fire Protection][no classification][Emissions][C10F18][t][From stocks][no method][no target][no option][no type]
type: Concept
definition: 2.F.2.b [Fire Protection][no classification][Emissions][C10F18][t][From stocks][no method][no target][no option][no type]
status: valid
status modified: 2017-02-13
accepted date: 2017-02-13
in scheme: emissions_variables_MMR

2.F.2.b [Fire Protection][no classification][Emissions][C10F18][t][no source][no method][no target][no option][no type]
type: Concept
definition: 2.F.2.b [Fire Protection][no classification][Emissions][C10F18][t][no source][no method][no target][no option][no type]
status: valid
status modified: 2017-02-13
accepted date: 2017-02-13
in scheme: emissions_variables_MMR

2.F.2.b [Fire Protection][no classification][Emissions][C2F6][t][From disposal][no method][no target][no option][no type]
type: Concept
definition: 2.F.2.b [Fire Protection][no classification][Emissions][C2F6][t][From disposal][no method][no target][no option][no type]
status: valid
status modified: 2017-02-13
accepted date: 2017-02-13
in scheme: emissions_variables_MMR

2.F.2.b [Fire Protection][no classification][Emissions][C2F6][t][From manufacturing][no method][no target][no option][no type]
type: Concept
definition: 2.F.2.b [Fire Protection][no classification][Emissions][C2F6][t][From manufacturing][no method][no target][no option][no type]
status: valid
status modified: 2017-02-13
accepted date: 2017-02-13
in scheme: emissions_variables_MMR

2.F.2.b [Fire Protection][no classification][Emissions][C2F6][t][From stocks][no method][no target][no option][no type]
type: Concept
definition: 2.F.2.b [Fire Protection][no classification][Emissions][C2F6][t][From stocks][no method][no target][no option][no type]
status: valid
status modified: 2017-02-13
accepted date: 2017-02-13
in scheme: emissions_variables_MMR

2.F.2.b [Fire Protection][no classification][Emissions][C2F6][t][no source][no method][no target][no option][no type]
type: Concept
definition: 2.F.2.b [Fire Protection][no classification][Emissions][C2F6][t][no source][no method][no target][no option][no type]
status: valid
status modified: 2017-02-13
accepted date: 2017-02-13
in scheme: emissions_variables_MMR

2.F.2.b [Fire Protection][no classification][Emissions][C3F8][t][From disposal][no method][no target][no option][no type]
type: Concept
definition: 2.F.2.b [Fire Protection][no classification][Emissions][C3F8][t][From disposal][no method][no target][no option][no type]
status: valid
status modified: 2017-02-13
accepted date: 2017-02-13
in scheme: emissions_variables_MMR

2.F.2.b [Fire Protection][no classification][Emissions][C3F8][t][From manufacturing][no method][no target][no option][no type]
type: Concept
definition: 2.F.2.b [Fire Protection][no classification][Emissions][C3F8][t][From manufacturing][no method][no target][no option][no type]
status: valid
status modified: 2017-02-13
accepted date: 2017-02-13
in scheme: emissions_variables_MMR

2.F.2.b [Fire Protection][no classification][Emissions][C3F8][t][From stocks][no method][no target][no option][no type]
type: Concept
definition: 2.F.2.b [Fire Protection][no classification][Emissions][C3F8][t][From stocks][no method][no target][no option][no type]
status: valid
status modified: 2017-02-13
accepted date: 2017-02-13
in scheme: emissions_variables_MMR

2.F.2.b [Fire Protection][no classification][Emissions][C4F10][t][From disposal][no method][no target][no option][no type]
type: Concept
definition: 2.F.2.b [Fire Protection][no classification][Emissions][C4F10][t][From disposal][no method][no target][no option][no type]
status: valid
status modified: 2017-02-13
accepted date: 2017-02-13
in scheme: emissions_variables_MMR

2.F.2.b [Fire Protection][no classification][Emissions][C4F10][t][From manufacturing][no method][no target][no option][no type]
type: Concept
definition: 2.F.2.b [Fire Protection][no classification][Emissions][C4F10][t][From manufacturing][no method][no target][no option][no type]
status: valid
status modified: 2017-02-13
accepted date: 2017-02-13
in scheme: emissions_variables_MMR

2.F.2.b [Fire Protection][no classification][Emissions][C4F10][t][From stocks][no method][no target][no option][no type]
type: Concept
definition: 2.F.2.b [Fire Protection][no classification][Emissions][C4F10][t][From stocks][no method][no target][no option][no type]
status: valid
status modified: 2017-02-13
accepted date: 2017-02-13
in scheme: emissions_variables_MMR

2.F.2.b [Fire Protection][no classification][Emissions][C4F10][t][no source][no method][no target][no option][no type]
type: Concept
definition: 2.F.2.b [Fire Protection][no classification][Emissions][C4F10][t][no source][no method][no target][no option][no type]
status: valid
status modified: 2017-02-13
accepted date: 2017-02-13
in scheme: emissions_variables_MMR

2.F.2.b [Fire Protection][no classification][Emissions][C5F12][t][From disposal][no method][no target][no option][no type]
type: Concept
definition: 2.F.2.b [Fire Protection][no classification][Emissions][C5F12][t][From disposal][no method][no target][no option][no type]
status: valid
status modified: 2017-02-13
accepted date: 2017-02-13
in scheme: emissions_variables_MMR

2.F.2.b [Fire Protection][no classification][Emissions][C5F12][t][From manufacturing][no method][no target][no option][no type]
type: Concept
definition: 2.F.2.b [Fire Protection][no classification][Emissions][C5F12][t][From manufacturing][no method][no target][no option][no type]
status: valid
status modified: 2017-02-13
accepted date: 2017-02-13
in scheme: emissions_variables_MMR

2.F.2.b [Fire Protection][no classification][Emissions][C5F12][t][From stocks][no method][no target][no option][no type]
type: Concept
definition: 2.F.2.b [Fire Protection][no classification][Emissions][C5F12][t][From stocks][no method][no target][no option][no type]
status: valid
status modified: 2017-02-13
accepted date: 2017-02-13
in scheme: emissions_variables_MMR

2.F.2.b [Fire Protection][no classification][Emissions][C5F12][t][no source][no method][no target][no option][no type]
type: Concept
definition: 2.F.2.b [Fire Protection][no classification][Emissions][C5F12][t][no source][no method][no target][no option][no type]
status: valid
status modified: 2017-02-13
accepted date: 2017-02-13
in scheme: emissions_variables_MMR

2.F.2.b [Fire Protection][no classification][Emissions][C6F14][t][From disposal][no method][no target][no option][no type]
type: Concept
definition: 2.F.2.b [Fire Protection][no classification][Emissions][C6F14][t][From disposal][no method][no target][no option][no type]
status: valid
status modified: 2017-02-13
accepted date: 2017-02-13
in scheme: emissions_variables_MMR

2.F.2.b [Fire Protection][no classification][Emissions][C6F14][t][From manufacturing][no method][no target][no option][no type]
type: Concept
definition: 2.F.2.b [Fire Protection][no classification][Emissions][C6F14][t][From manufacturing][no method][no target][no option][no type]
status: valid
status modified: 2017-02-13
accepted date: 2017-02-13
in scheme: emissions_variables_MMR

2.F.2.b [Fire Protection][no classification][Emissions][C6F14][t][From stocks][no method][no target][no option][no type]
type: Concept
definition: 2.F.2.b [Fire Protection][no classification][Emissions][C6F14][t][From stocks][no method][no target][no option][no type]
status: valid
status modified: 2017-02-13
accepted date: 2017-02-13
in scheme: emissions_variables_MMR

2.F.2.b [Fire Protection][no classification][Emissions][c-C3F6][t][From disposal][no method][no target][no option][no type]
type: Concept
definition: 2.F.2.b [Fire Protection][no classification][Emissions][c-C3F6][t][From disposal][no method][no target][no option][no type]
status: valid
status modified: 2017-02-13
accepted date: 2017-02-13
in scheme: emissions_variables_MMR

2.F.2.b [Fire Protection][no classification][Emissions][c-C3F6][t][From manufacturing][no method][no target][no option][no type]
type: Concept
definition: 2.F.2.b [Fire Protection][no classification][Emissions][c-C3F6][t][From manufacturing][no method][no target][no option][no type]
status: valid
status modified: 2017-02-13
accepted date: 2017-02-13
in scheme: emissions_variables_MMR

2.F.2.b [Fire Protection][no classification][Emissions][c-C3F6][t][From stocks][no method][no target][no option][no type]
type: Concept
definition: 2.F.2.b [Fire Protection][no classification][Emissions][c-C3F6][t][From stocks][no method][no target][no option][no type]
status: valid
status modified: 2017-02-13
accepted date: 2017-02-13
in scheme: emissions_variables_MMR

2.F.2.b [Fire Protection][no classification][Emissions][c-C3F6][t][no source][no method][no target][no option][no type]
type: Concept
definition: 2.F.2.b [Fire Protection][no classification][Emissions][c-C3F6][t][no source][no method][no target][no option][no type]
status: valid
status modified: 2017-02-13
accepted date: 2017-02-13
in scheme: emissions_variables_MMR

2.F.2.b [Fire Protection][no classification][Emissions][c-C4F8][t][From disposal][no method][no target][no option][no type]
type: Concept
definition: 2.F.2.b [Fire Protection][no classification][Emissions][c-C4F8][t][From disposal][no method][no target][no option][no type]
status: valid
status modified: 2017-02-13
accepted date: 2017-02-13
in scheme: emissions_variables_MMR

2.F.2.b [Fire Protection][no classification][Emissions][c-C4F8][t][From manufacturing][no method][no target][no option][no type]
type: Concept
definition: 2.F.2.b [Fire Protection][no classification][Emissions][c-C4F8][t][From manufacturing][no method][no target][no option][no type]
status: valid
status modified: 2017-02-13
accepted date: 2017-02-13
in scheme: emissions_variables_MMR

2.F.2.b [Fire Protection][no classification][Emissions][c-C4F8][t][From stocks][no method][no target][no option][no type]
type: Concept
definition: 2.F.2.b [Fire Protection][no classification][Emissions][c-C4F8][t][From stocks][no method][no target][no option][no type]
status: valid
status modified: 2017-02-13
accepted date: 2017-02-13
in scheme: emissions_variables_MMR

2.F.2.b [Fire Protection][no classification][Emissions][c-C4F8][t][no source][no method][no target][no option][no type]
type: Concept
definition: 2.F.2.b [Fire Protection][no classification][Emissions][c-C4F8][t][no source][no method][no target][no option][no type]
status: valid
status modified: 2017-02-13
accepted date: 2017-02-13
in scheme: emissions_variables_MMR

2.F.2.b [Fire Protection][no classification][Emissions][CF4][t][From disposal][no method][no target][no option][no type]
type: Concept
definition: 2.F.2.b [Fire Protection][no classification][Emissions][CF4][t][From disposal][no method][no target][no option][no type]
status: valid
status modified: 2017-02-13
accepted date: 2017-02-13
in scheme: emissions_variables_MMR

2.F.2.b [Fire Protection][no classification][Emissions][CF4][t][From manufacturing][no method][no target][no option][no type]
type: Concept
definition: 2.F.2.b [Fire Protection][no classification][Emissions][CF4][t][From manufacturing][no method][no target][no option][no type]
status: valid
status modified: 2017-02-13
accepted date: 2017-02-13
in scheme: emissions_variables_MMR

2.F.2.b [Fire Protection][no classification][Emissions][CF4][t][From stocks][no method][no target][no option][no type]
type: Concept
definition: 2.F.2.b [Fire Protection][no classification][Emissions][CF4][t][From stocks][no method][no target][no option][no type]
status: valid
status modified: 2017-02-13
accepted date: 2017-02-13
in scheme: emissions_variables_MMR

2.F.2.b [Fire Protection][no classification][Emissions][HFC-125][t][From disposal][no method][no target][no option][no type]
type: Concept
definition: 2.F.2.b [Fire Protection][no classification][Emissions][HFC-125][t][From disposal][no method][no target][no option][no type]
status: valid
status modified: 2017-02-13
accepted date: 2017-02-13
in scheme: emissions_variables_MMR

2.F.2.b [Fire Protection][no classification][Emissions][HFC-125][t][From manufacturing][no method][no target][no option][no type]
type: Concept
definition: 2.F.2.b [Fire Protection][no classification][Emissions][HFC-125][t][From manufacturing][no method][no target][no option][no type]
status: valid
status modified: 2017-02-13
accepted date: 2017-02-13
in scheme: emissions_variables_MMR

2.F.2.b [Fire Protection][no classification][Emissions][HFC-125][t][From stocks][no method][no target][no option][no type]
type: Concept
definition: 2.F.2.b [Fire Protection][no classification][Emissions][HFC-125][t][From stocks][no method][no target][no option][no type]
status: valid
status modified: 2017-02-13
accepted date: 2017-02-13
in scheme: emissions_variables_MMR

2.F.2.b [Fire Protection][no classification][Emissions][HFC-125][t][no source][no method][no target][no option][no type]
type: Concept
definition: 2.F.2.b [Fire Protection][no classification][Emissions][HFC-125][t][no source][no method][no target][no option][no type]
status: valid
status modified: 2017-02-13
accepted date: 2017-02-13
in scheme: emissions_variables_MMR

2.F.2.b [Fire Protection][no classification][Emissions][HFC-134][t][From disposal][no method][no target][no option][no type]
type: Concept
definition: 2.F.2.b [Fire Protection][no classification][Emissions][HFC-134][t][From disposal][no method][no target][no option][no type]
status: valid
status modified: 2017-02-13
accepted date: 2017-02-13
in scheme: emissions_variables_MMR

2.F.2.b [Fire Protection][no classification][Emissions][HFC-134][t][From manufacturing][no method][no target][no option][no type]
type: Concept
definition: 2.F.2.b [Fire Protection][no classification][Emissions][HFC-134][t][From manufacturing][no method][no target][no option][no type]
status: valid
status modified: 2017-02-13
accepted date: 2017-02-13
in scheme: emissions_variables_MMR

2.F.2.b [Fire Protection][no classification][Emissions][HFC-134][t][From stocks][no method][no target][no option][no type]
type: Concept
definition: 2.F.2.b [Fire Protection][no classification][Emissions][HFC-134][t][From stocks][no method][no target][no option][no type]
status: valid
status modified: 2017-02-13
accepted date: 2017-02-13
in scheme: emissions_variables_MMR

2.F.2.b [Fire Protection][no classification][Emissions][HFC-134][t][no source][no method][no target][no option][no type]
type: Concept
definition: 2.F.2.b [Fire Protection][no classification][Emissions][HFC-134][t][no source][no method][no target][no option][no type]
status: valid
status modified: 2017-02-13
accepted date: 2017-02-13
in scheme: emissions_variables_MMR

2.F.2.b [Fire Protection][no classification][Emissions][HFC-134a][t][From disposal][no method][no target][no option][no type]
type: Concept
definition: 2.F.2.b [Fire Protection][no classification][Emissions][HFC-134a][t][From disposal][no method][no target][no option][no type]
status: valid
status modified: 2017-02-13
accepted date: 2017-02-13
in scheme: emissions_variables_MMR

2.F.2.b [Fire Protection][no classification][Emissions][HFC-134a][t][From manufacturing][no method][no target][no option][no type]
type: Concept
definition: 2.F.2.b [Fire Protection][no classification][Emissions][HFC-134a][t][From manufacturing][no method][no target][no option][no type]
status: valid
status modified: 2017-02-13
accepted date: 2017-02-13
in scheme: emissions_variables_MMR

2.F.2.b [Fire Protection][no classification][Emissions][HFC-134a][t][From stocks][no method][no target][no option][no type]
type: Concept
definition: 2.F.2.b [Fire Protection][no classification][Emissions][HFC-134a][t][From stocks][no method][no target][no option][no type]
status: valid
status modified: 2017-02-13
accepted date: 2017-02-13
in scheme: emissions_variables_MMR

2.F.2.b [Fire Protection][no classification][Emissions][HFC-143][t][From disposal][no method][no target][no option][no type]
type: Concept
definition: 2.F.2.b [Fire Protection][no classification][Emissions][HFC-143][t][From disposal][no method][no target][no option][no type]
status: valid
status modified: 2017-02-13
accepted date: 2017-02-13
in scheme: emissions_variables_MMR

2.F.2.b [Fire Protection][no classification][Emissions][HFC-143][t][From manufacturing][no method][no target][no option][no type]
type: Concept
definition: 2.F.2.b [Fire Protection][no classification][Emissions][HFC-143][t][From manufacturing][no method][no target][no option][no type]
status: valid
status modified: 2017-02-13
accepted date: 2017-02-13
in scheme: emissions_variables_MMR

2.F.2.b [Fire Protection][no classification][Emissions][HFC-143][t][From stocks][no method][no target][no option][no type]
type: Concept
definition: 2.F.2.b [Fire Protection][no classification][Emissions][HFC-143][t][From stocks][no method][no target][no option][no type]
status: valid
status modified: 2017-02-13
accepted date: 2017-02-13
in scheme: emissions_variables_MMR

2.F.2.b [Fire Protection][no classification][Emissions][HFC-143][t][no source][no method][no target][no option][no type]
type: Concept
definition: 2.F.2.b [Fire Protection][no classification][Emissions][HFC-143][t][no source][no method][no target][no option][no type]
status: valid
status modified: 2017-02-13
accepted date: 2017-02-13
in scheme: emissions_variables_MMR

2.F.2.b [Fire Protection][no classification][Emissions][HFC-143a][t][From disposal][no method][no target][no option][no type]
type: Concept
definition: 2.F.2.b [Fire Protection][no classification][Emissions][HFC-143a][t][From disposal][no method][no target][no option][no type]
status: valid
status modified: 2017-02-13
accepted date: 2017-02-13
in scheme: emissions_variables_MMR

2.F.2.b [Fire Protection][no classification][Emissions][HFC-143a][t][From manufacturing][no method][no target][no option][no type]
type: Concept
definition: 2.F.2.b [Fire Protection][no classification][Emissions][HFC-143a][t][From manufacturing][no method][no target][no option][no type]
status: valid
status modified: 2017-02-13
accepted date: 2017-02-13
in scheme: emissions_variables_MMR

2.F.2.b [Fire Protection][no classification][Emissions][HFC-143a][t][From stocks][no method][no target][no option][no type]
type: Concept
definition: 2.F.2.b [Fire Protection][no classification][Emissions][HFC-143a][t][From stocks][no method][no target][no option][no type]
status: valid
status modified: 2017-02-13
accepted date: 2017-02-13
in scheme: emissions_variables_MMR

2.F.2.b [Fire Protection][no classification][Emissions][HFC-152][t][From disposal][no method][no target][no option][no type]
type: Concept
definition: 2.F.2.b [Fire Protection][no classification][Emissions][HFC-152][t][From disposal][no method][no target][no option][no type]
status: valid
status modified: 2017-02-13
accepted date: 2017-02-13
in scheme: emissions_variables_MMR

2.F.2.b [Fire Protection][no classification][Emissions][HFC-152][t][From manufacturing][no method][no target][no option][no type]
type: Concept
definition: 2.F.2.b [Fire Protection][no classification][Emissions][HFC-152][t][From manufacturing][no method][no target][no option][no type]
status: valid
status modified: 2017-02-13
accepted date: 2017-02-13
in scheme: emissions_variables_MMR

2.F.2.b [Fire Protection][no classification][Emissions][HFC-152][t][From stocks][no method][no target][no option][no type]
type: Concept
definition: 2.F.2.b [Fire Protection][no classification][Emissions][HFC-152][t][From stocks][no method][no target][no option][no type]
status: valid
status modified: 2017-02-13
accepted date: 2017-02-13
in scheme: emissions_variables_MMR

2.F.2.b [Fire Protection][no classification][Emissions][HFC-152][t][no source][no method][no target][no option][no type]
type: Concept
definition: 2.F.2.b [Fire Protection][no classification][Emissions][HFC-152][t][no source][no method][no target][no option][no type]
status: valid
status modified: 2017-02-13
accepted date: 2017-02-13
in scheme: emissions_variables_MMR

2.F.2.b [Fire Protection][no classification][Emissions][HFC-152a][t][From disposal][no method][no target][no option][no type]
type: Concept
definition: 2.F.2.b [Fire Protection][no classification][Emissions][HFC-152a][t][From disposal][no method][no target][no option][no type]
status: valid
status modified: 2017-02-13
accepted date: 2017-02-13
in scheme: emissions_variables_MMR

2.F.2.b [Fire Protection][no classification][Emissions][HFC-152a][t][From manufacturing][no method][no target][no option][no type]
type: Concept
definition: 2.F.2.b [Fire Protection][no classification][Emissions][HFC-152a][t][From manufacturing][no method][no target][no option][no type]
status: valid
status modified: 2017-02-13
accepted date: 2017-02-13
in scheme: emissions_variables_MMR

2.F.2.b [Fire Protection][no classification][Emissions][HFC-152a][t][From stocks][no method][no target][no option][no type]
type: Concept
definition: 2.F.2.b [Fire Protection][no classification][Emissions][HFC-152a][t][From stocks][no method][no target][no option][no type]
status: valid
status modified: 2017-02-13
accepted date: 2017-02-13
in scheme: emissions_variables_MMR

2.F.2.b [Fire Protection][no classification][Emissions][HFC-161][t][From disposal][no method][no target][no option][no type]
type: Concept
definition: 2.F.2.b [Fire Protection][no classification][Emissions][HFC-161][t][From disposal][no method][no target][no option][no type]
status: valid
status modified: 2017-02-13
accepted date: 2017-02-13
in scheme: emissions_variables_MMR

2.F.2.b [Fire Protection][no classification][Emissions][HFC-161][t][From manufacturing][no method][no target][no option][no type]
type: Concept
definition: 2.F.2.b [Fire Protection][no classification][Emissions][HFC-161][t][From manufacturing][no method][no target][no option][no type]
status: valid
status modified: 2017-02-13
accepted date: 2017-02-13
in scheme: emissions_variables_MMR

2.F.2.b [Fire Protection][no classification][Emissions][HFC-161][t][From stocks][no method][no target][no option][no type]
type: Concept
definition: 2.F.2.b [Fire Protection][no classification][Emissions][HFC-161][t][From stocks][no method][no target][no option][no type]
status: valid
status modified: 2017-02-13
accepted date: 2017-02-13
in scheme: emissions_variables_MMR

2.F.2.b [Fire Protection][no classification][Emissions][HFC-161][t][no source][no method][no target][no option][no type]
type: Concept
definition: 2.F.2.b [Fire Protection][no classification][Emissions][HFC-161][t][no source][no method][no target][no option][no type]
status: valid
status modified: 2017-02-13
accepted date: 2017-02-13
in scheme: emissions_variables_MMR

2.F.2.b [Fire Protection][no classification][Emissions][HFC-227ea][t][From disposal][no method][no target][no option][no type]
type: Concept
definition: 2.F.2.b [Fire Protection][no classification][Emissions][HFC-227ea][t][From disposal][no method][no target][no option][no type]
status: valid
status modified: 2017-02-13
accepted date: 2017-02-13
in scheme: emissions_variables_MMR

2.F.2.b [Fire Protection][no classification][Emissions][HFC-227ea][t][From manufacturing][no method][no target][no option][no type]
type: Concept
definition: 2.F.2.b [Fire Protection][no classification][Emissions][HFC-227ea][t][From manufacturing][no method][no target][no option][no type]
status: valid
status modified: 2017-02-13
accepted date: 2017-02-13
in scheme: emissions_variables_MMR

2.F.2.b [Fire Protection][no classification][Emissions][HFC-227ea][t][From stocks][no method][no target][no option][no type]
type: Concept
definition: 2.F.2.b [Fire Protection][no classification][Emissions][HFC-227ea][t][From stocks][no method][no target][no option][no type]
status: valid
status modified: 2017-02-13
accepted date: 2017-02-13
in scheme: emissions_variables_MMR

2.F.2.b [Fire Protection][no classification][Emissions][HFC-227ea][t][no source][no method][no target][no option][no type]
type: Concept
definition: 2.F.2.b [Fire Protection][no classification][Emissions][HFC-227ea][t][no source][no method][no target][no option][no type]
status: valid
status modified: 2017-02-13
accepted date: 2017-02-13
in scheme: emissions_variables_MMR

2.F.2.b [Fire Protection][no classification][Emissions][HFC-23][t][From disposal][no method][no target][no option][no type]
type: Concept
definition: 2.F.2.b [Fire Protection][no classification][Emissions][HFC-23][t][From disposal][no method][no target][no option][no type]
status: valid
status modified: 2017-02-13
accepted date: 2017-02-13
in scheme: emissions_variables_MMR

2.F.2.b [Fire Protection][no classification][Emissions][HFC-23][t][From manufacturing][no method][no target][no option][no type]
type: Concept
definition: 2.F.2.b [Fire Protection][no classification][Emissions][HFC-23][t][From manufacturing][no method][no target][no option][no type]
status: valid
status modified: 2017-02-13
accepted date: 2017-02-13
in scheme: emissions_variables_MMR

2.F.2.b [Fire Protection][no classification][Emissions][HFC-23][t][From stocks][no method][no target][no option][no type]
type: Concept
definition: 2.F.2.b [Fire Protection][no classification][Emissions][HFC-23][t][From stocks][no method][no target][no option][no type]
status: valid
status modified: 2017-02-13
accepted date: 2017-02-13
in scheme: emissions_variables_MMR

2.F.2.b [Fire Protection][no classification][Emissions][HFC-236cb][t][From disposal][no method][no target][no option][no type]
type: Concept
definition: 2.F.2.b [Fire Protection][no classification][Emissions][HFC-236cb][t][From disposal][no method][no target][no option][no type]
status: valid
status modified: 2017-02-13
accepted date: 2017-02-13
in scheme: emissions_variables_MMR

2.F.2.b [Fire Protection][no classification][Emissions][HFC-236cb][t][From manufacturing][no method][no target][no option][no type]
type: Concept
definition: 2.F.2.b [Fire Protection][no classification][Emissions][HFC-236cb][t][From manufacturing][no method][no target][no option][no type]
status: valid
status modified: 2017-02-13
accepted date: 2017-02-13
in scheme: emissions_variables_MMR

2.F.2.b [Fire Protection][no classification][Emissions][HFC-236cb][t][From stocks][no method][no target][no option][no type]
type: Concept
definition: 2.F.2.b [Fire Protection][no classification][Emissions][HFC-236cb][t][From stocks][no method][no target][no option][no type]
status: valid
status modified: 2017-02-13
accepted date: 2017-02-13
in scheme: emissions_variables_MMR

2.F.2.b [Fire Protection][no classification][Emissions][HFC-236ea][t][From disposal][no method][no target][no option][no type]
type: Concept
definition: 2.F.2.b [Fire Protection][no classification][Emissions][HFC-236ea][t][From disposal][no method][no target][no option][no type]
status: valid
status modified: 2017-02-13
accepted date: 2017-02-13
in scheme: emissions_variables_MMR

2.F.2.b [Fire Protection][no classification][Emissions][HFC-236ea][t][From manufacturing][no method][no target][no option][no type]
type: Concept
definition: 2.F.2.b [Fire Protection][no classification][Emissions][HFC-236ea][t][From manufacturing][no method][no target][no option][no type]
status: valid
status modified: 2017-02-13
accepted date: 2017-02-13
in scheme: emissions_variables_MMR

2.F.2.b [Fire Protection][no classification][Emissions][HFC-236ea][t][From stocks][no method][no target][no option][no type]
type: Concept
definition: 2.F.2.b [Fire Protection][no classification][Emissions][HFC-236ea][t][From stocks][no method][no target][no option][no type]
status: valid
status modified: 2017-02-13
accepted date: 2017-02-13
in scheme: emissions_variables_MMR

2.F.2.b [Fire Protection][no classification][Emissions][HFC-236fa][t][From disposal][no method][no target][no option][no type]
type: Concept
definition: 2.F.2.b [Fire Protection][no classification][Emissions][HFC-236fa][t][From disposal][no method][no target][no option][no type]
status: valid
status modified: 2017-02-13
accepted date: 2017-02-13
in scheme: emissions_variables_MMR

2.F.2.b [Fire Protection][no classification][Emissions][HFC-236fa][t][From manufacturing][no method][no target][no option][no type]
type: Concept
definition: 2.F.2.b [Fire Protection][no classification][Emissions][HFC-236fa][t][From manufacturing][no method][no target][no option][no type]
status: valid
status modified: 2017-02-13
accepted date: 2017-02-13
in scheme: emissions_variables_MMR

2.F.2.b [Fire Protection][no classification][Emissions][HFC-236fa][t][From stocks][no method][no target][no option][no type]
type: Concept
definition: 2.F.2.b [Fire Protection][no classification][Emissions][HFC-236fa][t][From stocks][no method][no target][no option][no type]
status: valid
status modified: 2017-02-13
accepted date: 2017-02-13
in scheme: emissions_variables_MMR

2.F.2.b [Fire Protection][no classification][Emissions][HFC-236fa][t][no source][no method][no target][no option][no type]
type: Concept
definition: 2.F.2.b [Fire Protection][no classification][Emissions][HFC-236fa][t][no source][no method][no target][no option][no type]
status: valid
status modified: 2017-02-13
accepted date: 2017-02-13
in scheme: emissions_variables_MMR

2.F.2.b [Fire Protection][no classification][Emissions][HFC-245ca][t][From disposal][no method][no target][no option][no type]
type: Concept
definition: 2.F.2.b [Fire Protection][no classification][Emissions][HFC-245ca][t][From disposal][no method][no target][no option][no type]
status: valid
status modified: 2017-02-13
accepted date: 2017-02-13
in scheme: emissions_variables_MMR

2.F.2.b [Fire Protection][no classification][Emissions][HFC-245ca][t][From manufacturing][no method][no target][no option][no type]
type: Concept
definition: 2.F.2.b [Fire Protection][no classification][Emissions][HFC-245ca][t][From manufacturing][no method][no target][no option][no type]
status: valid
status modified: 2017-02-13
accepted date: 2017-02-13
in scheme: emissions_variables_MMR

2.F.2.b [Fire Protection][no classification][Emissions][HFC-245ca][t][From stocks][no method][no target][no option][no type]
type: Concept
definition: 2.F.2.b [Fire Protection][no classification][Emissions][HFC-245ca][t][From stocks][no method][no target][no option][no type]
status: valid
status modified: 2017-02-13
accepted date: 2017-02-13
in scheme: emissions_variables_MMR

2.F.2.b [Fire Protection][no classification][Emissions][HFC-245fa][t][From disposal][no method][no target][no option][no type]
type: Concept
definition: 2.F.2.b [Fire Protection][no classification][Emissions][HFC-245fa][t][From disposal][no method][no target][no option][no type]
status: valid
status modified: 2017-02-13
accepted date: 2017-02-13
in scheme: emissions_variables_MMR

2.F.2.b [Fire Protection][no classification][Emissions][HFC-245fa][t][From manufacturing][no method][no target][no option][no type]
type: Concept
definition: 2.F.2.b [Fire Protection][no classification][Emissions][HFC-245fa][t][From manufacturing][no method][no target][no option][no type]
status: valid
status modified: 2017-02-13
accepted date: 2017-02-13
in scheme: emissions_variables_MMR

2.F.2.b [Fire Protection][no classification][Emissions][HFC-245fa][t][From stocks][no method][no target][no option][no type]
type: Concept
definition: 2.F.2.b [Fire Protection][no classification][Emissions][HFC-245fa][t][From stocks][no method][no target][no option][no type]
status: valid
status modified: 2017-02-13
accepted date: 2017-02-13
in scheme: emissions_variables_MMR

2.F.2.b [Fire Protection][no classification][Emissions][HFC-32][t][From disposal][no method][no target][no option][no type]
type: Concept
definition: 2.F.2.b [Fire Protection][no classification][Emissions][HFC-32][t][From disposal][no method][no target][no option][no type]
status: valid
status modified: 2017-02-13
accepted date: 2017-02-13
in scheme: emissions_variables_MMR

2.F.2.b [Fire Protection][no classification][Emissions][HFC-32][t][From manufacturing][no method][no target][no option][no type]
type: Concept
definition: 2.F.2.b [Fire Protection][no classification][Emissions][HFC-32][t][From manufacturing][no method][no target][no option][no type]
status: valid
status modified: 2017-02-13
accepted date: 2017-02-13
in scheme: emissions_variables_MMR

2.F.2.b [Fire Protection][no classification][Emissions][HFC-32][t][From stocks][no method][no target][no option][no type]
type: Concept
definition: 2.F.2.b [Fire Protection][no classification][Emissions][HFC-32][t][From stocks][no method][no target][no option][no type]
status: valid
status modified: 2017-02-13
accepted date: 2017-02-13
in scheme: emissions_variables_MMR

2.F.2.b [Fire Protection][no classification][Emissions][HFC-32][t][no source][no method][no target][no option][no type]
type: Concept
definition: 2.F.2.b [Fire Protection][no classification][Emissions][HFC-32][t][no source][no method][no target][no option][no type]
status: valid
status modified: 2017-02-13
accepted date: 2017-02-13
in scheme: emissions_variables_MMR

2.F.2.b [Fire Protection][no classification][Emissions][HFC-365mfc][t][From disposal][no method][no target][no option][no type]
type: Concept
definition: 2.F.2.b [Fire Protection][no classification][Emissions][HFC-365mfc][t][From disposal][no method][no target][no option][no type]
status: valid
status modified: 2017-02-13
accepted date: 2017-02-13
in scheme: emissions_variables_MMR

2.F.2.b [Fire Protection][no classification][Emissions][HFC-365mfc][t][From manufacturing][no method][no target][no option][no type]
type: Concept
definition: 2.F.2.b [Fire Protection][no classification][Emissions][HFC-365mfc][t][From manufacturing][no method][no target][no option][no type]
status: valid
status modified: 2017-02-13
accepted date: 2017-02-13
in scheme: emissions_variables_MMR

2.F.2.b [Fire Protection][no classification][Emissions][HFC-365mfc][t][From stocks][no method][no target][no option][no type]
type: Concept
definition: 2.F.2.b [Fire Protection][no classification][Emissions][HFC-365mfc][t][From stocks][no method][no target][no option][no type]
status: valid
status modified: 2017-02-13
accepted date: 2017-02-13
in scheme: emissions_variables_MMR

2.F.2.b [Fire Protection][no classification][Emissions][HFC-41][t][From disposal][no method][no target][no option][no type]
type: Concept
definition: 2.F.2.b [Fire Protection][no classification][Emissions][HFC-41][t][From disposal][no method][no target][no option][no type]
status: valid
status modified: 2017-02-13
accepted date: 2017-02-13
in scheme: emissions_variables_MMR

2.F.2.b [Fire Protection][no classification][Emissions][HFC-41][t][From manufacturing][no method][no target][no option][no type]
type: Concept
definition: 2.F.2.b [Fire Protection][no classification][Emissions][HFC-41][t][From manufacturing][no method][no target][no option][no type]
status: valid
status modified: 2017-02-13
accepted date: 2017-02-13
in scheme: emissions_variables_MMR

2.F.2.b [Fire Protection][no classification][Emissions][HFC-41][t][From stocks][no method][no target][no option][no type]
type: Concept
definition: 2.F.2.b [Fire Protection][no classification][Emissions][HFC-41][t][From stocks][no method][no target][no option][no type]
status: valid
status modified: 2017-02-13
accepted date: 2017-02-13
in scheme: emissions_variables_MMR

2.F.2.b [Fire Protection][no classification][Emissions][HFC-43-10mee][t][From disposal][no method][no target][no option][no type]
type: Concept
definition: 2.F.2.b [Fire Protection][no classification][Emissions][HFC-43-10mee][t][From disposal][no method][no target][no option][no type]
status: valid
status modified: 2017-02-13
accepted date: 2017-02-13
in scheme: emissions_variables_MMR

2.F.2.b [Fire Protection][no classification][Emissions][HFC-43-10mee][t][From manufacturing][no method][no target][no option][no type]
type: Concept
definition: 2.F.2.b [Fire Protection][no classification][Emissions][HFC-43-10mee][t][From manufacturing][no method][no target][no option][no type]
status: valid
status modified: 2017-02-13
accepted date: 2017-02-13
in scheme: emissions_variables_MMR

2.F.2.b [Fire Protection][no classification][Emissions][HFC-43-10mee][t][From stocks][no method][no target][no option][no type]
type: Concept
definition: 2.F.2.b [Fire Protection][no classification][Emissions][HFC-43-10mee][t][From stocks][no method][no target][no option][no type]
status: valid
status modified: 2017-02-13
accepted date: 2017-02-13
in scheme: emissions_variables_MMR

2.F.2.b [Fire Protection][no classification][Emissions][NF3][t][From disposal][no method][no target][no option][no type]
type: Concept
definition: 2.F.2.b [Fire Protection][no classification][Emissions][NF3][t][From disposal][no method][no target][no option][no type]
status: valid
status modified: 2017-02-13
accepted date: 2017-02-13
in scheme: emissions_variables_MMR

2.F.2.b [Fire Protection][no classification][Emissions][NF3][t][From manufacturing][no method][no target][no option][no type]
type: Concept
definition: 2.F.2.b [Fire Protection][no classification][Emissions][NF3][t][From manufacturing][no method][no target][no option][no type]
status: valid
status modified: 2017-02-13
accepted date: 2017-02-13
in scheme: emissions_variables_MMR

2.F.2.b [Fire Protection][no classification][Emissions][NF3][t][From stocks][no method][no target][no option][no type]
type: Concept
definition: 2.F.2.b [Fire Protection][no classification][Emissions][NF3][t][From stocks][no method][no target][no option][no type]
status: valid
status modified: 2017-02-13
accepted date: 2017-02-13
in scheme: emissions_variables_MMR

2.F.2.b [Fire Protection][no classification][Emissions][SF6][t][From disposal][no method][no target][no option][no type]
type: Concept
definition: 2.F.2.b [Fire Protection][no classification][Emissions][SF6][t][From disposal][no method][no target][no option][no type]
status: valid
status modified: 2017-02-13
accepted date: 2017-02-13
in scheme: emissions_variables_MMR

2.F.2.b [Fire Protection][no classification][Emissions][SF6][t][From manufacturing][no method][no target][no option][no type]
type: Concept
definition: 2.F.2.b [Fire Protection][no classification][Emissions][SF6][t][From manufacturing][no method][no target][no option][no type]
status: valid
status modified: 2017-02-13
accepted date: 2017-02-13
in scheme: emissions_variables_MMR

2.F.2.b [Fire Protection][no classification][Emissions][SF6][t][From stocks][no method][no target][no option][no type]
type: Concept
definition: 2.F.2.b [Fire Protection][no classification][Emissions][SF6][t][From stocks][no method][no target][no option][no type]
status: valid
status modified: 2017-02-13
accepted date: 2017-02-13
in scheme: emissions_variables_MMR

2.F.2.b [Fire Protection][no classification][Emissions][Unspecified mix of HFCs and PFCs][t CO2 equivalent][From disposal][no method][no target][no option][no type]
type: Concept
definition: 2.F.2.b [Fire Protection][no classification][Emissions][Unspecified mix of HFCs and PFCs][t CO2 equivalent][From disposal][no method][no target][no option][no type]
status: valid
status modified: 2017-02-13
accepted date: 2017-02-13
in scheme: emissions_variables_MMR

2.F.2.b [Fire Protection][no classification][Emissions][Unspecified mix of HFCs and PFCs][t CO2 equivalent][From manufacturing][no method][no target][no option][no type]
type: Concept
definition: 2.F.2.b [Fire Protection][no classification][Emissions][Unspecified mix of HFCs and PFCs][t CO2 equivalent][From manufacturing][no method][no target][no option][no type]
status: valid
status modified: 2017-02-13
accepted date: 2017-02-13
in scheme: emissions_variables_MMR

2.F.2.b [Fire Protection][no classification][Emissions][Unspecified mix of HFCs and PFCs][t CO2 equivalent][From stocks][no method][no target][no option][no type]
type: Concept
definition: 2.F.2.b [Fire Protection][no classification][Emissions][Unspecified mix of HFCs and PFCs][t CO2 equivalent][From stocks][no method][no target][no option][no type]
status: valid
status modified: 2017-02-13
accepted date: 2017-02-13
in scheme: emissions_variables_MMR

2.F.2.b [Fire Protection][no classification][Emissions][Unspecified mix of HFCs][t CO2 equivalent][From disposal][no method][no target][no option][no type]
type: Concept
definition: 2.F.2.b [Fire Protection][no classification][Emissions][Unspecified mix of HFCs][t CO2 equivalent][From disposal][no method][no target][no option][no type]
status: valid
status modified: 2017-02-13
accepted date: 2017-02-13
in scheme: emissions_variables_MMR

2.F.2.b [Fire Protection][no classification][Emissions][Unspecified mix of HFCs][t CO2 equivalent][From manufacturing][no method][no target][no option][no type]
type: Concept
definition: 2.F.2.b [Fire Protection][no classification][Emissions][Unspecified mix of HFCs][t CO2 equivalent][From manufacturing][no method][no target][no option][no type]
status: valid
status modified: 2017-02-13
accepted date: 2017-02-13
in scheme: emissions_variables_MMR

2.F.2.b [Fire Protection][no classification][Emissions][Unspecified mix of HFCs][t CO2 equivalent][From stocks][no method][no target][no option][no type]
type: Concept
definition: 2.F.2.b [Fire Protection][no classification][Emissions][Unspecified mix of HFCs][t CO2 equivalent][From stocks][no method][no target][no option][no type]
status: valid
status modified: 2017-02-13
accepted date: 2017-02-13
in scheme: emissions_variables_MMR

2.F.2.b [Fire Protection][no classification][Emissions][Unspecified mix of PFCs][t CO2 equivalent][From disposal][no method][no target][no option][no type]
type: Concept
definition: 2.F.2.b [Fire Protection][no classification][Emissions][Unspecified mix of PFCs][t CO2 equivalent][From disposal][no method][no target][no option][no type]
status: valid
status modified: 2017-02-13
accepted date: 2017-02-13
in scheme: emissions_variables_MMR

2.F.2.b [Fire Protection][no classification][Emissions][Unspecified mix of PFCs][t CO2 equivalent][From manufacturing][no method][no target][no option][no type]
type: Concept
definition: 2.F.2.b [Fire Protection][no classification][Emissions][Unspecified mix of PFCs][t CO2 equivalent][From manufacturing][no method][no target][no option][no type]
status: valid
status modified: 2017-02-13
accepted date: 2017-02-13
in scheme: emissions_variables_MMR

2.F.2.b [Fire Protection][no classification][Emissions][Unspecified mix of PFCs][t CO2 equivalent][From stocks][no method][no target][no option][no type]
type: Concept
definition: 2.F.2.b [Fire Protection][no classification][Emissions][Unspecified mix of PFCs][t CO2 equivalent][From stocks][no method][no target][no option][no type]
status: valid
status modified: 2017-02-13
accepted date: 2017-02-13
in scheme: emissions_variables_MMR

2.F.2.b [Open Cells][no classification][Emissions][Aggregate F-gases][t CO2 equivalent][no source][no method][no target][no option][no type]
type: Concept
definition: 2.F.2.b [Open Cells][no classification][Emissions][Aggregate F-gases][t CO2 equivalent][no source][no method][no target][no option][no type]
status: valid
status modified: 2017-02-13
accepted date: 2017-02-13
in scheme: emissions_variables_MMR

2.F.2.b [Open Cells][no classification][Emissions][C10F18][t][From manufacturing][no method][no target][no option][no type]
type: Concept
definition: 2.F.2.b [Open Cells][no classification][Emissions][C10F18][t][From manufacturing][no method][no target][no option][no type]
status: valid
status modified: 2017-02-13
accepted date: 2017-02-13
in scheme: emissions_variables_MMR

2.F.2.b [Open Cells][no classification][Emissions][C10F18][t][From stocks][no method][no target][no option][no type]
type: Concept
definition: 2.F.2.b [Open Cells][no classification][Emissions][C10F18][t][From stocks][no method][no target][no option][no type]
status: valid
status modified: 2017-02-13
accepted date: 2017-02-13
in scheme: emissions_variables_MMR

2.F.2.b [Open Cells][no classification][Emissions][C10F18][t][no source][no method][no target][no option][no type]
type: Concept
definition: 2.F.2.b [Open Cells][no classification][Emissions][C10F18][t][no source][no method][no target][no option][no type]
status: valid
status modified: 2017-02-13
accepted date: 2017-02-13
in scheme: emissions_variables_MMR

2.F.2.b [Open Cells][no classification][Emissions][C2F6][t][From manufacturing][no method][no target][no option][no type]
type: Concept
definition: 2.F.2.b [Open Cells][no classification][Emissions][C2F6][t][From manufacturing][no method][no target][no option][no type]
status: valid
status modified: 2017-02-13
accepted date: 2017-02-13
in scheme: emissions_variables_MMR

2.F.2.b [Open Cells][no classification][Emissions][C2F6][t][From stocks][no method][no target][no option][no type]
type: Concept
definition: 2.F.2.b [Open Cells][no classification][Emissions][C2F6][t][From stocks][no method][no target][no option][no type]
status: valid
status modified: 2017-02-13
accepted date: 2017-02-13
in scheme: emissions_variables_MMR

2.F.2.b [Open Cells][no classification][Emissions][C2F6][t][no source][no method][no target][no option][no type]
type: Concept
definition: 2.F.2.b [Open Cells][no classification][Emissions][C2F6][t][no source][no method][no target][no option][no type]
status: valid
status modified: 2017-02-13
accepted date: 2017-02-13
in scheme: emissions_variables_MMR

2.F.2.b [Open Cells][no classification][Emissions][C3F8][t][From manufacturing][no method][no target][no option][no type]
type: Concept
definition: 2.F.2.b [Open Cells][no classification][Emissions][C3F8][t][From manufacturing][no method][no target][no option][no type]
status: valid
status modified: 2017-02-13
accepted date: 2017-02-13
in scheme: emissions_variables_MMR

2.F.2.b [Open Cells][no classification][Emissions][C3F8][t][From stocks][no method][no target][no option][no type]
type: Concept
definition: 2.F.2.b [Open Cells][no classification][Emissions][C3F8][t][From stocks][no method][no target][no option][no type]
status: valid
status modified: 2017-02-13
accepted date: 2017-02-13
in scheme: emissions_variables_MMR

2.F.2.b [Open Cells][no classification][Emissions][C3F8][t][no source][no method][no target][no option][no type]
type: Concept
definition: 2.F.2.b [Open Cells][no classification][Emissions][C3F8][t][no source][no method][no target][no option][no type]
status: valid
status modified: 2017-02-13
accepted date: 2017-02-13
in scheme: emissions_variables_MMR

2.F.2.b [Open Cells][no classification][Emissions][C4F10][t][From manufacturing][no method][no target][no option][no type]
type: Concept
definition: 2.F.2.b [Open Cells][no classification][Emissions][C4F10][t][From manufacturing][no method][no target][no option][no type]
status: valid
status modified: 2017-02-13
accepted date: 2017-02-13
in scheme: emissions_variables_MMR

2.F.2.b [Open Cells][no classification][Emissions][C4F10][t][From stocks][no method][no target][no option][no type]
type: Concept
definition: 2.F.2.b [Open Cells][no classification][Emissions][C4F10][t][From stocks][no method][no target][no option][no type]
status: valid
status modified: 2017-02-13
accepted date: 2017-02-13
in scheme: emissions_variables_MMR

2.F.2.b [Open Cells][no classification][Emissions][C4F10][t][no source][no method][no target][no option][no type]
type: Concept
definition: 2.F.2.b [Open Cells][no classification][Emissions][C4F10][t][no source][no method][no target][no option][no type]
status: valid
status modified: 2017-02-13
accepted date: 2017-02-13
in scheme: emissions_variables_MMR

2.F.2.b [Open Cells][no classification][Emissions][C5F12][t][From manufacturing][no method][no target][no option][no type]
type: Concept
definition: 2.F.2.b [Open Cells][no classification][Emissions][C5F12][t][From manufacturing][no method][no target][no option][no type]
status: valid
status modified: 2017-02-13
accepted date: 2017-02-13
in scheme: emissions_variables_MMR

2.F.2.b [Open Cells][no classification][Emissions][C5F12][t][From stocks][no method][no target][no option][no type]
type: Concept
definition: 2.F.2.b [Open Cells][no classification][Emissions][C5F12][t][From stocks][no method][no target][no option][no type]
status: valid
status modified: 2017-02-13
accepted date: 2017-02-13
in scheme: emissions_variables_MMR

2.F.2.b [Open Cells][no classification][Emissions][C5F12][t][no source][no method][no target][no option][no type]
type: Concept
definition: 2.F.2.b [Open Cells][no classification][Emissions][C5F12][t][no source][no method][no target][no option][no type]
status: valid
status modified: 2017-02-13
accepted date: 2017-02-13
in scheme: emissions_variables_MMR

2.F.2.b [Open Cells][no classification][Emissions][C6F14][t][From manufacturing][no method][no target][no option][no type]
type: Concept
definition: 2.F.2.b [Open Cells][no classification][Emissions][C6F14][t][From manufacturing][no method][no target][no option][no type]
status: valid
status modified: 2017-02-13
accepted date: 2017-02-13
in scheme: emissions_variables_MMR

2.F.2.b [Open Cells][no classification][Emissions][C6F14][t][From stocks][no method][no target][no option][no type]
type: Concept
definition: 2.F.2.b [Open Cells][no classification][Emissions][C6F14][t][From stocks][no method][no target][no option][no type]
status: valid
status modified: 2017-02-13
accepted date: 2017-02-13
in scheme: emissions_variables_MMR

2.F.2.b [Open Cells][no classification][Emissions][C6F14][t][no source][no method][no target][no option][no type]
type: Concept
definition: 2.F.2.b [Open Cells][no classification][Emissions][C6F14][t][no source][no method][no target][no option][no type]
status: valid
status modified: 2017-02-13
accepted date: 2017-02-13
in scheme: emissions_variables_MMR

2.F.2.b [Open Cells][no classification][Emissions][c-C3F6][t][From manufacturing][no method][no target][no option][no type]
type: Concept
definition: 2.F.2.b [Open Cells][no classification][Emissions][c-C3F6][t][From manufacturing][no method][no target][no option][no type]
status: valid
status modified: 2017-02-13
accepted date: 2017-02-13
in scheme: emissions_variables_MMR

2.F.2.b [Open Cells][no classification][Emissions][c-C3F6][t][From stocks][no method][no target][no option][no type]
type: Concept
definition: 2.F.2.b [Open Cells][no classification][Emissions][c-C3F6][t][From stocks][no method][no target][no option][no type]
status: valid
status modified: 2017-02-13
accepted date: 2017-02-13
in scheme: emissions_variables_MMR

2.F.2.b [Open Cells][no classification][Emissions][c-C3F6][t][no source][no method][no target][no option][no type]
type: Concept
definition: 2.F.2.b [Open Cells][no classification][Emissions][c-C3F6][t][no source][no method][no target][no option][no type]
status: valid
status modified: 2017-02-13
accepted date: 2017-02-13
in scheme: emissions_variables_MMR

2.F.2.b [Open Cells][no classification][Emissions][c-C4F8][t][From manufacturing][no method][no target][no option][no type]
type: Concept
definition: 2.F.2.b [Open Cells][no classification][Emissions][c-C4F8][t][From manufacturing][no method][no target][no option][no type]
status: valid
status modified: 2017-02-13
accepted date: 2017-02-13
in scheme: emissions_variables_MMR

2.F.2.b [Open Cells][no classification][Emissions][c-C4F8][t][From stocks][no method][no target][no option][no type]
type: Concept
definition: 2.F.2.b [Open Cells][no classification][Emissions][c-C4F8][t][From stocks][no method][no target][no option][no type]
status: valid
status modified: 2017-02-13
accepted date: 2017-02-13
in scheme: emissions_variables_MMR

2.F.2.b [Open Cells][no classification][Emissions][c-C4F8][t][no source][no method][no target][no option][no type]
type: Concept
definition: 2.F.2.b [Open Cells][no classification][Emissions][c-C4F8][t][no source][no method][no target][no option][no type]
status: valid
status modified: 2017-02-13
accepted date: 2017-02-13
in scheme: emissions_variables_MMR

2.F.2.b [Open Cells][no classification][Emissions][CF4][t][From manufacturing][no method][no target][no option][no type]
type: Concept
definition: 2.F.2.b [Open Cells][no classification][Emissions][CF4][t][From manufacturing][no method][no target][no option][no type]
status: valid
status modified: 2017-02-13
accepted date: 2017-02-13
in scheme: emissions_variables_MMR

2.F.2.b [Open Cells][no classification][Emissions][CF4][t][From stocks][no method][no target][no option][no type]
type: Concept
definition: 2.F.2.b [Open Cells][no classification][Emissions][CF4][t][From stocks][no method][no target][no option][no type]
status: valid
status modified: 2017-02-13
accepted date: 2017-02-13
in scheme: emissions_variables_MMR

2.F.2.b [Open Cells][no classification][Emissions][CF4][t][no source][no method][no target][no option][no type]
type: Concept
definition: 2.F.2.b [Open Cells][no classification][Emissions][CF4][t][no source][no method][no target][no option][no type]
status: valid
status modified: 2017-02-13
accepted date: 2017-02-13
in scheme: emissions_variables_MMR

2.F.2.b [Open Cells][no classification][Emissions][HFC-125][t][From manufacturing][no method][no target][no option][no type]
type: Concept
definition: 2.F.2.b [Open Cells][no classification][Emissions][HFC-125][t][From manufacturing][no method][no target][no option][no type]
status: valid
status modified: 2017-02-13
accepted date: 2017-02-13
in scheme: emissions_variables_MMR

2.F.2.b [Open Cells][no classification][Emissions][HFC-125][t][From stocks][no method][no target][no option][no type]
type: Concept
definition: 2.F.2.b [Open Cells][no classification][Emissions][HFC-125][t][From stocks][no method][no target][no option][no type]
status: valid
status modified: 2017-02-13
accepted date: 2017-02-13
in scheme: emissions_variables_MMR

2.F.2.b [Open Cells][no classification][Emissions][HFC-125][t][no source][no method][no target][no option][no type]
type: Concept
definition: 2.F.2.b [Open Cells][no classification][Emissions][HFC-125][t][no source][no method][no target][no option][no type]
status: valid
status modified: 2017-02-13
accepted date: 2017-02-13
in scheme: emissions_variables_MMR

2.F.2.b [Open Cells][no classification][Emissions][HFC-134][t][From manufacturing][no method][no target][no option][no type]
type: Concept
definition: 2.F.2.b [Open Cells][no classification][Emissions][HFC-134][t][From manufacturing][no method][no target][no option][no type]
status: valid
status modified: 2017-02-13
accepted date: 2017-02-13
in scheme: emissions_variables_MMR

2.F.2.b [Open Cells][no classification][Emissions][HFC-134][t][From stocks][no method][no target][no option][no type]
type: Concept
definition: 2.F.2.b [Open Cells][no classification][Emissions][HFC-134][t][From stocks][no method][no target][no option][no type]
status: valid
status modified: 2017-02-13
accepted date: 2017-02-13
in scheme: emissions_variables_MMR

2.F.2.b [Open Cells][no classification][Emissions][HFC-134][t][no source][no method][no target][no option][no type]
type: Concept
definition: 2.F.2.b [Open Cells][no classification][Emissions][HFC-134][t][no source][no method][no target][no option][no type]
status: valid
status modified: 2017-02-13
accepted date: 2017-02-13
in scheme: emissions_variables_MMR

2.F.2.b [Open Cells][no classification][Emissions][HFC-134a][t][From manufacturing][no method][no target][no option][no type]
type: Concept
definition: 2.F.2.b [Open Cells][no classification][Emissions][HFC-134a][t][From manufacturing][no method][no target][no option][no type]
status: valid
status modified: 2017-02-13
accepted date: 2017-02-13
in scheme: emissions_variables_MMR

2.F.2.b [Open Cells][no classification][Emissions][HFC-134a][t][From stocks][no method][no target][no option][no type]
type: Concept
definition: 2.F.2.b [Open Cells][no classification][Emissions][HFC-134a][t][From stocks][no method][no target][no option][no type]
status: valid
status modified: 2017-02-13
accepted date: 2017-02-13
in scheme: emissions_variables_MMR

2.F.2.b [Open Cells][no classification][Emissions][HFC-134a][t][no source][no method][no target][no option][no type]
type: Concept
definition: 2.F.2.b [Open Cells][no classification][Emissions][HFC-134a][t][no source][no method][no target][no option][no type]
status: valid
status modified: 2017-02-13
accepted date: 2017-02-13
in scheme: emissions_variables_MMR

2.F.2.b [Open Cells][no classification][Emissions][HFC-143][t][From manufacturing][no method][no target][no option][no type]
type: Concept
definition: 2.F.2.b [Open Cells][no classification][Emissions][HFC-143][t][From manufacturing][no method][no target][no option][no type]
status: valid
status modified: 2017-02-13
accepted date: 2017-02-13
in scheme: emissions_variables_MMR

2.F.2.b [Open Cells][no classification][Emissions][HFC-143][t][From stocks][no method][no target][no option][no type]
type: Concept
definition: 2.F.2.b [Open Cells][no classification][Emissions][HFC-143][t][From stocks][no method][no target][no option][no type]
status: valid
status modified: 2017-02-13
accepted date: 2017-02-13
in scheme: emissions_variables_MMR

2.F.2.b [Open Cells][no classification][Emissions][HFC-143][t][no source][no method][no target][no option][no type]
type: Concept
definition: 2.F.2.b [Open Cells][no classification][Emissions][HFC-143][t][no source][no method][no target][no option][no type]
status: valid
status modified: 2017-02-13
accepted date: 2017-02-13
in scheme: emissions_variables_MMR

2.F.2.b [Open Cells][no classification][Emissions][HFC-143a][t][From manufacturing][no method][no target][no option][no type]
type: Concept
definition: 2.F.2.b [Open Cells][no classification][Emissions][HFC-143a][t][From manufacturing][no method][no target][no option][no type]
status: valid
status modified: 2017-02-13
accepted date: 2017-02-13
in scheme: emissions_variables_MMR

2.F.2.b [Open Cells][no classification][Emissions][HFC-143a][t][From stocks][no method][no target][no option][no type]
type: Concept
definition: 2.F.2.b [Open Cells][no classification][Emissions][HFC-143a][t][From stocks][no method][no target][no option][no type]
status: valid
status modified: 2017-02-13
accepted date: 2017-02-13
in scheme: emissions_variables_MMR

2.F.2.b [Open Cells][no classification][Emissions][HFC-143a][t][no source][no method][no target][no option][no type]
type: Concept
definition: 2.F.2.b [Open Cells][no classification][Emissions][HFC-143a][t][no source][no method][no target][no option][no type]
status: valid
status modified: 2017-02-13
accepted date: 2017-02-13
in scheme: emissions_variables_MMR

2.F.2.b [Open Cells][no classification][Emissions][HFC-152][t][From manufacturing][no method][no target][no option][no type]
type: Concept
definition: 2.F.2.b [Open Cells][no classification][Emissions][HFC-152][t][From manufacturing][no method][no target][no option][no type]
status: valid
status modified: 2017-02-13
accepted date: 2017-02-13
in scheme: emissions_variables_MMR

2.F.2.b [Open Cells][no classification][Emissions][HFC-152][t][From stocks][no method][no target][no option][no type]
type: Concept
definition: 2.F.2.b [Open Cells][no classification][Emissions][HFC-152][t][From stocks][no method][no target][no option][no type]
status: valid
status modified: 2017-02-13
accepted date: 2017-02-13
in scheme: emissions_variables_MMR

2.F.2.b [Open Cells][no classification][Emissions][HFC-152][t][no source][no method][no target][no option][no type]
type: Concept
definition: 2.F.2.b [Open Cells][no classification][Emissions][HFC-152][t][no source][no method][no target][no option][no type]
status: valid
status modified: 2017-02-13
accepted date: 2017-02-13
in scheme: emissions_variables_MMR

2.F.2.b [Open Cells][no classification][Emissions][HFC-152a][t][From manufacturing][no method][no target][no option][no type]
type: Concept
definition: 2.F.2.b [Open Cells][no classification][Emissions][HFC-152a][t][From manufacturing][no method][no target][no option][no type]
status: valid
status modified: 2017-02-13
accepted date: 2017-02-13
in scheme: emissions_variables_MMR

2.F.2.b [Open Cells][no classification][Emissions][HFC-152a][t][From stocks][no method][no target][no option][no type]
type: Concept
definition: 2.F.2.b [Open Cells][no classification][Emissions][HFC-152a][t][From stocks][no method][no target][no option][no type]
status: valid
status modified: 2017-02-13
accepted date: 2017-02-13
in scheme: emissions_variables_MMR

2.F.2.b [Open Cells][no classification][Emissions][HFC-152a][t][no source][no method][no target][no option][no type]
type: Concept
definition: 2.F.2.b [Open Cells][no classification][Emissions][HFC-152a][t][no source][no method][no target][no option][no type]
status: valid
status modified: 2017-02-13
accepted date: 2017-02-13
in scheme: emissions_variables_MMR

2.F.2.b [Open Cells][no classification][Emissions][HFC-161][t][From manufacturing][no method][no target][no option][no type]
type: Concept
definition: 2.F.2.b [Open Cells][no classification][Emissions][HFC-161][t][From manufacturing][no method][no target][no option][no type]
status: valid
status modified: 2017-02-13
accepted date: 2017-02-13
in scheme: emissions_variables_MMR

2.F.2.b [Open Cells][no classification][Emissions][HFC-161][t][From stocks][no method][no target][no option][no type]
type: Concept
definition: 2.F.2.b [Open Cells][no classification][Emissions][HFC-161][t][From stocks][no method][no target][no option][no type]
status: valid
status modified: 2017-02-13
accepted date: 2017-02-13
in scheme: emissions_variables_MMR

2.F.2.b [Open Cells][no classification][Emissions][HFC-161][t][no source][no method][no target][no option][no type]
type: Concept
definition: 2.F.2.b [Open Cells][no classification][Emissions][HFC-161][t][no source][no method][no target][no option][no type]
status: valid
status modified: 2017-02-13
accepted date: 2017-02-13
in scheme: emissions_variables_MMR

2.F.2.b [Open Cells][no classification][Emissions][HFC-227ea][t][From manufacturing][no method][no target][no option][no type]
type: Concept
definition: 2.F.2.b [Open Cells][no classification][Emissions][HFC-227ea][t][From manufacturing][no method][no target][no option][no type]
status: valid
status modified: 2017-02-13
accepted date: 2017-02-13
in scheme: emissions_variables_MMR

2.F.2.b [Open Cells][no classification][Emissions][HFC-227ea][t][From stocks][no method][no target][no option][no type]
type: Concept
definition: 2.F.2.b [Open Cells][no classification][Emissions][HFC-227ea][t][From stocks][no method][no target][no option][no type]
status: valid
status modified: 2017-02-13
accepted date: 2017-02-13
in scheme: emissions_variables_MMR

2.F.2.b [Open Cells][no classification][Emissions][HFC-227ea][t][no source][no method][no target][no option][no type]
type: Concept
definition: 2.F.2.b [Open Cells][no classification][Emissions][HFC-227ea][t][no source][no method][no target][no option][no type]
status: valid
status modified: 2017-02-13
accepted date: 2017-02-13
in scheme: emissions_variables_MMR

2.F.2.b [Open Cells][no classification][Emissions][HFC-23][t][From manufacturing][no method][no target][no option][no type]
type: Concept
definition: 2.F.2.b [Open Cells][no classification][Emissions][HFC-23][t][From manufacturing][no method][no target][no option][no type]
status: valid
status modified: 2017-02-13
accepted date: 2017-02-13
in scheme: emissions_variables_MMR

2.F.2.b [Open Cells][no classification][Emissions][HFC-23][t][From stocks][no method][no target][no option][no type]
type: Concept
definition: 2.F.2.b [Open Cells][no classification][Emissions][HFC-23][t][From stocks][no method][no target][no option][no type]
status: valid
status modified: 2017-02-13
accepted date: 2017-02-13
in scheme: emissions_variables_MMR

2.F.2.b [Open Cells][no classification][Emissions][HFC-23][t][no source][no method][no target][no option][no type]
type: Concept
definition: 2.F.2.b [Open Cells][no classification][Emissions][HFC-23][t][no source][no method][no target][no option][no type]
status: valid
status modified: 2017-02-13
accepted date: 2017-02-13
in scheme: emissions_variables_MMR

2.F.2.b [Open Cells][no classification][Emissions][HFC-236cb][t][From manufacturing][no method][no target][no option][no type]
type: Concept
definition: 2.F.2.b [Open Cells][no classification][Emissions][HFC-236cb][t][From manufacturing][no method][no target][no option][no type]
status: valid
status modified: 2017-02-13
accepted date: 2017-02-13
in scheme: emissions_variables_MMR

2.F.2.b [Open Cells][no classification][Emissions][HFC-236cb][t][From stocks][no method][no target][no option][no type]
type: Concept
definition: 2.F.2.b [Open Cells][no classification][Emissions][HFC-236cb][t][From stocks][no method][no target][no option][no type]
status: valid
status modified: 2017-02-13
accepted date: 2017-02-13
in scheme: emissions_variables_MMR

2.F.2.b [Open Cells][no classification][Emissions][HFC-236cb][t][no source][no method][no target][no option][no type]
type: Concept
definition: 2.F.2.b [Open Cells][no classification][Emissions][HFC-236cb][t][no source][no method][no target][no option][no type]
status: valid
status modified: 2017-02-13
accepted date: 2017-02-13
in scheme: emissions_variables_MMR

2.F.2.b [Open Cells][no classification][Emissions][HFC-236ea][t][From manufacturing][no method][no target][no option][no type]
type: Concept
definition: 2.F.2.b [Open Cells][no classification][Emissions][HFC-236ea][t][From manufacturing][no method][no target][no option][no type]
status: valid
status modified: 2017-02-13
accepted date: 2017-02-13
in scheme: emissions_variables_MMR

2.F.2.b [Open Cells][no classification][Emissions][HFC-236ea][t][From stocks][no method][no target][no option][no type]
type: Concept
definition: 2.F.2.b [Open Cells][no classification][Emissions][HFC-236ea][t][From stocks][no method][no target][no option][no type]
status: valid
status modified: 2017-02-13
accepted date: 2017-02-13
in scheme: emissions_variables_MMR

2.F.2.b [Open Cells][no classification][Emissions][HFC-236ea][t][no source][no method][no target][no option][no type]
type: Concept
definition: 2.F.2.b [Open Cells][no classification][Emissions][HFC-236ea][t][no source][no method][no target][no option][no type]
status: valid
status modified: 2017-02-13
accepted date: 2017-02-13
in scheme: emissions_variables_MMR

2.F.2.b [Open Cells][no classification][Emissions][HFC-236fa][t][From manufacturing][no method][no target][no option][no type]
type: Concept
definition: 2.F.2.b [Open Cells][no classification][Emissions][HFC-236fa][t][From manufacturing][no method][no target][no option][no type]
status: valid
status modified: 2017-02-13
accepted date: 2017-02-13
in scheme: emissions_variables_MMR

2.F.2.b [Open Cells][no classification][Emissions][HFC-236fa][t][From stocks][no method][no target][no option][no type]
type: Concept
definition: 2.F.2.b [Open Cells][no classification][Emissions][HFC-236fa][t][From stocks][no method][no target][no option][no type]
status: valid
status modified: 2017-02-13
accepted date: 2017-02-13
in scheme: emissions_variables_MMR

2.F.2.b [Open Cells][no classification][Emissions][HFC-236fa][t][no source][no method][no target][no option][no type]
type: Concept
definition: 2.F.2.b [Open Cells][no classification][Emissions][HFC-236fa][t][no source][no method][no target][no option][no type]
status: valid
status modified: 2017-02-13
accepted date: 2017-02-13
in scheme: emissions_variables_MMR

2.F.2.b [Open Cells][no classification][Emissions][HFC-245ca][t][From manufacturing][no method][no target][no option][no type]
type: Concept
definition: 2.F.2.b [Open Cells][no classification][Emissions][HFC-245ca][t][From manufacturing][no method][no target][no option][no type]
status: valid
status modified: 2017-02-13
accepted date: 2017-02-13
in scheme: emissions_variables_MMR

2.F.2.b [Open Cells][no classification][Emissions][HFC-245ca][t][From stocks][no method][no target][no option][no type]
type: Concept
definition: 2.F.2.b [Open Cells][no classification][Emissions][HFC-245ca][t][From stocks][no method][no target][no option][no type]
status: valid
status modified: 2017-02-13
accepted date: 2017-02-13
in scheme: emissions_variables_MMR

2.F.2.b [Open Cells][no classification][Emissions][HFC-245ca][t][no source][no method][no target][no option][no type]
type: Concept
definition: 2.F.2.b [Open Cells][no classification][Emissions][HFC-245ca][t][no source][no method][no target][no option][no type]
status: valid
status modified: 2017-02-13
accepted date: 2017-02-13
in scheme: emissions_variables_MMR

2.F.2.b [Open Cells][no classification][Emissions][HFC-245fa][t][From manufacturing][no method][no target][no option][no type]
type: Concept
definition: 2.F.2.b [Open Cells][no classification][Emissions][HFC-245fa][t][From manufacturing][no method][no target][no option][no type]
status: valid
status modified: 2017-02-13
accepted date: 2017-02-13
in scheme: emissions_variables_MMR

2.F.2.b [Open Cells][no classification][Emissions][HFC-245fa][t][From stocks][no method][no target][no option][no type]
type: Concept
definition: 2.F.2.b [Open Cells][no classification][Emissions][HFC-245fa][t][From stocks][no method][no target][no option][no type]
status: valid
status modified: 2017-02-13
accepted date: 2017-02-13
in scheme: emissions_variables_MMR

2.F.2.b [Open Cells][no classification][Emissions][HFC-245fa][t][no source][no method][no target][no option][no type]
type: Concept
definition: 2.F.2.b [Open Cells][no classification][Emissions][HFC-245fa][t][no source][no method][no target][no option][no type]
status: valid
status modified: 2017-02-13
accepted date: 2017-02-13
in scheme: emissions_variables_MMR

2.F.2.b [Open Cells][no classification][Emissions][HFC-32][t][From manufacturing][no method][no target][no option][no type]
type: Concept
definition: 2.F.2.b [Open Cells][no classification][Emissions][HFC-32][t][From manufacturing][no method][no target][no option][no type]
status: valid
status modified: 2017-02-13
accepted date: 2017-02-13
in scheme: emissions_variables_MMR

2.F.2.b [Open Cells][no classification][Emissions][HFC-32][t][From stocks][no method][no target][no option][no type]
type: Concept
definition: 2.F.2.b [Open Cells][no classification][Emissions][HFC-32][t][From stocks][no method][no target][no option][no type]
status: valid
status modified: 2017-02-13
accepted date: 2017-02-13
in scheme: emissions_variables_MMR

2.F.2.b [Open Cells][no classification][Emissions][HFC-32][t][no source][no method][no target][no option][no type]
type: Concept
definition: 2.F.2.b [Open Cells][no classification][Emissions][HFC-32][t][no source][no method][no target][no option][no type]
status: valid
status modified: 2017-02-13
accepted date: 2017-02-13
in scheme: emissions_variables_MMR

2.F.2.b [Open Cells][no classification][Emissions][HFC-365mfc][t][From manufacturing][no method][no target][no option][no type]
type: Concept
definition: 2.F.2.b [Open Cells][no classification][Emissions][HFC-365mfc][t][From manufacturing][no method][no target][no option][no type]
status: valid
status modified: 2017-02-13
accepted date: 2017-02-13
in scheme: emissions_variables_MMR

2.F.2.b [Open Cells][no classification][Emissions][HFC-365mfc][t][From stocks][no method][no target][no option][no type]
type: Concept
definition: 2.F.2.b [Open Cells][no classification][Emissions][HFC-365mfc][t][From stocks][no method][no target][no option][no type]
status: valid
status modified: 2017-02-13
accepted date: 2017-02-13
in scheme: emissions_variables_MMR

2.F.2.b [Open Cells][no classification][Emissions][HFC-365mfc][t][no source][no method][no target][no option][no type]
type: Concept
definition: 2.F.2.b [Open Cells][no classification][Emissions][HFC-365mfc][t][no source][no method][no target][no option][no type]
status: valid
status modified: 2017-02-13
accepted date: 2017-02-13
in scheme: emissions_variables_MMR

2.F.2.b [Open Cells][no classification][Emissions][HFC-41][t][From manufacturing][no method][no target][no option][no type]
type: Concept
definition: 2.F.2.b [Open Cells][no classification][Emissions][HFC-41][t][From manufacturing][no method][no target][no option][no type]
status: valid
status modified: 2017-02-13
accepted date: 2017-02-13
in scheme: emissions_variables_MMR

2.F.2.b [Open Cells][no classification][Emissions][HFC-41][t][From stocks][no method][no target][no option][no type]
type: Concept
definition: 2.F.2.b [Open Cells][no classification][Emissions][HFC-41][t][From stocks][no method][no target][no option][no type]
status: valid
status modified: 2017-02-13
accepted date: 2017-02-13
in scheme: emissions_variables_MMR

2.F.2.b [Open Cells][no classification][Emissions][HFC-41][t][no source][no method][no target][no option][no type]
type: Concept
definition: 2.F.2.b [Open Cells][no classification][Emissions][HFC-41][t][no source][no method][no target][no option][no type]
status: valid
status modified: 2017-02-13
accepted date: 2017-02-13
in scheme: emissions_variables_MMR

2.F.2.b [Open Cells][no classification][Emissions][HFC-43-10mee][t][From manufacturing][no method][no target][no option][no type]
type: Concept
definition: 2.F.2.b [Open Cells][no classification][Emissions][HFC-43-10mee][t][From manufacturing][no method][no target][no option][no type]
status: valid
status modified: 2017-02-13
accepted date: 2017-02-13
in scheme: emissions_variables_MMR

2.F.2.b [Open Cells][no classification][Emissions][HFC-43-10mee][t][From stocks][no method][no target][no option][no type]
type: Concept
definition: 2.F.2.b [Open Cells][no classification][Emissions][HFC-43-10mee][t][From stocks][no method][no target][no option][no type]
status: valid
status modified: 2017-02-13
accepted date: 2017-02-13
in scheme: emissions_variables_MMR

2.F.2.b [Open Cells][no classification][Emissions][HFC-43-10mee][t][no source][no method][no target][no option][no type]
type: Concept
definition: 2.F.2.b [Open Cells][no classification][Emissions][HFC-43-10mee][t][no source][no method][no target][no option][no type]
status: valid
status modified: 2017-02-13
accepted date: 2017-02-13
in scheme: emissions_variables_MMR

2.F.2.b [Open Cells][no classification][Emissions][HFCs][t CO2 equivalent][no source][no method][no target][no option][no type]
type: Concept
definition: 2.F.2.b [Open Cells][no classification][Emissions][HFCs][t CO2 equivalent][no source][no method][no target][no option][no type]
status: valid
status modified: 2017-02-13
accepted date: 2017-02-13
in scheme: emissions_variables_MMR

2.F.2.b [Open Cells][no classification][Emissions][NF3][t][From manufacturing][no method][no target][no option][no type]
type: Concept
definition: 2.F.2.b [Open Cells][no classification][Emissions][NF3][t][From manufacturing][no method][no target][no option][no type]
status: valid
status modified: 2017-02-13
accepted date: 2017-02-13
in scheme: emissions_variables_MMR

2.F.2.b [Open Cells][no classification][Emissions][NF3][t][From stocks][no method][no target][no option][no type]
type: Concept
definition: 2.F.2.b [Open Cells][no classification][Emissions][NF3][t][From stocks][no method][no target][no option][no type]
status: valid
status modified: 2017-02-13
accepted date: 2017-02-13
in scheme: emissions_variables_MMR

2.F.2.b [Open Cells][no classification][Emissions][NF3][t][no source][no method][no target][no option][no type]
type: Concept
definition: 2.F.2.b [Open Cells][no classification][Emissions][NF3][t][no source][no method][no target][no option][no type]
status: valid
status modified: 2017-02-13
accepted date: 2017-02-13
in scheme: emissions_variables_MMR

2.F.2.b [Open Cells][no classification][Emissions][no gas][kt CO2 equivalent][no source][no method][no target][no option][no type]
type: Concept
definition: 2.F.2.b [Open Cells][no classification][Emissions][no gas][kt CO2 equivalent][no source][no method][no target][no option][no type]
status: valid
status modified: 2017-02-13
accepted date: 2017-02-13
in scheme: emissions_variables_MMR

2.F.2.b [Open Cells][no classification][Emissions][PFCs][t CO2 equivalent][no source][no method][no target][no option][no type]
type: Concept
definition: 2.F.2.b [Open Cells][no classification][Emissions][PFCs][t CO2 equivalent][no source][no method][no target][no option][no type]
status: valid
status modified: 2017-02-13
accepted date: 2017-02-13
in scheme: emissions_variables_MMR

2.F.2.b [Open Cells][no classification][Emissions][SF6][t][From manufacturing][no method][no target][no option][no type]
type: Concept
definition: 2.F.2.b [Open Cells][no classification][Emissions][SF6][t][From manufacturing][no method][no target][no option][no type]
status: valid
status modified: 2017-02-13
accepted date: 2017-02-13
in scheme: emissions_variables_MMR

2.F.2.b [Open Cells][no classification][Emissions][SF6][t][From stocks][no method][no target][no option][no type]
type: Concept
definition: 2.F.2.b [Open Cells][no classification][Emissions][SF6][t][From stocks][no method][no target][no option][no type]
status: valid
status modified: 2017-02-13
accepted date: 2017-02-13
in scheme: emissions_variables_MMR

2.F.2.b [Open Cells][no classification][Emissions][SF6][t][no source][no method][no target][no option][no type]
type: Concept
definition: 2.F.2.b [Open Cells][no classification][Emissions][SF6][t][no source][no method][no target][no option][no type]
status: valid
status modified: 2017-02-13
accepted date: 2017-02-13
in scheme: emissions_variables_MMR

2.F.2.b [Open Cells][no classification][Emissions][Unspecified mix of HFCs and PFCs][t CO2 equivalent][From manufacturing][no method][no target][no option][no type]
type: Concept
definition: 2.F.2.b [Open Cells][no classification][Emissions][Unspecified mix of HFCs and PFCs][t CO2 equivalent][From manufacturing][no method][no target][no option][no type]
status: valid
status modified: 2017-02-13
accepted date: 2017-02-13
in scheme: emissions_variables_MMR

2.F.2.b [Open Cells][no classification][Emissions][Unspecified mix of HFCs and PFCs][t CO2 equivalent][From stocks][no method][no target][no option][no type]
type: Concept
definition: 2.F.2.b [Open Cells][no classification][Emissions][Unspecified mix of HFCs and PFCs][t CO2 equivalent][From stocks][no method][no target][no option][no type]
status: valid
status modified: 2017-02-13
accepted date: 2017-02-13
in scheme: emissions_variables_MMR

2.F.2.b [Open Cells][no classification][Emissions][Unspecified mix of HFCs and PFCs][t CO2 equivalent][no source][no method][no target][no option][no type]
type: Concept
definition: 2.F.2.b [Open Cells][no classification][Emissions][Unspecified mix of HFCs and PFCs][t CO2 equivalent][no source][no method][no target][no option][no type]
status: valid
status modified: 2017-02-13
accepted date: 2017-02-13
in scheme: emissions_variables_MMR

2.F.2.b [Open Cells][no classification][Emissions][Unspecified mix of HFCs][t CO2 equivalent][From manufacturing][no method][no target][no option][no type]
type: Concept
definition: 2.F.2.b [Open Cells][no classification][Emissions][Unspecified mix of HFCs][t CO2 equivalent][From manufacturing][no method][no target][no option][no type]
status: valid
status modified: 2017-02-13
accepted date: 2017-02-13
in scheme: emissions_variables_MMR

2.F.2.b [Open Cells][no classification][Emissions][Unspecified mix of HFCs][t CO2 equivalent][From stocks][no method][no target][no option][no type]
type: Concept
definition: 2.F.2.b [Open Cells][no classification][Emissions][Unspecified mix of HFCs][t CO2 equivalent][From stocks][no method][no target][no option][no type]
status: valid
status modified: 2017-02-13
accepted date: 2017-02-13
in scheme: emissions_variables_MMR

2.F.2.b [Open Cells][no classification][Emissions][Unspecified mix of HFCs][t CO2 equivalent][no source][no method][no target][no option][no type]
type: Concept
definition: 2.F.2.b [Open Cells][no classification][Emissions][Unspecified mix of HFCs][t CO2 equivalent][no source][no method][no target][no option][no type]
status: valid
status modified: 2017-02-13
accepted date: 2017-02-13
in scheme: emissions_variables_MMR

2.F.2.b [Open Cells][no classification][Emissions][Unspecified mix of PFCs][t CO2 equivalent][From manufacturing][no method][no target][no option][no type]
type: Concept
definition: 2.F.2.b [Open Cells][no classification][Emissions][Unspecified mix of PFCs][t CO2 equivalent][From manufacturing][no method][no target][no option][no type]
status: valid
status modified: 2017-02-13
accepted date: 2017-02-13
in scheme: emissions_variables_MMR

2.F.2.b [Open Cells][no classification][Emissions][Unspecified mix of PFCs][t CO2 equivalent][From stocks][no method][no target][no option][no type]
type: Concept
definition: 2.F.2.b [Open Cells][no classification][Emissions][Unspecified mix of PFCs][t CO2 equivalent][From stocks][no method][no target][no option][no type]
status: valid
status modified: 2017-02-13
accepted date: 2017-02-13
in scheme: emissions_variables_MMR

2.F.2.b [Open Cells][no classification][Emissions][Unspecified mix of PFCs][t CO2 equivalent][no source][no method][no target][no option][no type]
type: Concept
definition: 2.F.2.b [Open Cells][no classification][Emissions][Unspecified mix of PFCs][t CO2 equivalent][no source][no method][no target][no option][no type]
status: valid
status modified: 2017-02-13
accepted date: 2017-02-13
in scheme: emissions_variables_MMR

2.F.3 [Fire Protection][no classification][Emissions][Aggregate F-gases][t CO2 equivalent][no source][no method][no target][no option][no type]
type: Concept
definition: 2.F.3 [Fire Protection][no classification][Emissions][Aggregate F-gases][t CO2 equivalent][no source][no method][no target][no option][no type]
status: valid
status modified: 2017-02-13
accepted date: 2017-02-13
in scheme: emissions_variables_MMR

2.F.3 [Fire Protection][no classification][Emissions][C3F8][t][no source][no method][no target][no option][no type]
type: Concept
definition: 2.F.3 [Fire Protection][no classification][Emissions][C3F8][t][no source][no method][no target][no option][no type]
status: valid
status modified: 2017-02-13
accepted date: 2017-02-13
in scheme: emissions_variables_MMR

2.F.3 [Fire Protection][no classification][Emissions][C6F14][t][no source][no method][no target][no option][no type]
type: Concept
definition: 2.F.3 [Fire Protection][no classification][Emissions][C6F14][t][no source][no method][no target][no option][no type]
status: valid
status modified: 2017-02-13
accepted date: 2017-02-13
in scheme: emissions_variables_MMR

2.F.3 [Fire Protection][no classification][Emissions][CF4][t][no source][no method][no target][no option][no type]
type: Concept
definition: 2.F.3 [Fire Protection][no classification][Emissions][CF4][t][no source][no method][no target][no option][no type]
status: valid
status modified: 2017-02-13
accepted date: 2017-02-13
in scheme: emissions_variables_MMR

2.F.3 [Fire Protection][no classification][Emissions][HFC-134a][t][no source][no method][no target][no option][no type]
type: Concept
definition: 2.F.3 [Fire Protection][no classification][Emissions][HFC-134a][t][no source][no method][no target][no option][no type]
status: valid
status modified: 2017-02-13
accepted date: 2017-02-13
in scheme: emissions_variables_MMR

2.F.3 [Fire Protection][no classification][Emissions][HFC-143a][t][no source][no method][no target][no option][no type]
type: Concept
definition: 2.F.3 [Fire Protection][no classification][Emissions][HFC-143a][t][no source][no method][no target][no option][no type]
status: valid
status modified: 2017-02-13
accepted date: 2017-02-13
in scheme: emissions_variables_MMR

2.F.3 [Fire Protection][no classification][Emissions][HFC-152a][t][no source][no method][no target][no option][no type]
type: Concept
definition: 2.F.3 [Fire Protection][no classification][Emissions][HFC-152a][t][no source][no method][no target][no option][no type]
status: valid
status modified: 2017-02-13
accepted date: 2017-02-13
in scheme: emissions_variables_MMR

2.F.3 [Fire Protection][no classification][Emissions][HFC-23][t][no source][no method][no target][no option][no type]
type: Concept
definition: 2.F.3 [Fire Protection][no classification][Emissions][HFC-23][t][no source][no method][no target][no option][no type]
status: valid
status modified: 2017-02-13
accepted date: 2017-02-13
in scheme: emissions_variables_MMR

2.F.3 [Fire Protection][no classification][Emissions][HFC-236cb][t][no source][no method][no target][no option][no type]
type: Concept
definition: 2.F.3 [Fire Protection][no classification][Emissions][HFC-236cb][t][no source][no method][no target][no option][no type]
status: valid
status modified: 2017-02-13
accepted date: 2017-02-13
in scheme: emissions_variables_MMR

2.F.3 [Fire Protection][no classification][Emissions][HFC-236ea][t][no source][no method][no target][no option][no type]
type: Concept
definition: 2.F.3 [Fire Protection][no classification][Emissions][HFC-236ea][t][no source][no method][no target][no option][no type]
status: valid
status modified: 2017-02-13
accepted date: 2017-02-13
in scheme: emissions_variables_MMR

2.F.3 [Fire Protection][no classification][Emissions][HFC-245ca][t][no source][no method][no target][no option][no type]
type: Concept
definition: 2.F.3 [Fire Protection][no classification][Emissions][HFC-245ca][t][no source][no method][no target][no option][no type]
status: valid
status modified: 2017-02-13
accepted date: 2017-02-13
in scheme: emissions_variables_MMR

2.F.3 [Fire Protection][no classification][Emissions][HFC-245fa][t][no source][no method][no target][no option][no type]
type: Concept
definition: 2.F.3 [Fire Protection][no classification][Emissions][HFC-245fa][t][no source][no method][no target][no option][no type]
status: valid
status modified: 2017-02-13
accepted date: 2017-02-13
in scheme: emissions_variables_MMR

2.F.3 [Fire Protection][no classification][Emissions][HFC-365mfc][t][no source][no method][no target][no option][no type]
type: Concept
definition: 2.F.3 [Fire Protection][no classification][Emissions][HFC-365mfc][t][no source][no method][no target][no option][no type]
status: valid
status modified: 2017-02-13
accepted date: 2017-02-13
in scheme: emissions_variables_MMR

2.F.3 [Fire Protection][no classification][Emissions][HFC-41][t][no source][no method][no target][no option][no type]
type: Concept
definition: 2.F.3 [Fire Protection][no classification][Emissions][HFC-41][t][no source][no method][no target][no option][no type]
status: valid
status modified: 2017-02-13
accepted date: 2017-02-13
in scheme: emissions_variables_MMR

2.F.3 [Fire Protection][no classification][Emissions][HFC-43-10mee][t][no source][no method][no target][no option][no type]
type: Concept
definition: 2.F.3 [Fire Protection][no classification][Emissions][HFC-43-10mee][t][no source][no method][no target][no option][no type]
status: valid
status modified: 2017-02-13
accepted date: 2017-02-13
in scheme: emissions_variables_MMR

2.F.3 [Fire Protection][no classification][Emissions][HFCs and PFCs][t CO2 equivalent][no source][no method][no target][no option][no type]
type: Concept
definition: 2.F.3 [Fire Protection][no classification][Emissions][HFCs and PFCs][t CO2 equivalent][no source][no method][no target][no option][no type]
status: valid
status modified: 2017-02-13
accepted date: 2017-02-13
in scheme: emissions_variables_MMR

2.F.3 [Fire Protection][no classification][Emissions][HFCs][t CO2 equivalent][no source][no method][no target][no option][no type]
type: Concept
definition: 2.F.3 [Fire Protection][no classification][Emissions][HFCs][t CO2 equivalent][no source][no method][no target][no option][no type]
status: valid
status modified: 2017-02-13
accepted date: 2017-02-13
in scheme: emissions_variables_MMR

2.F.3 [Fire Protection][no classification][Emissions][NF3][t][no source][no method][no target][no option][no type]
type: Concept
definition: 2.F.3 [Fire Protection][no classification][Emissions][NF3][t][no source][no method][no target][no option][no type]
status: valid
status modified: 2017-02-13
accepted date: 2017-02-13
in scheme: emissions_variables_MMR

2.F.3 [Fire Protection][no classification][Emissions][PFCs][t CO2 equivalent][no source][no method][no target][no option][no type]
type: Concept
definition: 2.F.3 [Fire Protection][no classification][Emissions][PFCs][t CO2 equivalent][no source][no method][no target][no option][no type]
status: valid
status modified: 2017-02-13
accepted date: 2017-02-13
in scheme: emissions_variables_MMR

2.F.3 [Fire Protection][no classification][Emissions][SF6][t][no source][no method][no target][no option][no type]
type: Concept
definition: 2.F.3 [Fire Protection][no classification][Emissions][SF6][t][no source][no method][no target][no option][no type]
status: valid
status modified: 2017-02-13
accepted date: 2017-02-13
in scheme: emissions_variables_MMR

2.F.3 [Fire Protection][no classification][Emissions][Unspecified mix of HFCs and PFCs][t CO2 equivalent][no source][no method][no target][no option][no type]
type: Concept
definition: 2.F.3 [Fire Protection][no classification][Emissions][Unspecified mix of HFCs and PFCs][t CO2 equivalent][no source][no method][no target][no option][no type]
status: valid
status modified: 2017-02-13
accepted date: 2017-02-13
in scheme: emissions_variables_MMR

2.F.3 [Fire Protection][no classification][Emissions][Unspecified mix of HFCs][t CO2 equivalent][no source][no method][no target][no option][no type]
type: Concept
definition: 2.F.3 [Fire Protection][no classification][Emissions][Unspecified mix of HFCs][t CO2 equivalent][no source][no method][no target][no option][no type]
status: valid
status modified: 2017-02-13
accepted date: 2017-02-13
in scheme: emissions_variables_MMR

2.F.3 [Fire Protection][no classification][Emissions][Unspecified mix of PFCs][t CO2 equivalent][no source][no method][no target][no option][no type]
type: Concept
definition: 2.F.3 [Fire Protection][no classification][Emissions][Unspecified mix of PFCs][t CO2 equivalent][no source][no method][no target][no option][no type]
status: valid
status modified: 2017-02-13
accepted date: 2017-02-13
in scheme: emissions_variables_MMR

2.F.4 [Aerosols][no classification][Emissions][Aggregate F-gases][t CO2 equivalent][no source][no method][no target][no option][no type]
type: Concept
definition: 2.F.4 [Aerosols][no classification][Emissions][Aggregate F-gases][t CO2 equivalent][no source][no method][no target][no option][no type]
status: valid
status modified: 2017-02-13
accepted date: 2017-02-13
in scheme: emissions_variables_MMR

2.F.4 [Aerosols][no classification][Emissions][C10F18][t][no source][no method][no target][no option][no type]
type: Concept
definition: 2.F.4 [Aerosols][no classification][Emissions][C10F18][t][no source][no method][no target][no option][no type]
status: valid
status modified: 2017-02-13
accepted date: 2017-02-13
in scheme: emissions_variables_MMR

2.F.4 [Aerosols][no classification][Emissions][C2F6][t][no source][no method][no target][no option][no type]
type: Concept
definition: 2.F.4 [Aerosols][no classification][Emissions][C2F6][t][no source][no method][no target][no option][no type]
status: valid
status modified: 2017-02-13
accepted date: 2017-02-13
in scheme: emissions_variables_MMR

2.F.4 [Aerosols][no classification][Emissions][C3F8][t][no source][no method][no target][no option][no type]
type: Concept
definition: 2.F.4 [Aerosols][no classification][Emissions][C3F8][t][no source][no method][no target][no option][no type]
status: valid
status modified: 2017-02-13
accepted date: 2017-02-13
in scheme: emissions_variables_MMR

2.F.4 [Aerosols][no classification][Emissions][C4F10][t][no source][no method][no target][no option][no type]
type: Concept
definition: 2.F.4 [Aerosols][no classification][Emissions][C4F10][t][no source][no method][no target][no option][no type]
status: valid
status modified: 2017-02-13
accepted date: 2017-02-13
in scheme: emissions_variables_MMR

2.F.4 [Aerosols][no classification][Emissions][C5F12][t][no source][no method][no target][no option][no type]
type: Concept
definition: 2.F.4 [Aerosols][no classification][Emissions][C5F12][t][no source][no method][no target][no option][no type]
status: valid
status modified: 2017-02-13
accepted date: 2017-02-13
in scheme: emissions_variables_MMR

2.F.4 [Aerosols][no classification][Emissions][C6F14][t][no source][no method][no target][no option][no type]
type: Concept
definition: 2.F.4 [Aerosols][no classification][Emissions][C6F14][t][no source][no method][no target][no option][no type]
status: valid
status modified: 2017-02-13
accepted date: 2017-02-13
in scheme: emissions_variables_MMR

2.F.4 [Aerosols][no classification][Emissions][c-C3F6][t][no source][no method][no target][no option][no type]
type: Concept
definition: 2.F.4 [Aerosols][no classification][Emissions][c-C3F6][t][no source][no method][no target][no option][no type]
status: valid
status modified: 2017-02-13
accepted date: 2017-02-13
in scheme: emissions_variables_MMR

2.F.4 [Aerosols][no classification][Emissions][c-C4F8][t][no source][no method][no target][no option][no type]
type: Concept
definition: 2.F.4 [Aerosols][no classification][Emissions][c-C4F8][t][no source][no method][no target][no option][no type]
status: valid
status modified: 2017-02-13
accepted date: 2017-02-13
in scheme: emissions_variables_MMR

2.F.4 [Aerosols][no classification][Emissions][CF4][t][no source][no method][no target][no option][no type]
type: Concept
definition: 2.F.4 [Aerosols][no classification][Emissions][CF4][t][no source][no method][no target][no option][no type]
status: valid
status modified: 2017-02-13
accepted date: 2017-02-13
in scheme: emissions_variables_MMR

2.F.4 [Aerosols][no classification][Emissions][HFC-125][t][no source][no method][no target][no option][no type]
type: Concept
definition: 2.F.4 [Aerosols][no classification][Emissions][HFC-125][t][no source][no method][no target][no option][no type]
status: valid
status modified: 2017-02-13
accepted date: 2017-02-13
in scheme: emissions_variables_MMR

2.F.4 [Aerosols][no classification][Emissions][HFC-134][t][no source][no method][no target][no option][no type]
type: Concept
definition: 2.F.4 [Aerosols][no classification][Emissions][HFC-134][t][no source][no method][no target][no option][no type]
status: valid
status modified: 2017-02-13
accepted date: 2017-02-13
in scheme: emissions_variables_MMR

2.F.4 [Aerosols][no classification][Emissions][HFC-134a][t][no source][no method][no target][no option][no type]
type: Concept
definition: 2.F.4 [Aerosols][no classification][Emissions][HFC-134a][t][no source][no method][no target][no option][no type]
status: valid
status modified: 2017-02-13
accepted date: 2017-02-13
in scheme: emissions_variables_MMR

2.F.4 [Aerosols][no classification][Emissions][HFC-143][t][no source][no method][no target][no option][no type]
type: Concept
definition: 2.F.4 [Aerosols][no classification][Emissions][HFC-143][t][no source][no method][no target][no option][no type]
status: valid
status modified: 2017-02-13
accepted date: 2017-02-13
in scheme: emissions_variables_MMR

2.F.4 [Aerosols][no classification][Emissions][HFC-143a][t][no source][no method][no target][no option][no type]
type: Concept
definition: 2.F.4 [Aerosols][no classification][Emissions][HFC-143a][t][no source][no method][no target][no option][no type]
status: valid
status modified: 2017-02-13
accepted date: 2017-02-13
in scheme: emissions_variables_MMR

2.F.4 [Aerosols][no classification][Emissions][HFC-152][t][no source][no method][no target][no option][no type]
type: Concept
definition: 2.F.4 [Aerosols][no classification][Emissions][HFC-152][t][no source][no method][no target][no option][no type]
status: valid
status modified: 2017-02-13
accepted date: 2017-02-13
in scheme: emissions_variables_MMR

2.F.4 [Aerosols][no classification][Emissions][HFC-152a][t][no source][no method][no target][no option][no type]
type: Concept
definition: 2.F.4 [Aerosols][no classification][Emissions][HFC-152a][t][no source][no method][no target][no option][no type]
status: valid
status modified: 2017-02-13
accepted date: 2017-02-13
in scheme: emissions_variables_MMR

2.F.4 [Aerosols][no classification][Emissions][HFC-161][t][no source][no method][no target][no option][no type]
type: Concept
definition: 2.F.4 [Aerosols][no classification][Emissions][HFC-161][t][no source][no method][no target][no option][no type]
status: valid
status modified: 2017-02-13
accepted date: 2017-02-13
in scheme: emissions_variables_MMR

2.F.4 [Aerosols][no classification][Emissions][HFC-227ea][t][no source][no method][no target][no option][no type]
type: Concept
definition: 2.F.4 [Aerosols][no classification][Emissions][HFC-227ea][t][no source][no method][no target][no option][no type]
status: valid
status modified: 2017-02-13
accepted date: 2017-02-13
in scheme: emissions_variables_MMR

2.F.4 [Aerosols][no classification][Emissions][HFC-23][t][no source][no method][no target][no option][no type]
type: Concept
definition: 2.F.4 [Aerosols][no classification][Emissions][HFC-23][t][no source][no method][no target][no option][no type]
status: valid
status modified: 2017-02-13
accepted date: 2017-02-13
in scheme: emissions_variables_MMR

2.F.4 [Aerosols][no classification][Emissions][HFC-236cb][t][no source][no method][no target][no option][no type]
type: Concept
definition: 2.F.4 [Aerosols][no classification][Emissions][HFC-236cb][t][no source][no method][no target][no option][no type]
status: valid
status modified: 2017-02-13
accepted date: 2017-02-13
in scheme: emissions_variables_MMR

2.F.4 [Aerosols][no classification][Emissions][HFC-236ea][t][no source][no method][no target][no option][no type]
type: Concept
definition: 2.F.4 [Aerosols][no classification][Emissions][HFC-236ea][t][no source][no method][no target][no option][no type]
status: valid
status modified: 2017-02-13
accepted date: 2017-02-13
in scheme: emissions_variables_MMR

2.F.4 [Aerosols][no classification][Emissions][HFC-236fa][t][no source][no method][no target][no option][no type]
type: Concept
definition: 2.F.4 [Aerosols][no classification][Emissions][HFC-236fa][t][no source][no method][no target][no option][no type]
status: valid
status modified: 2017-02-13
accepted date: 2017-02-13
in scheme: emissions_variables_MMR

2.F.4 [Aerosols][no classification][Emissions][HFC-245ca][t][no source][no method][no target][no option][no type]
type: Concept
definition: 2.F.4 [Aerosols][no classification][Emissions][HFC-245ca][t][no source][no method][no target][no option][no type]
status: valid
status modified: 2017-02-13
accepted date: 2017-02-13
in scheme: emissions_variables_MMR

2.F.4 [Aerosols][no classification][Emissions][HFC-245fa][t][no source][no method][no target][no option][no type]
type: Concept
definition: 2.F.4 [Aerosols][no classification][Emissions][HFC-245fa][t][no source][no method][no target][no option][no type]
status: valid
status modified: 2017-02-13
accepted date: 2017-02-13
in scheme: emissions_variables_MMR

2.F.4 [Aerosols][no classification][Emissions][HFC-32][t][no source][no method][no target][no option][no type]
type: Concept
definition: 2.F.4 [Aerosols][no classification][Emissions][HFC-32][t][no source][no method][no target][no option][no type]
status: valid
status modified: 2017-02-13
accepted date: 2017-02-13
in scheme: emissions_variables_MMR

2.F.4 [Aerosols][no classification][Emissions][HFC-365mfc][t][no source][no method][no target][no option][no type]
type: Concept
definition: 2.F.4 [Aerosols][no classification][Emissions][HFC-365mfc][t][no source][no method][no target][no option][no type]
status: valid
status modified: 2017-02-13
accepted date: 2017-02-13
in scheme: emissions_variables_MMR

2.F.4 [Aerosols][no classification][Emissions][HFC-41][t][no source][no method][no target][no option][no type]
type: Concept
definition: 2.F.4 [Aerosols][no classification][Emissions][HFC-41][t][no source][no method][no target][no option][no type]
status: valid
status modified: 2017-02-13
accepted date: 2017-02-13
in scheme: emissions_variables_MMR

2.F.4 [Aerosols][no classification][Emissions][HFC-43-10mee][t][no source][no method][no target][no option][no type]
type: Concept
definition: 2.F.4 [Aerosols][no classification][Emissions][HFC-43-10mee][t][no source][no method][no target][no option][no type]
status: valid
status modified: 2017-02-13
accepted date: 2017-02-13
in scheme: emissions_variables_MMR

2.F.4 [Aerosols][no classification][Emissions][HFCs and PFCs][t CO2 equivalent][no source][no method][no target][no option][no type]
type: Concept
definition: 2.F.4 [Aerosols][no classification][Emissions][HFCs and PFCs][t CO2 equivalent][no source][no method][no target][no option][no type]
status: valid
status modified: 2017-02-13
accepted date: 2017-02-13
in scheme: emissions_variables_MMR

2.F.4 [Aerosols][no classification][Emissions][HFCs][t CO2 equivalent][no source][no method][no target][no option][no type]
type: Concept
definition: 2.F.4 [Aerosols][no classification][Emissions][HFCs][t CO2 equivalent][no source][no method][no target][no option][no type]
status: valid
status modified: 2017-02-13
accepted date: 2017-02-13
in scheme: emissions_variables_MMR

2.F.4 [Aerosols][no classification][Emissions][NF3][t][no source][no method][no target][no option][no type]
type: Concept
definition: 2.F.4 [Aerosols][no classification][Emissions][NF3][t][no source][no method][no target][no option][no type]
status: valid
status modified: 2017-02-13
accepted date: 2017-02-13
in scheme: emissions_variables_MMR

2.F.4 [Aerosols][no classification][Emissions][PFCs][t CO2 equivalent][no source][no method][no target][no option][no type]
type: Concept
definition: 2.F.4 [Aerosols][no classification][Emissions][PFCs][t CO2 equivalent][no source][no method][no target][no option][no type]
status: valid
status modified: 2017-02-13
accepted date: 2017-02-13
in scheme: emissions_variables_MMR

2.F.4 [Aerosols][no classification][Emissions][SF6][t][no source][no method][no target][no option][no type]
type: Concept
definition: 2.F.4 [Aerosols][no classification][Emissions][SF6][t][no source][no method][no target][no option][no type]
status: valid
status modified: 2017-02-13
accepted date: 2017-02-13
in scheme: emissions_variables_MMR

2.F.4 [Aerosols][no classification][Emissions][Unspecified mix of HFCs and PFCs][t CO2 equivalent][no source][no method][no target][no option][no type]
type: Concept
definition: 2.F.4 [Aerosols][no classification][Emissions][Unspecified mix of HFCs and PFCs][t CO2 equivalent][no source][no method][no target][no option][no type]
status: valid
status modified: 2017-02-13
accepted date: 2017-02-13
in scheme: emissions_variables_MMR

2.F.4 [Aerosols][no classification][Emissions][Unspecified mix of HFCs][t CO2 equivalent][no source][no method][no target][no option][no type]
type: Concept
definition: 2.F.4 [Aerosols][no classification][Emissions][Unspecified mix of HFCs][t CO2 equivalent][no source][no method][no target][no option][no type]
status: valid
status modified: 2017-02-13
accepted date: 2017-02-13
in scheme: emissions_variables_MMR

2.F.4 [Aerosols][no classification][Emissions][Unspecified mix of PFCs][t CO2 equivalent][no source][no method][no target][no option][no type]
type: Concept
definition: 2.F.4 [Aerosols][no classification][Emissions][Unspecified mix of PFCs][t CO2 equivalent][no source][no method][no target][no option][no type]
status: valid
status modified: 2017-02-13
accepted date: 2017-02-13
in scheme: emissions_variables_MMR

2.F.4.a [Metered Dose Inhalers][no classification][Emissions][Aggregate F-gases][t CO2 equivalent][no source][no method][no target][no option][no type]
type: Concept
definition: 2.F.4.a [Metered Dose Inhalers][no classification][Emissions][Aggregate F-gases][t CO2 equivalent][no source][no method][no target][no option][no type]
status: valid
status modified: 2017-02-13
accepted date: 2017-02-13
in scheme: emissions_variables_MMR

2.F.4.a [Metered Dose Inhalers][no classification][Emissions][C10F18][t][From manufacturing][no method][no target][no option][no type]
type: Concept
definition: 2.F.4.a [Metered Dose Inhalers][no classification][Emissions][C10F18][t][From manufacturing][no method][no target][no option][no type]
status: valid
status modified: 2017-02-13
accepted date: 2017-02-13
in scheme: emissions_variables_MMR

2.F.4.a [Metered Dose Inhalers][no classification][Emissions][C10F18][t][From stocks][no method][no target][no option][no type]
type: Concept
definition: 2.F.4.a [Metered Dose Inhalers][no classification][Emissions][C10F18][t][From stocks][no method][no target][no option][no type]
status: valid
status modified: 2017-02-13
accepted date: 2017-02-13
in scheme: emissions_variables_MMR

2.F.4.a [Metered Dose Inhalers][no classification][Emissions][C10F18][t][no source][no method][no target][no option][no type]
type: Concept
definition: 2.F.4.a [Metered Dose Inhalers][no classification][Emissions][C10F18][t][no source][no method][no target][no option][no type]
status: valid
status modified: 2017-02-13
accepted date: 2017-02-13
in scheme: emissions_variables_MMR

2.F.4.a [Metered Dose Inhalers][no classification][Emissions][C2F6][t][From manufacturing][no method][no target][no option][no type]
type: Concept
definition: 2.F.4.a [Metered Dose Inhalers][no classification][Emissions][C2F6][t][From manufacturing][no method][no target][no option][no type]
status: valid
status modified: 2017-02-13
accepted date: 2017-02-13
in scheme: emissions_variables_MMR

2.F.4.a [Metered Dose Inhalers][no classification][Emissions][C2F6][t][From stocks][no method][no target][no option][no type]
type: Concept
definition: 2.F.4.a [Metered Dose Inhalers][no classification][Emissions][C2F6][t][From stocks][no method][no target][no option][no type]
status: valid
status modified: 2017-02-13
accepted date: 2017-02-13
in scheme: emissions_variables_MMR

2.F.4.a [Metered Dose Inhalers][no classification][Emissions][C2F6][t][no source][no method][no target][no option][no type]
type: Concept
definition: 2.F.4.a [Metered Dose Inhalers][no classification][Emissions][C2F6][t][no source][no method][no target][no option][no type]
status: valid
status modified: 2017-02-13
accepted date: 2017-02-13
in scheme: emissions_variables_MMR

2.F.4.a [Metered Dose Inhalers][no classification][Emissions][C3F8][t][From manufacturing][no method][no target][no option][no type]
type: Concept
definition: 2.F.4.a [Metered Dose Inhalers][no classification][Emissions][C3F8][t][From manufacturing][no method][no target][no option][no type]
status: valid
status modified: 2017-02-13
accepted date: 2017-02-13
in scheme: emissions_variables_MMR

2.F.4.a [Metered Dose Inhalers][no classification][Emissions][C3F8][t][From stocks][no method][no target][no option][no type]
type: Concept
definition: 2.F.4.a [Metered Dose Inhalers][no classification][Emissions][C3F8][t][From stocks][no method][no target][no option][no type]
status: valid
status modified: 2017-02-13
accepted date: 2017-02-13
in scheme: emissions_variables_MMR

2.F.4.a [Metered Dose Inhalers][no classification][Emissions][C3F8][t][no source][no method][no target][no option][no type]
type: Concept
definition: 2.F.4.a [Metered Dose Inhalers][no classification][Emissions][C3F8][t][no source][no method][no target][no option][no type]
status: valid
status modified: 2017-02-13
accepted date: 2017-02-13
in scheme: emissions_variables_MMR

2.F.4.a [Metered Dose Inhalers][no classification][Emissions][C4F10][t][From manufacturing][no method][no target][no option][no type]
type: Concept
definition: 2.F.4.a [Metered Dose Inhalers][no classification][Emissions][C4F10][t][From manufacturing][no method][no target][no option][no type]
status: valid
status modified: 2017-02-13
accepted date: 2017-02-13
in scheme: emissions_variables_MMR

2.F.4.a [Metered Dose Inhalers][no classification][Emissions][C4F10][t][From stocks][no method][no target][no option][no type]
type: Concept
definition: 2.F.4.a [Metered Dose Inhalers][no classification][Emissions][C4F10][t][From stocks][no method][no target][no option][no type]
status: valid
status modified: 2017-02-13
accepted date: 2017-02-13
in scheme: emissions_variables_MMR

2.F.4.a [Metered Dose Inhalers][no classification][Emissions][C4F10][t][no source][no method][no target][no option][no type]
type: Concept
definition: 2.F.4.a [Metered Dose Inhalers][no classification][Emissions][C4F10][t][no source][no method][no target][no option][no type]
status: valid
status modified: 2017-02-13
accepted date: 2017-02-13
in scheme: emissions_variables_MMR

2.F.4.a [Metered Dose Inhalers][no classification][Emissions][C5F12][t][From manufacturing][no method][no target][no option][no type]
type: Concept
definition: 2.F.4.a [Metered Dose Inhalers][no classification][Emissions][C5F12][t][From manufacturing][no method][no target][no option][no type]
status: valid
status modified: 2017-02-13
accepted date: 2017-02-13
in scheme: emissions_variables_MMR

2.F.4.a [Metered Dose Inhalers][no classification][Emissions][C5F12][t][From stocks][no method][no target][no option][no type]
type: Concept
definition: 2.F.4.a [Metered Dose Inhalers][no classification][Emissions][C5F12][t][From stocks][no method][no target][no option][no type]
status: valid
status modified: 2017-02-13
accepted date: 2017-02-13
in scheme: emissions_variables_MMR

2.F.4.a [Metered Dose Inhalers][no classification][Emissions][C5F12][t][no source][no method][no target][no option][no type]
type: Concept
definition: 2.F.4.a [Metered Dose Inhalers][no classification][Emissions][C5F12][t][no source][no method][no target][no option][no type]
status: valid
status modified: 2017-02-13
accepted date: 2017-02-13
in scheme: emissions_variables_MMR

2.F.4.a [Metered Dose Inhalers][no classification][Emissions][C6F14][t][From manufacturing][no method][no target][no option][no type]
type: Concept
definition: 2.F.4.a [Metered Dose Inhalers][no classification][Emissions][C6F14][t][From manufacturing][no method][no target][no option][no type]
status: valid
status modified: 2017-02-13
accepted date: 2017-02-13
in scheme: emissions_variables_MMR

2.F.4.a [Metered Dose Inhalers][no classification][Emissions][C6F14][t][From stocks][no method][no target][no option][no type]
type: Concept
definition: 2.F.4.a [Metered Dose Inhalers][no classification][Emissions][C6F14][t][From stocks][no method][no target][no option][no type]
status: valid
status modified: 2017-02-13
accepted date: 2017-02-13
in scheme: emissions_variables_MMR

2.F.4.a [Metered Dose Inhalers][no classification][Emissions][C6F14][t][no source][no method][no target][no option][no type]
type: Concept
definition: 2.F.4.a [Metered Dose Inhalers][no classification][Emissions][C6F14][t][no source][no method][no target][no option][no type]
status: valid
status modified: 2017-02-13
accepted date: 2017-02-13
in scheme: emissions_variables_MMR

2.F.4.a [Metered Dose Inhalers][no classification][Emissions][c-C3F6][t][From manufacturing][no method][no target][no option][no type]
type: Concept
definition: 2.F.4.a [Metered Dose Inhalers][no classification][Emissions][c-C3F6][t][From manufacturing][no method][no target][no option][no type]
status: valid
status modified: 2017-02-13
accepted date: 2017-02-13
in scheme: emissions_variables_MMR

2.F.4.a [Metered Dose Inhalers][no classification][Emissions][c-C3F6][t][From stocks][no method][no target][no option][no type]
type: Concept
definition: 2.F.4.a [Metered Dose Inhalers][no classification][Emissions][c-C3F6][t][From stocks][no method][no target][no option][no type]
status: valid
status modified: 2017-02-13
accepted date: 2017-02-13
in scheme: emissions_variables_MMR

2.F.4.a [Metered Dose Inhalers][no classification][Emissions][c-C3F6][t][no source][no method][no target][no option][no type]
type: Concept
definition: 2.F.4.a [Metered Dose Inhalers][no classification][Emissions][c-C3F6][t][no source][no method][no target][no option][no type]
status: valid
status modified: 2017-02-13
accepted date: 2017-02-13
in scheme: emissions_variables_MMR

2.F.4.a [Metered Dose Inhalers][no classification][Emissions][c-C4F8][t][From manufacturing][no method][no target][no option][no type]
type: Concept
definition: 2.F.4.a [Metered Dose Inhalers][no classification][Emissions][c-C4F8][t][From manufacturing][no method][no target][no option][no type]
status: valid
status modified: 2017-02-13
accepted date: 2017-02-13
in scheme: emissions_variables_MMR

2.F.4.a [Metered Dose Inhalers][no classification][Emissions][c-C4F8][t][From stocks][no method][no target][no option][no type]
type: Concept
definition: 2.F.4.a [Metered Dose Inhalers][no classification][Emissions][c-C4F8][t][From stocks][no method][no target][no option][no type]
status: valid
status modified: 2017-02-13
accepted date: 2017-02-13
in scheme: emissions_variables_MMR

2.F.4.a [Metered Dose Inhalers][no classification][Emissions][c-C4F8][t][no source][no method][no target][no option][no type]
type: Concept
definition: 2.F.4.a [Metered Dose Inhalers][no classification][Emissions][c-C4F8][t][no source][no method][no target][no option][no type]
status: valid
status modified: 2017-02-13
accepted date: 2017-02-13
in scheme: emissions_variables_MMR

2.F.4.a [Metered Dose Inhalers][no classification][Emissions][CF4][t][From manufacturing][no method][no target][no option][no type]
type: Concept
definition: 2.F.4.a [Metered Dose Inhalers][no classification][Emissions][CF4][t][From manufacturing][no method][no target][no option][no type]
status: valid
status modified: 2017-02-13
accepted date: 2017-02-13
in scheme: emissions_variables_MMR

2.F.4.a [Metered Dose Inhalers][no classification][Emissions][CF4][t][From stocks][no method][no target][no option][no type]
type: Concept
definition: 2.F.4.a [Metered Dose Inhalers][no classification][Emissions][CF4][t][From stocks][no method][no target][no option][no type]
status: valid
status modified: 2017-02-13
accepted date: 2017-02-13
in scheme: emissions_variables_MMR

2.F.4.a [Metered Dose Inhalers][no classification][Emissions][CF4][t][no source][no method][no target][no option][no type]
type: Concept
definition: 2.F.4.a [Metered Dose Inhalers][no classification][Emissions][CF4][t][no source][no method][no target][no option][no type]
status: valid
status modified: 2017-02-13
accepted date: 2017-02-13
in scheme: emissions_variables_MMR

2.F.4.a [Metered Dose Inhalers][no classification][Emissions][HFC-125][t][From manufacturing][no method][no target][no option][no type]
type: Concept
definition: 2.F.4.a [Metered Dose Inhalers][no classification][Emissions][HFC-125][t][From manufacturing][no method][no target][no option][no type]
status: valid
status modified: 2017-02-13
accepted date: 2017-02-13
in scheme: emissions_variables_MMR

2.F.4.a [Metered Dose Inhalers][no classification][Emissions][HFC-125][t][From stocks][no method][no target][no option][no type]
type: Concept
definition: 2.F.4.a [Metered Dose Inhalers][no classification][Emissions][HFC-125][t][From stocks][no method][no target][no option][no type]
status: valid
status modified: 2017-02-13
accepted date: 2017-02-13
in scheme: emissions_variables_MMR

2.F.4.a [Metered Dose Inhalers][no classification][Emissions][HFC-125][t][no source][no method][no target][no option][no type]
type: Concept
definition: 2.F.4.a [Metered Dose Inhalers][no classification][Emissions][HFC-125][t][no source][no method][no target][no option][no type]
status: valid
status modified: 2017-02-13
accepted date: 2017-02-13
in scheme: emissions_variables_MMR

2.F.4.a [Metered Dose Inhalers][no classification][Emissions][HFC-134][t][From manufacturing][no method][no target][no option][no type]
type: Concept
definition: 2.F.4.a [Metered Dose Inhalers][no classification][Emissions][HFC-134][t][From manufacturing][no method][no target][no option][no type]
status: valid
status modified: 2017-02-13
accepted date: 2017-02-13
in scheme: emissions_variables_MMR

2.F.4.a [Metered Dose Inhalers][no classification][Emissions][HFC-134][t][From stocks][no method][no target][no option][no type]
type: Concept
definition: 2.F.4.a [Metered Dose Inhalers][no classification][Emissions][HFC-134][t][From stocks][no method][no target][no option][no type]
status: valid
status modified: 2017-02-13
accepted date: 2017-02-13
in scheme: emissions_variables_MMR

2.F.4.a [Metered Dose Inhalers][no classification][Emissions][HFC-134][t][no source][no method][no target][no option][no type]
type: Concept
definition: 2.F.4.a [Metered Dose Inhalers][no classification][Emissions][HFC-134][t][no source][no method][no target][no option][no type]
status: valid
status modified: 2017-02-13
accepted date: 2017-02-13
in scheme: emissions_variables_MMR

2.F.4.a [Metered Dose Inhalers][no classification][Emissions][HFC-134a][t][From manufacturing][no method][no target][no option][no type]
type: Concept
definition: 2.F.4.a [Metered Dose Inhalers][no classification][Emissions][HFC-134a][t][From manufacturing][no method][no target][no option][no type]
status: valid
status modified: 2017-02-13
accepted date: 2017-02-13
in scheme: emissions_variables_MMR

2.F.4.a [Metered Dose Inhalers][no classification][Emissions][HFC-134a][t][From stocks][no method][no target][no option][no type]
type: Concept
definition: 2.F.4.a [Metered Dose Inhalers][no classification][Emissions][HFC-134a][t][From stocks][no method][no target][no option][no type]
status: valid
status modified: 2017-02-13
accepted date: 2017-02-13
in scheme: emissions_variables_MMR

2.F.4.a [Metered Dose Inhalers][no classification][Emissions][HFC-134a][t][no source][no method][no target][no option][no type]
type: Concept
definition: 2.F.4.a [Metered Dose Inhalers][no classification][Emissions][HFC-134a][t][no source][no method][no target][no option][no type]
status: valid
status modified: 2017-02-13
accepted date: 2017-02-13
in scheme: emissions_variables_MMR

2.F.4.a [Metered Dose Inhalers][no classification][Emissions][HFC-143][t][From manufacturing][no method][no target][no option][no type]
type: Concept
definition: 2.F.4.a [Metered Dose Inhalers][no classification][Emissions][HFC-143][t][From manufacturing][no method][no target][no option][no type]
status: valid
status modified: 2017-02-13
accepted date: 2017-02-13
in scheme: emissions_variables_MMR

2.F.4.a [Metered Dose Inhalers][no classification][Emissions][HFC-143][t][From stocks][no method][no target][no option][no type]
type: Concept
definition: 2.F.4.a [Metered Dose Inhalers][no classification][Emissions][HFC-143][t][From stocks][no method][no target][no option][no type]
status: valid
status modified: 2017-02-13
accepted date: 2017-02-13
in scheme: emissions_variables_MMR

2.F.4.a [Metered Dose Inhalers][no classification][Emissions][HFC-143][t][no source][no method][no target][no option][no type]
type: Concept
definition: 2.F.4.a [Metered Dose Inhalers][no classification][Emissions][HFC-143][t][no source][no method][no target][no option][no type]
status: valid
status modified: 2017-02-13
accepted date: 2017-02-13
in scheme: emissions_variables_MMR

2.F.4.a [Metered Dose Inhalers][no classification][Emissions][HFC-143a][t][From manufacturing][no method][no target][no option][no type]
type: Concept
definition: 2.F.4.a [Metered Dose Inhalers][no classification][Emissions][HFC-143a][t][From manufacturing][no method][no target][no option][no type]
status: valid
status modified: 2017-02-13
accepted date: 2017-02-13
in scheme: emissions_variables_MMR

2.F.4.a [Metered Dose Inhalers][no classification][Emissions][HFC-143a][t][From stocks][no method][no target][no option][no type]
type: Concept
definition: 2.F.4.a [Metered Dose Inhalers][no classification][Emissions][HFC-143a][t][From stocks][no method][no target][no option][no type]
status: valid
status modified: 2017-02-13
accepted date: 2017-02-13
in scheme: emissions_variables_MMR

2.F.4.a [Metered Dose Inhalers][no classification][Emissions][HFC-143a][t][no source][no method][no target][no option][no type]
type: Concept
definition: 2.F.4.a [Metered Dose Inhalers][no classification][Emissions][HFC-143a][t][no source][no method][no target][no option][no type]
status: valid
status modified: 2017-02-13
accepted date: 2017-02-13
in scheme: emissions_variables_MMR

2.F.4.a [Metered Dose Inhalers][no classification][Emissions][HFC-152][t][From manufacturing][no method][no target][no option][no type]
type: Concept
definition: 2.F.4.a [Metered Dose Inhalers][no classification][Emissions][HFC-152][t][From manufacturing][no method][no target][no option][no type]
status: valid
status modified: 2017-02-13
accepted date: 2017-02-13
in scheme: emissions_variables_MMR

2.F.4.a [Metered Dose Inhalers][no classification][Emissions][HFC-152][t][From stocks][no method][no target][no option][no type]
type: Concept
definition: 2.F.4.a [Metered Dose Inhalers][no classification][Emissions][HFC-152][t][From stocks][no method][no target][no option][no type]
status: valid
status modified: 2017-02-13
accepted date: 2017-02-13
in scheme: emissions_variables_MMR

2.F.4.a [Metered Dose Inhalers][no classification][Emissions][HFC-152][t][no source][no method][no target][no option][no type]
type: Concept
definition: 2.F.4.a [Metered Dose Inhalers][no classification][Emissions][HFC-152][t][no source][no method][no target][no option][no type]
status: valid
status modified: 2017-02-13
accepted date: 2017-02-13
in scheme: emissions_variables_MMR

2.F.4.a [Metered Dose Inhalers][no classification][Emissions][HFC-152a][t][From manufacturing][no method][no target][no option][no type]
type: Concept
definition: 2.F.4.a [Metered Dose Inhalers][no classification][Emissions][HFC-152a][t][From manufacturing][no method][no target][no option][no type]
status: valid
status modified: 2017-02-13
accepted date: 2017-02-13
in scheme: emissions_variables_MMR

2.F.4.a [Metered Dose Inhalers][no classification][Emissions][HFC-152a][t][From stocks][no method][no target][no option][no type]
type: Concept
definition: 2.F.4.a [Metered Dose Inhalers][no classification][Emissions][HFC-152a][t][From stocks][no method][no target][no option][no type]
status: valid
status modified: 2017-02-13
accepted date: 2017-02-13
in scheme: emissions_variables_MMR

2.F.4.a [Metered Dose Inhalers][no classification][Emissions][HFC-152a][t][no source][no method][no target][no option][no type]
type: Concept
definition: 2.F.4.a [Metered Dose Inhalers][no classification][Emissions][HFC-152a][t][no source][no method][no target][no option][no type]
status: valid
status modified: 2017-02-13
accepted date: 2017-02-13
in scheme: emissions_variables_MMR

2.F.4.a [Metered Dose Inhalers][no classification][Emissions][HFC-161][t][From manufacturing][no method][no target][no option][no type]
type: Concept
definition: 2.F.4.a [Metered Dose Inhalers][no classification][Emissions][HFC-161][t][From manufacturing][no method][no target][no option][no type]
status: valid
status modified: 2017-02-13
accepted date: 2017-02-13
in scheme: emissions_variables_MMR

2.F.4.a [Metered Dose Inhalers][no classification][Emissions][HFC-161][t][From stocks][no method][no target][no option][no type]
type: Concept
definition: 2.F.4.a [Metered Dose Inhalers][no classification][Emissions][HFC-161][t][From stocks][no method][no target][no option][no type]
status: valid
status modified: 2017-02-13
accepted date: 2017-02-13
in scheme: emissions_variables_MMR

2.F.4.a [Metered Dose Inhalers][no classification][Emissions][HFC-161][t][no source][no method][no target][no option][no type]
type: Concept
definition: 2.F.4.a [Metered Dose Inhalers][no classification][Emissions][HFC-161][t][no source][no method][no target][no option][no type]
status: valid
status modified: 2017-02-13
accepted date: 2017-02-13
in scheme: emissions_variables_MMR

2.F.4.a [Metered Dose Inhalers][no classification][Emissions][HFC-227ea][t][From manufacturing][no method][no target][no option][no type]
type: Concept
definition: 2.F.4.a [Metered Dose Inhalers][no classification][Emissions][HFC-227ea][t][From manufacturing][no method][no target][no option][no type]
status: valid
status modified: 2017-02-13
accepted date: 2017-02-13
in scheme: emissions_variables_MMR

2.F.4.a [Metered Dose Inhalers][no classification][Emissions][HFC-227ea][t][From stocks][no method][no target][no option][no type]
type: Concept
definition: 2.F.4.a [Metered Dose Inhalers][no classification][Emissions][HFC-227ea][t][From stocks][no method][no target][no option][no type]
status: valid
status modified: 2017-02-13
accepted date: 2017-02-13
in scheme: emissions_variables_MMR

2.F.4.a [Metered Dose Inhalers][no classification][Emissions][HFC-227ea][t][no source][no method][no target][no option][no type]
type: Concept
definition: 2.F.4.a [Metered Dose Inhalers][no classification][Emissions][HFC-227ea][t][no source][no method][no target][no option][no type]
status: valid
status modified: 2017-02-13
accepted date: 2017-02-13
in scheme: emissions_variables_MMR

2.F.4.a [Metered Dose Inhalers][no classification][Emissions][HFC-23][t][From manufacturing][no method][no target][no option][no type]
type: Concept
definition: 2.F.4.a [Metered Dose Inhalers][no classification][Emissions][HFC-23][t][From manufacturing][no method][no target][no option][no type]
status: valid
status modified: 2017-02-13
accepted date: 2017-02-13
in scheme: emissions_variables_MMR

2.F.4.a [Metered Dose Inhalers][no classification][Emissions][HFC-23][t][From stocks][no method][no target][no option][no type]
type: Concept
definition: 2.F.4.a [Metered Dose Inhalers][no classification][Emissions][HFC-23][t][From stocks][no method][no target][no option][no type]
status: valid
status modified: 2017-02-13
accepted date: 2017-02-13
in scheme: emissions_variables_MMR

2.F.4.a [Metered Dose Inhalers][no classification][Emissions][HFC-23][t][no source][no method][no target][no option][no type]
type: Concept
definition: 2.F.4.a [Metered Dose Inhalers][no classification][Emissions][HFC-23][t][no source][no method][no target][no option][no type]
status: valid
status modified: 2017-02-13
accepted date: 2017-02-13
in scheme: emissions_variables_MMR

2.F.4.a [Metered Dose Inhalers][no classification][Emissions][HFC-236cb][t][From manufacturing][no method][no target][no option][no type]
type: Concept
definition: 2.F.4.a [Metered Dose Inhalers][no classification][Emissions][HFC-236cb][t][From manufacturing][no method][no target][no option][no type]
status: valid
status modified: 2017-02-13
accepted date: 2017-02-13
in scheme: emissions_variables_MMR

2.F.4.a [Metered Dose Inhalers][no classification][Emissions][HFC-236cb][t][From stocks][no method][no target][no option][no type]
type: Concept
definition: 2.F.4.a [Metered Dose Inhalers][no classification][Emissions][HFC-236cb][t][From stocks][no method][no target][no option][no type]
status: valid
status modified: 2017-02-13
accepted date: 2017-02-13
in scheme: emissions_variables_MMR

2.F.4.a [Metered Dose Inhalers][no classification][Emissions][HFC-236cb][t][no source][no method][no target][no option][no type]
type: Concept
definition: 2.F.4.a [Metered Dose Inhalers][no classification][Emissions][HFC-236cb][t][no source][no method][no target][no option][no type]
status: valid
status modified: 2017-02-13
accepted date: 2017-02-13
in scheme: emissions_variables_MMR

2.F.4.a [Metered Dose Inhalers][no classification][Emissions][HFC-236ea][t][From manufacturing][no method][no target][no option][no type]
type: Concept
definition: 2.F.4.a [Metered Dose Inhalers][no classification][Emissions][HFC-236ea][t][From manufacturing][no method][no target][no option][no type]
status: valid
status modified: 2017-02-13
accepted date: 2017-02-13
in scheme: emissions_variables_MMR

2.F.4.a [Metered Dose Inhalers][no classification][Emissions][HFC-236ea][t][From stocks][no method][no target][no option][no type]
type: Concept
definition: 2.F.4.a [Metered Dose Inhalers][no classification][Emissions][HFC-236ea][t][From stocks][no method][no target][no option][no type]
status: valid
status modified: 2017-02-13
accepted date: 2017-02-13
in scheme: emissions_variables_MMR

2.F.4.a [Metered Dose Inhalers][no classification][Emissions][HFC-236ea][t][no source][no method][no target][no option][no type]
type: Concept
definition: 2.F.4.a [Metered Dose Inhalers][no classification][Emissions][HFC-236ea][t][no source][no method][no target][no option][no type]
status: valid
status modified: 2017-02-13
accepted date: 2017-02-13
in scheme: emissions_variables_MMR

2.F.4.a [Metered Dose Inhalers][no classification][Emissions][HFC-236fa][t][From manufacturing][no method][no target][no option][no type]
type: Concept
definition: 2.F.4.a [Metered Dose Inhalers][no classification][Emissions][HFC-236fa][t][From manufacturing][no method][no target][no option][no type]
status: valid
status modified: 2017-02-13
accepted date: 2017-02-13
in scheme: emissions_variables_MMR

2.F.4.a [Metered Dose Inhalers][no classification][Emissions][HFC-236fa][t][From stocks][no method][no target][no option][no type]
type: Concept
definition: 2.F.4.a [Metered Dose Inhalers][no classification][Emissions][HFC-236fa][t][From stocks][no method][no target][no option][no type]
status: valid
status modified: 2017-02-13
accepted date: 2017-02-13
in scheme: emissions_variables_MMR

2.F.4.a [Metered Dose Inhalers][no classification][Emissions][HFC-236fa][t][no source][no method][no target][no option][no type]
type: Concept
definition: 2.F.4.a [Metered Dose Inhalers][no classification][Emissions][HFC-236fa][t][no source][no method][no target][no option][no type]
status: valid
status modified: 2017-02-13
accepted date: 2017-02-13
in scheme: emissions_variables_MMR

2.F.4.a [Metered Dose Inhalers][no classification][Emissions][HFC-245ca][t][From manufacturing][no method][no target][no option][no type]
type: Concept
definition: 2.F.4.a [Metered Dose Inhalers][no classification][Emissions][HFC-245ca][t][From manufacturing][no method][no target][no option][no type]
status: valid
status modified: 2017-02-13
accepted date: 2017-02-13
in scheme: emissions_variables_MMR

2.F.4.a [Metered Dose Inhalers][no classification][Emissions][HFC-245ca][t][From stocks][no method][no target][no option][no type]
type: Concept
definition: 2.F.4.a [Metered Dose Inhalers][no classification][Emissions][HFC-245ca][t][From stocks][no method][no target][no option][no type]
status: valid
status modified: 2017-02-13
accepted date: 2017-02-13
in scheme: emissions_variables_MMR

2.F.4.a [Metered Dose Inhalers][no classification][Emissions][HFC-245ca][t][no source][no method][no target][no option][no type]
type: Concept
definition: 2.F.4.a [Metered Dose Inhalers][no classification][Emissions][HFC-245ca][t][no source][no method][no target][no option][no type]
status: valid
status modified: 2017-02-13
accepted date: 2017-02-13
in scheme: emissions_variables_MMR

2.F.4.a [Metered Dose Inhalers][no classification][Emissions][HFC-245fa][t][From manufacturing][no method][no target][no option][no type]
type: Concept
definition: 2.F.4.a [Metered Dose Inhalers][no classification][Emissions][HFC-245fa][t][From manufacturing][no method][no target][no option][no type]
status: valid
status modified: 2017-02-13
accepted date: 2017-02-13
in scheme: emissions_variables_MMR

2.F.4.a [Metered Dose Inhalers][no classification][Emissions][HFC-245fa][t][From stocks][no method][no target][no option][no type]
type: Concept
definition: 2.F.4.a [Metered Dose Inhalers][no classification][Emissions][HFC-245fa][t][From stocks][no method][no target][no option][no type]
status: valid
status modified: 2017-02-13
accepted date: 2017-02-13
in scheme: emissions_variables_MMR

2.F.4.a [Metered Dose Inhalers][no classification][Emissions][HFC-245fa][t][no source][no method][no target][no option][no type]
type: Concept
definition: 2.F.4.a [Metered Dose Inhalers][no classification][Emissions][HFC-245fa][t][no source][no method][no target][no option][no type]
status: valid
status modified: 2017-02-13
accepted date: 2017-02-13
in scheme: emissions_variables_MMR

2.F.4.a [Metered Dose Inhalers][no classification][Emissions][HFC-32][t][From manufacturing][no method][no target][no option][no type]
type: Concept
definition: 2.F.4.a [Metered Dose Inhalers][no classification][Emissions][HFC-32][t][From manufacturing][no method][no target][no option][no type]
status: valid
status modified: 2017-02-13
accepted date: 2017-02-13
in scheme: emissions_variables_MMR

2.F.4.a [Metered Dose Inhalers][no classification][Emissions][HFC-32][t][From stocks][no method][no target][no option][no type]
type: Concept
definition: 2.F.4.a [Metered Dose Inhalers][no classification][Emissions][HFC-32][t][From stocks][no method][no target][no option][no type]
status: valid
status modified: 2017-02-13
accepted date: 2017-02-13
in scheme: emissions_variables_MMR

2.F.4.a [Metered Dose Inhalers][no classification][Emissions][HFC-32][t][no source][no method][no target][no option][no type]
type: Concept
definition: 2.F.4.a [Metered Dose Inhalers][no classification][Emissions][HFC-32][t][no source][no method][no target][no option][no type]
status: valid
status modified: 2017-02-13
accepted date: 2017-02-13
in scheme: emissions_variables_MMR

2.F.4.a [Metered Dose Inhalers][no classification][Emissions][HFC-365mfc][t][From manufacturing][no method][no target][no option][no type]
type: Concept
definition: 2.F.4.a [Metered Dose Inhalers][no classification][Emissions][HFC-365mfc][t][From manufacturing][no method][no target][no option][no type]
status: valid
status modified: 2017-02-13
accepted date: 2017-02-13
in scheme: emissions_variables_MMR

2.F.4.a [Metered Dose Inhalers][no classification][Emissions][HFC-365mfc][t][From stocks][no method][no target][no option][no type]
type: Concept
definition: 2.F.4.a [Metered Dose Inhalers][no classification][Emissions][HFC-365mfc][t][From stocks][no method][no target][no option][no type]
status: valid
status modified: 2017-02-13
accepted date: 2017-02-13
in scheme: emissions_variables_MMR

2.F.4.a [Metered Dose Inhalers][no classification][Emissions][HFC-365mfc][t][no source][no method][no target][no option][no type]
type: Concept
definition: 2.F.4.a [Metered Dose Inhalers][no classification][Emissions][HFC-365mfc][t][no source][no method][no target][no option][no type]
status: valid
status modified: 2017-02-13
accepted date: 2017-02-13
in scheme: emissions_variables_MMR

2.F.4.a [Metered Dose Inhalers][no classification][Emissions][HFC-41][t][From manufacturing][no method][no target][no option][no type]
type: Concept
definition: 2.F.4.a [Metered Dose Inhalers][no classification][Emissions][HFC-41][t][From manufacturing][no method][no target][no option][no type]
status: valid
status modified: 2017-02-13
accepted date: 2017-02-13
in scheme: emissions_variables_MMR

2.F.4.a [Metered Dose Inhalers][no classification][Emissions][HFC-41][t][From stocks][no method][no target][no option][no type]
type: Concept
definition: 2.F.4.a [Metered Dose Inhalers][no classification][Emissions][HFC-41][t][From stocks][no method][no target][no option][no type]
status: valid
status modified: 2017-02-13
accepted date: 2017-02-13
in scheme: emissions_variables_MMR

2.F.4.a [Metered Dose Inhalers][no classification][Emissions][HFC-41][t][no source][no method][no target][no option][no type]
type: Concept
definition: 2.F.4.a [Metered Dose Inhalers][no classification][Emissions][HFC-41][t][no source][no method][no target][no option][no type]
status: valid
status modified: 2017-02-13
accepted date: 2017-02-13
in scheme: emissions_variables_MMR

2.F.4.a [Metered Dose Inhalers][no classification][Emissions][HFC-43-10mee][t][From manufacturing][no method][no target][no option][no type]
type: Concept
definition: 2.F.4.a [Metered Dose Inhalers][no classification][Emissions][HFC-43-10mee][t][From manufacturing][no method][no target][no option][no type]
status: valid
status modified: 2017-02-13
accepted date: 2017-02-13
in scheme: emissions_variables_MMR

2.F.4.a [Metered Dose Inhalers][no classification][Emissions][HFC-43-10mee][t][From stocks][no method][no target][no option][no type]
type: Concept
definition: 2.F.4.a [Metered Dose Inhalers][no classification][Emissions][HFC-43-10mee][t][From stocks][no method][no target][no option][no type]
status: valid
status modified: 2017-02-13
accepted date: 2017-02-13
in scheme: emissions_variables_MMR

2.F.4.a [Metered Dose Inhalers][no classification][Emissions][HFC-43-10mee][t][no source][no method][no target][no option][no type]
type: Concept
definition: 2.F.4.a [Metered Dose Inhalers][no classification][Emissions][HFC-43-10mee][t][no source][no method][no target][no option][no type]
status: valid
status modified: 2017-02-13
accepted date: 2017-02-13
in scheme: emissions_variables_MMR

2.F.4.a [Metered Dose Inhalers][no classification][Emissions][HFCs][t CO2 equivalent][no source][no method][no target][no option][no type]
type: Concept
definition: 2.F.4.a [Metered Dose Inhalers][no classification][Emissions][HFCs][t CO2 equivalent][no source][no method][no target][no option][no type]
status: valid
status modified: 2017-02-13
accepted date: 2017-02-13
in scheme: emissions_variables_MMR

2.F.4.a [Metered Dose Inhalers][no classification][Emissions][NF3][t][From manufacturing][no method][no target][no option][no type]
type: Concept
definition: 2.F.4.a [Metered Dose Inhalers][no classification][Emissions][NF3][t][From manufacturing][no method][no target][no option][no type]
status: valid
status modified: 2017-02-13
accepted date: 2017-02-13
in scheme: emissions_variables_MMR

2.F.4.a [Metered Dose Inhalers][no classification][Emissions][NF3][t][From stocks][no method][no target][no option][no type]
type: Concept
definition: 2.F.4.a [Metered Dose Inhalers][no classification][Emissions][NF3][t][From stocks][no method][no target][no option][no type]
status: valid
status modified: 2017-02-13
accepted date: 2017-02-13
in scheme: emissions_variables_MMR

2.F.4.a [Metered Dose Inhalers][no classification][Emissions][NF3][t][no source][no method][no target][no option][no type]
type: Concept
definition: 2.F.4.a [Metered Dose Inhalers][no classification][Emissions][NF3][t][no source][no method][no target][no option][no type]
status: valid
status modified: 2017-02-13
accepted date: 2017-02-13
in scheme: emissions_variables_MMR

2.F.4.a [Metered Dose Inhalers][no classification][Emissions][no gas][kt CO2 equivalent][no source][no method][no target][no option][no type]
type: Concept
definition: 2.F.4.a [Metered Dose Inhalers][no classification][Emissions][no gas][kt CO2 equivalent][no source][no method][no target][no option][no type]
status: valid
status modified: 2017-02-13
accepted date: 2017-02-13
in scheme: emissions_variables_MMR

2.F.4.a [Metered Dose Inhalers][no classification][Emissions][PFCs][t CO2 equivalent][no source][no method][no target][no option][no type]
type: Concept
definition: 2.F.4.a [Metered Dose Inhalers][no classification][Emissions][PFCs][t CO2 equivalent][no source][no method][no target][no option][no type]
status: valid
status modified: 2017-02-13
accepted date: 2017-02-13
in scheme: emissions_variables_MMR

2.F.4.a [Metered Dose Inhalers][no classification][Emissions][SF6][t][From manufacturing][no method][no target][no option][no type]
type: Concept
definition: 2.F.4.a [Metered Dose Inhalers][no classification][Emissions][SF6][t][From manufacturing][no method][no target][no option][no type]
status: valid
status modified: 2017-02-13
accepted date: 2017-02-13
in scheme: emissions_variables_MMR

2.F.4.a [Metered Dose Inhalers][no classification][Emissions][SF6][t][From stocks][no method][no target][no option][no type]
type: Concept
definition: 2.F.4.a [Metered Dose Inhalers][no classification][Emissions][SF6][t][From stocks][no method][no target][no option][no type]
status: valid
status modified: 2017-02-13
accepted date: 2017-02-13
in scheme: emissions_variables_MMR

2.F.4.a [Metered Dose Inhalers][no classification][Emissions][SF6][t][no source][no method][no target][no option][no type]
type: Concept
definition: 2.F.4.a [Metered Dose Inhalers][no classification][Emissions][SF6][t][no source][no method][no target][no option][no type]
status: valid
status modified: 2017-02-13
accepted date: 2017-02-13
in scheme: emissions_variables_MMR

2.F.4.a [Metered Dose Inhalers][no classification][Emissions][Unspecified mix of HFCs and PFCs][t CO2 equivalent][From manufacturing][no method][no target][no option][no type]
type: Concept
definition: 2.F.4.a [Metered Dose Inhalers][no classification][Emissions][Unspecified mix of HFCs and PFCs][t CO2 equivalent][From manufacturing][no method][no target][no option][no type]
status: valid
status modified: 2017-02-13
accepted date: 2017-02-13
in scheme: emissions_variables_MMR

2.F.4.a [Metered Dose Inhalers][no classification][Emissions][Unspecified mix of HFCs and PFCs][t CO2 equivalent][From stocks][no method][no target][no option][no type]
type: Concept
definition: 2.F.4.a [Metered Dose Inhalers][no classification][Emissions][Unspecified mix of HFCs and PFCs][t CO2 equivalent][From stocks][no method][no target][no option][no type]
status: valid
status modified: 2017-02-13
accepted date: 2017-02-13
in scheme: emissions_variables_MMR

2.F.4.a [Metered Dose Inhalers][no classification][Emissions][Unspecified mix of HFCs and PFCs][t CO2 equivalent][no source][no method][no target][no option][no type]
type: Concept
definition: 2.F.4.a [Metered Dose Inhalers][no classification][Emissions][Unspecified mix of HFCs and PFCs][t CO2 equivalent][no source][no method][no target][no option][no type]
status: valid
status modified: 2017-02-13
accepted date: 2017-02-13
in scheme: emissions_variables_MMR

2.F.4.a [Metered Dose Inhalers][no classification][Emissions][Unspecified mix of HFCs][t CO2 equivalent][From manufacturing][no method][no target][no option][no type]
type: Concept
definition: 2.F.4.a [Metered Dose Inhalers][no classification][Emissions][Unspecified mix of HFCs][t CO2 equivalent][From manufacturing][no method][no target][no option][no type]
status: valid
status modified: 2017-02-13
accepted date: 2017-02-13
in scheme: emissions_variables_MMR

2.F.4.a [Metered Dose Inhalers][no classification][Emissions][Unspecified mix of HFCs][t CO2 equivalent][From stocks][no method][no target][no option][no type]
type: Concept
definition: 2.F.4.a [Metered Dose Inhalers][no classification][Emissions][Unspecified mix of HFCs][t CO2 equivalent][From stocks][no method][no target][no option][no type]
status: valid
status modified: 2017-02-13
accepted date: 2017-02-13
in scheme: emissions_variables_MMR

2.F.4.a [Metered Dose Inhalers][no classification][Emissions][Unspecified mix of HFCs][t CO2 equivalent][no source][no method][no target][no option][no type]
type: Concept
definition: 2.F.4.a [Metered Dose Inhalers][no classification][Emissions][Unspecified mix of HFCs][t CO2 equivalent][no source][no method][no target][no option][no type]
status: valid
status modified: 2017-02-13
accepted date: 2017-02-13
in scheme: emissions_variables_MMR

2.F.4.a [Metered Dose Inhalers][no classification][Emissions][Unspecified mix of PFCs][t CO2 equivalent][From manufacturing][no method][no target][no option][no type]
type: Concept
definition: 2.F.4.a [Metered Dose Inhalers][no classification][Emissions][Unspecified mix of PFCs][t CO2 equivalent][From manufacturing][no method][no target][no option][no type]
status: valid
status modified: 2017-02-13
accepted date: 2017-02-13
in scheme: emissions_variables_MMR

2.F.4.a [Metered Dose Inhalers][no classification][Emissions][Unspecified mix of PFCs][t CO2 equivalent][From stocks][no method][no target][no option][no type]
type: Concept
definition: 2.F.4.a [Metered Dose Inhalers][no classification][Emissions][Unspecified mix of PFCs][t CO2 equivalent][From stocks][no method][no target][no option][no type]
status: valid
status modified: 2017-02-13
accepted date: 2017-02-13
in scheme: emissions_variables_MMR

2.F.4.a [Metered Dose Inhalers][no classification][Emissions][Unspecified mix of PFCs][t CO2 equivalent][no source][no method][no target][no option][no type]
type: Concept
definition: 2.F.4.a [Metered Dose Inhalers][no classification][Emissions][Unspecified mix of PFCs][t CO2 equivalent][no source][no method][no target][no option][no type]
status: valid
status modified: 2017-02-13
accepted date: 2017-02-13
in scheme: emissions_variables_MMR

2.F.4.b [Other aerosols][no classification][Emissions][Aggregate F-gases][t CO2 equivalent][no source][no method][no target][no option][no type]
type: Concept
definition: 2.F.4.b [Other aerosols][no classification][Emissions][Aggregate F-gases][t CO2 equivalent][no source][no method][no target][no option][no type]
status: valid
status modified: 2017-02-13
accepted date: 2017-02-13
in scheme: emissions_variables_MMR

2.F.4.b [Other aerosols][no classification][Emissions][C10F18][t][no source][no method][no target][no option][no type]
type: Concept
definition: 2.F.4.b [Other aerosols][no classification][Emissions][C10F18][t][no source][no method][no target][no option][no type]
status: valid
status modified: 2017-02-13
accepted date: 2017-02-13
in scheme: emissions_variables_MMR

2.F.4.b [Other aerosols][no classification][Emissions][C2F6][t][no source][no method][no target][no option][no type]
type: Concept
definition: 2.F.4.b [Other aerosols][no classification][Emissions][C2F6][t][no source][no method][no target][no option][no type]
status: valid
status modified: 2017-02-13
accepted date: 2017-02-13
in scheme: emissions_variables_MMR

2.F.4.b [Other aerosols][no classification][Emissions][C3F8][t][no source][no method][no target][no option][no type]
type: Concept
definition: 2.F.4.b [Other aerosols][no classification][Emissions][C3F8][t][no source][no method][no target][no option][no type]
status: valid
status modified: 2017-02-13
accepted date: 2017-02-13
in scheme: emissions_variables_MMR

2.F.4.b [Other aerosols][no classification][Emissions][C4F10][t][no source][no method][no target][no option][no type]
type: Concept
definition: 2.F.4.b [Other aerosols][no classification][Emissions][C4F10][t][no source][no method][no target][no option][no type]
status: valid
status modified: 2017-02-13
accepted date: 2017-02-13
in scheme: emissions_variables_MMR

2.F.4.b [Other aerosols][no classification][Emissions][C5F12][t][no source][no method][no target][no option][no type]
type: Concept
definition: 2.F.4.b [Other aerosols][no classification][Emissions][C5F12][t][no source][no method][no target][no option][no type]
status: valid
status modified: 2017-02-13
accepted date: 2017-02-13
in scheme: emissions_variables_MMR

2.F.4.b [Other aerosols][no classification][Emissions][C6F14][t][no source][no method][no target][no option][no type]
type: Concept
definition: 2.F.4.b [Other aerosols][no classification][Emissions][C6F14][t][no source][no method][no target][no option][no type]
status: valid
status modified: 2017-02-13
accepted date: 2017-02-13
in scheme: emissions_variables_MMR

2.F.4.b [Other aerosols][no classification][Emissions][c-C3F6][t][no source][no method][no target][no option][no type]
type: Concept
definition: 2.F.4.b [Other aerosols][no classification][Emissions][c-C3F6][t][no source][no method][no target][no option][no type]
status: valid
status modified: 2017-02-13
accepted date: 2017-02-13
in scheme: emissions_variables_MMR

2.F.4.b [Other aerosols][no classification][Emissions][c-C4F8][t][no source][no method][no target][no option][no type]
type: Concept
definition: 2.F.4.b [Other aerosols][no classification][Emissions][c-C4F8][t][no source][no method][no target][no option][no type]
status: valid
status modified: 2017-02-13
accepted date: 2017-02-13
in scheme: emissions_variables_MMR

2.F.4.b [Other aerosols][no classification][Emissions][CF4][t][no source][no method][no target][no option][no type]
type: Concept
definition: 2.F.4.b [Other aerosols][no classification][Emissions][CF4][t][no source][no method][no target][no option][no type]
status: valid
status modified: 2017-02-13
accepted date: 2017-02-13
in scheme: emissions_variables_MMR

2.F.4.b [Other aerosols][no classification][Emissions][HFC-125][t][no source][no method][no target][no option][no type]
type: Concept
definition: 2.F.4.b [Other aerosols][no classification][Emissions][HFC-125][t][no source][no method][no target][no option][no type]
status: valid
status modified: 2017-02-13
accepted date: 2017-02-13
in scheme: emissions_variables_MMR

2.F.4.b [Other aerosols][no classification][Emissions][HFC-134][t][no source][no method][no target][no option][no type]
type: Concept
definition: 2.F.4.b [Other aerosols][no classification][Emissions][HFC-134][t][no source][no method][no target][no option][no type]
status: valid
status modified: 2017-02-13
accepted date: 2017-02-13
in scheme: emissions_variables_MMR

2.F.4.b [Other aerosols][no classification][Emissions][HFC-134a][t][no source][no method][no target][no option][no type]
type: Concept
definition: 2.F.4.b [Other aerosols][no classification][Emissions][HFC-134a][t][no source][no method][no target][no option][no type]
status: valid
status modified: 2017-02-13
accepted date: 2017-02-13
in scheme: emissions_variables_MMR

2.F.4.b [Other aerosols][no classification][Emissions][HFC-143][t][no source][no method][no target][no option][no type]
type: Concept
definition: 2.F.4.b [Other aerosols][no classification][Emissions][HFC-143][t][no source][no method][no target][no option][no type]
status: valid
status modified: 2017-02-13
accepted date: 2017-02-13
in scheme: emissions_variables_MMR

2.F.4.b [Other aerosols][no classification][Emissions][HFC-143a][t][no source][no method][no target][no option][no type]
type: Concept
definition: 2.F.4.b [Other aerosols][no classification][Emissions][HFC-143a][t][no source][no method][no target][no option][no type]
status: valid
status modified: 2017-02-13
accepted date: 2017-02-13
in scheme: emissions_variables_MMR

2.F.4.b [Other aerosols][no classification][Emissions][HFC-152][t][no source][no method][no target][no option][no type]
type: Concept
definition: 2.F.4.b [Other aerosols][no classification][Emissions][HFC-152][t][no source][no method][no target][no option][no type]
status: valid
status modified: 2017-02-13
accepted date: 2017-02-13
in scheme: emissions_variables_MMR

2.F.4.b [Other aerosols][no classification][Emissions][HFC-152a][t][no source][no method][no target][no option][no type]
type: Concept
definition: 2.F.4.b [Other aerosols][no classification][Emissions][HFC-152a][t][no source][no method][no target][no option][no type]
status: valid
status modified: 2017-02-13
accepted date: 2017-02-13
in scheme: emissions_variables_MMR

2.F.4.b [Other aerosols][no classification][Emissions][HFC-161][t][no source][no method][no target][no option][no type]
type: Concept
definition: 2.F.4.b [Other aerosols][no classification][Emissions][HFC-161][t][no source][no method][no target][no option][no type]
status: valid
status modified: 2017-02-13
accepted date: 2017-02-13
in scheme: emissions_variables_MMR

2.F.4.b [Other aerosols][no classification][Emissions][HFC-227ea][t][no source][no method][no target][no option][no type]
type: Concept
definition: 2.F.4.b [Other aerosols][no classification][Emissions][HFC-227ea][t][no source][no method][no target][no option][no type]
status: valid
status modified: 2017-02-13
accepted date: 2017-02-13
in scheme: emissions_variables_MMR

2.F.4.b [Other aerosols][no classification][Emissions][HFC-23][t][no source][no method][no target][no option][no type]
type: Concept
definition: 2.F.4.b [Other aerosols][no classification][Emissions][HFC-23][t][no source][no method][no target][no option][no type]
status: valid
status modified: 2017-02-13
accepted date: 2017-02-13
in scheme: emissions_variables_MMR

2.F.4.b [Other aerosols][no classification][Emissions][HFC-236cb][t][no source][no method][no target][no option][no type]
type: Concept
definition: 2.F.4.b [Other aerosols][no classification][Emissions][HFC-236cb][t][no source][no method][no target][no option][no type]
status: valid
status modified: 2017-02-13
accepted date: 2017-02-13
in scheme: emissions_variables_MMR

2.F.4.b [Other aerosols][no classification][Emissions][HFC-236ea][t][no source][no method][no target][no option][no type]
type: Concept
definition: 2.F.4.b [Other aerosols][no classification][Emissions][HFC-236ea][t][no source][no method][no target][no option][no type]
status: valid
status modified: 2017-02-13
accepted date: 2017-02-13
in scheme: emissions_variables_MMR

2.F.4.b [Other aerosols][no classification][Emissions][HFC-236fa][t][no source][no method][no target][no option][no type]
type: Concept
definition: 2.F.4.b [Other aerosols][no classification][Emissions][HFC-236fa][t][no source][no method][no target][no option][no type]
status: valid
status modified: 2017-02-13
accepted date: 2017-02-13
in scheme: emissions_variables_MMR

2.F.4.b [Other aerosols][no classification][Emissions][HFC-245ca][t][no source][no method][no target][no option][no type]
type: Concept
definition: 2.F.4.b [Other aerosols][no classification][Emissions][HFC-245ca][t][no source][no method][no target][no option][no type]
status: valid
status modified: 2017-02-13
accepted date: 2017-02-13
in scheme: emissions_variables_MMR

2.F.4.b [Other aerosols][no classification][Emissions][HFC-245fa][t][no source][no method][no target][no option][no type]
type: Concept
definition: 2.F.4.b [Other aerosols][no classification][Emissions][HFC-245fa][t][no source][no method][no target][no option][no type]
status: valid
status modified: 2017-02-13
accepted date: 2017-02-13
in scheme: emissions_variables_MMR

2.F.4.b [Other aerosols][no classification][Emissions][HFC-32][t][no source][no method][no target][no option][no type]
type: Concept
definition: 2.F.4.b [Other aerosols][no classification][Emissions][HFC-32][t][no source][no method][no target][no option][no type]
status: valid
status modified: 2017-02-13
accepted date: 2017-02-13
in scheme: emissions_variables_MMR

2.F.4.b [Other aerosols][no classification][Emissions][HFC-365mfc][t][no source][no method][no target][no option][no type]
type: Concept
definition: 2.F.4.b [Other aerosols][no classification][Emissions][HFC-365mfc][t][no source][no method][no target][no option][no type]
status: valid
status modified: 2017-02-13
accepted date: 2017-02-13
in scheme: emissions_variables_MMR

2.F.4.b [Other aerosols][no classification][Emissions][HFC-41][t][no source][no method][no target][no option][no type]
type: Concept
definition: 2.F.4.b [Other aerosols][no classification][Emissions][HFC-41][t][no source][no method][no target][no option][no type]
status: valid
status modified: 2017-02-13
accepted date: 2017-02-13
in scheme: emissions_variables_MMR

2.F.4.b [Other aerosols][no classification][Emissions][HFC-43-10mee][t][no source][no method][no target][no option][no type]
type: Concept
definition: 2.F.4.b [Other aerosols][no classification][Emissions][HFC-43-10mee][t][no source][no method][no target][no option][no type]
status: valid
status modified: 2017-02-13
accepted date: 2017-02-13
in scheme: emissions_variables_MMR

2.F.4.b [Other aerosols][no classification][Emissions][HFCs and PFCs][t CO2 equivalent][no source][no method][no target][no option][no type]
type: Concept
definition: 2.F.4.b [Other aerosols][no classification][Emissions][HFCs and PFCs][t CO2 equivalent][no source][no method][no target][no option][no type]
status: valid
status modified: 2017-02-13
accepted date: 2017-02-13
in scheme: emissions_variables_MMR

2.F.4.b [Other aerosols][no classification][Emissions][HFCs][t CO2 equivalent][no source][no method][no target][no option][no type]
type: Concept
definition: 2.F.4.b [Other aerosols][no classification][Emissions][HFCs][t CO2 equivalent][no source][no method][no target][no option][no type]
status: valid
status modified: 2017-02-13
accepted date: 2017-02-13
in scheme: emissions_variables_MMR

2.F.4.b [Other aerosols][no classification][Emissions][NF3][t][no source][no method][no target][no option][no type]
type: Concept
definition: 2.F.4.b [Other aerosols][no classification][Emissions][NF3][t][no source][no method][no target][no option][no type]
status: valid
status modified: 2017-02-13
accepted date: 2017-02-13
in scheme: emissions_variables_MMR

2.F.4.b [Other aerosols][no classification][Emissions][PFCs][t CO2 equivalent][no source][no method][no target][no option][no type]
type: Concept
definition: 2.F.4.b [Other aerosols][no classification][Emissions][PFCs][t CO2 equivalent][no source][no method][no target][no option][no type]
status: valid
status modified: 2017-02-13
accepted date: 2017-02-13
in scheme: emissions_variables_MMR

2.F.4.b [Other aerosols][no classification][Emissions][SF6][t][no source][no method][no target][no option][no type]
type: Concept
definition: 2.F.4.b [Other aerosols][no classification][Emissions][SF6][t][no source][no method][no target][no option][no type]
status: valid
status modified: 2017-02-13
accepted date: 2017-02-13
in scheme: emissions_variables_MMR

2.F.4.b [Other aerosols][no classification][Emissions][Unspecified mix of HFCs and PFCs][t CO2 equivalent][no source][no method][no target][no option][no type]
type: Concept
definition: 2.F.4.b [Other aerosols][no classification][Emissions][Unspecified mix of HFCs and PFCs][t CO2 equivalent][no source][no method][no target][no option][no type]
status: valid
status modified: 2017-02-13
accepted date: 2017-02-13
in scheme: emissions_variables_MMR

2.F.4.b [Other aerosols][no classification][Emissions][Unspecified mix of HFCs][t CO2 equivalent][no source][no method][no target][no option][no type]
type: Concept
definition: 2.F.4.b [Other aerosols][no classification][Emissions][Unspecified mix of HFCs][t CO2 equivalent][no source][no method][no target][no option][no type]
status: valid
status modified: 2017-02-13
accepted date: 2017-02-13
in scheme: emissions_variables_MMR

2.F.4.b [Other aerosols][no classification][Emissions][Unspecified mix of PFCs][t CO2 equivalent][no source][no method][no target][no option][no type]
type: Concept
definition: 2.F.4.b [Other aerosols][no classification][Emissions][Unspecified mix of PFCs][t CO2 equivalent][no source][no method][no target][no option][no type]
status: valid
status modified: 2017-02-13
accepted date: 2017-02-13
in scheme: emissions_variables_MMR

2.F.5 [Solvents][no classification][Emissions][Aggregate F-gases][t CO2 equivalent][no source][no method][no target][no option][no type]
type: Concept
definition: 2.F.5 [Solvents][no classification][Emissions][Aggregate F-gases][t CO2 equivalent][no source][no method][no target][no option][no type]
status: valid
status modified: 2017-02-13
accepted date: 2017-02-13
in scheme: emissions_variables_MMR

2.F.5 [Solvents][no classification][Emissions][C10F18][t][From disposal][no method][no target][no option][no type]
type: Concept
definition: 2.F.5 [Solvents][no classification][Emissions][C10F18][t][From disposal][no method][no target][no option][no type]
status: valid
status modified: 2017-02-13
accepted date: 2017-02-13
in scheme: emissions_variables_MMR

2.F.5 [Solvents][no classification][Emissions][C10F18][t][From manufacturing][no method][no target][no option][no type]
type: Concept
definition: 2.F.5 [Solvents][no classification][Emissions][C10F18][t][From manufacturing][no method][no target][no option][no type]
status: valid
status modified: 2017-02-13
accepted date: 2017-02-13
in scheme: emissions_variables_MMR

2.F.5 [Solvents][no classification][Emissions][C10F18][t][From stocks][no method][no target][no option][no type]
type: Concept
definition: 2.F.5 [Solvents][no classification][Emissions][C10F18][t][From stocks][no method][no target][no option][no type]
status: valid
status modified: 2017-02-13
accepted date: 2017-02-13
in scheme: emissions_variables_MMR

2.F.5 [Solvents][no classification][Emissions][C10F18][t][no source][no method][no target][no option][no type]
type: Concept
definition: 2.F.5 [Solvents][no classification][Emissions][C10F18][t][no source][no method][no target][no option][no type]
status: valid
status modified: 2017-02-13
accepted date: 2017-02-13
in scheme: emissions_variables_MMR

2.F.5 [Solvents][no classification][Emissions][C2F6][t][From disposal][no method][no target][no option][no type]
type: Concept
definition: 2.F.5 [Solvents][no classification][Emissions][C2F6][t][From disposal][no method][no target][no option][no type]
status: valid
status modified: 2017-02-13
accepted date: 2017-02-13
in scheme: emissions_variables_MMR

2.F.5 [Solvents][no classification][Emissions][C2F6][t][From manufacturing][no method][no target][no option][no type]
type: Concept
definition: 2.F.5 [Solvents][no classification][Emissions][C2F6][t][From manufacturing][no method][no target][no option][no type]
status: valid
status modified: 2017-02-13
accepted date: 2017-02-13
in scheme: emissions_variables_MMR

2.F.5 [Solvents][no classification][Emissions][C2F6][t][From stocks][no method][no target][no option][no type]
type: Concept
definition: 2.F.5 [Solvents][no classification][Emissions][C2F6][t][From stocks][no method][no target][no option][no type]
status: valid
status modified: 2017-02-13
accepted date: 2017-02-13
in scheme: emissions_variables_MMR

2.F.5 [Solvents][no classification][Emissions][C2F6][t][no source][no method][no target][no option][no type]
type: Concept
definition: 2.F.5 [Solvents][no classification][Emissions][C2F6][t][no source][no method][no target][no option][no type]
status: valid
status modified: 2017-02-13
accepted date: 2017-02-13
in scheme: emissions_variables_MMR

2.F.5 [Solvents][no classification][Emissions][C3F8][t][From disposal][no method][no target][no option][no type]
type: Concept
definition: 2.F.5 [Solvents][no classification][Emissions][C3F8][t][From disposal][no method][no target][no option][no type]
status: valid
status modified: 2017-02-13
accepted date: 2017-02-13
in scheme: emissions_variables_MMR

2.F.5 [Solvents][no classification][Emissions][C3F8][t][From manufacturing][no method][no target][no option][no type]
type: Concept
definition: 2.F.5 [Solvents][no classification][Emissions][C3F8][t][From manufacturing][no method][no target][no option][no type]
status: valid
status modified: 2017-02-13
accepted date: 2017-02-13
in scheme: emissions_variables_MMR

2.F.5 [Solvents][no classification][Emissions][C3F8][t][From stocks][no method][no target][no option][no type]
type: Concept
definition: 2.F.5 [Solvents][no classification][Emissions][C3F8][t][From stocks][no method][no target][no option][no type]
status: valid
status modified: 2017-02-13
accepted date: 2017-02-13
in scheme: emissions_variables_MMR

2.F.5 [Solvents][no classification][Emissions][C3F8][t][no source][no method][no target][no option][no type]
type: Concept
definition: 2.F.5 [Solvents][no classification][Emissions][C3F8][t][no source][no method][no target][no option][no type]
status: valid
status modified: 2017-02-13
accepted date: 2017-02-13
in scheme: emissions_variables_MMR

2.F.5 [Solvents][no classification][Emissions][C4F10][t][From disposal][no method][no target][no option][no type]
type: Concept
definition: 2.F.5 [Solvents][no classification][Emissions][C4F10][t][From disposal][no method][no target][no option][no type]
status: valid
status modified: 2017-02-13
accepted date: 2017-02-13
in scheme: emissions_variables_MMR

2.F.5 [Solvents][no classification][Emissions][C4F10][t][From manufacturing][no method][no target][no option][no type]
type: Concept
definition: 2.F.5 [Solvents][no classification][Emissions][C4F10][t][From manufacturing][no method][no target][no option][no type]
status: valid
status modified: 2017-02-13
accepted date: 2017-02-13
in scheme: emissions_variables_MMR

2.F.5 [Solvents][no classification][Emissions][C4F10][t][From stocks][no method][no target][no option][no type]
type: Concept
definition: 2.F.5 [Solvents][no classification][Emissions][C4F10][t][From stocks][no method][no target][no option][no type]
status: valid
status modified: 2017-02-13
accepted date: 2017-02-13
in scheme: emissions_variables_MMR

2.F.5 [Solvents][no classification][Emissions][C4F10][t][no source][no method][no target][no option][no type]
type: Concept
definition: 2.F.5 [Solvents][no classification][Emissions][C4F10][t][no source][no method][no target][no option][no type]
status: valid
status modified: 2017-02-13
accepted date: 2017-02-13
in scheme: emissions_variables_MMR

2.F.5 [Solvents][no classification][Emissions][C5F12][t][From disposal][no method][no target][no option][no type]
type: Concept
definition: 2.F.5 [Solvents][no classification][Emissions][C5F12][t][From disposal][no method][no target][no option][no type]
status: valid
status modified: 2017-02-13
accepted date: 2017-02-13
in scheme: emissions_variables_MMR

2.F.5 [Solvents][no classification][Emissions][C5F12][t][From manufacturing][no method][no target][no option][no type]
type: Concept
definition: 2.F.5 [Solvents][no classification][Emissions][C5F12][t][From manufacturing][no method][no target][no option][no type]
status: valid
status modified: 2017-02-13
accepted date: 2017-02-13
in scheme: emissions_variables_MMR

2.F.5 [Solvents][no classification][Emissions][C5F12][t][From stocks][no method][no target][no option][no type]
type: Concept
definition: 2.F.5 [Solvents][no classification][Emissions][C5F12][t][From stocks][no method][no target][no option][no type]
status: valid
status modified: 2017-02-13
accepted date: 2017-02-13
in scheme: emissions_variables_MMR

2.F.5 [Solvents][no classification][Emissions][C5F12][t][no source][no method][no target][no option][no type]
type: Concept
definition: 2.F.5 [Solvents][no classification][Emissions][C5F12][t][no source][no method][no target][no option][no type]
status: valid
status modified: 2017-02-13
accepted date: 2017-02-13
in scheme: emissions_variables_MMR

2.F.5 [Solvents][no classification][Emissions][C6F14][t][From disposal][no method][no target][no option][no type]
type: Concept
definition: 2.F.5 [Solvents][no classification][Emissions][C6F14][t][From disposal][no method][no target][no option][no type]
status: valid
status modified: 2017-02-13
accepted date: 2017-02-13
in scheme: emissions_variables_MMR

2.F.5 [Solvents][no classification][Emissions][C6F14][t][From manufacturing][no method][no target][no option][no type]
type: Concept
definition: 2.F.5 [Solvents][no classification][Emissions][C6F14][t][From manufacturing][no method][no target][no option][no type]
status: valid
status modified: 2017-02-13
accepted date: 2017-02-13
in scheme: emissions_variables_MMR

2.F.5 [Solvents][no classification][Emissions][C6F14][t][From stocks][no method][no target][no option][no type]
type: Concept
definition: 2.F.5 [Solvents][no classification][Emissions][C6F14][t][From stocks][no method][no target][no option][no type]
status: valid
status modified: 2017-02-13
accepted date: 2017-02-13
in scheme: emissions_variables_MMR

2.F.5 [Solvents][no classification][Emissions][C6F14][t][no source][no method][no target][no option][no type]
type: Concept
definition: 2.F.5 [Solvents][no classification][Emissions][C6F14][t][no source][no method][no target][no option][no type]
status: valid
status modified: 2017-02-13
accepted date: 2017-02-13
in scheme: emissions_variables_MMR

2.F.5 [Solvents][no classification][Emissions][c-C3F6][t][From disposal][no method][no target][no option][no type]
type: Concept
definition: 2.F.5 [Solvents][no classification][Emissions][c-C3F6][t][From disposal][no method][no target][no option][no type]
status: valid
status modified: 2017-02-13
accepted date: 2017-02-13
in scheme: emissions_variables_MMR

2.F.5 [Solvents][no classification][Emissions][c-C3F6][t][From manufacturing][no method][no target][no option][no type]
type: Concept
definition: 2.F.5 [Solvents][no classification][Emissions][c-C3F6][t][From manufacturing][no method][no target][no option][no type]
status: valid
status modified: 2017-02-13
accepted date: 2017-02-13
in scheme: emissions_variables_MMR

2.F.5 [Solvents][no classification][Emissions][c-C3F6][t][From stocks][no method][no target][no option][no type]
type: Concept
definition: 2.F.5 [Solvents][no classification][Emissions][c-C3F6][t][From stocks][no method][no target][no option][no type]
status: valid
status modified: 2017-02-13
accepted date: 2017-02-13
in scheme: emissions_variables_MMR

2.F.5 [Solvents][no classification][Emissions][c-C3F6][t][no source][no method][no target][no option][no type]
type: Concept
definition: 2.F.5 [Solvents][no classification][Emissions][c-C3F6][t][no source][no method][no target][no option][no type]
status: valid
status modified: 2017-02-13
accepted date: 2017-02-13
in scheme: emissions_variables_MMR

2.F.5 [Solvents][no classification][Emissions][c-C4F8][t][From disposal][no method][no target][no option][no type]
type: Concept
definition: 2.F.5 [Solvents][no classification][Emissions][c-C4F8][t][From disposal][no method][no target][no option][no type]
status: valid
status modified: 2017-02-13
accepted date: 2017-02-13
in scheme: emissions_variables_MMR

2.F.5 [Solvents][no classification][Emissions][c-C4F8][t][From manufacturing][no method][no target][no option][no type]
type: Concept
definition: 2.F.5 [Solvents][no classification][Emissions][c-C4F8][t][From manufacturing][no method][no target][no option][no type]
status: valid
status modified: 2017-02-13
accepted date: 2017-02-13
in scheme: emissions_variables_MMR

2.F.5 [Solvents][no classification][Emissions][c-C4F8][t][From stocks][no method][no target][no option][no type]
type: Concept
definition: 2.F.5 [Solvents][no classification][Emissions][c-C4F8][t][From stocks][no method][no target][no option][no type]
status: valid
status modified: 2017-02-13
accepted date: 2017-02-13
in scheme: emissions_variables_MMR

2.F.5 [Solvents][no classification][Emissions][c-C4F8][t][no source][no method][no target][no option][no type]
type: Concept
definition: 2.F.5 [Solvents][no classification][Emissions][c-C4F8][t][no source][no method][no target][no option][no type]
status: valid
status modified: 2017-02-13
accepted date: 2017-02-13
in scheme: emissions_variables_MMR

2.F.5 [Solvents][no classification][Emissions][CF4][t][From disposal][no method][no target][no option][no type]
type: Concept
definition: 2.F.5 [Solvents][no classification][Emissions][CF4][t][From disposal][no method][no target][no option][no type]
status: valid
status modified: 2017-02-13
accepted date: 2017-02-13
in scheme: emissions_variables_MMR

2.F.5 [Solvents][no classification][Emissions][CF4][t][From manufacturing][no method][no target][no option][no type]
type: Concept
definition: 2.F.5 [Solvents][no classification][Emissions][CF4][t][From manufacturing][no method][no target][no option][no type]
status: valid
status modified: 2017-02-13
accepted date: 2017-02-13
in scheme: emissions_variables_MMR

2.F.5 [Solvents][no classification][Emissions][CF4][t][From stocks][no method][no target][no option][no type]
type: Concept
definition: 2.F.5 [Solvents][no classification][Emissions][CF4][t][From stocks][no method][no target][no option][no type]
status: valid
status modified: 2017-02-13
accepted date: 2017-02-13
in scheme: emissions_variables_MMR

2.F.5 [Solvents][no classification][Emissions][CF4][t][no source][no method][no target][no option][no type]
type: Concept
definition: 2.F.5 [Solvents][no classification][Emissions][CF4][t][no source][no method][no target][no option][no type]
status: valid
status modified: 2017-02-13
accepted date: 2017-02-13
in scheme: emissions_variables_MMR

2.F.5 [Solvents][no classification][Emissions][HFC-125][t][From disposal][no method][no target][no option][no type]
type: Concept
definition: 2.F.5 [Solvents][no classification][Emissions][HFC-125][t][From disposal][no method][no target][no option][no type]
status: valid
status modified: 2017-02-13
accepted date: 2017-02-13
in scheme: emissions_variables_MMR

2.F.5 [Solvents][no classification][Emissions][HFC-125][t][From manufacturing][no method][no target][no option][no type]
type: Concept
definition: 2.F.5 [Solvents][no classification][Emissions][HFC-125][t][From manufacturing][no method][no target][no option][no type]
status: valid
status modified: 2017-02-13
accepted date: 2017-02-13
in scheme: emissions_variables_MMR

2.F.5 [Solvents][no classification][Emissions][HFC-125][t][From stocks][no method][no target][no option][no type]
type: Concept
definition: 2.F.5 [Solvents][no classification][Emissions][HFC-125][t][From stocks][no method][no target][no option][no type]
status: valid
status modified: 2017-02-13
accepted date: 2017-02-13
in scheme: emissions_variables_MMR

2.F.5 [Solvents][no classification][Emissions][HFC-125][t][no source][no method][no target][no option][no type]
type: Concept
definition: 2.F.5 [Solvents][no classification][Emissions][HFC-125][t][no source][no method][no target][no option][no type]
status: valid
status modified: 2017-02-13
accepted date: 2017-02-13
in scheme: emissions_variables_MMR

2.F.5 [Solvents][no classification][Emissions][HFC-134][t][From disposal][no method][no target][no option][no type]
type: Concept
definition: 2.F.5 [Solvents][no classification][Emissions][HFC-134][t][From disposal][no method][no target][no option][no type]
status: valid
status modified: 2017-02-13
accepted date: 2017-02-13
in scheme: emissions_variables_MMR

2.F.5 [Solvents][no classification][Emissions][HFC-134][t][From manufacturing][no method][no target][no option][no type]
type: Concept
definition: 2.F.5 [Solvents][no classification][Emissions][HFC-134][t][From manufacturing][no method][no target][no option][no type]
status: valid
status modified: 2017-02-13
accepted date: 2017-02-13
in scheme: emissions_variables_MMR

2.F.5 [Solvents][no classification][Emissions][HFC-134][t][From stocks][no method][no target][no option][no type]
type: Concept
definition: 2.F.5 [Solvents][no classification][Emissions][HFC-134][t][From stocks][no method][no target][no option][no type]
status: valid
status modified: 2017-02-13
accepted date: 2017-02-13
in scheme: emissions_variables_MMR

2.F.5 [Solvents][no classification][Emissions][HFC-134][t][no source][no method][no target][no option][no type]
type: Concept
definition: 2.F.5 [Solvents][no classification][Emissions][HFC-134][t][no source][no method][no target][no option][no type]
status: valid
status modified: 2017-02-13
accepted date: 2017-02-13
in scheme: emissions_variables_MMR

2.F.5 [Solvents][no classification][Emissions][HFC-134a][t][From disposal][no method][no target][no option][no type]
type: Concept
definition: 2.F.5 [Solvents][no classification][Emissions][HFC-134a][t][From disposal][no method][no target][no option][no type]
status: valid
status modified: 2017-02-13
accepted date: 2017-02-13
in scheme: emissions_variables_MMR

2.F.5 [Solvents][no classification][Emissions][HFC-134a][t][From manufacturing][no method][no target][no option][no type]
type: Concept
definition: 2.F.5 [Solvents][no classification][Emissions][HFC-134a][t][From manufacturing][no method][no target][no option][no type]
status: valid
status modified: 2017-02-13
accepted date: 2017-02-13
in scheme: emissions_variables_MMR

2.F.5 [Solvents][no classification][Emissions][HFC-134a][t][From stocks][no method][no target][no option][no type]
type: Concept
definition: 2.F.5 [Solvents][no classification][Emissions][HFC-134a][t][From stocks][no method][no target][no option][no type]
status: valid
status modified: 2017-02-13
accepted date: 2017-02-13
in scheme: emissions_variables_MMR

2.F.5 [Solvents][no classification][Emissions][HFC-134a][t][no source][no method][no target][no option][no type]
type: Concept
definition: 2.F.5 [Solvents][no classification][Emissions][HFC-134a][t][no source][no method][no target][no option][no type]
status: valid
status modified: 2017-02-13
accepted date: 2017-02-13
in scheme: emissions_variables_MMR

2.F.5 [Solvents][no classification][Emissions][HFC-143][t][From disposal][no method][no target][no option][no type]
type: Concept
definition: 2.F.5 [Solvents][no classification][Emissions][HFC-143][t][From disposal][no method][no target][no option][no type]
status: valid
status modified: 2017-02-13
accepted date: 2017-02-13
in scheme: emissions_variables_MMR

2.F.5 [Solvents][no classification][Emissions][HFC-143][t][From manufacturing][no method][no target][no option][no type]
type: Concept
definition: 2.F.5 [Solvents][no classification][Emissions][HFC-143][t][From manufacturing][no method][no target][no option][no type]
status: valid
status modified: 2017-02-13
accepted date: 2017-02-13
in scheme: emissions_variables_MMR

2.F.5 [Solvents][no classification][Emissions][HFC-143][t][From stocks][no method][no target][no option][no type]
type: Concept
definition: 2.F.5 [Solvents][no classification][Emissions][HFC-143][t][From stocks][no method][no target][no option][no type]
status: valid
status modified: 2017-02-13
accepted date: 2017-02-13
in scheme: emissions_variables_MMR

2.F.5 [Solvents][no classification][Emissions][HFC-143][t][no source][no method][no target][no option][no type]
type: Concept
definition: 2.F.5 [Solvents][no classification][Emissions][HFC-143][t][no source][no method][no target][no option][no type]
status: valid
status modified: 2017-02-13
accepted date: 2017-02-13
in scheme: emissions_variables_MMR

2.F.5 [Solvents][no classification][Emissions][HFC-143a][t][From disposal][no method][no target][no option][no type]
type: Concept
definition: 2.F.5 [Solvents][no classification][Emissions][HFC-143a][t][From disposal][no method][no target][no option][no type]
status: valid
status modified: 2017-02-13
accepted date: 2017-02-13
in scheme: emissions_variables_MMR

2.F.5 [Solvents][no classification][Emissions][HFC-143a][t][From manufacturing][no method][no target][no option][no type]
type: Concept
definition: 2.F.5 [Solvents][no classification][Emissions][HFC-143a][t][From manufacturing][no method][no target][no option][no type]
status: valid
status modified: 2017-02-13
accepted date: 2017-02-13
in scheme: emissions_variables_MMR

2.F.5 [Solvents][no classification][Emissions][HFC-143a][t][From stocks][no method][no target][no option][no type]
type: Concept
definition: 2.F.5 [Solvents][no classification][Emissions][HFC-143a][t][From stocks][no method][no target][no option][no type]
status: valid
status modified: 2017-02-13
accepted date: 2017-02-13
in scheme: emissions_variables_MMR

2.F.5 [Solvents][no classification][Emissions][HFC-143a][t][no source][no method][no target][no option][no type]
type: Concept
definition: 2.F.5 [Solvents][no classification][Emissions][HFC-143a][t][no source][no method][no target][no option][no type]
status: valid
status modified: 2017-02-13
accepted date: 2017-02-13
in scheme: emissions_variables_MMR

2.F.5 [Solvents][no classification][Emissions][HFC-152][t][From disposal][no method][no target][no option][no type]
type: Concept
definition: 2.F.5 [Solvents][no classification][Emissions][HFC-152][t][From disposal][no method][no target][no option][no type]
status: valid
status modified: 2017-02-13
accepted date: 2017-02-13
in scheme: emissions_variables_MMR

2.F.5 [Solvents][no classification][Emissions][HFC-152][t][From manufacturing][no method][no target][no option][no type]
type: Concept
definition: 2.F.5 [Solvents][no classification][Emissions][HFC-152][t][From manufacturing][no method][no target][no option][no type]
status: valid
status modified: 2017-02-13
accepted date: 2017-02-13
in scheme: emissions_variables_MMR

2.F.5 [Solvents][no classification][Emissions][HFC-152][t][From stocks][no method][no target][no option][no type]
type: Concept
definition: 2.F.5 [Solvents][no classification][Emissions][HFC-152][t][From stocks][no method][no target][no option][no type]
status: valid
status modified: 2017-02-13
accepted date: 2017-02-13
in scheme: emissions_variables_MMR

2.F.5 [Solvents][no classification][Emissions][HFC-152][t][no source][no method][no target][no option][no type]
type: Concept
definition: 2.F.5 [Solvents][no classification][Emissions][HFC-152][t][no source][no method][no target][no option][no type]
status: valid
status modified: 2017-02-13
accepted date: 2017-02-13
in scheme: emissions_variables_MMR

2.F.5 [Solvents][no classification][Emissions][HFC-152a][t][From disposal][no method][no target][no option][no type]
type: Concept
definition: 2.F.5 [Solvents][no classification][Emissions][HFC-152a][t][From disposal][no method][no target][no option][no type]
status: valid
status modified: 2017-02-13
accepted date: 2017-02-13
in scheme: emissions_variables_MMR

2.F.5 [Solvents][no classification][Emissions][HFC-152a][t][From manufacturing][no method][no target][no option][no type]
type: Concept
definition: 2.F.5 [Solvents][no classification][Emissions][HFC-152a][t][From manufacturing][no method][no target][no option][no type]
status: valid
status modified: 2017-02-13
accepted date: 2017-02-13
in scheme: emissions_variables_MMR

2.F.5 [Solvents][no classification][Emissions][HFC-152a][t][From stocks][no method][no target][no option][no type]
type: Concept
definition: 2.F.5 [Solvents][no classification][Emissions][HFC-152a][t][From stocks][no method][no target][no option][no type]
status: valid
status modified: 2017-02-13
accepted date: 2017-02-13
in scheme: emissions_variables_MMR

2.F.5 [Solvents][no classification][Emissions][HFC-152a][t][no source][no method][no target][no option][no type]
type: Concept
definition: 2.F.5 [Solvents][no classification][Emissions][HFC-152a][t][no source][no method][no target][no option][no type]
status: valid
status modified: 2017-02-13
accepted date: 2017-02-13
in scheme: emissions_variables_MMR

2.F.5 [Solvents][no classification][Emissions][HFC-161][t][From disposal][no method][no target][no option][no type]
type: Concept
definition: 2.F.5 [Solvents][no classification][Emissions][HFC-161][t][From disposal][no method][no target][no option][no type]
status: valid
status modified: 2017-02-13
accepted date: 2017-02-13
in scheme: emissions_variables_MMR

2.F.5 [Solvents][no classification][Emissions][HFC-161][t][From manufacturing][no method][no target][no option][no type]
type: Concept
definition: 2.F.5 [Solvents][no classification][Emissions][HFC-161][t][From manufacturing][no method][no target][no option][no type]
status: valid
status modified: 2017-02-13
accepted date: 2017-02-13
in scheme: emissions_variables_MMR

2.F.5 [Solvents][no classification][Emissions][HFC-161][t][From stocks][no method][no target][no option][no type]
type: Concept
definition: 2.F.5 [Solvents][no classification][Emissions][HFC-161][t][From stocks][no method][no target][no option][no type]
status: valid
status modified: 2017-02-13
accepted date: 2017-02-13
in scheme: emissions_variables_MMR

2.F.5 [Solvents][no classification][Emissions][HFC-161][t][no source][no method][no target][no option][no type]
type: Concept
definition: 2.F.5 [Solvents][no classification][Emissions][HFC-161][t][no source][no method][no target][no option][no type]
status: valid
status modified: 2017-02-13
accepted date: 2017-02-13
in scheme: emissions_variables_MMR

2.F.5 [Solvents][no classification][Emissions][HFC-227ea][t][From disposal][no method][no target][no option][no type]
type: Concept
definition: 2.F.5 [Solvents][no classification][Emissions][HFC-227ea][t][From disposal][no method][no target][no option][no type]
status: valid
status modified: 2017-02-13
accepted date: 2017-02-13
in scheme: emissions_variables_MMR

2.F.5 [Solvents][no classification][Emissions][HFC-227ea][t][From manufacturing][no method][no target][no option][no type]
type: Concept
definition: 2.F.5 [Solvents][no classification][Emissions][HFC-227ea][t][From manufacturing][no method][no target][no option][no type]
status: valid
status modified: 2017-02-13
accepted date: 2017-02-13
in scheme: emissions_variables_MMR

2.F.5 [Solvents][no classification][Emissions][HFC-227ea][t][From stocks][no method][no target][no option][no type]
type: Concept
definition: 2.F.5 [Solvents][no classification][Emissions][HFC-227ea][t][From stocks][no method][no target][no option][no type]
status: valid
status modified: 2017-02-13
accepted date: 2017-02-13
in scheme: emissions_variables_MMR

2.F.5 [Solvents][no classification][Emissions][HFC-227ea][t][no source][no method][no target][no option][no type]
type: Concept
definition: 2.F.5 [Solvents][no classification][Emissions][HFC-227ea][t][no source][no method][no target][no option][no type]
status: valid
status modified: 2017-02-13
accepted date: 2017-02-13
in scheme: emissions_variables_MMR

2.F.5 [Solvents][no classification][Emissions][HFC-23][t][From disposal][no method][no target][no option][no type]
type: Concept
definition: 2.F.5 [Solvents][no classification][Emissions][HFC-23][t][From disposal][no method][no target][no option][no type]
status: valid
status modified: 2017-02-13
accepted date: 2017-02-13
in scheme: emissions_variables_MMR

2.F.5 [Solvents][no classification][Emissions][HFC-23][t][From manufacturing][no method][no target][no option][no type]
type: Concept
definition: 2.F.5 [Solvents][no classification][Emissions][HFC-23][t][From manufacturing][no method][no target][no option][no type]
status: valid
status modified: 2017-02-13
accepted date: 2017-02-13
in scheme: emissions_variables_MMR

2.F.5 [Solvents][no classification][Emissions][HFC-23][t][From stocks][no method][no target][no option][no type]
type: Concept
definition: 2.F.5 [Solvents][no classification][Emissions][HFC-23][t][From stocks][no method][no target][no option][no type]
status: valid
status modified: 2017-02-13
accepted date: 2017-02-13
in scheme: emissions_variables_MMR

2.F.5 [Solvents][no classification][Emissions][HFC-23][t][no source][no method][no target][no option][no type]
type: Concept
definition: 2.F.5 [Solvents][no classification][Emissions][HFC-23][t][no source][no method][no target][no option][no type]
status: valid
status modified: 2017-02-13
accepted date: 2017-02-13
in scheme: emissions_variables_MMR

2.F.5 [Solvents][no classification][Emissions][HFC-236cb][t][From disposal][no method][no target][no option][no type]
type: Concept
definition: 2.F.5 [Solvents][no classification][Emissions][HFC-236cb][t][From disposal][no method][no target][no option][no type]
status: valid
status modified: 2017-02-13
accepted date: 2017-02-13
in scheme: emissions_variables_MMR

2.F.5 [Solvents][no classification][Emissions][HFC-236cb][t][From manufacturing][no method][no target][no option][no type]
type: Concept
definition: 2.F.5 [Solvents][no classification][Emissions][HFC-236cb][t][From manufacturing][no method][no target][no option][no type]
status: valid
status modified: 2017-02-13
accepted date: 2017-02-13
in scheme: emissions_variables_MMR

2.F.5 [Solvents][no classification][Emissions][HFC-236cb][t][From stocks][no method][no target][no option][no type]
type: Concept
definition: 2.F.5 [Solvents][no classification][Emissions][HFC-236cb][t][From stocks][no method][no target][no option][no type]
status: valid
status modified: 2017-02-13
accepted date: 2017-02-13
in scheme: emissions_variables_MMR

2.F.5 [Solvents][no classification][Emissions][HFC-236cb][t][no source][no method][no target][no option][no type]
type: Concept
definition: 2.F.5 [Solvents][no classification][Emissions][HFC-236cb][t][no source][no method][no target][no option][no type]
status: valid
status modified: 2017-02-13
accepted date: 2017-02-13
in scheme: emissions_variables_MMR

2.F.5 [Solvents][no classification][Emissions][HFC-236ea][t][From disposal][no method][no target][no option][no type]
type: Concept
definition: 2.F.5 [Solvents][no classification][Emissions][HFC-236ea][t][From disposal][no method][no target][no option][no type]
status: valid
status modified: 2017-02-13
accepted date: 2017-02-13
in scheme: emissions_variables_MMR

2.F.5 [Solvents][no classification][Emissions][HFC-236ea][t][From manufacturing][no method][no target][no option][no type]
type: Concept
definition: 2.F.5 [Solvents][no classification][Emissions][HFC-236ea][t][From manufacturing][no method][no target][no option][no type]
status: valid
status modified: 2017-02-13
accepted date: 2017-02-13
in scheme: emissions_variables_MMR

2.F.5 [Solvents][no classification][Emissions][HFC-236ea][t][From stocks][no method][no target][no option][no type]
type: Concept
definition: 2.F.5 [Solvents][no classification][Emissions][HFC-236ea][t][From stocks][no method][no target][no option][no type]
status: valid
status modified: 2017-02-13
accepted date: 2017-02-13
in scheme: emissions_variables_MMR

2.F.5 [Solvents][no classification][Emissions][HFC-236ea][t][no source][no method][no target][no option][no type]
type: Concept
definition: 2.F.5 [Solvents][no classification][Emissions][HFC-236ea][t][no source][no method][no target][no option][no type]
status: valid
status modified: 2017-02-13
accepted date: 2017-02-13
in scheme: emissions_variables_MMR

2.F.5 [Solvents][no classification][Emissions][HFC-236fa][t][From disposal][no method][no target][no option][no type]
type: Concept
definition: 2.F.5 [Solvents][no classification][Emissions][HFC-236fa][t][From disposal][no method][no target][no option][no type]
status: valid
status modified: 2017-02-13
accepted date: 2017-02-13
in scheme: emissions_variables_MMR

2.F.5 [Solvents][no classification][Emissions][HFC-236fa][t][From manufacturing][no method][no target][no option][no type]
type: Concept
definition: 2.F.5 [Solvents][no classification][Emissions][HFC-236fa][t][From manufacturing][no method][no target][no option][no type]
status: valid
status modified: 2017-02-13
accepted date: 2017-02-13
in scheme: emissions_variables_MMR

2.F.5 [Solvents][no classification][Emissions][HFC-236fa][t][From stocks][no method][no target][no option][no type]
type: Concept
definition: 2.F.5 [Solvents][no classification][Emissions][HFC-236fa][t][From stocks][no method][no target][no option][no type]
status: valid
status modified: 2017-02-13
accepted date: 2017-02-13
in scheme: emissions_variables_MMR

2.F.5 [Solvents][no classification][Emissions][HFC-236fa][t][no source][no method][no target][no option][no type]
type: Concept
definition: 2.F.5 [Solvents][no classification][Emissions][HFC-236fa][t][no source][no method][no target][no option][no type]
status: valid
status modified: 2017-02-13
accepted date: 2017-02-13
in scheme: emissions_variables_MMR

2.F.5 [Solvents][no classification][Emissions][HFC-245ca][t][From disposal][no method][no target][no option][no type]
type: Concept
definition: 2.F.5 [Solvents][no classification][Emissions][HFC-245ca][t][From disposal][no method][no target][no option][no type]
status: valid
status modified: 2017-02-13
accepted date: 2017-02-13
in scheme: emissions_variables_MMR

2.F.5 [Solvents][no classification][Emissions][HFC-245ca][t][From manufacturing][no method][no target][no option][no type]
type: Concept
definition: 2.F.5 [Solvents][no classification][Emissions][HFC-245ca][t][From manufacturing][no method][no target][no option][no type]
status: valid
status modified: 2017-02-13
accepted date: 2017-02-13
in scheme: emissions_variables_MMR

2.F.5 [Solvents][no classification][Emissions][HFC-245ca][t][From stocks][no method][no target][no option][no type]
type: Concept
definition: 2.F.5 [Solvents][no classification][Emissions][HFC-245ca][t][From stocks][no method][no target][no option][no type]
status: valid
status modified: 2017-02-13
accepted date: 2017-02-13
in scheme: emissions_variables_MMR

2.F.5 [Solvents][no classification][Emissions][HFC-245ca][t][no source][no method][no target][no option][no type]
type: Concept
definition: 2.F.5 [Solvents][no classification][Emissions][HFC-245ca][t][no source][no method][no target][no option][no type]
status: valid
status modified: 2017-02-13
accepted date: 2017-02-13
in scheme: emissions_variables_MMR

2.F.5 [Solvents][no classification][Emissions][HFC-245fa][t][From disposal][no method][no target][no option][no type]
type: Concept
definition: 2.F.5 [Solvents][no classification][Emissions][HFC-245fa][t][From disposal][no method][no target][no option][no type]
status: valid
status modified: 2017-02-13
accepted date: 2017-02-13
in scheme: emissions_variables_MMR

2.F.5 [Solvents][no classification][Emissions][HFC-245fa][t][From manufacturing][no method][no target][no option][no type]
type: Concept
definition: 2.F.5 [Solvents][no classification][Emissions][HFC-245fa][t][From manufacturing][no method][no target][no option][no type]
status: valid
status modified: 2017-02-13
accepted date: 2017-02-13
in scheme: emissions_variables_MMR

2.F.5 [Solvents][no classification][Emissions][HFC-245fa][t][From stocks][no method][no target][no option][no type]
type: Concept
definition: 2.F.5 [Solvents][no classification][Emissions][HFC-245fa][t][From stocks][no method][no target][no option][no type]
status: valid
status modified: 2017-02-13
accepted date: 2017-02-13
in scheme: emissions_variables_MMR

2.F.5 [Solvents][no classification][Emissions][HFC-245fa][t][no source][no method][no target][no option][no type]
type: Concept
definition: 2.F.5 [Solvents][no classification][Emissions][HFC-245fa][t][no source][no method][no target][no option][no type]
status: valid
status modified: 2017-02-13
accepted date: 2017-02-13
in scheme: emissions_variables_MMR

2.F.5 [Solvents][no classification][Emissions][HFC-32][t][From disposal][no method][no target][no option][no type]
type: Concept
definition: 2.F.5 [Solvents][no classification][Emissions][HFC-32][t][From disposal][no method][no target][no option][no type]
status: valid
status modified: 2017-02-13
accepted date: 2017-02-13
in scheme: emissions_variables_MMR

2.F.5 [Solvents][no classification][Emissions][HFC-32][t][From manufacturing][no method][no target][no option][no type]
type: Concept
definition: 2.F.5 [Solvents][no classification][Emissions][HFC-32][t][From manufacturing][no method][no target][no option][no type]
status: valid
status modified: 2017-02-13
accepted date: 2017-02-13
in scheme: emissions_variables_MMR

2.F.5 [Solvents][no classification][Emissions][HFC-32][t][From stocks][no method][no target][no option][no type]
type: Concept
definition: 2.F.5 [Solvents][no classification][Emissions][HFC-32][t][From stocks][no method][no target][no option][no type]
status: valid
status modified: 2017-02-13
accepted date: 2017-02-13
in scheme: emissions_variables_MMR

2.F.5 [Solvents][no classification][Emissions][HFC-32][t][no source][no method][no target][no option][no type]
type: Concept
definition: 2.F.5 [Solvents][no classification][Emissions][HFC-32][t][no source][no method][no target][no option][no type]
status: valid
status modified: 2017-02-13
accepted date: 2017-02-13
in scheme: emissions_variables_MMR

2.F.5 [Solvents][no classification][Emissions][HFC-365mfc][t][From disposal][no method][no target][no option][no type]
type: Concept
definition: 2.F.5 [Solvents][no classification][Emissions][HFC-365mfc][t][From disposal][no method][no target][no option][no type]
status: valid
status modified: 2017-02-13
accepted date: 2017-02-13
in scheme: emissions_variables_MMR

2.F.5 [Solvents][no classification][Emissions][HFC-365mfc][t][From manufacturing][no method][no target][no option][no type]
type: Concept
definition: 2.F.5 [Solvents][no classification][Emissions][HFC-365mfc][t][From manufacturing][no method][no target][no option][no type]
status: valid
status modified: 2017-02-13
accepted date: 2017-02-13
in scheme: emissions_variables_MMR

2.F.5 [Solvents][no classification][Emissions][HFC-365mfc][t][From stocks][no method][no target][no option][no type]
type: Concept
definition: 2.F.5 [Solvents][no classification][Emissions][HFC-365mfc][t][From stocks][no method][no target][no option][no type]
status: valid
status modified: 2017-02-13
accepted date: 2017-02-13
in scheme: emissions_variables_MMR

2.F.5 [Solvents][no classification][Emissions][HFC-365mfc][t][no source][no method][no target][no option][no type]
type: Concept
definition: 2.F.5 [Solvents][no classification][Emissions][HFC-365mfc][t][no source][no method][no target][no option][no type]
status: valid
status modified: 2017-02-13
accepted date: 2017-02-13
in scheme: emissions_variables_MMR

2.F.5 [Solvents][no classification][Emissions][HFC-41][t][From disposal][no method][no target][no option][no type]
type: Concept
definition: 2.F.5 [Solvents][no classification][Emissions][HFC-41][t][From disposal][no method][no target][no option][no type]
status: valid
status modified: 2017-02-13
accepted date: 2017-02-13
in scheme: emissions_variables_MMR

2.F.5 [Solvents][no classification][Emissions][HFC-41][t][From manufacturing][no method][no target][no option][no type]
type: Concept
definition: 2.F.5 [Solvents][no classification][Emissions][HFC-41][t][From manufacturing][no method][no target][no option][no type]
status: valid
status modified: 2017-02-13
accepted date: 2017-02-13
in scheme: emissions_variables_MMR

2.F.5 [Solvents][no classification][Emissions][HFC-41][t][From stocks][no method][no target][no option][no type]
type: Concept
definition: 2.F.5 [Solvents][no classification][Emissions][HFC-41][t][From stocks][no method][no target][no option][no type]
status: valid
status modified: 2017-02-13
accepted date: 2017-02-13
in scheme: emissions_variables_MMR

2.F.5 [Solvents][no classification][Emissions][HFC-41][t][no source][no method][no target][no option][no type]
type: Concept
definition: 2.F.5 [Solvents][no classification][Emissions][HFC-41][t][no source][no method][no target][no option][no type]
status: valid
status modified: 2017-02-13
accepted date: 2017-02-13
in scheme: emissions_variables_MMR

2.F.5 [Solvents][no classification][Emissions][HFC-43-10mee][t][From disposal][no method][no target][no option][no type]
type: Concept
definition: 2.F.5 [Solvents][no classification][Emissions][HFC-43-10mee][t][From disposal][no method][no target][no option][no type]
status: valid
status modified: 2017-02-13
accepted date: 2017-02-13
in scheme: emissions_variables_MMR

2.F.5 [Solvents][no classification][Emissions][HFC-43-10mee][t][From manufacturing][no method][no target][no option][no type]
type: Concept
definition: 2.F.5 [Solvents][no classification][Emissions][HFC-43-10mee][t][From manufacturing][no method][no target][no option][no type]
status: valid
status modified: 2017-02-13
accepted date: 2017-02-13
in scheme: emissions_variables_MMR

2.F.5 [Solvents][no classification][Emissions][HFC-43-10mee][t][From stocks][no method][no target][no option][no type]
type: Concept
definition: 2.F.5 [Solvents][no classification][Emissions][HFC-43-10mee][t][From stocks][no method][no target][no option][no type]
status: valid
status modified: 2017-02-13
accepted date: 2017-02-13
in scheme: emissions_variables_MMR

2.F.5 [Solvents][no classification][Emissions][HFC-43-10mee][t][no source][no method][no target][no option][no type]
type: Concept
definition: 2.F.5 [Solvents][no classification][Emissions][HFC-43-10mee][t][no source][no method][no target][no option][no type]
status: valid
status modified: 2017-02-13
accepted date: 2017-02-13
in scheme: emissions_variables_MMR

2.F.5 [Solvents][no classification][Emissions][HFCs and PFCs][t CO2 equivalent][no source][no method][no target][no option][no type]
type: Concept
definition: 2.F.5 [Solvents][no classification][Emissions][HFCs and PFCs][t CO2 equivalent][no source][no method][no target][no option][no type]
status: valid
status modified: 2017-02-13
accepted date: 2017-02-13
in scheme: emissions_variables_MMR

2.F.5 [Solvents][no classification][Emissions][HFCs][t CO2 equivalent][no source][no method][no target][no option][no type]
type: Concept
definition: 2.F.5 [Solvents][no classification][Emissions][HFCs][t CO2 equivalent][no source][no method][no target][no option][no type]
status: valid
status modified: 2017-02-13
accepted date: 2017-02-13
in scheme: emissions_variables_MMR

2.F.5 [Solvents][no classification][Emissions][NF3][t][From disposal][no method][no target][no option][no type]
type: Concept
definition: 2.F.5 [Solvents][no classification][Emissions][NF3][t][From disposal][no method][no target][no option][no type]
status: valid
status modified: 2017-02-13
accepted date: 2017-02-13
in scheme: emissions_variables_MMR

2.F.5 [Solvents][no classification][Emissions][NF3][t][From manufacturing][no method][no target][no option][no type]
type: Concept
definition: 2.F.5 [Solvents][no classification][Emissions][NF3][t][From manufacturing][no method][no target][no option][no type]
status: valid
status modified: 2017-02-13
accepted date: 2017-02-13
in scheme: emissions_variables_MMR

2.F.5 [Solvents][no classification][Emissions][NF3][t][From stocks][no method][no target][no option][no type]
type: Concept
definition: 2.F.5 [Solvents][no classification][Emissions][NF3][t][From stocks][no method][no target][no option][no type]
status: valid
status modified: 2017-02-13
accepted date: 2017-02-13
in scheme: emissions_variables_MMR

2.F.5 [Solvents][no classification][Emissions][NF3][t][no source][no method][no target][no option][no type]
type: Concept
definition: 2.F.5 [Solvents][no classification][Emissions][NF3][t][no source][no method][no target][no option][no type]
status: valid
status modified: 2017-02-13
accepted date: 2017-02-13
in scheme: emissions_variables_MMR

2.F.5 [Solvents][no classification][Emissions][PFCs][t CO2 equivalent][no source][no method][no target][no option][no type]
type: Concept
definition: 2.F.5 [Solvents][no classification][Emissions][PFCs][t CO2 equivalent][no source][no method][no target][no option][no type]
status: valid
status modified: 2017-02-13
accepted date: 2017-02-13
in scheme: emissions_variables_MMR

2.F.5 [Solvents][no classification][Emissions][SF6][t][From disposal][no method][no target][no option][no type]
type: Concept
definition: 2.F.5 [Solvents][no classification][Emissions][SF6][t][From disposal][no method][no target][no option][no type]
status: valid
status modified: 2017-02-13
accepted date: 2017-02-13
in scheme: emissions_variables_MMR

2.F.5 [Solvents][no classification][Emissions][SF6][t][From manufacturing][no method][no target][no option][no type]
type: Concept
definition: 2.F.5 [Solvents][no classification][Emissions][SF6][t][From manufacturing][no method][no target][no option][no type]
status: valid
status modified: 2017-02-13
accepted date: 2017-02-13
in scheme: emissions_variables_MMR

2.F.5 [Solvents][no classification][Emissions][SF6][t][From stocks][no method][no target][no option][no type]
type: Concept
definition: 2.F.5 [Solvents][no classification][Emissions][SF6][t][From stocks][no method][no target][no option][no type]
status: valid
status modified: 2017-02-13
accepted date: 2017-02-13
in scheme: emissions_variables_MMR

2.F.5 [Solvents][no classification][Emissions][SF6][t][no source][no method][no target][no option][no type]
type: Concept
definition: 2.F.5 [Solvents][no classification][Emissions][SF6][t][no source][no method][no target][no option][no type]
status: valid
status modified: 2017-02-13
accepted date: 2017-02-13
in scheme: emissions_variables_MMR

2.F.5 [Solvents][no classification][Emissions][Unspecified mix of HFCs and PFCs][t CO2 equivalent][From disposal][no method][no target][no option][no type]
type: Concept
definition: 2.F.5 [Solvents][no classification][Emissions][Unspecified mix of HFCs and PFCs][t CO2 equivalent][From disposal][no method][no target][no option][no type]
status: valid
status modified: 2017-02-13
accepted date: 2017-02-13
in scheme: emissions_variables_MMR

2.F.5 [Solvents][no classification][Emissions][Unspecified mix of HFCs and PFCs][t CO2 equivalent][From manufacturing][no method][no target][no option][no type]
type: Concept
definition: 2.F.5 [Solvents][no classification][Emissions][Unspecified mix of HFCs and PFCs][t CO2 equivalent][From manufacturing][no method][no target][no option][no type]
status: valid
status modified: 2017-02-13
accepted date: 2017-02-13
in scheme: emissions_variables_MMR

2.F.5 [Solvents][no classification][Emissions][Unspecified mix of HFCs and PFCs][t CO2 equivalent][From stocks][no method][no target][no option][no type]
type: Concept
definition: 2.F.5 [Solvents][no classification][Emissions][Unspecified mix of HFCs and PFCs][t CO2 equivalent][From stocks][no method][no target][no option][no type]
status: valid
status modified: 2017-02-13
accepted date: 2017-02-13
in scheme: emissions_variables_MMR

2.F.5 [Solvents][no classification][Emissions][Unspecified mix of HFCs and PFCs][t CO2 equivalent][no source][no method][no target][no option][no type]
type: Concept
definition: 2.F.5 [Solvents][no classification][Emissions][Unspecified mix of HFCs and PFCs][t CO2 equivalent][no source][no method][no target][no option][no type]
status: valid
status modified: 2017-02-13
accepted date: 2017-02-13
in scheme: emissions_variables_MMR

2.F.5 [Solvents][no classification][Emissions][Unspecified mix of HFCs][t CO2 equivalent][From disposal][no method][no target][no option][no type]
type: Concept
definition: 2.F.5 [Solvents][no classification][Emissions][Unspecified mix of HFCs][t CO2 equivalent][From disposal][no method][no target][no option][no type]
status: valid
status modified: 2017-02-13
accepted date: 2017-02-13
in scheme: emissions_variables_MMR

2.F.5 [Solvents][no classification][Emissions][Unspecified mix of HFCs][t CO2 equivalent][From manufacturing][no method][no target][no option][no type]
type: Concept
definition: 2.F.5 [Solvents][no classification][Emissions][Unspecified mix of HFCs][t CO2 equivalent][From manufacturing][no method][no target][no option][no type]
status: valid
status modified: 2017-02-13
accepted date: 2017-02-13
in scheme: emissions_variables_MMR

2.F.5 [Solvents][no classification][Emissions][Unspecified mix of HFCs][t CO2 equivalent][From stocks][no method][no target][no option][no type]
type: Concept
definition: 2.F.5 [Solvents][no classification][Emissions][Unspecified mix of HFCs][t CO2 equivalent][From stocks][no method][no target][no option][no type]
status: valid
status modified: 2017-02-13
accepted date: 2017-02-13
in scheme: emissions_variables_MMR

2.F.5 [Solvents][no classification][Emissions][Unspecified mix of HFCs][t CO2 equivalent][no source][no method][no target][no option][no type]
type: Concept
definition: 2.F.5 [Solvents][no classification][Emissions][Unspecified mix of HFCs][t CO2 equivalent][no source][no method][no target][no option][no type]
status: valid
status modified: 2017-02-13
accepted date: 2017-02-13
in scheme: emissions_variables_MMR

2.F.5 [Solvents][no classification][Emissions][Unspecified mix of PFCs][t CO2 equivalent][From disposal][no method][no target][no option][no type]
type: Concept
definition: 2.F.5 [Solvents][no classification][Emissions][Unspecified mix of PFCs][t CO2 equivalent][From disposal][no method][no target][no option][no type]
status: valid
status modified: 2017-02-13
accepted date: 2017-02-13
in scheme: emissions_variables_MMR

2.F.5 [Solvents][no classification][Emissions][Unspecified mix of PFCs][t CO2 equivalent][From manufacturing][no method][no target][no option][no type]
type: Concept
definition: 2.F.5 [Solvents][no classification][Emissions][Unspecified mix of PFCs][t CO2 equivalent][From manufacturing][no method][no target][no option][no type]
status: valid
status modified: 2017-02-13
accepted date: 2017-02-13
in scheme: emissions_variables_MMR

2.F.5 [Solvents][no classification][Emissions][Unspecified mix of PFCs][t CO2 equivalent][From stocks][no method][no target][no option][no type]
type: Concept
definition: 2.F.5 [Solvents][no classification][Emissions][Unspecified mix of PFCs][t CO2 equivalent][From stocks][no method][no target][no option][no type]
status: valid
status modified: 2017-02-13
accepted date: 2017-02-13
in scheme: emissions_variables_MMR

2.F.5 [Solvents][no classification][Emissions][Unspecified mix of PFCs][t CO2 equivalent][no source][no method][no target][no option][no type]
type: Concept
definition: 2.F.5 [Solvents][no classification][Emissions][Unspecified mix of PFCs][t CO2 equivalent][no source][no method][no target][no option][no type]
status: valid
status modified: 2017-02-13
accepted date: 2017-02-13
in scheme: emissions_variables_MMR

2.F.6 [Other Applications][no classification][Emissions][Aggregate F-gases][t CO2 equivalent][no source][no method][no target][no option][no type]
type: Concept
definition: 2.F.6 [Other Applications][no classification][Emissions][Aggregate F-gases][t CO2 equivalent][no source][no method][no target][no option][no type]
status: valid
status modified: 2017-02-13
accepted date: 2017-02-13
in scheme: emissions_variables_MMR

2.F.6 [Other Applications][no classification][Emissions][C10F18][t][no source][no method][no target][no option][no type]
type: Concept
definition: 2.F.6 [Other Applications][no classification][Emissions][C10F18][t][no source][no method][no target][no option][no type]
status: valid
status modified: 2017-02-13
accepted date: 2017-02-13
in scheme: emissions_variables_MMR

2.F.6 [Other Applications][no classification][Emissions][C2F6][t][no source][no method][no target][no option][no type]
type: Concept
definition: 2.F.6 [Other Applications][no classification][Emissions][C2F6][t][no source][no method][no target][no option][no type]
status: valid
status modified: 2017-02-13
accepted date: 2017-02-13
in scheme: emissions_variables_MMR

2.F.6 [Other Applications][no classification][Emissions][C3F8][t][no source][no method][no target][no option][no type]
type: Concept
definition: 2.F.6 [Other Applications][no classification][Emissions][C3F8][t][no source][no method][no target][no option][no type]
status: valid
status modified: 2017-02-13
accepted date: 2017-02-13
in scheme: emissions_variables_MMR

2.F.6 [Other Applications][no classification][Emissions][C4F10][t][no source][no method][no target][no option][no type]
type: Concept
definition: 2.F.6 [Other Applications][no classification][Emissions][C4F10][t][no source][no method][no target][no option][no type]
status: valid
status modified: 2017-02-13
accepted date: 2017-02-13
in scheme: emissions_variables_MMR

2.F.6 [Other Applications][no classification][Emissions][C5F12][t][no source][no method][no target][no option][no type]
type: Concept
definition: 2.F.6 [Other Applications][no classification][Emissions][C5F12][t][no source][no method][no target][no option][no type]
status: valid
status modified: 2017-02-13
accepted date: 2017-02-13
in scheme: emissions_variables_MMR

2.F.6 [Other Applications][no classification][Emissions][C6F14][t][no source][no method][no target][no option][no type]
type: Concept
definition: 2.F.6 [Other Applications][no classification][Emissions][C6F14][t][no source][no method][no target][no option][no type]
status: valid
status modified: 2017-02-13
accepted date: 2017-02-13
in scheme: emissions_variables_MMR

2.F.6 [Other Applications][no classification][Emissions][c-C3F6][t][no source][no method][no target][no option][no type]
type: Concept
definition: 2.F.6 [Other Applications][no classification][Emissions][c-C3F6][t][no source][no method][no target][no option][no type]
status: valid
status modified: 2017-02-13
accepted date: 2017-02-13
in scheme: emissions_variables_MMR

2.F.6 [Other Applications][no classification][Emissions][c-C4F8][t][no source][no method][no target][no option][no type]
type: Concept
definition: 2.F.6 [Other Applications][no classification][Emissions][c-C4F8][t][no source][no method][no target][no option][no type]
status: valid
status modified: 2017-02-13
accepted date: 2017-02-13
in scheme: emissions_variables_MMR

2.F.6 [Other Applications][no classification][Emissions][CF4][t][no source][no method][no target][no option][no type]
type: Concept
definition: 2.F.6 [Other Applications][no classification][Emissions][CF4][t][no source][no method][no target][no option][no type]
status: valid
status modified: 2017-02-13
accepted date: 2017-02-13
in scheme: emissions_variables_MMR

2.F.6 [Other Applications][no classification][Emissions][HFC-125][t][no source][no method][no target][no option][no type]
type: Concept
definition: 2.F.6 [Other Applications][no classification][Emissions][HFC-125][t][no source][no method][no target][no option][no type]
status: valid
status modified: 2017-02-13
accepted date: 2017-02-13
in scheme: emissions_variables_MMR

2.F.6 [Other Applications][no classification][Emissions][HFC-134][t][no source][no method][no target][no option][no type]
type: Concept
definition: 2.F.6 [Other Applications][no classification][Emissions][HFC-134][t][no source][no method][no target][no option][no type]
status: valid
status modified: 2017-02-13
accepted date: 2017-02-13
in scheme: emissions_variables_MMR

2.F.6 [Other Applications][no classification][Emissions][HFC-134a][t][no source][no method][no target][no option][no type]
type: Concept
definition: 2.F.6 [Other Applications][no classification][Emissions][HFC-134a][t][no source][no method][no target][no option][no type]
status: valid
status modified: 2017-02-13
accepted date: 2017-02-13
in scheme: emissions_variables_MMR

2.F.6 [Other Applications][no classification][Emissions][HFC-143][t][no source][no method][no target][no option][no type]
type: Concept
definition: 2.F.6 [Other Applications][no classification][Emissions][HFC-143][t][no source][no method][no target][no option][no type]
status: valid
status modified: 2017-02-13
accepted date: 2017-02-13
in scheme: emissions_variables_MMR

2.F.6 [Other Applications][no classification][Emissions][HFC-143a][t][no source][no method][no target][no option][no type]
type: Concept
definition: 2.F.6 [Other Applications][no classification][Emissions][HFC-143a][t][no source][no method][no target][no option][no type]
status: valid
status modified: 2017-02-13
accepted date: 2017-02-13
in scheme: emissions_variables_MMR

2.F.6 [Other Applications][no classification][Emissions][HFC-152][t][no source][no method][no target][no option][no type]
type: Concept
definition: 2.F.6 [Other Applications][no classification][Emissions][HFC-152][t][no source][no method][no target][no option][no type]
status: valid
status modified: 2017-02-13
accepted date: 2017-02-13
in scheme: emissions_variables_MMR

2.F.6 [Other Applications][no classification][Emissions][HFC-152a][t][no source][no method][no target][no option][no type]
type: Concept
definition: 2.F.6 [Other Applications][no classification][Emissions][HFC-152a][t][no source][no method][no target][no option][no type]
status: valid
status modified: 2017-02-13
accepted date: 2017-02-13
in scheme: emissions_variables_MMR

2.F.6 [Other Applications][no classification][Emissions][HFC-161][t][no source][no method][no target][no option][no type]
type: Concept
definition: 2.F.6 [Other Applications][no classification][Emissions][HFC-161][t][no source][no method][no target][no option][no type]
status: valid
status modified: 2017-02-13
accepted date: 2017-02-13
in scheme: emissions_variables_MMR

2.F.6 [Other Applications][no classification][Emissions][HFC-227ea][t][no source][no method][no target][no option][no type]
type: Concept
definition: 2.F.6 [Other Applications][no classification][Emissions][HFC-227ea][t][no source][no method][no target][no option][no type]
status: valid
status modified: 2017-02-13
accepted date: 2017-02-13
in scheme: emissions_variables_MMR

2.F.6 [Other Applications][no classification][Emissions][HFC-23][t][no source][no method][no target][no option][no type]
type: Concept
definition: 2.F.6 [Other Applications][no classification][Emissions][HFC-23][t][no source][no method][no target][no option][no type]
status: valid
status modified: 2017-02-13
accepted date: 2017-02-13
in scheme: emissions_variables_MMR

2.F.6 [Other Applications][no classification][Emissions][HFC-236cb][t][no source][no method][no target][no option][no type]
type: Concept
definition: 2.F.6 [Other Applications][no classification][Emissions][HFC-236cb][t][no source][no method][no target][no option][no type]
status: valid
status modified: 2017-02-13
accepted date: 2017-02-13
in scheme: emissions_variables_MMR

2.F.6 [Other Applications][no classification][Emissions][HFC-236ea][t][no source][no method][no target][no option][no type]
type: Concept
definition: 2.F.6 [Other Applications][no classification][Emissions][HFC-236ea][t][no source][no method][no target][no option][no type]
status: valid
status modified: 2017-02-13
accepted date: 2017-02-13
in scheme: emissions_variables_MMR

2.F.6 [Other Applications][no classification][Emissions][HFC-236fa][t][no source][no method][no target][no option][no type]
type: Concept
definition: 2.F.6 [Other Applications][no classification][Emissions][HFC-236fa][t][no source][no method][no target][no option][no type]
status: valid
status modified: 2017-02-13
accepted date: 2017-02-13
in scheme: emissions_variables_MMR

2.F.6 [Other Applications][no classification][Emissions][HFC-245ca][t][no source][no method][no target][no option][no type]
type: Concept
definition: 2.F.6 [Other Applications][no classification][Emissions][HFC-245ca][t][no source][no method][no target][no option][no type]
status: valid
status modified: 2017-02-13
accepted date: 2017-02-13
in scheme: emissions_variables_MMR

2.F.6 [Other Applications][no classification][Emissions][HFC-245fa][t][no source][no method][no target][no option][no type]
type: Concept
definition: 2.F.6 [Other Applications][no classification][Emissions][HFC-245fa][t][no source][no method][no target][no option][no type]
status: valid
status modified: 2017-02-13
accepted date: 2017-02-13
in scheme: emissions_variables_MMR

2.F.6 [Other Applications][no classification][Emissions][HFC-32][t][no source][no method][no target][no option][no type]
type: Concept
definition: 2.F.6 [Other Applications][no classification][Emissions][HFC-32][t][no source][no method][no target][no option][no type]
status: valid
status modified: 2017-02-13
accepted date: 2017-02-13
in scheme: emissions_variables_MMR

2.F.6 [Other Applications][no classification][Emissions][HFC-365mfc][t][no source][no method][no target][no option][no type]
type: Concept
definition: 2.F.6 [Other Applications][no classification][Emissions][HFC-365mfc][t][no source][no method][no target][no option][no type]
status: valid
status modified: 2017-02-13
accepted date: 2017-02-13
in scheme: emissions_variables_MMR

2.F.6 [Other Applications][no classification][Emissions][HFC-41][t][no source][no method][no target][no option][no type]
type: Concept
definition: 2.F.6 [Other Applications][no classification][Emissions][HFC-41][t][no source][no method][no target][no option][no type]
status: valid
status modified: 2017-02-13
accepted date: 2017-02-13
in scheme: emissions_variables_MMR

2.F.6 [Other Applications][no classification][Emissions][HFC-43-10mee][t][no source][no method][no target][no option][no type]
type: Concept
definition: 2.F.6 [Other Applications][no classification][Emissions][HFC-43-10mee][t][no source][no method][no target][no option][no type]
status: valid
status modified: 2017-02-13
accepted date: 2017-02-13
in scheme: emissions_variables_MMR

2.F.6 [Other Applications][no classification][Emissions][HFCs and PFCs][t CO2 equivalent][no source][no method][no target][no option][no type]
type: Concept
definition: 2.F.6 [Other Applications][no classification][Emissions][HFCs and PFCs][t CO2 equivalent][no source][no method][no target][no option][no type]
status: valid
status modified: 2017-02-13
accepted date: 2017-02-13
in scheme: emissions_variables_MMR

2.F.6 [Other Applications][no classification][Emissions][HFCs][t CO2 equivalent][no source][no method][no target][no option][no type]
type: Concept
definition: 2.F.6 [Other Applications][no classification][Emissions][HFCs][t CO2 equivalent][no source][no method][no target][no option][no type]
status: valid
status modified: 2017-02-13
accepted date: 2017-02-13
in scheme: emissions_variables_MMR

2.F.6 [Other Applications][no classification][Emissions][NF3][t][no source][no method][no target][no option][no type]
type: Concept
definition: 2.F.6 [Other Applications][no classification][Emissions][NF3][t][no source][no method][no target][no option][no type]
status: valid
status modified: 2017-02-13
accepted date: 2017-02-13
in scheme: emissions_variables_MMR

2.F.6 [Other Applications][no classification][Emissions][PFCs][t CO2 equivalent][no source][no method][no target][no option][no type]
type: Concept
definition: 2.F.6 [Other Applications][no classification][Emissions][PFCs][t CO2 equivalent][no source][no method][no target][no option][no type]
status: valid
status modified: 2017-02-13
accepted date: 2017-02-13
in scheme: emissions_variables_MMR

2.F.6 [Other Applications][no classification][Emissions][SF6][t][no source][no method][no target][no option][no type]
type: Concept
definition: 2.F.6 [Other Applications][no classification][Emissions][SF6][t][no source][no method][no target][no option][no type]
status: valid
status modified: 2017-02-13
accepted date: 2017-02-13
in scheme: emissions_variables_MMR

2.F.6 [Other Applications][no classification][Emissions][Unspecified mix of HFCs and PFCs][t CO2 equivalent][no source][no method][no target][no option][no type]
type: Concept
definition: 2.F.6 [Other Applications][no classification][Emissions][Unspecified mix of HFCs and PFCs][t CO2 equivalent][no source][no method][no target][no option][no type]
status: valid
status modified: 2017-02-13
accepted date: 2017-02-13
in scheme: emissions_variables_MMR

2.F.6 [Other Applications][no classification][Emissions][Unspecified mix of HFCs][t CO2 equivalent][no source][no method][no target][no option][no type]
type: Concept
definition: 2.F.6 [Other Applications][no classification][Emissions][Unspecified mix of HFCs][t CO2 equivalent][no source][no method][no target][no option][no type]
status: valid
status modified: 2017-02-13
accepted date: 2017-02-13
in scheme: emissions_variables_MMR

2.F.6 [Other Applications][no classification][Emissions][Unspecified mix of PFCs][t CO2 equivalent][no source][no method][no target][no option][no type]
type: Concept
definition: 2.F.6 [Other Applications][no classification][Emissions][Unspecified mix of PFCs][t CO2 equivalent][no source][no method][no target][no option][no type]
status: valid
status modified: 2017-02-13
accepted date: 2017-02-13
in scheme: emissions_variables_MMR

2.F.6.a [Emissive][no classification][Emissions][Aggregate F-gases][t CO2 equivalent][no source][no method][no target][no option][no type]
type: Concept
definition: 2.F.6.a [Emissive][no classification][Emissions][Aggregate F-gases][t CO2 equivalent][no source][no method][no target][no option][no type]
status: valid
status modified: 2017-02-13
accepted date: 2017-02-13
in scheme: emissions_variables_MMR

2.F.6.a [Emissive][no classification][Emissions][C10F18][t][From manufacturing][no method][no target][no option][no type]
type: Concept
definition: 2.F.6.a [Emissive][no classification][Emissions][C10F18][t][From manufacturing][no method][no target][no option][no type]
status: valid
status modified: 2017-02-13
accepted date: 2017-02-13
in scheme: emissions_variables_MMR

2.F.6.a [Emissive][no classification][Emissions][C10F18][t][From stocks][no method][no target][no option][no type]
type: Concept
definition: 2.F.6.a [Emissive][no classification][Emissions][C10F18][t][From stocks][no method][no target][no option][no type]
status: valid
status modified: 2017-02-13
accepted date: 2017-02-13
in scheme: emissions_variables_MMR

2.F.6.a [Emissive][no classification][Emissions][C10F18][t][no source][no method][no target][no option][no type]
type: Concept
definition: 2.F.6.a [Emissive][no classification][Emissions][C10F18][t][no source][no method][no target][no option][no type]
status: valid
status modified: 2017-02-13
accepted date: 2017-02-13
in scheme: emissions_variables_MMR

2.F.6.a [Emissive][no classification][Emissions][C2F6][t][From manufacturing][no method][no target][no option][no type]
type: Concept
definition: 2.F.6.a [Emissive][no classification][Emissions][C2F6][t][From manufacturing][no method][no target][no option][no type]
status: valid
status modified: 2017-02-13
accepted date: 2017-02-13
in scheme: emissions_variables_MMR

2.F.6.a [Emissive][no classification][Emissions][C2F6][t][From stocks][no method][no target][no option][no type]
type: Concept
definition: 2.F.6.a [Emissive][no classification][Emissions][C2F6][t][From stocks][no method][no target][no option][no type]
status: valid
status modified: 2017-02-13
accepted date: 2017-02-13
in scheme: emissions_variables_MMR

2.F.6.a [Emissive][no classification][Emissions][C2F6][t][no source][no method][no target][no option][no type]
type: Concept
definition: 2.F.6.a [Emissive][no classification][Emissions][C2F6][t][no source][no method][no target][no option][no type]
status: valid
status modified: 2017-02-13
accepted date: 2017-02-13
in scheme: emissions_variables_MMR

2.F.6.a [Emissive][no classification][Emissions][C3F8][t][From manufacturing][no method][no target][no option][no type]
type: Concept
definition: 2.F.6.a [Emissive][no classification][Emissions][C3F8][t][From manufacturing][no method][no target][no option][no type]
status: valid
status modified: 2017-02-13
accepted date: 2017-02-13
in scheme: emissions_variables_MMR

2.F.6.a [Emissive][no classification][Emissions][C3F8][t][From stocks][no method][no target][no option][no type]
type: Concept
definition: 2.F.6.a [Emissive][no classification][Emissions][C3F8][t][From stocks][no method][no target][no option][no type]
status: valid
status modified: 2017-02-13
accepted date: 2017-02-13
in scheme: emissions_variables_MMR

2.F.6.a [Emissive][no classification][Emissions][C3F8][t][no source][no method][no target][no option][no type]
type: Concept
definition: 2.F.6.a [Emissive][no classification][Emissions][C3F8][t][no source][no method][no target][no option][no type]
status: valid
status modified: 2017-02-13
accepted date: 2017-02-13
in scheme: emissions_variables_MMR

2.F.6.a [Emissive][no classification][Emissions][C4F10][t][From manufacturing][no method][no target][no option][no type]
type: Concept
definition: 2.F.6.a [Emissive][no classification][Emissions][C4F10][t][From manufacturing][no method][no target][no option][no type]
status: valid
status modified: 2017-02-13
accepted date: 2017-02-13
in scheme: emissions_variables_MMR

2.F.6.a [Emissive][no classification][Emissions][C4F10][t][From stocks][no method][no target][no option][no type]
type: Concept
definition: 2.F.6.a [Emissive][no classification][Emissions][C4F10][t][From stocks][no method][no target][no option][no type]
status: valid
status modified: 2017-02-13
accepted date: 2017-02-13
in scheme: emissions_variables_MMR

2.F.6.a [Emissive][no classification][Emissions][C4F10][t][no source][no method][no target][no option][no type]
type: Concept
definition: 2.F.6.a [Emissive][no classification][Emissions][C4F10][t][no source][no method][no target][no option][no type]
status: valid
status modified: 2017-02-13
accepted date: 2017-02-13
in scheme: emissions_variables_MMR

2.F.6.a [Emissive][no classification][Emissions][C5F12][t][From manufacturing][no method][no target][no option][no type]
type: Concept
definition: 2.F.6.a [Emissive][no classification][Emissions][C5F12][t][From manufacturing][no method][no target][no option][no type]
status: valid
status modified: 2017-02-13
accepted date: 2017-02-13
in scheme: emissions_variables_MMR

2.F.6.a [Emissive][no classification][Emissions][C5F12][t][From stocks][no method][no target][no option][no type]
type: Concept
definition: 2.F.6.a [Emissive][no classification][Emissions][C5F12][t][From stocks][no method][no target][no option][no type]
status: valid
status modified: 2017-02-13
accepted date: 2017-02-13
in scheme: emissions_variables_MMR

2.F.6.a [Emissive][no classification][Emissions][C5F12][t][no source][no method][no target][no option][no type]
type: Concept
definition: 2.F.6.a [Emissive][no classification][Emissions][C5F12][t][no source][no method][no target][no option][no type]
status: valid
status modified: 2017-02-13
accepted date: 2017-02-13
in scheme: emissions_variables_MMR

2.F.6.a [Emissive][no classification][Emissions][C6F14][t][From manufacturing][no method][no target][no option][no type]
type: Concept
definition: 2.F.6.a [Emissive][no classification][Emissions][C6F14][t][From manufacturing][no method][no target][no option][no type]
status: valid
status modified: 2017-02-13
accepted date: 2017-02-13
in scheme: emissions_variables_MMR

2.F.6.a [Emissive][no classification][Emissions][C6F14][t][From stocks][no method][no target][no option][no type]
type: Concept
definition: 2.F.6.a [Emissive][no classification][Emissions][C6F14][t][From stocks][no method][no target][no option][no type]
status: valid
status modified: 2017-02-13
accepted date: 2017-02-13
in scheme: emissions_variables_MMR

2.F.6.a [Emissive][no classification][Emissions][C6F14][t][no source][no method][no target][no option][no type]
type: Concept
definition: 2.F.6.a [Emissive][no classification][Emissions][C6F14][t][no source][no method][no target][no option][no type]
status: valid
status modified: 2017-02-13
accepted date: 2017-02-13
in scheme: emissions_variables_MMR

2.F.6.a [Emissive][no classification][Emissions][c-C3F6][t][From manufacturing][no method][no target][no option][no type]
type: Concept
definition: 2.F.6.a [Emissive][no classification][Emissions][c-C3F6][t][From manufacturing][no method][no target][no option][no type]
status: valid
status modified: 2017-02-13
accepted date: 2017-02-13
in scheme: emissions_variables_MMR

2.F.6.a [Emissive][no classification][Emissions][c-C3F6][t][From stocks][no method][no target][no option][no type]
type: Concept
definition: 2.F.6.a [Emissive][no classification][Emissions][c-C3F6][t][From stocks][no method][no target][no option][no type]
status: valid
status modified: 2017-02-13
accepted date: 2017-02-13
in scheme: emissions_variables_MMR

2.F.6.a [Emissive][no classification][Emissions][c-C3F6][t][no source][no method][no target][no option][no type]
type: Concept
definition: 2.F.6.a [Emissive][no classification][Emissions][c-C3F6][t][no source][no method][no target][no option][no type]
status: valid
status modified: 2017-02-13
accepted date: 2017-02-13
in scheme: emissions_variables_MMR

2.F.6.a [Emissive][no classification][Emissions][c-C4F8][t][From manufacturing][no method][no target][no option][no type]
type: Concept
definition: 2.F.6.a [Emissive][no classification][Emissions][c-C4F8][t][From manufacturing][no method][no target][no option][no type]
status: valid
status modified: 2017-02-13
accepted date: 2017-02-13
in scheme: emissions_variables_MMR

2.F.6.a [Emissive][no classification][Emissions][c-C4F8][t][From stocks][no method][no target][no option][no type]
type: Concept
definition: 2.F.6.a [Emissive][no classification][Emissions][c-C4F8][t][From stocks][no method][no target][no option][no type]
status: valid
status modified: 2017-02-13
accepted date: 2017-02-13
in scheme: emissions_variables_MMR

2.F.6.a [Emissive][no classification][Emissions][c-C4F8][t][no source][no method][no target][no option][no type]
type: Concept
definition: 2.F.6.a [Emissive][no classification][Emissions][c-C4F8][t][no source][no method][no target][no option][no type]
status: valid
status modified: 2017-02-13
accepted date: 2017-02-13
in scheme: emissions_variables_MMR

2.F.6.a [Emissive][no classification][Emissions][CF4][t][From manufacturing][no method][no target][no option][no type]
type: Concept
definition: 2.F.6.a [Emissive][no classification][Emissions][CF4][t][From manufacturing][no method][no target][no option][no type]
status: valid
status modified: 2017-02-13
accepted date: 2017-02-13
in scheme: emissions_variables_MMR

2.F.6.a [Emissive][no classification][Emissions][CF4][t][From stocks][no method][no target][no option][no type]
type: Concept
definition: 2.F.6.a [Emissive][no classification][Emissions][CF4][t][From stocks][no method][no target][no option][no type]
status: valid
status modified: 2017-02-13
accepted date: 2017-02-13
in scheme: emissions_variables_MMR

2.F.6.a [Emissive][no classification][Emissions][CF4][t][no source][no method][no target][no option][no type]
type: Concept
definition: 2.F.6.a [Emissive][no classification][Emissions][CF4][t][no source][no method][no target][no option][no type]
status: valid
status modified: 2017-02-13
accepted date: 2017-02-13
in scheme: emissions_variables_MMR

2.F.6.a [Emissive][no classification][Emissions][HFC-125][t][no source][no method][no target][no option][no type]
type: Concept
definition: 2.F.6.a [Emissive][no classification][Emissions][HFC-125][t][no source][no method][no target][no option][no type]
status: valid
status modified: 2017-02-13
accepted date: 2017-02-13
in scheme: emissions_variables_MMR

2.F.6.a [Emissive][no classification][Emissions][HFC-134][t][From manufacturing][no method][no target][no option][no type]
type: Concept
definition: 2.F.6.a [Emissive][no classification][Emissions][HFC-134][t][From manufacturing][no method][no target][no option][no type]
status: valid
status modified: 2017-02-13
accepted date: 2017-02-13
in scheme: emissions_variables_MMR

2.F.6.a [Emissive][no classification][Emissions][HFC-134][t][From stocks][no method][no target][no option][no type]
type: Concept
definition: 2.F.6.a [Emissive][no classification][Emissions][HFC-134][t][From stocks][no method][no target][no option][no type]
status: valid
status modified: 2017-02-13
accepted date: 2017-02-13
in scheme: emissions_variables_MMR

2.F.6.a [Emissive][no classification][Emissions][HFC-134][t][no source][no method][no target][no option][no type]
type: Concept
definition: 2.F.6.a [Emissive][no classification][Emissions][HFC-134][t][no source][no method][no target][no option][no type]
status: valid
status modified: 2017-02-13
accepted date: 2017-02-13
in scheme: emissions_variables_MMR

2.F.6.a [Emissive][no classification][Emissions][HFC-134a][t][From manufacturing][no method][no target][no option][no type]
type: Concept
definition: 2.F.6.a [Emissive][no classification][Emissions][HFC-134a][t][From manufacturing][no method][no target][no option][no type]
status: valid
status modified: 2017-02-13
accepted date: 2017-02-13
in scheme: emissions_variables_MMR

2.F.6.a [Emissive][no classification][Emissions][HFC-134a][t][From stocks][no method][no target][no option][no type]
type: Concept
definition: 2.F.6.a [Emissive][no classification][Emissions][HFC-134a][t][From stocks][no method][no target][no option][no type]
status: valid
status modified: 2017-02-13
accepted date: 2017-02-13
in scheme: emissions_variables_MMR

2.F.6.a [Emissive][no classification][Emissions][HFC-134a][t][no source][no method][no target][no option][no type]
type: Concept
definition: 2.F.6.a [Emissive][no classification][Emissions][HFC-134a][t][no source][no method][no target][no option][no type]
status: valid
status modified: 2017-02-13
accepted date: 2017-02-13
in scheme: emissions_variables_MMR

2.F.6.a [Emissive][no classification][Emissions][HFC-143][t][From manufacturing][no method][no target][no option][no type]
type: Concept
definition: 2.F.6.a [Emissive][no classification][Emissions][HFC-143][t][From manufacturing][no method][no target][no option][no type]
status: valid
status modified: 2017-02-13
accepted date: 2017-02-13
in scheme: emissions_variables_MMR

2.F.6.a [Emissive][no classification][Emissions][HFC-143][t][From stocks][no method][no target][no option][no type]
type: Concept
definition: 2.F.6.a [Emissive][no classification][Emissions][HFC-143][t][From stocks][no method][no target][no option][no type]
status: valid
status modified: 2017-02-13
accepted date: 2017-02-13
in scheme: emissions_variables_MMR

2.F.6.a [Emissive][no classification][Emissions][HFC-143][t][no source][no method][no target][no option][no type]
type: Concept
definition: 2.F.6.a [Emissive][no classification][Emissions][HFC-143][t][no source][no method][no target][no option][no type]
status: valid
status modified: 2017-02-13
accepted date: 2017-02-13
in scheme: emissions_variables_MMR

2.F.6.a [Emissive][no classification][Emissions][HFC-143a][t][no source][no method][no target][no option][no type]
type: Concept
definition: 2.F.6.a [Emissive][no classification][Emissions][HFC-143a][t][no source][no method][no target][no option][no type]
status: valid
status modified: 2017-02-13
accepted date: 2017-02-13
in scheme: emissions_variables_MMR

2.F.6.a [Emissive][no classification][Emissions][HFC-152][t][From manufacturing][no method][no target][no option][no type]
type: Concept
definition: 2.F.6.a [Emissive][no classification][Emissions][HFC-152][t][From manufacturing][no method][no target][no option][no type]
status: valid
status modified: 2017-02-13
accepted date: 2017-02-13
in scheme: emissions_variables_MMR

2.F.6.a [Emissive][no classification][Emissions][HFC-152][t][From stocks][no method][no target][no option][no type]
type: Concept
definition: 2.F.6.a [Emissive][no classification][Emissions][HFC-152][t][From stocks][no method][no target][no option][no type]
status: valid
status modified: 2017-02-13
accepted date: 2017-02-13
in scheme: emissions_variables_MMR

2.F.6.a [Emissive][no classification][Emissions][HFC-152][t][no source][no method][no target][no option][no type]
type: Concept
definition: 2.F.6.a [Emissive][no classification][Emissions][HFC-152][t][no source][no method][no target][no option][no type]
status: valid
status modified: 2017-02-13
accepted date: 2017-02-13
in scheme: emissions_variables_MMR

2.F.6.a [Emissive][no classification][Emissions][HFC-152a][t][no source][no method][no target][no option][no type]
type: Concept
definition: 2.F.6.a [Emissive][no classification][Emissions][HFC-152a][t][no source][no method][no target][no option][no type]
status: valid
status modified: 2017-02-13
accepted date: 2017-02-13
in scheme: emissions_variables_MMR

2.F.6.a [Emissive][no classification][Emissions][HFC-161][t][From manufacturing][no method][no target][no option][no type]
type: Concept
definition: 2.F.6.a [Emissive][no classification][Emissions][HFC-161][t][From manufacturing][no method][no target][no option][no type]
status: valid
status modified: 2017-02-13
accepted date: 2017-02-13
in scheme: emissions_variables_MMR

2.F.6.a [Emissive][no classification][Emissions][HFC-161][t][From stocks][no method][no target][no option][no type]
type: Concept
definition: 2.F.6.a [Emissive][no classification][Emissions][HFC-161][t][From stocks][no method][no target][no option][no type]
status: valid
status modified: 2017-02-13
accepted date: 2017-02-13
in scheme: emissions_variables_MMR

2.F.6.a [Emissive][no classification][Emissions][HFC-161][t][no source][no method][no target][no option][no type]
type: Concept
definition: 2.F.6.a [Emissive][no classification][Emissions][HFC-161][t][no source][no method][no target][no option][no type]
status: valid
status modified: 2017-02-13
accepted date: 2017-02-13
in scheme: emissions_variables_MMR

2.F.6.a [Emissive][no classification][Emissions][HFC-227ea][t][From manufacturing][no method][no target][no option][no type]
type: Concept
definition: 2.F.6.a [Emissive][no classification][Emissions][HFC-227ea][t][From manufacturing][no method][no target][no option][no type]
status: valid
status modified: 2017-02-13
accepted date: 2017-02-13
in scheme: emissions_variables_MMR

2.F.6.a [Emissive][no classification][Emissions][HFC-227ea][t][From stocks][no method][no target][no option][no type]
type: Concept
definition: 2.F.6.a [Emissive][no classification][Emissions][HFC-227ea][t][From stocks][no method][no target][no option][no type]
status: valid
status modified: 2017-02-13
accepted date: 2017-02-13
in scheme: emissions_variables_MMR

2.F.6.a [Emissive][no classification][Emissions][HFC-227ea][t][no source][no method][no target][no option][no type]
type: Concept
definition: 2.F.6.a [Emissive][no classification][Emissions][HFC-227ea][t][no source][no method][no target][no option][no type]
status: valid
status modified: 2017-02-13
accepted date: 2017-02-13
in scheme: emissions_variables_MMR

2.F.6.a [Emissive][no classification][Emissions][HFC-23][t][no source][no method][no target][no option][no type]
type: Concept
definition: 2.F.6.a [Emissive][no classification][Emissions][HFC-23][t][no source][no method][no target][no option][no type]
status: valid
status modified: 2017-02-13
accepted date: 2017-02-13
in scheme: emissions_variables_MMR

2.F.6.a [Emissive][no classification][Emissions][HFC-236cb][t][From manufacturing][no method][no target][no option][no type]
type: Concept
definition: 2.F.6.a [Emissive][no classification][Emissions][HFC-236cb][t][From manufacturing][no method][no target][no option][no type]
status: valid
status modified: 2017-02-13
accepted date: 2017-02-13
in scheme: emissions_variables_MMR

2.F.6.a [Emissive][no classification][Emissions][HFC-236cb][t][From stocks][no method][no target][no option][no type]
type: Concept
definition: 2.F.6.a [Emissive][no classification][Emissions][HFC-236cb][t][From stocks][no method][no target][no option][no type]
status: valid
status modified: 2017-02-13
accepted date: 2017-02-13
in scheme: emissions_variables_MMR

2.F.6.a [Emissive][no classification][Emissions][HFC-236cb][t][no source][no method][no target][no option][no type]
type: Concept
definition: 2.F.6.a [Emissive][no classification][Emissions][HFC-236cb][t][no source][no method][no target][no option][no type]
status: valid
status modified: 2017-02-13
accepted date: 2017-02-13
in scheme: emissions_variables_MMR

2.F.6.a [Emissive][no classification][Emissions][HFC-236ea][t][From manufacturing][no method][no target][no option][no type]
type: Concept
definition: 2.F.6.a [Emissive][no classification][Emissions][HFC-236ea][t][From manufacturing][no method][no target][no option][no type]
status: valid
status modified: 2017-02-13
accepted date: 2017-02-13
in scheme: emissions_variables_MMR

2.F.6.a [Emissive][no classification][Emissions][HFC-236ea][t][From stocks][no method][no target][no option][no type]
type: Concept
definition: 2.F.6.a [Emissive][no classification][Emissions][HFC-236ea][t][From stocks][no method][no target][no option][no type]
status: valid
status modified: 2017-02-13
accepted date: 2017-02-13
in scheme: emissions_variables_MMR

2.F.6.a [Emissive][no classification][Emissions][HFC-236ea][t][no source][no method][no target][no option][no type]
type: Concept
definition: 2.F.6.a [Emissive][no classification][Emissions][HFC-236ea][t][no source][no method][no target][no option][no type]
status: valid
status modified: 2017-02-13
accepted date: 2017-02-13
in scheme: emissions_variables_MMR

2.F.6.a [Emissive][no classification][Emissions][HFC-236fa][t][From manufacturing][no method][no target][no option][no type]
type: Concept
definition: 2.F.6.a [Emissive][no classification][Emissions][HFC-236fa][t][From manufacturing][no method][no target][no option][no type]
status: valid
status modified: 2017-02-13
accepted date: 2017-02-13
in scheme: emissions_variables_MMR

2.F.6.a [Emissive][no classification][Emissions][HFC-236fa][t][From stocks][no method][no target][no option][no type]
type: Concept
definition: 2.F.6.a [Emissive][no classification][Emissions][HFC-236fa][t][From stocks][no method][no target][no option][no type]
status: valid
status modified: 2017-02-13
accepted date: 2017-02-13
in scheme: emissions_variables_MMR

2.F.6.a [Emissive][no classification][Emissions][HFC-236fa][t][no source][no method][no target][no option][no type]
type: Concept
definition: 2.F.6.a [Emissive][no classification][Emissions][HFC-236fa][t][no source][no method][no target][no option][no type]
status: valid
status modified: 2017-02-13
accepted date: 2017-02-13
in scheme: emissions_variables_MMR

2.F.6.a [Emissive][no classification][Emissions][HFC-245ca][t][From manufacturing][no method][no target][no option][no type]
type: Concept
definition: 2.F.6.a [Emissive][no classification][Emissions][HFC-245ca][t][From manufacturing][no method][no target][no option][no type]
status: valid
status modified: 2017-02-13
accepted date: 2017-02-13
in scheme: emissions_variables_MMR

2.F.6.a [Emissive][no classification][Emissions][HFC-245ca][t][From stocks][no method][no target][no option][no type]
type: Concept
definition: 2.F.6.a [Emissive][no classification][Emissions][HFC-245ca][t][From stocks][no method][no target][no option][no type]
status: valid
status modified: 2017-02-13
accepted date: 2017-02-13
in scheme: emissions_variables_MMR

2.F.6.a [Emissive][no classification][Emissions][HFC-245ca][t][no source][no method][no target][no option][no type]
type: Concept
definition: 2.F.6.a [Emissive][no classification][Emissions][HFC-245ca][t][no source][no method][no target][no option][no type]
status: valid
status modified: 2017-02-13
accepted date: 2017-02-13
in scheme: emissions_variables_MMR

2.F.6.a [Emissive][no classification][Emissions][HFC-245fa][t][From manufacturing][no method][no target][no option][no type]
type: Concept
definition: 2.F.6.a [Emissive][no classification][Emissions][HFC-245fa][t][From manufacturing][no method][no target][no option][no type]
status: valid
status modified: 2017-02-13
accepted date: 2017-02-13
in scheme: emissions_variables_MMR

2.F.6.a [Emissive][no classification][Emissions][HFC-245fa][t][From stocks][no method][no target][no option][no type]
type: Concept
definition: 2.F.6.a [Emissive][no classification][Emissions][HFC-245fa][t][From stocks][no method][no target][no option][no type]
status: valid
status modified: 2017-02-13
accepted date: 2017-02-13
in scheme: emissions_variables_MMR

2.F.6.a [Emissive][no classification][Emissions][HFC-245fa][t][no source][no method][no target][no option][no type]
type: Concept
definition: 2.F.6.a [Emissive][no classification][Emissions][HFC-245fa][t][no source][no method][no target][no option][no type]
status: valid
status modified: 2017-02-13
accepted date: 2017-02-13
in scheme: emissions_variables_MMR

2.F.6.a [Emissive][no classification][Emissions][HFC-32][t][no source][no method][no target][no option][no type]
type: Concept
definition: 2.F.6.a [Emissive][no classification][Emissions][HFC-32][t][no source][no method][no target][no option][no type]
status: valid
status modified: 2017-02-13
accepted date: 2017-02-13
in scheme: emissions_variables_MMR

2.F.6.a [Emissive][no classification][Emissions][HFC-365mfc][t][From manufacturing][no method][no target][no option][no type]
type: Concept
definition: 2.F.6.a [Emissive][no classification][Emissions][HFC-365mfc][t][From manufacturing][no method][no target][no option][no type]
status: valid
status modified: 2017-02-13
accepted date: 2017-02-13
in scheme: emissions_variables_MMR

2.F.6.a [Emissive][no classification][Emissions][HFC-365mfc][t][From stocks][no method][no target][no option][no type]
type: Concept
definition: 2.F.6.a [Emissive][no classification][Emissions][HFC-365mfc][t][From stocks][no method][no target][no option][no type]
status: valid
status modified: 2017-02-13
accepted date: 2017-02-13
in scheme: emissions_variables_MMR

2.F.6.a [Emissive][no classification][Emissions][HFC-365mfc][t][no source][no method][no target][no option][no type]
type: Concept
definition: 2.F.6.a [Emissive][no classification][Emissions][HFC-365mfc][t][no source][no method][no target][no option][no type]
status: valid
status modified: 2017-02-13
accepted date: 2017-02-13
in scheme: emissions_variables_MMR

2.F.6.a [Emissive][no classification][Emissions][HFC-41][t][no source][no method][no target][no option][no type]
type: Concept
definition: 2.F.6.a [Emissive][no classification][Emissions][HFC-41][t][no source][no method][no target][no option][no type]
status: valid
status modified: 2017-02-13
accepted date: 2017-02-13
in scheme: emissions_variables_MMR

2.F.6.a [Emissive][no classification][Emissions][HFC-43-10mee][t][From manufacturing][no method][no target][no option][no type]
type: Concept
definition: 2.F.6.a [Emissive][no classification][Emissions][HFC-43-10mee][t][From manufacturing][no method][no target][no option][no type]
status: valid
status modified: 2017-02-13
accepted date: 2017-02-13
in scheme: emissions_variables_MMR

2.F.6.a [Emissive][no classification][Emissions][HFC-43-10mee][t][From stocks][no method][no target][no option][no type]
type: Concept
definition: 2.F.6.a [Emissive][no classification][Emissions][HFC-43-10mee][t][From stocks][no method][no target][no option][no type]
status: valid
status modified: 2017-02-13
accepted date: 2017-02-13
in scheme: emissions_variables_MMR

2.F.6.a [Emissive][no classification][Emissions][HFC-43-10mee][t][no source][no method][no target][no option][no type]
type: Concept
definition: 2.F.6.a [Emissive][no classification][Emissions][HFC-43-10mee][t][no source][no method][no target][no option][no type]
status: valid
status modified: 2017-02-13
accepted date: 2017-02-13
in scheme: emissions_variables_MMR

2.F.6.a [Emissive][no classification][Emissions][HFCs][t CO2 equivalent][no source][no method][no target][no option][no type]
type: Concept
definition: 2.F.6.a [Emissive][no classification][Emissions][HFCs][t CO2 equivalent][no source][no method][no target][no option][no type]
status: valid
status modified: 2017-02-13
accepted date: 2017-02-13
in scheme: emissions_variables_MMR

2.F.6.a [Emissive][no classification][Emissions][NF3][t][no source][no method][no target][no option][no type]
type: Concept
definition: 2.F.6.a [Emissive][no classification][Emissions][NF3][t][no source][no method][no target][no option][no type]
status: valid
status modified: 2017-02-13
accepted date: 2017-02-13
in scheme: emissions_variables_MMR

2.F.6.a [Emissive][no classification][Emissions][no gas][kt CO2 equivalent][no source][no method][no target][no option][no type]
type: Concept
definition: 2.F.6.a [Emissive][no classification][Emissions][no gas][kt CO2 equivalent][no source][no method][no target][no option][no type]
status: valid
status modified: 2017-02-13
accepted date: 2017-02-13
in scheme: emissions_variables_MMR

2.F.6.a [Emissive][no classification][Emissions][PFCs][t CO2 equivalent][no source][no method][no target][no option][no type]
type: Concept
definition: 2.F.6.a [Emissive][no classification][Emissions][PFCs][t CO2 equivalent][no source][no method][no target][no option][no type]
status: valid
status modified: 2017-02-13
accepted date: 2017-02-13
in scheme: emissions_variables_MMR

2.F.6.a [Emissive][no classification][Emissions][SF6][t][no source][no method][no target][no option][no type]
type: Concept
definition: 2.F.6.a [Emissive][no classification][Emissions][SF6][t][no source][no method][no target][no option][no type]
status: valid
status modified: 2017-02-13
accepted date: 2017-02-13
in scheme: emissions_variables_MMR

2.F.6.a [Emissive][no classification][Emissions][Unspecified mix of HFCs and PFCs][t CO2 equivalent][From manufacturing][no method][no target][no option][no type]
type: Concept
definition: 2.F.6.a [Emissive][no classification][Emissions][Unspecified mix of HFCs and PFCs][t CO2 equivalent][From manufacturing][no method][no target][no option][no type]
status: valid
status modified: 2017-02-13
accepted date: 2017-02-13
in scheme: emissions_variables_MMR

2.F.6.a [Emissive][no classification][Emissions][Unspecified mix of HFCs and PFCs][t CO2 equivalent][From stocks][no method][no target][no option][no type]
type: Concept
definition: 2.F.6.a [Emissive][no classification][Emissions][Unspecified mix of HFCs and PFCs][t CO2 equivalent][From stocks][no method][no target][no option][no type]
status: valid
status modified: 2017-02-13
accepted date: 2017-02-13
in scheme: emissions_variables_MMR

2.F.6.a [Emissive][no classification][Emissions][Unspecified mix of HFCs and PFCs][t CO2 equivalent][no source][no method][no target][no option][no type]
type: Concept
definition: 2.F.6.a [Emissive][no classification][Emissions][Unspecified mix of HFCs and PFCs][t CO2 equivalent][no source][no method][no target][no option][no type]
status: valid
status modified: 2017-02-13
accepted date: 2017-02-13
in scheme: emissions_variables_MMR

2.F.6.a [Emissive][no classification][Emissions][Unspecified mix of HFCs][t CO2 equivalent][From manufacturing][no method][no target][no option][no type]
type: Concept
definition: 2.F.6.a [Emissive][no classification][Emissions][Unspecified mix of HFCs][t CO2 equivalent][From manufacturing][no method][no target][no option][no type]
status: valid
status modified: 2017-02-13
accepted date: 2017-02-13
in scheme: emissions_variables_MMR

2.F.6.a [Emissive][no classification][Emissions][Unspecified mix of HFCs][t CO2 equivalent][From stocks][no method][no target][no option][no type]
type: Concept
definition: 2.F.6.a [Emissive][no classification][Emissions][Unspecified mix of HFCs][t CO2 equivalent][From stocks][no method][no target][no option][no type]
status: valid
status modified: 2017-02-13
accepted date: 2017-02-13
in scheme: emissions_variables_MMR

2.F.6.a [Emissive][no classification][Emissions][Unspecified mix of HFCs][t CO2 equivalent][no source][no method][no target][no option][no type]
type: Concept
definition: 2.F.6.a [Emissive][no classification][Emissions][Unspecified mix of HFCs][t CO2 equivalent][no source][no method][no target][no option][no type]
status: valid
status modified: 2017-02-13
accepted date: 2017-02-13
in scheme: emissions_variables_MMR

2.F.6.a [Emissive][no classification][Emissions][Unspecified mix of PFCs][t CO2 equivalent][no source][no method][no target][no option][no type]
type: Concept
definition: 2.F.6.a [Emissive][no classification][Emissions][Unspecified mix of PFCs][t CO2 equivalent][no source][no method][no target][no option][no type]
status: valid
status modified: 2017-02-13
accepted date: 2017-02-13
in scheme: emissions_variables_MMR

2.F.6.b [Contained][no classification][Emissions][Aggregate F-gases][t CO2 equivalent][no source][no method][no target][no option][no type]
type: Concept
definition: 2.F.6.b [Contained][no classification][Emissions][Aggregate F-gases][t CO2 equivalent][no source][no method][no target][no option][no type]
status: valid
status modified: 2017-02-13
accepted date: 2017-02-13
in scheme: emissions_variables_MMR

2.F.6.b [Contained][no classification][Emissions][C10F18][t][From disposal][no method][no target][no option][no type]
type: Concept
definition: 2.F.6.b [Contained][no classification][Emissions][C10F18][t][From disposal][no method][no target][no option][no type]
status: valid
status modified: 2017-02-13
accepted date: 2017-02-13
in scheme: emissions_variables_MMR

2.F.6.b [Contained][no classification][Emissions][C10F18][t][From manufacturing][no method][no target][no option][no type]
type: Concept
definition: 2.F.6.b [Contained][no classification][Emissions][C10F18][t][From manufacturing][no method][no target][no option][no type]
status: valid
status modified: 2017-02-13
accepted date: 2017-02-13
in scheme: emissions_variables_MMR

2.F.6.b [Contained][no classification][Emissions][C10F18][t][From stocks][no method][no target][no option][no type]
type: Concept
definition: 2.F.6.b [Contained][no classification][Emissions][C10F18][t][From stocks][no method][no target][no option][no type]
status: valid
status modified: 2017-02-13
accepted date: 2017-02-13
in scheme: emissions_variables_MMR

2.F.6.b [Contained][no classification][Emissions][C10F18][t][no source][no method][no target][no option][no type]
type: Concept
definition: 2.F.6.b [Contained][no classification][Emissions][C10F18][t][no source][no method][no target][no option][no type]
status: valid
status modified: 2017-02-13
accepted date: 2017-02-13
in scheme: emissions_variables_MMR

2.F.6.b [Contained][no classification][Emissions][C2F6][t][From disposal][no method][no target][no option][no type]
type: Concept
definition: 2.F.6.b [Contained][no classification][Emissions][C2F6][t][From disposal][no method][no target][no option][no type]
status: valid
status modified: 2017-02-13
accepted date: 2017-02-13
in scheme: emissions_variables_MMR

2.F.6.b [Contained][no classification][Emissions][C2F6][t][From manufacturing][no method][no target][no option][no type]
type: Concept
definition: 2.F.6.b [Contained][no classification][Emissions][C2F6][t][From manufacturing][no method][no target][no option][no type]
status: valid
status modified: 2017-02-13
accepted date: 2017-02-13
in scheme: emissions_variables_MMR

2.F.6.b [Contained][no classification][Emissions][C2F6][t][From stocks][no method][no target][no option][no type]
type: Concept
definition: 2.F.6.b [Contained][no classification][Emissions][C2F6][t][From stocks][no method][no target][no option][no type]
status: valid
status modified: 2017-02-13
accepted date: 2017-02-13
in scheme: emissions_variables_MMR

2.F.6.b [Contained][no classification][Emissions][C2F6][t][no source][no method][no target][no option][no type]
type: Concept
definition: 2.F.6.b [Contained][no classification][Emissions][C2F6][t][no source][no method][no target][no option][no type]
status: valid
status modified: 2017-02-13
accepted date: 2017-02-13
in scheme: emissions_variables_MMR

2.F.6.b [Contained][no classification][Emissions][C3F8][t][From disposal][no method][no target][no option][no type]
type: Concept
definition: 2.F.6.b [Contained][no classification][Emissions][C3F8][t][From disposal][no method][no target][no option][no type]
status: valid
status modified: 2017-02-13
accepted date: 2017-02-13
in scheme: emissions_variables_MMR

2.F.6.b [Contained][no classification][Emissions][C3F8][t][From manufacturing][no method][no target][no option][no type]
type: Concept
definition: 2.F.6.b [Contained][no classification][Emissions][C3F8][t][From manufacturing][no method][no target][no option][no type]
status: valid
status modified: 2017-02-13
accepted date: 2017-02-13
in scheme: emissions_variables_MMR

2.F.6.b [Contained][no classification][Emissions][C3F8][t][From stocks][no method][no target][no option][no type]
type: Concept
definition: 2.F.6.b [Contained][no classification][Emissions][C3F8][t][From stocks][no method][no target][no option][no type]
status: valid
status modified: 2017-02-13
accepted date: 2017-02-13
in scheme: emissions_variables_MMR

2.F.6.b [Contained][no classification][Emissions][C3F8][t][no source][no method][no target][no option][no type]
type: Concept
definition: 2.F.6.b [Contained][no classification][Emissions][C3F8][t][no source][no method][no target][no option][no type]
status: valid
status modified: 2017-02-13
accepted date: 2017-02-13
in scheme: emissions_variables_MMR

2.F.6.b [Contained][no classification][Emissions][C4F10][t][From disposal][no method][no target][no option][no type]
type: Concept
definition: 2.F.6.b [Contained][no classification][Emissions][C4F10][t][From disposal][no method][no target][no option][no type]
status: valid
status modified: 2017-02-13
accepted date: 2017-02-13
in scheme: emissions_variables_MMR

2.F.6.b [Contained][no classification][Emissions][C4F10][t][From manufacturing][no method][no target][no option][no type]
type: Concept
definition: 2.F.6.b [Contained][no classification][Emissions][C4F10][t][From manufacturing][no method][no target][no option][no type]
status: valid
status modified: 2017-02-13
accepted date: 2017-02-13
in scheme: emissions_variables_MMR

2.F.6.b [Contained][no classification][Emissions][C4F10][t][From stocks][no method][no target][no option][no type]
type: Concept
definition: 2.F.6.b [Contained][no classification][Emissions][C4F10][t][From stocks][no method][no target][no option][no type]
status: valid
status modified: 2017-02-13
accepted date: 2017-02-13
in scheme: emissions_variables_MMR

2.F.6.b [Contained][no classification][Emissions][C4F10][t][no source][no method][no target][no option][no type]
type: Concept
definition: 2.F.6.b [Contained][no classification][Emissions][C4F10][t][no source][no method][no target][no option][no type]
status: valid
status modified: 2017-02-13
accepted date: 2017-02-13
in scheme: emissions_variables_MMR

2.F.6.b [Contained][no classification][Emissions][C5F12][t][From disposal][no method][no target][no option][no type]
type: Concept
definition: 2.F.6.b [Contained][no classification][Emissions][C5F12][t][From disposal][no method][no target][no option][no type]
status: valid
status modified: 2017-02-13
accepted date: 2017-02-13
in scheme: emissions_variables_MMR

2.F.6.b [Contained][no classification][Emissions][C5F12][t][From manufacturing][no method][no target][no option][no type]
type: Concept
definition: 2.F.6.b [Contained][no classification][Emissions][C5F12][t][From manufacturing][no method][no target][no option][no type]
status: valid
status modified: 2017-02-13
accepted date: 2017-02-13
in scheme: emissions_variables_MMR

2.F.6.b [Contained][no classification][Emissions][C5F12][t][From stocks][no method][no target][no option][no type]
type: Concept
definition: 2.F.6.b [Contained][no classification][Emissions][C5F12][t][From stocks][no method][no target][no option][no type]
status: valid
status modified: 2017-02-13
accepted date: 2017-02-13
in scheme: emissions_variables_MMR

2.F.6.b [Contained][no classification][Emissions][C5F12][t][no source][no method][no target][no option][no type]
type: Concept
definition: 2.F.6.b [Contained][no classification][Emissions][C5F12][t][no source][no method][no target][no option][no type]
status: valid
status modified: 2017-02-13
accepted date: 2017-02-13
in scheme: emissions_variables_MMR

2.F.6.b [Contained][no classification][Emissions][C6F14][t][From disposal][no method][no target][no option][no type]
type: Concept
definition: 2.F.6.b [Contained][no classification][Emissions][C6F14][t][From disposal][no method][no target][no option][no type]
status: valid
status modified: 2017-02-13
accepted date: 2017-02-13
in scheme: emissions_variables_MMR

2.F.6.b [Contained][no classification][Emissions][C6F14][t][From manufacturing][no method][no target][no option][no type]
type: Concept
definition: 2.F.6.b [Contained][no classification][Emissions][C6F14][t][From manufacturing][no method][no target][no option][no type]
status: valid
status modified: 2017-02-13
accepted date: 2017-02-13
in scheme: emissions_variables_MMR

2.F.6.b [Contained][no classification][Emissions][C6F14][t][From stocks][no method][no target][no option][no type]
type: Concept
definition: 2.F.6.b [Contained][no classification][Emissions][C6F14][t][From stocks][no method][no target][no option][no type]
status: valid
status modified: 2017-02-13
accepted date: 2017-02-13
in scheme: emissions_variables_MMR

2.F.6.b [Contained][no classification][Emissions][C6F14][t][no source][no method][no target][no option][no type]
type: Concept
definition: 2.F.6.b [Contained][no classification][Emissions][C6F14][t][no source][no method][no target][no option][no type]
status: valid
status modified: 2017-02-13
accepted date: 2017-02-13
in scheme: emissions_variables_MMR

2.F.6.b [Contained][no classification][Emissions][c-C3F6][t][From disposal][no method][no target][no option][no type]
type: Concept
definition: 2.F.6.b [Contained][no classification][Emissions][c-C3F6][t][From disposal][no method][no target][no option][no type]
status: valid
status modified: 2017-02-13
accepted date: 2017-02-13
in scheme: emissions_variables_MMR

2.F.6.b [Contained][no classification][Emissions][c-C3F6][t][From manufacturing][no method][no target][no option][no type]
type: Concept
definition: 2.F.6.b [Contained][no classification][Emissions][c-C3F6][t][From manufacturing][no method][no target][no option][no type]
status: valid
status modified: 2017-02-13
accepted date: 2017-02-13
in scheme: emissions_variables_MMR

2.F.6.b [Contained][no classification][Emissions][c-C3F6][t][From stocks][no method][no target][no option][no type]
type: Concept
definition: 2.F.6.b [Contained][no classification][Emissions][c-C3F6][t][From stocks][no method][no target][no option][no type]
status: valid
status modified: 2017-02-13
accepted date: 2017-02-13
in scheme: emissions_variables_MMR

2.F.6.b [Contained][no classification][Emissions][c-C3F6][t][no source][no method][no target][no option][no type]
type: Concept
definition: 2.F.6.b [Contained][no classification][Emissions][c-C3F6][t][no source][no method][no target][no option][no type]
status: valid
status modified: 2017-02-13
accepted date: 2017-02-13
in scheme: emissions_variables_MMR

2.F.6.b [Contained][no classification][Emissions][c-C4F8][t][From disposal][no method][no target][no option][no type]
type: Concept
definition: 2.F.6.b [Contained][no classification][Emissions][c-C4F8][t][From disposal][no method][no target][no option][no type]
status: valid
status modified: 2017-02-13
accepted date: 2017-02-13
in scheme: emissions_variables_MMR

2.F.6.b [Contained][no classification][Emissions][c-C4F8][t][From manufacturing][no method][no target][no option][no type]
type: Concept
definition: 2.F.6.b [Contained][no classification][Emissions][c-C4F8][t][From manufacturing][no method][no target][no option][no type]
status: valid
status modified: 2017-02-13
accepted date: 2017-02-13
in scheme: emissions_variables_MMR

2.F.6.b [Contained][no classification][Emissions][c-C4F8][t][From stocks][no method][no target][no option][no type]
type: Concept
definition: 2.F.6.b [Contained][no classification][Emissions][c-C4F8][t][From stocks][no method][no target][no option][no type]
status: valid
status modified: 2017-02-13
accepted date: 2017-02-13
in scheme: emissions_variables_MMR

2.F.6.b [Contained][no classification][Emissions][c-C4F8][t][no source][no method][no target][no option][no type]
type: Concept
definition: 2.F.6.b [Contained][no classification][Emissions][c-C4F8][t][no source][no method][no target][no option][no type]
status: valid
status modified: 2017-02-13
accepted date: 2017-02-13
in scheme: emissions_variables_MMR

2.F.6.b [Contained][no classification][Emissions][CF4][t][From disposal][no method][no target][no option][no type]
type: Concept
definition: 2.F.6.b [Contained][no classification][Emissions][CF4][t][From disposal][no method][no target][no option][no type]
status: valid
status modified: 2017-02-13
accepted date: 2017-02-13
in scheme: emissions_variables_MMR

2.F.6.b [Contained][no classification][Emissions][CF4][t][From manufacturing][no method][no target][no option][no type]
type: Concept
definition: 2.F.6.b [Contained][no classification][Emissions][CF4][t][From manufacturing][no method][no target][no option][no type]
status: valid
status modified: 2017-02-13
accepted date: 2017-02-13
in scheme: emissions_variables_MMR

2.F.6.b [Contained][no classification][Emissions][CF4][t][From stocks][no method][no target][no option][no type]
type: Concept
definition: 2.F.6.b [Contained][no classification][Emissions][CF4][t][From stocks][no method][no target][no option][no type]
status: valid
status modified: 2017-02-13
accepted date: 2017-02-13
in scheme: emissions_variables_MMR

2.F.6.b [Contained][no classification][Emissions][CF4][t][no source][no method][no target][no option][no type]
type: Concept
definition: 2.F.6.b [Contained][no classification][Emissions][CF4][t][no source][no method][no target][no option][no type]
status: valid
status modified: 2017-02-13
accepted date: 2017-02-13
in scheme: emissions_variables_MMR

2.F.6.b [Contained][no classification][Emissions][HFC-125][t][From disposal][no method][no target][no option][no type]
type: Concept
definition: 2.F.6.b [Contained][no classification][Emissions][HFC-125][t][From disposal][no method][no target][no option][no type]
status: valid
status modified: 2017-02-13
accepted date: 2017-02-13
in scheme: emissions_variables_MMR

2.F.6.b [Contained][no classification][Emissions][HFC-125][t][From manufacturing][no method][no target][no option][no type]
type: Concept
definition: 2.F.6.b [Contained][no classification][Emissions][HFC-125][t][From manufacturing][no method][no target][no option][no type]
status: valid
status modified: 2017-02-13
accepted date: 2017-02-13
in scheme: emissions_variables_MMR

2.F.6.b [Contained][no classification][Emissions][HFC-125][t][From stocks][no method][no target][no option][no type]
type: Concept
definition: 2.F.6.b [Contained][no classification][Emissions][HFC-125][t][From stocks][no method][no target][no option][no type]
status: valid
status modified: 2017-02-13
accepted date: 2017-02-13
in scheme: emissions_variables_MMR

2.F.6.b [Contained][no classification][Emissions][HFC-125][t][no source][no method][no target][no option][no type]
type: Concept
definition: 2.F.6.b [Contained][no classification][Emissions][HFC-125][t][no source][no method][no target][no option][no type]
status: valid
status modified: 2017-02-13
accepted date: 2017-02-13
in scheme: emissions_variables_MMR

2.F.6.b [Contained][no classification][Emissions][HFC-134][t][From disposal][no method][no target][no option][no type]
type: Concept
definition: 2.F.6.b [Contained][no classification][Emissions][HFC-134][t][From disposal][no method][no target][no option][no type]
status: valid
status modified: 2017-02-13
accepted date: 2017-02-13
in scheme: emissions_variables_MMR

2.F.6.b [Contained][no classification][Emissions][HFC-134][t][From manufacturing][no method][no target][no option][no type]
type: Concept
definition: 2.F.6.b [Contained][no classification][Emissions][HFC-134][t][From manufacturing][no method][no target][no option][no type]
status: valid
status modified: 2017-02-13
accepted date: 2017-02-13
in scheme: emissions_variables_MMR

2.F.6.b [Contained][no classification][Emissions][HFC-134][t][From stocks][no method][no target][no option][no type]
type: Concept
definition: 2.F.6.b [Contained][no classification][Emissions][HFC-134][t][From stocks][no method][no target][no option][no type]
status: valid
status modified: 2017-02-13
accepted date: 2017-02-13
in scheme: emissions_variables_MMR

2.F.6.b [Contained][no classification][Emissions][HFC-134][t][no source][no method][no target][no option][no type]
type: Concept
definition: 2.F.6.b [Contained][no classification][Emissions][HFC-134][t][no source][no method][no target][no option][no type]
status: valid
status modified: 2017-02-13
accepted date: 2017-02-13
in scheme: emissions_variables_MMR

2.F.6.b [Contained][no classification][Emissions][HFC-134a][t][From disposal][no method][no target][no option][no type]
type: Concept
definition: 2.F.6.b [Contained][no classification][Emissions][HFC-134a][t][From disposal][no method][no target][no option][no type]
status: valid
status modified: 2017-02-13
accepted date: 2017-02-13
in scheme: emissions_variables_MMR

2.F.6.b [Contained][no classification][Emissions][HFC-134a][t][From manufacturing][no method][no target][no option][no type]
type: Concept
definition: 2.F.6.b [Contained][no classification][Emissions][HFC-134a][t][From manufacturing][no method][no target][no option][no type]
status: valid
status modified: 2017-02-13
accepted date: 2017-02-13
in scheme: emissions_variables_MMR

2.F.6.b [Contained][no classification][Emissions][HFC-134a][t][From stocks][no method][no target][no option][no type]
type: Concept
definition: 2.F.6.b [Contained][no classification][Emissions][HFC-134a][t][From stocks][no method][no target][no option][no type]
status: valid
status modified: 2017-02-13
accepted date: 2017-02-13
in scheme: emissions_variables_MMR

2.F.6.b [Contained][no classification][Emissions][HFC-134a][t][no source][no method][no target][no option][no type]
type: Concept
definition: 2.F.6.b [Contained][no classification][Emissions][HFC-134a][t][no source][no method][no target][no option][no type]
status: valid
status modified: 2017-02-13
accepted date: 2017-02-13
in scheme: emissions_variables_MMR

2.F.6.b [Contained][no classification][Emissions][HFC-143][t][From disposal][no method][no target][no option][no type]
type: Concept
definition: 2.F.6.b [Contained][no classification][Emissions][HFC-143][t][From disposal][no method][no target][no option][no type]
status: valid
status modified: 2017-02-13
accepted date: 2017-02-13
in scheme: emissions_variables_MMR

2.F.6.b [Contained][no classification][Emissions][HFC-143][t][From manufacturing][no method][no target][no option][no type]
type: Concept
definition: 2.F.6.b [Contained][no classification][Emissions][HFC-143][t][From manufacturing][no method][no target][no option][no type]
status: valid
status modified: 2017-02-13
accepted date: 2017-02-13
in scheme: emissions_variables_MMR

2.F.6.b [Contained][no classification][Emissions][HFC-143][t][From stocks][no method][no target][no option][no type]
type: Concept
definition: 2.F.6.b [Contained][no classification][Emissions][HFC-143][t][From stocks][no method][no target][no option][no type]
status: valid
status modified: 2017-02-13
accepted date: 2017-02-13
in scheme: emissions_variables_MMR

2.F.6.b [Contained][no classification][Emissions][HFC-143][t][no source][no method][no target][no option][no type]
type: Concept
definition: 2.F.6.b [Contained][no classification][Emissions][HFC-143][t][no source][no method][no target][no option][no type]
status: valid
status modified: 2017-02-13
accepted date: 2017-02-13
in scheme: emissions_variables_MMR

2.F.6.b [Contained][no classification][Emissions][HFC-143a][t][From disposal][no method][no target][no option][no type]
type: Concept
definition: 2.F.6.b [Contained][no classification][Emissions][HFC-143a][t][From disposal][no method][no target][no option][no type]
status: valid
status modified: 2017-02-13
accepted date: 2017-02-13
in scheme: emissions_variables_MMR

2.F.6.b [Contained][no classification][Emissions][HFC-143a][t][From manufacturing][no method][no target][no option][no type]
type: Concept
definition: 2.F.6.b [Contained][no classification][Emissions][HFC-143a][t][From manufacturing][no method][no target][no option][no type]
status: valid
status modified: 2017-02-13
accepted date: 2017-02-13
in scheme: emissions_variables_MMR

2.F.6.b [Contained][no classification][Emissions][HFC-143a][t][From stocks][no method][no target][no option][no type]
type: Concept
definition: 2.F.6.b [Contained][no classification][Emissions][HFC-143a][t][From stocks][no method][no target][no option][no type]
status: valid
status modified: 2017-02-13
accepted date: 2017-02-13
in scheme: emissions_variables_MMR

2.F.6.b [Contained][no classification][Emissions][HFC-143a][t][no source][no method][no target][no option][no type]
type: Concept
definition: 2.F.6.b [Contained][no classification][Emissions][HFC-143a][t][no source][no method][no target][no option][no type]
status: valid
status modified: 2017-02-13
accepted date: 2017-02-13
in scheme: emissions_variables_MMR

2.F.6.b [Contained][no classification][Emissions][HFC-152][t][From disposal][no method][no target][no option][no type]
type: Concept
definition: 2.F.6.b [Contained][no classification][Emissions][HFC-152][t][From disposal][no method][no target][no option][no type]
status: valid
status modified: 2017-02-13
accepted date: 2017-02-13
in scheme: emissions_variables_MMR

2.F.6.b [Contained][no classification][Emissions][HFC-152][t][From manufacturing][no method][no target][no option][no type]
type: Concept
definition: 2.F.6.b [Contained][no classification][Emissions][HFC-152][t][From manufacturing][no method][no target][no option][no type]
status: valid
status modified: 2017-02-13
accepted date: 2017-02-13
in scheme: emissions_variables_MMR

2.F.6.b [Contained][no classification][Emissions][HFC-152][t][From stocks][no method][no target][no option][no type]
type: Concept
definition: 2.F.6.b [Contained][no classification][Emissions][HFC-152][t][From stocks][no method][no target][no option][no type]
status: valid
status modified: 2017-02-13
accepted date: 2017-02-13
in scheme: emissions_variables_MMR

2.F.6.b [Contained][no classification][Emissions][HFC-152][t][no source][no method][no target][no option][no type]
type: Concept
definition: 2.F.6.b [Contained][no classification][Emissions][HFC-152][t][no source][no method][no target][no option][no type]
status: valid
status modified: 2017-02-13
accepted date: 2017-02-13
in scheme: emissions_variables_MMR

2.F.6.b [Contained][no classification][Emissions][HFC-152a][t][From disposal][no method][no target][no option][no type]
type: Concept
definition: 2.F.6.b [Contained][no classification][Emissions][HFC-152a][t][From disposal][no method][no target][no option][no type]
status: valid
status modified: 2017-02-13
accepted date: 2017-02-13
in scheme: emissions_variables_MMR

2.F.6.b [Contained][no classification][Emissions][HFC-152a][t][From manufacturing][no method][no target][no option][no type]
type: Concept
definition: 2.F.6.b [Contained][no classification][Emissions][HFC-152a][t][From manufacturing][no method][no target][no option][no type]
status: valid
status modified: 2017-02-13
accepted date: 2017-02-13
in scheme: emissions_variables_MMR

2.F.6.b [Contained][no classification][Emissions][HFC-152a][t][From stocks][no method][no target][no option][no type]
type: Concept
definition: 2.F.6.b [Contained][no classification][Emissions][HFC-152a][t][From stocks][no method][no target][no option][no type]
status: valid
status modified: 2017-02-13
accepted date: 2017-02-13
in scheme: emissions_variables_MMR

2.F.6.b [Contained][no classification][Emissions][HFC-152a][t][no source][no method][no target][no option][no type]
type: Concept
definition: 2.F.6.b [Contained][no classification][Emissions][HFC-152a][t][no source][no method][no target][no option][no type]
status: valid
status modified: 2017-02-13
accepted date: 2017-02-13
in scheme: emissions_variables_MMR

2.F.6.b [Contained][no classification][Emissions][HFC-161][t][From disposal][no method][no target][no option][no type]
type: Concept
definition: 2.F.6.b [Contained][no classification][Emissions][HFC-161][t][From disposal][no method][no target][no option][no type]
status: valid
status modified: 2017-02-13
accepted date: 2017-02-13
in scheme: emissions_variables_MMR

2.F.6.b [Contained][no classification][Emissions][HFC-161][t][From manufacturing][no method][no target][no option][no type]
type: Concept
definition: 2.F.6.b [Contained][no classification][Emissions][HFC-161][t][From manufacturing][no method][no target][no option][no type]
status: valid
status modified: 2017-02-13
accepted date: 2017-02-13
in scheme: emissions_variables_MMR

2.F.6.b [Contained][no classification][Emissions][HFC-161][t][From stocks][no method][no target][no option][no type]
type: Concept
definition: 2.F.6.b [Contained][no classification][Emissions][HFC-161][t][From stocks][no method][no target][no option][no type]
status: valid
status modified: 2017-02-13
accepted date: 2017-02-13
in scheme: emissions_variables_MMR

2.F.6.b [Contained][no classification][Emissions][HFC-161][t][no source][no method][no target][no option][no type]
type: Concept
definition: 2.F.6.b [Contained][no classification][Emissions][HFC-161][t][no source][no method][no target][no option][no type]
status: valid
status modified: 2017-02-13
accepted date: 2017-02-13
in scheme: emissions_variables_MMR

2.F.6.b [Contained][no classification][Emissions][HFC-227ea][t][From disposal][no method][no target][no option][no type]
type: Concept
definition: 2.F.6.b [Contained][no classification][Emissions][HFC-227ea][t][From disposal][no method][no target][no option][no type]
status: valid
status modified: 2017-02-13
accepted date: 2017-02-13
in scheme: emissions_variables_MMR

2.F.6.b [Contained][no classification][Emissions][HFC-227ea][t][From manufacturing][no method][no target][no option][no type]
type: Concept
definition: 2.F.6.b [Contained][no classification][Emissions][HFC-227ea][t][From manufacturing][no method][no target][no option][no type]
status: valid
status modified: 2017-02-13
accepted date: 2017-02-13
in scheme: emissions_variables_MMR

2.F.6.b [Contained][no classification][Emissions][HFC-227ea][t][From stocks][no method][no target][no option][no type]
type: Concept
definition: 2.F.6.b [Contained][no classification][Emissions][HFC-227ea][t][From stocks][no method][no target][no option][no type]
status: valid
status modified: 2017-02-13
accepted date: 2017-02-13
in scheme: emissions_variables_MMR

2.F.6.b [Contained][no classification][Emissions][HFC-227ea][t][no source][no method][no target][no option][no type]
type: Concept
definition: 2.F.6.b [Contained][no classification][Emissions][HFC-227ea][t][no source][no method][no target][no option][no type]
status: valid
status modified: 2017-02-13
accepted date: 2017-02-13
in scheme: emissions_variables_MMR

2.F.6.b [Contained][no classification][Emissions][HFC-23][t][From disposal][no method][no target][no option][no type]
type: Concept
definition: 2.F.6.b [Contained][no classification][Emissions][HFC-23][t][From disposal][no method][no target][no option][no type]
status: valid
status modified: 2017-02-13
accepted date: 2017-02-13
in scheme: emissions_variables_MMR

2.F.6.b [Contained][no classification][Emissions][HFC-23][t][From manufacturing][no method][no target][no option][no type]
type: Concept
definition: 2.F.6.b [Contained][no classification][Emissions][HFC-23][t][From manufacturing][no method][no target][no option][no type]
status: valid
status modified: 2017-02-13
accepted date: 2017-02-13
in scheme: emissions_variables_MMR

2.F.6.b [Contained][no classification][Emissions][HFC-23][t][From stocks][no method][no target][no option][no type]
type: Concept
definition: 2.F.6.b [Contained][no classification][Emissions][HFC-23][t][From stocks][no method][no target][no option][no type]
status: valid
status modified: 2017-02-13
accepted date: 2017-02-13
in scheme: emissions_variables_MMR

2.F.6.b [Contained][no classification][Emissions][HFC-23][t][no source][no method][no target][no option][no type]
type: Concept
definition: 2.F.6.b [Contained][no classification][Emissions][HFC-23][t][no source][no method][no target][no option][no type]
status: valid
status modified: 2017-02-13
accepted date: 2017-02-13
in scheme: emissions_variables_MMR

2.F.6.b [Contained][no classification][Emissions][HFC-236cb][t][From disposal][no method][no target][no option][no type]
type: Concept
definition: 2.F.6.b [Contained][no classification][Emissions][HFC-236cb][t][From disposal][no method][no target][no option][no type]
status: valid
status modified: 2017-02-13
accepted date: 2017-02-13
in scheme: emissions_variables_MMR

2.F.6.b [Contained][no classification][Emissions][HFC-236cb][t][From manufacturing][no method][no target][no option][no type]
type: Concept
definition: 2.F.6.b [Contained][no classification][Emissions][HFC-236cb][t][From manufacturing][no method][no target][no option][no type]
status: valid
status modified: 2017-02-13
accepted date: 2017-02-13
in scheme: emissions_variables_MMR

2.F.6.b [Contained][no classification][Emissions][HFC-236cb][t][From stocks][no method][no target][no option][no type]
type: Concept
definition: 2.F.6.b [Contained][no classification][Emissions][HFC-236cb][t][From stocks][no method][no target][no option][no type]
status: valid
status modified: 2017-02-13
accepted date: 2017-02-13
in scheme: emissions_variables_MMR

2.F.6.b [Contained][no classification][Emissions][HFC-236cb][t][no source][no method][no target][no option][no type]
type: Concept
definition: 2.F.6.b [Contained][no classification][Emissions][HFC-236cb][t][no source][no method][no target][no option][no type]
status: valid
status modified: 2017-02-13
accepted date: 2017-02-13
in scheme: emissions_variables_MMR

2.F.6.b [Contained][no classification][Emissions][HFC-236ea][t][From disposal][no method][no target][no option][no type]
type: Concept
definition: 2.F.6.b [Contained][no classification][Emissions][HFC-236ea][t][From disposal][no method][no target][no option][no type]
status: valid
status modified: 2017-02-13
accepted date: 2017-02-13
in scheme: emissions_variables_MMR

2.F.6.b [Contained][no classification][Emissions][HFC-236ea][t][From manufacturing][no method][no target][no option][no type]
type: Concept
definition: 2.F.6.b [Contained][no classification][Emissions][HFC-236ea][t][From manufacturing][no method][no target][no option][no type]
status: valid
status modified: 2017-02-13
accepted date: 2017-02-13
in scheme: emissions_variables_MMR

2.F.6.b [Contained][no classification][Emissions][HFC-236ea][t][From stocks][no method][no target][no option][no type]
type: Concept
definition: 2.F.6.b [Contained][no classification][Emissions][HFC-236ea][t][From stocks][no method][no target][no option][no type]
status: valid
status modified: 2017-02-13
accepted date: 2017-02-13
in scheme: emissions_variables_MMR

2.F.6.b [Contained][no classification][Emissions][HFC-236ea][t][no source][no method][no target][no option][no type]
type: Concept
definition: 2.F.6.b [Contained][no classification][Emissions][HFC-236ea][t][no source][no method][no target][no option][no type]
status: valid
status modified: 2017-02-13
accepted date: 2017-02-13
in scheme: emissions_variables_MMR

2.F.6.b [Contained][no classification][Emissions][HFC-236fa][t][From disposal][no method][no target][no option][no type]
type: Concept
definition: 2.F.6.b [Contained][no classification][Emissions][HFC-236fa][t][From disposal][no method][no target][no option][no type]
status: valid
status modified: 2017-02-13
accepted date: 2017-02-13
in scheme: emissions_variables_MMR

2.F.6.b [Contained][no classification][Emissions][HFC-236fa][t][From manufacturing][no method][no target][no option][no type]
type: Concept
definition: 2.F.6.b [Contained][no classification][Emissions][HFC-236fa][t][From manufacturing][no method][no target][no option][no type]
status: valid
status modified: 2017-02-13
accepted date: 2017-02-13
in scheme: emissions_variables_MMR

2.F.6.b [Contained][no classification][Emissions][HFC-236fa][t][From stocks][no method][no target][no option][no type]
type: Concept
definition: 2.F.6.b [Contained][no classification][Emissions][HFC-236fa][t][From stocks][no method][no target][no option][no type]
status: valid
status modified: 2017-02-13
accepted date: 2017-02-13
in scheme: emissions_variables_MMR

2.F.6.b [Contained][no classification][Emissions][HFC-236fa][t][no source][no method][no target][no option][no type]
type: Concept
definition: 2.F.6.b [Contained][no classification][Emissions][HFC-236fa][t][no source][no method][no target][no option][no type]
status: valid
status modified: 2017-02-13
accepted date: 2017-02-13
in scheme: emissions_variables_MMR

2.F.6.b [Contained][no classification][Emissions][HFC-245ca][t][From disposal][no method][no target][no option][no type]
type: Concept
definition: 2.F.6.b [Contained][no classification][Emissions][HFC-245ca][t][From disposal][no method][no target][no option][no type]
status: valid
status modified: 2017-02-13
accepted date: 2017-02-13
in scheme: emissions_variables_MMR

2.F.6.b [Contained][no classification][Emissions][HFC-245ca][t][From manufacturing][no method][no target][no option][no type]
type: Concept
definition: 2.F.6.b [Contained][no classification][Emissions][HFC-245ca][t][From manufacturing][no method][no target][no option][no type]
status: valid
status modified: 2017-02-13
accepted date: 2017-02-13
in scheme: emissions_variables_MMR

2.F.6.b [Contained][no classification][Emissions][HFC-245ca][t][From stocks][no method][no target][no option][no type]
type: Concept
definition: 2.F.6.b [Contained][no classification][Emissions][HFC-245ca][t][From stocks][no method][no target][no option][no type]
status: valid
status modified: 2017-02-13
accepted date: 2017-02-13
in scheme: emissions_variables_MMR

2.F.6.b [Contained][no classification][Emissions][HFC-245ca][t][no source][no method][no target][no option][no type]
type: Concept
definition: 2.F.6.b [Contained][no classification][Emissions][HFC-245ca][t][no source][no method][no target][no option][no type]
status: valid
status modified: 2017-02-13
accepted date: 2017-02-13
in scheme: emissions_variables_MMR

2.F.6.b [Contained][no classification][Emissions][HFC-245fa][t][From disposal][no method][no target][no option][no type]
type: Concept
definition: 2.F.6.b [Contained][no classification][Emissions][HFC-245fa][t][From disposal][no method][no target][no option][no type]
status: valid
status modified: 2017-02-13
accepted date: 2017-02-13
in scheme: emissions_variables_MMR

2.F.6.b [Contained][no classification][Emissions][HFC-245fa][t][From manufacturing][no method][no target][no option][no type]
type: Concept
definition: 2.F.6.b [Contained][no classification][Emissions][HFC-245fa][t][From manufacturing][no method][no target][no option][no type]
status: valid
status modified: 2017-02-13
accepted date: 2017-02-13
in scheme: emissions_variables_MMR

2.F.6.b [Contained][no classification][Emissions][HFC-245fa][t][From stocks][no method][no target][no option][no type]
type: Concept
definition: 2.F.6.b [Contained][no classification][Emissions][HFC-245fa][t][From stocks][no method][no target][no option][no type]
status: valid
status modified: 2017-02-13
accepted date: 2017-02-13
in scheme: emissions_variables_MMR

2.F.6.b [Contained][no classification][Emissions][HFC-245fa][t][no source][no method][no target][no option][no type]
type: Concept
definition: 2.F.6.b [Contained][no classification][Emissions][HFC-245fa][t][no source][no method][no target][no option][no type]
status: valid
status modified: 2017-02-13
accepted date: 2017-02-13
in scheme: emissions_variables_MMR

2.F.6.b [Contained][no classification][Emissions][HFC-32][t][From disposal][no method][no target][no option][no type]
type: Concept
definition: 2.F.6.b [Contained][no classification][Emissions][HFC-32][t][From disposal][no method][no target][no option][no type]
status: valid
status modified: 2017-02-13
accepted date: 2017-02-13
in scheme: emissions_variables_MMR

2.F.6.b [Contained][no classification][Emissions][HFC-32][t][From manufacturing][no method][no target][no option][no type]
type: Concept
definition: 2.F.6.b [Contained][no classification][Emissions][HFC-32][t][From manufacturing][no method][no target][no option][no type]
status: valid
status modified: 2017-02-13
accepted date: 2017-02-13
in scheme: emissions_variables_MMR

2.F.6.b [Contained][no classification][Emissions][HFC-32][t][From stocks][no method][no target][no option][no type]
type: Concept
definition: 2.F.6.b [Contained][no classification][Emissions][HFC-32][t][From stocks][no method][no target][no option][no type]
status: valid
status modified: 2017-02-13
accepted date: 2017-02-13
in scheme: emissions_variables_MMR

2.F.6.b [Contained][no classification][Emissions][HFC-32][t][no source][no method][no target][no option][no type]
type: Concept
definition: 2.F.6.b [Contained][no classification][Emissions][HFC-32][t][no source][no method][no target][no option][no type]
status: valid
status modified: 2017-02-13
accepted date: 2017-02-13
in scheme: emissions_variables_MMR

2.F.6.b [Contained][no classification][Emissions][HFC-365mfc][t][From disposal][no method][no target][no option][no type]
type: Concept
definition: 2.F.6.b [Contained][no classification][Emissions][HFC-365mfc][t][From disposal][no method][no target][no option][no type]
status: valid
status modified: 2017-02-13
accepted date: 2017-02-13
in scheme: emissions_variables_MMR

2.F.6.b [Contained][no classification][Emissions][HFC-365mfc][t][From manufacturing][no method][no target][no option][no type]
type: Concept
definition: 2.F.6.b [Contained][no classification][Emissions][HFC-365mfc][t][From manufacturing][no method][no target][no option][no type]
status: valid
status modified: 2017-02-13
accepted date: 2017-02-13
in scheme: emissions_variables_MMR

2.F.6.b [Contained][no classification][Emissions][HFC-365mfc][t][From stocks][no method][no target][no option][no type]
type: Concept
definition: 2.F.6.b [Contained][no classification][Emissions][HFC-365mfc][t][From stocks][no method][no target][no option][no type]
status: valid
status modified: 2017-02-13
accepted date: 2017-02-13
in scheme: emissions_variables_MMR

2.F.6.b [Contained][no classification][Emissions][HFC-365mfc][t][no source][no method][no target][no option][no type]
type: Concept
definition: 2.F.6.b [Contained][no classification][Emissions][HFC-365mfc][t][no source][no method][no target][no option][no type]
status: valid
status modified: 2017-02-13
accepted date: 2017-02-13
in scheme: emissions_variables_MMR

2.F.6.b [Contained][no classification][Emissions][HFC-41][t][From disposal][no method][no target][no option][no type]
type: Concept
definition: 2.F.6.b [Contained][no classification][Emissions][HFC-41][t][From disposal][no method][no target][no option][no type]
status: valid
status modified: 2017-02-13
accepted date: 2017-02-13
in scheme: emissions_variables_MMR

2.F.6.b [Contained][no classification][Emissions][HFC-41][t][From manufacturing][no method][no target][no option][no type]
type: Concept
definition: 2.F.6.b [Contained][no classification][Emissions][HFC-41][t][From manufacturing][no method][no target][no option][no type]
status: valid
status modified: 2017-02-13
accepted date: 2017-02-13
in scheme: emissions_variables_MMR

2.F.6.b [Contained][no classification][Emissions][HFC-41][t][From stocks][no method][no target][no option][no type]
type: Concept
definition: 2.F.6.b [Contained][no classification][Emissions][HFC-41][t][From stocks][no method][no target][no option][no type]
status: valid
status modified: 2017-02-13
accepted date: 2017-02-13
in scheme: emissions_variables_MMR

2.F.6.b [Contained][no classification][Emissions][HFC-41][t][no source][no method][no target][no option][no type]
type: Concept
definition: 2.F.6.b [Contained][no classification][Emissions][HFC-41][t][no source][no method][no target][no option][no type]
status: valid
status modified: 2017-02-13
accepted date: 2017-02-13
in scheme: emissions_variables_MMR

2.F.6.b [Contained][no classification][Emissions][HFC-43-10mee][t][From disposal][no method][no target][no option][no type]
type: Concept
definition: 2.F.6.b [Contained][no classification][Emissions][HFC-43-10mee][t][From disposal][no method][no target][no option][no type]
status: valid
status modified: 2017-02-13
accepted date: 2017-02-13
in scheme: emissions_variables_MMR

2.F.6.b [Contained][no classification][Emissions][HFC-43-10mee][t][From manufacturing][no method][no target][no option][no type]
type: Concept
definition: 2.F.6.b [Contained][no classification][Emissions][HFC-43-10mee][t][From manufacturing][no method][no target][no option][no type]
status: valid
status modified: 2017-02-13
accepted date: 2017-02-13
in scheme: emissions_variables_MMR

2.F.6.b [Contained][no classification][Emissions][HFC-43-10mee][t][From stocks][no method][no target][no option][no type]
type: Concept
definition: 2.F.6.b [Contained][no classification][Emissions][HFC-43-10mee][t][From stocks][no method][no target][no option][no type]
status: valid
status modified: 2017-02-13
accepted date: 2017-02-13
in scheme: emissions_variables_MMR

2.F.6.b [Contained][no classification][Emissions][HFC-43-10mee][t][no source][no method][no target][no option][no type]
type: Concept
definition: 2.F.6.b [Contained][no classification][Emissions][HFC-43-10mee][t][no source][no method][no target][no option][no type]
status: valid
status modified: 2017-02-13
accepted date: 2017-02-13
in scheme: emissions_variables_MMR

2.F.6.b [Contained][no classification][Emissions][HFCs and PFCs][t CO2 equivalent][no source][no method][no target][no option][no type]
type: Concept
definition: 2.F.6.b [Contained][no classification][Emissions][HFCs and PFCs][t CO2 equivalent][no source][no method][no target][no option][no type]
status: valid
status modified: 2017-02-13
accepted date: 2017-02-13
in scheme: emissions_variables_MMR

2.F.6.b [Contained][no classification][Emissions][HFCs][t CO2 equivalent][no source][no method][no target][no option][no type]
type: Concept
definition: 2.F.6.b [Contained][no classification][Emissions][HFCs][t CO2 equivalent][no source][no method][no target][no option][no type]
status: valid
status modified: 2017-02-13
accepted date: 2017-02-13
in scheme: emissions_variables_MMR

2.F.6.b [Contained][no classification][Emissions][NF3][t][From disposal][no method][no target][no option][no type]
type: Concept
definition: 2.F.6.b [Contained][no classification][Emissions][NF3][t][From disposal][no method][no target][no option][no type]
status: valid
status modified: 2017-02-13
accepted date: 2017-02-13
in scheme: emissions_variables_MMR

2.F.6.b [Contained][no classification][Emissions][NF3][t][From manufacturing][no method][no target][no option][no type]
type: Concept
definition: 2.F.6.b [Contained][no classification][Emissions][NF3][t][From manufacturing][no method][no target][no option][no type]
status: valid
status modified: 2017-02-13
accepted date: 2017-02-13
in scheme: emissions_variables_MMR

2.F.6.b [Contained][no classification][Emissions][NF3][t][From stocks][no method][no target][no option][no type]
type: Concept
definition: 2.F.6.b [Contained][no classification][Emissions][NF3][t][From stocks][no method][no target][no option][no type]
status: valid
status modified: 2017-02-13
accepted date: 2017-02-13
in scheme: emissions_variables_MMR

2.F.6.b [Contained][no classification][Emissions][NF3][t][no source][no method][no target][no option][no type]
type: Concept
definition: 2.F.6.b [Contained][no classification][Emissions][NF3][t][no source][no method][no target][no option][no type]
status: valid
status modified: 2017-02-13
accepted date: 2017-02-13
in scheme: emissions_variables_MMR

2.F.6.b [Contained][no classification][Emissions][PFCs][t CO2 equivalent][no source][no method][no target][no option][no type]
type: Concept
definition: 2.F.6.b [Contained][no classification][Emissions][PFCs][t CO2 equivalent][no source][no method][no target][no option][no type]
status: valid
status modified: 2017-02-13
accepted date: 2017-02-13
in scheme: emissions_variables_MMR

2.F.6.b [Contained][no classification][Emissions][SF6][t][From disposal][no method][no target][no option][no type]
type: Concept
definition: 2.F.6.b [Contained][no classification][Emissions][SF6][t][From disposal][no method][no target][no option][no type]
status: valid
status modified: 2017-02-13
accepted date: 2017-02-13
in scheme: emissions_variables_MMR

2.F.6.b [Contained][no classification][Emissions][SF6][t][From manufacturing][no method][no target][no option][no type]
type: Concept
definition: 2.F.6.b [Contained][no classification][Emissions][SF6][t][From manufacturing][no method][no target][no option][no type]
status: valid
status modified: 2017-02-13
accepted date: 2017-02-13
in scheme: emissions_variables_MMR

2.F.6.b [Contained][no classification][Emissions][SF6][t][From stocks][no method][no target][no option][no type]
type: Concept
definition: 2.F.6.b [Contained][no classification][Emissions][SF6][t][From stocks][no method][no target][no option][no type]
status: valid
status modified: 2017-02-13
accepted date: 2017-02-13
in scheme: emissions_variables_MMR

2.F.6.b [Contained][no classification][Emissions][SF6][t][no source][no method][no target][no option][no type]
type: Concept
definition: 2.F.6.b [Contained][no classification][Emissions][SF6][t][no source][no method][no target][no option][no type]
status: valid
status modified: 2017-02-13
accepted date: 2017-02-13
in scheme: emissions_variables_MMR

2.F.6.b [Contained][no classification][Emissions][Unspecified mix of HFCs and PFCs][t CO2 equivalent][From disposal][no method][no target][no option][no type]
type: Concept
definition: 2.F.6.b [Contained][no classification][Emissions][Unspecified mix of HFCs and PFCs][t CO2 equivalent][From disposal][no method][no target][no option][no type]
status: valid
status modified: 2017-02-13
accepted date: 2017-02-13
in scheme: emissions_variables_MMR

2.F.6.b [Contained][no classification][Emissions][Unspecified mix of HFCs and PFCs][t CO2 equivalent][From manufacturing][no method][no target][no option][no type]
type: Concept
definition: 2.F.6.b [Contained][no classification][Emissions][Unspecified mix of HFCs and PFCs][t CO2 equivalent][From manufacturing][no method][no target][no option][no type]
status: valid
status modified: 2017-02-13
accepted date: 2017-02-13
in scheme: emissions_variables_MMR

2.F.6.b [Contained][no classification][Emissions][Unspecified mix of HFCs and PFCs][t CO2 equivalent][From stocks][no method][no target][no option][no type]
type: Concept
definition: 2.F.6.b [Contained][no classification][Emissions][Unspecified mix of HFCs and PFCs][t CO2 equivalent][From stocks][no method][no target][no option][no type]
status: valid
status modified: 2017-02-13
accepted date: 2017-02-13
in scheme: emissions_variables_MMR

2.F.6.b [Contained][no classification][Emissions][Unspecified mix of HFCs and PFCs][t CO2 equivalent][no source][no method][no target][no option][no type]
type: Concept
definition: 2.F.6.b [Contained][no classification][Emissions][Unspecified mix of HFCs and PFCs][t CO2 equivalent][no source][no method][no target][no option][no type]
status: valid
status modified: 2017-02-13
accepted date: 2017-02-13
in scheme: emissions_variables_MMR

2.F.6.b [Contained][no classification][Emissions][Unspecified mix of HFCs][t CO2 equivalent][From disposal][no method][no target][no option][no type]
type: Concept
definition: 2.F.6.b [Contained][no classification][Emissions][Unspecified mix of HFCs][t CO2 equivalent][From disposal][no method][no target][no option][no type]
status: valid
status modified: 2017-02-13
accepted date: 2017-02-13
in scheme: emissions_variables_MMR

2.F.6.b [Contained][no classification][Emissions][Unspecified mix of HFCs][t CO2 equivalent][From manufacturing][no method][no target][no option][no type]
type: Concept
definition: 2.F.6.b [Contained][no classification][Emissions][Unspecified mix of HFCs][t CO2 equivalent][From manufacturing][no method][no target][no option][no type]
status: valid
status modified: 2017-02-13
accepted date: 2017-02-13
in scheme: emissions_variables_MMR

2.F.6.b [Contained][no classification][Emissions][Unspecified mix of HFCs][t CO2 equivalent][From stocks][no method][no target][no option][no type]
type: Concept
definition: 2.F.6.b [Contained][no classification][Emissions][Unspecified mix of HFCs][t CO2 equivalent][From stocks][no method][no target][no option][no type]
status: valid
status modified: 2017-02-13
accepted date: 2017-02-13
in scheme: emissions_variables_MMR

2.F.6.b [Contained][no classification][Emissions][Unspecified mix of HFCs][t CO2 equivalent][no source][no method][no target][no option][no type]
type: Concept
definition: 2.F.6.b [Contained][no classification][Emissions][Unspecified mix of HFCs][t CO2 equivalent][no source][no method][no target][no option][no type]
status: valid
status modified: 2017-02-13
accepted date: 2017-02-13
in scheme: emissions_variables_MMR

2.F.6.b [Contained][no classification][Emissions][Unspecified mix of PFCs][t CO2 equivalent][From disposal][no method][no target][no option][no type]
type: Concept
definition: 2.F.6.b [Contained][no classification][Emissions][Unspecified mix of PFCs][t CO2 equivalent][From disposal][no method][no target][no option][no type]
status: valid
status modified: 2017-02-13
accepted date: 2017-02-13
in scheme: emissions_variables_MMR

2.F.6.b [Contained][no classification][Emissions][Unspecified mix of PFCs][t CO2 equivalent][From manufacturing][no method][no target][no option][no type]
type: Concept
definition: 2.F.6.b [Contained][no classification][Emissions][Unspecified mix of PFCs][t CO2 equivalent][From manufacturing][no method][no target][no option][no type]
status: valid
status modified: 2017-02-13
accepted date: 2017-02-13
in scheme: emissions_variables_MMR

2.F.6.b [Contained][no classification][Emissions][Unspecified mix of PFCs][t CO2 equivalent][From stocks][no method][no target][no option][no type]
type: Concept
definition: 2.F.6.b [Contained][no classification][Emissions][Unspecified mix of PFCs][t CO2 equivalent][From stocks][no method][no target][no option][no type]
status: valid
status modified: 2017-02-13
accepted date: 2017-02-13
in scheme: emissions_variables_MMR

2.F.6.b [Contained][no classification][Emissions][Unspecified mix of PFCs][t CO2 equivalent][no source][no method][no target][no option][no type]
type: Concept
definition: 2.F.6.b [Contained][no classification][Emissions][Unspecified mix of PFCs][t CO2 equivalent][no source][no method][no target][no option][no type]
status: valid
status modified: 2017-02-13
accepted date: 2017-02-13
in scheme: emissions_variables_MMR

2.G [Other Product Manufacture and Use][no classification][Emissions][Aggregate F-gases][t CO2 equivalent][no source][no method][no target][no option][no type]
type: Concept
definition: 2.G [Other Product Manufacture and Use][no classification][Emissions][Aggregate F-gases][t CO2 equivalent][no source][no method][no target][no option][no type]
status: valid
status modified: 2017-02-13
accepted date: 2017-02-13
in scheme: emissions_variables_MMR

2.G [Other Product Manufacture and Use][no classification][Emissions][Aggregate GHGs][kt CO2 equivalent][no source][no method][no target][no option][no type]
type: Concept
definition: 2.G [Other Product Manufacture and Use][no classification][Emissions][Aggregate GHGs][kt CO2 equivalent][no source][no method][no target][no option][no type]
status: valid
status modified: 2017-02-13
accepted date: 2017-02-13
in scheme: emissions_variables_MMR

2.G [Other Product Manufacture and Use][no classification][Emissions][C10F18][t][no source][no method][no target][no option][no type]
type: Concept
definition: 2.G [Other Product Manufacture and Use][no classification][Emissions][C10F18][t][no source][no method][no target][no option][no type]
status: valid
status modified: 2017-02-13
accepted date: 2017-02-13
in scheme: emissions_variables_MMR

2.G [Other Product Manufacture and Use][no classification][Emissions][C2F6][t][no source][no method][no target][no option][no type]
type: Concept
definition: 2.G [Other Product Manufacture and Use][no classification][Emissions][C2F6][t][no source][no method][no target][no option][no type]
status: valid
status modified: 2017-02-13
accepted date: 2017-02-13
in scheme: emissions_variables_MMR

2.G [Other Product Manufacture and Use][no classification][Emissions][C3F8][t][no source][no method][no target][no option][no type]
type: Concept
definition: 2.G [Other Product Manufacture and Use][no classification][Emissions][C3F8][t][no source][no method][no target][no option][no type]
status: valid
status modified: 2017-02-13
accepted date: 2017-02-13
in scheme: emissions_variables_MMR

2.G [Other Product Manufacture and Use][no classification][Emissions][C4F10][t][no source][no method][no target][no option][no type]
type: Concept
definition: 2.G [Other Product Manufacture and Use][no classification][Emissions][C4F10][t][no source][no method][no target][no option][no type]
status: valid
status modified: 2017-02-13
accepted date: 2017-02-13
in scheme: emissions_variables_MMR

2.G [Other Product Manufacture and Use][no classification][Emissions][C5F12][t][no source][no method][no target][no option][no type]
type: Concept
definition: 2.G [Other Product Manufacture and Use][no classification][Emissions][C5F12][t][no source][no method][no target][no option][no type]
status: valid
status modified: 2017-02-13
accepted date: 2017-02-13
in scheme: emissions_variables_MMR

2.G [Other Product Manufacture and Use][no classification][Emissions][C6F14][t][no source][no method][no target][no option][no type]
type: Concept
definition: 2.G [Other Product Manufacture and Use][no classification][Emissions][C6F14][t][no source][no method][no target][no option][no type]
status: valid
status modified: 2017-02-13
accepted date: 2017-02-13
in scheme: emissions_variables_MMR

2.G [Other Product Manufacture and Use][no classification][Emissions][c-C3F6][t][no source][no method][no target][no option][no type]
type: Concept
definition: 2.G [Other Product Manufacture and Use][no classification][Emissions][c-C3F6][t][no source][no method][no target][no option][no type]
status: valid
status modified: 2017-02-13
accepted date: 2017-02-13
in scheme: emissions_variables_MMR

2.G [Other Product Manufacture and Use][no classification][Emissions][c-C4F8][t][no source][no method][no target][no option][no type]
type: Concept
definition: 2.G [Other Product Manufacture and Use][no classification][Emissions][c-C4F8][t][no source][no method][no target][no option][no type]
status: valid
status modified: 2017-02-13
accepted date: 2017-02-13
in scheme: emissions_variables_MMR

2.G [Other Product Manufacture and Use][no classification][Emissions][CF4][t][no source][no method][no target][no option][no type]
type: Concept
definition: 2.G [Other Product Manufacture and Use][no classification][Emissions][CF4][t][no source][no method][no target][no option][no type]
status: valid
status modified: 2017-02-13
accepted date: 2017-02-13
in scheme: emissions_variables_MMR

2.G [Other Product Manufacture and Use][no classification][Emissions][CH4][kt][no source][no method][no target][no option][no type]
type: Concept
definition: 2.G [Other Product Manufacture and Use][no classification][Emissions][CH4][kt][no source][no method][no target][no option][no type]
status: valid
status modified: 2017-02-13
accepted date: 2017-02-13
in scheme: emissions_variables_MMR

2.G [Other Product Manufacture and Use][no classification][Emissions][CO][kt][no source][no method][no target][no option][no type]
type: Concept
definition: 2.G [Other Product Manufacture and Use][no classification][Emissions][CO][kt][no source][no method][no target][no option][no type]
status: valid
status modified: 2017-02-13
accepted date: 2017-02-13
in scheme: emissions_variables_MMR

2.G [Other Product Manufacture and Use][no classification][Emissions][CO2][kt][no source][no method][no target][no option][no type]
type: Concept
definition: 2.G [Other Product Manufacture and Use][no classification][Emissions][CO2][kt][no source][no method][no target][no option][no type]
status: valid
status modified: 2017-02-13
accepted date: 2017-02-13
in scheme: emissions_variables_MMR

2.G [Other Product Manufacture and Use][no classification][Emissions][HFC-125][t][no source][no method][no target][no option][no type]
type: Concept
definition: 2.G [Other Product Manufacture and Use][no classification][Emissions][HFC-125][t][no source][no method][no target][no option][no type]
status: valid
status modified: 2017-02-13
accepted date: 2017-02-13
in scheme: emissions_variables_MMR

2.G [Other Product Manufacture and Use][no classification][Emissions][HFC-134][t][no source][no method][no target][no option][no type]
type: Concept
definition: 2.G [Other Product Manufacture and Use][no classification][Emissions][HFC-134][t][no source][no method][no target][no option][no type]
status: valid
status modified: 2017-02-13
accepted date: 2017-02-13
in scheme: emissions_variables_MMR

2.G [Other Product Manufacture and Use][no classification][Emissions][HFC-134a][t][no source][no method][no target][no option][no type]
type: Concept
definition: 2.G [Other Product Manufacture and Use][no classification][Emissions][HFC-134a][t][no source][no method][no target][no option][no type]
status: valid
status modified: 2017-02-13
accepted date: 2017-02-13
in scheme: emissions_variables_MMR

2.G [Other Product Manufacture and Use][no classification][Emissions][HFC-143][t][no source][no method][no target][no option][no type]
type: Concept
definition: 2.G [Other Product Manufacture and Use][no classification][Emissions][HFC-143][t][no source][no method][no target][no option][no type]
status: valid
status modified: 2017-02-13
accepted date: 2017-02-13
in scheme: emissions_variables_MMR

2.G [Other Product Manufacture and Use][no classification][Emissions][HFC-143a][t][no source][no method][no target][no option][no type]
type: Concept
definition: 2.G [Other Product Manufacture and Use][no classification][Emissions][HFC-143a][t][no source][no method][no target][no option][no type]
status: valid
status modified: 2017-02-13
accepted date: 2017-02-13
in scheme: emissions_variables_MMR

2.G [Other Product Manufacture and Use][no classification][Emissions][HFC-152][t][no source][no method][no target][no option][no type]
type: Concept
definition: 2.G [Other Product Manufacture and Use][no classification][Emissions][HFC-152][t][no source][no method][no target][no option][no type]
status: valid
status modified: 2017-02-13
accepted date: 2017-02-13
in scheme: emissions_variables_MMR

2.G [Other Product Manufacture and Use][no classification][Emissions][HFC-152a][t][no source][no method][no target][no option][no type]
type: Concept
definition: 2.G [Other Product Manufacture and Use][no classification][Emissions][HFC-152a][t][no source][no method][no target][no option][no type]
status: valid
status modified: 2017-02-13
accepted date: 2017-02-13
in scheme: emissions_variables_MMR

2.G [Other Product Manufacture and Use][no classification][Emissions][HFC-161][t][no source][no method][no target][no option][no type]
type: Concept
definition: 2.G [Other Product Manufacture and Use][no classification][Emissions][HFC-161][t][no source][no method][no target][no option][no type]
status: valid
status modified: 2017-02-13
accepted date: 2017-02-13
in scheme: emissions_variables_MMR

2.G [Other Product Manufacture and Use][no classification][Emissions][HFC-227ea][t][no source][no method][no target][no option][no type]
type: Concept
definition: 2.G [Other Product Manufacture and Use][no classification][Emissions][HFC-227ea][t][no source][no method][no target][no option][no type]
status: valid
status modified: 2017-02-13
accepted date: 2017-02-13
in scheme: emissions_variables_MMR

2.G [Other Product Manufacture and Use][no classification][Emissions][HFC-23][t][no source][no method][no target][no option][no type]
type: Concept
definition: 2.G [Other Product Manufacture and Use][no classification][Emissions][HFC-23][t][no source][no method][no target][no option][no type]
status: valid
status modified: 2017-02-13
accepted date: 2017-02-13
in scheme: emissions_variables_MMR

2.G [Other Product Manufacture and Use][no classification][Emissions][HFC-236cb][t][no source][no method][no target][no option][no type]
type: Concept
definition: 2.G [Other Product Manufacture and Use][no classification][Emissions][HFC-236cb][t][no source][no method][no target][no option][no type]
status: valid
status modified: 2017-02-13
accepted date: 2017-02-13
in scheme: emissions_variables_MMR

2.G [Other Product Manufacture and Use][no classification][Emissions][HFC-236ea][t][no source][no method][no target][no option][no type]
type: Concept
definition: 2.G [Other Product Manufacture and Use][no classification][Emissions][HFC-236ea][t][no source][no method][no target][no option][no type]
status: valid
status modified: 2017-02-13
accepted date: 2017-02-13
in scheme: emissions_variables_MMR

2.G [Other Product Manufacture and Use][no classification][Emissions][HFC-236fa][t][no source][no method][no target][no option][no type]
type: Concept
definition: 2.G [Other Product Manufacture and Use][no classification][Emissions][HFC-236fa][t][no source][no method][no target][no option][no type]
status: valid
status modified: 2017-02-13
accepted date: 2017-02-13
in scheme: emissions_variables_MMR

2.G [Other Product Manufacture and Use][no classification][Emissions][HFC-245ca][t][no source][no method][no target][no option][no type]
type: Concept
definition: 2.G [Other Product Manufacture and Use][no classification][Emissions][HFC-245ca][t][no source][no method][no target][no option][no type]
status: valid
status modified: 2017-02-13
accepted date: 2017-02-13
in scheme: emissions_variables_MMR

2.G [Other Product Manufacture and Use][no classification][Emissions][HFC-245fa][t][no source][no method][no target][no option][no type]
type: Concept
definition: 2.G [Other Product Manufacture and Use][no classification][Emissions][HFC-245fa][t][no source][no method][no target][no option][no type]
status: valid
status modified: 2017-02-13
accepted date: 2017-02-13
in scheme: emissions_variables_MMR

2.G [Other Product Manufacture and Use][no classification][Emissions][HFC-32][t][no source][no method][no target][no option][no type]
type: Concept
definition: 2.G [Other Product Manufacture and Use][no classification][Emissions][HFC-32][t][no source][no method][no target][no option][no type]
status: valid
status modified: 2017-02-13
accepted date: 2017-02-13
in scheme: emissions_variables_MMR

2.G [Other Product Manufacture and Use][no classification][Emissions][HFC-365mfc][t][no source][no method][no target][no option][no type]
type: Concept
definition: 2.G [Other Product Manufacture and Use][no classification][Emissions][HFC-365mfc][t][no source][no method][no target][no option][no type]
status: valid
status modified: 2017-02-13
accepted date: 2017-02-13
in scheme: emissions_variables_MMR

2.G [Other Product Manufacture and Use][no classification][Emissions][HFC-41][t][no source][no method][no target][no option][no type]
type: Concept
definition: 2.G [Other Product Manufacture and Use][no classification][Emissions][HFC-41][t][no source][no method][no target][no option][no type]
status: valid
status modified: 2017-02-13
accepted date: 2017-02-13
in scheme: emissions_variables_MMR

2.G [Other Product Manufacture and Use][no classification][Emissions][HFC-43-10mee][t][no source][no method][no target][no option][no type]
type: Concept
definition: 2.G [Other Product Manufacture and Use][no classification][Emissions][HFC-43-10mee][t][no source][no method][no target][no option][no type]
status: valid
status modified: 2017-02-13
accepted date: 2017-02-13
in scheme: emissions_variables_MMR

2.G [Other Product Manufacture and Use][no classification][Emissions][HFCs][t CO2 equivalent][no source][no method][no target][no option][no type]
type: Concept
definition: 2.G [Other Product Manufacture and Use][no classification][Emissions][HFCs][t CO2 equivalent][no source][no method][no target][no option][no type]
status: valid
status modified: 2017-02-13
accepted date: 2017-02-13
in scheme: emissions_variables_MMR

2.G [Other Product Manufacture and Use][no classification][Emissions][N2O][kt][no source][no method][no target][no option][no type]
type: Concept
definition: 2.G [Other Product Manufacture and Use][no classification][Emissions][N2O][kt][no source][no method][no target][no option][no type]
status: valid
status modified: 2017-02-13
accepted date: 2017-02-13
in scheme: emissions_variables_MMR

2.G [Other Product Manufacture and Use][no classification][Emissions][NF3][kt][no source][no method][no target][no option][no type]
type: Concept
definition: 2.G [Other Product Manufacture and Use][no classification][Emissions][NF3][kt][no source][no method][no target][no option][no type]
status: valid
status modified: 2017-02-13
accepted date: 2017-02-13
in scheme: emissions_variables_MMR

2.G [Other Product Manufacture and Use][no classification][Emissions][NMVOC][kt][no source][no method][no target][no option][no type]
type: Concept
definition: 2.G [Other Product Manufacture and Use][no classification][Emissions][NMVOC][kt][no source][no method][no target][no option][no type]
status: valid
status modified: 2017-02-13
accepted date: 2017-02-13
in scheme: emissions_variables_MMR

2.G [Other Product Manufacture and Use][no classification][Emissions][NOx][kt][no source][no method][no target][no option][no type]
type: Concept
definition: 2.G [Other Product Manufacture and Use][no classification][Emissions][NOx][kt][no source][no method][no target][no option][no type]
status: valid
status modified: 2017-02-13
accepted date: 2017-02-13
in scheme: emissions_variables_MMR

2.G [Other Product Manufacture and Use][no classification][Emissions][PFCs][t CO2 equivalent][no source][no method][no target][no option][no type]
type: Concept
definition: 2.G [Other Product Manufacture and Use][no classification][Emissions][PFCs][t CO2 equivalent][no source][no method][no target][no option][no type]
status: valid
status modified: 2017-02-13
accepted date: 2017-02-13
in scheme: emissions_variables_MMR

2.G [Other Product Manufacture and Use][no classification][Emissions][SF6][kt][no source][no method][no target][no option][no type]
type: Concept
definition: 2.G [Other Product Manufacture and Use][no classification][Emissions][SF6][kt][no source][no method][no target][no option][no type]
status: valid
status modified: 2017-02-13
accepted date: 2017-02-13
in scheme: emissions_variables_MMR

2.G [Other Product Manufacture and Use][no classification][Emissions][SO2][kt][no source][no method][no target][no option][no type]
type: Concept
definition: 2.G [Other Product Manufacture and Use][no classification][Emissions][SO2][kt][no source][no method][no target][no option][no type]
status: valid
status modified: 2017-02-13
accepted date: 2017-02-13
in scheme: emissions_variables_MMR

2.G [Other Product Manufacture and Use][no classification][Emissions][Unspecified mix of HFCs and PFCs][t CO2 equivalent][no source][no method][no target][no option][no type]
type: Concept
definition: 2.G [Other Product Manufacture and Use][no classification][Emissions][Unspecified mix of HFCs and PFCs][t CO2 equivalent][no source][no method][no target][no option][no type]
status: valid
status modified: 2017-02-13
accepted date: 2017-02-13
in scheme: emissions_variables_MMR

2.G [Other Product Manufacture and Use][no classification][Emissions][Unspecified mix of HFCs][t CO2 equivalent][no source][no method][no target][no option][no type]
type: Concept
definition: 2.G [Other Product Manufacture and Use][no classification][Emissions][Unspecified mix of HFCs][t CO2 equivalent][no source][no method][no target][no option][no type]
status: valid
status modified: 2017-02-13
accepted date: 2017-02-13
in scheme: emissions_variables_MMR

2.G [Other Product Manufacture and Use][no classification][Emissions][Unspecified mix of PFCs][t CO2 equivalent][no source][no method][no target][no option][no type]
type: Concept
definition: 2.G [Other Product Manufacture and Use][no classification][Emissions][Unspecified mix of PFCs][t CO2 equivalent][no source][no method][no target][no option][no type]
status: valid
status modified: 2017-02-13
accepted date: 2017-02-13
in scheme: emissions_variables_MMR

2.G.1 [Electrical Equipment][no classification][Emissions][Aggregate F-gases][t CO2 equivalent][no source][no method][no target][no option][no type]
type: Concept
definition: 2.G.1 [Electrical Equipment][no classification][Emissions][Aggregate F-gases][t CO2 equivalent][no source][no method][no target][no option][no type]
status: valid
status modified: 2017-02-13
accepted date: 2017-02-13
in scheme: emissions_variables_MMR

2.G.1 [Electrical Equipment][no classification][Emissions][C10F18][t][From disposal][no method][no target][no option][no type]
type: Concept
definition: 2.G.1 [Electrical Equipment][no classification][Emissions][C10F18][t][From disposal][no method][no target][no option][no type]
status: valid
status modified: 2017-02-13
accepted date: 2017-02-13
in scheme: emissions_variables_MMR

2.G.1 [Electrical Equipment][no classification][Emissions][C10F18][t][From manufacturing][no method][no target][no option][no type]
type: Concept
definition: 2.G.1 [Electrical Equipment][no classification][Emissions][C10F18][t][From manufacturing][no method][no target][no option][no type]
status: valid
status modified: 2017-02-13
accepted date: 2017-02-13
in scheme: emissions_variables_MMR

2.G.1 [Electrical Equipment][no classification][Emissions][C10F18][t][From stocks][no method][no target][no option][no type]
type: Concept
definition: 2.G.1 [Electrical Equipment][no classification][Emissions][C10F18][t][From stocks][no method][no target][no option][no type]
status: valid
status modified: 2017-02-13
accepted date: 2017-02-13
in scheme: emissions_variables_MMR

2.G.1 [Electrical Equipment][no classification][Emissions][C10F18][t][no source][no method][no target][no option][no type]
type: Concept
definition: 2.G.1 [Electrical Equipment][no classification][Emissions][C10F18][t][no source][no method][no target][no option][no type]
status: valid
status modified: 2017-02-13
accepted date: 2017-02-13
in scheme: emissions_variables_MMR

2.G.1 [Electrical Equipment][no classification][Emissions][C2F6][t][From disposal][no method][no target][no option][no type]
type: Concept
definition: 2.G.1 [Electrical Equipment][no classification][Emissions][C2F6][t][From disposal][no method][no target][no option][no type]
status: valid
status modified: 2017-02-13
accepted date: 2017-02-13
in scheme: emissions_variables_MMR

2.G.1 [Electrical Equipment][no classification][Emissions][C2F6][t][From manufacturing][no method][no target][no option][no type]
type: Concept
definition: 2.G.1 [Electrical Equipment][no classification][Emissions][C2F6][t][From manufacturing][no method][no target][no option][no type]
status: valid
status modified: 2017-02-13
accepted date: 2017-02-13
in scheme: emissions_variables_MMR

2.G.1 [Electrical Equipment][no classification][Emissions][C2F6][t][From stocks][no method][no target][no option][no type]
type: Concept
definition: 2.G.1 [Electrical Equipment][no classification][Emissions][C2F6][t][From stocks][no method][no target][no option][no type]
status: valid
status modified: 2017-02-13
accepted date: 2017-02-13
in scheme: emissions_variables_MMR

2.G.1 [Electrical Equipment][no classification][Emissions][C2F6][t][no source][no method][no target][no option][no type]
type: Concept
definition: 2.G.1 [Electrical Equipment][no classification][Emissions][C2F6][t][no source][no method][no target][no option][no type]
status: valid
status modified: 2017-02-13
accepted date: 2017-02-13
in scheme: emissions_variables_MMR

2.G.1 [Electrical Equipment][no classification][Emissions][C3F8][t][From disposal][no method][no target][no option][no type]
type: Concept
definition: 2.G.1 [Electrical Equipment][no classification][Emissions][C3F8][t][From disposal][no method][no target][no option][no type]
status: valid
status modified: 2017-02-13
accepted date: 2017-02-13
in scheme: emissions_variables_MMR

2.G.1 [Electrical Equipment][no classification][Emissions][C3F8][t][From manufacturing][no method][no target][no option][no type]
type: Concept
definition: 2.G.1 [Electrical Equipment][no classification][Emissions][C3F8][t][From manufacturing][no method][no target][no option][no type]
status: valid
status modified: 2017-02-13
accepted date: 2017-02-13
in scheme: emissions_variables_MMR

2.G.1 [Electrical Equipment][no classification][Emissions][C3F8][t][From stocks][no method][no target][no option][no type]
type: Concept
definition: 2.G.1 [Electrical Equipment][no classification][Emissions][C3F8][t][From stocks][no method][no target][no option][no type]
status: valid
status modified: 2017-02-13
accepted date: 2017-02-13
in scheme: emissions_variables_MMR