IPCC_variables_MMR
type: ConceptScheme
notation: IPCC_variables_MMR
is part of: ghg
registration status: Released
user modified: demo_user
date modified: 2017-02-13 15:00:58.0
vocabulary type: Common
is numeric concept identifiers: false
is notations equal identifiers: false

1.A.1 [Energy Industries][Biomass][Emissions][CH4][kt][no source][no method][no target][no option][no type]
type: Concept
definition: 1.A.1 [Energy Industries][Biomass][Emissions][CH4][kt][no source][no method][no target][no option][no type]
status: valid
status modified: 2017-02-13
accepted date: 2017-02-13
in scheme: IPCC_variables_MMR

1.A.1 [Energy Industries][Biomass][Emissions][CO2][kt][no source][no method][no target][no option][no type]
type: Concept
definition: 1.A.1 [Energy Industries][Biomass][Emissions][CO2][kt][no source][no method][no target][no option][no type]
status: valid
status modified: 2017-02-13
accepted date: 2017-02-13
in scheme: IPCC_variables_MMR

1.A.1 [Energy Industries][Biomass][Emissions][N2O][kt][no source][no method][no target][no option][no type]
type: Concept
definition: 1.A.1 [Energy Industries][Biomass][Emissions][N2O][kt][no source][no method][no target][no option][no type]
status: valid
status modified: 2017-02-13
accepted date: 2017-02-13
in scheme: IPCC_variables_MMR

1.A.1 [Energy Industries][Fuels][Emissions][CH4][kt][no source][no method][no target][no option][no type]
type: Concept
definition: 1.A.1 [Energy Industries][Fuels][Emissions][CH4][kt][no source][no method][no target][no option][no type]
status: valid
status modified: 2017-02-13
accepted date: 2017-02-13
in scheme: IPCC_variables_MMR

1.A.1 [Energy Industries][Fuels][Emissions][CO2][kt][no source][no method][no target][no option][no type]
type: Concept
definition: 1.A.1 [Energy Industries][Fuels][Emissions][CO2][kt][no source][no method][no target][no option][no type]
status: valid
status modified: 2017-02-13
accepted date: 2017-02-13
in scheme: IPCC_variables_MMR

1.A.1 [Energy Industries][Fuels][Emissions][N2O][kt][no source][no method][no target][no option][no type]
type: Concept
definition: 1.A.1 [Energy Industries][Fuels][Emissions][N2O][kt][no source][no method][no target][no option][no type]
status: valid
status modified: 2017-02-13
accepted date: 2017-02-13
in scheme: IPCC_variables_MMR

1.A.1 [Energy Industries][Gaseous Fuels][Emissions][CH4][kt][no source][no method][no target][no option][no type]
type: Concept
definition: 1.A.1 [Energy Industries][Gaseous Fuels][Emissions][CH4][kt][no source][no method][no target][no option][no type]
status: valid
status modified: 2017-02-13
accepted date: 2017-02-13
in scheme: IPCC_variables_MMR

1.A.1 [Energy Industries][Gaseous Fuels][Emissions][CO2][kt][no source][no method][no target][no option][no type]
type: Concept
definition: 1.A.1 [Energy Industries][Gaseous Fuels][Emissions][CO2][kt][no source][no method][no target][no option][no type]
status: valid
status modified: 2017-02-13
accepted date: 2017-02-13
in scheme: IPCC_variables_MMR

1.A.1 [Energy Industries][Gaseous Fuels][Emissions][N2O][kt][no source][no method][no target][no option][no type]
type: Concept
definition: 1.A.1 [Energy Industries][Gaseous Fuels][Emissions][N2O][kt][no source][no method][no target][no option][no type]
status: valid
status modified: 2017-02-13
accepted date: 2017-02-13
in scheme: IPCC_variables_MMR

1.A.1 [Energy Industries][Liquid Fuels][Emissions][CH4][kt][no source][no method][no target][no option][no type]
type: Concept
definition: 1.A.1 [Energy Industries][Liquid Fuels][Emissions][CH4][kt][no source][no method][no target][no option][no type]
status: valid
status modified: 2017-02-13
accepted date: 2017-02-13
in scheme: IPCC_variables_MMR

1.A.1 [Energy Industries][Liquid Fuels][Emissions][CO2][kt][no source][no method][no target][no option][no type]
type: Concept
definition: 1.A.1 [Energy Industries][Liquid Fuels][Emissions][CO2][kt][no source][no method][no target][no option][no type]
status: valid
status modified: 2017-02-13
accepted date: 2017-02-13
in scheme: IPCC_variables_MMR

1.A.1 [Energy Industries][Liquid Fuels][Emissions][N2O][kt][no source][no method][no target][no option][no type]
type: Concept
definition: 1.A.1 [Energy Industries][Liquid Fuels][Emissions][N2O][kt][no source][no method][no target][no option][no type]
status: valid
status modified: 2017-02-13
accepted date: 2017-02-13
in scheme: IPCC_variables_MMR

1.A.1 [Energy Industries][Other Fossil Fuels][Emissions][CH4][kt][no source][no method][no target][no option][no type]
type: Concept
definition: 1.A.1 [Energy Industries][Other Fossil Fuels][Emissions][CH4][kt][no source][no method][no target][no option][no type]
status: valid
status modified: 2017-02-13
accepted date: 2017-02-13
in scheme: IPCC_variables_MMR

1.A.1 [Energy Industries][Other Fossil Fuels][Emissions][CO2][kt][no source][no method][no target][no option][no type]
type: Concept
definition: 1.A.1 [Energy Industries][Other Fossil Fuels][Emissions][CO2][kt][no source][no method][no target][no option][no type]
status: valid
status modified: 2017-02-13
accepted date: 2017-02-13
in scheme: IPCC_variables_MMR

1.A.1 [Energy Industries][Other Fossil Fuels][Emissions][N2O][kt][no source][no method][no target][no option][no type]
type: Concept
definition: 1.A.1 [Energy Industries][Other Fossil Fuels][Emissions][N2O][kt][no source][no method][no target][no option][no type]
status: valid
status modified: 2017-02-13
accepted date: 2017-02-13
in scheme: IPCC_variables_MMR

1.A.1 [Energy Industries][Peat][Emissions][CH4][kt][no source][no method][no target][no option][no type]
type: Concept
definition: 1.A.1 [Energy Industries][Peat][Emissions][CH4][kt][no source][no method][no target][no option][no type]
status: valid
status modified: 2017-02-13
accepted date: 2017-02-13
in scheme: IPCC_variables_MMR

1.A.1 [Energy Industries][Peat][Emissions][CO2][kt][no source][no method][no target][no option][no type]
type: Concept
definition: 1.A.1 [Energy Industries][Peat][Emissions][CO2][kt][no source][no method][no target][no option][no type]
status: valid
status modified: 2017-02-13
accepted date: 2017-02-13
in scheme: IPCC_variables_MMR

1.A.1 [Energy Industries][Peat][Emissions][N2O][kt][no source][no method][no target][no option][no type]
type: Concept
definition: 1.A.1 [Energy Industries][Peat][Emissions][N2O][kt][no source][no method][no target][no option][no type]
status: valid
status modified: 2017-02-13
accepted date: 2017-02-13
in scheme: IPCC_variables_MMR

1.A.1 [Energy Industries][Solid Fuels][Emissions][CH4][kt][no source][no method][no target][no option][no type]
type: Concept
definition: 1.A.1 [Energy Industries][Solid Fuels][Emissions][CH4][kt][no source][no method][no target][no option][no type]
status: valid
status modified: 2017-02-13
accepted date: 2017-02-13
in scheme: IPCC_variables_MMR

1.A.1 [Energy Industries][Solid Fuels][Emissions][CO2][kt][no source][no method][no target][no option][no type]
type: Concept
definition: 1.A.1 [Energy Industries][Solid Fuels][Emissions][CO2][kt][no source][no method][no target][no option][no type]
status: valid
status modified: 2017-02-13
accepted date: 2017-02-13
in scheme: IPCC_variables_MMR

1.A.1 [Energy Industries][Solid Fuels][Emissions][N2O][kt][no source][no method][no target][no option][no type]
type: Concept
definition: 1.A.1 [Energy Industries][Solid Fuels][Emissions][N2O][kt][no source][no method][no target][no option][no type]
status: valid
status modified: 2017-02-13
accepted date: 2017-02-13
in scheme: IPCC_variables_MMR

1.A.1.a [Public Electricity and Heat Production][Biomass][Emissions][CH4][kt][no source][no method][no target][no option][no type]
type: Concept
definition: 1.A.1.a [Public Electricity and Heat Production][Biomass][Emissions][CH4][kt][no source][no method][no target][no option][no type]
status: valid
status modified: 2017-02-13
accepted date: 2017-02-13
in scheme: IPCC_variables_MMR

1.A.1.a [Public Electricity and Heat Production][Biomass][Emissions][CO2][kt][no source][no method][no target][no option][no type]
type: Concept
definition: 1.A.1.a [Public Electricity and Heat Production][Biomass][Emissions][CO2][kt][no source][no method][no target][no option][no type]
status: valid
status modified: 2017-02-13
accepted date: 2017-02-13
in scheme: IPCC_variables_MMR

1.A.1.a [Public Electricity and Heat Production][Biomass][Emissions][N2O][kt][no source][no method][no target][no option][no type]
type: Concept
definition: 1.A.1.a [Public Electricity and Heat Production][Biomass][Emissions][N2O][kt][no source][no method][no target][no option][no type]
status: valid
status modified: 2017-02-13
accepted date: 2017-02-13
in scheme: IPCC_variables_MMR

1.A.1.a [Public Electricity and Heat Production][Fossil fuels][Emissions][CO2][kt][no source][no method][no target][no option][no type]
type: Concept
definition: 1.A.1.a [Public Electricity and Heat Production][Fossil fuels][Emissions][CO2][kt][no source][no method][no target][no option][no type]
status: valid
status modified: 2017-02-13
accepted date: 2017-02-13
in scheme: IPCC_variables_MMR

1.A.1.a [Public Electricity and Heat Production][Fuels][Emissions][CH4][kt][no source][no method][no target][no option][no type]
type: Concept
definition: 1.A.1.a [Public Electricity and Heat Production][Fuels][Emissions][CH4][kt][no source][no method][no target][no option][no type]
status: valid
status modified: 2017-02-13
accepted date: 2017-02-13
in scheme: IPCC_variables_MMR

1.A.1.a [Public Electricity and Heat Production][Fuels][Emissions][N2O][kt][no source][no method][no target][no option][no type]
type: Concept
definition: 1.A.1.a [Public Electricity and Heat Production][Fuels][Emissions][N2O][kt][no source][no method][no target][no option][no type]
status: valid
status modified: 2017-02-13
accepted date: 2017-02-13
in scheme: IPCC_variables_MMR

1.A.1.a [Public Electricity and Heat Production][Gaseous Fuels][Emissions][CH4][kt][no source][no method][no target][no option][no type]
type: Concept
definition: 1.A.1.a [Public Electricity and Heat Production][Gaseous Fuels][Emissions][CH4][kt][no source][no method][no target][no option][no type]
status: valid
status modified: 2017-02-13
accepted date: 2017-02-13
in scheme: IPCC_variables_MMR

1.A.1.a [Public Electricity and Heat Production][Gaseous Fuels][Emissions][CO2][kt][no source][no method][no target][no option][no type]
type: Concept
definition: 1.A.1.a [Public Electricity and Heat Production][Gaseous Fuels][Emissions][CO2][kt][no source][no method][no target][no option][no type]
status: valid
status modified: 2017-02-13
accepted date: 2017-02-13
in scheme: IPCC_variables_MMR

1.A.1.a [Public Electricity and Heat Production][Gaseous Fuels][Emissions][N2O][kt][no source][no method][no target][no option][no type]
type: Concept
definition: 1.A.1.a [Public Electricity and Heat Production][Gaseous Fuels][Emissions][N2O][kt][no source][no method][no target][no option][no type]
status: valid
status modified: 2017-02-13
accepted date: 2017-02-13
in scheme: IPCC_variables_MMR

1.A.1.a [Public Electricity and Heat Production][Liquid Fuels][Emissions][CH4][kt][no source][no method][no target][no option][no type]
type: Concept
definition: 1.A.1.a [Public Electricity and Heat Production][Liquid Fuels][Emissions][CH4][kt][no source][no method][no target][no option][no type]
status: valid
status modified: 2017-02-13
accepted date: 2017-02-13
in scheme: IPCC_variables_MMR

1.A.1.a [Public Electricity and Heat Production][Liquid Fuels][Emissions][CO2][kt][no source][no method][no target][no option][no type]
type: Concept
definition: 1.A.1.a [Public Electricity and Heat Production][Liquid Fuels][Emissions][CO2][kt][no source][no method][no target][no option][no type]
status: valid
status modified: 2017-02-13
accepted date: 2017-02-13
in scheme: IPCC_variables_MMR

1.A.1.a [Public Electricity and Heat Production][Liquid Fuels][Emissions][N2O][kt][no source][no method][no target][no option][no type]
type: Concept
definition: 1.A.1.a [Public Electricity and Heat Production][Liquid Fuels][Emissions][N2O][kt][no source][no method][no target][no option][no type]
status: valid
status modified: 2017-02-13
accepted date: 2017-02-13
in scheme: IPCC_variables_MMR

1.A.1.a [Public Electricity and Heat Production][Other Fossil Fuels][Emissions][CH4][kt][no source][no method][no target][no option][no type]
type: Concept
definition: 1.A.1.a [Public Electricity and Heat Production][Other Fossil Fuels][Emissions][CH4][kt][no source][no method][no target][no option][no type]
status: valid
status modified: 2017-02-13
accepted date: 2017-02-13
in scheme: IPCC_variables_MMR

1.A.1.a [Public Electricity and Heat Production][Other Fossil Fuels][Emissions][CO2][kt][no source][no method][no target][no option][no type]
type: Concept
definition: 1.A.1.a [Public Electricity and Heat Production][Other Fossil Fuels][Emissions][CO2][kt][no source][no method][no target][no option][no type]
status: valid
status modified: 2017-02-13
accepted date: 2017-02-13
in scheme: IPCC_variables_MMR

1.A.1.a [Public Electricity and Heat Production][Other Fossil Fuels][Emissions][N2O][kt][no source][no method][no target][no option][no type]
type: Concept
definition: 1.A.1.a [Public Electricity and Heat Production][Other Fossil Fuels][Emissions][N2O][kt][no source][no method][no target][no option][no type]
status: valid
status modified: 2017-02-13
accepted date: 2017-02-13
in scheme: IPCC_variables_MMR

1.A.1.a [Public Electricity and Heat Production][Peat][Emissions][CH4][kt][no source][no method][no target][no option][no type]
type: Concept
definition: 1.A.1.a [Public Electricity and Heat Production][Peat][Emissions][CH4][kt][no source][no method][no target][no option][no type]
status: valid
status modified: 2017-02-13
accepted date: 2017-02-13
in scheme: IPCC_variables_MMR

1.A.1.a [Public Electricity and Heat Production][Peat][Emissions][CO2][kt][no source][no method][no target][no option][no type]
type: Concept
definition: 1.A.1.a [Public Electricity and Heat Production][Peat][Emissions][CO2][kt][no source][no method][no target][no option][no type]
status: valid
status modified: 2017-02-13
accepted date: 2017-02-13
in scheme: IPCC_variables_MMR

1.A.1.a [Public Electricity and Heat Production][Peat][Emissions][N2O][kt][no source][no method][no target][no option][no type]
type: Concept
definition: 1.A.1.a [Public Electricity and Heat Production][Peat][Emissions][N2O][kt][no source][no method][no target][no option][no type]
status: valid
status modified: 2017-02-13
accepted date: 2017-02-13
in scheme: IPCC_variables_MMR

1.A.1.a [Public Electricity and Heat Production][Solid Fuels][Emissions][CH4][kt][no source][no method][no target][no option][no type]
type: Concept
definition: 1.A.1.a [Public Electricity and Heat Production][Solid Fuels][Emissions][CH4][kt][no source][no method][no target][no option][no type]
status: valid
status modified: 2017-02-13
accepted date: 2017-02-13
in scheme: IPCC_variables_MMR

1.A.1.a [Public Electricity and Heat Production][Solid Fuels][Emissions][CO2][kt][no source][no method][no target][no option][no type]
type: Concept
definition: 1.A.1.a [Public Electricity and Heat Production][Solid Fuels][Emissions][CO2][kt][no source][no method][no target][no option][no type]
status: valid
status modified: 2017-02-13
accepted date: 2017-02-13
in scheme: IPCC_variables_MMR

1.A.1.a [Public Electricity and Heat Production][Solid Fuels][Emissions][N2O][kt][no source][no method][no target][no option][no type]
type: Concept
definition: 1.A.1.a [Public Electricity and Heat Production][Solid Fuels][Emissions][N2O][kt][no source][no method][no target][no option][no type]
status: valid
status modified: 2017-02-13
accepted date: 2017-02-13
in scheme: IPCC_variables_MMR

1.A.1.b [Petroleum Refining][Fuels][Emissions][CH4][kt][no source][no method][no target][no option][no type]
type: Concept
definition: 1.A.1.b [Petroleum Refining][Fuels][Emissions][CH4][kt][no source][no method][no target][no option][no type]
status: valid
status modified: 2017-02-13
accepted date: 2017-02-13
in scheme: IPCC_variables_MMR

1.A.1.b [Petroleum Refining][Fuels][Emissions][CO2][kt][no source][no method][no target][no option][no type]
type: Concept
definition: 1.A.1.b [Petroleum Refining][Fuels][Emissions][CO2][kt][no source][no method][no target][no option][no type]
status: valid
status modified: 2017-02-13
accepted date: 2017-02-13
in scheme: IPCC_variables_MMR

1.A.1.b [Petroleum Refining][Fuels][Emissions][N2O][kt][no source][no method][no target][no option][no type]
type: Concept
definition: 1.A.1.b [Petroleum Refining][Fuels][Emissions][N2O][kt][no source][no method][no target][no option][no type]
status: valid
status modified: 2017-02-13
accepted date: 2017-02-13
in scheme: IPCC_variables_MMR

1.A.1.b Biomass [Petroleum Refining][Biomass][Emissions][CH4][kt][no source][no method][no target][no option][no type]
type: Concept
definition: 1.A.1.b Biomass [Petroleum Refining][Biomass][Emissions][CH4][kt][no source][no method][no target][no option][no type]
status: valid
status modified: 2017-02-13
accepted date: 2017-02-13
in scheme: IPCC_variables_MMR

1.A.1.b Biomass [Petroleum Refining][Biomass][Emissions][CO2][kt][no source][no method][no target][no option][no type]
type: Concept
definition: 1.A.1.b Biomass [Petroleum Refining][Biomass][Emissions][CO2][kt][no source][no method][no target][no option][no type]
status: valid
status modified: 2017-02-13
accepted date: 2017-02-13
in scheme: IPCC_variables_MMR

1.A.1.b Biomass [Petroleum Refining][Biomass][Emissions][N2O][kt][no source][no method][no target][no option][no type]
type: Concept
definition: 1.A.1.b Biomass [Petroleum Refining][Biomass][Emissions][N2O][kt][no source][no method][no target][no option][no type]
status: valid
status modified: 2017-02-13
accepted date: 2017-02-13
in scheme: IPCC_variables_MMR

1.A.1.b Gaseous Fuels [Petroleum Refining][Gaseous Fuels][Emissions][CH4][kt][no source][no method][no target][no option][no type]
type: Concept
definition: 1.A.1.b Gaseous Fuels [Petroleum Refining][Gaseous Fuels][Emissions][CH4][kt][no source][no method][no target][no option][no type]
status: valid
status modified: 2017-02-13
accepted date: 2017-02-13
in scheme: IPCC_variables_MMR

1.A.1.b Gaseous Fuels [Petroleum Refining][Gaseous Fuels][Emissions][CO2][kt][no source][no method][no target][no option][no type]
type: Concept
definition: 1.A.1.b Gaseous Fuels [Petroleum Refining][Gaseous Fuels][Emissions][CO2][kt][no source][no method][no target][no option][no type]
status: valid
status modified: 2017-02-13
accepted date: 2017-02-13
in scheme: IPCC_variables_MMR

1.A.1.b Gaseous Fuels [Petroleum Refining][Gaseous Fuels][Emissions][N2O][kt][no source][no method][no target][no option][no type]
type: Concept
definition: 1.A.1.b Gaseous Fuels [Petroleum Refining][Gaseous Fuels][Emissions][N2O][kt][no source][no method][no target][no option][no type]
status: valid
status modified: 2017-02-13
accepted date: 2017-02-13
in scheme: IPCC_variables_MMR

1.A.1.b Liquid Fuels [Petroleum Refining][Liquid Fuels][Emissions][CH4][kt][no source][no method][no target][no option][no type]
type: Concept
definition: 1.A.1.b Liquid Fuels [Petroleum Refining][Liquid Fuels][Emissions][CH4][kt][no source][no method][no target][no option][no type]
status: valid
status modified: 2017-02-13
accepted date: 2017-02-13
in scheme: IPCC_variables_MMR

1.A.1.b Liquid Fuels [Petroleum Refining][Liquid Fuels][Emissions][CO2][kt][no source][no method][no target][no option][no type]
type: Concept
definition: 1.A.1.b Liquid Fuels [Petroleum Refining][Liquid Fuels][Emissions][CO2][kt][no source][no method][no target][no option][no type]
status: valid
status modified: 2017-02-13
accepted date: 2017-02-13
in scheme: IPCC_variables_MMR

1.A.1.b Liquid Fuels [Petroleum Refining][Liquid Fuels][Emissions][N2O][kt][no source][no method][no target][no option][no type]
type: Concept
definition: 1.A.1.b Liquid Fuels [Petroleum Refining][Liquid Fuels][Emissions][N2O][kt][no source][no method][no target][no option][no type]
status: valid
status modified: 2017-02-13
accepted date: 2017-02-13
in scheme: IPCC_variables_MMR

1.A.1.b Other Fossil Fuels [Petroleum Refining][Other Fossil Fuels][Emissions][CH4][kt][no source][no method][no target][no option][no type]
type: Concept
definition: 1.A.1.b Other Fossil Fuels [Petroleum Refining][Other Fossil Fuels][Emissions][CH4][kt][no source][no method][no target][no option][no type]
status: valid
status modified: 2017-02-13
accepted date: 2017-02-13
in scheme: IPCC_variables_MMR

1.A.1.b Other Fossil Fuels [Petroleum Refining][Other Fossil Fuels][Emissions][CO2][kt][no source][no method][no target][no option][no type]
type: Concept
definition: 1.A.1.b Other Fossil Fuels [Petroleum Refining][Other Fossil Fuels][Emissions][CO2][kt][no source][no method][no target][no option][no type]
status: valid
status modified: 2017-02-13
accepted date: 2017-02-13
in scheme: IPCC_variables_MMR

1.A.1.b Other Fossil Fuels [Petroleum Refining][Other Fossil Fuels][Emissions][N2O][kt][no source][no method][no target][no option][no type]
type: Concept
definition: 1.A.1.b Other Fossil Fuels [Petroleum Refining][Other Fossil Fuels][Emissions][N2O][kt][no source][no method][no target][no option][no type]
status: valid
status modified: 2017-02-13
accepted date: 2017-02-13
in scheme: IPCC_variables_MMR

1.A.1.b Peat [Petroleum Refining][Peat][Emissions][CH4][kt][no source][no method][no target][no option][no type]
type: Concept
definition: 1.A.1.b Peat [Petroleum Refining][Peat][Emissions][CH4][kt][no source][no method][no target][no option][no type]
status: valid
status modified: 2017-02-13
accepted date: 2017-02-13
in scheme: IPCC_variables_MMR

1.A.1.b Peat [Petroleum Refining][Peat][Emissions][CO2][kt][no source][no method][no target][no option][no type]
type: Concept
definition: 1.A.1.b Peat [Petroleum Refining][Peat][Emissions][CO2][kt][no source][no method][no target][no option][no type]
status: valid
status modified: 2017-02-13
accepted date: 2017-02-13
in scheme: IPCC_variables_MMR

1.A.1.b Peat [Petroleum Refining][Peat][Emissions][N2O][kt][no source][no method][no target][no option][no type]
type: Concept
definition: 1.A.1.b Peat [Petroleum Refining][Peat][Emissions][N2O][kt][no source][no method][no target][no option][no type]
status: valid
status modified: 2017-02-13
accepted date: 2017-02-13
in scheme: IPCC_variables_MMR

1.A.1.b Solid Fuels [Petroleum Refining][Solid Fuels][Emissions][CH4][kt][no source][no method][no target][no option][no type]
type: Concept
definition: 1.A.1.b Solid Fuels [Petroleum Refining][Solid Fuels][Emissions][CH4][kt][no source][no method][no target][no option][no type]
status: valid
status modified: 2017-02-13
accepted date: 2017-02-13
in scheme: IPCC_variables_MMR

1.A.1.b Solid Fuels [Petroleum Refining][Solid Fuels][Emissions][CO2][kt][no source][no method][no target][no option][no type]
type: Concept
definition: 1.A.1.b Solid Fuels [Petroleum Refining][Solid Fuels][Emissions][CO2][kt][no source][no method][no target][no option][no type]
status: valid
status modified: 2017-02-13
accepted date: 2017-02-13
in scheme: IPCC_variables_MMR

1.A.1.b Solid Fuels [Petroleum Refining][Solid Fuels][Emissions][N2O][kt][no source][no method][no target][no option][no type]
type: Concept
definition: 1.A.1.b Solid Fuels [Petroleum Refining][Solid Fuels][Emissions][N2O][kt][no source][no method][no target][no option][no type]
status: valid
status modified: 2017-02-13
accepted date: 2017-02-13
in scheme: IPCC_variables_MMR

1.A.1.c [Manufacture of Solid Fuels and Other Energy Industries][Biomass][Emissions][CH4][kt][no source][no method][no target][no option][no type]
type: Concept
definition: 1.A.1.c [Manufacture of Solid Fuels and Other Energy Industries][Biomass][Emissions][CH4][kt][no source][no method][no target][no option][no type]
status: valid
status modified: 2017-02-13
accepted date: 2017-02-13
in scheme: IPCC_variables_MMR

1.A.1.c [Manufacture of Solid Fuels and Other Energy Industries][Biomass][Emissions][CO2][kt][no source][no method][no target][no option][no type]
type: Concept
definition: 1.A.1.c [Manufacture of Solid Fuels and Other Energy Industries][Biomass][Emissions][CO2][kt][no source][no method][no target][no option][no type]
status: valid
status modified: 2017-02-13
accepted date: 2017-02-13
in scheme: IPCC_variables_MMR

1.A.1.c [Manufacture of Solid Fuels and Other Energy Industries][Biomass][Emissions][N2O][kt][no source][no method][no target][no option][no type]
type: Concept
definition: 1.A.1.c [Manufacture of Solid Fuels and Other Energy Industries][Biomass][Emissions][N2O][kt][no source][no method][no target][no option][no type]
status: valid
status modified: 2017-02-13
accepted date: 2017-02-13
in scheme: IPCC_variables_MMR

1.A.1.c [Manufacture of Solid Fuels and Other Energy Industries][Fossil fuels][Emissions][CO2][kt][no source][no method][no target][no option][no type]
type: Concept
definition: 1.A.1.c [Manufacture of Solid Fuels and Other Energy Industries][Fossil fuels][Emissions][CO2][kt][no source][no method][no target][no option][no type]
status: valid
status modified: 2017-02-13
accepted date: 2017-02-13
in scheme: IPCC_variables_MMR

1.A.1.c [Manufacture of Solid Fuels and Other Energy Industries][Fuels][Emissions][CH4][kt][no source][no method][no target][no option][no type]
type: Concept
definition: 1.A.1.c [Manufacture of Solid Fuels and Other Energy Industries][Fuels][Emissions][CH4][kt][no source][no method][no target][no option][no type]
status: valid
status modified: 2017-02-13
accepted date: 2017-02-13
in scheme: IPCC_variables_MMR

1.A.1.c [Manufacture of Solid Fuels and Other Energy Industries][Fuels][Emissions][N2O][kt][no source][no method][no target][no option][no type]
type: Concept
definition: 1.A.1.c [Manufacture of Solid Fuels and Other Energy Industries][Fuels][Emissions][N2O][kt][no source][no method][no target][no option][no type]
status: valid
status modified: 2017-02-13
accepted date: 2017-02-13
in scheme: IPCC_variables_MMR

1.A.1.c [Manufacture of Solid Fuels and Other Energy Industries][Gaseous Fuels][Emissions][CH4][kt][no source][no method][no target][no option][no type]
type: Concept
definition: 1.A.1.c [Manufacture of Solid Fuels and Other Energy Industries][Gaseous Fuels][Emissions][CH4][kt][no source][no method][no target][no option][no type]
status: valid
status modified: 2017-02-13
accepted date: 2017-02-13
in scheme: IPCC_variables_MMR

1.A.1.c [Manufacture of Solid Fuels and Other Energy Industries][Gaseous Fuels][Emissions][CO2][kt][no source][no method][no target][no option][no type]
type: Concept
definition: 1.A.1.c [Manufacture of Solid Fuels and Other Energy Industries][Gaseous Fuels][Emissions][CO2][kt][no source][no method][no target][no option][no type]
status: valid
status modified: 2017-02-13
accepted date: 2017-02-13
in scheme: IPCC_variables_MMR

1.A.1.c [Manufacture of Solid Fuels and Other Energy Industries][Gaseous Fuels][Emissions][N2O][kt][no source][no method][no target][no option][no type]
type: Concept
definition: 1.A.1.c [Manufacture of Solid Fuels and Other Energy Industries][Gaseous Fuels][Emissions][N2O][kt][no source][no method][no target][no option][no type]
status: valid
status modified: 2017-02-13
accepted date: 2017-02-13
in scheme: IPCC_variables_MMR

1.A.1.c [Manufacture of Solid Fuels and Other Energy Industries][Liquid Fuels][Emissions][CH4][kt][no source][no method][no target][no option][no type]
type: Concept
definition: 1.A.1.c [Manufacture of Solid Fuels and Other Energy Industries][Liquid Fuels][Emissions][CH4][kt][no source][no method][no target][no option][no type]
status: valid
status modified: 2017-02-13
accepted date: 2017-02-13
in scheme: IPCC_variables_MMR

1.A.1.c [Manufacture of Solid Fuels and Other Energy Industries][Liquid Fuels][Emissions][CO2][kt][no source][no method][no target][no option][no type]
type: Concept
definition: 1.A.1.c [Manufacture of Solid Fuels and Other Energy Industries][Liquid Fuels][Emissions][CO2][kt][no source][no method][no target][no option][no type]
status: valid
status modified: 2017-02-13
accepted date: 2017-02-13
in scheme: IPCC_variables_MMR

1.A.1.c [Manufacture of Solid Fuels and Other Energy Industries][Liquid Fuels][Emissions][N2O][kt][no source][no method][no target][no option][no type]
type: Concept
definition: 1.A.1.c [Manufacture of Solid Fuels and Other Energy Industries][Liquid Fuels][Emissions][N2O][kt][no source][no method][no target][no option][no type]
status: valid
status modified: 2017-02-13
accepted date: 2017-02-13
in scheme: IPCC_variables_MMR

1.A.1.c [Manufacture of Solid Fuels and Other Energy Industries][Other Fossil Fuels][Emissions][CH4][kt][no source][no method][no target][no option][no type]
type: Concept
definition: 1.A.1.c [Manufacture of Solid Fuels and Other Energy Industries][Other Fossil Fuels][Emissions][CH4][kt][no source][no method][no target][no option][no type]
status: valid
status modified: 2017-02-13
accepted date: 2017-02-13
in scheme: IPCC_variables_MMR

1.A.1.c [Manufacture of Solid Fuels and Other Energy Industries][Other Fossil Fuels][Emissions][CO2][kt][no source][no method][no target][no option][no type]
type: Concept
definition: 1.A.1.c [Manufacture of Solid Fuels and Other Energy Industries][Other Fossil Fuels][Emissions][CO2][kt][no source][no method][no target][no option][no type]
status: valid
status modified: 2017-02-13
accepted date: 2017-02-13
in scheme: IPCC_variables_MMR

1.A.1.c [Manufacture of Solid Fuels and Other Energy Industries][Other Fossil Fuels][Emissions][N2O][kt][no source][no method][no target][no option][no type]
type: Concept
definition: 1.A.1.c [Manufacture of Solid Fuels and Other Energy Industries][Other Fossil Fuels][Emissions][N2O][kt][no source][no method][no target][no option][no type]
status: valid
status modified: 2017-02-13
accepted date: 2017-02-13
in scheme: IPCC_variables_MMR

1.A.1.c [Manufacture of Solid Fuels and Other Energy Industries][Peat][Emissions][CH4][kt][no source][no method][no target][no option][no type]
type: Concept
definition: 1.A.1.c [Manufacture of Solid Fuels and Other Energy Industries][Peat][Emissions][CH4][kt][no source][no method][no target][no option][no type]
status: valid
status modified: 2017-02-13
accepted date: 2017-02-13
in scheme: IPCC_variables_MMR

1.A.1.c [Manufacture of Solid Fuels and Other Energy Industries][Peat][Emissions][CO2][kt][no source][no method][no target][no option][no type]
type: Concept
definition: 1.A.1.c [Manufacture of Solid Fuels and Other Energy Industries][Peat][Emissions][CO2][kt][no source][no method][no target][no option][no type]
status: valid
status modified: 2017-02-13
accepted date: 2017-02-13
in scheme: IPCC_variables_MMR

1.A.1.c [Manufacture of Solid Fuels and Other Energy Industries][Peat][Emissions][N2O][kt][no source][no method][no target][no option][no type]
type: Concept
definition: 1.A.1.c [Manufacture of Solid Fuels and Other Energy Industries][Peat][Emissions][N2O][kt][no source][no method][no target][no option][no type]
status: valid
status modified: 2017-02-13
accepted date: 2017-02-13
in scheme: IPCC_variables_MMR

1.A.1.c [Manufacture of Solid Fuels and Other Energy Industries][Solid Fuels][Emissions][CH4][kt][no source][no method][no target][no option][no type]
type: Concept
definition: 1.A.1.c [Manufacture of Solid Fuels and Other Energy Industries][Solid Fuels][Emissions][CH4][kt][no source][no method][no target][no option][no type]
status: valid
status modified: 2017-02-13
accepted date: 2017-02-13
in scheme: IPCC_variables_MMR

1.A.1.c [Manufacture of Solid Fuels and Other Energy Industries][Solid Fuels][Emissions][CO2][kt][no source][no method][no target][no option][no type]
type: Concept
definition: 1.A.1.c [Manufacture of Solid Fuels and Other Energy Industries][Solid Fuels][Emissions][CO2][kt][no source][no method][no target][no option][no type]
status: valid
status modified: 2017-02-13
accepted date: 2017-02-13
in scheme: IPCC_variables_MMR

1.A.1.c [Manufacture of Solid Fuels and Other Energy Industries][Solid Fuels][Emissions][N2O][kt][no source][no method][no target][no option][no type]
type: Concept
definition: 1.A.1.c [Manufacture of Solid Fuels and Other Energy Industries][Solid Fuels][Emissions][N2O][kt][no source][no method][no target][no option][no type]
status: valid
status modified: 2017-02-13
accepted date: 2017-02-13
in scheme: IPCC_variables_MMR

1.A.2 [Manufacturing Industries and Construction][Biomass][Emissions][CH4][kt][no source][no method][no target][no option][no type]
type: Concept
definition: 1.A.2 [Manufacturing Industries and Construction][Biomass][Emissions][CH4][kt][no source][no method][no target][no option][no type]
status: valid
status modified: 2017-02-13
accepted date: 2017-02-13
in scheme: IPCC_variables_MMR

1.A.2 [Manufacturing Industries and Construction][Biomass][Emissions][CO2][kt][no source][no method][no target][no option][no type]
type: Concept
definition: 1.A.2 [Manufacturing Industries and Construction][Biomass][Emissions][CO2][kt][no source][no method][no target][no option][no type]
status: valid
status modified: 2017-02-13
accepted date: 2017-02-13
in scheme: IPCC_variables_MMR

1.A.2 [Manufacturing Industries and Construction][Biomass][Emissions][N2O][kt][no source][no method][no target][no option][no type]
type: Concept
definition: 1.A.2 [Manufacturing Industries and Construction][Biomass][Emissions][N2O][kt][no source][no method][no target][no option][no type]
status: valid
status modified: 2017-02-13
accepted date: 2017-02-13
in scheme: IPCC_variables_MMR

1.A.2 [Manufacturing Industries and Construction][Fuels][Emissions][CH4][kt][no source][no method][no target][no option][no type]
type: Concept
definition: 1.A.2 [Manufacturing Industries and Construction][Fuels][Emissions][CH4][kt][no source][no method][no target][no option][no type]
status: valid
status modified: 2017-02-13
accepted date: 2017-02-13
in scheme: IPCC_variables_MMR

1.A.2 [Manufacturing Industries and Construction][Fuels][Emissions][CO2][kt][no source][no method][no target][no option][no type]
type: Concept
definition: 1.A.2 [Manufacturing Industries and Construction][Fuels][Emissions][CO2][kt][no source][no method][no target][no option][no type]
status: valid
status modified: 2017-02-13
accepted date: 2017-02-13
in scheme: IPCC_variables_MMR

1.A.2 [Manufacturing Industries and Construction][Fuels][Emissions][N2O][kt][no source][no method][no target][no option][no type]
type: Concept
definition: 1.A.2 [Manufacturing Industries and Construction][Fuels][Emissions][N2O][kt][no source][no method][no target][no option][no type]
status: valid
status modified: 2017-02-13
accepted date: 2017-02-13
in scheme: IPCC_variables_MMR

1.A.2 [Manufacturing Industries and Construction][Gaseous Fuels][Emissions][CH4][kt][no source][no method][no target][no option][no type]
type: Concept
definition: 1.A.2 [Manufacturing Industries and Construction][Gaseous Fuels][Emissions][CH4][kt][no source][no method][no target][no option][no type]
status: valid
status modified: 2017-02-13
accepted date: 2017-02-13
in scheme: IPCC_variables_MMR

1.A.2 [Manufacturing Industries and Construction][Gaseous Fuels][Emissions][CO2][kt][no source][no method][no target][no option][no type]
type: Concept
definition: 1.A.2 [Manufacturing Industries and Construction][Gaseous Fuels][Emissions][CO2][kt][no source][no method][no target][no option][no type]
status: valid
status modified: 2017-02-13
accepted date: 2017-02-13
in scheme: IPCC_variables_MMR

1.A.2 [Manufacturing Industries and Construction][Gaseous Fuels][Emissions][N2O][kt][no source][no method][no target][no option][no type]
type: Concept
definition: 1.A.2 [Manufacturing Industries and Construction][Gaseous Fuels][Emissions][N2O][kt][no source][no method][no target][no option][no type]
status: valid
status modified: 2017-02-13
accepted date: 2017-02-13
in scheme: IPCC_variables_MMR

1.A.2 [Manufacturing Industries and Construction][Liquid Fuels][Emissions][CH4][kt][no source][no method][no target][no option][no type]
type: Concept
definition: 1.A.2 [Manufacturing Industries and Construction][Liquid Fuels][Emissions][CH4][kt][no source][no method][no target][no option][no type]
status: valid
status modified: 2017-02-13
accepted date: 2017-02-13
in scheme: IPCC_variables_MMR

1.A.2 [Manufacturing Industries and Construction][Liquid Fuels][Emissions][CO2][kt][no source][no method][no target][no option][no type]
type: Concept
definition: 1.A.2 [Manufacturing Industries and Construction][Liquid Fuels][Emissions][CO2][kt][no source][no method][no target][no option][no type]
status: valid
status modified: 2017-02-13
accepted date: 2017-02-13
in scheme: IPCC_variables_MMR

1.A.2 [Manufacturing Industries and Construction][Liquid Fuels][Emissions][N2O][kt][no source][no method][no target][no option][no type]
type: Concept
definition: 1.A.2 [Manufacturing Industries and Construction][Liquid Fuels][Emissions][N2O][kt][no source][no method][no target][no option][no type]
status: valid
status modified: 2017-02-13
accepted date: 2017-02-13
in scheme: IPCC_variables_MMR

1.A.2 [Manufacturing Industries and Construction][Other Fossil Fuels][Emissions][CH4][kt][no source][no method][no target][no option][no type]
type: Concept
definition: 1.A.2 [Manufacturing Industries and Construction][Other Fossil Fuels][Emissions][CH4][kt][no source][no method][no target][no option][no type]
status: valid
status modified: 2017-02-13
accepted date: 2017-02-13
in scheme: IPCC_variables_MMR

1.A.2 [Manufacturing Industries and Construction][Other Fossil Fuels][Emissions][CO2][kt][no source][no method][no target][no option][no type]
type: Concept
definition: 1.A.2 [Manufacturing Industries and Construction][Other Fossil Fuels][Emissions][CO2][kt][no source][no method][no target][no option][no type]
status: valid
status modified: 2017-02-13
accepted date: 2017-02-13
in scheme: IPCC_variables_MMR

1.A.2 [Manufacturing Industries and Construction][Other Fossil Fuels][Emissions][N2O][kt][no source][no method][no target][no option][no type]
type: Concept
definition: 1.A.2 [Manufacturing Industries and Construction][Other Fossil Fuels][Emissions][N2O][kt][no source][no method][no target][no option][no type]
status: valid
status modified: 2017-02-13
accepted date: 2017-02-13
in scheme: IPCC_variables_MMR

1.A.2 [Manufacturing Industries and Construction][Peat][Emissions][CH4][kt][no source][no method][no target][no option][no type]
type: Concept
definition: 1.A.2 [Manufacturing Industries and Construction][Peat][Emissions][CH4][kt][no source][no method][no target][no option][no type]
status: valid
status modified: 2017-02-13
accepted date: 2017-02-13
in scheme: IPCC_variables_MMR

1.A.2 [Manufacturing Industries and Construction][Peat][Emissions][CO2][kt][no source][no method][no target][no option][no type]
type: Concept
definition: 1.A.2 [Manufacturing Industries and Construction][Peat][Emissions][CO2][kt][no source][no method][no target][no option][no type]
status: valid
status modified: 2017-02-13
accepted date: 2017-02-13
in scheme: IPCC_variables_MMR

1.A.2 [Manufacturing Industries and Construction][Peat][Emissions][N2O][kt][no source][no method][no target][no option][no type]
type: Concept
definition: 1.A.2 [Manufacturing Industries and Construction][Peat][Emissions][N2O][kt][no source][no method][no target][no option][no type]
status: valid
status modified: 2017-02-13
accepted date: 2017-02-13
in scheme: IPCC_variables_MMR

1.A.2 [Manufacturing Industries and Construction][Solid Fuels][Emissions][CH4][kt][no source][no method][no target][no option][no type]
type: Concept
definition: 1.A.2 [Manufacturing Industries and Construction][Solid Fuels][Emissions][CH4][kt][no source][no method][no target][no option][no type]
status: valid
status modified: 2017-02-13
accepted date: 2017-02-13
in scheme: IPCC_variables_MMR

1.A.2 [Manufacturing Industries and Construction][Solid Fuels][Emissions][CO2][kt][no source][no method][no target][no option][no type]
type: Concept
definition: 1.A.2 [Manufacturing Industries and Construction][Solid Fuels][Emissions][CO2][kt][no source][no method][no target][no option][no type]
status: valid
status modified: 2017-02-13
accepted date: 2017-02-13
in scheme: IPCC_variables_MMR

1.A.2 [Manufacturing Industries and Construction][Solid Fuels][Emissions][N2O][kt][no source][no method][no target][no option][no type]
type: Concept
definition: 1.A.2 [Manufacturing Industries and Construction][Solid Fuels][Emissions][N2O][kt][no source][no method][no target][no option][no type]
status: valid
status modified: 2017-02-13
accepted date: 2017-02-13
in scheme: IPCC_variables_MMR

1.A.2.a [Iron and Steel][Fuels][Emissions][CH4][kt][no source][no method][no target][no option][no type]
type: Concept
definition: 1.A.2.a [Iron and Steel][Fuels][Emissions][CH4][kt][no source][no method][no target][no option][no type]
status: valid
status modified: 2017-02-13
accepted date: 2017-02-13
in scheme: IPCC_variables_MMR

1.A.2.a [Iron and Steel][Fuels][Emissions][CO2][kt][no source][no method][no target][no option][no type]
type: Concept
definition: 1.A.2.a [Iron and Steel][Fuels][Emissions][CO2][kt][no source][no method][no target][no option][no type]
status: valid
status modified: 2017-02-13
accepted date: 2017-02-13
in scheme: IPCC_variables_MMR

1.A.2.a [Iron and Steel][Fuels][Emissions][N2O][kt][no source][no method][no target][no option][no type]
type: Concept
definition: 1.A.2.a [Iron and Steel][Fuels][Emissions][N2O][kt][no source][no method][no target][no option][no type]
status: valid
status modified: 2017-02-13
accepted date: 2017-02-13
in scheme: IPCC_variables_MMR

1.A.2.a Biomass [Iron and Steel][Biomass][Emissions][CH4][kt][no source][no method][no target][no option][no type]
type: Concept
definition: 1.A.2.a Biomass [Iron and Steel][Biomass][Emissions][CH4][kt][no source][no method][no target][no option][no type]
status: valid
status modified: 2017-02-13
accepted date: 2017-02-13
in scheme: IPCC_variables_MMR

1.A.2.a Biomass [Iron and Steel][Biomass][Emissions][CO2][kt][no source][no method][no target][no option][no type]
type: Concept
definition: 1.A.2.a Biomass [Iron and Steel][Biomass][Emissions][CO2][kt][no source][no method][no target][no option][no type]
status: valid
status modified: 2017-02-13
accepted date: 2017-02-13
in scheme: IPCC_variables_MMR

1.A.2.a Biomass [Iron and Steel][Biomass][Emissions][N2O][kt][no source][no method][no target][no option][no type]
type: Concept
definition: 1.A.2.a Biomass [Iron and Steel][Biomass][Emissions][N2O][kt][no source][no method][no target][no option][no type]
status: valid
status modified: 2017-02-13
accepted date: 2017-02-13
in scheme: IPCC_variables_MMR

1.A.2.a Gaseous Fuels [Iron and Steel][Gaseous Fuels][Emissions][CH4][kt][no source][no method][no target][no option][no type]
type: Concept
definition: 1.A.2.a Gaseous Fuels [Iron and Steel][Gaseous Fuels][Emissions][CH4][kt][no source][no method][no target][no option][no type]
status: valid
status modified: 2017-02-13
accepted date: 2017-02-13
in scheme: IPCC_variables_MMR

1.A.2.a Gaseous Fuels [Iron and Steel][Gaseous Fuels][Emissions][CO2][kt][no source][no method][no target][no option][no type]
type: Concept
definition: 1.A.2.a Gaseous Fuels [Iron and Steel][Gaseous Fuels][Emissions][CO2][kt][no source][no method][no target][no option][no type]
status: valid
status modified: 2017-02-13
accepted date: 2017-02-13
in scheme: IPCC_variables_MMR

1.A.2.a Gaseous Fuels [Iron and Steel][Gaseous Fuels][Emissions][N2O][kt][no source][no method][no target][no option][no type]
type: Concept
definition: 1.A.2.a Gaseous Fuels [Iron and Steel][Gaseous Fuels][Emissions][N2O][kt][no source][no method][no target][no option][no type]
status: valid
status modified: 2017-02-13
accepted date: 2017-02-13
in scheme: IPCC_variables_MMR

1.A.2.a Liquid Fuels [Iron and Steel][Liquid Fuels][Emissions][CH4][kt][no source][no method][no target][no option][no type]
type: Concept
definition: 1.A.2.a Liquid Fuels [Iron and Steel][Liquid Fuels][Emissions][CH4][kt][no source][no method][no target][no option][no type]
status: valid
status modified: 2017-02-13
accepted date: 2017-02-13
in scheme: IPCC_variables_MMR

1.A.2.a Liquid Fuels [Iron and Steel][Liquid Fuels][Emissions][CO2][kt][no source][no method][no target][no option][no type]
type: Concept
definition: 1.A.2.a Liquid Fuels [Iron and Steel][Liquid Fuels][Emissions][CO2][kt][no source][no method][no target][no option][no type]
status: valid
status modified: 2017-02-13
accepted date: 2017-02-13
in scheme: IPCC_variables_MMR

1.A.2.a Liquid Fuels [Iron and Steel][Liquid Fuels][Emissions][N2O][kt][no source][no method][no target][no option][no type]
type: Concept
definition: 1.A.2.a Liquid Fuels [Iron and Steel][Liquid Fuels][Emissions][N2O][kt][no source][no method][no target][no option][no type]
status: valid
status modified: 2017-02-13
accepted date: 2017-02-13
in scheme: IPCC_variables_MMR

1.A.2.a Other Fossil Fuel [Iron and Steel][Other Fossil Fuels][Emissions][CH4][kt][no source][no method][no target][no option][no type]
type: Concept
definition: 1.A.2.a Other Fossil Fuel [Iron and Steel][Other Fossil Fuels][Emissions][CH4][kt][no source][no method][no target][no option][no type]
status: valid
status modified: 2017-02-13
accepted date: 2017-02-13
in scheme: IPCC_variables_MMR

1.A.2.a Other Fossil Fuel [Iron and Steel][Other Fossil Fuels][Emissions][CO2][kt][no source][no method][no target][no option][no type]
type: Concept
definition: 1.A.2.a Other Fossil Fuel [Iron and Steel][Other Fossil Fuels][Emissions][CO2][kt][no source][no method][no target][no option][no type]
status: valid
status modified: 2017-02-13
accepted date: 2017-02-13
in scheme: IPCC_variables_MMR

1.A.2.a Other Fossil Fuel [Iron and Steel][Other Fossil Fuels][Emissions][N2O][kt][no source][no method][no target][no option][no type]
type: Concept
definition: 1.A.2.a Other Fossil Fuel [Iron and Steel][Other Fossil Fuels][Emissions][N2O][kt][no source][no method][no target][no option][no type]
status: valid
status modified: 2017-02-13
accepted date: 2017-02-13
in scheme: IPCC_variables_MMR

1.A.2.a Peat [Iron and Steel][Peat][Emissions][CH4][kt][no source][no method][no target][no option][no type]
type: Concept
definition: 1.A.2.a Peat [Iron and Steel][Peat][Emissions][CH4][kt][no source][no method][no target][no option][no type]
status: valid
status modified: 2017-02-13
accepted date: 2017-02-13
in scheme: IPCC_variables_MMR

1.A.2.a Peat [Iron and Steel][Peat][Emissions][CO2][kt][no source][no method][no target][no option][no type]
type: Concept
definition: 1.A.2.a Peat [Iron and Steel][Peat][Emissions][CO2][kt][no source][no method][no target][no option][no type]
status: valid
status modified: 2017-02-13
accepted date: 2017-02-13
in scheme: IPCC_variables_MMR

1.A.2.a Peat [Iron and Steel][Peat][Emissions][N2O][kt][no source][no method][no target][no option][no type]
type: Concept
definition: 1.A.2.a Peat [Iron and Steel][Peat][Emissions][N2O][kt][no source][no method][no target][no option][no type]
status: valid
status modified: 2017-02-13
accepted date: 2017-02-13
in scheme: IPCC_variables_MMR

1.A.2.a Solid Fuels [Iron and Steel][Solid Fuels][Emissions][CH4][kt][no source][no method][no target][no option][no type]
type: Concept
definition: 1.A.2.a Solid Fuels [Iron and Steel][Solid Fuels][Emissions][CH4][kt][no source][no method][no target][no option][no type]
status: valid
status modified: 2017-02-13
accepted date: 2017-02-13
in scheme: IPCC_variables_MMR

1.A.2.a Solid Fuels [Iron and Steel][Solid Fuels][Emissions][CO2][kt][no source][no method][no target][no option][no type]
type: Concept
definition: 1.A.2.a Solid Fuels [Iron and Steel][Solid Fuels][Emissions][CO2][kt][no source][no method][no target][no option][no type]
status: valid
status modified: 2017-02-13
accepted date: 2017-02-13
in scheme: IPCC_variables_MMR

1.A.2.a Solid Fuels [Iron and Steel][Solid Fuels][Emissions][N2O][kt][no source][no method][no target][no option][no type]
type: Concept
definition: 1.A.2.a Solid Fuels [Iron and Steel][Solid Fuels][Emissions][N2O][kt][no source][no method][no target][no option][no type]
status: valid
status modified: 2017-02-13
accepted date: 2017-02-13
in scheme: IPCC_variables_MMR

1.A.2.b [Non-Ferrous Metals][Fuels][Emissions][CH4][kt][no source][no method][no target][no option][no type]
type: Concept
definition: 1.A.2.b [Non-Ferrous Metals][Fuels][Emissions][CH4][kt][no source][no method][no target][no option][no type]
status: valid
status modified: 2017-02-13
accepted date: 2017-02-13
in scheme: IPCC_variables_MMR

1.A.2.b [Non-Ferrous Metals][Fuels][Emissions][CO2][kt][no source][no method][no target][no option][no type]
type: Concept
definition: 1.A.2.b [Non-Ferrous Metals][Fuels][Emissions][CO2][kt][no source][no method][no target][no option][no type]
status: valid
status modified: 2017-02-13
accepted date: 2017-02-13
in scheme: IPCC_variables_MMR

1.A.2.b [Non-Ferrous Metals][Fuels][Emissions][N2O][kt][no source][no method][no target][no option][no type]
type: Concept
definition: 1.A.2.b [Non-Ferrous Metals][Fuels][Emissions][N2O][kt][no source][no method][no target][no option][no type]
status: valid
status modified: 2017-02-13
accepted date: 2017-02-13
in scheme: IPCC_variables_MMR

1.A.2.b Biomass [Non-Ferrous Metals][Biomass][Emissions][CH4][kt][no source][no method][no target][no option][no type]
type: Concept
definition: 1.A.2.b Biomass [Non-Ferrous Metals][Biomass][Emissions][CH4][kt][no source][no method][no target][no option][no type]
status: valid
status modified: 2017-02-13
accepted date: 2017-02-13
in scheme: IPCC_variables_MMR

1.A.2.b Biomass [Non-Ferrous Metals][Biomass][Emissions][CO2][kt][no source][no method][no target][no option][no type]
type: Concept
definition: 1.A.2.b Biomass [Non-Ferrous Metals][Biomass][Emissions][CO2][kt][no source][no method][no target][no option][no type]
status: valid
status modified: 2017-02-13
accepted date: 2017-02-13
in scheme: IPCC_variables_MMR

1.A.2.b Biomass [Non-Ferrous Metals][Biomass][Emissions][N2O][kt][no source][no method][no target][no option][no type]
type: Concept
definition: 1.A.2.b Biomass [Non-Ferrous Metals][Biomass][Emissions][N2O][kt][no source][no method][no target][no option][no type]
status: valid
status modified: 2017-02-13
accepted date: 2017-02-13
in scheme: IPCC_variables_MMR

1.A.2.b Gaseous Fuels [Non-Ferrous Metals][Gaseous Fuels][Emissions][CH4][kt][no source][no method][no target][no option][no type]
type: Concept
definition: 1.A.2.b Gaseous Fuels [Non-Ferrous Metals][Gaseous Fuels][Emissions][CH4][kt][no source][no method][no target][no option][no type]
status: valid
status modified: 2017-02-13
accepted date: 2017-02-13
in scheme: IPCC_variables_MMR

1.A.2.b Gaseous Fuels [Non-Ferrous Metals][Gaseous Fuels][Emissions][CO2][kt][no source][no method][no target][no option][no type]
type: Concept
definition: 1.A.2.b Gaseous Fuels [Non-Ferrous Metals][Gaseous Fuels][Emissions][CO2][kt][no source][no method][no target][no option][no type]
status: valid
status modified: 2017-02-13
accepted date: 2017-02-13
in scheme: IPCC_variables_MMR

1.A.2.b Gaseous Fuels [Non-Ferrous Metals][Gaseous Fuels][Emissions][N2O][kt][no source][no method][no target][no option][no type]
type: Concept
definition: 1.A.2.b Gaseous Fuels [Non-Ferrous Metals][Gaseous Fuels][Emissions][N2O][kt][no source][no method][no target][no option][no type]
status: valid
status modified: 2017-02-13
accepted date: 2017-02-13
in scheme: IPCC_variables_MMR

1.A.2.b Liquid Fuels [Non-Ferrous Metals][Liquid Fuels][Emissions][CH4][kt][no source][no method][no target][no option][no type]
type: Concept
definition: 1.A.2.b Liquid Fuels [Non-Ferrous Metals][Liquid Fuels][Emissions][CH4][kt][no source][no method][no target][no option][no type]
status: valid
status modified: 2017-02-13
accepted date: 2017-02-13
in scheme: IPCC_variables_MMR

1.A.2.b Liquid Fuels [Non-Ferrous Metals][Liquid Fuels][Emissions][CO2][kt][no source][no method][no target][no option][no type]
type: Concept
definition: 1.A.2.b Liquid Fuels [Non-Ferrous Metals][Liquid Fuels][Emissions][CO2][kt][no source][no method][no target][no option][no type]
status: valid
status modified: 2017-02-13
accepted date: 2017-02-13
in scheme: IPCC_variables_MMR

1.A.2.b Liquid Fuels [Non-Ferrous Metals][Liquid Fuels][Emissions][N2O][kt][no source][no method][no target][no option][no type]
type: Concept
definition: 1.A.2.b Liquid Fuels [Non-Ferrous Metals][Liquid Fuels][Emissions][N2O][kt][no source][no method][no target][no option][no type]
status: valid
status modified: 2017-02-13
accepted date: 2017-02-13
in scheme: IPCC_variables_MMR

1.A.2.b Other Fossil Fuel [Non-Ferrous Metals][Other Fossil Fuels][Emissions][CH4][kt][no source][no method][no target][no option][no type]
type: Concept
definition: 1.A.2.b Other Fossil Fuel [Non-Ferrous Metals][Other Fossil Fuels][Emissions][CH4][kt][no source][no method][no target][no option][no type]
status: valid
status modified: 2017-02-13
accepted date: 2017-02-13
in scheme: IPCC_variables_MMR

1.A.2.b Other Fossil Fuel [Non-Ferrous Metals][Other Fossil Fuels][Emissions][CO2][kt][no source][no method][no target][no option][no type]
type: Concept
definition: 1.A.2.b Other Fossil Fuel [Non-Ferrous Metals][Other Fossil Fuels][Emissions][CO2][kt][no source][no method][no target][no option][no type]
status: valid
status modified: 2017-02-13
accepted date: 2017-02-13
in scheme: IPCC_variables_MMR

1.A.2.b Other Fossil Fuel [Non-Ferrous Metals][Other Fossil Fuels][Emissions][N2O][kt][no source][no method][no target][no option][no type]
type: Concept
definition: 1.A.2.b Other Fossil Fuel [Non-Ferrous Metals][Other Fossil Fuels][Emissions][N2O][kt][no source][no method][no target][no option][no type]
status: valid
status modified: 2017-02-13
accepted date: 2017-02-13
in scheme: IPCC_variables_MMR

1.A.2.b Peat [Non-Ferrous Metals][Peat][Emissions][CH4][kt][no source][no method][no target][no option][no type]
type: Concept
definition: 1.A.2.b Peat [Non-Ferrous Metals][Peat][Emissions][CH4][kt][no source][no method][no target][no option][no type]
status: valid
status modified: 2017-02-13
accepted date: 2017-02-13
in scheme: IPCC_variables_MMR

1.A.2.b Peat [Non-Ferrous Metals][Peat][Emissions][CO2][kt][no source][no method][no target][no option][no type]
type: Concept
definition: 1.A.2.b Peat [Non-Ferrous Metals][Peat][Emissions][CO2][kt][no source][no method][no target][no option][no type]
status: valid
status modified: 2017-02-13
accepted date: 2017-02-13
in scheme: IPCC_variables_MMR

1.A.2.b Peat [Non-Ferrous Metals][Peat][Emissions][N2O][kt][no source][no method][no target][no option][no type]
type: Concept
definition: 1.A.2.b Peat [Non-Ferrous Metals][Peat][Emissions][N2O][kt][no source][no method][no target][no option][no type]
status: valid
status modified: 2017-02-13
accepted date: 2017-02-13
in scheme: IPCC_variables_MMR

1.A.2.b Solid Fuels [Non-Ferrous Metals][Solid Fuels][Emissions][CH4][kt][no source][no method][no target][no option][no type]
type: Concept
definition: 1.A.2.b Solid Fuels [Non-Ferrous Metals][Solid Fuels][Emissions][CH4][kt][no source][no method][no target][no option][no type]
status: valid
status modified: 2017-02-13
accepted date: 2017-02-13
in scheme: IPCC_variables_MMR

1.A.2.b Solid Fuels [Non-Ferrous Metals][Solid Fuels][Emissions][CO2][kt][no source][no method][no target][no option][no type]
type: Concept
definition: 1.A.2.b Solid Fuels [Non-Ferrous Metals][Solid Fuels][Emissions][CO2][kt][no source][no method][no target][no option][no type]
status: valid
status modified: 2017-02-13
accepted date: 2017-02-13
in scheme: IPCC_variables_MMR

1.A.2.b Solid Fuels [Non-Ferrous Metals][Solid Fuels][Emissions][N2O][kt][no source][no method][no target][no option][no type]
type: Concept
definition: 1.A.2.b Solid Fuels [Non-Ferrous Metals][Solid Fuels][Emissions][N2O][kt][no source][no method][no target][no option][no type]
status: valid
status modified: 2017-02-13
accepted date: 2017-02-13
in scheme: IPCC_variables_MMR

1.A.2.c [Chemicals][Fuels][Emissions][CH4][kt][no source][no method][no target][no option][no type]
type: Concept
definition: 1.A.2.c [Chemicals][Fuels][Emissions][CH4][kt][no source][no method][no target][no option][no type]
status: valid
status modified: 2017-02-13
accepted date: 2017-02-13
in scheme: IPCC_variables_MMR

1.A.2.c [Chemicals][Fuels][Emissions][CO2][kt][no source][no method][no target][no option][no type]
type: Concept
definition: 1.A.2.c [Chemicals][Fuels][Emissions][CO2][kt][no source][no method][no target][no option][no type]
status: valid
status modified: 2017-02-13
accepted date: 2017-02-13
in scheme: IPCC_variables_MMR

1.A.2.c [Chemicals][Fuels][Emissions][N2O][kt][no source][no method][no target][no option][no type]
type: Concept
definition: 1.A.2.c [Chemicals][Fuels][Emissions][N2O][kt][no source][no method][no target][no option][no type]
status: valid
status modified: 2017-02-13
accepted date: 2017-02-13
in scheme: IPCC_variables_MMR

1.A.2.c Biomass [Chemicals][Biomass][Emissions][CH4][kt][no source][no method][no target][no option][no type]
type: Concept
definition: 1.A.2.c Biomass [Chemicals][Biomass][Emissions][CH4][kt][no source][no method][no target][no option][no type]
status: valid
status modified: 2017-02-13
accepted date: 2017-02-13
in scheme: IPCC_variables_MMR

1.A.2.c Biomass [Chemicals][Biomass][Emissions][CO2][kt][no source][no method][no target][no option][no type]
type: Concept
definition: 1.A.2.c Biomass [Chemicals][Biomass][Emissions][CO2][kt][no source][no method][no target][no option][no type]
status: valid
status modified: 2017-02-13
accepted date: 2017-02-13
in scheme: IPCC_variables_MMR

1.A.2.c Biomass [Chemicals][Biomass][Emissions][N2O][kt][no source][no method][no target][no option][no type]
type: Concept
definition: 1.A.2.c Biomass [Chemicals][Biomass][Emissions][N2O][kt][no source][no method][no target][no option][no type]
status: valid
status modified: 2017-02-13
accepted date: 2017-02-13
in scheme: IPCC_variables_MMR

1.A.2.c Gaseous Fuels [Chemicals][Gaseous Fuels][Emissions][CH4][kt][no source][no method][no target][no option][no type]
type: Concept
definition: 1.A.2.c Gaseous Fuels [Chemicals][Gaseous Fuels][Emissions][CH4][kt][no source][no method][no target][no option][no type]
status: valid
status modified: 2017-02-13
accepted date: 2017-02-13
in scheme: IPCC_variables_MMR

1.A.2.c Gaseous Fuels [Chemicals][Gaseous Fuels][Emissions][CO2][kt][no source][no method][no target][no option][no type]
type: Concept
definition: 1.A.2.c Gaseous Fuels [Chemicals][Gaseous Fuels][Emissions][CO2][kt][no source][no method][no target][no option][no type]
status: valid
status modified: 2017-02-13
accepted date: 2017-02-13
in scheme: IPCC_variables_MMR

1.A.2.c Gaseous Fuels [Chemicals][Gaseous Fuels][Emissions][N2O][kt][no source][no method][no target][no option][no type]
type: Concept
definition: 1.A.2.c Gaseous Fuels [Chemicals][Gaseous Fuels][Emissions][N2O][kt][no source][no method][no target][no option][no type]
status: valid
status modified: 2017-02-13
accepted date: 2017-02-13
in scheme: IPCC_variables_MMR

1.A.2.c Liquid Fuels [Chemicals][Liquid Fuels][Emissions][CH4][kt][no source][no method][no target][no option][no type]
type: Concept
definition: 1.A.2.c Liquid Fuels [Chemicals][Liquid Fuels][Emissions][CH4][kt][no source][no method][no target][no option][no type]
status: valid
status modified: 2017-02-13
accepted date: 2017-02-13
in scheme: IPCC_variables_MMR

1.A.2.c Liquid Fuels [Chemicals][Liquid Fuels][Emissions][CO2][kt][no source][no method][no target][no option][no type]
type: Concept
definition: 1.A.2.c Liquid Fuels [Chemicals][Liquid Fuels][Emissions][CO2][kt][no source][no method][no target][no option][no type]
status: valid
status modified: 2017-02-13
accepted date: 2017-02-13
in scheme: IPCC_variables_MMR

1.A.2.c Liquid Fuels [Chemicals][Liquid Fuels][Emissions][N2O][kt][no source][no method][no target][no option][no type]
type: Concept
definition: 1.A.2.c Liquid Fuels [Chemicals][Liquid Fuels][Emissions][N2O][kt][no source][no method][no target][no option][no type]
status: valid
status modified: 2017-02-13
accepted date: 2017-02-13
in scheme: IPCC_variables_MMR

1.A.2.c Other Fossil Fuel [Chemicals][Other Fossil Fuels][Emissions][CH4][kt][no source][no method][no target][no option][no type]
type: Concept
definition: 1.A.2.c Other Fossil Fuel [Chemicals][Other Fossil Fuels][Emissions][CH4][kt][no source][no method][no target][no option][no type]
status: valid
status modified: 2017-02-13
accepted date: 2017-02-13
in scheme: IPCC_variables_MMR

1.A.2.c Other Fossil Fuel [Chemicals][Other Fossil Fuels][Emissions][CO2][kt][no source][no method][no target][no option][no type]
type: Concept
definition: 1.A.2.c Other Fossil Fuel [Chemicals][Other Fossil Fuels][Emissions][CO2][kt][no source][no method][no target][no option][no type]
status: valid
status modified: 2017-02-13
accepted date: 2017-02-13
in scheme: IPCC_variables_MMR

1.A.2.c Other Fossil Fuel [Chemicals][Other Fossil Fuels][Emissions][N2O][kt][no source][no method][no target][no option][no type]
type: Concept
definition: 1.A.2.c Other Fossil Fuel [Chemicals][Other Fossil Fuels][Emissions][N2O][kt][no source][no method][no target][no option][no type]
status: valid
status modified: 2017-02-13
accepted date: 2017-02-13
in scheme: IPCC_variables_MMR

1.A.2.c Peat [Chemicals][Peat][Emissions][CH4][kt][no source][no method][no target][no option][no type]
type: Concept
definition: 1.A.2.c Peat [Chemicals][Peat][Emissions][CH4][kt][no source][no method][no target][no option][no type]
status: valid
status modified: 2017-02-13
accepted date: 2017-02-13
in scheme: IPCC_variables_MMR

1.A.2.c Peat [Chemicals][Peat][Emissions][CO2][kt][no source][no method][no target][no option][no type]
type: Concept
definition: 1.A.2.c Peat [Chemicals][Peat][Emissions][CO2][kt][no source][no method][no target][no option][no type]
status: valid
status modified: 2017-02-13
accepted date: 2017-02-13
in scheme: IPCC_variables_MMR

1.A.2.c Peat [Chemicals][Peat][Emissions][N2O][kt][no source][no method][no target][no option][no type]
type: Concept
definition: 1.A.2.c Peat [Chemicals][Peat][Emissions][N2O][kt][no source][no method][no target][no option][no type]
status: valid
status modified: 2017-02-13
accepted date: 2017-02-13
in scheme: IPCC_variables_MMR

1.A.2.c Solid Fuels [Chemicals][Solid Fuels][Emissions][CH4][kt][no source][no method][no target][no option][no type]
type: Concept
definition: 1.A.2.c Solid Fuels [Chemicals][Solid Fuels][Emissions][CH4][kt][no source][no method][no target][no option][no type]
status: valid
status modified: 2017-02-13
accepted date: 2017-02-13
in scheme: IPCC_variables_MMR

1.A.2.c Solid Fuels [Chemicals][Solid Fuels][Emissions][CO2][kt][no source][no method][no target][no option][no type]
type: Concept
definition: 1.A.2.c Solid Fuels [Chemicals][Solid Fuels][Emissions][CO2][kt][no source][no method][no target][no option][no type]
status: valid
status modified: 2017-02-13
accepted date: 2017-02-13
in scheme: IPCC_variables_MMR

1.A.2.c Solid Fuels [Chemicals][Solid Fuels][Emissions][N2O][kt][no source][no method][no target][no option][no type]
type: Concept
definition: 1.A.2.c Solid Fuels [Chemicals][Solid Fuels][Emissions][N2O][kt][no source][no method][no target][no option][no type]
status: valid
status modified: 2017-02-13
accepted date: 2017-02-13
in scheme: IPCC_variables_MMR

1.A.2.d [Pulp, Paper and Print][Fuels][Emissions][CH4][kt][no source][no method][no target][no option][no type]
type: Concept
definition: 1.A.2.d [Pulp, Paper and Print][Fuels][Emissions][CH4][kt][no source][no method][no target][no option][no type]
status: valid
status modified: 2017-02-13
accepted date: 2017-02-13
in scheme: IPCC_variables_MMR

1.A.2.d [Pulp, Paper and Print][Fuels][Emissions][CO2][kt][no source][no method][no target][no option][no type]
type: Concept
definition: 1.A.2.d [Pulp, Paper and Print][Fuels][Emissions][CO2][kt][no source][no method][no target][no option][no type]
status: valid
status modified: 2017-02-13
accepted date: 2017-02-13
in scheme: IPCC_variables_MMR

1.A.2.d [Pulp, Paper and Print][Fuels][Emissions][N2O][kt][no source][no method][no target][no option][no type]
type: Concept
definition: 1.A.2.d [Pulp, Paper and Print][Fuels][Emissions][N2O][kt][no source][no method][no target][no option][no type]
status: valid
status modified: 2017-02-13
accepted date: 2017-02-13
in scheme: IPCC_variables_MMR

1.A.2.d Biomass [Pulp, Paper and Print][Biomass][Emissions][CH4][kt][no source][no method][no target][no option][no type]
type: Concept
definition: 1.A.2.d Biomass [Pulp, Paper and Print][Biomass][Emissions][CH4][kt][no source][no method][no target][no option][no type]
status: valid
status modified: 2017-02-13
accepted date: 2017-02-13
in scheme: IPCC_variables_MMR

1.A.2.d Biomass [Pulp, Paper and Print][Biomass][Emissions][CO2][kt][no source][no method][no target][no option][no type]
type: Concept
definition: 1.A.2.d Biomass [Pulp, Paper and Print][Biomass][Emissions][CO2][kt][no source][no method][no target][no option][no type]
status: valid
status modified: 2017-02-13
accepted date: 2017-02-13
in scheme: IPCC_variables_MMR

1.A.2.d Biomass [Pulp, Paper and Print][Biomass][Emissions][N2O][kt][no source][no method][no target][no option][no type]
type: Concept
definition: 1.A.2.d Biomass [Pulp, Paper and Print][Biomass][Emissions][N2O][kt][no source][no method][no target][no option][no type]
status: valid
status modified: 2017-02-13
accepted date: 2017-02-13
in scheme: IPCC_variables_MMR

1.A.2.d Gaseous Fuels [Pulp, Paper and Print][Gaseous Fuels][Emissions][CH4][kt][no source][no method][no target][no option][no type]
type: Concept
definition: 1.A.2.d Gaseous Fuels [Pulp, Paper and Print][Gaseous Fuels][Emissions][CH4][kt][no source][no method][no target][no option][no type]
status: valid
status modified: 2017-02-13
accepted date: 2017-02-13
in scheme: IPCC_variables_MMR

1.A.2.d Gaseous Fuels [Pulp, Paper and Print][Gaseous Fuels][Emissions][CO2][kt][no source][no method][no target][no option][no type]
type: Concept
definition: 1.A.2.d Gaseous Fuels [Pulp, Paper and Print][Gaseous Fuels][Emissions][CO2][kt][no source][no method][no target][no option][no type]
status: valid
status modified: 2017-02-13
accepted date: 2017-02-13
in scheme: IPCC_variables_MMR

1.A.2.d Gaseous Fuels [Pulp, Paper and Print][Gaseous Fuels][Emissions][N2O][kt][no source][no method][no target][no option][no type]
type: Concept
definition: 1.A.2.d Gaseous Fuels [Pulp, Paper and Print][Gaseous Fuels][Emissions][N2O][kt][no source][no method][no target][no option][no type]
status: valid
status modified: 2017-02-13
accepted date: 2017-02-13
in scheme: IPCC_variables_MMR

1.A.2.d Liquid Fuels [Pulp, Paper and Print][Liquid Fuels][Emissions][CH4][kt][no source][no method][no target][no option][no type]
type: Concept
definition: 1.A.2.d Liquid Fuels [Pulp, Paper and Print][Liquid Fuels][Emissions][CH4][kt][no source][no method][no target][no option][no type]
status: valid
status modified: 2017-02-13
accepted date: 2017-02-13
in scheme: IPCC_variables_MMR

1.A.2.d Liquid Fuels [Pulp, Paper and Print][Liquid Fuels][Emissions][CO2][kt][no source][no method][no target][no option][no type]
type: Concept
definition: 1.A.2.d Liquid Fuels [Pulp, Paper and Print][Liquid Fuels][Emissions][CO2][kt][no source][no method][no target][no option][no type]
status: valid
status modified: 2017-02-13
accepted date: 2017-02-13
in scheme: IPCC_variables_MMR

1.A.2.d Liquid Fuels [Pulp, Paper and Print][Liquid Fuels][Emissions][N2O][kt][no source][no method][no target][no option][no type]
type: Concept
definition: 1.A.2.d Liquid Fuels [Pulp, Paper and Print][Liquid Fuels][Emissions][N2O][kt][no source][no method][no target][no option][no type]
status: valid
status modified: 2017-02-13
accepted date: 2017-02-13
in scheme: IPCC_variables_MMR

1.A.2.d Other Fossil Fuel [Pulp, Paper and Print][Other Fossil Fuels][Emissions][CH4][kt][no source][no method][no target][no option][no type]
type: Concept
definition: 1.A.2.d Other Fossil Fuel [Pulp, Paper and Print][Other Fossil Fuels][Emissions][CH4][kt][no source][no method][no target][no option][no type]
status: valid
status modified: 2017-02-13
accepted date: 2017-02-13
in scheme: IPCC_variables_MMR

1.A.2.d Other Fossil Fuel [Pulp, Paper and Print][Other Fossil Fuels][Emissions][CO2][kt][no source][no method][no target][no option][no type]
type: Concept
definition: 1.A.2.d Other Fossil Fuel [Pulp, Paper and Print][Other Fossil Fuels][Emissions][CO2][kt][no source][no method][no target][no option][no type]
status: valid
status modified: 2017-02-13
accepted date: 2017-02-13
in scheme: IPCC_variables_MMR

1.A.2.d Other Fossil Fuel [Pulp, Paper and Print][Other Fossil Fuels][Emissions][N2O][kt][no source][no method][no target][no option][no type]
type: Concept
definition: 1.A.2.d Other Fossil Fuel [Pulp, Paper and Print][Other Fossil Fuels][Emissions][N2O][kt][no source][no method][no target][no option][no type]
status: valid
status modified: 2017-02-13
accepted date: 2017-02-13
in scheme: IPCC_variables_MMR

1.A.2.d Peat [Pulp, Paper and Print][Peat][Emissions][CH4][kt][no source][no method][no target][no option][no type]
type: Concept
definition: 1.A.2.d Peat [Pulp, Paper and Print][Peat][Emissions][CH4][kt][no source][no method][no target][no option][no type]
status: valid
status modified: 2017-02-13
accepted date: 2017-02-13
in scheme: IPCC_variables_MMR

1.A.2.d Peat [Pulp, Paper and Print][Peat][Emissions][CO2][kt][no source][no method][no target][no option][no type]
type: Concept
definition: 1.A.2.d Peat [Pulp, Paper and Print][Peat][Emissions][CO2][kt][no source][no method][no target][no option][no type]
status: valid
status modified: 2017-02-13
accepted date: 2017-02-13
in scheme: IPCC_variables_MMR

1.A.2.d Peat [Pulp, Paper and Print][Peat][Emissions][N2O][kt][no source][no method][no target][no option][no type]
type: Concept
definition: 1.A.2.d Peat [Pulp, Paper and Print][Peat][Emissions][N2O][kt][no source][no method][no target][no option][no type]
status: valid
status modified: 2017-02-13
accepted date: 2017-02-13
in scheme: IPCC_variables_MMR

1.A.2.d Solid Fuels [Pulp, Paper and Print][Solid Fuels][Emissions][CH4][kt][no source][no method][no target][no option][no type]
type: Concept
definition: 1.A.2.d Solid Fuels [Pulp, Paper and Print][Solid Fuels][Emissions][CH4][kt][no source][no method][no target][no option][no type]
status: valid
status modified: 2017-02-13
accepted date: 2017-02-13
in scheme: IPCC_variables_MMR

1.A.2.d Solid Fuels [Pulp, Paper and Print][Solid Fuels][Emissions][CO2][kt][no source][no method][no target][no option][no type]
type: Concept
definition: 1.A.2.d Solid Fuels [Pulp, Paper and Print][Solid Fuels][Emissions][CO2][kt][no source][no method][no target][no option][no type]
status: valid
status modified: 2017-02-13
accepted date: 2017-02-13
in scheme: IPCC_variables_MMR

1.A.2.d Solid Fuels [Pulp, Paper and Print][Solid Fuels][Emissions][N2O][kt][no source][no method][no target][no option][no type]
type: Concept
definition: 1.A.2.d Solid Fuels [Pulp, Paper and Print][Solid Fuels][Emissions][N2O][kt][no source][no method][no target][no option][no type]
status: valid
status modified: 2017-02-13
accepted date: 2017-02-13
in scheme: IPCC_variables_MMR

1.A.2.e [Food Processing, Beverages and Tobacco][Fuels][Emissions][CH4][kt][no source][no method][no target][no option][no type]
type: Concept
definition: 1.A.2.e [Food Processing, Beverages and Tobacco][Fuels][Emissions][CH4][kt][no source][no method][no target][no option][no type]
status: valid
status modified: 2017-02-13
accepted date: 2017-02-13
in scheme: IPCC_variables_MMR

1.A.2.e [Food Processing, Beverages and Tobacco][Fuels][Emissions][CO2][kt][no source][no method][no target][no option][no type]
type: Concept
definition: 1.A.2.e [Food Processing, Beverages and Tobacco][Fuels][Emissions][CO2][kt][no source][no method][no target][no option][no type]
status: valid
status modified: 2017-02-13
accepted date: 2017-02-13
in scheme: IPCC_variables_MMR

1.A.2.e [Food Processing, Beverages and Tobacco][Fuels][Emissions][N2O][kt][no source][no method][no target][no option][no type]
type: Concept
definition: 1.A.2.e [Food Processing, Beverages and Tobacco][Fuels][Emissions][N2O][kt][no source][no method][no target][no option][no type]
status: valid
status modified: 2017-02-13
accepted date: 2017-02-13
in scheme: IPCC_variables_MMR

1.A.2.e Biomass [Food Processing, Beverages and Tobacco][Biomass][Emissions][CH4][kt][no source][no method][no target][no option][no type]
type: Concept
definition: 1.A.2.e Biomass [Food Processing, Beverages and Tobacco][Biomass][Emissions][CH4][kt][no source][no method][no target][no option][no type]
status: valid
status modified: 2017-02-13
accepted date: 2017-02-13
in scheme: IPCC_variables_MMR

1.A.2.e Biomass [Food Processing, Beverages and Tobacco][Biomass][Emissions][CO2][kt][no source][no method][no target][no option][no type]
type: Concept
definition: 1.A.2.e Biomass [Food Processing, Beverages and Tobacco][Biomass][Emissions][CO2][kt][no source][no method][no target][no option][no type]
status: valid
status modified: 2017-02-13
accepted date: 2017-02-13
in scheme: IPCC_variables_MMR

1.A.2.e Biomass [Food Processing, Beverages and Tobacco][Biomass][Emissions][N2O][kt][no source][no method][no target][no option][no type]
type: Concept
definition: 1.A.2.e Biomass [Food Processing, Beverages and Tobacco][Biomass][Emissions][N2O][kt][no source][no method][no target][no option][no type]
status: valid
status modified: 2017-02-13
accepted date: 2017-02-13
in scheme: IPCC_variables_MMR

1.A.2.e Gaseous Fuels [Food Processing, Beverages and Tobacco][Gaseous Fuels][Emissions][CH4][kt][no source][no method][no target][no option][no type]
type: Concept
definition: 1.A.2.e Gaseous Fuels [Food Processing, Beverages and Tobacco][Gaseous Fuels][Emissions][CH4][kt][no source][no method][no target][no option][no type]
status: valid
status modified: 2017-02-13
accepted date: 2017-02-13
in scheme: IPCC_variables_MMR

1.A.2.e Gaseous Fuels [Food Processing, Beverages and Tobacco][Gaseous Fuels][Emissions][CO2][kt][no source][no method][no target][no option][no type]
type: Concept
definition: 1.A.2.e Gaseous Fuels [Food Processing, Beverages and Tobacco][Gaseous Fuels][Emissions][CO2][kt][no source][no method][no target][no option][no type]
status: valid
status modified: 2017-02-13
accepted date: 2017-02-13
in scheme: IPCC_variables_MMR

1.A.2.e Gaseous Fuels [Food Processing, Beverages and Tobacco][Gaseous Fuels][Emissions][N2O][kt][no source][no method][no target][no option][no type]
type: Concept
definition: 1.A.2.e Gaseous Fuels [Food Processing, Beverages and Tobacco][Gaseous Fuels][Emissions][N2O][kt][no source][no method][no target][no option][no type]
status: valid
status modified: 2017-02-13
accepted date: 2017-02-13
in scheme: IPCC_variables_MMR

1.A.2.e Liquid Fuels [Food Processing, Beverages and Tobacco][Liquid Fuels][Emissions][CH4][kt][no source][no method][no target][no option][no type]
type: Concept
definition: 1.A.2.e Liquid Fuels [Food Processing, Beverages and Tobacco][Liquid Fuels][Emissions][CH4][kt][no source][no method][no target][no option][no type]
status: valid
status modified: 2017-02-13
accepted date: 2017-02-13
in scheme: IPCC_variables_MMR

1.A.2.e Liquid Fuels [Food Processing, Beverages and Tobacco][Liquid Fuels][Emissions][CO2][kt][no source][no method][no target][no option][no type]
type: Concept
definition: 1.A.2.e Liquid Fuels [Food Processing, Beverages and Tobacco][Liquid Fuels][Emissions][CO2][kt][no source][no method][no target][no option][no type]
status: valid
status modified: 2017-02-13
accepted date: 2017-02-13
in scheme: IPCC_variables_MMR

1.A.2.e Liquid Fuels [Food Processing, Beverages and Tobacco][Liquid Fuels][Emissions][N2O][kt][no source][no method][no target][no option][no type]
type: Concept
definition: 1.A.2.e Liquid Fuels [Food Processing, Beverages and Tobacco][Liquid Fuels][Emissions][N2O][kt][no source][no method][no target][no option][no type]
status: valid
status modified: 2017-02-13
accepted date: 2017-02-13
in scheme: IPCC_variables_MMR

1.A.2.e Other Fossil Fuel [Food Processing, Beverages and Tobacco][Other Fossil Fuels][Emissions][CH4][kt][no source][no method][no target][no option][no type]
type: Concept
definition: 1.A.2.e Other Fossil Fuel [Food Processing, Beverages and Tobacco][Other Fossil Fuels][Emissions][CH4][kt][no source][no method][no target][no option][no type]
status: valid
status modified: 2017-02-13
accepted date: 2017-02-13
in scheme: IPCC_variables_MMR

1.A.2.e Other Fossil Fuel [Food Processing, Beverages and Tobacco][Other Fossil Fuels][Emissions][CO2][kt][no source][no method][no target][no option][no type]
type: Concept
definition: 1.A.2.e Other Fossil Fuel [Food Processing, Beverages and Tobacco][Other Fossil Fuels][Emissions][CO2][kt][no source][no method][no target][no option][no type]
status: valid
status modified: 2017-02-13
accepted date: 2017-02-13
in scheme: IPCC_variables_MMR

1.A.2.e Other Fossil Fuel [Food Processing, Beverages and Tobacco][Other Fossil Fuels][Emissions][N2O][kt][no source][no method][no target][no option][no type]
type: Concept
definition: 1.A.2.e Other Fossil Fuel [Food Processing, Beverages and Tobacco][Other Fossil Fuels][Emissions][N2O][kt][no source][no method][no target][no option][no type]
status: valid
status modified: 2017-02-13
accepted date: 2017-02-13
in scheme: IPCC_variables_MMR

1.A.2.e Peat [Food Processing, Beverages and Tobacco][Peat][Emissions][CH4][kt][no source][no method][no target][no option][no type]
type: Concept
definition: 1.A.2.e Peat [Food Processing, Beverages and Tobacco][Peat][Emissions][CH4][kt][no source][no method][no target][no option][no type]
status: valid
status modified: 2017-02-13
accepted date: 2017-02-13
in scheme: IPCC_variables_MMR

1.A.2.e Peat [Food Processing, Beverages and Tobacco][Peat][Emissions][CO2][kt][no source][no method][no target][no option][no type]
type: Concept
definition: 1.A.2.e Peat [Food Processing, Beverages and Tobacco][Peat][Emissions][CO2][kt][no source][no method][no target][no option][no type]
status: valid
status modified: 2017-02-13
accepted date: 2017-02-13
in scheme: IPCC_variables_MMR

1.A.2.e Peat [Food Processing, Beverages and Tobacco][Peat][Emissions][N2O][kt][no source][no method][no target][no option][no type]
type: Concept
definition: 1.A.2.e Peat [Food Processing, Beverages and Tobacco][Peat][Emissions][N2O][kt][no source][no method][no target][no option][no type]
status: valid
status modified: 2017-02-13
accepted date: 2017-02-13
in scheme: IPCC_variables_MMR

1.A.2.e Solid Fuels [Food Processing, Beverages and Tobacco][Solid Fuels][Emissions][CH4][kt][no source][no method][no target][no option][no type]
type: Concept
definition: 1.A.2.e Solid Fuels [Food Processing, Beverages and Tobacco][Solid Fuels][Emissions][CH4][kt][no source][no method][no target][no option][no type]
status: valid
status modified: 2017-02-13
accepted date: 2017-02-13
in scheme: IPCC_variables_MMR

1.A.2.e Solid Fuels [Food Processing, Beverages and Tobacco][Solid Fuels][Emissions][CO2][kt][no source][no method][no target][no option][no type]
type: Concept
definition: 1.A.2.e Solid Fuels [Food Processing, Beverages and Tobacco][Solid Fuels][Emissions][CO2][kt][no source][no method][no target][no option][no type]
status: valid
status modified: 2017-02-13
accepted date: 2017-02-13
in scheme: IPCC_variables_MMR

1.A.2.e Solid Fuels [Food Processing, Beverages and Tobacco][Solid Fuels][Emissions][N2O][kt][no source][no method][no target][no option][no type]
type: Concept
definition: 1.A.2.e Solid Fuels [Food Processing, Beverages and Tobacco][Solid Fuels][Emissions][N2O][kt][no source][no method][no target][no option][no type]
status: valid
status modified: 2017-02-13
accepted date: 2017-02-13
in scheme: IPCC_variables_MMR

1.A.2.f [Non-metallic minerals][Fuels][Emissions][CH4][kt][no source][no method][no target][no option][no type]
type: Concept
definition: 1.A.2.f [Non-metallic minerals][Fuels][Emissions][CH4][kt][no source][no method][no target][no option][no type]
status: valid
status modified: 2017-02-13
accepted date: 2017-02-13
in scheme: IPCC_variables_MMR

1.A.2.f [Non-metallic minerals][Fuels][Emissions][CO2][kt][no source][no method][no target][no option][no type]
type: Concept
definition: 1.A.2.f [Non-metallic minerals][Fuels][Emissions][CO2][kt][no source][no method][no target][no option][no type]
status: valid
status modified: 2017-02-13
accepted date: 2017-02-13
in scheme: IPCC_variables_MMR

1.A.2.f [Non-metallic minerals][Fuels][Emissions][N2O][kt][no source][no method][no target][no option][no type]
type: Concept
definition: 1.A.2.f [Non-metallic minerals][Fuels][Emissions][N2O][kt][no source][no method][no target][no option][no type]
status: valid
status modified: 2017-02-13
accepted date: 2017-02-13
in scheme: IPCC_variables_MMR

1.A.2.f Biomass [Non-metallic minerals][Biomass][Emissions][CH4][kt][no source][no method][no target][no option][no type]
type: Concept
definition: 1.A.2.f Biomass [Non-metallic minerals][Biomass][Emissions][CH4][kt][no source][no method][no target][no option][no type]
status: valid
status modified: 2017-02-13
accepted date: 2017-02-13
in scheme: IPCC_variables_MMR

1.A.2.f Biomass [Non-metallic minerals][Biomass][Emissions][CO2][kt][no source][no method][no target][no option][no type]
type: Concept
definition: 1.A.2.f Biomass [Non-metallic minerals][Biomass][Emissions][CO2][kt][no source][no method][no target][no option][no type]
status: valid
status modified: 2017-02-13
accepted date: 2017-02-13
in scheme: IPCC_variables_MMR

1.A.2.f Biomass [Non-metallic minerals][Biomass][Emissions][N2O][kt][no source][no method][no target][no option][no type]
type: Concept
definition: 1.A.2.f Biomass [Non-metallic minerals][Biomass][Emissions][N2O][kt][no source][no method][no target][no option][no type]
status: valid
status modified: 2017-02-13
accepted date: 2017-02-13
in scheme: IPCC_variables_MMR

1.A.2.f Gaseous Fuels [Non-metallic minerals][Gaseous Fuels][Emissions][CH4][kt][no source][no method][no target][no option][no type]
type: Concept
definition: 1.A.2.f Gaseous Fuels [Non-metallic minerals][Gaseous Fuels][Emissions][CH4][kt][no source][no method][no target][no option][no type]
status: valid
status modified: 2017-02-13
accepted date: 2017-02-13
in scheme: IPCC_variables_MMR

1.A.2.f Gaseous Fuels [Non-metallic minerals][Gaseous Fuels][Emissions][CO2][kt][no source][no method][no target][no option][no type]
type: Concept
definition: 1.A.2.f Gaseous Fuels [Non-metallic minerals][Gaseous Fuels][Emissions][CO2][kt][no source][no method][no target][no option][no type]
status: valid
status modified: 2017-02-13
accepted date: 2017-02-13
in scheme: IPCC_variables_MMR

1.A.2.f Gaseous Fuels [Non-metallic minerals][Gaseous Fuels][Emissions][N2O][kt][no source][no method][no target][no option][no type]
type: Concept
definition: 1.A.2.f Gaseous Fuels [Non-metallic minerals][Gaseous Fuels][Emissions][N2O][kt][no source][no method][no target][no option][no type]
status: valid
status modified: 2017-02-13
accepted date: 2017-02-13
in scheme: IPCC_variables_MMR

1.A.2.f Liquid Fuels [Non-metallic minerals][Liquid Fuels][Emissions][CH4][kt][no source][no method][no target][no option][no type]
type: Concept
definition: 1.A.2.f Liquid Fuels [Non-metallic minerals][Liquid Fuels][Emissions][CH4][kt][no source][no method][no target][no option][no type]
status: valid
status modified: 2017-02-13
accepted date: 2017-02-13
in scheme: IPCC_variables_MMR

1.A.2.f Liquid Fuels [Non-metallic minerals][Liquid Fuels][Emissions][CO2][kt][no source][no method][no target][no option][no type]
type: Concept
definition: 1.A.2.f Liquid Fuels [Non-metallic minerals][Liquid Fuels][Emissions][CO2][kt][no source][no method][no target][no option][no type]
status: valid
status modified: 2017-02-13
accepted date: 2017-02-13
in scheme: IPCC_variables_MMR

1.A.2.f Liquid Fuels [Non-metallic minerals][Liquid Fuels][Emissions][N2O][kt][no source][no method][no target][no option][no type]
type: Concept
definition: 1.A.2.f Liquid Fuels [Non-metallic minerals][Liquid Fuels][Emissions][N2O][kt][no source][no method][no target][no option][no type]
status: valid
status modified: 2017-02-13
accepted date: 2017-02-13
in scheme: IPCC_variables_MMR

1.A.2.f Other Fossil Fuel [Non-metallic minerals][Other Fossil Fuels][Emissions][CH4][kt][no source][no method][no target][no option][no type]
type: Concept
definition: 1.A.2.f Other Fossil Fuel [Non-metallic minerals][Other Fossil Fuels][Emissions][CH4][kt][no source][no method][no target][no option][no type]
status: valid
status modified: 2017-02-13
accepted date: 2017-02-13
in scheme: IPCC_variables_MMR

1.A.2.f Other Fossil Fuel [Non-metallic minerals][Other Fossil Fuels][Emissions][CO2][kt][no source][no method][no target][no option][no type]
type: Concept
definition: 1.A.2.f Other Fossil Fuel [Non-metallic minerals][Other Fossil Fuels][Emissions][CO2][kt][no source][no method][no target][no option][no type]
status: valid
status modified: 2017-02-13
accepted date: 2017-02-13
in scheme: IPCC_variables_MMR

1.A.2.f Other Fossil Fuel [Non-metallic minerals][Other Fossil Fuels][Emissions][N2O][kt][no source][no method][no target][no option][no type]
type: Concept
definition: 1.A.2.f Other Fossil Fuel [Non-metallic minerals][Other Fossil Fuels][Emissions][N2O][kt][no source][no method][no target][no option][no type]
status: valid
status modified: 2017-02-13
accepted date: 2017-02-13
in scheme: IPCC_variables_MMR

1.A.2.f Peat [Non-metallic minerals][Peat][Emissions][CH4][kt][no source][no method][no target][no option][no type]
type: Concept
definition: 1.A.2.f Peat [Non-metallic minerals][Peat][Emissions][CH4][kt][no source][no method][no target][no option][no type]
status: valid
status modified: 2017-02-13
accepted date: 2017-02-13
in scheme: IPCC_variables_MMR

1.A.2.f Peat [Non-metallic minerals][Peat][Emissions][CO2][kt][no source][no method][no target][no option][no type]
type: Concept
definition: 1.A.2.f Peat [Non-metallic minerals][Peat][Emissions][CO2][kt][no source][no method][no target][no option][no type]
status: valid
status modified: 2017-02-13
accepted date: 2017-02-13
in scheme: IPCC_variables_MMR

1.A.2.f Peat [Non-metallic minerals][Peat][Emissions][N2O][kt][no source][no method][no target][no option][no type]
type: Concept
definition: 1.A.2.f Peat [Non-metallic minerals][Peat][Emissions][N2O][kt][no source][no method][no target][no option][no type]
status: valid
status modified: 2017-02-13
accepted date: 2017-02-13
in scheme: IPCC_variables_MMR

1.A.2.f Solid Fuels [Non-metallic minerals][Solid Fuels][Emissions][CH4][kt][no source][no method][no target][no option][no type]
type: Concept
definition: 1.A.2.f Solid Fuels [Non-metallic minerals][Solid Fuels][Emissions][CH4][kt][no source][no method][no target][no option][no type]
status: valid
status modified: 2017-02-13
accepted date: 2017-02-13
in scheme: IPCC_variables_MMR

1.A.2.f Solid Fuels [Non-metallic minerals][Solid Fuels][Emissions][CO2][kt][no source][no method][no target][no option][no type]
type: Concept
definition: 1.A.2.f Solid Fuels [Non-metallic minerals][Solid Fuels][Emissions][CO2][kt][no source][no method][no target][no option][no type]
status: valid
status modified: 2017-02-13
accepted date: 2017-02-13
in scheme: IPCC_variables_MMR

1.A.2.f Solid Fuels [Non-metallic minerals][Solid Fuels][Emissions][N2O][kt][no source][no method][no target][no option][no type]
type: Concept
definition: 1.A.2.f Solid Fuels [Non-metallic minerals][Solid Fuels][Emissions][N2O][kt][no source][no method][no target][no option][no type]
status: valid
status modified: 2017-02-13
accepted date: 2017-02-13
in scheme: IPCC_variables_MMR

1.A.2.g [Other Manufacturing Industries and Constructions][Biomass][Emissions][CH4][kt][no source][no method][no target][no option][no type]
type: Concept
definition: 1.A.2.g [Other Manufacturing Industries and Constructions][Biomass][Emissions][CH4][kt][no source][no method][no target][no option][no type]
status: valid
status modified: 2017-02-13
accepted date: 2017-02-13
in scheme: IPCC_variables_MMR

1.A.2.g [Other Manufacturing Industries and Constructions][Biomass][Emissions][CO2][kt][no source][no method][no target][no option][no type]
type: Concept
definition: 1.A.2.g [Other Manufacturing Industries and Constructions][Biomass][Emissions][CO2][kt][no source][no method][no target][no option][no type]
status: valid
status modified: 2017-02-13
accepted date: 2017-02-13
in scheme: IPCC_variables_MMR

1.A.2.g [Other Manufacturing Industries and Constructions][Biomass][Emissions][N2O][kt][no source][no method][no target][no option][no type]
type: Concept
definition: 1.A.2.g [Other Manufacturing Industries and Constructions][Biomass][Emissions][N2O][kt][no source][no method][no target][no option][no type]
status: valid
status modified: 2017-02-13
accepted date: 2017-02-13
in scheme: IPCC_variables_MMR

1.A.2.g [Other Manufacturing Industries and Constructions][Fossil fuels][Emissions][CO2][kt][no source][no method][no target][no option][no type]
type: Concept
definition: 1.A.2.g [Other Manufacturing Industries and Constructions][Fossil fuels][Emissions][CO2][kt][no source][no method][no target][no option][no type]
status: valid
status modified: 2017-02-13
accepted date: 2017-02-13
in scheme: IPCC_variables_MMR

1.A.2.g [Other Manufacturing Industries and Constructions][Fuels][Emissions][CH4][kt][no source][no method][no target][no option][no type]
type: Concept
definition: 1.A.2.g [Other Manufacturing Industries and Constructions][Fuels][Emissions][CH4][kt][no source][no method][no target][no option][no type]
status: valid
status modified: 2017-02-13
accepted date: 2017-02-13
in scheme: IPCC_variables_MMR

1.A.2.g [Other Manufacturing Industries and Constructions][Fuels][Emissions][N2O][kt][no source][no method][no target][no option][no type]
type: Concept
definition: 1.A.2.g [Other Manufacturing Industries and Constructions][Fuels][Emissions][N2O][kt][no source][no method][no target][no option][no type]
status: valid
status modified: 2017-02-13
accepted date: 2017-02-13
in scheme: IPCC_variables_MMR

1.A.2.g [Other Manufacturing Industries and Constructions][Gaseous Fuels][Emissions][CH4][kt][no source][no method][no target][no option][no type]
type: Concept
definition: 1.A.2.g [Other Manufacturing Industries and Constructions][Gaseous Fuels][Emissions][CH4][kt][no source][no method][no target][no option][no type]
status: valid
status modified: 2017-02-13
accepted date: 2017-02-13
in scheme: IPCC_variables_MMR

1.A.2.g [Other Manufacturing Industries and Constructions][Gaseous Fuels][Emissions][CO2][kt][no source][no method][no target][no option][no type]
type: Concept
definition: 1.A.2.g [Other Manufacturing Industries and Constructions][Gaseous Fuels][Emissions][CO2][kt][no source][no method][no target][no option][no type]
status: valid
status modified: 2017-02-13
accepted date: 2017-02-13
in scheme: IPCC_variables_MMR

1.A.2.g [Other Manufacturing Industries and Constructions][Gaseous Fuels][Emissions][N2O][kt][no source][no method][no target][no option][no type]
type: Concept
definition: 1.A.2.g [Other Manufacturing Industries and Constructions][Gaseous Fuels][Emissions][N2O][kt][no source][no method][no target][no option][no type]
status: valid
status modified: 2017-02-13
accepted date: 2017-02-13
in scheme: IPCC_variables_MMR

1.A.2.g [Other Manufacturing Industries and Constructions][Liquid Fuels][Emissions][CH4][kt][no source][no method][no target][no option][no type]
type: Concept
definition: 1.A.2.g [Other Manufacturing Industries and Constructions][Liquid Fuels][Emissions][CH4][kt][no source][no method][no target][no option][no type]
status: valid
status modified: 2017-02-13
accepted date: 2017-02-13
in scheme: IPCC_variables_MMR

1.A.2.g [Other Manufacturing Industries and Constructions][Liquid Fuels][Emissions][CO2][kt][no source][no method][no target][no option][no type]
type: Concept
definition: 1.A.2.g [Other Manufacturing Industries and Constructions][Liquid Fuels][Emissions][CO2][kt][no source][no method][no target][no option][no type]
status: valid
status modified: 2017-02-13
accepted date: 2017-02-13
in scheme: IPCC_variables_MMR

1.A.2.g [Other Manufacturing Industries and Constructions][Liquid Fuels][Emissions][N2O][kt][no source][no method][no target][no option][no type]
type: Concept
definition: 1.A.2.g [Other Manufacturing Industries and Constructions][Liquid Fuels][Emissions][N2O][kt][no source][no method][no target][no option][no type]
status: valid
status modified: 2017-02-13
accepted date: 2017-02-13
in scheme: IPCC_variables_MMR

1.A.2.g [Other Manufacturing Industries and Constructions][Other Fossil Fuels][Emissions][CH4][kt][no source][no method][no target][no option][no type]
type: Concept
definition: 1.A.2.g [Other Manufacturing Industries and Constructions][Other Fossil Fuels][Emissions][CH4][kt][no source][no method][no target][no option][no type]
status: valid
status modified: 2017-02-13
accepted date: 2017-02-13
in scheme: IPCC_variables_MMR

1.A.2.g [Other Manufacturing Industries and Constructions][Other Fossil Fuels][Emissions][CO2][kt][no source][no method][no target][no option][no type]
type: Concept
definition: 1.A.2.g [Other Manufacturing Industries and Constructions][Other Fossil Fuels][Emissions][CO2][kt][no source][no method][no target][no option][no type]
status: valid
status modified: 2017-02-13
accepted date: 2017-02-13
in scheme: IPCC_variables_MMR

1.A.2.g [Other Manufacturing Industries and Constructions][Other Fossil Fuels][Emissions][N2O][kt][no source][no method][no target][no option][no type]
type: Concept
definition: 1.A.2.g [Other Manufacturing Industries and Constructions][Other Fossil Fuels][Emissions][N2O][kt][no source][no method][no target][no option][no type]
status: valid
status modified: 2017-02-13
accepted date: 2017-02-13
in scheme: IPCC_variables_MMR

1.A.2.g [Other Manufacturing Industries and Constructions][Peat][Emissions][CH4][kt][no source][no method][no target][no option][no type]
type: Concept
definition: 1.A.2.g [Other Manufacturing Industries and Constructions][Peat][Emissions][CH4][kt][no source][no method][no target][no option][no type]
status: valid
status modified: 2017-02-13
accepted date: 2017-02-13
in scheme: IPCC_variables_MMR

1.A.2.g [Other Manufacturing Industries and Constructions][Peat][Emissions][CO2][kt][no source][no method][no target][no option][no type]
type: Concept
definition: 1.A.2.g [Other Manufacturing Industries and Constructions][Peat][Emissions][CO2][kt][no source][no method][no target][no option][no type]
status: valid
status modified: 2017-02-13
accepted date: 2017-02-13
in scheme: IPCC_variables_MMR

1.A.2.g [Other Manufacturing Industries and Constructions][Peat][Emissions][N2O][kt][no source][no method][no target][no option][no type]
type: Concept
definition: 1.A.2.g [Other Manufacturing Industries and Constructions][Peat][Emissions][N2O][kt][no source][no method][no target][no option][no type]
status: valid
status modified: 2017-02-13
accepted date: 2017-02-13
in scheme: IPCC_variables_MMR

1.A.2.g [Other Manufacturing Industries and Constructions][Solid Fuels][Emissions][CH4][kt][no source][no method][no target][no option][no type]
type: Concept
definition: 1.A.2.g [Other Manufacturing Industries and Constructions][Solid Fuels][Emissions][CH4][kt][no source][no method][no target][no option][no type]
status: valid
status modified: 2017-02-13
accepted date: 2017-02-13
in scheme: IPCC_variables_MMR

1.A.2.g [Other Manufacturing Industries and Constructions][Solid Fuels][Emissions][CO2][kt][no source][no method][no target][no option][no type]
type: Concept
definition: 1.A.2.g [Other Manufacturing Industries and Constructions][Solid Fuels][Emissions][CO2][kt][no source][no method][no target][no option][no type]
status: valid
status modified: 2017-02-13
accepted date: 2017-02-13
in scheme: IPCC_variables_MMR

1.A.2.g [Other Manufacturing Industries and Constructions][Solid Fuels][Emissions][N2O][kt][no source][no method][no target][no option][no type]
type: Concept
definition: 1.A.2.g [Other Manufacturing Industries and Constructions][Solid Fuels][Emissions][N2O][kt][no source][no method][no target][no option][no type]
status: valid
status modified: 2017-02-13
accepted date: 2017-02-13
in scheme: IPCC_variables_MMR

1.A.3 [Transport][Biomass][Emissions][CH4][kt][no source][no method][no target][no option][no type]
type: Concept
definition: 1.A.3 [Transport][Biomass][Emissions][CH4][kt][no source][no method][no target][no option][no type]
status: valid
status modified: 2017-02-13
accepted date: 2017-02-13
in scheme: IPCC_variables_MMR

1.A.3 [Transport][Biomass][Emissions][CO2][kt][no source][no method][no target][no option][no type]
type: Concept
definition: 1.A.3 [Transport][Biomass][Emissions][CO2][kt][no source][no method][no target][no option][no type]
status: valid
status modified: 2017-02-13
accepted date: 2017-02-13
in scheme: IPCC_variables_MMR

1.A.3 [Transport][Biomass][Emissions][N2O][kt][no source][no method][no target][no option][no type]
type: Concept
definition: 1.A.3 [Transport][Biomass][Emissions][N2O][kt][no source][no method][no target][no option][no type]
status: valid
status modified: 2017-02-13
accepted date: 2017-02-13
in scheme: IPCC_variables_MMR

1.A.3 [Transport][Fuels][Emissions][CH4][kt][no source][no method][no target][no option][no type]
type: Concept
definition: 1.A.3 [Transport][Fuels][Emissions][CH4][kt][no source][no method][no target][no option][no type]
status: valid
status modified: 2017-02-13
accepted date: 2017-02-13
in scheme: IPCC_variables_MMR

1.A.3 [Transport][Fuels][Emissions][CO2][kt][no source][no method][no target][no option][no type]
type: Concept
definition: 1.A.3 [Transport][Fuels][Emissions][CO2][kt][no source][no method][no target][no option][no type]
status: valid
status modified: 2017-02-13
accepted date: 2017-02-13
in scheme: IPCC_variables_MMR

1.A.3 [Transport][Fuels][Emissions][N2O][kt][no source][no method][no target][no option][no type]
type: Concept
definition: 1.A.3 [Transport][Fuels][Emissions][N2O][kt][no source][no method][no target][no option][no type]
status: valid
status modified: 2017-02-13
accepted date: 2017-02-13
in scheme: IPCC_variables_MMR

1.A.3 [Transport][Gaseous Fuels][Emissions][CH4][kt][no source][no method][no target][no option][no type]
type: Concept
definition: 1.A.3 [Transport][Gaseous Fuels][Emissions][CH4][kt][no source][no method][no target][no option][no type]
status: valid
status modified: 2017-02-13
accepted date: 2017-02-13
in scheme: IPCC_variables_MMR

1.A.3 [Transport][Gaseous Fuels][Emissions][CO2][kt][no source][no method][no target][no option][no type]
type: Concept
definition: 1.A.3 [Transport][Gaseous Fuels][Emissions][CO2][kt][no source][no method][no target][no option][no type]
status: valid
status modified: 2017-02-13
accepted date: 2017-02-13
in scheme: IPCC_variables_MMR

1.A.3 [Transport][Gaseous Fuels][Emissions][N2O][kt][no source][no method][no target][no option][no type]
type: Concept
definition: 1.A.3 [Transport][Gaseous Fuels][Emissions][N2O][kt][no source][no method][no target][no option][no type]
status: valid
status modified: 2017-02-13
accepted date: 2017-02-13
in scheme: IPCC_variables_MMR

1.A.3 [Transport][Liquid Fuels][Emissions][CH4][kt][no source][no method][no target][no option][no type]
type: Concept
definition: 1.A.3 [Transport][Liquid Fuels][Emissions][CH4][kt][no source][no method][no target][no option][no type]
status: valid
status modified: 2017-02-13
accepted date: 2017-02-13
in scheme: IPCC_variables_MMR

1.A.3 [Transport][Liquid Fuels][Emissions][CO2][kt][no source][no method][no target][no option][no type]
type: Concept
definition: 1.A.3 [Transport][Liquid Fuels][Emissions][CO2][kt][no source][no method][no target][no option][no type]
status: valid
status modified: 2017-02-13
accepted date: 2017-02-13
in scheme: IPCC_variables_MMR

1.A.3 [Transport][Liquid Fuels][Emissions][N2O][kt][no source][no method][no target][no option][no type]
type: Concept
definition: 1.A.3 [Transport][Liquid Fuels][Emissions][N2O][kt][no source][no method][no target][no option][no type]
status: valid
status modified: 2017-02-13
accepted date: 2017-02-13
in scheme: IPCC_variables_MMR

1.A.3 [Transport][Other Fossil Fuels][Emissions][CH4][kt][no source][no method][no target][no option][no type]
type: Concept
definition: 1.A.3 [Transport][Other Fossil Fuels][Emissions][CH4][kt][no source][no method][no target][no option][no type]
status: valid
status modified: 2017-02-13
accepted date: 2017-02-13
in scheme: IPCC_variables_MMR

1.A.3 [Transport][Other Fossil Fuels][Emissions][CO2][kt][no source][no method][no target][no option][no type]
type: Concept
definition: 1.A.3 [Transport][Other Fossil Fuels][Emissions][CO2][kt][no source][no method][no target][no option][no type]
status: valid
status modified: 2017-02-13
accepted date: 2017-02-13
in scheme: IPCC_variables_MMR

1.A.3 [Transport][Other Fossil Fuels][Emissions][N2O][kt][no source][no method][no target][no option][no type]
type: Concept
definition: 1.A.3 [Transport][Other Fossil Fuels][Emissions][N2O][kt][no source][no method][no target][no option][no type]
status: valid
status modified: 2017-02-13
accepted date: 2017-02-13
in scheme: IPCC_variables_MMR

1.A.3 [Transport][Solid Fuels][Emissions][CH4][kt][no source][no method][no target][no option][no type]
type: Concept
definition: 1.A.3 [Transport][Solid Fuels][Emissions][CH4][kt][no source][no method][no target][no option][no type]
status: valid
status modified: 2017-02-13
accepted date: 2017-02-13
in scheme: IPCC_variables_MMR

1.A.3 [Transport][Solid Fuels][Emissions][CO2][kt][no source][no method][no target][no option][no type]
type: Concept
definition: 1.A.3 [Transport][Solid Fuels][Emissions][CO2][kt][no source][no method][no target][no option][no type]
status: valid
status modified: 2017-02-13
accepted date: 2017-02-13
in scheme: IPCC_variables_MMR

1.A.3 [Transport][Solid Fuels][Emissions][N2O][kt][no source][no method][no target][no option][no type]
type: Concept
definition: 1.A.3 [Transport][Solid Fuels][Emissions][N2O][kt][no source][no method][no target][no option][no type]
status: valid
status modified: 2017-02-13
accepted date: 2017-02-13
in scheme: IPCC_variables_MMR

1.A.3.a [Domestic Aviation][Fossil fuels][Emissions][CO2][kt][no source][no method][no target][no option][no type]
type: Concept
definition: 1.A.3.a [Domestic Aviation][Fossil fuels][Emissions][CO2][kt][no source][no method][no target][no option][no type]
status: valid
status modified: 2017-02-13
accepted date: 2017-02-13
in scheme: IPCC_variables_MMR

1.A.3.a [Domestic Aviation][Fuels][Emissions][CH4][kt][no source][no method][no target][no option][no type]
type: Concept
definition: 1.A.3.a [Domestic Aviation][Fuels][Emissions][CH4][kt][no source][no method][no target][no option][no type]
status: valid
status modified: 2017-02-13
accepted date: 2017-02-13
in scheme: IPCC_variables_MMR

1.A.3.a [Domestic Aviation][Fuels][Emissions][CO2][kt][no source][no method][no target][no option][no type]
type: Concept
definition: 1.A.3.a [Domestic Aviation][Fuels][Emissions][CO2][kt][no source][no method][no target][no option][no type]
status: valid
status modified: 2017-02-13
accepted date: 2017-02-13
in scheme: IPCC_variables_MMR

1.A.3.a [Domestic Aviation][Fuels][Emissions][N2O][kt][no source][no method][no target][no option][no type]
type: Concept
definition: 1.A.3.a [Domestic Aviation][Fuels][Emissions][N2O][kt][no source][no method][no target][no option][no type]
status: valid
status modified: 2017-02-13
accepted date: 2017-02-13
in scheme: IPCC_variables_MMR

1.A.3.a [Domestic Aviation][Liquid Fuels][Emissions][CH4][kt][no source][no method][no target][no option][no type]
type: Concept
definition: 1.A.3.a [Domestic Aviation][Liquid Fuels][Emissions][CH4][kt][no source][no method][no target][no option][no type]
status: valid
status modified: 2017-02-13
accepted date: 2017-02-13
in scheme: IPCC_variables_MMR

1.A.3.a [Domestic Aviation][Liquid Fuels][Emissions][N2O][kt][no source][no method][no target][no option][no type]
type: Concept
definition: 1.A.3.a [Domestic Aviation][Liquid Fuels][Emissions][N2O][kt][no source][no method][no target][no option][no type]
status: valid
status modified: 2017-02-13
accepted date: 2017-02-13
in scheme: IPCC_variables_MMR

1.A.3.a Aviation Gasoline [Domestic Aviation][Aviation Gasoline][Emissions][CH4][kt][no source][no method][no target][no option][no type]
type: Concept
definition: 1.A.3.a Aviation Gasoline [Domestic Aviation][Aviation Gasoline][Emissions][CH4][kt][no source][no method][no target][no option][no type]
status: valid
status modified: 2017-02-13
accepted date: 2017-02-13
in scheme: IPCC_variables_MMR

1.A.3.a Aviation Gasoline [Domestic Aviation][Aviation Gasoline][Emissions][CO2][kt][no source][no method][no target][no option][no type]
type: Concept
definition: 1.A.3.a Aviation Gasoline [Domestic Aviation][Aviation Gasoline][Emissions][CO2][kt][no source][no method][no target][no option][no type]
status: valid
status modified: 2017-02-13
accepted date: 2017-02-13
in scheme: IPCC_variables_MMR

1.A.3.a Aviation Gasoline [Domestic Aviation][Aviation Gasoline][Emissions][N2O][kt][no source][no method][no target][no option][no type]
type: Concept
definition: 1.A.3.a Aviation Gasoline [Domestic Aviation][Aviation Gasoline][Emissions][N2O][kt][no source][no method][no target][no option][no type]
status: valid
status modified: 2017-02-13
accepted date: 2017-02-13
in scheme: IPCC_variables_MMR

1.A.3.a Biomass [Domestic Aviation][Biomass][Emissions][CH4][kt][no source][no method][no target][no option][no type]
type: Concept
definition: 1.A.3.a Biomass [Domestic Aviation][Biomass][Emissions][CH4][kt][no source][no method][no target][no option][no type]
status: valid
status modified: 2017-02-13
accepted date: 2017-02-13
in scheme: IPCC_variables_MMR

1.A.3.a Biomass [Domestic Aviation][Biomass][Emissions][CO2][kt][no source][no method][no target][no option][no type]
type: Concept
definition: 1.A.3.a Biomass [Domestic Aviation][Biomass][Emissions][CO2][kt][no source][no method][no target][no option][no type]
status: valid
status modified: 2017-02-13
accepted date: 2017-02-13
in scheme: IPCC_variables_MMR

1.A.3.a Biomass [Domestic Aviation][Biomass][Emissions][N2O][kt][no source][no method][no target][no option][no type]
type: Concept
definition: 1.A.3.a Biomass [Domestic Aviation][Biomass][Emissions][N2O][kt][no source][no method][no target][no option][no type]
status: valid
status modified: 2017-02-13
accepted date: 2017-02-13
in scheme: IPCC_variables_MMR

1.A.3.a Jet Kerosene [Domestic Aviation][Jet Kerosene][Emissions][CH4][kt][no source][no method][no target][no option][no type]
type: Concept
definition: 1.A.3.a Jet Kerosene [Domestic Aviation][Jet Kerosene][Emissions][CH4][kt][no source][no method][no target][no option][no type]
status: valid
status modified: 2017-02-13
accepted date: 2017-02-13
in scheme: IPCC_variables_MMR

1.A.3.a Jet Kerosene [Domestic Aviation][Jet Kerosene][Emissions][CO2][kt][no source][no method][no target][no option][no type]
type: Concept
definition: 1.A.3.a Jet Kerosene [Domestic Aviation][Jet Kerosene][Emissions][CO2][kt][no source][no method][no target][no option][no type]
status: valid
status modified: 2017-02-13
accepted date: 2017-02-13
in scheme: IPCC_variables_MMR

1.A.3.a Jet Kerosene [Domestic Aviation][Jet Kerosene][Emissions][N2O][kt][no source][no method][no target][no option][no type]
type: Concept
definition: 1.A.3.a Jet Kerosene [Domestic Aviation][Jet Kerosene][Emissions][N2O][kt][no source][no method][no target][no option][no type]
status: valid
status modified: 2017-02-13
accepted date: 2017-02-13
in scheme: IPCC_variables_MMR

1.A.3.b [Road Transportation][Biomass][Emissions][CH4][kt][no source][no method][no target][no option][no type]
type: Concept
definition: 1.A.3.b [Road Transportation][Biomass][Emissions][CH4][kt][no source][no method][no target][no option][no type]
status: valid
status modified: 2017-02-13
accepted date: 2017-02-13
in scheme: IPCC_variables_MMR

1.A.3.b [Road Transportation][Biomass][Emissions][CO2][kt][no source][no method][no target][no option][no type]
type: Concept
definition: 1.A.3.b [Road Transportation][Biomass][Emissions][CO2][kt][no source][no method][no target][no option][no type]
status: valid
status modified: 2017-02-13
accepted date: 2017-02-13
in scheme: IPCC_variables_MMR

1.A.3.b [Road Transportation][Biomass][Emissions][N2O][kt][no source][no method][no target][no option][no type]
type: Concept
definition: 1.A.3.b [Road Transportation][Biomass][Emissions][N2O][kt][no source][no method][no target][no option][no type]
status: valid
status modified: 2017-02-13
accepted date: 2017-02-13
in scheme: IPCC_variables_MMR

1.A.3.b [Road Transportation][Diesel Oil][Emissions][CH4][kt][no source][no method][no target][no option][no type]
type: Concept
definition: 1.A.3.b [Road Transportation][Diesel Oil][Emissions][CH4][kt][no source][no method][no target][no option][no type]
status: valid
status modified: 2017-02-13
accepted date: 2017-02-13
in scheme: IPCC_variables_MMR

1.A.3.b [Road Transportation][Diesel Oil][Emissions][CO2][kt][no source][no method][no target][no option][no type]
type: Concept
definition: 1.A.3.b [Road Transportation][Diesel Oil][Emissions][CO2][kt][no source][no method][no target][no option][no type]
status: valid
status modified: 2017-02-13
accepted date: 2017-02-13
in scheme: IPCC_variables_MMR

1.A.3.b [Road Transportation][Diesel Oil][Emissions][N2O][kt][no source][no method][no target][no option][no type]
type: Concept
definition: 1.A.3.b [Road Transportation][Diesel Oil][Emissions][N2O][kt][no source][no method][no target][no option][no type]
status: valid
status modified: 2017-02-13
accepted date: 2017-02-13
in scheme: IPCC_variables_MMR

1.A.3.b [Road Transportation][Fossil fuels][Emissions][CO2][kt][no source][no method][no target][no option][no type]
type: Concept
definition: 1.A.3.b [Road Transportation][Fossil fuels][Emissions][CO2][kt][no source][no method][no target][no option][no type]
status: valid
status modified: 2017-02-13
accepted date: 2017-02-13
in scheme: IPCC_variables_MMR

1.A.3.b [Road Transportation][Fuels][Emissions][CH4][kt][no source][no method][no target][no option][no type]
type: Concept
definition: 1.A.3.b [Road Transportation][Fuels][Emissions][CH4][kt][no source][no method][no target][no option][no type]
status: valid
status modified: 2017-02-13
accepted date: 2017-02-13
in scheme: IPCC_variables_MMR

1.A.3.b [Road Transportation][Fuels][Emissions][N2O][kt][no source][no method][no target][no option][no type]
type: Concept
definition: 1.A.3.b [Road Transportation][Fuels][Emissions][N2O][kt][no source][no method][no target][no option][no type]
status: valid
status modified: 2017-02-13
accepted date: 2017-02-13
in scheme: IPCC_variables_MMR

1.A.3.b [Road Transportation][Gaseous Fuels][Emissions][CH4][kt][no source][no method][no target][no option][no type]
type: Concept
definition: 1.A.3.b [Road Transportation][Gaseous Fuels][Emissions][CH4][kt][no source][no method][no target][no option][no type]
status: valid
status modified: 2017-02-13
accepted date: 2017-02-13
in scheme: IPCC_variables_MMR

1.A.3.b [Road Transportation][Gaseous Fuels][Emissions][CO2][kt][no source][no method][no target][no option][no type]
type: Concept
definition: 1.A.3.b [Road Transportation][Gaseous Fuels][Emissions][CO2][kt][no source][no method][no target][no option][no type]
status: valid
status modified: 2017-02-13
accepted date: 2017-02-13
in scheme: IPCC_variables_MMR

1.A.3.b [Road Transportation][Gaseous Fuels][Emissions][N2O][kt][no source][no method][no target][no option][no type]
type: Concept
definition: 1.A.3.b [Road Transportation][Gaseous Fuels][Emissions][N2O][kt][no source][no method][no target][no option][no type]
status: valid
status modified: 2017-02-13
accepted date: 2017-02-13
in scheme: IPCC_variables_MMR

1.A.3.b [Road Transportation][Gasoline][Emissions][CH4][kt][no source][no method][no target][no option][no type]
type: Concept
definition: 1.A.3.b [Road Transportation][Gasoline][Emissions][CH4][kt][no source][no method][no target][no option][no type]
status: valid
status modified: 2017-02-13
accepted date: 2017-02-13
in scheme: IPCC_variables_MMR

1.A.3.b [Road Transportation][Gasoline][Emissions][CO2][kt][no source][no method][no target][no option][no type]
type: Concept
definition: 1.A.3.b [Road Transportation][Gasoline][Emissions][CO2][kt][no source][no method][no target][no option][no type]
status: valid
status modified: 2017-02-13
accepted date: 2017-02-13
in scheme: IPCC_variables_MMR

1.A.3.b [Road Transportation][Gasoline][Emissions][N2O][kt][no source][no method][no target][no option][no type]
type: Concept
definition: 1.A.3.b [Road Transportation][Gasoline][Emissions][N2O][kt][no source][no method][no target][no option][no type]
status: valid
status modified: 2017-02-13
accepted date: 2017-02-13
in scheme: IPCC_variables_MMR

1.A.3.b [Road Transportation][Liquefied Petroleum Gases (LPG)][Emissions][CH4][kt][no source][no method][no target][no option][no type]
type: Concept
definition: 1.A.3.b [Road Transportation][Liquefied Petroleum Gases (LPG)][Emissions][CH4][kt][no source][no method][no target][no option][no type]
status: valid
status modified: 2017-02-13
accepted date: 2017-02-13
in scheme: IPCC_variables_MMR

1.A.3.b [Road Transportation][Liquefied Petroleum Gases (LPG)][Emissions][CO2][kt][no source][no method][no target][no option][no type]
type: Concept
definition: 1.A.3.b [Road Transportation][Liquefied Petroleum Gases (LPG)][Emissions][CO2][kt][no source][no method][no target][no option][no type]
status: valid
status modified: 2017-02-13
accepted date: 2017-02-13
in scheme: IPCC_variables_MMR

1.A.3.b [Road Transportation][Liquefied Petroleum Gases (LPG)][Emissions][N2O][kt][no source][no method][no target][no option][no type]
type: Concept
definition: 1.A.3.b [Road Transportation][Liquefied Petroleum Gases (LPG)][Emissions][N2O][kt][no source][no method][no target][no option][no type]
status: valid
status modified: 2017-02-13
accepted date: 2017-02-13
in scheme: IPCC_variables_MMR

1.A.3.b [Road Transportation][Liquid Fuels][Emissions][CH4][kt][no source][no method][no target][no option][no type]
type: Concept
definition: 1.A.3.b [Road Transportation][Liquid Fuels][Emissions][CH4][kt][no source][no method][no target][no option][no type]
status: valid
status modified: 2017-02-13
accepted date: 2017-02-13
in scheme: IPCC_variables_MMR

1.A.3.b [Road Transportation][Liquid Fuels][Emissions][CO2][kt][no source][no method][no target][no option][no type]
type: Concept
definition: 1.A.3.b [Road Transportation][Liquid Fuels][Emissions][CO2][kt][no source][no method][no target][no option][no type]
status: valid
status modified: 2017-02-13
accepted date: 2017-02-13
in scheme: IPCC_variables_MMR

1.A.3.b [Road Transportation][Liquid Fuels][Emissions][N2O][kt][no source][no method][no target][no option][no type]
type: Concept
definition: 1.A.3.b [Road Transportation][Liquid Fuels][Emissions][N2O][kt][no source][no method][no target][no option][no type]
status: valid
status modified: 2017-02-13
accepted date: 2017-02-13
in scheme: IPCC_variables_MMR

1.A.3.b [Road Transportation][Other Fossil Fuels][Emissions][CH4][kt][no source][no method][no target][no option][no type]
type: Concept
definition: 1.A.3.b [Road Transportation][Other Fossil Fuels][Emissions][CH4][kt][no source][no method][no target][no option][no type]
status: valid
status modified: 2017-02-13
accepted date: 2017-02-13
in scheme: IPCC_variables_MMR

1.A.3.b [Road Transportation][Other Fossil Fuels][Emissions][CO2][kt][no source][no method][no target][no option][no type]
type: Concept
definition: 1.A.3.b [Road Transportation][Other Fossil Fuels][Emissions][CO2][kt][no source][no method][no target][no option][no type]
status: valid
status modified: 2017-02-13
accepted date: 2017-02-13
in scheme: IPCC_variables_MMR

1.A.3.b [Road Transportation][Other Fossil Fuels][Emissions][N2O][kt][no source][no method][no target][no option][no type]
type: Concept
definition: 1.A.3.b [Road Transportation][Other Fossil Fuels][Emissions][N2O][kt][no source][no method][no target][no option][no type]
status: valid
status modified: 2017-02-13
accepted date: 2017-02-13
in scheme: IPCC_variables_MMR

1.A.3.b [Road Transportation][Other Liquid Fuels][Emissions][CH4][kt][no source][no method][no target][no option][no type]
type: Concept
definition: 1.A.3.b [Road Transportation][Other Liquid Fuels][Emissions][CH4][kt][no source][no method][no target][no option][no type]
status: valid
status modified: 2017-02-13
accepted date: 2017-02-13
in scheme: IPCC_variables_MMR

1.A.3.b [Road Transportation][Other Liquid Fuels][Emissions][CO2][kt][no source][no method][no target][no option][no type]
type: Concept
definition: 1.A.3.b [Road Transportation][Other Liquid Fuels][Emissions][CO2][kt][no source][no method][no target][no option][no type]
status: valid
status modified: 2017-02-13
accepted date: 2017-02-13
in scheme: IPCC_variables_MMR

1.A.3.b [Road Transportation][Other Liquid Fuels][Emissions][N2O][kt][no source][no method][no target][no option][no type]
type: Concept
definition: 1.A.3.b [Road Transportation][Other Liquid Fuels][Emissions][N2O][kt][no source][no method][no target][no option][no type]
status: valid
status modified: 2017-02-13
accepted date: 2017-02-13
in scheme: IPCC_variables_MMR

1.A.3.b.i Biomass [Cars][Biomass][Emissions][CH4][kt][no source][no method][no target][no option][no type]
type: Concept
definition: 1.A.3.b.i Biomass [Cars][Biomass][Emissions][CH4][kt][no source][no method][no target][no option][no type]
status: valid
status modified: 2017-02-13
accepted date: 2017-02-13
in scheme: IPCC_variables_MMR

1.A.3.b.i Biomass [Cars][Biomass][Emissions][CO2][kt][no source][no method][no target][no option][no type]
type: Concept
definition: 1.A.3.b.i Biomass [Cars][Biomass][Emissions][CO2][kt][no source][no method][no target][no option][no type]
status: valid
status modified: 2017-02-13
accepted date: 2017-02-13
in scheme: IPCC_variables_MMR

1.A.3.b.i Biomass [Cars][Biomass][Emissions][N2O][kt][no source][no method][no target][no option][no type]
type: Concept
definition: 1.A.3.b.i Biomass [Cars][Biomass][Emissions][N2O][kt][no source][no method][no target][no option][no type]
status: valid
status modified: 2017-02-13
accepted date: 2017-02-13
in scheme: IPCC_variables_MMR

1.A.3.b.i Diesel Oil [Cars][Diesel Oil][Emissions][CH4][kt][no source][no method][no target][no option][no type]
type: Concept
definition: 1.A.3.b.i Diesel Oil [Cars][Diesel Oil][Emissions][CH4][kt][no source][no method][no target][no option][no type]
status: valid
status modified: 2017-02-13
accepted date: 2017-02-13
in scheme: IPCC_variables_MMR

1.A.3.b.i Diesel Oil [Cars][Diesel Oil][Emissions][CO2][kt][no source][no method][no target][no option][no type]
type: Concept
definition: 1.A.3.b.i Diesel Oil [Cars][Diesel Oil][Emissions][CO2][kt][no source][no method][no target][no option][no type]
status: valid
status modified: 2017-02-13
accepted date: 2017-02-13
in scheme: IPCC_variables_MMR

1.A.3.b.i Diesel Oil [Cars][Diesel Oil][Emissions][N2O][kt][no source][no method][no target][no option][no type]
type: Concept
definition: 1.A.3.b.i Diesel Oil [Cars][Diesel Oil][Emissions][N2O][kt][no source][no method][no target][no option][no type]
status: valid
status modified: 2017-02-13
accepted date: 2017-02-13
in scheme: IPCC_variables_MMR

1.A.3.b.i Gaseous Fuels [Cars][Gaseous Fuels][Emissions][CH4][kt][no source][no method][no target][no option][no type]
type: Concept
definition: 1.A.3.b.i Gaseous Fuels [Cars][Gaseous Fuels][Emissions][CH4][kt][no source][no method][no target][no option][no type]
status: valid
status modified: 2017-02-13
accepted date: 2017-02-13
in scheme: IPCC_variables_MMR

1.A.3.b.i Gaseous Fuels [Cars][Gaseous Fuels][Emissions][CO2][kt][no source][no method][no target][no option][no type]
type: Concept
definition: 1.A.3.b.i Gaseous Fuels [Cars][Gaseous Fuels][Emissions][CO2][kt][no source][no method][no target][no option][no type]
status: valid
status modified: 2017-02-13
accepted date: 2017-02-13
in scheme: IPCC_variables_MMR

1.A.3.b.i Gaseous Fuels [Cars][Gaseous Fuels][Emissions][N2O][kt][no source][no method][no target][no option][no type]
type: Concept
definition: 1.A.3.b.i Gaseous Fuels [Cars][Gaseous Fuels][Emissions][N2O][kt][no source][no method][no target][no option][no type]
status: valid
status modified: 2017-02-13
accepted date: 2017-02-13
in scheme: IPCC_variables_MMR

1.A.3.b.i Gasoline [Cars][Gasoline][Emissions][CH4][kt][no source][no method][no target][no option][no type]
type: Concept
definition: 1.A.3.b.i Gasoline [Cars][Gasoline][Emissions][CH4][kt][no source][no method][no target][no option][no type]
status: valid
status modified: 2017-02-13
accepted date: 2017-02-13
in scheme: IPCC_variables_MMR

1.A.3.b.i Gasoline [Cars][Gasoline][Emissions][CO2][kt][no source][no method][no target][no option][no type]
type: Concept
definition: 1.A.3.b.i Gasoline [Cars][Gasoline][Emissions][CO2][kt][no source][no method][no target][no option][no type]
status: valid
status modified: 2017-02-13
accepted date: 2017-02-13
in scheme: IPCC_variables_MMR

1.A.3.b.i Gasoline [Cars][Gasoline][Emissions][N2O][kt][no source][no method][no target][no option][no type]
type: Concept
definition: 1.A.3.b.i Gasoline [Cars][Gasoline][Emissions][N2O][kt][no source][no method][no target][no option][no type]
status: valid
status modified: 2017-02-13
accepted date: 2017-02-13
in scheme: IPCC_variables_MMR

1.A.3.b.i LPG [Cars][Liquefied Petroleum Gases (LPG)][Emissions][CH4][kt][no source][no method][no target][no option][no type]
type: Concept
definition: 1.A.3.b.i LPG [Cars][Liquefied Petroleum Gases (LPG)][Emissions][CH4][kt][no source][no method][no target][no option][no type]
status: valid
status modified: 2017-02-13
accepted date: 2017-02-13
in scheme: IPCC_variables_MMR

1.A.3.b.i LPG [Cars][Liquefied Petroleum Gases (LPG)][Emissions][CO2][kt][no source][no method][no target][no option][no type]
type: Concept
definition: 1.A.3.b.i LPG [Cars][Liquefied Petroleum Gases (LPG)][Emissions][CO2][kt][no source][no method][no target][no option][no type]
status: valid
status modified: 2017-02-13
accepted date: 2017-02-13
in scheme: IPCC_variables_MMR

1.A.3.b.i LPG [Cars][Liquefied Petroleum Gases (LPG)][Emissions][N2O][kt][no source][no method][no target][no option][no type]
type: Concept
definition: 1.A.3.b.i LPG [Cars][Liquefied Petroleum Gases (LPG)][Emissions][N2O][kt][no source][no method][no target][no option][no type]
status: valid
status modified: 2017-02-13
accepted date: 2017-02-13
in scheme: IPCC_variables_MMR

1.A.3.b.i Other Fossil Fuels [Cars][Other Fossil Fuels][Emissions][CH4][kt][no source][no method][no target][no option][no type]
type: Concept
definition: 1.A.3.b.i Other Fossil Fuels [Cars][Other Fossil Fuels][Emissions][CH4][kt][no source][no method][no target][no option][no type]
status: valid
status modified: 2017-02-13
accepted date: 2017-02-13
in scheme: IPCC_variables_MMR

1.A.3.b.i Other Fossil Fuels [Cars][Other Fossil Fuels][Emissions][CO2][kt][no source][no method][no target][no option][no type]
type: Concept
definition: 1.A.3.b.i Other Fossil Fuels [Cars][Other Fossil Fuels][Emissions][CO2][kt][no source][no method][no target][no option][no type]
status: valid
status modified: 2017-02-13
accepted date: 2017-02-13
in scheme: IPCC_variables_MMR

1.A.3.b.i Other Fossil Fuels [Cars][Other Fossil Fuels][Emissions][N2O][kt][no source][no method][no target][no option][no type]
type: Concept
definition: 1.A.3.b.i Other Fossil Fuels [Cars][Other Fossil Fuels][Emissions][N2O][kt][no source][no method][no target][no option][no type]
status: valid
status modified: 2017-02-13
accepted date: 2017-02-13
in scheme: IPCC_variables_MMR

1.A.3.b.i Other Liquid Fuels [Cars][Other Liquid Fuels][Emissions][CH4][kt][no source][no method][no target][no option][no type]
type: Concept
definition: 1.A.3.b.i Other Liquid Fuels [Cars][Other Liquid Fuels][Emissions][CH4][kt][no source][no method][no target][no option][no type]
status: valid
status modified: 2017-02-13
accepted date: 2017-02-13
in scheme: IPCC_variables_MMR

1.A.3.b.i Other Liquid Fuels [Cars][Other Liquid Fuels][Emissions][CO2][kt][no source][no method][no target][no option][no type]
type: Concept
definition: 1.A.3.b.i Other Liquid Fuels [Cars][Other Liquid Fuels][Emissions][CO2][kt][no source][no method][no target][no option][no type]
status: valid
status modified: 2017-02-13
accepted date: 2017-02-13
in scheme: IPCC_variables_MMR

1.A.3.b.i Other Liquid Fuels [Cars][Other Liquid Fuels][Emissions][N2O][kt][no source][no method][no target][no option][no type]
type: Concept
definition: 1.A.3.b.i Other Liquid Fuels [Cars][Other Liquid Fuels][Emissions][N2O][kt][no source][no method][no target][no option][no type]
status: valid
status modified: 2017-02-13
accepted date: 2017-02-13
in scheme: IPCC_variables_MMR

1.A.3.b.ii Biomass [Light duty trucks][Biomass][Emissions][CH4][kt][no source][no method][no target][no option][no type]
type: Concept
definition: 1.A.3.b.ii Biomass [Light duty trucks][Biomass][Emissions][CH4][kt][no source][no method][no target][no option][no type]
status: valid
status modified: 2017-02-13
accepted date: 2017-02-13
in scheme: IPCC_variables_MMR

1.A.3.b.ii Biomass [Light duty trucks][Biomass][Emissions][CO2][kt][no source][no method][no target][no option][no type]
type: Concept
definition: 1.A.3.b.ii Biomass [Light duty trucks][Biomass][Emissions][CO2][kt][no source][no method][no target][no option][no type]
status: valid
status modified: 2017-02-13
accepted date: 2017-02-13
in scheme: IPCC_variables_MMR

1.A.3.b.ii Biomass [Light duty trucks][Biomass][Emissions][N2O][kt][no source][no method][no target][no option][no type]
type: Concept
definition: 1.A.3.b.ii Biomass [Light duty trucks][Biomass][Emissions][N2O][kt][no source][no method][no target][no option][no type]
status: valid
status modified: 2017-02-13
accepted date: 2017-02-13
in scheme: IPCC_variables_MMR

1.A.3.b.ii Diesel Oil [Light duty trucks][Diesel Oil][Emissions][CH4][kt][no source][no method][no target][no option][no type]
type: Concept
definition: 1.A.3.b.ii Diesel Oil [Light duty trucks][Diesel Oil][Emissions][CH4][kt][no source][no method][no target][no option][no type]
status: valid
status modified: 2017-02-13
accepted date: 2017-02-13
in scheme: IPCC_variables_MMR

1.A.3.b.ii Diesel Oil [Light duty trucks][Diesel Oil][Emissions][CO2][kt][no source][no method][no target][no option][no type]
type: Concept
definition: 1.A.3.b.ii Diesel Oil [Light duty trucks][Diesel Oil][Emissions][CO2][kt][no source][no method][no target][no option][no type]
status: valid
status modified: 2017-02-13
accepted date: 2017-02-13
in scheme: IPCC_variables_MMR

1.A.3.b.ii Diesel Oil [Light duty trucks][Diesel Oil][Emissions][N2O][kt][no source][no method][no target][no option][no type]
type: Concept
definition: 1.A.3.b.ii Diesel Oil [Light duty trucks][Diesel Oil][Emissions][N2O][kt][no source][no method][no target][no option][no type]
status: valid
status modified: 2017-02-13
accepted date: 2017-02-13
in scheme: IPCC_variables_MMR

1.A.3.b.ii Gaseous Fuels [Light duty trucks][Gaseous Fuels][Emissions][CH4][kt][no source][no method][no target][no option][no type]
type: Concept
definition: 1.A.3.b.ii Gaseous Fuels [Light duty trucks][Gaseous Fuels][Emissions][CH4][kt][no source][no method][no target][no option][no type]
status: valid
status modified: 2017-02-13
accepted date: 2017-02-13
in scheme: IPCC_variables_MMR

1.A.3.b.ii Gaseous Fuels [Light duty trucks][Gaseous Fuels][Emissions][CO2][kt][no source][no method][no target][no option][no type]
type: Concept
definition: 1.A.3.b.ii Gaseous Fuels [Light duty trucks][Gaseous Fuels][Emissions][CO2][kt][no source][no method][no target][no option][no type]
status: valid
status modified: 2017-02-13
accepted date: 2017-02-13
in scheme: IPCC_variables_MMR

1.A.3.b.ii Gaseous Fuels [Light duty trucks][Gaseous Fuels][Emissions][N2O][kt][no source][no method][no target][no option][no type]
type: Concept
definition: 1.A.3.b.ii Gaseous Fuels [Light duty trucks][Gaseous Fuels][Emissions][N2O][kt][no source][no method][no target][no option][no type]
status: valid
status modified: 2017-02-13
accepted date: 2017-02-13
in scheme: IPCC_variables_MMR

1.A.3.b.ii Gasoline [Light duty trucks][Gasoline][Emissions][CH4][kt][no source][no method][no target][no option][no type]
type: Concept
definition: 1.A.3.b.ii Gasoline [Light duty trucks][Gasoline][Emissions][CH4][kt][no source][no method][no target][no option][no type]
status: valid
status modified: 2017-02-13
accepted date: 2017-02-13
in scheme: IPCC_variables_MMR

1.A.3.b.ii Gasoline [Light duty trucks][Gasoline][Emissions][CO2][kt][no source][no method][no target][no option][no type]
type: Concept
definition: 1.A.3.b.ii Gasoline [Light duty trucks][Gasoline][Emissions][CO2][kt][no source][no method][no target][no option][no type]
status: valid
status modified: 2017-02-13
accepted date: 2017-02-13
in scheme: IPCC_variables_MMR

1.A.3.b.ii Gasoline [Light duty trucks][Gasoline][Emissions][N2O][kt][no source][no method][no target][no option][no type]
type: Concept
definition: 1.A.3.b.ii Gasoline [Light duty trucks][Gasoline][Emissions][N2O][kt][no source][no method][no target][no option][no type]
status: valid
status modified: 2017-02-13
accepted date: 2017-02-13
in scheme: IPCC_variables_MMR

1.A.3.b.ii LPG [Light duty trucks][Liquefied Petroleum Gases (LPG)][Emissions][CH4][kt][no source][no method][no target][no option][no type]
type: Concept
definition: 1.A.3.b.ii LPG [Light duty trucks][Liquefied Petroleum Gases (LPG)][Emissions][CH4][kt][no source][no method][no target][no option][no type]
status: valid
status modified: 2017-02-13
accepted date: 2017-02-13
in scheme: IPCC_variables_MMR

1.A.3.b.ii LPG [Light duty trucks][Liquefied Petroleum Gases (LPG)][Emissions][CO2][kt][no source][no method][no target][no option][no type]
type: Concept
definition: 1.A.3.b.ii LPG [Light duty trucks][Liquefied Petroleum Gases (LPG)][Emissions][CO2][kt][no source][no method][no target][no option][no type]
status: valid
status modified: 2017-02-13
accepted date: 2017-02-13
in scheme: IPCC_variables_MMR

1.A.3.b.ii LPG [Light duty trucks][Liquefied Petroleum Gases (LPG)][Emissions][N2O][kt][no source][no method][no target][no option][no type]
type: Concept
definition: 1.A.3.b.ii LPG [Light duty trucks][Liquefied Petroleum Gases (LPG)][Emissions][N2O][kt][no source][no method][no target][no option][no type]
status: valid
status modified: 2017-02-13
accepted date: 2017-02-13
in scheme: IPCC_variables_MMR

1.A.3.b.ii Other Fossil Fuel [Light duty trucks][Other Fossil Fuels][Emissions][CH4][kt][no source][no method][no target][no option][no type]
type: Concept
definition: 1.A.3.b.ii Other Fossil Fuel [Light duty trucks][Other Fossil Fuels][Emissions][CH4][kt][no source][no method][no target][no option][no type]
status: valid
status modified: 2017-02-13
accepted date: 2017-02-13
in scheme: IPCC_variables_MMR

1.A.3.b.ii Other Fossil Fuel [Light duty trucks][Other Fossil Fuels][Emissions][CO2][kt][no source][no method][no target][no option][no type]
type: Concept
definition: 1.A.3.b.ii Other Fossil Fuel [Light duty trucks][Other Fossil Fuels][Emissions][CO2][kt][no source][no method][no target][no option][no type]
status: valid
status modified: 2017-02-13
accepted date: 2017-02-13
in scheme: IPCC_variables_MMR

1.A.3.b.ii Other Fossil Fuel [Light duty trucks][Other Fossil Fuels][Emissions][N2O][kt][no source][no method][no target][no option][no type]
type: Concept
definition: 1.A.3.b.ii Other Fossil Fuel [Light duty trucks][Other Fossil Fuels][Emissions][N2O][kt][no source][no method][no target][no option][no type]
status: valid
status modified: 2017-02-13
accepted date: 2017-02-13
in scheme: IPCC_variables_MMR

1.A.3.b.ii Other Liquid Fuel [Light duty trucks][Other Liquid Fuels][Emissions][CH4][kt][no source][no method][no target][no option][no type]
type: Concept
definition: 1.A.3.b.ii Other Liquid Fuel [Light duty trucks][Other Liquid Fuels][Emissions][CH4][kt][no source][no method][no target][no option][no type]
status: valid
status modified: 2017-02-13
accepted date: 2017-02-13
in scheme: IPCC_variables_MMR

1.A.3.b.ii Other Liquid Fuel [Light duty trucks][Other Liquid Fuels][Emissions][CO2][kt][no source][no method][no target][no option][no type]
type: Concept
definition: 1.A.3.b.ii Other Liquid Fuel [Light duty trucks][Other Liquid Fuels][Emissions][CO2][kt][no source][no method][no target][no option][no type]
status: valid
status modified: 2017-02-13
accepted date: 2017-02-13
in scheme: IPCC_variables_MMR

1.A.3.b.ii Other Liquid Fuel [Light duty trucks][Other Liquid Fuels][Emissions][N2O][kt][no source][no method][no target][no option][no type]
type: Concept
definition: 1.A.3.b.ii Other Liquid Fuel [Light duty trucks][Other Liquid Fuels][Emissions][N2O][kt][no source][no method][no target][no option][no type]
status: valid
status modified: 2017-02-13
accepted date: 2017-02-13
in scheme: IPCC_variables_MMR

1.A.3.b.iii Biomass [Heavy duty trucks and buses][Biomass][Emissions][CH4][kt][no source][no method][no target][no option][no type]
type: Concept
definition: 1.A.3.b.iii Biomass [Heavy duty trucks and buses][Biomass][Emissions][CH4][kt][no source][no method][no target][no option][no type]
status: valid
status modified: 2017-02-13
accepted date: 2017-02-13
in scheme: IPCC_variables_MMR

1.A.3.b.iii Biomass [Heavy duty trucks and buses][Biomass][Emissions][CO2][kt][no source][no method][no target][no option][no type]
type: Concept
definition: 1.A.3.b.iii Biomass [Heavy duty trucks and buses][Biomass][Emissions][CO2][kt][no source][no method][no target][no option][no type]
status: valid
status modified: 2017-02-13
accepted date: 2017-02-13
in scheme: IPCC_variables_MMR

1.A.3.b.iii Biomass [Heavy duty trucks and buses][Biomass][Emissions][N2O][kt][no source][no method][no target][no option][no type]
type: Concept
definition: 1.A.3.b.iii Biomass [Heavy duty trucks and buses][Biomass][Emissions][N2O][kt][no source][no method][no target][no option][no type]
status: valid
status modified: 2017-02-13
accepted date: 2017-02-13
in scheme: IPCC_variables_MMR

1.A.3.b.iii Diesel Oil [Heavy duty trucks and buses][Diesel Oil][Emissions][CH4][kt][no source][no method][no target][no option][no type]
type: Concept
definition: 1.A.3.b.iii Diesel Oil [Heavy duty trucks and buses][Diesel Oil][Emissions][CH4][kt][no source][no method][no target][no option][no type]
status: valid
status modified: 2017-02-13
accepted date: 2017-02-13
in scheme: IPCC_variables_MMR

1.A.3.b.iii Diesel Oil [Heavy duty trucks and buses][Diesel Oil][Emissions][CO2][kt][no source][no method][no target][no option][no type]
type: Concept
definition: 1.A.3.b.iii Diesel Oil [Heavy duty trucks and buses][Diesel Oil][Emissions][CO2][kt][no source][no method][no target][no option][no type]
status: valid
status modified: 2017-02-13
accepted date: 2017-02-13
in scheme: IPCC_variables_MMR

1.A.3.b.iii Diesel Oil [Heavy duty trucks and buses][Diesel Oil][Emissions][N2O][kt][no source][no method][no target][no option][no type]
type: Concept
definition: 1.A.3.b.iii Diesel Oil [Heavy duty trucks and buses][Diesel Oil][Emissions][N2O][kt][no source][no method][no target][no option][no type]
status: valid
status modified: 2017-02-13
accepted date: 2017-02-13
in scheme: IPCC_variables_MMR

1.A.3.b.iii Gaseous Fuels [Heavy duty trucks and buses][Gaseous Fuels][Emissions][CH4][kt][no source][no method][no target][no option][no type]
type: Concept
definition: 1.A.3.b.iii Gaseous Fuels [Heavy duty trucks and buses][Gaseous Fuels][Emissions][CH4][kt][no source][no method][no target][no option][no type]
status: valid
status modified: 2017-02-13
accepted date: 2017-02-13
in scheme: IPCC_variables_MMR

1.A.3.b.iii Gaseous Fuels [Heavy duty trucks and buses][Gaseous Fuels][Emissions][CO2][kt][no source][no method][no target][no option][no type]
type: Concept
definition: 1.A.3.b.iii Gaseous Fuels [Heavy duty trucks and buses][Gaseous Fuels][Emissions][CO2][kt][no source][no method][no target][no option][no type]
status: valid
status modified: 2017-02-13
accepted date: 2017-02-13
in scheme: IPCC_variables_MMR

1.A.3.b.iii Gaseous Fuels [Heavy duty trucks and buses][Gaseous Fuels][Emissions][N2O][kt][no source][no method][no target][no option][no type]
type: Concept
definition: 1.A.3.b.iii Gaseous Fuels [Heavy duty trucks and buses][Gaseous Fuels][Emissions][N2O][kt][no source][no method][no target][no option][no type]
status: valid
status modified: 2017-02-13
accepted date: 2017-02-13
in scheme: IPCC_variables_MMR

1.A.3.b.iii Gasoline [Heavy duty trucks and buses][Gasoline][Emissions][CH4][kt][no source][no method][no target][no option][no type]
type: Concept
definition: 1.A.3.b.iii Gasoline [Heavy duty trucks and buses][Gasoline][Emissions][CH4][kt][no source][no method][no target][no option][no type]
status: valid
status modified: 2017-02-13
accepted date: 2017-02-13
in scheme: IPCC_variables_MMR

1.A.3.b.iii Gasoline [Heavy duty trucks and buses][Gasoline][Emissions][CO2][kt][no source][no method][no target][no option][no type]
type: Concept
definition: 1.A.3.b.iii Gasoline [Heavy duty trucks and buses][Gasoline][Emissions][CO2][kt][no source][no method][no target][no option][no type]
status: valid
status modified: 2017-02-13
accepted date: 2017-02-13
in scheme: IPCC_variables_MMR

1.A.3.b.iii Gasoline [Heavy duty trucks and buses][Gasoline][Emissions][N2O][kt][no source][no method][no target][no option][no type]
type: Concept
definition: 1.A.3.b.iii Gasoline [Heavy duty trucks and buses][Gasoline][Emissions][N2O][kt][no source][no method][no target][no option][no type]
status: valid
status modified: 2017-02-13
accepted date: 2017-02-13
in scheme: IPCC_variables_MMR

1.A.3.b.iii LPG [Heavy duty trucks and buses][Liquefied Petroleum Gases (LPG)][Emissions][CH4][kt][no source][no method][no target][no option][no type]
type: Concept
definition: 1.A.3.b.iii LPG [Heavy duty trucks and buses][Liquefied Petroleum Gases (LPG)][Emissions][CH4][kt][no source][no method][no target][no option][no type]
status: valid
status modified: 2017-02-13
accepted date: 2017-02-13
in scheme: IPCC_variables_MMR

1.A.3.b.iii LPG [Heavy duty trucks and buses][Liquefied Petroleum Gases (LPG)][Emissions][CO2][kt][no source][no method][no target][no option][no type]
type: Concept
definition: 1.A.3.b.iii LPG [Heavy duty trucks and buses][Liquefied Petroleum Gases (LPG)][Emissions][CO2][kt][no source][no method][no target][no option][no type]
status: valid
status modified: 2017-02-13
accepted date: 2017-02-13
in scheme: IPCC_variables_MMR

1.A.3.b.iii LPG [Heavy duty trucks and buses][Liquefied Petroleum Gases (LPG)][Emissions][N2O][kt][no source][no method][no target][no option][no type]
type: Concept
definition: 1.A.3.b.iii LPG [Heavy duty trucks and buses][Liquefied Petroleum Gases (LPG)][Emissions][N2O][kt][no source][no method][no target][no option][no type]
status: valid
status modified: 2017-02-13
accepted date: 2017-02-13
in scheme: IPCC_variables_MMR

1.A.3.b.iii Other Fossil Fuel [Heavy duty trucks and buses][Other Fossil Fuels][Emissions][CH4][kt][no source][no method][no target][no option][no type]
type: Concept
definition: 1.A.3.b.iii Other Fossil Fuel [Heavy duty trucks and buses][Other Fossil Fuels][Emissions][CH4][kt][no source][no method][no target][no option][no type]
status: valid
status modified: 2017-02-13
accepted date: 2017-02-13
in scheme: IPCC_variables_MMR

1.A.3.b.iii Other Fossil Fuel [Heavy duty trucks and buses][Other Fossil Fuels][Emissions][CO2][kt][no source][no method][no target][no option][no type]
type: Concept
definition: 1.A.3.b.iii Other Fossil Fuel [Heavy duty trucks and buses][Other Fossil Fuels][Emissions][CO2][kt][no source][no method][no target][no option][no type]
status: valid
status modified: 2017-02-13
accepted date: 2017-02-13
in scheme: IPCC_variables_MMR

1.A.3.b.iii Other Fossil Fuel [Heavy duty trucks and buses][Other Fossil Fuels][Emissions][N2O][kt][no source][no method][no target][no option][no type]
type: Concept
definition: 1.A.3.b.iii Other Fossil Fuel [Heavy duty trucks and buses][Other Fossil Fuels][Emissions][N2O][kt][no source][no method][no target][no option][no type]
status: valid
status modified: 2017-02-13
accepted date: 2017-02-13
in scheme: IPCC_variables_MMR

1.A.3.b.iii Other Liquid Fuel [Heavy duty trucks and buses][Other Liquid Fuels][Emissions][CH4][kt][no source][no method][no target][no option][no type]
type: Concept
definition: 1.A.3.b.iii Other Liquid Fuel [Heavy duty trucks and buses][Other Liquid Fuels][Emissions][CH4][kt][no source][no method][no target][no option][no type]
status: valid
status modified: 2017-02-13
accepted date: 2017-02-13
in scheme: IPCC_variables_MMR

1.A.3.b.iii Other Liquid Fuel [Heavy duty trucks and buses][Other Liquid Fuels][Emissions][CO2][kt][no source][no method][no target][no option][no type]
type: Concept
definition: 1.A.3.b.iii Other Liquid Fuel [Heavy duty trucks and buses][Other Liquid Fuels][Emissions][CO2][kt][no source][no method][no target][no option][no type]
status: valid
status modified: 2017-02-13
accepted date: 2017-02-13
in scheme: IPCC_variables_MMR

1.A.3.b.iii Other Liquid Fuel [Heavy duty trucks and buses][Other Liquid Fuels][Emissions][N2O][kt][no source][no method][no target][no option][no type]
type: Concept
definition: 1.A.3.b.iii Other Liquid Fuel [Heavy duty trucks and buses][Other Liquid Fuels][Emissions][N2O][kt][no source][no method][no target][no option][no type]
status: valid
status modified: 2017-02-13
accepted date: 2017-02-13
in scheme: IPCC_variables_MMR

1.A.3.b.iv Biomass [Motorcycles][Biomass][Emissions][CH4][kt][no source][no method][no target][no option][no type]
type: Concept
definition: 1.A.3.b.iv Biomass [Motorcycles][Biomass][Emissions][CH4][kt][no source][no method][no target][no option][no type]
status: valid
status modified: 2017-02-13
accepted date: 2017-02-13
in scheme: IPCC_variables_MMR

1.A.3.b.iv Biomass [Motorcycles][Biomass][Emissions][CO2][kt][no source][no method][no target][no option][no type]
type: Concept
definition: 1.A.3.b.iv Biomass [Motorcycles][Biomass][Emissions][CO2][kt][no source][no method][no target][no option][no type]
status: valid
status modified: 2017-02-13
accepted date: 2017-02-13
in scheme: IPCC_variables_MMR

1.A.3.b.iv Biomass [Motorcycles][Biomass][Emissions][N2O][kt][no source][no method][no target][no option][no type]
type: Concept
definition: 1.A.3.b.iv Biomass [Motorcycles][Biomass][Emissions][N2O][kt][no source][no method][no target][no option][no type]
status: valid
status modified: 2017-02-13
accepted date: 2017-02-13
in scheme: IPCC_variables_MMR

1.A.3.b.iv Diesel Oil [Motorcycles][Diesel Oil][Emissions][CH4][kt][no source][no method][no target][no option][no type]
type: Concept
definition: 1.A.3.b.iv Diesel Oil [Motorcycles][Diesel Oil][Emissions][CH4][kt][no source][no method][no target][no option][no type]
status: valid
status modified: 2017-02-13
accepted date: 2017-02-13
in scheme: IPCC_variables_MMR

1.A.3.b.iv Diesel Oil [Motorcycles][Diesel Oil][Emissions][CO2][kt][no source][no method][no target][no option][no type]
type: Concept
definition: 1.A.3.b.iv Diesel Oil [Motorcycles][Diesel Oil][Emissions][CO2][kt][no source][no method][no target][no option][no type]
status: valid
status modified: 2017-02-13
accepted date: 2017-02-13
in scheme: IPCC_variables_MMR

1.A.3.b.iv Diesel Oil [Motorcycles][Diesel Oil][Emissions][N2O][kt][no source][no method][no target][no option][no type]
type: Concept
definition: 1.A.3.b.iv Diesel Oil [Motorcycles][Diesel Oil][Emissions][N2O][kt][no source][no method][no target][no option][no type]
status: valid
status modified: 2017-02-13
accepted date: 2017-02-13
in scheme: IPCC_variables_MMR

1.A.3.b.iv Gaseous Fuels [Motorcycles][Gaseous Fuels][Emissions][CH4][kt][no source][no method][no target][no option][no type]
type: Concept
definition: 1.A.3.b.iv Gaseous Fuels [Motorcycles][Gaseous Fuels][Emissions][CH4][kt][no source][no method][no target][no option][no type]
status: valid
status modified: 2017-02-13
accepted date: 2017-02-13
in scheme: IPCC_variables_MMR

1.A.3.b.iv Gaseous Fuels [Motorcycles][Gaseous Fuels][Emissions][CO2][kt][no source][no method][no target][no option][no type]
type: Concept
definition: 1.A.3.b.iv Gaseous Fuels [Motorcycles][Gaseous Fuels][Emissions][CO2][kt][no source][no method][no target][no option][no type]
status: valid
status modified: 2017-02-13
accepted date: 2017-02-13
in scheme: IPCC_variables_MMR

1.A.3.b.iv Gaseous Fuels [Motorcycles][Gaseous Fuels][Emissions][N2O][kt][no source][no method][no target][no option][no type]
type: Concept
definition: 1.A.3.b.iv Gaseous Fuels [Motorcycles][Gaseous Fuels][Emissions][N2O][kt][no source][no method][no target][no option][no type]
status: valid
status modified: 2017-02-13
accepted date: 2017-02-13
in scheme: IPCC_variables_MMR

1.A.3.b.iv Gasoline [Motorcycles][Gasoline][Emissions][CH4][kt][no source][no method][no target][no option][no type]
type: Concept
definition: 1.A.3.b.iv Gasoline [Motorcycles][Gasoline][Emissions][CH4][kt][no source][no method][no target][no option][no type]
status: valid
status modified: 2017-02-13
accepted date: 2017-02-13
in scheme: IPCC_variables_MMR

1.A.3.b.iv Gasoline [Motorcycles][Gasoline][Emissions][CO2][kt][no source][no method][no target][no option][no type]
type: Concept
definition: 1.A.3.b.iv Gasoline [Motorcycles][Gasoline][Emissions][CO2][kt][no source][no method][no target][no option][no type]
status: valid
status modified: 2017-02-13
accepted date: 2017-02-13
in scheme: IPCC_variables_MMR

1.A.3.b.iv Gasoline [Motorcycles][Gasoline][Emissions][N2O][kt][no source][no method][no target][no option][no type]
type: Concept
definition: 1.A.3.b.iv Gasoline [Motorcycles][Gasoline][Emissions][N2O][kt][no source][no method][no target][no option][no type]
status: valid
status modified: 2017-02-13
accepted date: 2017-02-13
in scheme: IPCC_variables_MMR

1.A.3.b.iv LPG [Motorcycles][Liquefied Petroleum Gases (LPG)][Emissions][CH4][kt][no source][no method][no target][no option][no type]
type: Concept
definition: 1.A.3.b.iv LPG [Motorcycles][Liquefied Petroleum Gases (LPG)][Emissions][CH4][kt][no source][no method][no target][no option][no type]
status: valid
status modified: 2017-02-13
accepted date: 2017-02-13
in scheme: IPCC_variables_MMR

1.A.3.b.iv LPG [Motorcycles][Liquefied Petroleum Gases (LPG)][Emissions][CO2][kt][no source][no method][no target][no option][no type]
type: Concept
definition: 1.A.3.b.iv LPG [Motorcycles][Liquefied Petroleum Gases (LPG)][Emissions][CO2][kt][no source][no method][no target][no option][no type]
status: valid
status modified: 2017-02-13
accepted date: 2017-02-13
in scheme: IPCC_variables_MMR

1.A.3.b.iv LPG [Motorcycles][Liquefied Petroleum Gases (LPG)][Emissions][N2O][kt][no source][no method][no target][no option][no type]
type: Concept
definition: 1.A.3.b.iv LPG [Motorcycles][Liquefied Petroleum Gases (LPG)][Emissions][N2O][kt][no source][no method][no target][no option][no type]
status: valid
status modified: 2017-02-13
accepted date: 2017-02-13
in scheme: IPCC_variables_MMR

1.A.3.b.iv Other Fossil Fuel [Motorcycles][Other Fossil Fuels][Emissions][CH4][kt][no source][no method][no target][no option][no type]
type: Concept
definition: 1.A.3.b.iv Other Fossil Fuel [Motorcycles][Other Fossil Fuels][Emissions][CH4][kt][no source][no method][no target][no option][no type]
status: valid
status modified: 2017-02-13
accepted date: 2017-02-13
in scheme: IPCC_variables_MMR

1.A.3.b.iv Other Fossil Fuel [Motorcycles][Other Fossil Fuels][Emissions][CO2][kt][no source][no method][no target][no option][no type]
type: Concept
definition: 1.A.3.b.iv Other Fossil Fuel [Motorcycles][Other Fossil Fuels][Emissions][CO2][kt][no source][no method][no target][no option][no type]
status: valid
status modified: 2017-02-13
accepted date: 2017-02-13
in scheme: IPCC_variables_MMR

1.A.3.b.iv Other Fossil Fuel [Motorcycles][Other Fossil Fuels][Emissions][N2O][kt][no source][no method][no target][no option][no type]
type: Concept
definition: 1.A.3.b.iv Other Fossil Fuel [Motorcycles][Other Fossil Fuels][Emissions][N2O][kt][no source][no method][no target][no option][no type]
status: valid
status modified: 2017-02-13
accepted date: 2017-02-13
in scheme: IPCC_variables_MMR

1.A.3.b.iv Other Liquid Fuel [Motorcycles][Other Liquid Fuels][Emissions][CH4][kt][no source][no method][no target][no option][no type]
type: Concept
definition: 1.A.3.b.iv Other Liquid Fuel [Motorcycles][Other Liquid Fuels][Emissions][CH4][kt][no source][no method][no target][no option][no type]
status: valid
status modified: 2017-02-13
accepted date: 2017-02-13
in scheme: IPCC_variables_MMR

1.A.3.b.iv Other Liquid Fuel [Motorcycles][Other Liquid Fuels][Emissions][CO2][kt][no source][no method][no target][no option][no type]
type: Concept
definition: 1.A.3.b.iv Other Liquid Fuel [Motorcycles][Other Liquid Fuels][Emissions][CO2][kt][no source][no method][no target][no option][no type]
status: valid
status modified: 2017-02-13
accepted date: 2017-02-13
in scheme: IPCC_variables_MMR

1.A.3.b.iv Other Liquid Fuel [Motorcycles][Other Liquid Fuels][Emissions][N2O][kt][no source][no method][no target][no option][no type]
type: Concept
definition: 1.A.3.b.iv Other Liquid Fuel [Motorcycles][Other Liquid Fuels][Emissions][N2O][kt][no source][no method][no target][no option][no type]
status: valid
status modified: 2017-02-13
accepted date: 2017-02-13
in scheme: IPCC_variables_MMR

1.A.3.c [Railways][Fossil fuels][Emissions][CO2][kt][no source][no method][no target][no option][no type]
type: Concept
definition: 1.A.3.c [Railways][Fossil fuels][Emissions][CO2][kt][no source][no method][no target][no option][no type]
status: valid
status modified: 2017-02-13
accepted date: 2017-02-13
in scheme: IPCC_variables_MMR

1.A.3.c [Railways][Fuels][Emissions][CH4][kt][no source][no method][no target][no option][no type]
type: Concept
definition: 1.A.3.c [Railways][Fuels][Emissions][CH4][kt][no source][no method][no target][no option][no type]
status: valid
status modified: 2017-02-13
accepted date: 2017-02-13
in scheme: IPCC_variables_MMR

1.A.3.c [Railways][Fuels][Emissions][N2O][kt][no source][no method][no target][no option][no type]
type: Concept
definition: 1.A.3.c [Railways][Fuels][Emissions][N2O][kt][no source][no method][no target][no option][no type]
status: valid
status modified: 2017-02-13
accepted date: 2017-02-13
in scheme: IPCC_variables_MMR

1.A.3.c Biomass [Railways][Biomass][Emissions][CH4][kt][no source][no method][no target][no option][no type]
type: Concept
definition: 1.A.3.c Biomass [Railways][Biomass][Emissions][CH4][kt][no source][no method][no target][no option][no type]
status: valid
status modified: 2017-02-13
accepted date: 2017-02-13
in scheme: IPCC_variables_MMR

1.A.3.c Biomass [Railways][Biomass][Emissions][CO2][kt][no source][no method][no target][no option][no type]
type: Concept
definition: 1.A.3.c Biomass [Railways][Biomass][Emissions][CO2][kt][no source][no method][no target][no option][no type]
status: valid
status modified: 2017-02-13
accepted date: 2017-02-13
in scheme: IPCC_variables_MMR

1.A.3.c Biomass [Railways][Biomass][Emissions][N2O][kt][no source][no method][no target][no option][no type]
type: Concept
definition: 1.A.3.c Biomass [Railways][Biomass][Emissions][N2O][kt][no source][no method][no target][no option][no type]
status: valid
status modified: 2017-02-13
accepted date: 2017-02-13
in scheme: IPCC_variables_MMR

1.A.3.c Gaseous Fuels [Railways][Gaseous Fuels][Emissions][CH4][kt][no source][no method][no target][no option][no type]
type: Concept
definition: 1.A.3.c Gaseous Fuels [Railways][Gaseous Fuels][Emissions][CH4][kt][no source][no method][no target][no option][no type]
status: valid
status modified: 2017-02-13
accepted date: 2017-02-13
in scheme: IPCC_variables_MMR

1.A.3.c Gaseous Fuels [Railways][Gaseous Fuels][Emissions][CO2][kt][no source][no method][no target][no option][no type]
type: Concept
definition: 1.A.3.c Gaseous Fuels [Railways][Gaseous Fuels][Emissions][CO2][kt][no source][no method][no target][no option][no type]
status: valid
status modified: 2017-02-13
accepted date: 2017-02-13
in scheme: IPCC_variables_MMR

1.A.3.c Gaseous Fuels [Railways][Gaseous Fuels][Emissions][N2O][kt][no source][no method][no target][no option][no type]
type: Concept
definition: 1.A.3.c Gaseous Fuels [Railways][Gaseous Fuels][Emissions][N2O][kt][no source][no method][no target][no option][no type]
status: valid
status modified: 2017-02-13
accepted date: 2017-02-13
in scheme: IPCC_variables_MMR

1.A.3.c Liquid Fuels [Railways][Liquid Fuels][Emissions][CH4][kt][no source][no method][no target][no option][no type]
type: Concept
definition: 1.A.3.c Liquid Fuels [Railways][Liquid Fuels][Emissions][CH4][kt][no source][no method][no target][no option][no type]
status: valid
status modified: 2017-02-13
accepted date: 2017-02-13
in scheme: IPCC_variables_MMR

1.A.3.c Liquid Fuels [Railways][Liquid Fuels][Emissions][CO2][kt][no source][no method][no target][no option][no type]
type: Concept
definition: 1.A.3.c Liquid Fuels [Railways][Liquid Fuels][Emissions][CO2][kt][no source][no method][no target][no option][no type]
status: valid
status modified: 2017-02-13
accepted date: 2017-02-13
in scheme: IPCC_variables_MMR

1.A.3.c Liquid Fuels [Railways][Liquid Fuels][Emissions][N2O][kt][no source][no method][no target][no option][no type]
type: Concept
definition: 1.A.3.c Liquid Fuels [Railways][Liquid Fuels][Emissions][N2O][kt][no source][no method][no target][no option][no type]
status: valid
status modified: 2017-02-13
accepted date: 2017-02-13
in scheme: IPCC_variables_MMR

1.A.3.c Other Fossil Fuels [Railways][Other Fossil Fuels][Emissions][CH4][kt][no source][no method][no target][no option][no type]
type: Concept
definition: 1.A.3.c Other Fossil Fuels [Railways][Other Fossil Fuels][Emissions][CH4][kt][no source][no method][no target][no option][no type]
status: valid
status modified: 2017-02-13
accepted date: 2017-02-13
in scheme: IPCC_variables_MMR

1.A.3.c Other Fossil Fuels [Railways][Other Fossil Fuels][Emissions][CO2][kt][no source][no method][no target][no option][no type]
type: Concept
definition: 1.A.3.c Other Fossil Fuels [Railways][Other Fossil Fuels][Emissions][CO2][kt][no source][no method][no target][no option][no type]
status: valid
status modified: 2017-02-13
accepted date: 2017-02-13
in scheme: IPCC_variables_MMR

1.A.3.c Other Fossil Fuels [Railways][Other Fossil Fuels][Emissions][N2O][kt][no source][no method][no target][no option][no type]
type: Concept
definition: 1.A.3.c Other Fossil Fuels [Railways][Other Fossil Fuels][Emissions][N2O][kt][no source][no method][no target][no option][no type]
status: valid
status modified: 2017-02-13
accepted date: 2017-02-13
in scheme: IPCC_variables_MMR

1.A.3.c Solid Fuels [Railways][Solid Fuels][Emissions][CH4][kt][no source][no method][no target][no option][no type]
type: Concept
definition: 1.A.3.c Solid Fuels [Railways][Solid Fuels][Emissions][CH4][kt][no source][no method][no target][no option][no type]
status: valid
status modified: 2017-02-13
accepted date: 2017-02-13
in scheme: IPCC_variables_MMR

1.A.3.c Solid Fuels [Railways][Solid Fuels][Emissions][CO2][kt][no source][no method][no target][no option][no type]
type: Concept
definition: 1.A.3.c Solid Fuels [Railways][Solid Fuels][Emissions][CO2][kt][no source][no method][no target][no option][no type]
status: valid
status modified: 2017-02-13
accepted date: 2017-02-13
in scheme: IPCC_variables_MMR

1.A.3.c Solid Fuels [Railways][Solid Fuels][Emissions][N2O][kt][no source][no method][no target][no option][no type]
type: Concept
definition: 1.A.3.c Solid Fuels [Railways][Solid Fuels][Emissions][N2O][kt][no source][no method][no target][no option][no type]
status: valid
status modified: 2017-02-13
accepted date: 2017-02-13
in scheme: IPCC_variables_MMR

1.A.3.d [Domestic Navigation][Fossil fuels][Emissions][CO2][kt][no source][no method][no target][no option][no type]
type: Concept
definition: 1.A.3.d [Domestic Navigation][Fossil fuels][Emissions][CO2][kt][no source][no method][no target][no option][no type]
status: valid
status modified: 2017-02-13
accepted date: 2017-02-13
in scheme: IPCC_variables_MMR

1.A.3.d [Domestic Navigation][Fuels][Emissions][CH4][kt][no source][no method][no target][no option][no type]
type: Concept
definition: 1.A.3.d [Domestic Navigation][Fuels][Emissions][CH4][kt][no source][no method][no target][no option][no type]
status: valid
status modified: 2017-02-13
accepted date: 2017-02-13
in scheme: IPCC_variables_MMR

1.A.3.d [Domestic Navigation][Fuels][Emissions][N2O][kt][no source][no method][no target][no option][no type]
type: Concept
definition: 1.A.3.d [Domestic Navigation][Fuels][Emissions][N2O][kt][no source][no method][no target][no option][no type]
status: valid
status modified: 2017-02-13
accepted date: 2017-02-13
in scheme: IPCC_variables_MMR

1.A.3.d [Domestic Navigation][Liquid Fuels][Emissions][CH4][kt][no source][no method][no target][no option][no type]
type: Concept
definition: 1.A.3.d [Domestic Navigation][Liquid Fuels][Emissions][CH4][kt][no source][no method][no target][no option][no type]
status: valid
status modified: 2017-02-13
accepted date: 2017-02-13
in scheme: IPCC_variables_MMR

1.A.3.d [Domestic Navigation][Liquid Fuels][Emissions][CO2][kt][no source][no method][no target][no option][no type]
type: Concept
definition: 1.A.3.d [Domestic Navigation][Liquid Fuels][Emissions][CO2][kt][no source][no method][no target][no option][no type]
status: valid
status modified: 2017-02-13
accepted date: 2017-02-13
in scheme: IPCC_variables_MMR

1.A.3.d [Domestic Navigation][Liquid Fuels][Emissions][N2O][kt][no source][no method][no target][no option][no type]
type: Concept
definition: 1.A.3.d [Domestic Navigation][Liquid Fuels][Emissions][N2O][kt][no source][no method][no target][no option][no type]
status: valid
status modified: 2017-02-13
accepted date: 2017-02-13
in scheme: IPCC_variables_MMR

1.A.3.d Biomass [Domestic Navigation][Biomass][Emissions][CH4][kt][no source][no method][no target][no option][no type]
type: Concept
definition: 1.A.3.d Biomass [Domestic Navigation][Biomass][Emissions][CH4][kt][no source][no method][no target][no option][no type]
status: valid
status modified: 2017-02-13
accepted date: 2017-02-13
in scheme: IPCC_variables_MMR

1.A.3.d Biomass [Domestic Navigation][Biomass][Emissions][CO2][kt][no source][no method][no target][no option][no type]
type: Concept
definition: 1.A.3.d Biomass [Domestic Navigation][Biomass][Emissions][CO2][kt][no source][no method][no target][no option][no type]
status: valid
status modified: 2017-02-13
accepted date: 2017-02-13
in scheme: IPCC_variables_MMR

1.A.3.d Biomass [Domestic Navigation][Biomass][Emissions][N2O][kt][no source][no method][no target][no option][no type]
type: Concept
definition: 1.A.3.d Biomass [Domestic Navigation][Biomass][Emissions][N2O][kt][no source][no method][no target][no option][no type]
status: valid
status modified: 2017-02-13
accepted date: 2017-02-13
in scheme: IPCC_variables_MMR

1.A.3.d Gas/Diesel Oil [Domestic Navigation][Gas/Diesel Oil][Emissions][CH4][kt][no source][no method][no target][no option][no type]
type: Concept
definition: 1.A.3.d Gas/Diesel Oil [Domestic Navigation][Gas/Diesel Oil][Emissions][CH4][kt][no source][no method][no target][no option][no type]
status: valid
status modified: 2017-02-13
accepted date: 2017-02-13
in scheme: IPCC_variables_MMR

1.A.3.d Gas/Diesel Oil [Domestic Navigation][Gas/Diesel Oil][Emissions][CO2][kt][no source][no method][no target][no option][no type]
type: Concept
definition: 1.A.3.d Gas/Diesel Oil [Domestic Navigation][Gas/Diesel Oil][Emissions][CO2][kt][no source][no method][no target][no option][no type]
status: valid
status modified: 2017-02-13
accepted date: 2017-02-13
in scheme: IPCC_variables_MMR

1.A.3.d Gas/Diesel Oil [Domestic Navigation][Gas/Diesel Oil][Emissions][N2O][kt][no source][no method][no target][no option][no type]
type: Concept
definition: 1.A.3.d Gas/Diesel Oil [Domestic Navigation][Gas/Diesel Oil][Emissions][N2O][kt][no source][no method][no target][no option][no type]
status: valid
status modified: 2017-02-13
accepted date: 2017-02-13
in scheme: IPCC_variables_MMR

1.A.3.d Gaseous Fuels [Domestic Navigation][Gaseous Fuels][Emissions][CH4][kt][no source][no method][no target][no option][no type]
type: Concept
definition: 1.A.3.d Gaseous Fuels [Domestic Navigation][Gaseous Fuels][Emissions][CH4][kt][no source][no method][no target][no option][no type]
status: valid
status modified: 2017-02-13
accepted date: 2017-02-13
in scheme: IPCC_variables_MMR

1.A.3.d Gaseous Fuels [Domestic Navigation][Gaseous Fuels][Emissions][CO2][kt][no source][no method][no target][no option][no type]
type: Concept
definition: 1.A.3.d Gaseous Fuels [Domestic Navigation][Gaseous Fuels][Emissions][CO2][kt][no source][no method][no target][no option][no type]
status: valid
status modified: 2017-02-13
accepted date: 2017-02-13
in scheme: IPCC_variables_MMR

1.A.3.d Gaseous Fuels [Domestic Navigation][Gaseous Fuels][Emissions][N2O][kt][no source][no method][no target][no option][no type]
type: Concept
definition: 1.A.3.d Gaseous Fuels [Domestic Navigation][Gaseous Fuels][Emissions][N2O][kt][no source][no method][no target][no option][no type]
status: valid
status modified: 2017-02-13
accepted date: 2017-02-13
in scheme: IPCC_variables_MMR

1.A.3.d Gasoline [Domestic Navigation][Gasoline][Emissions][CH4][kt][no source][no method][no target][no option][no type]
type: Concept
definition: 1.A.3.d Gasoline [Domestic Navigation][Gasoline][Emissions][CH4][kt][no source][no method][no target][no option][no type]
status: valid
status modified: 2017-02-13
accepted date: 2017-02-13
in scheme: IPCC_variables_MMR

1.A.3.d Gasoline [Domestic Navigation][Gasoline][Emissions][CO2][kt][no source][no method][no target][no option][no type]
type: Concept
definition: 1.A.3.d Gasoline [Domestic Navigation][Gasoline][Emissions][CO2][kt][no source][no method][no target][no option][no type]
status: valid
status modified: 2017-02-13
accepted date: 2017-02-13
in scheme: IPCC_variables_MMR

1.A.3.d Gasoline [Domestic Navigation][Gasoline][Emissions][N2O][kt][no source][no method][no target][no option][no type]
type: Concept
definition: 1.A.3.d Gasoline [Domestic Navigation][Gasoline][Emissions][N2O][kt][no source][no method][no target][no option][no type]
status: valid
status modified: 2017-02-13
accepted date: 2017-02-13
in scheme: IPCC_variables_MMR

1.A.3.d Other Fossil Fuels [Domestic Navigation][Other Fossil Fuels][Emissions][CH4][kt][no source][no method][no target][no option][no type]
type: Concept
definition: 1.A.3.d Other Fossil Fuels [Domestic Navigation][Other Fossil Fuels][Emissions][CH4][kt][no source][no method][no target][no option][no type]
status: valid
status modified: 2017-02-13
accepted date: 2017-02-13
in scheme: IPCC_variables_MMR

1.A.3.d Other Fossil Fuels [Domestic Navigation][Other Fossil Fuels][Emissions][CO2][kt][no source][no method][no target][no option][no type]
type: Concept
definition: 1.A.3.d Other Fossil Fuels [Domestic Navigation][Other Fossil Fuels][Emissions][CO2][kt][no source][no method][no target][no option][no type]
status: valid
status modified: 2017-02-13
accepted date: 2017-02-13
in scheme: IPCC_variables_MMR

1.A.3.d Other Fossil Fuels [Domestic Navigation][Other Fossil Fuels][Emissions][N2O][kt][no source][no method][no target][no option][no type]
type: Concept
definition: 1.A.3.d Other Fossil Fuels [Domestic Navigation][Other Fossil Fuels][Emissions][N2O][kt][no source][no method][no target][no option][no type]
status: valid
status modified: 2017-02-13
accepted date: 2017-02-13
in scheme: IPCC_variables_MMR

1.A.3.d Other Liquid Fuels [Domestic Navigation][Other Liquid Fuels][Emissions][CH4][kt][no source][no method][no target][no option][no type]
type: Concept
definition: 1.A.3.d Other Liquid Fuels [Domestic Navigation][Other Liquid Fuels][Emissions][CH4][kt][no source][no method][no target][no option][no type]
status: valid
status modified: 2017-02-13
accepted date: 2017-02-13
in scheme: IPCC_variables_MMR

1.A.3.d Other Liquid Fuels [Domestic Navigation][Other Liquid Fuels][Emissions][CO2][kt][no source][no method][no target][no option][no type]
type: Concept
definition: 1.A.3.d Other Liquid Fuels [Domestic Navigation][Other Liquid Fuels][Emissions][CO2][kt][no source][no method][no target][no option][no type]
status: valid
status modified: 2017-02-13
accepted date: 2017-02-13
in scheme: IPCC_variables_MMR

1.A.3.d Other Liquid Fuels [Domestic Navigation][Other Liquid Fuels][Emissions][N2O][kt][no source][no method][no target][no option][no type]
type: Concept
definition: 1.A.3.d Other Liquid Fuels [Domestic Navigation][Other Liquid Fuels][Emissions][N2O][kt][no source][no method][no target][no option][no type]
status: valid
status modified: 2017-02-13
accepted date: 2017-02-13
in scheme: IPCC_variables_MMR

1.A.3.d Residual Fuel Oil [Domestic Navigation][Residual Fuel Oil][Emissions][CH4][kt][no source][no method][no target][no option][no type]
type: Concept
definition: 1.A.3.d Residual Fuel Oil [Domestic Navigation][Residual Fuel Oil][Emissions][CH4][kt][no source][no method][no target][no option][no type]
status: valid
status modified: 2017-02-13
accepted date: 2017-02-13
in scheme: IPCC_variables_MMR

1.A.3.d Residual Fuel Oil [Domestic Navigation][Residual Fuel Oil][Emissions][CO2][kt][no source][no method][no target][no option][no type]
type: Concept
definition: 1.A.3.d Residual Fuel Oil [Domestic Navigation][Residual Fuel Oil][Emissions][CO2][kt][no source][no method][no target][no option][no type]
status: valid
status modified: 2017-02-13
accepted date: 2017-02-13
in scheme: IPCC_variables_MMR

1.A.3.d Residual Fuel Oil [Domestic Navigation][Residual Fuel Oil][Emissions][N2O][kt][no source][no method][no target][no option][no type]
type: Concept
definition: 1.A.3.d Residual Fuel Oil [Domestic Navigation][Residual Fuel Oil][Emissions][N2O][kt][no source][no method][no target][no option][no type]
status: valid
status modified: 2017-02-13
accepted date: 2017-02-13
in scheme: IPCC_variables_MMR

1.A.3.e [Other Transportation][Biomass][Emissions][CH4][kt][no source][no method][no target][no option][no type]
type: Concept
definition: 1.A.3.e [Other Transportation][Biomass][Emissions][CH4][kt][no source][no method][no target][no option][no type]
status: valid
status modified: 2017-02-13
accepted date: 2017-02-13
in scheme: IPCC_variables_MMR

1.A.3.e [Other Transportation][Biomass][Emissions][CO2][kt][no source][no method][no target][no option][no type]
type: Concept
definition: 1.A.3.e [Other Transportation][Biomass][Emissions][CO2][kt][no source][no method][no target][no option][no type]
status: valid
status modified: 2017-02-13
accepted date: 2017-02-13
in scheme: IPCC_variables_MMR

1.A.3.e [Other Transportation][Biomass][Emissions][N2O][kt][no source][no method][no target][no option][no type]
type: Concept
definition: 1.A.3.e [Other Transportation][Biomass][Emissions][N2O][kt][no source][no method][no target][no option][no type]
status: valid
status modified: 2017-02-13
accepted date: 2017-02-13
in scheme: IPCC_variables_MMR

1.A.3.e [Other Transportation][Fossil fuels][Emissions][CO2][kt][no source][no method][no target][no option][no type]
type: Concept
definition: 1.A.3.e [Other Transportation][Fossil fuels][Emissions][CO2][kt][no source][no method][no target][no option][no type]
status: valid
status modified: 2017-02-13
accepted date: 2017-02-13
in scheme: IPCC_variables_MMR

1.A.3.e [Other Transportation][Fuels][Emissions][CH4][kt][no source][no method][no target][no option][no type]
type: Concept
definition: 1.A.3.e [Other Transportation][Fuels][Emissions][CH4][kt][no source][no method][no target][no option][no type]
status: valid
status modified: 2017-02-13
accepted date: 2017-02-13
in scheme: IPCC_variables_MMR

1.A.3.e [Other Transportation][Fuels][Emissions][N2O][kt][no source][no method][no target][no option][no type]
type: Concept
definition: 1.A.3.e [Other Transportation][Fuels][Emissions][N2O][kt][no source][no method][no target][no option][no type]
status: valid
status modified: 2017-02-13
accepted date: 2017-02-13
in scheme: IPCC_variables_MMR

1.A.3.e [Other Transportation][Gaseous Fuels][Emissions][CH4][kt][no source][no method][no target][no option][no type]
type: Concept
definition: 1.A.3.e [Other Transportation][Gaseous Fuels][Emissions][CH4][kt][no source][no method][no target][no option][no type]
status: valid
status modified: 2017-02-13
accepted date: 2017-02-13
in scheme: IPCC_variables_MMR

1.A.3.e [Other Transportation][Gaseous Fuels][Emissions][CO2][kt][no source][no method][no target][no option][no type]
type: Concept
definition: 1.A.3.e [Other Transportation][Gaseous Fuels][Emissions][CO2][kt][no source][no method][no target][no option][no type]
status: valid
status modified: 2017-02-13
accepted date: 2017-02-13
in scheme: IPCC_variables_MMR

1.A.3.e [Other Transportation][Gaseous Fuels][Emissions][N2O][kt][no source][no method][no target][no option][no type]
type: Concept
definition: 1.A.3.e [Other Transportation][Gaseous Fuels][Emissions][N2O][kt][no source][no method][no target][no option][no type]
status: valid
status modified: 2017-02-13
accepted date: 2017-02-13
in scheme: IPCC_variables_MMR

1.A.3.e [Other Transportation][Liquid Fuels][Emissions][CH4][kt][no source][no method][no target][no option][no type]
type: Concept
definition: 1.A.3.e [Other Transportation][Liquid Fuels][Emissions][CH4][kt][no source][no method][no target][no option][no type]
status: valid
status modified: 2017-02-13
accepted date: 2017-02-13
in scheme: IPCC_variables_MMR

1.A.3.e [Other Transportation][Liquid Fuels][Emissions][CO2][kt][no source][no method][no target][no option][no type]
type: Concept
definition: 1.A.3.e [Other Transportation][Liquid Fuels][Emissions][CO2][kt][no source][no method][no target][no option][no type]
status: valid
status modified: 2017-02-13
accepted date: 2017-02-13
in scheme: IPCC_variables_MMR

1.A.3.e [Other Transportation][Liquid Fuels][Emissions][N2O][kt][no source][no method][no target][no option][no type]
type: Concept
definition: 1.A.3.e [Other Transportation][Liquid Fuels][Emissions][N2O][kt][no source][no method][no target][no option][no type]
status: valid
status modified: 2017-02-13
accepted date: 2017-02-13
in scheme: IPCC_variables_MMR

1.A.3.e [Other Transportation][Other Fossil Fuels][Emissions][CH4][kt][no source][no method][no target][no option][no type]
type: Concept
definition: 1.A.3.e [Other Transportation][Other Fossil Fuels][Emissions][CH4][kt][no source][no method][no target][no option][no type]
status: valid
status modified: 2017-02-13
accepted date: 2017-02-13
in scheme: IPCC_variables_MMR

1.A.3.e [Other Transportation][Other Fossil Fuels][Emissions][CO2][kt][no source][no method][no target][no option][no type]
type: Concept
definition: 1.A.3.e [Other Transportation][Other Fossil Fuels][Emissions][CO2][kt][no source][no method][no target][no option][no type]
status: valid
status modified: 2017-02-13
accepted date: 2017-02-13
in scheme: IPCC_variables_MMR

1.A.3.e [Other Transportation][Other Fossil Fuels][Emissions][N2O][kt][no source][no method][no target][no option][no type]
type: Concept
definition: 1.A.3.e [Other Transportation][Other Fossil Fuels][Emissions][N2O][kt][no source][no method][no target][no option][no type]
status: valid
status modified: 2017-02-13
accepted date: 2017-02-13
in scheme: IPCC_variables_MMR

1.A.3.e [Other Transportation][Solid Fuels][Emissions][CH4][kt][no source][no method][no target][no option][no type]
type: Concept
definition: 1.A.3.e [Other Transportation][Solid Fuels][Emissions][CH4][kt][no source][no method][no target][no option][no type]
status: valid
status modified: 2017-02-13
accepted date: 2017-02-13
in scheme: IPCC_variables_MMR

1.A.3.e [Other Transportation][Solid Fuels][Emissions][CO2][kt][no source][no method][no target][no option][no type]
type: Concept
definition: 1.A.3.e [Other Transportation][Solid Fuels][Emissions][CO2][kt][no source][no method][no target][no option][no type]
status: valid
status modified: 2017-02-13
accepted date: 2017-02-13
in scheme: IPCC_variables_MMR

1.A.3.e [Other Transportation][Solid Fuels][Emissions][N2O][kt][no source][no method][no target][no option][no type]
type: Concept
definition: 1.A.3.e [Other Transportation][Solid Fuels][Emissions][N2O][kt][no source][no method][no target][no option][no type]
status: valid
status modified: 2017-02-13
accepted date: 2017-02-13
in scheme: IPCC_variables_MMR

1.A.3.e.i Biomass [Pipeline Transport][Biomass][Emissions][CH4][kt][no source][no method][no target][no option][no type]
type: Concept
definition: 1.A.3.e.i Biomass [Pipeline Transport][Biomass][Emissions][CH4][kt][no source][no method][no target][no option][no type]
status: valid
status modified: 2017-02-13
accepted date: 2017-02-13
in scheme: IPCC_variables_MMR

1.A.3.e.i Biomass [Pipeline Transport][Biomass][Emissions][CO2][kt][no source][no method][no target][no option][no type]
type: Concept
definition: 1.A.3.e.i Biomass [Pipeline Transport][Biomass][Emissions][CO2][kt][no source][no method][no target][no option][no type]
status: valid
status modified: 2017-02-13
accepted date: 2017-02-13
in scheme: IPCC_variables_MMR

1.A.3.e.i Biomass [Pipeline Transport][Biomass][Emissions][N2O][kt][no source][no method][no target][no option][no type]
type: Concept
definition: 1.A.3.e.i Biomass [Pipeline Transport][Biomass][Emissions][N2O][kt][no source][no method][no target][no option][no type]
status: valid
status modified: 2017-02-13
accepted date: 2017-02-13
in scheme: IPCC_variables_MMR

1.A.3.e.i Gaseous Fuels [Pipeline Transport][Gaseous Fuels][Emissions][CH4][kt][no source][no method][no target][no option][no type]
type: Concept
definition: 1.A.3.e.i Gaseous Fuels [Pipeline Transport][Gaseous Fuels][Emissions][CH4][kt][no source][no method][no target][no option][no type]
status: valid
status modified: 2017-02-13
accepted date: 2017-02-13
in scheme: IPCC_variables_MMR

1.A.3.e.i Gaseous Fuels [Pipeline Transport][Gaseous Fuels][Emissions][CO2][kt][no source][no method][no target][no option][no type]
type: Concept
definition: 1.A.3.e.i Gaseous Fuels [Pipeline Transport][Gaseous Fuels][Emissions][CO2][kt][no source][no method][no target][no option][no type]
status: valid
status modified: 2017-02-13
accepted date: 2017-02-13
in scheme: IPCC_variables_MMR

1.A.3.e.i Gaseous Fuels [Pipeline Transport][Gaseous Fuels][Emissions][N2O][kt][no source][no method][no target][no option][no type]
type: Concept
definition: 1.A.3.e.i Gaseous Fuels [Pipeline Transport][Gaseous Fuels][Emissions][N2O][kt][no source][no method][no target][no option][no type]
status: valid
status modified: 2017-02-13
accepted date: 2017-02-13
in scheme: IPCC_variables_MMR

1.A.3.e.i Other Fossil Fuels [Pipeline Transport][Other Fossil Fuels][Emissions][CH4][kt][no source][no method][no target][no option][no type]
type: Concept
definition: 1.A.3.e.i Other Fossil Fuels [Pipeline Transport][Other Fossil Fuels][Emissions][CH4][kt][no source][no method][no target][no option][no type]
status: valid
status modified: 2017-02-13
accepted date: 2017-02-13
in scheme: IPCC_variables_MMR

1.A.3.e.i Other Fossil Fuels [Pipeline Transport][Other Fossil Fuels][Emissions][CO2][kt][no source][no method][no target][no option][no type]
type: Concept
definition: 1.A.3.e.i Other Fossil Fuels [Pipeline Transport][Other Fossil Fuels][Emissions][CO2][kt][no source][no method][no target][no option][no type]
status: valid
status modified: 2017-02-13
accepted date: 2017-02-13
in scheme: IPCC_variables_MMR

1.A.3.e.i Other Fossil Fuels [Pipeline Transport][Other Fossil Fuels][Emissions][N2O][kt][no source][no method][no target][no option][no type]
type: Concept
definition: 1.A.3.e.i Other Fossil Fuels [Pipeline Transport][Other Fossil Fuels][Emissions][N2O][kt][no source][no method][no target][no option][no type]
status: valid
status modified: 2017-02-13
accepted date: 2017-02-13
in scheme: IPCC_variables_MMR

1.A.3.e.i Solid Fuels [Pipeline Transport][Solid Fuels][Emissions][CH4][kt][no source][no method][no target][no option][no type]
type: Concept
definition: 1.A.3.e.i Solid Fuels [Pipeline Transport][Solid Fuels][Emissions][CH4][kt][no source][no method][no target][no option][no type]
status: valid
status modified: 2017-02-13
accepted date: 2017-02-13
in scheme: IPCC_variables_MMR

1.A.3.e.i Solid Fuels [Pipeline Transport][Solid Fuels][Emissions][CO2][kt][no source][no method][no target][no option][no type]
type: Concept
definition: 1.A.3.e.i Solid Fuels [Pipeline Transport][Solid Fuels][Emissions][CO2][kt][no source][no method][no target][no option][no type]
status: valid
status modified: 2017-02-13
accepted date: 2017-02-13
in scheme: IPCC_variables_MMR

1.A.3.e.i Solid Fuels [Pipeline Transport][Solid Fuels][Emissions][N2O][kt][no source][no method][no target][no option][no type]
type: Concept
definition: 1.A.3.e.i Solid Fuels [Pipeline Transport][Solid Fuels][Emissions][N2O][kt][no source][no method][no target][no option][no type]
status: valid
status modified: 2017-02-13
accepted date: 2017-02-13
in scheme: IPCC_variables_MMR

1.A.4 [Other Sectors][Biomass][Emissions][CH4][kt][no source][no method][no target][no option][no type]
type: Concept
definition: 1.A.4 [Other Sectors][Biomass][Emissions][CH4][kt][no source][no method][no target][no option][no type]
status: valid
status modified: 2017-02-13
accepted date: 2017-02-13
in scheme: IPCC_variables_MMR

1.A.4 [Other Sectors][Biomass][Emissions][CO2][kt][no source][no method][no target][no option][no type]
type: Concept
definition: 1.A.4 [Other Sectors][Biomass][Emissions][CO2][kt][no source][no method][no target][no option][no type]
status: valid
status modified: 2017-02-13
accepted date: 2017-02-13
in scheme: IPCC_variables_MMR

1.A.4 [Other Sectors][Biomass][Emissions][N2O][kt][no source][no method][no target][no option][no type]
type: Concept
definition: 1.A.4 [Other Sectors][Biomass][Emissions][N2O][kt][no source][no method][no target][no option][no type]
status: valid
status modified: 2017-02-13
accepted date: 2017-02-13
in scheme: IPCC_variables_MMR

1.A.4 [Other Sectors][Fuels][Emissions][CH4][kt][no source][no method][no target][no option][no type]
type: Concept
definition: 1.A.4 [Other Sectors][Fuels][Emissions][CH4][kt][no source][no method][no target][no option][no type]
status: valid
status modified: 2017-02-13
accepted date: 2017-02-13
in scheme: IPCC_variables_MMR

1.A.4 [Other Sectors][Fuels][Emissions][CO2][kt][no source][no method][no target][no option][no type]
type: Concept
definition: 1.A.4 [Other Sectors][Fuels][Emissions][CO2][kt][no source][no method][no target][no option][no type]
status: valid
status modified: 2017-02-13
accepted date: 2017-02-13
in scheme: IPCC_variables_MMR

1.A.4 [Other Sectors][Fuels][Emissions][N2O][kt][no source][no method][no target][no option][no type]
type: Concept
definition: 1.A.4 [Other Sectors][Fuels][Emissions][N2O][kt][no source][no method][no target][no option][no type]
status: valid
status modified: 2017-02-13
accepted date: 2017-02-13
in scheme: IPCC_variables_MMR

1.A.4 [Other Sectors][Gaseous Fuels][Emissions][CH4][kt][no source][no method][no target][no option][no type]
type: Concept
definition: 1.A.4 [Other Sectors][Gaseous Fuels][Emissions][CH4][kt][no source][no method][no target][no option][no type]
status: valid
status modified: 2017-02-13
accepted date: 2017-02-13
in scheme: IPCC_variables_MMR

1.A.4 [Other Sectors][Gaseous Fuels][Emissions][CO2][kt][no source][no method][no target][no option][no type]
type: Concept
definition: 1.A.4 [Other Sectors][Gaseous Fuels][Emissions][CO2][kt][no source][no method][no target][no option][no type]
status: valid
status modified: 2017-02-13
accepted date: 2017-02-13
in scheme: IPCC_variables_MMR

1.A.4 [Other Sectors][Gaseous Fuels][Emissions][N2O][kt][no source][no method][no target][no option][no type]
type: Concept
definition: 1.A.4 [Other Sectors][Gaseous Fuels][Emissions][N2O][kt][no source][no method][no target][no option][no type]
status: valid
status modified: 2017-02-13
accepted date: 2017-02-13
in scheme: IPCC_variables_MMR

1.A.4 [Other Sectors][Liquid Fuels][Emissions][CH4][kt][no source][no method][no target][no option][no type]
type: Concept
definition: 1.A.4 [Other Sectors][Liquid Fuels][Emissions][CH4][kt][no source][no method][no target][no option][no type]
status: valid
status modified: 2017-02-13
accepted date: 2017-02-13
in scheme: IPCC_variables_MMR

1.A.4 [Other Sectors][Liquid Fuels][Emissions][CO2][kt][no source][no method][no target][no option][no type]
type: Concept
definition: 1.A.4 [Other Sectors][Liquid Fuels][Emissions][CO2][kt][no source][no method][no target][no option][no type]
status: valid
status modified: 2017-02-13
accepted date: 2017-02-13
in scheme: IPCC_variables_MMR

1.A.4 [Other Sectors][Liquid Fuels][Emissions][N2O][kt][no source][no method][no target][no option][no type]
type: Concept
definition: 1.A.4 [Other Sectors][Liquid Fuels][Emissions][N2O][kt][no source][no method][no target][no option][no type]
status: valid
status modified: 2017-02-13
accepted date: 2017-02-13
in scheme: IPCC_variables_MMR

1.A.4 [Other Sectors][Other Fossil Fuels][Emissions][CH4][kt][no source][no method][no target][no option][no type]
type: Concept
definition: 1.A.4 [Other Sectors][Other Fossil Fuels][Emissions][CH4][kt][no source][no method][no target][no option][no type]
status: valid
status modified: 2017-02-13
accepted date: 2017-02-13
in scheme: IPCC_variables_MMR

1.A.4 [Other Sectors][Other Fossil Fuels][Emissions][CO2][kt][no source][no method][no target][no option][no type]
type: Concept
definition: 1.A.4 [Other Sectors][Other Fossil Fuels][Emissions][CO2][kt][no source][no method][no target][no option][no type]
status: valid
status modified: 2017-02-13
accepted date: 2017-02-13
in scheme: IPCC_variables_MMR

1.A.4 [Other Sectors][Other Fossil Fuels][Emissions][N2O][kt][no source][no method][no target][no option][no type]
type: Concept
definition: 1.A.4 [Other Sectors][Other Fossil Fuels][Emissions][N2O][kt][no source][no method][no target][no option][no type]
status: valid
status modified: 2017-02-13
accepted date: 2017-02-13
in scheme: IPCC_variables_MMR

1.A.4 [Other Sectors][Peat][Emissions][CH4][kt][no source][no method][no target][no option][no type]
type: Concept
definition: 1.A.4 [Other Sectors][Peat][Emissions][CH4][kt][no source][no method][no target][no option][no type]
status: valid
status modified: 2017-02-13
accepted date: 2017-02-13
in scheme: IPCC_variables_MMR

1.A.4 [Other Sectors][Peat][Emissions][CO2][kt][no source][no method][no target][no option][no type]
type: Concept
definition: 1.A.4 [Other Sectors][Peat][Emissions][CO2][kt][no source][no method][no target][no option][no type]
status: valid
status modified: 2017-02-13
accepted date: 2017-02-13
in scheme: IPCC_variables_MMR

1.A.4 [Other Sectors][Peat][Emissions][N2O][kt][no source][no method][no target][no option][no type]
type: Concept
definition: 1.A.4 [Other Sectors][Peat][Emissions][N2O][kt][no source][no method][no target][no option][no type]
status: valid
status modified: 2017-02-13
accepted date: 2017-02-13
in scheme: IPCC_variables_MMR

1.A.4 [Other Sectors][Solid Fuels][Emissions][CH4][kt][no source][no method][no target][no option][no type]
type: Concept
definition: 1.A.4 [Other Sectors][Solid Fuels][Emissions][CH4][kt][no source][no method][no target][no option][no type]
status: valid
status modified: 2017-02-13
accepted date: 2017-02-13
in scheme: IPCC_variables_MMR

1.A.4 [Other Sectors][Solid Fuels][Emissions][CO2][kt][no source][no method][no target][no option][no type]
type: Concept
definition: 1.A.4 [Other Sectors][Solid Fuels][Emissions][CO2][kt][no source][no method][no target][no option][no type]
status: valid
status modified: 2017-02-13
accepted date: 2017-02-13
in scheme: IPCC_variables_MMR

1.A.4 [Other Sectors][Solid Fuels][Emissions][N2O][kt][no source][no method][no target][no option][no type]
type: Concept
definition: 1.A.4 [Other Sectors][Solid Fuels][Emissions][N2O][kt][no source][no method][no target][no option][no type]
status: valid
status modified: 2017-02-13
accepted date: 2017-02-13
in scheme: IPCC_variables_MMR

1.A.4.a [Commercial/Institutional][Biomass][Emissions][CH4][kt][no source][no method][no target][no option][no type]
type: Concept
definition: 1.A.4.a [Commercial/Institutional][Biomass][Emissions][CH4][kt][no source][no method][no target][no option][no type]
status: valid
status modified: 2017-02-13
accepted date: 2017-02-13
in scheme: IPCC_variables_MMR

1.A.4.a [Commercial/Institutional][Biomass][Emissions][CO2][kt][no source][no method][no target][no option][no type]
type: Concept
definition: 1.A.4.a [Commercial/Institutional][Biomass][Emissions][CO2][kt][no source][no method][no target][no option][no type]
status: valid
status modified: 2017-02-13
accepted date: 2017-02-13
in scheme: IPCC_variables_MMR

1.A.4.a [Commercial/Institutional][Biomass][Emissions][N2O][kt][no source][no method][no target][no option][no type]
type: Concept
definition: 1.A.4.a [Commercial/Institutional][Biomass][Emissions][N2O][kt][no source][no method][no target][no option][no type]
status: valid
status modified: 2017-02-13
accepted date: 2017-02-13
in scheme: IPCC_variables_MMR

1.A.4.a [Commercial/Institutional][Fossil fuels][Emissions][CO2][kt][no source][no method][no target][no option][no type]
type: Concept
definition: 1.A.4.a [Commercial/Institutional][Fossil fuels][Emissions][CO2][kt][no source][no method][no target][no option][no type]
status: valid
status modified: 2017-02-13
accepted date: 2017-02-13
in scheme: IPCC_variables_MMR

1.A.4.a [Commercial/Institutional][Fuels][Emissions][CH4][kt][no source][no method][no target][no option][no type]
type: Concept
definition: 1.A.4.a [Commercial/Institutional][Fuels][Emissions][CH4][kt][no source][no method][no target][no option][no type]
status: valid
status modified: 2017-02-13
accepted date: 2017-02-13
in scheme: IPCC_variables_MMR

1.A.4.a [Commercial/Institutional][Fuels][Emissions][N2O][kt][no source][no method][no target][no option][no type]
type: Concept
definition: 1.A.4.a [Commercial/Institutional][Fuels][Emissions][N2O][kt][no source][no method][no target][no option][no type]
status: valid
status modified: 2017-02-13
accepted date: 2017-02-13
in scheme: IPCC_variables_MMR

1.A.4.a [Commercial/Institutional][Gaseous Fuels][Emissions][CH4][kt][no source][no method][no target][no option][no type]
type: Concept
definition: 1.A.4.a [Commercial/Institutional][Gaseous Fuels][Emissions][CH4][kt][no source][no method][no target][no option][no type]
status: valid
status modified: 2017-02-13
accepted date: 2017-02-13
in scheme: IPCC_variables_MMR

1.A.4.a [Commercial/Institutional][Gaseous Fuels][Emissions][CO2][kt][no source][no method][no target][no option][no type]
type: Concept
definition: 1.A.4.a [Commercial/Institutional][Gaseous Fuels][Emissions][CO2][kt][no source][no method][no target][no option][no type]
status: valid
status modified: 2017-02-13
accepted date: 2017-02-13
in scheme: IPCC_variables_MMR

1.A.4.a [Commercial/Institutional][Gaseous Fuels][Emissions][N2O][kt][no source][no method][no target][no option][no type]
type: Concept
definition: 1.A.4.a [Commercial/Institutional][Gaseous Fuels][Emissions][N2O][kt][no source][no method][no target][no option][no type]
status: valid
status modified: 2017-02-13
accepted date: 2017-02-13
in scheme: IPCC_variables_MMR

1.A.4.a [Commercial/Institutional][Liquid Fuels][Emissions][CH4][kt][no source][no method][no target][no option][no type]
type: Concept
definition: 1.A.4.a [Commercial/Institutional][Liquid Fuels][Emissions][CH4][kt][no source][no method][no target][no option][no type]
status: valid
status modified: 2017-02-13
accepted date: 2017-02-13
in scheme: IPCC_variables_MMR

1.A.4.a [Commercial/Institutional][Liquid Fuels][Emissions][CO2][kt][no source][no method][no target][no option][no type]
type: Concept
definition: 1.A.4.a [Commercial/Institutional][Liquid Fuels][Emissions][CO2][kt][no source][no method][no target][no option][no type]
status: valid
status modified: 2017-02-13
accepted date: 2017-02-13
in scheme: IPCC_variables_MMR

1.A.4.a [Commercial/Institutional][Liquid Fuels][Emissions][N2O][kt][no source][no method][no target][no option][no type]
type: Concept
definition: 1.A.4.a [Commercial/Institutional][Liquid Fuels][Emissions][N2O][kt][no source][no method][no target][no option][no type]
status: valid
status modified: 2017-02-13
accepted date: 2017-02-13
in scheme: IPCC_variables_MMR

1.A.4.a [Commercial/Institutional][Other Fossil Fuels][Emissions][CH4][kt][no source][no method][no target][no option][no type]
type: Concept
definition: 1.A.4.a [Commercial/Institutional][Other Fossil Fuels][Emissions][CH4][kt][no source][no method][no target][no option][no type]
status: valid
status modified: 2017-02-13
accepted date: 2017-02-13
in scheme: IPCC_variables_MMR

1.A.4.a [Commercial/Institutional][Other Fossil Fuels][Emissions][CO2][kt][no source][no method][no target][no option][no type]
type: Concept
definition: 1.A.4.a [Commercial/Institutional][Other Fossil Fuels][Emissions][CO2][kt][no source][no method][no target][no option][no type]
status: valid
status modified: 2017-02-13
accepted date: 2017-02-13
in scheme: IPCC_variables_MMR

1.A.4.a [Commercial/Institutional][Other Fossil Fuels][Emissions][N2O][kt][no source][no method][no target][no option][no type]
type: Concept
definition: 1.A.4.a [Commercial/Institutional][Other Fossil Fuels][Emissions][N2O][kt][no source][no method][no target][no option][no type]
status: valid
status modified: 2017-02-13
accepted date: 2017-02-13
in scheme: IPCC_variables_MMR

1.A.4.a [Commercial/Institutional][Peat][Emissions][CH4][kt][no source][no method][no target][no option][no type]
type: Concept
definition: 1.A.4.a [Commercial/Institutional][Peat][Emissions][CH4][kt][no source][no method][no target][no option][no type]
status: valid
status modified: 2017-02-13
accepted date: 2017-02-13
in scheme: IPCC_variables_MMR

1.A.4.a [Commercial/Institutional][Peat][Emissions][CO2][kt][no source][no method][no target][no option][no type]
type: Concept
definition: 1.A.4.a [Commercial/Institutional][Peat][Emissions][CO2][kt][no source][no method][no target][no option][no type]
status: valid
status modified: 2017-02-13
accepted date: 2017-02-13
in scheme: IPCC_variables_MMR

1.A.4.a [Commercial/Institutional][Peat][Emissions][N2O][kt][no source][no method][no target][no option][no type]
type: Concept
definition: 1.A.4.a [Commercial/Institutional][Peat][Emissions][N2O][kt][no source][no method][no target][no option][no type]
status: valid
status modified: 2017-02-13
accepted date: 2017-02-13
in scheme: IPCC_variables_MMR

1.A.4.a [Commercial/Institutional][Solid Fuels][Emissions][CH4][kt][no source][no method][no target][no option][no type]
type: Concept
definition: 1.A.4.a [Commercial/Institutional][Solid Fuels][Emissions][CH4][kt][no source][no method][no target][no option][no type]
status: valid
status modified: 2017-02-13
accepted date: 2017-02-13
in scheme: IPCC_variables_MMR

1.A.4.a [Commercial/Institutional][Solid Fuels][Emissions][CO2][kt][no source][no method][no target][no option][no type]
type: Concept
definition: 1.A.4.a [Commercial/Institutional][Solid Fuels][Emissions][CO2][kt][no source][no method][no target][no option][no type]
status: valid
status modified: 2017-02-13
accepted date: 2017-02-13
in scheme: IPCC_variables_MMR

1.A.4.a [Commercial/Institutional][Solid Fuels][Emissions][N2O][kt][no source][no method][no target][no option][no type]
type: Concept
definition: 1.A.4.a [Commercial/Institutional][Solid Fuels][Emissions][N2O][kt][no source][no method][no target][no option][no type]
status: valid
status modified: 2017-02-13
accepted date: 2017-02-13
in scheme: IPCC_variables_MMR

1.A.4.b [Residential][Biomass][Emissions][CH4][kt][no source][no method][no target][no option][no type]
type: Concept
definition: 1.A.4.b [Residential][Biomass][Emissions][CH4][kt][no source][no method][no target][no option][no type]
status: valid
status modified: 2017-02-13
accepted date: 2017-02-13
in scheme: IPCC_variables_MMR

1.A.4.b [Residential][Biomass][Emissions][CO2][kt][no source][no method][no target][no option][no type]
type: Concept
definition: 1.A.4.b [Residential][Biomass][Emissions][CO2][kt][no source][no method][no target][no option][no type]
status: valid
status modified: 2017-02-13
accepted date: 2017-02-13
in scheme: IPCC_variables_MMR

1.A.4.b [Residential][Biomass][Emissions][N2O][kt][no source][no method][no target][no option][no type]
type: Concept
definition: 1.A.4.b [Residential][Biomass][Emissions][N2O][kt][no source][no method][no target][no option][no type]
status: valid
status modified: 2017-02-13
accepted date: 2017-02-13
in scheme: IPCC_variables_MMR

1.A.4.b [Residential][Fossil fuels][Emissions][CO2][kt][no source][no method][no target][no option][no type]
type: Concept
definition: 1.A.4.b [Residential][Fossil fuels][Emissions][CO2][kt][no source][no method][no target][no option][no type]
status: valid
status modified: 2017-02-13
accepted date: 2017-02-13
in scheme: IPCC_variables_MMR

1.A.4.b [Residential][Fuels][Emissions][CH4][kt][no source][no method][no target][no option][no type]
type: Concept
definition: 1.A.4.b [Residential][Fuels][Emissions][CH4][kt][no source][no method][no target][no option][no type]
status: valid
status modified: 2017-02-13
accepted date: 2017-02-13
in scheme: IPCC_variables_MMR

1.A.4.b [Residential][Fuels][Emissions][N2O][kt][no source][no method][no target][no option][no type]
type: Concept
definition: 1.A.4.b [Residential][Fuels][Emissions][N2O][kt][no source][no method][no target][no option][no type]
status: valid
status modified: 2017-02-13
accepted date: 2017-02-13
in scheme: IPCC_variables_MMR

1.A.4.b [Residential][Gaseous Fuels][Emissions][CH4][kt][no source][no method][no target][no option][no type]
type: Concept
definition: 1.A.4.b [Residential][Gaseous Fuels][Emissions][CH4][kt][no source][no method][no target][no option][no type]
status: valid
status modified: 2017-02-13
accepted date: 2017-02-13
in scheme: IPCC_variables_MMR

1.A.4.b [Residential][Gaseous Fuels][Emissions][CO2][kt][no source][no method][no target][no option][no type]
type: Concept
definition: 1.A.4.b [Residential][Gaseous Fuels][Emissions][CO2][kt][no source][no method][no target][no option][no type]
status: valid
status modified: 2017-02-13
accepted date: 2017-02-13
in scheme: IPCC_variables_MMR

1.A.4.b [Residential][Gaseous Fuels][Emissions][N2O][kt][no source][no method][no target][no option][no type]
type: Concept
definition: 1.A.4.b [Residential][Gaseous Fuels][Emissions][N2O][kt][no source][no method][no target][no option][no type]
status: valid
status modified: 2017-02-13
accepted date: 2017-02-13
in scheme: IPCC_variables_MMR

1.A.4.b [Residential][Liquid Fuels][Emissions][CH4][kt][no source][no method][no target][no option][no type]
type: Concept
definition: 1.A.4.b [Residential][Liquid Fuels][Emissions][CH4][kt][no source][no method][no target][no option][no type]
status: valid
status modified: 2017-02-13
accepted date: 2017-02-13
in scheme: IPCC_variables_MMR

1.A.4.b [Residential][Liquid Fuels][Emissions][CO2][kt][no source][no method][no target][no option][no type]
type: Concept
definition: 1.A.4.b [Residential][Liquid Fuels][Emissions][CO2][kt][no source][no method][no target][no option][no type]
status: valid
status modified: 2017-02-13
accepted date: 2017-02-13
in scheme: IPCC_variables_MMR

1.A.4.b [Residential][Liquid Fuels][Emissions][N2O][kt][no source][no method][no target][no option][no type]
type: Concept
definition: 1.A.4.b [Residential][Liquid Fuels][Emissions][N2O][kt][no source][no method][no target][no option][no type]
status: valid
status modified: 2017-02-13
accepted date: 2017-02-13
in scheme: IPCC_variables_MMR

1.A.4.b [Residential][Other Fossil Fuels][Emissions][CH4][kt][no source][no method][no target][no option][no type]
type: Concept
definition: 1.A.4.b [Residential][Other Fossil Fuels][Emissions][CH4][kt][no source][no method][no target][no option][no type]
status: valid
status modified: 2017-02-13
accepted date: 2017-02-13
in scheme: IPCC_variables_MMR

1.A.4.b [Residential][Other Fossil Fuels][Emissions][CO2][kt][no source][no method][no target][no option][no type]
type: Concept
definition: 1.A.4.b [Residential][Other Fossil Fuels][Emissions][CO2][kt][no source][no method][no target][no option][no type]
status: valid
status modified: 2017-02-13
accepted date: 2017-02-13
in scheme: IPCC_variables_MMR

1.A.4.b [Residential][Other Fossil Fuels][Emissions][N2O][kt][no source][no method][no target][no option][no type]
type: Concept
definition: 1.A.4.b [Residential][Other Fossil Fuels][Emissions][N2O][kt][no source][no method][no target][no option][no type]
status: valid
status modified: 2017-02-13
accepted date: 2017-02-13
in scheme: IPCC_variables_MMR

1.A.4.b [Residential][Peat][Emissions][CH4][kt][no source][no method][no target][no option][no type]
type: Concept
definition: 1.A.4.b [Residential][Peat][Emissions][CH4][kt][no source][no method][no target][no option][no type]
status: valid
status modified: 2017-02-13
accepted date: 2017-02-13
in scheme: IPCC_variables_MMR

1.A.4.b [Residential][Peat][Emissions][CO2][kt][no source][no method][no target][no option][no type]
type: Concept
definition: 1.A.4.b [Residential][Peat][Emissions][CO2][kt][no source][no method][no target][no option][no type]
status: valid
status modified: 2017-02-13
accepted date: 2017-02-13
in scheme: IPCC_variables_MMR

1.A.4.b [Residential][Peat][Emissions][N2O][kt][no source][no method][no target][no option][no type]
type: Concept
definition: 1.A.4.b [Residential][Peat][Emissions][N2O][kt][no source][no method][no target][no option][no type]
status: valid
status modified: 2017-02-13
accepted date: 2017-02-13
in scheme: IPCC_variables_MMR

1.A.4.b [Residential][Solid Fuels][Emissions][CH4][kt][no source][no method][no target][no option][no type]
type: Concept
definition: 1.A.4.b [Residential][Solid Fuels][Emissions][CH4][kt][no source][no method][no target][no option][no type]
status: valid
status modified: 2017-02-13
accepted date: 2017-02-13
in scheme: IPCC_variables_MMR

1.A.4.b [Residential][Solid Fuels][Emissions][CO2][kt][no source][no method][no target][no option][no type]
type: Concept
definition: 1.A.4.b [Residential][Solid Fuels][Emissions][CO2][kt][no source][no method][no target][no option][no type]
status: valid
status modified: 2017-02-13
accepted date: 2017-02-13
in scheme: IPCC_variables_MMR

1.A.4.b [Residential][Solid Fuels][Emissions][N2O][kt][no source][no method][no target][no option][no type]
type: Concept
definition: 1.A.4.b [Residential][Solid Fuels][Emissions][N2O][kt][no source][no method][no target][no option][no type]
status: valid
status modified: 2017-02-13
accepted date: 2017-02-13
in scheme: IPCC_variables_MMR

1.A.4.c [Agriculture/Forestry/Fishing][Biomass][Emissions][CH4][kt][no source][no method][no target][no option][no type]
type: Concept
definition: 1.A.4.c [Agriculture/Forestry/Fishing][Biomass][Emissions][CH4][kt][no source][no method][no target][no option][no type]
status: valid
status modified: 2017-02-13
accepted date: 2017-02-13
in scheme: IPCC_variables_MMR

1.A.4.c [Agriculture/Forestry/Fishing][Biomass][Emissions][CO2][kt][no source][no method][no target][no option][no type]
type: Concept
definition: 1.A.4.c [Agriculture/Forestry/Fishing][Biomass][Emissions][CO2][kt][no source][no method][no target][no option][no type]
status: valid
status modified: 2017-02-13
accepted date: 2017-02-13
in scheme: IPCC_variables_MMR

1.A.4.c [Agriculture/Forestry/Fishing][Biomass][Emissions][N2O][kt][no source][no method][no target][no option][no type]
type: Concept
definition: 1.A.4.c [Agriculture/Forestry/Fishing][Biomass][Emissions][N2O][kt][no source][no method][no target][no option][no type]
status: valid
status modified: 2017-02-13
accepted date: 2017-02-13
in scheme: IPCC_variables_MMR

1.A.4.c [Agriculture/Forestry/Fishing][Fossil fuels][Emissions][CO2][kt][no source][no method][no target][no option][no type]
type: Concept
definition: 1.A.4.c [Agriculture/Forestry/Fishing][Fossil fuels][Emissions][CO2][kt][no source][no method][no target][no option][no type]
status: valid
status modified: 2017-02-13
accepted date: 2017-02-13
in scheme: IPCC_variables_MMR

1.A.4.c [Agriculture/Forestry/Fishing][Fuels][Emissions][CH4][kt][no source][no method][no target][no option][no type]
type: Concept
definition: 1.A.4.c [Agriculture/Forestry/Fishing][Fuels][Emissions][CH4][kt][no source][no method][no target][no option][no type]
status: valid
status modified: 2017-02-13
accepted date: 2017-02-13
in scheme: IPCC_variables_MMR

1.A.4.c [Agriculture/Forestry/Fishing][Fuels][Emissions][N2O][kt][no source][no method][no target][no option][no type]
type: Concept
definition: 1.A.4.c [Agriculture/Forestry/Fishing][Fuels][Emissions][N2O][kt][no source][no method][no target][no option][no type]
status: valid
status modified: 2017-02-13
accepted date: 2017-02-13
in scheme: IPCC_variables_MMR

1.A.4.c [Agriculture/Forestry/Fishing][Gaseous Fuels][Emissions][CH4][kt][no source][no method][no target][no option][no type]
type: Concept
definition: 1.A.4.c [Agriculture/Forestry/Fishing][Gaseous Fuels][Emissions][CH4][kt][no source][no method][no target][no option][no type]
status: valid
status modified: 2017-02-13
accepted date: 2017-02-13
in scheme: IPCC_variables_MMR

1.A.4.c [Agriculture/Forestry/Fishing][Gaseous Fuels][Emissions][CO2][kt][no source][no method][no target][no option][no type]
type: Concept
definition: 1.A.4.c [Agriculture/Forestry/Fishing][Gaseous Fuels][Emissions][CO2][kt][no source][no method][no target][no option][no type]
status: valid
status modified: 2017-02-13
accepted date: 2017-02-13
in scheme: IPCC_variables_MMR

1.A.4.c [Agriculture/Forestry/Fishing][Gaseous Fuels][Emissions][N2O][kt][no source][no method][no target][no option][no type]
type: Concept
definition: 1.A.4.c [Agriculture/Forestry/Fishing][Gaseous Fuels][Emissions][N2O][kt][no source][no method][no target][no option][no type]
status: valid
status modified: 2017-02-13
accepted date: 2017-02-13
in scheme: IPCC_variables_MMR

1.A.4.c [Agriculture/Forestry/Fishing][Liquid Fuels][Emissions][CH4][kt][no source][no method][no target][no option][no type]
type: Concept
definition: 1.A.4.c [Agriculture/Forestry/Fishing][Liquid Fuels][Emissions][CH4][kt][no source][no method][no target][no option][no type]
status: valid
status modified: 2017-02-13
accepted date: 2017-02-13
in scheme: IPCC_variables_MMR

1.A.4.c [Agriculture/Forestry/Fishing][Liquid Fuels][Emissions][CO2][kt][no source][no method][no target][no option][no type]
type: Concept
definition: 1.A.4.c [Agriculture/Forestry/Fishing][Liquid Fuels][Emissions][CO2][kt][no source][no method][no target][no option][no type]
status: valid
status modified: 2017-02-13
accepted date: 2017-02-13
in scheme: IPCC_variables_MMR

1.A.4.c [Agriculture/Forestry/Fishing][Liquid Fuels][Emissions][N2O][kt][no source][no method][no target][no option][no type]
type: Concept
definition: 1.A.4.c [Agriculture/Forestry/Fishing][Liquid Fuels][Emissions][N2O][kt][no source][no method][no target][no option][no type]
status: valid
status modified: 2017-02-13
accepted date: 2017-02-13
in scheme: IPCC_variables_MMR

1.A.4.c [Agriculture/Forestry/Fishing][Other Fossil Fuels][Emissions][CH4][kt][no source][no method][no target][no option][no type]
type: Concept
definition: 1.A.4.c [Agriculture/Forestry/Fishing][Other Fossil Fuels][Emissions][CH4][kt][no source][no method][no target][no option][no type]
status: valid
status modified: 2017-02-13
accepted date: 2017-02-13
in scheme: IPCC_variables_MMR

1.A.4.c [Agriculture/Forestry/Fishing][Other Fossil Fuels][Emissions][CO2][kt][no source][no method][no target][no option][no type]
type: Concept
definition: 1.A.4.c [Agriculture/Forestry/Fishing][Other Fossil Fuels][Emissions][CO2][kt][no source][no method][no target][no option][no type]
status: valid
status modified: 2017-02-13
accepted date: 2017-02-13
in scheme: IPCC_variables_MMR

1.A.4.c [Agriculture/Forestry/Fishing][Other Fossil Fuels][Emissions][N2O][kt][no source][no method][no target][no option][no type]
type: Concept
definition: 1.A.4.c [Agriculture/Forestry/Fishing][Other Fossil Fuels][Emissions][N2O][kt][no source][no method][no target][no option][no type]
status: valid
status modified: 2017-02-13
accepted date: 2017-02-13
in scheme: IPCC_variables_MMR

1.A.4.c [Agriculture/Forestry/Fishing][Peat][Emissions][CH4][kt][no source][no method][no target][no option][no type]
type: Concept
definition: 1.A.4.c [Agriculture/Forestry/Fishing][Peat][Emissions][CH4][kt][no source][no method][no target][no option][no type]
status: valid
status modified: 2017-02-13
accepted date: 2017-02-13
in scheme: IPCC_variables_MMR

1.A.4.c [Agriculture/Forestry/Fishing][Peat][Emissions][CO2][kt][no source][no method][no target][no option][no type]
type: Concept
definition: 1.A.4.c [Agriculture/Forestry/Fishing][Peat][Emissions][CO2][kt][no source][no method][no target][no option][no type]
status: valid
status modified: 2017-02-13
accepted date: 2017-02-13
in scheme: IPCC_variables_MMR

1.A.4.c [Agriculture/Forestry/Fishing][Peat][Emissions][N2O][kt][no source][no method][no target][no option][no type]
type: Concept
definition: 1.A.4.c [Agriculture/Forestry/Fishing][Peat][Emissions][N2O][kt][no source][no method][no target][no option][no type]
status: valid
status modified: 2017-02-13
accepted date: 2017-02-13
in scheme: IPCC_variables_MMR

1.A.4.c [Agriculture/Forestry/Fishing][Solid Fuels][Emissions][CH4][kt][no source][no method][no target][no option][no type]
type: Concept
definition: 1.A.4.c [Agriculture/Forestry/Fishing][Solid Fuels][Emissions][CH4][kt][no source][no method][no target][no option][no type]
status: valid
status modified: 2017-02-13
accepted date: 2017-02-13
in scheme: IPCC_variables_MMR

1.A.4.c [Agriculture/Forestry/Fishing][Solid Fuels][Emissions][CO2][kt][no source][no method][no target][no option][no type]
type: Concept
definition: 1.A.4.c [Agriculture/Forestry/Fishing][Solid Fuels][Emissions][CO2][kt][no source][no method][no target][no option][no type]
status: valid
status modified: 2017-02-13
accepted date: 2017-02-13
in scheme: IPCC_variables_MMR

1.A.4.c [Agriculture/Forestry/Fishing][Solid Fuels][Emissions][N2O][kt][no source][no method][no target][no option][no type]
type: Concept
definition: 1.A.4.c [Agriculture/Forestry/Fishing][Solid Fuels][Emissions][N2O][kt][no source][no method][no target][no option][no type]
status: valid
status modified: 2017-02-13
accepted date: 2017-02-13
in scheme: IPCC_variables_MMR

1.A.4.c.i Biomass [Agriculture/Forestry/Fishing][Biomass][Emissions][CH4][kt][Stationary combustion][no method][no target][no option][no type]
type: Concept
definition: 1.A.4.c.i Biomass [Agriculture/Forestry/Fishing][Biomass][Emissions][CH4][kt][Stationary combustion][no method][no target][no option][no type]
status: valid
status modified: 2017-02-13
accepted date: 2017-02-13
in scheme: IPCC_variables_MMR

1.A.4.c.i Biomass [Agriculture/Forestry/Fishing][Biomass][Emissions][CO2][kt][Stationary combustion][no method][no target][no option][no type]
type: Concept
definition: 1.A.4.c.i Biomass [Agriculture/Forestry/Fishing][Biomass][Emissions][CO2][kt][Stationary combustion][no method][no target][no option][no type]
status: valid
status modified: 2017-02-13
accepted date: 2017-02-13
in scheme: IPCC_variables_MMR

1.A.4.c.i Biomass [Agriculture/Forestry/Fishing][Biomass][Emissions][N2O][kt][Stationary combustion][no method][no target][no option][no type]
type: Concept
definition: 1.A.4.c.i Biomass [Agriculture/Forestry/Fishing][Biomass][Emissions][N2O][kt][Stationary combustion][no method][no target][no option][no type]
status: valid
status modified: 2017-02-13
accepted date: 2017-02-13
in scheme: IPCC_variables_MMR

1.A.4.c.i Gaseous Fuels [Agriculture/Forestry/Fishing][Gaseous Fuels][Emissions][CH4][kt][Stationary combustion][no method][no target][no option][no type]
type: Concept
definition: 1.A.4.c.i Gaseous Fuels [Agriculture/Forestry/Fishing][Gaseous Fuels][Emissions][CH4][kt][Stationary combustion][no method][no target][no option][no type]
status: valid
status modified: 2017-02-13
accepted date: 2017-02-13
in scheme: IPCC_variables_MMR

1.A.4.c.i Gaseous Fuels [Agriculture/Forestry/Fishing][Gaseous Fuels][Emissions][CO2][kt][Stationary combustion][no method][no target][no option][no type]
type: Concept
definition: 1.A.4.c.i Gaseous Fuels [Agriculture/Forestry/Fishing][Gaseous Fuels][Emissions][CO2][kt][Stationary combustion][no method][no target][no option][no type]
status: valid
status modified: 2017-02-13
accepted date: 2017-02-13
in scheme: IPCC_variables_MMR

1.A.4.c.i Gaseous Fuels [Agriculture/Forestry/Fishing][Gaseous Fuels][Emissions][N2O][kt][Stationary combustion][no method][no target][no option][no type]
type: Concept
definition: 1.A.4.c.i Gaseous Fuels [Agriculture/Forestry/Fishing][Gaseous Fuels][Emissions][N2O][kt][Stationary combustion][no method][no target][no option][no type]
status: valid
status modified: 2017-02-13
accepted date: 2017-02-13
in scheme: IPCC_variables_MMR

1.A.4.c.i Liquid Fuels [Agriculture/Forestry/Fishing][Liquid Fuels][Emissions][CH4][kt][Stationary combustion][no method][no target][no option][no type]
type: Concept
definition: 1.A.4.c.i Liquid Fuels [Agriculture/Forestry/Fishing][Liquid Fuels][Emissions][CH4][kt][Stationary combustion][no method][no target][no option][no type]
status: valid
status modified: 2017-02-13
accepted date: 2017-02-13
in scheme: IPCC_variables_MMR

1.A.4.c.i Liquid Fuels [Agriculture/Forestry/Fishing][Liquid Fuels][Emissions][CO2][kt][Stationary combustion][no method][no target][no option][no type]
type: Concept
definition: 1.A.4.c.i Liquid Fuels [Agriculture/Forestry/Fishing][Liquid Fuels][Emissions][CO2][kt][Stationary combustion][no method][no target][no option][no type]
status: valid
status modified: 2017-02-13
accepted date: 2017-02-13
in scheme: IPCC_variables_MMR

1.A.4.c.i Liquid Fuels [Agriculture/Forestry/Fishing][Liquid Fuels][Emissions][N2O][kt][Stationary combustion][no method][no target][no option][no type]
type: Concept
definition: 1.A.4.c.i Liquid Fuels [Agriculture/Forestry/Fishing][Liquid Fuels][Emissions][N2O][kt][Stationary combustion][no method][no target][no option][no type]
status: valid
status modified: 2017-02-13
accepted date: 2017-02-13
in scheme: IPCC_variables_MMR

1.A.4.c.i Other Fossil Fuels [Agriculture/Forestry/Fishing][Other Fossil Fuels][Emissions][CH4][kt][Stationary combustion][no method][no target][no option][no type]
type: Concept
definition: 1.A.4.c.i Other Fossil Fuels [Agriculture/Forestry/Fishing][Other Fossil Fuels][Emissions][CH4][kt][Stationary combustion][no method][no target][no option][no type]
status: valid
status modified: 2017-02-13
accepted date: 2017-02-13
in scheme: IPCC_variables_MMR

1.A.4.c.i Other Fossil Fuels [Agriculture/Forestry/Fishing][Other Fossil Fuels][Emissions][CO2][kt][Stationary combustion][no method][no target][no option][no type]
type: Concept
definition: 1.A.4.c.i Other Fossil Fuels [Agriculture/Forestry/Fishing][Other Fossil Fuels][Emissions][CO2][kt][Stationary combustion][no method][no target][no option][no type]
status: valid
status modified: 2017-02-13
accepted date: 2017-02-13
in scheme: IPCC_variables_MMR

1.A.4.c.i Other Fossil Fuels [Agriculture/Forestry/Fishing][Other Fossil Fuels][Emissions][N2O][kt][Stationary combustion][no method][no target][no option][no type]
type: Concept
definition: 1.A.4.c.i Other Fossil Fuels [Agriculture/Forestry/Fishing][Other Fossil Fuels][Emissions][N2O][kt][Stationary combustion][no method][no target][no option][no type]
status: valid
status modified: 2017-02-13
accepted date: 2017-02-13
in scheme: IPCC_variables_MMR

1.A.4.c.i Peat [Agriculture/Forestry/Fishing][Peat][Emissions][CH4][kt][Stationary combustion][no method][no target][no option][no type]
type: Concept
definition: 1.A.4.c.i Peat [Agriculture/Forestry/Fishing][Peat][Emissions][CH4][kt][Stationary combustion][no method][no target][no option][no type]
status: valid
status modified: 2017-02-13
accepted date: 2017-02-13
in scheme: IPCC_variables_MMR

1.A.4.c.i Peat [Agriculture/Forestry/Fishing][Peat][Emissions][CO2][kt][Stationary combustion][no method][no target][no option][no type]
type: Concept
definition: 1.A.4.c.i Peat [Agriculture/Forestry/Fishing][Peat][Emissions][CO2][kt][Stationary combustion][no method][no target][no option][no type]
status: valid
status modified: 2017-02-13
accepted date: 2017-02-13
in scheme: IPCC_variables_MMR

1.A.4.c.i Peat [Agriculture/Forestry/Fishing][Peat][Emissions][N2O][kt][Stationary combustion][no method][no target][no option][no type]
type: Concept
definition: 1.A.4.c.i Peat [Agriculture/Forestry/Fishing][Peat][Emissions][N2O][kt][Stationary combustion][no method][no target][no option][no type]
status: valid
status modified: 2017-02-13
accepted date: 2017-02-13
in scheme: IPCC_variables_MMR

1.A.4.c.i Solid Fuels [Agriculture/Forestry/Fishing][Solid Fuels][Emissions][CH4][kt][Stationary combustion][no method][no target][no option][no type]
type: Concept
definition: 1.A.4.c.i Solid Fuels [Agriculture/Forestry/Fishing][Solid Fuels][Emissions][CH4][kt][Stationary combustion][no method][no target][no option][no type]
status: valid
status modified: 2017-02-13
accepted date: 2017-02-13
in scheme: IPCC_variables_MMR

1.A.4.c.i Solid Fuels [Agriculture/Forestry/Fishing][Solid Fuels][Emissions][CO2][kt][Stationary combustion][no method][no target][no option][no type]
type: Concept
definition: 1.A.4.c.i Solid Fuels [Agriculture/Forestry/Fishing][Solid Fuels][Emissions][CO2][kt][Stationary combustion][no method][no target][no option][no type]
status: valid
status modified: 2017-02-13
accepted date: 2017-02-13
in scheme: IPCC_variables_MMR

1.A.4.c.i Solid Fuels [Agriculture/Forestry/Fishing][Solid Fuels][Emissions][N2O][kt][Stationary combustion][no method][no target][no option][no type]
type: Concept
definition: 1.A.4.c.i Solid Fuels [Agriculture/Forestry/Fishing][Solid Fuels][Emissions][N2O][kt][Stationary combustion][no method][no target][no option][no type]
status: valid
status modified: 2017-02-13
accepted date: 2017-02-13
in scheme: IPCC_variables_MMR

1.A.4.c.ii [Agriculture/Forestry/Fishing][Liquid Fuels][Emissions][CH4][kt][Off-road vehicles and other machinery][no method][no target][no option][no type]
type: Concept
definition: 1.A.4.c.ii [Agriculture/Forestry/Fishing][Liquid Fuels][Emissions][CH4][kt][Off-road vehicles and other machinery][no method][no target][no option][no type]
status: valid
status modified: 2017-02-13
accepted date: 2017-02-13
in scheme: IPCC_variables_MMR

1.A.4.c.ii [Agriculture/Forestry/Fishing][Liquid Fuels][Emissions][CO2][kt][Off-road vehicles and other machinery][no method][no target][no option][no type]
type: Concept
definition: 1.A.4.c.ii [Agriculture/Forestry/Fishing][Liquid Fuels][Emissions][CO2][kt][Off-road vehicles and other machinery][no method][no target][no option][no type]
status: valid
status modified: 2017-02-13
accepted date: 2017-02-13
in scheme: IPCC_variables_MMR

1.A.4.c.ii [Agriculture/Forestry/Fishing][Liquid Fuels][Emissions][N2O][kt][Off-road vehicles and other machinery][no method][no target][no option][no type]
type: Concept
definition: 1.A.4.c.ii [Agriculture/Forestry/Fishing][Liquid Fuels][Emissions][N2O][kt][Off-road vehicles and other machinery][no method][no target][no option][no type]
status: valid
status modified: 2017-02-13
accepted date: 2017-02-13
in scheme: IPCC_variables_MMR

1.A.4.c.ii Biomass [Agriculture/Forestry/Fishing][Biomass][Emissions][CH4][kt][Off-road vehicles and other machinery][no method][no target][no option][no type]
type: Concept
definition: 1.A.4.c.ii Biomass [Agriculture/Forestry/Fishing][Biomass][Emissions][CH4][kt][Off-road vehicles and other machinery][no method][no target][no option][no type]
status: valid
status modified: 2017-02-13
accepted date: 2017-02-13
in scheme: IPCC_variables_MMR

1.A.4.c.ii Biomass [Agriculture/Forestry/Fishing][Biomass][Emissions][CO2][kt][Off-road vehicles and other machinery][no method][no target][no option][no type]
type: Concept
definition: 1.A.4.c.ii Biomass [Agriculture/Forestry/Fishing][Biomass][Emissions][CO2][kt][Off-road vehicles and other machinery][no method][no target][no option][no type]
status: valid
status modified: 2017-02-13
accepted date: 2017-02-13
in scheme: IPCC_variables_MMR

1.A.4.c.ii Biomass [Agriculture/Forestry/Fishing][Biomass][Emissions][N2O][kt][Off-road vehicles and other machinery][no method][no target][no option][no type]
type: Concept
definition: 1.A.4.c.ii Biomass [Agriculture/Forestry/Fishing][Biomass][Emissions][N2O][kt][Off-road vehicles and other machinery][no method][no target][no option][no type]
status: valid
status modified: 2017-02-13
accepted date: 2017-02-13
in scheme: IPCC_variables_MMR

1.A.4.c.ii Diesel Oil [Agriculture/Forestry/Fishing][Diesel Oil][Emissions][CH4][kt][Off-road vehicles and other machinery][no method][no target][no option][no type]
type: Concept
definition: 1.A.4.c.ii Diesel Oil [Agriculture/Forestry/Fishing][Diesel Oil][Emissions][CH4][kt][Off-road vehicles and other machinery][no method][no target][no option][no type]
status: valid
status modified: 2017-02-13
accepted date: 2017-02-13
in scheme: IPCC_variables_MMR

1.A.4.c.ii Diesel Oil [Agriculture/Forestry/Fishing][Diesel Oil][Emissions][CO2][kt][Off-road vehicles and other machinery][no method][no target][no option][no type]
type: Concept
definition: 1.A.4.c.ii Diesel Oil [Agriculture/Forestry/Fishing][Diesel Oil][Emissions][CO2][kt][Off-road vehicles and other machinery][no method][no target][no option][no type]
status: valid
status modified: 2017-02-13
accepted date: 2017-02-13
in scheme: IPCC_variables_MMR

1.A.4.c.ii Diesel Oil [Agriculture/Forestry/Fishing][Diesel Oil][Emissions][N2O][kt][Off-road vehicles and other machinery][no method][no target][no option][no type]
type: Concept
definition: 1.A.4.c.ii Diesel Oil [Agriculture/Forestry/Fishing][Diesel Oil][Emissions][N2O][kt][Off-road vehicles and other machinery][no method][no target][no option][no type]
status: valid
status modified: 2017-02-13
accepted date: 2017-02-13
in scheme: IPCC_variables_MMR

1.A.4.c.ii Gaseous Fuels [Agriculture/Forestry/Fishing][Gaseous Fuels][Emissions][CH4][kt][Off-road vehicles and other machinery][no method][no target][no option][no type]
type: Concept
definition: 1.A.4.c.ii Gaseous Fuels [Agriculture/Forestry/Fishing][Gaseous Fuels][Emissions][CH4][kt][Off-road vehicles and other machinery][no method][no target][no option][no type]
status: valid
status modified: 2017-02-13
accepted date: 2017-02-13
in scheme: IPCC_variables_MMR

1.A.4.c.ii Gaseous Fuels [Agriculture/Forestry/Fishing][Gaseous Fuels][Emissions][CO2][kt][Off-road vehicles and other machinery][no method][no target][no option][no type]
type: Concept
definition: 1.A.4.c.ii Gaseous Fuels [Agriculture/Forestry/Fishing][Gaseous Fuels][Emissions][CO2][kt][Off-road vehicles and other machinery][no method][no target][no option][no type]
status: valid
status modified: 2017-02-13
accepted date: 2017-02-13
in scheme: IPCC_variables_MMR

1.A.4.c.ii Gaseous Fuels [Agriculture/Forestry/Fishing][Gaseous Fuels][Emissions][N2O][kt][Off-road vehicles and other machinery][no method][no target][no option][no type]
type: Concept
definition: 1.A.4.c.ii Gaseous Fuels [Agriculture/Forestry/Fishing][Gaseous Fuels][Emissions][N2O][kt][Off-road vehicles and other machinery][no method][no target][no option][no type]
status: valid
status modified: 2017-02-13
accepted date: 2017-02-13
in scheme: IPCC_variables_MMR

1.A.4.c.ii Gasoline [Agriculture/Forestry/Fishing][Gasoline][Emissions][CH4][kt][Off-road vehicles and other machinery][no method][no target][no option][no type]
type: Concept
definition: 1.A.4.c.ii Gasoline [Agriculture/Forestry/Fishing][Gasoline][Emissions][CH4][kt][Off-road vehicles and other machinery][no method][no target][no option][no type]
status: valid
status modified: 2017-02-13
accepted date: 2017-02-13
in scheme: IPCC_variables_MMR

1.A.4.c.ii Gasoline [Agriculture/Forestry/Fishing][Gasoline][Emissions][CO2][kt][Off-road vehicles and other machinery][no method][no target][no option][no type]
type: Concept
definition: 1.A.4.c.ii Gasoline [Agriculture/Forestry/Fishing][Gasoline][Emissions][CO2][kt][Off-road vehicles and other machinery][no method][no target][no option][no type]
status: valid
status modified: 2017-02-13
accepted date: 2017-02-13
in scheme: IPCC_variables_MMR

1.A.4.c.ii Gasoline [Agriculture/Forestry/Fishing][Gasoline][Emissions][N2O][kt][Off-road vehicles and other machinery][no method][no target][no option][no type]
type: Concept
definition: 1.A.4.c.ii Gasoline [Agriculture/Forestry/Fishing][Gasoline][Emissions][N2O][kt][Off-road vehicles and other machinery][no method][no target][no option][no type]
status: valid
status modified: 2017-02-13
accepted date: 2017-02-13
in scheme: IPCC_variables_MMR

1.A.4.c.ii LPG [Agriculture/Forestry/Fishing][Liquefied Petroleum Gases (LPG)][Emissions][CH4][kt][Off-road vehicles and other machinery][no method][no target][no option][no type]
type: Concept
definition: 1.A.4.c.ii LPG [Agriculture/Forestry/Fishing][Liquefied Petroleum Gases (LPG)][Emissions][CH4][kt][Off-road vehicles and other machinery][no method][no target][no option][no type]
status: valid
status modified: 2017-02-13
accepted date: 2017-02-13
in scheme: IPCC_variables_MMR

1.A.4.c.ii LPG [Agriculture/Forestry/Fishing][Liquefied Petroleum Gases (LPG)][Emissions][CO2][kt][Off-road vehicles and other machinery][no method][no target][no option][no type]
type: Concept
definition: 1.A.4.c.ii LPG [Agriculture/Forestry/Fishing][Liquefied Petroleum Gases (LPG)][Emissions][CO2][kt][Off-road vehicles and other machinery][no method][no target][no option][no type]
status: valid
status modified: 2017-02-13
accepted date: 2017-02-13
in scheme: IPCC_variables_MMR

1.A.4.c.ii LPG [Agriculture/Forestry/Fishing][Liquefied Petroleum Gases (LPG)][Emissions][N2O][kt][Off-road vehicles and other machinery][no method][no target][no option][no type]
type: Concept
definition: 1.A.4.c.ii LPG [Agriculture/Forestry/Fishing][Liquefied Petroleum Gases (LPG)][Emissions][N2O][kt][Off-road vehicles and other machinery][no method][no target][no option][no type]
status: valid
status modified: 2017-02-13
accepted date: 2017-02-13
in scheme: IPCC_variables_MMR

1.A.4.c.ii Other Fossil Fuels [Agriculture/Forestry/Fishing][Other Fossil Fuels][Emissions][CH4][kt][Off-road vehicles and other machinery][no method][no target][no option][no type]
type: Concept
definition: 1.A.4.c.ii Other Fossil Fuels [Agriculture/Forestry/Fishing][Other Fossil Fuels][Emissions][CH4][kt][Off-road vehicles and other machinery][no method][no target][no option][no type]
status: valid
status modified: 2017-02-13
accepted date: 2017-02-13
in scheme: IPCC_variables_MMR

1.A.4.c.ii Other Fossil Fuels [Agriculture/Forestry/Fishing][Other Fossil Fuels][Emissions][CO2][kt][Off-road vehicles and other machinery][no method][no target][no option][no type]
type: Concept
definition: 1.A.4.c.ii Other Fossil Fuels [Agriculture/Forestry/Fishing][Other Fossil Fuels][Emissions][CO2][kt][Off-road vehicles and other machinery][no method][no target][no option][no type]
status: valid
status modified: 2017-02-13
accepted date: 2017-02-13
in scheme: IPCC_variables_MMR

1.A.4.c.ii Other Fossil Fuels [Agriculture/Forestry/Fishing][Other Fossil Fuels][Emissions][N2O][kt][Off-road vehicles and other machinery][no method][no target][no option][no type]
type: Concept
definition: 1.A.4.c.ii Other Fossil Fuels [Agriculture/Forestry/Fishing][Other Fossil Fuels][Emissions][N2O][kt][Off-road vehicles and other machinery][no method][no target][no option][no type]
status: valid
status modified: 2017-02-13
accepted date: 2017-02-13
in scheme: IPCC_variables_MMR

1.A.4.c.ii Other Liquid Fuels [Agriculture/Forestry/Fishing][Other Liquid Fuels][Emissions][CH4][kt][Off-road vehicles and other machinery][no method][no target][no option][no type]
type: Concept
definition: 1.A.4.c.ii Other Liquid Fuels [Agriculture/Forestry/Fishing][Other Liquid Fuels][Emissions][CH4][kt][Off-road vehicles and other machinery][no method][no target][no option][no type]
status: valid
status modified: 2017-02-13
accepted date: 2017-02-13
in scheme: IPCC_variables_MMR

1.A.4.c.ii Other Liquid Fuels [Agriculture/Forestry/Fishing][Other Liquid Fuels][Emissions][CO2][kt][Off-road vehicles and other machinery][no method][no target][no option][no type]
type: Concept
definition: 1.A.4.c.ii Other Liquid Fuels [Agriculture/Forestry/Fishing][Other Liquid Fuels][Emissions][CO2][kt][Off-road vehicles and other machinery][no method][no target][no option][no type]
status: valid
status modified: 2017-02-13
accepted date: 2017-02-13
in scheme: IPCC_variables_MMR

1.A.4.c.ii Other Liquid Fuels [Agriculture/Forestry/Fishing][Other Liquid Fuels][Emissions][N2O][kt][Off-road vehicles and other machinery][no method][no target][no option][no type]
type: Concept
definition: 1.A.4.c.ii Other Liquid Fuels [Agriculture/Forestry/Fishing][Other Liquid Fuels][Emissions][N2O][kt][Off-road vehicles and other machinery][no method][no target][no option][no type]
status: valid
status modified: 2017-02-13
accepted date: 2017-02-13
in scheme: IPCC_variables_MMR

1.A.4.c.iii [Agriculture/Forestry/Fishing][Liquid Fuels][Emissions][CH4][kt][Fishing][no method][no target][no option][no type]
type: Concept
definition: 1.A.4.c.iii [Agriculture/Forestry/Fishing][Liquid Fuels][Emissions][CH4][kt][Fishing][no method][no target][no option][no type]
status: valid
status modified: 2017-02-13
accepted date: 2017-02-13
in scheme: IPCC_variables_MMR

1.A.4.c.iii [Agriculture/Forestry/Fishing][Liquid Fuels][Emissions][CO2][kt][Fishing][no method][no target][no option][no type]
type: Concept
definition: 1.A.4.c.iii [Agriculture/Forestry/Fishing][Liquid Fuels][Emissions][CO2][kt][Fishing][no method][no target][no option][no type]
status: valid
status modified: 2017-02-13
accepted date: 2017-02-13
in scheme: IPCC_variables_MMR

1.A.4.c.iii [Agriculture/Forestry/Fishing][Liquid Fuels][Emissions][N2O][kt][Fishing][no method][no target][no option][no type]
type: Concept
definition: 1.A.4.c.iii [Agriculture/Forestry/Fishing][Liquid Fuels][Emissions][N2O][kt][Fishing][no method][no target][no option][no type]
status: valid
status modified: 2017-02-13
accepted date: 2017-02-13
in scheme: IPCC_variables_MMR

1.A.4.c.iii Biomass [Agriculture/Forestry/Fishing][Biomass][Emissions][CH4][kt][Fishing][no method][no target][no option][no type]
type: Concept
definition: 1.A.4.c.iii Biomass [Agriculture/Forestry/Fishing][Biomass][Emissions][CH4][kt][Fishing][no method][no target][no option][no type]
status: valid
status modified: 2017-02-13
accepted date: 2017-02-13
in scheme: IPCC_variables_MMR

1.A.4.c.iii Biomass [Agriculture/Forestry/Fishing][Biomass][Emissions][CO2][kt][Fishing][no method][no target][no option][no type]
type: Concept
definition: 1.A.4.c.iii Biomass [Agriculture/Forestry/Fishing][Biomass][Emissions][CO2][kt][Fishing][no method][no target][no option][no type]
status: valid
status modified: 2017-02-13
accepted date: 2017-02-13
in scheme: IPCC_variables_MMR

1.A.4.c.iii Biomass [Agriculture/Forestry/Fishing][Biomass][Emissions][N2O][kt][Fishing][no method][no target][no option][no type]
type: Concept
definition: 1.A.4.c.iii Biomass [Agriculture/Forestry/Fishing][Biomass][Emissions][N2O][kt][Fishing][no method][no target][no option][no type]
status: valid
status modified: 2017-02-13
accepted date: 2017-02-13
in scheme: IPCC_variables_MMR

1.A.4.c.iii Gas/Diesel Oil [Agriculture/Forestry/Fishing][Gas/Diesel Oil][Emissions][CH4][kt][Fishing][no method][no target][no option][no type]
type: Concept
definition: 1.A.4.c.iii Gas/Diesel Oil [Agriculture/Forestry/Fishing][Gas/Diesel Oil][Emissions][CH4][kt][Fishing][no method][no target][no option][no type]
status: valid
status modified: 2017-02-13
accepted date: 2017-02-13
in scheme: IPCC_variables_MMR

1.A.4.c.iii Gas/Diesel Oil [Agriculture/Forestry/Fishing][Gas/Diesel Oil][Emissions][CO2][kt][Fishing][no method][no target][no option][no type]
type: Concept
definition: 1.A.4.c.iii Gas/Diesel Oil [Agriculture/Forestry/Fishing][Gas/Diesel Oil][Emissions][CO2][kt][Fishing][no method][no target][no option][no type]
status: valid
status modified: 2017-02-13
accepted date: 2017-02-13
in scheme: IPCC_variables_MMR

1.A.4.c.iii Gas/Diesel Oil [Agriculture/Forestry/Fishing][Gas/Diesel Oil][Emissions][N2O][kt][Fishing][no method][no target][no option][no type]
type: Concept
definition: 1.A.4.c.iii Gas/Diesel Oil [Agriculture/Forestry/Fishing][Gas/Diesel Oil][Emissions][N2O][kt][Fishing][no method][no target][no option][no type]
status: valid
status modified: 2017-02-13
accepted date: 2017-02-13
in scheme: IPCC_variables_MMR

1.A.4.c.iii Gaseous Fuels [Agriculture/Forestry/Fishing][Gaseous Fuels][Emissions][CH4][kt][Fishing][no method][no target][no option][no type]
type: Concept
definition: 1.A.4.c.iii Gaseous Fuels [Agriculture/Forestry/Fishing][Gaseous Fuels][Emissions][CH4][kt][Fishing][no method][no target][no option][no type]
status: valid
status modified: 2017-02-13
accepted date: 2017-02-13
in scheme: IPCC_variables_MMR

1.A.4.c.iii Gaseous Fuels [Agriculture/Forestry/Fishing][Gaseous Fuels][Emissions][CO2][kt][Fishing][no method][no target][no option][no type]
type: Concept
definition: 1.A.4.c.iii Gaseous Fuels [Agriculture/Forestry/Fishing][Gaseous Fuels][Emissions][CO2][kt][Fishing][no method][no target][no option][no type]
status: valid
status modified: 2017-02-13
accepted date: 2017-02-13
in scheme: IPCC_variables_MMR

1.A.4.c.iii Gaseous Fuels [Agriculture/Forestry/Fishing][Gaseous Fuels][Emissions][N2O][kt][Fishing][no method][no target][no option][no type]
type: Concept
definition: 1.A.4.c.iii Gaseous Fuels [Agriculture/Forestry/Fishing][Gaseous Fuels][Emissions][N2O][kt][Fishing][no method][no target][no option][no type]
status: valid
status modified: 2017-02-13
accepted date: 2017-02-13
in scheme: IPCC_variables_MMR

1.A.4.c.iii Gasoline [Agriculture/Forestry/Fishing][Gasoline][Emissions][CH4][kt][Fishing][no method][no target][no option][no type]
type: Concept
definition: 1.A.4.c.iii Gasoline [Agriculture/Forestry/Fishing][Gasoline][Emissions][CH4][kt][Fishing][no method][no target][no option][no type]
status: valid
status modified: 2017-02-13
accepted date: 2017-02-13
in scheme: IPCC_variables_MMR

1.A.4.c.iii Gasoline [Agriculture/Forestry/Fishing][Gasoline][Emissions][CO2][kt][Fishing][no method][no target][no option][no type]
type: Concept
definition: 1.A.4.c.iii Gasoline [Agriculture/Forestry/Fishing][Gasoline][Emissions][CO2][kt][Fishing][no method][no target][no option][no type]
status: valid
status modified: 2017-02-13
accepted date: 2017-02-13
in scheme: IPCC_variables_MMR

1.A.4.c.iii Gasoline [Agriculture/Forestry/Fishing][Gasoline][Emissions][N2O][kt][Fishing][no method][no target][no option][no type]
type: Concept
definition: 1.A.4.c.iii Gasoline [Agriculture/Forestry/Fishing][Gasoline][Emissions][N2O][kt][Fishing][no method][no target][no option][no type]
status: valid
status modified: 2017-02-13
accepted date: 2017-02-13
in scheme: IPCC_variables_MMR

1.A.4.c.iii Residual Fuel Oil [Agriculture/Forestry/Fishing][Residual Fuel Oil][Emissions][CH4][kt][Fishing][no method][no target][no option][no type]
type: Concept
definition: 1.A.4.c.iii Residual Fuel Oil [Agriculture/Forestry/Fishing][Residual Fuel Oil][Emissions][CH4][kt][Fishing][no method][no target][no option][no type]
status: valid
status modified: 2017-02-13
accepted date: 2017-02-13
in scheme: IPCC_variables_MMR

1.A.4.c.iii Residual Fuel Oil [Agriculture/Forestry/Fishing][Residual Fuel Oil][Emissions][CO2][kt][Fishing][no method][no target][no option][no type]
type: Concept
definition: 1.A.4.c.iii Residual Fuel Oil [Agriculture/Forestry/Fishing][Residual Fuel Oil][Emissions][CO2][kt][Fishing][no method][no target][no option][no type]
status: valid
status modified: 2017-02-13
accepted date: 2017-02-13
in scheme: IPCC_variables_MMR

1.A.4.c.iii Residual Fuel Oil [Agriculture/Forestry/Fishing][Residual Fuel Oil][Emissions][N2O][kt][Fishing][no method][no target][no option][no type]
type: Concept
definition: 1.A.4.c.iii Residual Fuel Oil [Agriculture/Forestry/Fishing][Residual Fuel Oil][Emissions][N2O][kt][Fishing][no method][no target][no option][no type]
status: valid
status modified: 2017-02-13
accepted date: 2017-02-13
in scheme: IPCC_variables_MMR

1.A.5.a [Other Other Sectors][Biomass][Emissions][CH4][kt][Stationary combustion][no method][no target][no option][no type]
type: Concept
definition: 1.A.5.a [Other Other Sectors][Biomass][Emissions][CH4][kt][Stationary combustion][no method][no target][no option][no type]
status: valid
status modified: 2017-02-13
accepted date: 2017-02-13
in scheme: IPCC_variables_MMR

1.A.5.a [Other Other Sectors][Biomass][Emissions][CO2][kt][Stationary combustion][no method][no target][no option][no type]
type: Concept
definition: 1.A.5.a [Other Other Sectors][Biomass][Emissions][CO2][kt][Stationary combustion][no method][no target][no option][no type]
status: valid
status modified: 2017-02-13
accepted date: 2017-02-13
in scheme: IPCC_variables_MMR

1.A.5.a [Other Other Sectors][Biomass][Emissions][N2O][kt][Stationary combustion][no method][no target][no option][no type]
type: Concept
definition: 1.A.5.a [Other Other Sectors][Biomass][Emissions][N2O][kt][Stationary combustion][no method][no target][no option][no type]
status: valid
status modified: 2017-02-13
accepted date: 2017-02-13
in scheme: IPCC_variables_MMR

1.A.5.a [Other Other Sectors][Fossil fuels][Emissions][CO2][kt][Stationary combustion][no method][no target][no option][no type]
type: Concept
definition: 1.A.5.a [Other Other Sectors][Fossil fuels][Emissions][CO2][kt][Stationary combustion][no method][no target][no option][no type]
status: valid
status modified: 2017-02-13
accepted date: 2017-02-13
in scheme: IPCC_variables_MMR

1.A.5.a [Other Other Sectors][Fuels][Emissions][CH4][kt][Stationary combustion][no method][no target][no option][no type]
type: Concept
definition: 1.A.5.a [Other Other Sectors][Fuels][Emissions][CH4][kt][Stationary combustion][no method][no target][no option][no type]
status: valid
status modified: 2017-02-13
accepted date: 2017-02-13
in scheme: IPCC_variables_MMR

1.A.5.a [Other Other Sectors][Fuels][Emissions][N2O][kt][Stationary combustion][no method][no target][no option][no type]
type: Concept
definition: 1.A.5.a [Other Other Sectors][Fuels][Emissions][N2O][kt][Stationary combustion][no method][no target][no option][no type]
status: valid
status modified: 2017-02-13
accepted date: 2017-02-13
in scheme: IPCC_variables_MMR

1.A.5.a [Other Other Sectors][Gaseous Fuels][Emissions][CH4][kt][Stationary combustion][no method][no target][no option][no type]
type: Concept
definition: 1.A.5.a [Other Other Sectors][Gaseous Fuels][Emissions][CH4][kt][Stationary combustion][no method][no target][no option][no type]
status: valid
status modified: 2017-02-13
accepted date: 2017-02-13
in scheme: IPCC_variables_MMR

1.A.5.a [Other Other Sectors][Gaseous Fuels][Emissions][CO2][kt][Stationary combustion][no method][no target][no option][no type]
type: Concept
definition: 1.A.5.a [Other Other Sectors][Gaseous Fuels][Emissions][CO2][kt][Stationary combustion][no method][no target][no option][no type]
status: valid
status modified: 2017-02-13
accepted date: 2017-02-13
in scheme: IPCC_variables_MMR

1.A.5.a [Other Other Sectors][Gaseous Fuels][Emissions][N2O][kt][Stationary combustion][no method][no target][no option][no type]
type: Concept
definition: 1.A.5.a [Other Other Sectors][Gaseous Fuels][Emissions][N2O][kt][Stationary combustion][no method][no target][no option][no type]
status: valid
status modified: 2017-02-13
accepted date: 2017-02-13
in scheme: IPCC_variables_MMR

1.A.5.a [Other Other Sectors][Liquid Fuels][Emissions][CH4][kt][Stationary combustion][no method][no target][no option][no type]
type: Concept
definition: 1.A.5.a [Other Other Sectors][Liquid Fuels][Emissions][CH4][kt][Stationary combustion][no method][no target][no option][no type]
status: valid
status modified: 2017-02-13
accepted date: 2017-02-13
in scheme: IPCC_variables_MMR

1.A.5.a [Other Other Sectors][Liquid Fuels][Emissions][CO2][kt][Stationary combustion][no method][no target][no option][no type]
type: Concept
definition: 1.A.5.a [Other Other Sectors][Liquid Fuels][Emissions][CO2][kt][Stationary combustion][no method][no target][no option][no type]
status: valid
status modified: 2017-02-13
accepted date: 2017-02-13
in scheme: IPCC_variables_MMR

1.A.5.a [Other Other Sectors][Liquid Fuels][Emissions][N2O][kt][Stationary combustion][no method][no target][no option][no type]
type: Concept
definition: 1.A.5.a [Other Other Sectors][Liquid Fuels][Emissions][N2O][kt][Stationary combustion][no method][no target][no option][no type]
status: valid
status modified: 2017-02-13
accepted date: 2017-02-13
in scheme: IPCC_variables_MMR

1.A.5.a [Other Other Sectors][Other Fossil Fuels][Emissions][CH4][kt][Stationary combustion][no method][no target][no option][no type]
type: Concept
definition: 1.A.5.a [Other Other Sectors][Other Fossil Fuels][Emissions][CH4][kt][Stationary combustion][no method][no target][no option][no type]
status: valid
status modified: 2017-02-13
accepted date: 2017-02-13
in scheme: IPCC_variables_MMR

1.A.5.a [Other Other Sectors][Other Fossil Fuels][Emissions][CO2][kt][Stationary combustion][no method][no target][no option][no type]
type: Concept
definition: 1.A.5.a [Other Other Sectors][Other Fossil Fuels][Emissions][CO2][kt][Stationary combustion][no method][no target][no option][no type]
status: valid
status modified: 2017-02-13
accepted date: 2017-02-13
in scheme: IPCC_variables_MMR

1.A.5.a [Other Other Sectors][Other Fossil Fuels][Emissions][N2O][kt][Stationary combustion][no method][no target][no option][no type]
type: Concept
definition: 1.A.5.a [Other Other Sectors][Other Fossil Fuels][Emissions][N2O][kt][Stationary combustion][no method][no target][no option][no type]
status: valid
status modified: 2017-02-13
accepted date: 2017-02-13
in scheme: IPCC_variables_MMR

1.A.5.a [Other Other Sectors][Peat][Emissions][CH4][kt][Stationary combustion][no method][no target][no option][no type]
type: Concept
definition: 1.A.5.a [Other Other Sectors][Peat][Emissions][CH4][kt][Stationary combustion][no method][no target][no option][no type]
status: valid
status modified: 2017-02-13
accepted date: 2017-02-13
in scheme: IPCC_variables_MMR

1.A.5.a [Other Other Sectors][Peat][Emissions][CO2][kt][Stationary combustion][no method][no target][no option][no type]
type: Concept
definition: 1.A.5.a [Other Other Sectors][Peat][Emissions][CO2][kt][Stationary combustion][no method][no target][no option][no type]
status: valid
status modified: 2017-02-13
accepted date: 2017-02-13
in scheme: IPCC_variables_MMR

1.A.5.a [Other Other Sectors][Peat][Emissions][N2O][kt][Stationary combustion][no method][no target][no option][no type]
type: Concept
definition: 1.A.5.a [Other Other Sectors][Peat][Emissions][N2O][kt][Stationary combustion][no method][no target][no option][no type]
status: valid
status modified: 2017-02-13
accepted date: 2017-02-13
in scheme: IPCC_variables_MMR

1.A.5.a [Other Other Sectors][Solid Fuels][Emissions][CH4][kt][Stationary combustion][no method][no target][no option][no type]
type: Concept
definition: 1.A.5.a [Other Other Sectors][Solid Fuels][Emissions][CH4][kt][Stationary combustion][no method][no target][no option][no type]
status: valid
status modified: 2017-02-13
accepted date: 2017-02-13
in scheme: IPCC_variables_MMR

1.A.5.a [Other Other Sectors][Solid Fuels][Emissions][CO2][kt][Stationary combustion][no method][no target][no option][no type]
type: Concept
definition: 1.A.5.a [Other Other Sectors][Solid Fuels][Emissions][CO2][kt][Stationary combustion][no method][no target][no option][no type]
status: valid
status modified: 2017-02-13
accepted date: 2017-02-13
in scheme: IPCC_variables_MMR

1.A.5.a [Other Other Sectors][Solid Fuels][Emissions][N2O][kt][Stationary combustion][no method][no target][no option][no type]
type: Concept
definition: 1.A.5.a [Other Other Sectors][Solid Fuels][Emissions][N2O][kt][Stationary combustion][no method][no target][no option][no type]
status: valid
status modified: 2017-02-13
accepted date: 2017-02-13
in scheme: IPCC_variables_MMR

1.A.5.b [Other Other Sectors][Biomass][Emissions][CH4][kt][Mobile Combustion][no method][no target][no option][no type]
type: Concept
definition: 1.A.5.b [Other Other Sectors][Biomass][Emissions][CH4][kt][Mobile Combustion][no method][no target][no option][no type]
status: valid
status modified: 2017-02-13
accepted date: 2017-02-13
in scheme: IPCC_variables_MMR

1.A.5.b [Other Other Sectors][Biomass][Emissions][CO2][kt][Mobile Combustion][no method][no target][no option][no type]
type: Concept
definition: 1.A.5.b [Other Other Sectors][Biomass][Emissions][CO2][kt][Mobile Combustion][no method][no target][no option][no type]
status: valid
status modified: 2017-02-13
accepted date: 2017-02-13
in scheme: IPCC_variables_MMR

1.A.5.b [Other Other Sectors][Biomass][Emissions][N2O][kt][Mobile Combustion][no method][no target][no option][no type]
type: Concept
definition: 1.A.5.b [Other Other Sectors][Biomass][Emissions][N2O][kt][Mobile Combustion][no method][no target][no option][no type]
status: valid
status modified: 2017-02-13
accepted date: 2017-02-13
in scheme: IPCC_variables_MMR

1.A.5.b [Other Other Sectors][Fuels][Emissions][CH4][kt][Mobile Combustion][no method][no target][no option][no type]
type: Concept
definition: 1.A.5.b [Other Other Sectors][Fuels][Emissions][CH4][kt][Mobile Combustion][no method][no target][no option][no type]
status: valid
status modified: 2017-02-13
accepted date: 2017-02-13
in scheme: IPCC_variables_MMR

1.A.5.b [Other Other Sectors][Fuels][Emissions][CO2][kt][Mobile Combustion][no method][no target][no option][no type]
type: Concept
definition: 1.A.5.b [Other Other Sectors][Fuels][Emissions][CO2][kt][Mobile Combustion][no method][no target][no option][no type]
status: valid
status modified: 2017-02-13
accepted date: 2017-02-13
in scheme: IPCC_variables_MMR

1.A.5.b [Other Other Sectors][Fuels][Emissions][N2O][kt][Mobile Combustion][no method][no target][no option][no type]
type: Concept
definition: 1.A.5.b [Other Other Sectors][Fuels][Emissions][N2O][kt][Mobile Combustion][no method][no target][no option][no type]
status: valid
status modified: 2017-02-13
accepted date: 2017-02-13
in scheme: IPCC_variables_MMR

1.A.5.b [Other Other Sectors][Gaseous Fuels][Emissions][CH4][kt][Mobile Combustion][no method][no target][no option][no type]
type: Concept
definition: 1.A.5.b [Other Other Sectors][Gaseous Fuels][Emissions][CH4][kt][Mobile Combustion][no method][no target][no option][no type]
status: valid
status modified: 2017-02-13
accepted date: 2017-02-13
in scheme: IPCC_variables_MMR

1.A.5.b [Other Other Sectors][Gaseous Fuels][Emissions][CO2][kt][Mobile Combustion][no method][no target][no option][no type]
type: Concept
definition: 1.A.5.b [Other Other Sectors][Gaseous Fuels][Emissions][CO2][kt][Mobile Combustion][no method][no target][no option][no type]
status: valid
status modified: 2017-02-13
accepted date: 2017-02-13
in scheme: IPCC_variables_MMR

1.A.5.b [Other Other Sectors][Gaseous Fuels][Emissions][N2O][kt][Mobile Combustion][no method][no target][no option][no type]
type: Concept
definition: 1.A.5.b [Other Other Sectors][Gaseous Fuels][Emissions][N2O][kt][Mobile Combustion][no method][no target][no option][no type]
status: valid
status modified: 2017-02-13
accepted date: 2017-02-13
in scheme: IPCC_variables_MMR

1.A.5.b [Other Other Sectors][Liquid Fuels][Emissions][CH4][kt][Mobile Combustion][no method][no target][no option][no type]
type: Concept
definition: 1.A.5.b [Other Other Sectors][Liquid Fuels][Emissions][CH4][kt][Mobile Combustion][no method][no target][no option][no type]
status: valid
status modified: 2017-02-13
accepted date: 2017-02-13
in scheme: IPCC_variables_MMR

1.A.5.b [Other Other Sectors][Liquid Fuels][Emissions][CO2][kt][Mobile Combustion][no method][no target][no option][no type]
type: Concept
definition: 1.A.5.b [Other Other Sectors][Liquid Fuels][Emissions][CO2][kt][Mobile Combustion][no method][no target][no option][no type]
status: valid
status modified: 2017-02-13
accepted date: 2017-02-13
in scheme: IPCC_variables_MMR

1.A.5.b [Other Other Sectors][Liquid Fuels][Emissions][N2O][kt][Mobile Combustion][no method][no target][no option][no type]
type: Concept
definition: 1.A.5.b [Other Other Sectors][Liquid Fuels][Emissions][N2O][kt][Mobile Combustion][no method][no target][no option][no type]
status: valid
status modified: 2017-02-13
accepted date: 2017-02-13
in scheme: IPCC_variables_MMR

1.A.5.b [Other Other Sectors][Other Fossil Fuels][Emissions][CH4][kt][Mobile Combustion][no method][no target][no option][no type]
type: Concept
definition: 1.A.5.b [Other Other Sectors][Other Fossil Fuels][Emissions][CH4][kt][Mobile Combustion][no method][no target][no option][no type]
status: valid
status modified: 2017-02-13
accepted date: 2017-02-13
in scheme: IPCC_variables_MMR

1.A.5.b [Other Other Sectors][Other Fossil Fuels][Emissions][CO2][kt][Mobile Combustion][no method][no target][no option][no type]
type: Concept
definition: 1.A.5.b [Other Other Sectors][Other Fossil Fuels][Emissions][CO2][kt][Mobile Combustion][no method][no target][no option][no type]
status: valid
status modified: 2017-02-13
accepted date: 2017-02-13
in scheme: IPCC_variables_MMR

1.A.5.b [Other Other Sectors][Other Fossil Fuels][Emissions][N2O][kt][Mobile Combustion][no method][no target][no option][no type]
type: Concept
definition: 1.A.5.b [Other Other Sectors][Other Fossil Fuels][Emissions][N2O][kt][Mobile Combustion][no method][no target][no option][no type]
status: valid
status modified: 2017-02-13
accepted date: 2017-02-13
in scheme: IPCC_variables_MMR

1.A.5.b [Other Other Sectors][Solid Fuels][Emissions][CH4][kt][Mobile Combustion][no method][no target][no option][no type]
type: Concept
definition: 1.A.5.b [Other Other Sectors][Solid Fuels][Emissions][CH4][kt][Mobile Combustion][no method][no target][no option][no type]
status: valid
status modified: 2017-02-13
accepted date: 2017-02-13
in scheme: IPCC_variables_MMR

1.A.5.b [Other Other Sectors][Solid Fuels][Emissions][CO2][kt][Mobile Combustion][no method][no target][no option][no type]
type: Concept
definition: 1.A.5.b [Other Other Sectors][Solid Fuels][Emissions][CO2][kt][Mobile Combustion][no method][no target][no option][no type]
status: valid
status modified: 2017-02-13
accepted date: 2017-02-13
in scheme: IPCC_variables_MMR

1.A.5.b [Other Other Sectors][Solid Fuels][Emissions][N2O][kt][Mobile Combustion][no method][no target][no option][no type]
type: Concept
definition: 1.A.5.b [Other Other Sectors][Solid Fuels][Emissions][N2O][kt][Mobile Combustion][no method][no target][no option][no type]
status: valid
status modified: 2017-02-13
accepted date: 2017-02-13
in scheme: IPCC_variables_MMR

1.B.1.a.1 [Underground Mines][Operation][Emissions][CH4][kt][no source][no method][no target][no option][no type]
type: Concept
definition: 1.B.1.a.1 [Underground Mines][Operation][Emissions][CH4][kt][no source][no method][no target][no option][no type]
status: valid
status modified: 2017-02-13
accepted date: 2017-02-13
in scheme: IPCC_variables_MMR

1.B.1.a.1.i [Underground Mines][Mining Activities][Emissions][CH4][kt][no source][no method][no target][no option][no type]
type: Concept
definition: 1.B.1.a.1.i [Underground Mines][Mining Activities][Emissions][CH4][kt][no source][no method][no target][no option][no type]
status: valid
status modified: 2017-02-13
accepted date: 2017-02-13
in scheme: IPCC_variables_MMR

1.B.1.a.1.i [Underground Mines][Mining Activities][Emissions][CO2][kt][no source][no method][no target][no option][no type]
type: Concept
definition: 1.B.1.a.1.i [Underground Mines][Mining Activities][Emissions][CO2][kt][no source][no method][no target][no option][no type]
status: valid
status modified: 2017-02-13
accepted date: 2017-02-13
in scheme: IPCC_variables_MMR

1.B.1.a.1.ii [Underground Mines][Post-Mining Activities][Emissions][CH4][kt][no source][no method][no target][no option][no type]
type: Concept
definition: 1.B.1.a.1.ii [Underground Mines][Post-Mining Activities][Emissions][CH4][kt][no source][no method][no target][no option][no type]
status: valid
status modified: 2017-02-13
accepted date: 2017-02-13
in scheme: IPCC_variables_MMR

1.B.1.a.1.iii [Underground Mines][Abandoned Underground Mines][Emissions][CH4][kt][no source][no method][no target][no option][no type]
type: Concept
definition: 1.B.1.a.1.iii [Underground Mines][Abandoned Underground Mines][Emissions][CH4][kt][no source][no method][no target][no option][no type]
status: valid
status modified: 2017-02-13
accepted date: 2017-02-13
in scheme: IPCC_variables_MMR

1.B.1.a.2 [Surface Mines][Operation][Emissions][CH4][kt][no source][no method][no target][no option][no type]
type: Concept
definition: 1.B.1.a.2 [Surface Mines][Operation][Emissions][CH4][kt][no source][no method][no target][no option][no type]
status: valid
status modified: 2017-02-13
accepted date: 2017-02-13
in scheme: IPCC_variables_MMR

1.B.1.a.2.i [Surface Mines][Mining Activities][Emissions][CH4][kt][no source][no method][no target][no option][no type]
type: Concept
definition: 1.B.1.a.2.i [Surface Mines][Mining Activities][Emissions][CH4][kt][no source][no method][no target][no option][no type]
status: valid
status modified: 2017-02-13
accepted date: 2017-02-13
in scheme: IPCC_variables_MMR

1.B.1.a.2.ii [Surface Mines][Post-Mining Activities][Emissions][CH4][kt][no source][no method][no target][no option][no type]
type: Concept
definition: 1.B.1.a.2.ii [Surface Mines][Post-Mining Activities][Emissions][CH4][kt][no source][no method][no target][no option][no type]
status: valid
status modified: 2017-02-13
accepted date: 2017-02-13
in scheme: IPCC_variables_MMR

1.B.2.a.1 [Oil][Exploration][Emissions][CH4][kt][no source][no method][no target][no option][no type]
type: Concept
definition: 1.B.2.a.1 [Oil][Exploration][Emissions][CH4][kt][no source][no method][no target][no option][no type]
status: valid
status modified: 2017-02-13
accepted date: 2017-02-13
in scheme: IPCC_variables_MMR

1.B.2.a.1 [Oil][Exploration][Emissions][CO2][kt][no source][no method][no target][no option][no type]
type: Concept
definition: 1.B.2.a.1 [Oil][Exploration][Emissions][CO2][kt][no source][no method][no target][no option][no type]
status: valid
status modified: 2017-02-13
accepted date: 2017-02-13
in scheme: IPCC_variables_MMR

1.B.2.a.1 [Oil][Exploration][Emissions][N2O][kt][no source][no method][no target][no option][no type]
type: Concept
definition: 1.B.2.a.1 [Oil][Exploration][Emissions][N2O][kt][no source][no method][no target][no option][no type]
status: valid
status modified: 2017-02-13
accepted date: 2017-02-13
in scheme: IPCC_variables_MMR

1.B.2.a.2 [Oil][Production][Emissions][CH4][kt][no source][no method][no target][no option][no type]
type: Concept
definition: 1.B.2.a.2 [Oil][Production][Emissions][CH4][kt][no source][no method][no target][no option][no type]
status: valid
status modified: 2017-02-13
accepted date: 2017-02-13
in scheme: IPCC_variables_MMR

1.B.2.a.2 [Oil][Production][Emissions][CO2][kt][no source][no method][no target][no option][no type]
type: Concept
definition: 1.B.2.a.2 [Oil][Production][Emissions][CO2][kt][no source][no method][no target][no option][no type]
status: valid
status modified: 2017-02-13
accepted date: 2017-02-13
in scheme: IPCC_variables_MMR

1.B.2.a.3 [Oil][Transport][Emissions][CH4][kt][no source][no method][no target][no option][no type]
type: Concept
definition: 1.B.2.a.3 [Oil][Transport][Emissions][CH4][kt][no source][no method][no target][no option][no type]
status: valid
status modified: 2017-02-13
accepted date: 2017-02-13
in scheme: IPCC_variables_MMR

1.B.2.a.3 [Oil][Transport][Emissions][CO2][kt][no source][no method][no target][no option][no type]
type: Concept
definition: 1.B.2.a.3 [Oil][Transport][Emissions][CO2][kt][no source][no method][no target][no option][no type]
status: valid
status modified: 2017-02-13
accepted date: 2017-02-13
in scheme: IPCC_variables_MMR

1.B.2.a.4 [Oil][Refining / Storage][Emissions][CH4][kt][no source][no method][no target][no option][no type]
type: Concept
definition: 1.B.2.a.4 [Oil][Refining / Storage][Emissions][CH4][kt][no source][no method][no target][no option][no type]
status: valid
status modified: 2017-02-13
accepted date: 2017-02-13
in scheme: IPCC_variables_MMR

1.B.2.a.4 [Oil][Refining / Storage][Emissions][CO2][kt][no source][no method][no target][no option][no type]
type: Concept
definition: 1.B.2.a.4 [Oil][Refining / Storage][Emissions][CO2][kt][no source][no method][no target][no option][no type]
status: valid
status modified: 2017-02-13
accepted date: 2017-02-13
in scheme: IPCC_variables_MMR

1.B.2.a.4 [Oil][Refining / Storage][Emissions][N2O][kt][no source][no method][no target][no option][no type]
type: Concept
definition: 1.B.2.a.4 [Oil][Refining / Storage][Emissions][N2O][kt][no source][no method][no target][no option][no type]
status: valid
status modified: 2017-02-13
accepted date: 2017-02-13
in scheme: IPCC_variables_MMR

1.B.2.a.5 [Oil][Distribution of Oil Products][Emissions][CH4][kt][no source][no method][no target][no option][no type]
type: Concept
definition: 1.B.2.a.5 [Oil][Distribution of Oil Products][Emissions][CH4][kt][no source][no method][no target][no option][no type]
status: valid
status modified: 2017-02-13
accepted date: 2017-02-13
in scheme: IPCC_variables_MMR

1.B.2.a.5 [Oil][Distribution of Oil Products][Emissions][CO2][kt][no source][no method][no target][no option][no type]
type: Concept
definition: 1.B.2.a.5 [Oil][Distribution of Oil Products][Emissions][CO2][kt][no source][no method][no target][no option][no type]
status: valid
status modified: 2017-02-13
accepted date: 2017-02-13
in scheme: IPCC_variables_MMR

1.B.2.a.6 [Oil][Other operation on oil][Emissions][CH4][kt][no source][no method][no target][no option][no type]
type: Concept
definition: 1.B.2.a.6 [Oil][Other operation on oil][Emissions][CH4][kt][no source][no method][no target][no option][no type]
status: valid
status modified: 2017-02-13
accepted date: 2017-02-13
in scheme: IPCC_variables_MMR

1.B.2.a.6 [Oil][Other operation on oil][Emissions][CO2][kt][no source][no method][no target][no option][no type]
type: Concept
definition: 1.B.2.a.6 [Oil][Other operation on oil][Emissions][CO2][kt][no source][no method][no target][no option][no type]
status: valid
status modified: 2017-02-13
accepted date: 2017-02-13
in scheme: IPCC_variables_MMR

1.B.2.b.1 [Natural Gas][Exploration][Emissions][CH4][kt][no source][no method][no target][no option][no type]
type: Concept
definition: 1.B.2.b.1 [Natural Gas][Exploration][Emissions][CH4][kt][no source][no method][no target][no option][no type]
status: valid
status modified: 2017-02-13
accepted date: 2017-02-13
in scheme: IPCC_variables_MMR

1.B.2.b.1 [Natural Gas][Exploration][Emissions][CO2][kt][no source][no method][no target][no option][no type]
type: Concept
definition: 1.B.2.b.1 [Natural Gas][Exploration][Emissions][CO2][kt][no source][no method][no target][no option][no type]
status: valid
status modified: 2017-02-13
accepted date: 2017-02-13
in scheme: IPCC_variables_MMR

1.B.2.b.2 [Natural Gas][Production][Emissions][CH4][kt][no source][no method][no target][no option][no type]
type: Concept
definition: 1.B.2.b.2 [Natural Gas][Production][Emissions][CH4][kt][no source][no method][no target][no option][no type]
status: valid
status modified: 2017-02-13
accepted date: 2017-02-13
in scheme: IPCC_variables_MMR

1.B.2.b.2 [Natural Gas][Production][Emissions][CO2][kt][no source][no method][no target][no option][no type]
type: Concept
definition: 1.B.2.b.2 [Natural Gas][Production][Emissions][CO2][kt][no source][no method][no target][no option][no type]
status: valid
status modified: 2017-02-13
accepted date: 2017-02-13
in scheme: IPCC_variables_MMR

1.B.2.b.3 [Natural Gas][Processing][Emissions][CH4][kt][no source][no method][no target][no option][no type]
type: Concept
definition: 1.B.2.b.3 [Natural Gas][Processing][Emissions][CH4][kt][no source][no method][no target][no option][no type]
status: valid
status modified: 2017-02-13
accepted date: 2017-02-13
in scheme: IPCC_variables_MMR

1.B.2.b.3 [Natural Gas][Processing][Emissions][CO2][kt][no source][no method][no target][no option][no type]
type: Concept
definition: 1.B.2.b.3 [Natural Gas][Processing][Emissions][CO2][kt][no source][no method][no target][no option][no type]
status: valid
status modified: 2017-02-13
accepted date: 2017-02-13
in scheme: IPCC_variables_MMR

1.B.2.b.4 [Natural Gas][Transmission and storage][Emissions][CH4][kt][no source][no method][no target][no option][no type]
type: Concept
definition: 1.B.2.b.4 [Natural Gas][Transmission and storage][Emissions][CH4][kt][no source][no method][no target][no option][no type]
status: valid
status modified: 2017-02-13
accepted date: 2017-02-13
in scheme: IPCC_variables_MMR

1.B.2.b.4 [Natural Gas][Transmission and storage][Emissions][CO2][kt][no source][no method][no target][no option][no type]
type: Concept
definition: 1.B.2.b.4 [Natural Gas][Transmission and storage][Emissions][CO2][kt][no source][no method][no target][no option][no type]
status: valid
status modified: 2017-02-13
accepted date: 2017-02-13
in scheme: IPCC_variables_MMR

1.B.2.b.5 [Natural Gas][Distribution][Emissions][CH4][kt][no source][no method][no target][no option][no type]
type: Concept
definition: 1.B.2.b.5 [Natural Gas][Distribution][Emissions][CH4][kt][no source][no method][no target][no option][no type]
status: valid
status modified: 2017-02-13
accepted date: 2017-02-13
in scheme: IPCC_variables_MMR

1.B.2.b.5 [Natural Gas][Distribution][Emissions][CO2][kt][no source][no method][no target][no option][no type]
type: Concept
definition: 1.B.2.b.5 [Natural Gas][Distribution][Emissions][CO2][kt][no source][no method][no target][no option][no type]
status: valid
status modified: 2017-02-13
accepted date: 2017-02-13
in scheme: IPCC_variables_MMR

1.B.2.b.6 [Natural Gas][Other operations on natural gas][Emissions][CH4][kt][no source][no method][no target][no option][no type]
type: Concept
definition: 1.B.2.b.6 [Natural Gas][Other operations on natural gas][Emissions][CH4][kt][no source][no method][no target][no option][no type]
status: valid
status modified: 2017-02-13
accepted date: 2017-02-13
in scheme: IPCC_variables_MMR

1.B.2.b.6 [Natural Gas][Other operations on natural gas][Emissions][CO2][kt][no source][no method][no target][no option][no type]
type: Concept
definition: 1.B.2.b.6 [Natural Gas][Other operations on natural gas][Emissions][CO2][kt][no source][no method][no target][no option][no type]
status: valid
status modified: 2017-02-13
accepted date: 2017-02-13
in scheme: IPCC_variables_MMR

1.B.2.c.1 [Venting][Operation][Emissions][CH4][kt][no source][no method][no target][no option][no type]
type: Concept
definition: 1.B.2.c.1 [Venting][Operation][Emissions][CH4][kt][no source][no method][no target][no option][no type]
status: valid
status modified: 2017-02-13
accepted date: 2017-02-13
in scheme: IPCC_variables_MMR

1.B.2.c.1 [Venting][Operation][Emissions][CO2][kt][no source][no method][no target][no option][no type]
type: Concept
definition: 1.B.2.c.1 [Venting][Operation][Emissions][CO2][kt][no source][no method][no target][no option][no type]
status: valid
status modified: 2017-02-13
accepted date: 2017-02-13
in scheme: IPCC_variables_MMR

1.B.2.c.1.i [Venting][Oil][Emissions][CH4][kt][no source][no method][no target][no option][no type]
type: Concept
definition: 1.B.2.c.1.i [Venting][Oil][Emissions][CH4][kt][no source][no method][no target][no option][no type]
status: valid
status modified: 2017-02-13
accepted date: 2017-02-13
in scheme: IPCC_variables_MMR

1.B.2.c.1.i [Venting][Oil][Emissions][CO2][kt][no source][no method][no target][no option][no type]
type: Concept
definition: 1.B.2.c.1.i [Venting][Oil][Emissions][CO2][kt][no source][no method][no target][no option][no type]
status: valid
status modified: 2017-02-13
accepted date: 2017-02-13
in scheme: IPCC_variables_MMR

1.B.2.c.1.ii [Venting][Gas][Emissions][CH4][kt][no source][no method][no target][no option][no type]
type: Concept
definition: 1.B.2.c.1.ii [Venting][Gas][Emissions][CH4][kt][no source][no method][no target][no option][no type]
status: valid
status modified: 2017-02-13
accepted date: 2017-02-13
in scheme: IPCC_variables_MMR

1.B.2.c.1.ii [Venting][Gas][Emissions][CO2][kt][no source][no method][no target][no option][no type]
type: Concept
definition: 1.B.2.c.1.ii [Venting][Gas][Emissions][CO2][kt][no source][no method][no target][no option][no type]
status: valid
status modified: 2017-02-13
accepted date: 2017-02-13
in scheme: IPCC_variables_MMR

1.B.2.c.1.iii [Venting][Combined][Emissions][CH4][kt][no source][no method][no target][no option][no type]
type: Concept
definition: 1.B.2.c.1.iii [Venting][Combined][Emissions][CH4][kt][no source][no method][no target][no option][no type]
status: valid
status modified: 2017-02-13
accepted date: 2017-02-13
in scheme: IPCC_variables_MMR

1.B.2.c.1.iii [Venting][Combined][Emissions][CO2][kt][no source][no method][no target][no option][no type]
type: Concept
definition: 1.B.2.c.1.iii [Venting][Combined][Emissions][CO2][kt][no source][no method][no target][no option][no type]
status: valid
status modified: 2017-02-13
accepted date: 2017-02-13
in scheme: IPCC_variables_MMR

1.B.2.c.2 [Flaring][Operation][Emissions][CH4][kt][no source][no method][no target][no option][no type]
type: Concept
definition: 1.B.2.c.2 [Flaring][Operation][Emissions][CH4][kt][no source][no method][no target][no option][no type]
status: valid
status modified: 2017-02-13
accepted date: 2017-02-13
in scheme: IPCC_variables_MMR

1.B.2.c.2 [Flaring][Operation][Emissions][CO2][kt][no source][no method][no target][no option][no type]
type: Concept
definition: 1.B.2.c.2 [Flaring][Operation][Emissions][CO2][kt][no source][no method][no target][no option][no type]
status: valid
status modified: 2017-02-13
accepted date: 2017-02-13
in scheme: IPCC_variables_MMR

1.B.2.c.2 [Flaring][Operation][Emissions][N2O][kt][no source][no method][no target][no option][no type]
type: Concept
definition: 1.B.2.c.2 [Flaring][Operation][Emissions][N2O][kt][no source][no method][no target][no option][no type]
status: valid
status modified: 2017-02-13
accepted date: 2017-02-13
in scheme: IPCC_variables_MMR

1.B.2.c.2.i [Flaring][Oil][Emissions][CH4][kt][no source][no method][no target][no option][no type]
type: Concept
definition: 1.B.2.c.2.i [Flaring][Oil][Emissions][CH4][kt][no source][no method][no target][no option][no type]
status: valid
status modified: 2017-02-13
accepted date: 2017-02-13
in scheme: IPCC_variables_MMR

1.B.2.c.2.i [Flaring][Oil][Emissions][CO2][kt][no source][no method][no target][no option][no type]
type: Concept
definition: 1.B.2.c.2.i [Flaring][Oil][Emissions][CO2][kt][no source][no method][no target][no option][no type]
status: valid
status modified: 2017-02-13
accepted date: 2017-02-13
in scheme: IPCC_variables_MMR

1.B.2.c.2.i [Flaring][Oil][Emissions][N2O][kt][no source][no method][no target][no option][no type]
type: Concept
definition: 1.B.2.c.2.i [Flaring][Oil][Emissions][N2O][kt][no source][no method][no target][no option][no type]
status: valid
status modified: 2017-02-13
accepted date: 2017-02-13
in scheme: IPCC_variables_MMR

1.B.2.c.2.ii [Flaring][Gas][Emissions][CH4][kt][no source][no method][no target][no option][no type]
type: Concept
definition: 1.B.2.c.2.ii [Flaring][Gas][Emissions][CH4][kt][no source][no method][no target][no option][no type]
status: valid
status modified: 2017-02-13
accepted date: 2017-02-13
in scheme: IPCC_variables_MMR

1.B.2.c.2.ii [Flaring][Gas][Emissions][CO2][kt][no source][no method][no target][no option][no type]
type: Concept
definition: 1.B.2.c.2.ii [Flaring][Gas][Emissions][CO2][kt][no source][no method][no target][no option][no type]
status: valid
status modified: 2017-02-13
accepted date: 2017-02-13
in scheme: IPCC_variables_MMR

1.B.2.c.2.ii [Flaring][Gas][Emissions][N2O][kt][no source][no method][no target][no option][no type]
type: Concept
definition: 1.B.2.c.2.ii [Flaring][Gas][Emissions][N2O][kt][no source][no method][no target][no option][no type]
status: valid
status modified: 2017-02-13
accepted date: 2017-02-13
in scheme: IPCC_variables_MMR

1.B.2.c.2.iii [Flaring][Combined][Emissions][CH4][kt][no source][no method][no target][no option][no type]
type: Concept
definition: 1.B.2.c.2.iii [Flaring][Combined][Emissions][CH4][kt][no source][no method][no target][no option][no type]
status: valid
status modified: 2017-02-13
accepted date: 2017-02-13
in scheme: IPCC_variables_MMR

1.B.2.c.2.iii [Flaring][Combined][Emissions][CO2][kt][no source][no method][no target][no option][no type]
type: Concept
definition: 1.B.2.c.2.iii [Flaring][Combined][Emissions][CO2][kt][no source][no method][no target][no option][no type]
status: valid
status modified: 2017-02-13
accepted date: 2017-02-13
in scheme: IPCC_variables_MMR

1.B.2.c.2.iii [Flaring][Combined][Emissions][N2O][kt][no source][no method][no target][no option][no type]
type: Concept
definition: 1.B.2.c.2.iii [Flaring][Combined][Emissions][N2O][kt][no source][no method][no target][no option][no type]
status: valid
status modified: 2017-02-13
accepted date: 2017-02-13
in scheme: IPCC_variables_MMR

1.C Pipelines [Pipelines][Fuels][Emissions][CO2][kt][no source][no method][no target][no option][no type]
type: Concept
definition: 1.C Pipelines [Pipelines][Fuels][Emissions][CO2][kt][no source][no method][no target][no option][no type]
status: valid
status modified: 2017-02-13
accepted date: 2017-02-13
in scheme: IPCC_variables_MMR

2.A.1 [Cement Production][no classification][Emissions][CO2][kt][no source][no method][no target][no option][no type]
type: Concept
definition: 2.A.1 [Cement Production][no classification][Emissions][CO2][kt][no source][no method][no target][no option][no type]
status: valid
status modified: 2017-02-13
accepted date: 2017-02-13
in scheme: IPCC_variables_MMR

2.A.2 [Lime Production][no classification][Emissions][CO2][kt][no source][no method][no target][no option][no type]
type: Concept
definition: 2.A.2 [Lime Production][no classification][Emissions][CO2][kt][no source][no method][no target][no option][no type]
status: valid
status modified: 2017-02-13
accepted date: 2017-02-13
in scheme: IPCC_variables_MMR

2.A.3 [Glass production][no classification][Emissions][CO2][kt][no source][no method][no target][no option][no type]
type: Concept
definition: 2.A.3 [Glass production][no classification][Emissions][CO2][kt][no source][no method][no target][no option][no type]
status: valid
status modified: 2017-02-13
accepted date: 2017-02-13
in scheme: IPCC_variables_MMR

2.A.4 [Other Process Uses of Carbonates][no classification][Emissions][CO2][kt][no source][no method][no target][no option][no type]
type: Concept
definition: 2.A.4 [Other Process Uses of Carbonates][no classification][Emissions][CO2][kt][no source][no method][no target][no option][no type]
status: valid
status modified: 2017-02-13
accepted date: 2017-02-13
in scheme: IPCC_variables_MMR

2.A.4.a [Ceramics][no classification][Emissions][CO2][kt][no source][no method][no target][no option][no type]
type: Concept
definition: 2.A.4.a [Ceramics][no classification][Emissions][CO2][kt][no source][no method][no target][no option][no type]
status: valid
status modified: 2017-02-13
accepted date: 2017-02-13
in scheme: IPCC_variables_MMR

2.A.4.b [Other uses of Soda Ash][no classification][Emissions][CO2][kt][no source][no method][no target][no option][no type]
type: Concept
definition: 2.A.4.b [Other uses of Soda Ash][no classification][Emissions][CO2][kt][no source][no method][no target][no option][no type]
status: valid
status modified: 2017-02-13
accepted date: 2017-02-13
in scheme: IPCC_variables_MMR

2.A.4.c [Non-metallurgical Magnesium Production][no classification][Emissions][CO2][kt][no source][no method][no target][no option][no type]
type: Concept
definition: 2.A.4.c [Non-metallurgical Magnesium Production][no classification][Emissions][CO2][kt][no source][no method][no target][no option][no type]
status: valid
status modified: 2017-02-13
accepted date: 2017-02-13
in scheme: IPCC_variables_MMR

2.A.4.d [Other unspecified uses of carbonates][no classification][Emissions][CO2][kt][no source][no method][no target][no option][no type]
type: Concept
definition: 2.A.4.d [Other unspecified uses of carbonates][no classification][Emissions][CO2][kt][no source][no method][no target][no option][no type]
status: valid
status modified: 2017-02-13
accepted date: 2017-02-13
in scheme: IPCC_variables_MMR

2.B.1 [Ammonia Production][no classification][Emissions][CO2][kt][no source][no method][no target][no option][no type]
type: Concept
definition: 2.B.1 [Ammonia Production][no classification][Emissions][CO2][kt][no source][no method][no target][no option][no type]
status: valid
status modified: 2017-02-13
accepted date: 2017-02-13
in scheme: IPCC_variables_MMR

2.B.2 [Nitric Acid Production][no classification][Emissions][N2O][kt][no source][no method][no target][no option][no type]
type: Concept
definition: 2.B.2 [Nitric Acid Production][no classification][Emissions][N2O][kt][no source][no method][no target][no option][no type]
status: valid
status modified: 2017-02-13
accepted date: 2017-02-13
in scheme: IPCC_variables_MMR

2.B.3 [Adipic Acid Production][no classification][Emissions][N2O][kt][no source][no method][no target][no option][no type]
type: Concept
definition: 2.B.3 [Adipic Acid Production][no classification][Emissions][N2O][kt][no source][no method][no target][no option][no type]
status: valid
status modified: 2017-02-13
accepted date: 2017-02-13
in scheme: IPCC_variables_MMR

2.B.4 [Caprolactam, Glyoxal and Glyoxylic Acid Production][no classification][Emissions][N2O][kt][no source][no method][no target][no option][no type]
type: Concept
definition: 2.B.4 [Caprolactam, Glyoxal and Glyoxylic Acid Production][no classification][Emissions][N2O][kt][no source][no method][no target][no option][no type]
status: valid
status modified: 2017-02-13
accepted date: 2017-02-13
in scheme: IPCC_variables_MMR

2.B.4.a [Caprolactam][no classification][Emissions][N2O][kt][no source][no method][no target][no option][no type]
type: Concept
definition: 2.B.4.a [Caprolactam][no classification][Emissions][N2O][kt][no source][no method][no target][no option][no type]
status: valid
status modified: 2017-02-13
accepted date: 2017-02-13
in scheme: IPCC_variables_MMR

2.B.4.b [Glyoxal][no classification][Emissions][N2O][kt][no source][no method][no target][no option][no type]
type: Concept
definition: 2.B.4.b [Glyoxal][no classification][Emissions][N2O][kt][no source][no method][no target][no option][no type]
status: valid
status modified: 2017-02-13
accepted date: 2017-02-13
in scheme: IPCC_variables_MMR

2.B.4.c [Glyoxylic Acid][no classification][Emissions][N2O][kt][no source][no method][no target][no option][no type]
type: Concept
definition: 2.B.4.c [Glyoxylic Acid][no classification][Emissions][N2O][kt][no source][no method][no target][no option][no type]
status: valid
status modified: 2017-02-13
accepted date: 2017-02-13
in scheme: IPCC_variables_MMR

2.B.5 [Carbide Production][no classification][Emissions][CH4][kt][no source][no method][no target][no option][no type]
type: Concept
definition: 2.B.5 [Carbide Production][no classification][Emissions][CH4][kt][no source][no method][no target][no option][no type]
status: valid
status modified: 2017-02-13
accepted date: 2017-02-13
in scheme: IPCC_variables_MMR

2.B.5 [Carbide Production][no classification][Emissions][CO2][kt][no source][no method][no target][no option][no type]
type: Concept
definition: 2.B.5 [Carbide Production][no classification][Emissions][CO2][kt][no source][no method][no target][no option][no type]
status: valid
status modified: 2017-02-13
accepted date: 2017-02-13
in scheme: IPCC_variables_MMR

2.B.5.a [Silicon Carbide][no classification][Emissions][CO2][kt][no source][no method][no target][no option][no type]
type: Concept
definition: 2.B.5.a [Silicon Carbide][no classification][Emissions][CO2][kt][no source][no method][no target][no option][no type]
status: valid
status modified: 2017-02-13
accepted date: 2017-02-13
in scheme: IPCC_variables_MMR

2.B.5.b [Calcium Carbide][no classification][Emissions][CO2][kt][no source][no method][no target][no option][no type]
type: Concept
definition: 2.B.5.b [Calcium Carbide][no classification][Emissions][CO2][kt][no source][no method][no target][no option][no type]
status: valid
status modified: 2017-02-13
accepted date: 2017-02-13
in scheme: IPCC_variables_MMR

2.B.6 [Titanium Dioxide Production][no classification][Emissions][CO2][kt][no source][no method][no target][no option][no type]
type: Concept
definition: 2.B.6 [Titanium Dioxide Production][no classification][Emissions][CO2][kt][no source][no method][no target][no option][no type]
status: valid
status modified: 2017-02-13
accepted date: 2017-02-13
in scheme: IPCC_variables_MMR

2.B.7 [Soda Ash Production][no classification][Emissions][CO2][kt][no source][no method][no target][no option][no type]
type: Concept
definition: 2.B.7 [Soda Ash Production][no classification][Emissions][CO2][kt][no source][no method][no target][no option][no type]
status: valid
status modified: 2017-02-13
accepted date: 2017-02-13
in scheme: IPCC_variables_MMR

2.B.8.a [Methanol][no classification][Emissions][CH4][kt][no source][no method][no target][no option][no type]
type: Concept
definition: 2.B.8.a [Methanol][no classification][Emissions][CH4][kt][no source][no method][no target][no option][no type]
status: valid
status modified: 2017-02-13
accepted date: 2017-02-13
in scheme: IPCC_variables_MMR

2.B.8.a [Methanol][no classification][Emissions][CO2][kt][no source][no method][no target][no option][no type]
type: Concept
definition: 2.B.8.a [Methanol][no classification][Emissions][CO2][kt][no source][no method][no target][no option][no type]
status: valid
status modified: 2017-02-13
accepted date: 2017-02-13
in scheme: IPCC_variables_MMR

2.B.8.b [Ethylene][no classification][Emissions][CH4][kt][no source][no method][no target][no option][no type]
type: Concept
definition: 2.B.8.b [Ethylene][no classification][Emissions][CH4][kt][no source][no method][no target][no option][no type]
status: valid
status modified: 2017-02-13
accepted date: 2017-02-13
in scheme: IPCC_variables_MMR

2.B.8.b [Ethylene][no classification][Emissions][CO2][kt][no source][no method][no target][no option][no type]
type: Concept
definition: 2.B.8.b [Ethylene][no classification][Emissions][CO2][kt][no source][no method][no target][no option][no type]
status: valid
status modified: 2017-02-13
accepted date: 2017-02-13
in scheme: IPCC_variables_MMR

2.B.8.c [Ethylene Dichloride and Vinyl Chloride Monomer][no classification][Emissions][CH4][kt][no source][no method][no target][no option][no type]
type: Concept
definition: 2.B.8.c [Ethylene Dichloride and Vinyl Chloride Monomer][no classification][Emissions][CH4][kt][no source][no method][no target][no option][no type]
status: valid
status modified: 2017-02-13
accepted date: 2017-02-13
in scheme: IPCC_variables_MMR

2.B.8.c [Ethylene Dichloride and Vinyl Chloride Monomer][no classification][Emissions][CO2][kt][no source][no method][no target][no option][no type]
type: Concept
definition: 2.B.8.c [Ethylene Dichloride and Vinyl Chloride Monomer][no classification][Emissions][CO2][kt][no source][no method][no target][no option][no type]
status: valid
status modified: 2017-02-13
accepted date: 2017-02-13
in scheme: IPCC_variables_MMR

2.B.8.d [Ethylene Oxide][no classification][Emissions][CH4][kt][no source][no method][no target][no option][no type]
type: Concept
definition: 2.B.8.d [Ethylene Oxide][no classification][Emissions][CH4][kt][no source][no method][no target][no option][no type]
status: valid
status modified: 2017-02-13
accepted date: 2017-02-13
in scheme: IPCC_variables_MMR

2.B.8.d [Ethylene Oxide][no classification][Emissions][CO2][kt][no source][no method][no target][no option][no type]
type: Concept
definition: 2.B.8.d [Ethylene Oxide][no classification][Emissions][CO2][kt][no source][no method][no target][no option][no type]
status: valid
status modified: 2017-02-13
accepted date: 2017-02-13
in scheme: IPCC_variables_MMR

2.B.8.e [Acrylonitrile][no classification][Emissions][CH4][kt][no source][no method][no target][no option][no type]
type: Concept
definition: 2.B.8.e [Acrylonitrile][no classification][Emissions][CH4][kt][no source][no method][no target][no option][no type]
status: valid
status modified: 2017-02-13
accepted date: 2017-02-13
in scheme: IPCC_variables_MMR

2.B.8.e [Acrylonitrile][no classification][Emissions][CO2][kt][no source][no method][no target][no option][no type]
type: Concept
definition: 2.B.8.e [Acrylonitrile][no classification][Emissions][CO2][kt][no source][no method][no target][no option][no type]
status: valid
status modified: 2017-02-13
accepted date: 2017-02-13
in scheme: IPCC_variables_MMR

2.B.8.f [Carbon Black][no classification][Emissions][CH4][kt][no source][no method][no target][no option][no type]
type: Concept
definition: 2.B.8.f [Carbon Black][no classification][Emissions][CH4][kt][no source][no method][no target][no option][no type]
status: valid
status modified: 2017-02-13
accepted date: 2017-02-13
in scheme: IPCC_variables_MMR

2.B.8.f [Carbon Black][no classification][Emissions][CO2][kt][no source][no method][no target][no option][no type]
type: Concept
definition: 2.B.8.f [Carbon Black][no classification][Emissions][CO2][kt][no source][no method][no target][no option][no type]
status: valid
status modified: 2017-02-13
accepted date: 2017-02-13
in scheme: IPCC_variables_MMR

2.C.1 [Iron and Steel Production][no classification][Emissions][CH4][kt][no source][no method][no target][no option][no type]
type: Concept
definition: 2.C.1 [Iron and Steel Production][no classification][Emissions][CH4][kt][no source][no method][no target][no option][no type]
status: valid
status modified: 2017-02-13
accepted date: 2017-02-13
in scheme: IPCC_variables_MMR

2.C.1 [Iron and Steel Production][no classification][Emissions][CO2][kt][no source][no method][no target][no option][no type]
type: Concept
definition: 2.C.1 [Iron and Steel Production][no classification][Emissions][CO2][kt][no source][no method][no target][no option][no type]
status: valid
status modified: 2017-02-13
accepted date: 2017-02-13
in scheme: IPCC_variables_MMR

2.C.1.a [Steel][no classification][Emissions][CO2][kt][no source][no method][no target][no option][no type]
type: Concept
definition: 2.C.1.a [Steel][no classification][Emissions][CO2][kt][no source][no method][no target][no option][no type]
status: valid
status modified: 2017-02-13
accepted date: 2017-02-13
in scheme: IPCC_variables_MMR

2.C.1.b [Pig Iron][no classification][Emissions][CH4][kt][no source][no method][no target][no option][no type]
type: Concept
definition: 2.C.1.b [Pig Iron][no classification][Emissions][CH4][kt][no source][no method][no target][no option][no type]
status: valid
status modified: 2017-02-13
accepted date: 2017-02-13
in scheme: IPCC_variables_MMR

2.C.1.b [Pig Iron][no classification][Emissions][CO2][kt][no source][no method][no target][no option][no type]
type: Concept
definition: 2.C.1.b [Pig Iron][no classification][Emissions][CO2][kt][no source][no method][no target][no option][no type]
status: valid
status modified: 2017-02-13
accepted date: 2017-02-13
in scheme: IPCC_variables_MMR

2.C.1.c [Direct Reduced Iron][no classification][Emissions][CH4][kt][no source][no method][no target][no option][no type]
type: Concept
definition: 2.C.1.c [Direct Reduced Iron][no classification][Emissions][CH4][kt][no source][no method][no target][no option][no type]
status: valid
status modified: 2017-02-13
accepted date: 2017-02-13
in scheme: IPCC_variables_MMR

2.C.1.c [Direct Reduced Iron][no classification][Emissions][CO2][kt][no source][no method][no target][no option][no type]
type: Concept
definition: 2.C.1.c [Direct Reduced Iron][no classification][Emissions][CO2][kt][no source][no method][no target][no option][no type]
status: valid
status modified: 2017-02-13
accepted date: 2017-02-13
in scheme: IPCC_variables_MMR

2.C.1.d [Sinter][no classification][Emissions][CH4][kt][no source][no method][no target][no option][no type]
type: Concept
definition: 2.C.1.d [Sinter][no classification][Emissions][CH4][kt][no source][no method][no target][no option][no type]
status: valid
status modified: 2017-02-13
accepted date: 2017-02-13
in scheme: IPCC_variables_MMR

2.C.1.d [Sinter][no classification][Emissions][CO2][kt][no source][no method][no target][no option][no type]
type: Concept
definition: 2.C.1.d [Sinter][no classification][Emissions][CO2][kt][no source][no method][no target][no option][no type]
status: valid
status modified: 2017-02-13
accepted date: 2017-02-13
in scheme: IPCC_variables_MMR

2.C.1.e [Pellet][no classification][Emissions][CO2][kt][no source][no method][no target][no option][no type]
type: Concept
definition: 2.C.1.e [Pellet][no classification][Emissions][CO2][kt][no source][no method][no target][no option][no type]
status: valid
status modified: 2017-02-13
accepted date: 2017-02-13
in scheme: IPCC_variables_MMR

2.C.1.f [Other Iron and Steel Production][no classification][Emissions][CH4][kt][no source][no method][no target][no option][no type]
type: Concept
definition: 2.C.1.f [Other Iron and Steel Production][no classification][Emissions][CH4][kt][no source][no method][no target][no option][no type]
status: valid
status modified: 2017-02-13
accepted date: 2017-02-13
in scheme: IPCC_variables_MMR

2.C.1.f [Other Iron and Steel Production][no classification][Emissions][CO2][kt][no source][no method][no target][no option][no type]
type: Concept
definition: 2.C.1.f [Other Iron and Steel Production][no classification][Emissions][CO2][kt][no source][no method][no target][no option][no type]
status: valid
status modified: 2017-02-13
accepted date: 2017-02-13
in scheme: IPCC_variables_MMR

2.C.2 [Ferroalloys Production][no classification][Emissions][CH4][kt][no source][no method][no target][no option][no type]
type: Concept
definition: 2.C.2 [Ferroalloys Production][no classification][Emissions][CH4][kt][no source][no method][no target][no option][no type]
status: valid
status modified: 2017-02-13
accepted date: 2017-02-13
in scheme: IPCC_variables_MMR

2.C.2 [Ferroalloys Production][no classification][Emissions][CO2][kt][no source][no method][no target][no option][no type]
type: Concept
definition: 2.C.2 [Ferroalloys Production][no classification][Emissions][CO2][kt][no source][no method][no target][no option][no type]
status: valid
status modified: 2017-02-13
accepted date: 2017-02-13
in scheme: IPCC_variables_MMR

2.C.3 [Aluminium Production][no classification][Emissions][C2F6][t][no source][no method][no target][no option][no type]
type: Concept
definition: 2.C.3 [Aluminium Production][no classification][Emissions][C2F6][t][no source][no method][no target][no option][no type]
status: valid
status modified: 2017-02-13
accepted date: 2017-02-13
in scheme: IPCC_variables_MMR

2.C.3 [Aluminium Production][no classification][Emissions][CF4][t][no source][no method][no target][no option][no type]
type: Concept
definition: 2.C.3 [Aluminium Production][no classification][Emissions][CF4][t][no source][no method][no target][no option][no type]
status: valid
status modified: 2017-02-13
accepted date: 2017-02-13
in scheme: IPCC_variables_MMR

2.C.3 [Aluminium Production][no classification][Emissions][CO2][kt][no source][no method][no target][no option][no type]
type: Concept
definition: 2.C.3 [Aluminium Production][no classification][Emissions][CO2][kt][no source][no method][no target][no option][no type]
status: valid
status modified: 2017-02-13
accepted date: 2017-02-13
in scheme: IPCC_variables_MMR

2.C.3 [Aluminium Production][no classification][Emissions][PFCs][kt CO2 equivalent][no source][no method][no target][no option][no type]
type: Concept
definition: 2.C.3 [Aluminium Production][no classification][Emissions][PFCs][kt CO2 equivalent][no source][no method][no target][no option][no type]
status: valid
status modified: 2017-02-13
accepted date: 2017-02-13
in scheme: IPCC_variables_MMR

2.C.3 [Aluminium Production][no classification][Emissions][SF6][t][no source][no method][no target][no option][no type]
type: Concept
definition: 2.C.3 [Aluminium Production][no classification][Emissions][SF6][t][no source][no method][no target][no option][no type]
status: valid
status modified: 2017-02-13
accepted date: 2017-02-13
in scheme: IPCC_variables_MMR

2.C.3.a [CO2 Emissions][no classification][Emissions][CO2][kt][no source][no method][no target][no option][no type]
type: Concept
definition: 2.C.3.a [CO2 Emissions][no classification][Emissions][CO2][kt][no source][no method][no target][no option][no type]
status: valid
status modified: 2017-02-13
accepted date: 2017-02-13
in scheme: IPCC_variables_MMR

2.C.3.b [By-Product Production][no classification][Emissions][PFCs][t CO2 equivalent][no source][no method][no target][no option][no type]
type: Concept
definition: 2.C.3.b [By-Product Production][no classification][Emissions][PFCs][t CO2 equivalent][no source][no method][no target][no option][no type]
status: valid
status modified: 2017-02-13
accepted date: 2017-02-13
in scheme: IPCC_variables_MMR

2.C.4 [Magnesium Production][no classification][Emissions][CO2][kt][no source][no method][no target][no option][no type]
type: Concept
definition: 2.C.4 [Magnesium Production][no classification][Emissions][CO2][kt][no source][no method][no target][no option][no type]
status: valid
status modified: 2017-02-13
accepted date: 2017-02-13
in scheme: IPCC_variables_MMR

2.C.5 [Lead Production][no classification][Emissions][CO2][kt][no source][no method][no target][no option][no type]
type: Concept
definition: 2.C.5 [Lead Production][no classification][Emissions][CO2][kt][no source][no method][no target][no option][no type]
status: valid
status modified: 2017-02-13
accepted date: 2017-02-13
in scheme: IPCC_variables_MMR

2.C.6 [Zinc Production][no classification][Emissions][CO2][kt][no source][no method][no target][no option][no type]
type: Concept
definition: 2.C.6 [Zinc Production][no classification][Emissions][CO2][kt][no source][no method][no target][no option][no type]
status: valid
status modified: 2017-02-13
accepted date: 2017-02-13
in scheme: IPCC_variables_MMR

2.D.1 [Lubricant Use][no classification][Emissions][CO2][kt][no source][no method][no target][no option][no type]
type: Concept
definition: 2.D.1 [Lubricant Use][no classification][Emissions][CO2][kt][no source][no method][no target][no option][no type]
status: valid
status modified: 2017-02-13
accepted date: 2017-02-13
in scheme: IPCC_variables_MMR

2.D.2 [Paraffin Wax Use][no classification][Emissions][CO2][kt][no source][no method][no target][no option][no type]
type: Concept
definition: 2.D.2 [Paraffin Wax Use][no classification][Emissions][CO2][kt][no source][no method][no target][no option][no type]
status: valid
status modified: 2017-02-13
accepted date: 2017-02-13
in scheme: IPCC_variables_MMR

2.D.3 [Other non energy products][no classification][Emissions][CO2][kt][no source][no method][no target][no option][no type]
type: Concept
definition: 2.D.3 [Other non energy products][no classification][Emissions][CO2][kt][no source][no method][no target][no option][no type]
status: valid
status modified: 2017-02-13
accepted date: 2017-02-13
in scheme: IPCC_variables_MMR

2.E.1 [Integrated Circuit or Semiconductor][no classification][Emissions][HFCs][t CO2 equivalent][no source][no method][no target][no option][no type]
type: Concept
definition: 2.E.1 [Integrated Circuit or Semiconductor][no classification][Emissions][HFCs][t CO2 equivalent][no source][no method][no target][no option][no type]
status: valid
status modified: 2017-02-13
accepted date: 2017-02-13
in scheme: IPCC_variables_MMR

2.E.1 [Integrated Circuit or Semiconductor][no classification][Emissions][PFCs][t CO2 equivalent][no source][no method][no target][no option][no type]
type: Concept
definition: 2.E.1 [Integrated Circuit or Semiconductor][no classification][Emissions][PFCs][t CO2 equivalent][no source][no method][no target][no option][no type]
status: valid
status modified: 2017-02-13
accepted date: 2017-02-13
in scheme: IPCC_variables_MMR

2.E.2 [TFT Flat Panel Display][no classification][Emissions][PFCs][t CO2 equivalent][no source][no method][no target][no option][no type]
type: Concept
definition: 2.E.2 [TFT Flat Panel Display][no classification][Emissions][PFCs][t CO2 equivalent][no source][no method][no target][no option][no type]
status: valid
status modified: 2017-02-13
accepted date: 2017-02-13
in scheme: IPCC_variables_MMR

2.E.3 [Photovoltaics][no classification][Emissions][HFCs][t CO2 equivalent][no source][no method][no target][no option][no type]
type: Concept
definition: 2.E.3 [Photovoltaics][no classification][Emissions][HFCs][t CO2 equivalent][no source][no method][no target][no option][no type]
status: valid
status modified: 2017-02-13
accepted date: 2017-02-13
in scheme: IPCC_variables_MMR

2.E.3 [Photovoltaics][no classification][Emissions][PFCs][t CO2 equivalent][no source][no method][no target][no option][no type]
type: Concept
definition: 2.E.3 [Photovoltaics][no classification][Emissions][PFCs][t CO2 equivalent][no source][no method][no target][no option][no type]
status: valid
status modified: 2017-02-13
accepted date: 2017-02-13
in scheme: IPCC_variables_MMR

2.F.1 [Refrigeration and Air conditioning][no classification][Emissions][C10F18][t][no source][no method][no target][no option][no type]
type: Concept
definition: 2.F.1 [Refrigeration and Air conditioning][no classification][Emissions][C10F18][t][no source][no method][no target][no option][no type]
status: valid
status modified: 2017-02-13
accepted date: 2017-02-13
in scheme: IPCC_variables_MMR

2.F.1 [Refrigeration and Air conditioning][no classification][Emissions][C2F6][t][no source][no method][no target][no option][no type]
type: Concept
definition: 2.F.1 [Refrigeration and Air conditioning][no classification][Emissions][C2F6][t][no source][no method][no target][no option][no type]
status: valid
status modified: 2017-02-13
accepted date: 2017-02-13
in scheme: IPCC_variables_MMR

2.F.1 [Refrigeration and Air conditioning][no classification][Emissions][C3F8][t][no source][no method][no target][no option][no type]
type: Concept
definition: 2.F.1 [Refrigeration and Air conditioning][no classification][Emissions][C3F8][t][no source][no method][no target][no option][no type]
status: valid
status modified: 2017-02-13
accepted date: 2017-02-13
in scheme: IPCC_variables_MMR

2.F.1 [Refrigeration and Air conditioning][no classification][Emissions][C4F10][t][no source][no method][no target][no option][no type]
type: Concept
definition: 2.F.1 [Refrigeration and Air conditioning][no classification][Emissions][C4F10][t][no source][no method][no target][no option][no type]
status: valid
status modified: 2017-02-13
accepted date: 2017-02-13
in scheme: IPCC_variables_MMR

2.F.1 [Refrigeration and Air conditioning][no classification][Emissions][C5F12][t][no source][no method][no target][no option][no type]
type: Concept
definition: 2.F.1 [Refrigeration and Air conditioning][no classification][Emissions][C5F12][t][no source][no method][no target][no option][no type]
status: valid
status modified: 2017-02-13
accepted date: 2017-02-13
in scheme: IPCC_variables_MMR

2.F.1 [Refrigeration and Air conditioning][no classification][Emissions][C6F14][t][no source][no method][no target][no option][no type]
type: Concept
definition: 2.F.1 [Refrigeration and Air conditioning][no classification][Emissions][C6F14][t][no source][no method][no target][no option][no type]
status: valid
status modified: 2017-02-13
accepted date: 2017-02-13
in scheme: IPCC_variables_MMR

2.F.1 [Refrigeration and Air conditioning][no classification][Emissions][c-C3F6][t][no source][no method][no target][no option][no type]
type: Concept
definition: 2.F.1 [Refrigeration and Air conditioning][no classification][Emissions][c-C3F6][t][no source][no method][no target][no option][no type]
status: valid
status modified: 2017-02-13
accepted date: 2017-02-13
in scheme: IPCC_variables_MMR

2.F.1 [Refrigeration and Air conditioning][no classification][Emissions][c-C4F8][t][no source][no method][no target][no option][no type]
type: Concept
definition: 2.F.1 [Refrigeration and Air conditioning][no classification][Emissions][c-C4F8][t][no source][no method][no target][no option][no type]
status: valid
status modified: 2017-02-13
accepted date: 2017-02-13
in scheme: IPCC_variables_MMR

2.F.1 [Refrigeration and Air conditioning][no classification][Emissions][CF4][t][no source][no method][no target][no option][no type]
type: Concept
definition: 2.F.1 [Refrigeration and Air conditioning][no classification][Emissions][CF4][t][no source][no method][no target][no option][no type]
status: valid
status modified: 2017-02-13
accepted date: 2017-02-13
in scheme: IPCC_variables_MMR

2.F.1 [Refrigeration and Air conditioning][no classification][Emissions][HFC-125][t][no source][no method][no target][no option][no type]
type: Concept
definition: 2.F.1 [Refrigeration and Air conditioning][no classification][Emissions][HFC-125][t][no source][no method][no target][no option][no type]
status: valid
status modified: 2017-02-13
accepted date: 2017-02-13
in scheme: IPCC_variables_MMR

2.F.1 [Refrigeration and Air conditioning][no classification][Emissions][HFC-134][t][no source][no method][no target][no option][no type]
type: Concept
definition: 2.F.1 [Refrigeration and Air conditioning][no classification][Emissions][HFC-134][t][no source][no method][no target][no option][no type]
status: valid
status modified: 2017-02-13
accepted date: 2017-02-13
in scheme: IPCC_variables_MMR

2.F.1 [Refrigeration and Air conditioning][no classification][Emissions][HFC-134a][t][no source][no method][no target][no option][no type]
type: Concept
definition: 2.F.1 [Refrigeration and Air conditioning][no classification][Emissions][HFC-134a][t][no source][no method][no target][no option][no type]
status: valid
status modified: 2017-02-13
accepted date: 2017-02-13
in scheme: IPCC_variables_MMR

2.F.1 [Refrigeration and Air conditioning][no classification][Emissions][HFC-143][t][no source][no method][no target][no option][no type]
type: Concept
definition: 2.F.1 [Refrigeration and Air conditioning][no classification][Emissions][HFC-143][t][no source][no method][no target][no option][no type]
status: valid
status modified: 2017-02-13
accepted date: 2017-02-13
in scheme: IPCC_variables_MMR

2.F.1 [Refrigeration and Air conditioning][no classification][Emissions][HFC-143a][t][no source][no method][no target][no option][no type]
type: Concept
definition: 2.F.1 [Refrigeration and Air conditioning][no classification][Emissions][HFC-143a][t][no source][no method][no target][no option][no type]
status: valid
status modified: 2017-02-13
accepted date: 2017-02-13
in scheme: IPCC_variables_MMR

2.F.1 [Refrigeration and Air conditioning][no classification][Emissions][HFC-152][t][no source][no method][no target][no option][no type]
type: Concept
definition: 2.F.1 [Refrigeration and Air conditioning][no classification][Emissions][HFC-152][t][no source][no method][no target][no option][no type]
status: valid
status modified: 2017-02-13
accepted date: 2017-02-13
in scheme: IPCC_variables_MMR

2.F.1 [Refrigeration and Air conditioning][no classification][Emissions][HFC-152a][t][no source][no method][no target][no option][no type]
type: Concept
definition: 2.F.1 [Refrigeration and Air conditioning][no classification][Emissions][HFC-152a][t][no source][no method][no target][no option][no type]
status: valid
status modified: 2017-02-13
accepted date: 2017-02-13
in scheme: IPCC_variables_MMR

2.F.1 [Refrigeration and Air conditioning][no classification][Emissions][HFC-161][t][no source][no method][no target][no option][no type]
type: Concept
definition: 2.F.1 [Refrigeration and Air conditioning][no classification][Emissions][HFC-161][t][no source][no method][no target][no option][no type]
status: valid
status modified: 2017-02-13
accepted date: 2017-02-13
in scheme: IPCC_variables_MMR

2.F.1 [Refrigeration and Air conditioning][no classification][Emissions][HFC-227ea][t][no source][no method][no target][no option][no type]
type: Concept
definition: 2.F.1 [Refrigeration and Air conditioning][no classification][Emissions][HFC-227ea][t][no source][no method][no target][no option][no type]
status: valid
status modified: 2017-02-13
accepted date: 2017-02-13
in scheme: IPCC_variables_MMR

2.F.1 [Refrigeration and Air conditioning][no classification][Emissions][HFC-23][t][no source][no method][no target][no option][no type]
type: Concept
definition: 2.F.1 [Refrigeration and Air conditioning][no classification][Emissions][HFC-23][t][no source][no method][no target][no option][no type]
status: valid
status modified: 2017-02-13
accepted date: 2017-02-13
in scheme: IPCC_variables_MMR

2.F.1 [Refrigeration and Air conditioning][no classification][Emissions][HFC-236cb][t][no source][no method][no target][no option][no type]
type: Concept
definition: 2.F.1 [Refrigeration and Air conditioning][no classification][Emissions][HFC-236cb][t][no source][no method][no target][no option][no type]
status: valid
status modified: 2017-02-13
accepted date: 2017-02-13
in scheme: IPCC_variables_MMR

2.F.1 [Refrigeration and Air conditioning][no classification][Emissions][HFC-236ea][t][no source][no method][no target][no option][no type]
type: Concept
definition: 2.F.1 [Refrigeration and Air conditioning][no classification][Emissions][HFC-236ea][t][no source][no method][no target][no option][no type]
status: valid
status modified: 2017-02-13
accepted date: 2017-02-13
in scheme: IPCC_variables_MMR

2.F.1 [Refrigeration and Air conditioning][no classification][Emissions][HFC-236fa][t][no source][no method][no target][no option][no type]
type: Concept
definition: 2.F.1 [Refrigeration and Air conditioning][no classification][Emissions][HFC-236fa][t][no source][no method][no target][no option][no type]
status: valid
status modified: 2017-02-13
accepted date: 2017-02-13
in scheme: IPCC_variables_MMR

2.F.1 [Refrigeration and Air conditioning][no classification][Emissions][HFC-245ca][t][no source][no method][no target][no option][no type]
type: Concept
definition: 2.F.1 [Refrigeration and Air conditioning][no classification][Emissions][HFC-245ca][t][no source][no method][no target][no option][no type]
status: valid
status modified: 2017-02-13
accepted date: 2017-02-13
in scheme: IPCC_variables_MMR

2.F.1 [Refrigeration and Air conditioning][no classification][Emissions][HFC-245fa][t][no source][no method][no target][no option][no type]
type: Concept
definition: 2.F.1 [Refrigeration and Air conditioning][no classification][Emissions][HFC-245fa][t][no source][no method][no target][no option][no type]
status: valid
status modified: 2017-02-13
accepted date: 2017-02-13
in scheme: IPCC_variables_MMR

2.F.1 [Refrigeration and Air conditioning][no classification][Emissions][HFC-32][t][no source][no method][no target][no option][no type]
type: Concept
definition: 2.F.1 [Refrigeration and Air conditioning][no classification][Emissions][HFC-32][t][no source][no method][no target][no option][no type]
status: valid
status modified: 2017-02-13
accepted date: 2017-02-13
in scheme: IPCC_variables_MMR

2.F.1 [Refrigeration and Air conditioning][no classification][Emissions][HFC-365mfc][t][no source][no method][no target][no option][no type]
type: Concept
definition: 2.F.1 [Refrigeration and Air conditioning][no classification][Emissions][HFC-365mfc][t][no source][no method][no target][no option][no type]
status: valid
status modified: 2017-02-13
accepted date: 2017-02-13
in scheme: IPCC_variables_MMR

2.F.1 [Refrigeration and Air conditioning][no classification][Emissions][HFC-41][t][no source][no method][no target][no option][no type]
type: Concept
definition: 2.F.1 [Refrigeration and Air conditioning][no classification][Emissions][HFC-41][t][no source][no method][no target][no option][no type]
status: valid
status modified: 2017-02-13
accepted date: 2017-02-13
in scheme: IPCC_variables_MMR

2.F.1 [Refrigeration and Air conditioning][no classification][Emissions][HFC-43-10mee][t][no source][no method][no target][no option][no type]
type: Concept
definition: 2.F.1 [Refrigeration and Air conditioning][no classification][Emissions][HFC-43-10mee][t][no source][no method][no target][no option][no type]
status: valid
status modified: 2017-02-13
accepted date: 2017-02-13
in scheme: IPCC_variables_MMR

2.F.1 [Refrigeration and Air conditioning][no classification][Emissions][HFCs][t CO2 equivalent][no source][no method][no target][no option][no type]
type: Concept
definition: 2.F.1 [Refrigeration and Air conditioning][no classification][Emissions][HFCs][t CO2 equivalent][no source][no method][no target][no option][no type]
status: valid
status modified: 2017-02-13
accepted date: 2017-02-13
in scheme: IPCC_variables_MMR

2.F.1 [Refrigeration and Air conditioning][no classification][Emissions][NF3][t][no source][no method][no target][no option][no type]
type: Concept
definition: 2.F.1 [Refrigeration and Air conditioning][no classification][Emissions][NF3][t][no source][no method][no target][no option][no type]
status: valid
status modified: 2017-02-13
accepted date: 2017-02-13
in scheme: IPCC_variables_MMR

2.F.1 [Refrigeration and Air conditioning][no classification][Emissions][PFCs][t CO2 equivalent][no source][no method][no target][no option][no type]
type: Concept
definition: 2.F.1 [Refrigeration and Air conditioning][no classification][Emissions][PFCs][t CO2 equivalent][no source][no method][no target][no option][no type]
status: valid
status modified: 2017-02-13
accepted date: 2017-02-13
in scheme: IPCC_variables_MMR

2.F.1 [Refrigeration and Air conditioning][no classification][Emissions][SF6][t][no source][no method][no target][no option][no type]
type: Concept
definition: 2.F.1 [Refrigeration and Air conditioning][no classification][Emissions][SF6][t][no source][no method][no target][no option][no type]
status: valid
status modified: 2017-02-13
accepted date: 2017-02-13
in scheme: IPCC_variables_MMR

2.F.1 [Refrigeration and Air conditioning][no classification][Emissions][Unspecified mix of HFCs][t CO2 equivalent][no source][no method][no target][no option][no type]
type: Concept
definition: 2.F.1 [Refrigeration and Air conditioning][no classification][Emissions][Unspecified mix of HFCs][t CO2 equivalent][no source][no method][no target][no option][no type]
status: valid
status modified: 2017-02-13
accepted date: 2017-02-13
in scheme: IPCC_variables_MMR

2.F.1 [Refrigeration and Air conditioning][no classification][Emissions][Unspecified mix of PFCs][t CO2 equivalent][no source][no method][no target][no option][no type]
type: Concept
definition: 2.F.1 [Refrigeration and Air conditioning][no classification][Emissions][Unspecified mix of PFCs][t CO2 equivalent][no source][no method][no target][no option][no type]
status: valid
status modified: 2017-02-13
accepted date: 2017-02-13
in scheme: IPCC_variables_MMR

2.F.2 [Foam Blowing Agents][no classification][Emissions][C10F18][t][no source][no method][no target][no option][no type]
type: Concept
definition: 2.F.2 [Foam Blowing Agents][no classification][Emissions][C10F18][t][no source][no method][no target][no option][no type]
status: valid
status modified: 2017-02-13
accepted date: 2017-02-13
in scheme: IPCC_variables_MMR

2.F.2 [Foam Blowing Agents][no classification][Emissions][C2F6][t][no source][no method][no target][no option][no type]
type: Concept
definition: 2.F.2 [Foam Blowing Agents][no classification][Emissions][C2F6][t][no source][no method][no target][no option][no type]
status: valid
status modified: 2017-02-13
accepted date: 2017-02-13
in scheme: IPCC_variables_MMR

2.F.2 [Foam Blowing Agents][no classification][Emissions][C3F8][t][no source][no method][no target][no option][no type]
type: Concept
definition: 2.F.2 [Foam Blowing Agents][no classification][Emissions][C3F8][t][no source][no method][no target][no option][no type]
status: valid
status modified: 2017-02-13
accepted date: 2017-02-13
in scheme: IPCC_variables_MMR

2.F.2 [Foam Blowing Agents][no classification][Emissions][C4F10][t][no source][no method][no target][no option][no type]
type: Concept
definition: 2.F.2 [Foam Blowing Agents][no classification][Emissions][C4F10][t][no source][no method][no target][no option][no type]
status: valid
status modified: 2017-02-13
accepted date: 2017-02-13
in scheme: IPCC_variables_MMR

2.F.2 [Foam Blowing Agents][no classification][Emissions][C5F12][t][no source][no method][no target][no option][no type]
type: Concept
definition: 2.F.2 [Foam Blowing Agents][no classification][Emissions][C5F12][t][no source][no method][no target][no option][no type]
status: valid
status modified: 2017-02-13
accepted date: 2017-02-13
in scheme: IPCC_variables_MMR

2.F.2 [Foam Blowing Agents][no classification][Emissions][C6F14][t][no source][no method][no target][no option][no type]
type: Concept
definition: 2.F.2 [Foam Blowing Agents][no classification][Emissions][C6F14][t][no source][no method][no target][no option][no type]
status: valid
status modified: 2017-02-13
accepted date: 2017-02-13
in scheme: IPCC_variables_MMR

2.F.2 [Foam Blowing Agents][no classification][Emissions][c-C3F6][t][no source][no method][no target][no option][no type]
type: Concept
definition: 2.F.2 [Foam Blowing Agents][no classification][Emissions][c-C3F6][t][no source][no method][no target][no option][no type]
status: valid
status modified: 2017-02-13
accepted date: 2017-02-13
in scheme: IPCC_variables_MMR

2.F.2 [Foam Blowing Agents][no classification][Emissions][c-C4F8][t][no source][no method][no target][no option][no type]
type: Concept
definition: 2.F.2 [Foam Blowing Agents][no classification][Emissions][c-C4F8][t][no source][no method][no target][no option][no type]
status: valid
status modified: 2017-02-13
accepted date: 2017-02-13
in scheme: IPCC_variables_MMR

2.F.2 [Foam Blowing Agents][no classification][Emissions][CF4][t][no source][no method][no target][no option][no type]
type: Concept
definition: 2.F.2 [Foam Blowing Agents][no classification][Emissions][CF4][t][no source][no method][no target][no option][no type]
status: valid
status modified: 2017-02-13
accepted date: 2017-02-13
in scheme: IPCC_variables_MMR

2.F.2 [Foam Blowing Agents][no classification][Emissions][HFC-125][t][no source][no method][no target][no option][no type]
type: Concept
definition: 2.F.2 [Foam Blowing Agents][no classification][Emissions][HFC-125][t][no source][no method][no target][no option][no type]
status: valid
status modified: 2017-02-13
accepted date: 2017-02-13
in scheme: IPCC_variables_MMR

2.F.2 [Foam Blowing Agents][no classification][Emissions][HFC-134][t][no source][no method][no target][no option][no type]
type: Concept
definition: 2.F.2 [Foam Blowing Agents][no classification][Emissions][HFC-134][t][no source][no method][no target][no option][no type]
status: valid
status modified: 2017-02-13
accepted date: 2017-02-13
in scheme: IPCC_variables_MMR

2.F.2 [Foam Blowing Agents][no classification][Emissions][HFC-134a][t][no source][no method][no target][no option][no type]
type: Concept
definition: 2.F.2 [Foam Blowing Agents][no classification][Emissions][HFC-134a][t][no source][no method][no target][no option][no type]
status: valid
status modified: 2017-02-13
accepted date: 2017-02-13
in scheme: IPCC_variables_MMR

2.F.2 [Foam Blowing Agents][no classification][Emissions][HFC-143][t][no source][no method][no target][no option][no type]
type: Concept
definition: 2.F.2 [Foam Blowing Agents][no classification][Emissions][HFC-143][t][no source][no method][no target][no option][no type]
status: valid
status modified: 2017-02-13
accepted date: 2017-02-13
in scheme: IPCC_variables_MMR

2.F.2 [Foam Blowing Agents][no classification][Emissions][HFC-143a][t][no source][no method][no target][no option][no type]
type: Concept
definition: 2.F.2 [Foam Blowing Agents][no classification][Emissions][HFC-143a][t][no source][no method][no target][no option][no type]
status: valid
status modified: 2017-02-13
accepted date: 2017-02-13
in scheme: IPCC_variables_MMR

2.F.2 [Foam Blowing Agents][no classification][Emissions][HFC-152][t][no source][no method][no target][no option][no type]
type: Concept
definition: 2.F.2 [Foam Blowing Agents][no classification][Emissions][HFC-152][t][no source][no method][no target][no option][no type]
status: valid
status modified: 2017-02-13
accepted date: 2017-02-13
in scheme: IPCC_variables_MMR

2.F.2 [Foam Blowing Agents][no classification][Emissions][HFC-152a][t][no source][no method][no target][no option][no type]
type: Concept
definition: 2.F.2 [Foam Blowing Agents][no classification][Emissions][HFC-152a][t][no source][no method][no target][no option][no type]
status: valid
status modified: 2017-02-13
accepted date: 2017-02-13
in scheme: IPCC_variables_MMR

2.F.2 [Foam Blowing Agents][no classification][Emissions][HFC-161][t][no source][no method][no target][no option][no type]
type: Concept
definition: 2.F.2 [Foam Blowing Agents][no classification][Emissions][HFC-161][t][no source][no method][no target][no option][no type]
status: valid
status modified: 2017-02-13
accepted date: 2017-02-13
in scheme: IPCC_variables_MMR

2.F.2 [Foam Blowing Agents][no classification][Emissions][HFC-227ea][t][no source][no method][no target][no option][no type]
type: Concept
definition: 2.F.2 [Foam Blowing Agents][no classification][Emissions][HFC-227ea][t][no source][no method][no target][no option][no type]
status: valid
status modified: 2017-02-13
accepted date: 2017-02-13
in scheme: IPCC_variables_MMR

2.F.2 [Foam Blowing Agents][no classification][Emissions][HFC-23][t][no source][no method][no target][no option][no type]
type: Concept
definition: 2.F.2 [Foam Blowing Agents][no classification][Emissions][HFC-23][t][no source][no method][no target][no option][no type]
status: valid
status modified: 2017-02-13
accepted date: 2017-02-13
in scheme: IPCC_variables_MMR

2.F.2 [Foam Blowing Agents][no classification][Emissions][HFC-236cb][t][no source][no method][no target][no option][no type]
type: Concept
definition: 2.F.2 [Foam Blowing Agents][no classification][Emissions][HFC-236cb][t][no source][no method][no target][no option][no type]
status: valid
status modified: 2017-02-13
accepted date: 2017-02-13
in scheme: IPCC_variables_MMR

2.F.2 [Foam Blowing Agents][no classification][Emissions][HFC-236ea][t][no source][no method][no target][no option][no type]
type: Concept
definition: 2.F.2 [Foam Blowing Agents][no classification][Emissions][HFC-236ea][t][no source][no method][no target][no option][no type]
status: valid
status modified: 2017-02-13
accepted date: 2017-02-13
in scheme: IPCC_variables_MMR

2.F.2 [Foam Blowing Agents][no classification][Emissions][HFC-236fa][t][no source][no method][no target][no option][no type]
type: Concept
definition: 2.F.2 [Foam Blowing Agents][no classification][Emissions][HFC-236fa][t][no source][no method][no target][no option][no type]
status: valid
status modified: 2017-02-13
accepted date: 2017-02-13
in scheme: IPCC_variables_MMR

2.F.2 [Foam Blowing Agents][no classification][Emissions][HFC-245ca][t][no source][no method][no target][no option][no type]
type: Concept
definition: 2.F.2 [Foam Blowing Agents][no classification][Emissions][HFC-245ca][t][no source][no method][no target][no option][no type]
status: valid
status modified: 2017-02-13
accepted date: 2017-02-13
in scheme: IPCC_variables_MMR

2.F.2 [Foam Blowing Agents][no classification][Emissions][HFC-245fa][t][no source][no method][no target][no option][no type]
type: Concept
definition: 2.F.2 [Foam Blowing Agents][no classification][Emissions][HFC-245fa][t][no source][no method][no target][no option][no type]
status: valid
status modified: 2017-02-13
accepted date: 2017-02-13
in scheme: IPCC_variables_MMR

2.F.2 [Foam Blowing Agents][no classification][Emissions][HFC-32][t][no source][no method][no target][no option][no type]
type: Concept
definition: 2.F.2 [Foam Blowing Agents][no classification][Emissions][HFC-32][t][no source][no method][no target][no option][no type]
status: valid
status modified: 2017-02-13
accepted date: 2017-02-13
in scheme: IPCC_variables_MMR

2.F.2 [Foam Blowing Agents][no classification][Emissions][HFC-365mfc][t][no source][no method][no target][no option][no type]
type: Concept
definition: 2.F.2 [Foam Blowing Agents][no classification][Emissions][HFC-365mfc][t][no source][no method][no target][no option][no type]
status: valid
status modified: 2017-02-13
accepted date: 2017-02-13
in scheme: IPCC_variables_MMR

2.F.2 [Foam Blowing Agents][no classification][Emissions][HFC-41][t][no source][no method][no target][no option][no type]
type: Concept
definition: 2.F.2 [Foam Blowing Agents][no classification][Emissions][HFC-41][t][no source][no method][no target][no option][no type]
status: valid
status modified: 2017-02-13
accepted date: 2017-02-13
in scheme: IPCC_variables_MMR

2.F.2 [Foam Blowing Agents][no classification][Emissions][HFC-43-10mee][t][no source][no method][no target][no option][no type]
type: Concept
definition: 2.F.2 [Foam Blowing Agents][no classification][Emissions][HFC-43-10mee][t][no source][no method][no target][no option][no type]
status: valid
status modified: 2017-02-13
accepted date: 2017-02-13
in scheme: IPCC_variables_MMR

2.F.2 [Foam Blowing Agents][no classification][Emissions][HFCs][t CO2 equivalent][no source][no method][no target][no option][no type]
type: Concept
definition: 2.F.2 [Foam Blowing Agents][no classification][Emissions][HFCs][t CO2 equivalent][no source][no method][no target][no option][no type]
status: valid
status modified: 2017-02-13
accepted date: 2017-02-13
in scheme: IPCC_variables_MMR

2.F.2 [Foam Blowing Agents][no classification][Emissions][NF3][t][no source][no method][no target][no option][no type]
type: Concept
definition: 2.F.2 [Foam Blowing Agents][no classification][Emissions][NF3][t][no source][no method][no target][no option][no type]
status: valid
status modified: 2017-02-13
accepted date: 2017-02-13
in scheme: IPCC_variables_MMR

2.F.2 [Foam Blowing Agents][no classification][Emissions][PFCs][t CO2 equivalent][no source][no method][no target][no option][no type]
type: Concept
definition: 2.F.2 [Foam Blowing Agents][no classification][Emissions][PFCs][t CO2 equivalent][no source][no method][no target][no option][no type]
status: valid
status modified: 2017-02-13
accepted date: 2017-02-13
in scheme: IPCC_variables_MMR

2.F.2 [Foam Blowing Agents][no classification][Emissions][SF6][t][no source][no method][no target][no option][no type]
type: Concept
definition: 2.F.2 [Foam Blowing Agents][no classification][Emissions][SF6][t][no source][no method][no target][no option][no type]
status: valid
status modified: 2017-02-13
accepted date: 2017-02-13
in scheme: IPCC_variables_MMR

2.F.2 [Foam Blowing Agents][no classification][Emissions][Unspecified mix of HFCs][t CO2 equivalent][no source][no method][no target][no option][no type]
type: Concept
definition: 2.F.2 [Foam Blowing Agents][no classification][Emissions][Unspecified mix of HFCs][t CO2 equivalent][no source][no method][no target][no option][no type]
status: valid
status modified: 2017-02-13
accepted date: 2017-02-13
in scheme: IPCC_variables_MMR

2.F.2 [Foam Blowing Agents][no classification][Emissions][Unspecified mix of PFCs][t CO2 equivalent][no source][no method][no target][no option][no type]
type: Concept
definition: 2.F.2 [Foam Blowing Agents][no classification][Emissions][Unspecified mix of PFCs][t CO2 equivalent][no source][no method][no target][no option][no type]
status: valid
status modified: 2017-02-13
accepted date: 2017-02-13
in scheme: IPCC_variables_MMR

2.F.3 [Fire Protection][no classification][Emissions][HFCs][t CO2 equivalent][no source][no method][no target][no option][no type]
type: Concept
definition: 2.F.3 [Fire Protection][no classification][Emissions][HFCs][t CO2 equivalent][no source][no method][no target][no option][no type]
status: valid
status modified: 2017-02-13
accepted date: 2017-02-13
in scheme: IPCC_variables_MMR

2.F.3 [Fire Protection][no classification][Emissions][PFCs][t CO2 equivalent][no source][no method][no target][no option][no type]
type: Concept
definition: 2.F.3 [Fire Protection][no classification][Emissions][PFCs][t CO2 equivalent][no source][no method][no target][no option][no type]
status: valid
status modified: 2017-02-13
accepted date: 2017-02-13
in scheme: IPCC_variables_MMR

2.F.4 [Aerosols][no classification][Emissions][C10F18][t][no source][no method][no target][no option][no type]
type: Concept
definition: 2.F.4 [Aerosols][no classification][Emissions][C10F18][t][no source][no method][no target][no option][no type]
status: valid
status modified: 2017-02-13
accepted date: 2017-02-13
in scheme: IPCC_variables_MMR

2.F.4 [Aerosols][no classification][Emissions][C2F6][t][no source][no method][no target][no option][no type]
type: Concept
definition: 2.F.4 [Aerosols][no classification][Emissions][C2F6][t][no source][no method][no target][no option][no type]
status: valid
status modified: 2017-02-13
accepted date: 2017-02-13
in scheme: IPCC_variables_MMR

2.F.4 [Aerosols][no classification][Emissions][C3F8][t][no source][no method][no target][no option][no type]
type: Concept
definition: 2.F.4 [Aerosols][no classification][Emissions][C3F8][t][no source][no method][no target][no option][no type]
status: valid
status modified: 2017-02-13
accepted date: 2017-02-13
in scheme: IPCC_variables_MMR

2.F.4 [Aerosols][no classification][Emissions][C4F10][t][no source][no method][no target][no option][no type]
type: Concept
definition: 2.F.4 [Aerosols][no classification][Emissions][C4F10][t][no source][no method][no target][no option][no type]
status: valid
status modified: 2017-02-13
accepted date: 2017-02-13
in scheme: IPCC_variables_MMR

2.F.4 [Aerosols][no classification][Emissions][C5F12][t][no source][no method][no target][no option][no type]
type: Concept
definition: 2.F.4 [Aerosols][no classification][Emissions][C5F12][t][no source][no method][no target][no option][no type]
status: valid
status modified: 2017-02-13
accepted date: 2017-02-13
in scheme: IPCC_variables_MMR

2.F.4 [Aerosols][no classification][Emissions][C6F14][t][no source][no method][no target][no option][no type]
type: Concept
definition: 2.F.4 [Aerosols][no classification][Emissions][C6F14][t][no source][no method][no target][no option][no type]
status: valid
status modified: 2017-02-13
accepted date: 2017-02-13
in scheme: IPCC_variables_MMR

2.F.4 [Aerosols][no classification][Emissions][c-C3F6][t][no source][no method][no target][no option][no type]
type: Concept
definition: 2.F.4 [Aerosols][no classification][Emissions][c-C3F6][t][no source][no method][no target][no option][no type]
status: valid
status modified: 2017-02-13
accepted date: 2017-02-13
in scheme: IPCC_variables_MMR

2.F.4 [Aerosols][no classification][Emissions][c-C4F8][t][no source][no method][no target][no option][no type]
type: Concept
definition: 2.F.4 [Aerosols][no classification][Emissions][c-C4F8][t][no source][no method][no target][no option][no type]
status: valid
status modified: 2017-02-13
accepted date: 2017-02-13
in scheme: IPCC_variables_MMR

2.F.4 [Aerosols][no classification][Emissions][CF4][t][no source][no method][no target][no option][no type]
type: Concept
definition: 2.F.4 [Aerosols][no classification][Emissions][CF4][t][no source][no method][no target][no option][no type]
status: valid
status modified: 2017-02-13
accepted date: 2017-02-13
in scheme: IPCC_variables_MMR

2.F.4 [Aerosols][no classification][Emissions][HFC-125][t][no source][no method][no target][no option][no type]
type: Concept
definition: 2.F.4 [Aerosols][no classification][Emissions][HFC-125][t][no source][no method][no target][no option][no type]
status: valid
status modified: 2017-02-13
accepted date: 2017-02-13
in scheme: IPCC_variables_MMR

2.F.4 [Aerosols][no classification][Emissions][HFC-134][t][no source][no method][no target][no option][no type]
type: Concept
definition: 2.F.4 [Aerosols][no classification][Emissions][HFC-134][t][no source][no method][no target][no option][no type]
status: valid
status modified: 2017-02-13
accepted date: 2017-02-13
in scheme: IPCC_variables_MMR

2.F.4 [Aerosols][no classification][Emissions][HFC-134a][t][no source][no method][no target][no option][no type]
type: Concept
definition: 2.F.4 [Aerosols][no classification][Emissions][HFC-134a][t][no source][no method][no target][no option][no type]
status: valid
status modified: 2017-02-13
accepted date: 2017-02-13
in scheme: IPCC_variables_MMR

2.F.4 [Aerosols][no classification][Emissions][HFC-143][t][no source][no method][no target][no option][no type]
type: Concept
definition: 2.F.4 [Aerosols][no classification][Emissions][HFC-143][t][no source][no method][no target][no option][no type]
status: valid
status modified: 2017-02-13
accepted date: 2017-02-13
in scheme: IPCC_variables_MMR

2.F.4 [Aerosols][no classification][Emissions][HFC-143a][t][no source][no method][no target][no option][no type]
type: Concept
definition: 2.F.4 [Aerosols][no classification][Emissions][HFC-143a][t][no source][no method][no target][no option][no type]
status: valid
status modified: 2017-02-13
accepted date: 2017-02-13
in scheme: IPCC_variables_MMR

2.F.4 [Aerosols][no classification][Emissions][HFC-152][t][no source][no method][no target][no option][no type]
type: Concept
definition: 2.F.4 [Aerosols][no classification][Emissions][HFC-152][t][no source][no method][no target][no option][no type]
status: valid
status modified: 2017-02-13
accepted date: 2017-02-13
in scheme: IPCC_variables_MMR

2.F.4 [Aerosols][no classification][Emissions][HFC-152a][t][no source][no method][no target][no option][no type]
type: Concept
definition: 2.F.4 [Aerosols][no classification][Emissions][HFC-152a][t][no source][no method][no target][no option][no type]
status: valid
status modified: 2017-02-13
accepted date: 2017-02-13
in scheme: IPCC_variables_MMR

2.F.4 [Aerosols][no classification][Emissions][HFC-161][t][no source][no method][no target][no option][no type]
type: Concept
definition: 2.F.4 [Aerosols][no classification][Emissions][HFC-161][t][no source][no method][no target][no option][no type]
status: valid
status modified: 2017-02-13
accepted date: 2017-02-13
in scheme: IPCC_variables_MMR

2.F.4 [Aerosols][no classification][Emissions][HFC-227ea][t][no source][no method][no target][no option][no type]
type: Concept
definition: 2.F.4 [Aerosols][no classification][Emissions][HFC-227ea][t][no source][no method][no target][no option][no type]
status: valid
status modified: 2017-02-13
accepted date: 2017-02-13
in scheme: IPCC_variables_MMR

2.F.4 [Aerosols][no classification][Emissions][HFC-23][t][no source][no method][no target][no option][no type]
type: Concept
definition: 2.F.4 [Aerosols][no classification][Emissions][HFC-23][t][no source][no method][no target][no option][no type]
status: valid
status modified: 2017-02-13
accepted date: 2017-02-13
in scheme: IPCC_variables_MMR

2.F.4 [Aerosols][no classification][Emissions][HFC-236cb][t][no source][no method][no target][no option][no type]
type: Concept
definition: 2.F.4 [Aerosols][no classification][Emissions][HFC-236cb][t][no source][no method][no target][no option][no type]
status: valid
status modified: 2017-02-13
accepted date: 2017-02-13
in scheme: IPCC_variables_MMR

2.F.4 [Aerosols][no classification][Emissions][HFC-236ea][t][no source][no method][no target][no option][no type]
type: Concept
definition: 2.F.4 [Aerosols][no classification][Emissions][HFC-236ea][t][no source][no method][no target][no option][no type]
status: valid
status modified: 2017-02-13
accepted date: 2017-02-13
in scheme: IPCC_variables_MMR

2.F.4 [Aerosols][no classification][Emissions][HFC-236fa][t][no source][no method][no target][no option][no type]
type: Concept
definition: 2.F.4 [Aerosols][no classification][Emissions][HFC-236fa][t][no source][no method][no target][no option][no type]
status: valid
status modified: 2017-02-13
accepted date: 2017-02-13
in scheme: IPCC_variables_MMR

2.F.4 [Aerosols][no classification][Emissions][HFC-245ca][t][no source][no method][no target][no option][no type]
type: Concept
definition: 2.F.4 [Aerosols][no classification][Emissions][HFC-245ca][t][no source][no method][no target][no option][no type]
status: valid
status modified: 2017-02-13
accepted date: 2017-02-13
in scheme: IPCC_variables_MMR

2.F.4 [Aerosols][no classification][Emissions][HFC-245fa][t][no source][no method][no target][no option][no type]
type: Concept
definition: 2.F.4 [Aerosols][no classification][Emissions][HFC-245fa][t][no source][no method][no target][no option][no type]
status: valid
status modified: 2017-02-13
accepted date: 2017-02-13
in scheme: IPCC_variables_MMR

2.F.4 [Aerosols][no classification][Emissions][HFC-32][t][no source][no method][no target][no option][no type]
type: Concept
definition: 2.F.4 [Aerosols][no classification][Emissions][HFC-32][t][no source][no method][no target][no option][no type]
status: valid
status modified: 2017-02-13
accepted date: 2017-02-13
in scheme: IPCC_variables_MMR

2.F.4 [Aerosols][no classification][Emissions][HFC-365mfc][t][no source][no method][no target][no option][no type]
type: Concept
definition: 2.F.4 [Aerosols][no classification][Emissions][HFC-365mfc][t][no source][no method][no target][no option][no type]
status: valid
status modified: 2017-02-13
accepted date: 2017-02-13
in scheme: IPCC_variables_MMR

2.F.4 [Aerosols][no classification][Emissions][HFC-41][t][no source][no method][no target][no option][no type]
type: Concept
definition: 2.F.4 [Aerosols][no classification][Emissions][HFC-41][t][no source][no method][no target][no option][no type]
status: valid
status modified: 2017-02-13
accepted date: 2017-02-13
in scheme: IPCC_variables_MMR

2.F.4 [Aerosols][no classification][Emissions][HFC-43-10mee][t][no source][no method][no target][no option][no type]
type: Concept
definition: 2.F.4 [Aerosols][no classification][Emissions][HFC-43-10mee][t][no source][no method][no target][no option][no type]
status: valid
status modified: 2017-02-13
accepted date: 2017-02-13
in scheme: IPCC_variables_MMR

2.F.4 [Aerosols][no classification][Emissions][HFCs][t CO2 equivalent][no source][no method][no target][no option][no type]
type: Concept
definition: 2.F.4 [Aerosols][no classification][Emissions][HFCs][t CO2 equivalent][no source][no method][no target][no option][no type]
status: valid
status modified: 2017-02-13
accepted date: 2017-02-13
in scheme: IPCC_variables_MMR

2.F.4 [Aerosols][no classification][Emissions][NF3][t][no source][no method][no target][no option][no type]
type: Concept
definition: 2.F.4 [Aerosols][no classification][Emissions][NF3][t][no source][no method][no target][no option][no type]
status: valid
status modified: 2017-02-13
accepted date: 2017-02-13
in scheme: IPCC_variables_MMR

2.F.4 [Aerosols][no classification][Emissions][PFCs][t CO2 equivalent][no source][no method][no target][no option][no type]
type: Concept
definition: 2.F.4 [Aerosols][no classification][Emissions][PFCs][t CO2 equivalent][no source][no method][no target][no option][no type]
status: valid
status modified: 2017-02-13
accepted date: 2017-02-13
in scheme: IPCC_variables_MMR

2.F.4 [Aerosols][no classification][Emissions][SF6][t][no source][no method][no target][no option][no type]
type: Concept
definition: 2.F.4 [Aerosols][no classification][Emissions][SF6][t][no source][no method][no target][no option][no type]
status: valid
status modified: 2017-02-13
accepted date: 2017-02-13
in scheme: IPCC_variables_MMR

2.F.4 [Aerosols][no classification][Emissions][Unspecified mix of HFCs][t CO2 equivalent][no source][no method][no target][no option][no type]
type: Concept
definition: 2.F.4 [Aerosols][no classification][Emissions][Unspecified mix of HFCs][t CO2 equivalent][no source][no method][no target][no option][no type]
status: valid
status modified: 2017-02-13
accepted date: 2017-02-13
in scheme: IPCC_variables_MMR

2.F.4 [Aerosols][no classification][Emissions][Unspecified mix of PFCs][t CO2 equivalent][no source][no method][no target][no option][no type]
type: Concept
definition: 2.F.4 [Aerosols][no classification][Emissions][Unspecified mix of PFCs][t CO2 equivalent][no source][no method][no target][no option][no type]
status: valid
status modified: 2017-02-13
accepted date: 2017-02-13
in scheme: IPCC_variables_MMR

2.F.5 [Solvents][no classification][Emissions][HFCs][t CO2 equivalent][no source][no method][no target][no option][no type]
type: Concept
definition: 2.F.5 [Solvents][no classification][Emissions][HFCs][t CO2 equivalent][no source][no method][no target][no option][no type]
status: valid
status modified: 2017-02-13
accepted date: 2017-02-13
in scheme: IPCC_variables_MMR

2.F.5 [Solvents][no classification][Emissions][PFCs][t CO2 equivalent][no source][no method][no target][no option][no type]
type: Concept
definition: 2.F.5 [Solvents][no classification][Emissions][PFCs][t CO2 equivalent][no source][no method][no target][no option][no type]
status: valid
status modified: 2017-02-13
accepted date: 2017-02-13
in scheme: IPCC_variables_MMR

2.F.6 [Other Applications][no classification][Emissions][C10F18][t][no source][no method][no target][no option][no type]
type: Concept
definition: 2.F.6 [Other Applications][no classification][Emissions][C10F18][t][no source][no method][no target][no option][no type]
status: valid
status modified: 2017-02-13
accepted date: 2017-02-13
in scheme: IPCC_variables_MMR

2.F.6 [Other Applications][no classification][Emissions][C2F6][t][no source][no method][no target][no option][no type]
type: Concept
definition: 2.F.6 [Other Applications][no classification][Emissions][C2F6][t][no source][no method][no target][no option][no type]
status: valid
status modified: 2017-02-13
accepted date: 2017-02-13
in scheme: IPCC_variables_MMR

2.F.6 [Other Applications][no classification][Emissions][C3F8][t][no source][no method][no target][no option][no type]
type: Concept
definition: 2.F.6 [Other Applications][no classification][Emissions][C3F8][t][no source][no method][no target][no option][no type]
status: valid
status modified: 2017-02-13
accepted date: 2017-02-13
in scheme: IPCC_variables_MMR

2.F.6 [Other Applications][no classification][Emissions][C4F10][t][no source][no method][no target][no option][no type]
type: Concept
definition: 2.F.6 [Other Applications][no classification][Emissions][C4F10][t][no source][no method][no target][no option][no type]
status: valid
status modified: 2017-02-13
accepted date: 2017-02-13
in scheme: IPCC_variables_MMR

2.F.6 [Other Applications][no classification][Emissions][C5F12][t][no source][no method][no target][no option][no type]
type: Concept
definition: 2.F.6 [Other Applications][no classification][Emissions][C5F12][t][no source][no method][no target][no option][no type]
status: valid
status modified: 2017-02-13
accepted date: 2017-02-13
in scheme: IPCC_variables_MMR

2.F.6 [Other Applications][no classification][Emissions][C6F14][t][no source][no method][no target][no option][no type]
type: Concept
definition: 2.F.6 [Other Applications][no classification][Emissions][C6F14][t][no source][no method][no target][no option][no type]
status: valid
status modified: 2017-02-13
accepted date: 2017-02-13
in scheme: IPCC_variables_MMR

2.F.6 [Other Applications][no classification][Emissions][c-C3F6][t][no source][no method][no target][no option][no type]
type: Concept
definition: 2.F.6 [Other Applications][no classification][Emissions][c-C3F6][t][no source][no method][no target][no option][no type]
status: valid
status modified: 2017-02-13
accepted date: 2017-02-13
in scheme: IPCC_variables_MMR

2.F.6 [Other Applications][no classification][Emissions][c-C4F8][t][no source][no method][no target][no option][no type]
type: Concept
definition: 2.F.6 [Other Applications][no classification][Emissions][c-C4F8][t][no source][no method][no target][no option][no type]
status: valid
status modified: 2017-02-13
accepted date: 2017-02-13
in scheme: IPCC_variables_MMR

2.F.6 [Other Applications][no classification][Emissions][CF4][t][no source][no method][no target][no option][no type]
type: Concept
definition: 2.F.6 [Other Applications][no classification][Emissions][CF4][t][no source][no method][no target][no option][no type]
status: valid
status modified: 2017-02-13
accepted date: 2017-02-13
in scheme: IPCC_variables_MMR

2.F.6 [Other Applications][no classification][Emissions][HFC-125][t][no source][no method][no target][no option][no type]
type: Concept
definition: 2.F.6 [Other Applications][no classification][Emissions][HFC-125][t][no source][no method][no target][no option][no type]
status: valid
status modified: 2017-02-13
accepted date: 2017-02-13
in scheme: IPCC_variables_MMR

2.F.6 [Other Applications][no classification][Emissions][HFC-134][t][no source][no method][no target][no option][no type]
type: Concept
definition: 2.F.6 [Other Applications][no classification][Emissions][HFC-134][t][no source][no method][no target][no option][no type]
status: valid
status modified: 2017-02-13
accepted date: 2017-02-13
in scheme: IPCC_variables_MMR

2.F.6 [Other Applications][no classification][Emissions][HFC-134a][t][no source][no method][no target][no option][no type]
type: Concept
definition: 2.F.6 [Other Applications][no classification][Emissions][HFC-134a][t][no source][no method][no target][no option][no type]
status: valid
status modified: 2017-02-13
accepted date: 2017-02-13
in scheme: IPCC_variables_MMR

2.F.6 [Other Applications][no classification][Emissions][HFC-143][t][no source][no method][no target][no option][no type]
type: Concept
definition: 2.F.6 [Other Applications][no classification][Emissions][HFC-143][t][no source][no method][no target][no option][no type]
status: valid
status modified: 2017-02-13
accepted date: 2017-02-13
in scheme: IPCC_variables_MMR

2.F.6 [Other Applications][no classification][Emissions][HFC-143a][t][no source][no method][no target][no option][no type]
type: Concept
definition: 2.F.6 [Other Applications][no classification][Emissions][HFC-143a][t][no source][no method][no target][no option][no type]
status: valid
status modified: 2017-02-13
accepted date: 2017-02-13
in scheme: IPCC_variables_MMR

2.F.6 [Other Applications][no classification][Emissions][HFC-152][t][no source][no method][no target][no option][no type]
type: Concept
definition: 2.F.6 [Other Applications][no classification][Emissions][HFC-152][t][no source][no method][no target][no option][no type]
status: valid
status modified: 2017-02-13
accepted date: 2017-02-13
in scheme: IPCC_variables_MMR

2.F.6 [Other Applications][no classification][Emissions][HFC-152a][t][no source][no method][no target][no option][no type]
type: Concept
definition: 2.F.6 [Other Applications][no classification][Emissions][HFC-152a][t][no source][no method][no target][no option][no type]
status: valid
status modified: 2017-02-13
accepted date: 2017-02-13
in scheme: IPCC_variables_MMR

2.F.6 [Other Applications][no classification][Emissions][HFC-161][t][no source][no method][no target][no option][no type]
type: Concept
definition: 2.F.6 [Other Applications][no classification][Emissions][HFC-161][t][no source][no method][no target][no option][no type]
status: valid
status modified: 2017-02-13
accepted date: 2017-02-13
in scheme: IPCC_variables_MMR

2.F.6 [Other Applications][no classification][Emissions][HFC-227ea][t][no source][no method][no target][no option][no type]
type: Concept
definition: 2.F.6 [Other Applications][no classification][Emissions][HFC-227ea][t][no source][no method][no target][no option][no type]
status: valid
status modified: 2017-02-13
accepted date: 2017-02-13
in scheme: IPCC_variables_MMR

2.F.6 [Other Applications][no classification][Emissions][HFC-23][t][no source][no method][no target][no option][no type]
type: Concept
definition: 2.F.6 [Other Applications][no classification][Emissions][HFC-23][t][no source][no method][no target][no option][no type]
status: valid
status modified: 2017-02-13
accepted date: 2017-02-13
in scheme: IPCC_variables_MMR

2.F.6 [Other Applications][no classification][Emissions][HFC-236cb][t][no source][no method][no target][no option][no type]
type: Concept
definition: 2.F.6 [Other Applications][no classification][Emissions][HFC-236cb][t][no source][no method][no target][no option][no type]
status: valid
status modified: 2017-02-13
accepted date: 2017-02-13
in scheme: IPCC_variables_MMR

2.F.6 [Other Applications][no classification][Emissions][HFC-236ea][t][no source][no method][no target][no option][no type]
type: Concept
definition: 2.F.6 [Other Applications][no classification][Emissions][HFC-236ea][t][no source][no method][no target][no option][no type]
status: valid
status modified: 2017-02-13
accepted date: 2017-02-13
in scheme: IPCC_variables_MMR

2.F.6 [Other Applications][no classification][Emissions][HFC-236fa][t][no source][no method][no target][no option][no type]
type: Concept
definition: 2.F.6 [Other Applications][no classification][Emissions][HFC-236fa][t][no source][no method][no target][no option][no type]
status: valid
status modified: 2017-02-13
accepted date: 2017-02-13
in scheme: IPCC_variables_MMR

2.F.6 [Other Applications][no classification][Emissions][HFC-245ca][t][no source][no method][no target][no option][no type]
type: Concept
definition: 2.F.6 [Other Applications][no classification][Emissions][HFC-245ca][t][no source][no method][no target][no option][no type]
status: valid
status modified: 2017-02-13
accepted date: 2017-02-13
in scheme: IPCC_variables_MMR

2.F.6 [Other Applications][no classification][Emissions][HFC-245fa][t][no source][no method][no target][no option][no type]
type: Concept
definition: 2.F.6 [Other Applications][no classification][Emissions][HFC-245fa][t][no source][no method][no target][no option][no type]
status: valid
status modified: 2017-02-13
accepted date: 2017-02-13
in scheme: IPCC_variables_MMR

2.F.6 [Other Applications][no classification][Emissions][HFC-32][t][no source][no method][no target][no option][no type]
type: Concept
definition: 2.F.6 [Other Applications][no classification][Emissions][HFC-32][t][no source][no method][no target][no option][no type]
status: valid
status modified: 2017-02-13
accepted date: 2017-02-13
in scheme: IPCC_variables_MMR

2.F.6 [Other Applications][no classification][Emissions][HFC-365mfc][t][no source][no method][no target][no option][no type]
type: Concept
definition: 2.F.6 [Other Applications][no classification][Emissions][HFC-365mfc][t][no source][no method][no target][no option][no type]
status: valid
status modified: 2017-02-13
accepted date: 2017-02-13
in scheme: IPCC_variables_MMR

2.F.6 [Other Applications][no classification][Emissions][HFC-41][t][no source][no method][no target][no option][no type]
type: Concept
definition: 2.F.6 [Other Applications][no classification][Emissions][HFC-41][t][no source][no method][no target][no option][no type]
status: valid
status modified: 2017-02-13
accepted date: 2017-02-13
in scheme: IPCC_variables_MMR

2.F.6 [Other Applications][no classification][Emissions][HFC-43-10mee][t][no source][no method][no target][no option][no type]
type: Concept
definition: 2.F.6 [Other Applications][no classification][Emissions][HFC-43-10mee][t][no source][no method][no target][no option][no type]
status: valid
status modified: 2017-02-13
accepted date: 2017-02-13
in scheme: IPCC_variables_MMR

2.F.6 [Other Applications][no classification][Emissions][HFCs][t CO2 equivalent][no source][no method][no target][no option][no type]
type: Concept
definition: 2.F.6 [Other Applications][no classification][Emissions][HFCs][t CO2 equivalent][no source][no method][no target][no option][no type]
status: valid
status modified: 2017-02-13
accepted date: 2017-02-13
in scheme: IPCC_variables_MMR

2.F.6 [Other Applications][no classification][Emissions][NF3][t][no source][no method][no target][no option][no type]
type: Concept
definition: 2.F.6 [Other Applications][no classification][Emissions][NF3][t][no source][no method][no target][no option][no type]
status: valid
status modified: 2017-02-13
accepted date: 2017-02-13
in scheme: IPCC_variables_MMR

2.F.6 [Other Applications][no classification][Emissions][PFCs][t CO2 equivalent][no source][no method][no target][no option][no type]
type: Concept
definition: 2.F.6 [Other Applications][no classification][Emissions][PFCs][t CO2 equivalent][no source][no method][no target][no option][no type]
status: valid
status modified: 2017-02-13
accepted date: 2017-02-13
in scheme: IPCC_variables_MMR

2.F.6 [Other Applications][no classification][Emissions][SF6][t][no source][no method][no target][no option][no type]
type: Concept
definition: 2.F.6 [Other Applications][no classification][Emissions][SF6][t][no source][no method][no target][no option][no type]
status: valid
status modified: 2017-02-13
accepted date: 2017-02-13
in scheme: IPCC_variables_MMR

2.F.6 [Other Applications][no classification][Emissions][Unspecified mix of HFCs][t CO2 equivalent][no source][no method][no target][no option][no type]
type: Concept
definition: 2.F.6 [Other Applications][no classification][Emissions][Unspecified mix of HFCs][t CO2 equivalent][no source][no method][no target][no option][no type]
status: valid
status modified: 2017-02-13
accepted date: 2017-02-13
in scheme: IPCC_variables_MMR

2.F.6 [Other Applications][no classification][Emissions][Unspecified mix of PFCs][t CO2 equivalent][no source][no method][no target][no option][no type]
type: Concept
definition: 2.F.6 [Other Applications][no classification][Emissions][Unspecified mix of PFCs][t CO2 equivalent][no source][no method][no target][no option][no type]
status: valid
status modified: 2017-02-13
accepted date: 2017-02-13
in scheme: IPCC_variables_MMR

2.G [Other Product Manufacture and Use][no classification][Emissions][HFCs][t CO2 equivalent][no source][no method][no target][no option][no type]
type: Concept
definition: 2.G [Other Product Manufacture and Use][no classification][Emissions][HFCs][t CO2 equivalent][no source][no method][no target][no option][no type]
status: valid
status modified: 2017-02-13
accepted date: 2017-02-13
in scheme: IPCC_variables_MMR

2.G [Other Product Manufacture and Use][no classification][Emissions][NF3][kt][no source][no method][no target][no option][no type]
type: Concept
definition: 2.G [Other Product Manufacture and Use][no classification][Emissions][NF3][kt][no source][no method][no target][no option][no type]
status: valid
status modified: 2017-02-13
accepted date: 2017-02-13
in scheme: IPCC_variables_MMR

2.G [Other Product Manufacture and Use][no classification][Emissions][PFCs][t CO2 equivalent][no source][no method][no target][no option][no type]
type: Concept
definition: 2.G [Other Product Manufacture and Use][no classification][Emissions][PFCs][t CO2 equivalent][no source][no method][no target][no option][no type]
status: valid
status modified: 2017-02-13
accepted date: 2017-02-13
in scheme: IPCC_variables_MMR

2.G [Other Product Manufacture and Use][no classification][Emissions][SF6][kt][no source][no method][no target][no option][no type]
type: Concept
definition: 2.G [Other Product Manufacture and Use][no classification][Emissions][SF6][kt][no source][no method][no target][no option][no type]
status: valid
status modified: 2017-02-13
accepted date: 2017-02-13
in scheme: IPCC_variables_MMR

2.G [Other Product Manufacture and Use][no classification][Emissions][Unspecified mix of HFCs][t CO2 equivalent][no source][no method][no target][no option][no type]
type: Concept
definition: 2.G [Other Product Manufacture and Use][no classification][Emissions][Unspecified mix of HFCs][t CO2 equivalent][no source][no method][no target][no option][no type]
status: valid
status modified: 2017-02-13
accepted date: 2017-02-13
in scheme: IPCC_variables_MMR

2.G [Other Product Manufacture and Use][no classification][Emissions][Unspecified mix of PFCs][t CO2 equivalent][no source][no method][no target][no option][no type]
type: Concept
definition: 2.G [Other Product Manufacture and Use][no classification][Emissions][Unspecified mix of PFCs][t CO2 equivalent][no source][no method][no target][no option][no type]
status: valid
status modified: 2017-02-13
accepted date: 2017-02-13
in scheme: IPCC_variables_MMR

2.G.2 [SF6 and PFCs from Other Product Use][no classification][Emissions][SF6][t][no source][no method][no target][no option][no type]
type: Concept
definition: 2.G.2 [SF6 and PFCs from Other Product Use][no classification][Emissions][SF6][t][no source][no method][no target][no option][no type]
status: valid
status modified: 2017-02-13
accepted date: 2017-02-13
in scheme: IPCC_variables_MMR

2.G.3 [N2O from Product Uses][no classification][Emissions][N2O][kt][no source][no method][no target][no option][no type]
type: Concept
definition: 2.G.3 [N2O from Product Uses][no classification][Emissions][N2O][kt][no source][no method][no target][no option][no type]
status: valid
status modified: 2017-02-13
accepted date: 2017-02-13
in scheme: IPCC_variables_MMR

2.G.3.a [Medical Applications][no classification][Emissions][N2O][kt][no source][no method][no target][no option][no type]
type: Concept
definition: 2.G.3.a [Medical Applications][no classification][Emissions][N2O][kt][no source][no method][no target][no option][no type]
status: valid
status modified: 2017-02-13
accepted date: 2017-02-13
in scheme: IPCC_variables_MMR

2.G.3.b [Other N2O from product use][no classification][Emissions][N2O][kt][no source][no method][no target][no option][no type]
type: Concept
definition: 2.G.3.b [Other N2O from product use][no classification][Emissions][N2O][kt][no source][no method][no target][no option][no type]
status: valid
status modified: 2017-02-13
accepted date: 2017-02-13
in scheme: IPCC_variables_MMR

3.A.1 [Enteric Fermentation][Cattle][Emissions][CH4][kt][no source][no method][no target][no option][no type]
type: Concept
definition: 3.A.1 [Enteric Fermentation][Cattle][Emissions][CH4][kt][no source][no method][no target][no option][no type]
status: valid
status modified: 2017-02-13
accepted date: 2017-02-13
in scheme: IPCC_variables_MMR

3.A.1 Dairy Cattle [Enteric Fermentation][Dairy Cattle][Emissions][CH4][kt][no source][no method][no target][Option A][no type]
type: Concept
definition: 3.A.1 Dairy Cattle [Enteric Fermentation][Dairy Cattle][Emissions][CH4][kt][no source][no method][no target][Option A][no type]
status: valid
status modified: 2017-02-13
accepted date: 2017-02-13
in scheme: IPCC_variables_MMR

3.A.1 Growing Cattle [Enteric Fermentation][Growing Cattle][Emissions][CH4][kt][no source][no method][no target][Option B][no type]
type: Concept
definition: 3.A.1 Growing Cattle [Enteric Fermentation][Growing Cattle][Emissions][CH4][kt][no source][no method][no target][Option B][no type]
status: valid
status modified: 2017-02-13
accepted date: 2017-02-13
in scheme: IPCC_variables_MMR

3.A.1 Mature Dairy Cattle [Enteric Fermentation][Mature Dairy Cattle][Emissions][CH4][kt][no source][no method][no target][Option B][no type]
type: Concept
definition: 3.A.1 Mature Dairy Cattle [Enteric Fermentation][Mature Dairy Cattle][Emissions][CH4][kt][no source][no method][no target][Option B][no type]
status: valid
status modified: 2017-02-13
accepted date: 2017-02-13
in scheme: IPCC_variables_MMR

3.A.1 Non-Dairy Cattle [Enteric Fermentation][Non-Dairy Cattle][Emissions][CH4][kt][no source][no method][no target][Option A][no type]
type: Concept
definition: 3.A.1 Non-Dairy Cattle [Enteric Fermentation][Non-Dairy Cattle][Emissions][CH4][kt][no source][no method][no target][Option A][no type]
status: valid
status modified: 2017-02-13
accepted date: 2017-02-13
in scheme: IPCC_variables_MMR

3.A.1 Other Mature Cattle [Enteric Fermentation][Other Mature Cattle][Emissions][CH4][kt][no source][no method][no target][Option B][no type]
type: Concept
definition: 3.A.1 Other Mature Cattle [Enteric Fermentation][Other Mature Cattle][Emissions][CH4][kt][no source][no method][no target][Option B][no type]
status: valid
status modified: 2017-02-13
accepted date: 2017-02-13
in scheme: IPCC_variables_MMR

3.A.2 [Enteric Fermentation][Sheep][Emissions][CH4][kt][no source][no method][no target][no option][no type]
type: Concept
definition: 3.A.2 [Enteric Fermentation][Sheep][Emissions][CH4][kt][no source][no method][no target][no option][no type]
status: valid
status modified: 2017-02-13
accepted date: 2017-02-13
in scheme: IPCC_variables_MMR

3.A.3 [Enteric Fermentation][Swine][Emissions][CH4][kt][no source][no method][no target][no option][no type]
type: Concept
definition: 3.A.3 [Enteric Fermentation][Swine][Emissions][CH4][kt][no source][no method][no target][no option][no type]
status: valid
status modified: 2017-02-13
accepted date: 2017-02-13
in scheme: IPCC_variables_MMR

3.B.1.1 [CH4 Emissions][Cattle][Emissions][CH4][kt][no source][no method][no target][no option][no type]
type: Concept
definition: 3.B.1.1 [CH4 Emissions][Cattle][Emissions][CH4][kt][no source][no method][no target][no option][no type]
status: valid
status modified: 2017-02-13
accepted date: 2017-02-13
in scheme: IPCC_variables_MMR

3.B.1.1 [CH4 Emissions][Other Cattle][Emissions][CH4][kt][no source][no method][no target][Option C][no type]
type: Concept
definition: 3.B.1.1 [CH4 Emissions][Other Cattle][Emissions][CH4][kt][no source][no method][no target][Option C][no type]
status: valid
status modified: 2017-02-13
accepted date: 2017-02-13
in scheme: IPCC_variables_MMR

3.B.1.1 Dairy Cattle [CH4 Emissions][Dairy Cattle][Emissions][CH4][kt][no source][no method][no target][Option A][no type]
type: Concept
definition: 3.B.1.1 Dairy Cattle [CH4 Emissions][Dairy Cattle][Emissions][CH4][kt][no source][no method][no target][Option A][no type]
status: valid
status modified: 2017-02-13
accepted date: 2017-02-13
in scheme: IPCC_variables_MMR

3.B.1.1 Growing Cattle [CH4 Emissions][Growing Cattle][Emissions][CH4][kt][no source][no method][no target][Option B][no type]
type: Concept
definition: 3.B.1.1 Growing Cattle [CH4 Emissions][Growing Cattle][Emissions][CH4][kt][no source][no method][no target][Option B][no type]
status: valid
status modified: 2017-02-13
accepted date: 2017-02-13
in scheme: IPCC_variables_MMR

3.B.1.1 Mature Dairy Cattle [CH4 Emissions][Mature Dairy Cattle][Emissions][CH4][kt][no source][no method][no target][Option B][no type]
type: Concept
definition: 3.B.1.1 Mature Dairy Cattle [CH4 Emissions][Mature Dairy Cattle][Emissions][CH4][kt][no source][no method][no target][Option B][no type]
status: valid
status modified: 2017-02-13
accepted date: 2017-02-13
in scheme: IPCC_variables_MMR

3.B.1.1 Non-Dairy Cattle [CH4 Emissions][Non-Dairy Cattle][Emissions][CH4][kt][no source][no method][no target][Option A][no type]
type: Concept
definition: 3.B.1.1 Non-Dairy Cattle [CH4 Emissions][Non-Dairy Cattle][Emissions][CH4][kt][no source][no method][no target][Option A][no type]
status: valid
status modified: 2017-02-13
accepted date: 2017-02-13
in scheme: IPCC_variables_MMR

3.B.1.1 Other Mature Cattle [CH4 Emissions][Other Mature Cattle][Emissions][CH4][kt][no source][no method][no target][Option B][no type]
type: Concept
definition: 3.B.1.1 Other Mature Cattle [CH4 Emissions][Other Mature Cattle][Emissions][CH4][kt][no source][no method][no target][Option B][no type]
status: valid
status modified: 2017-02-13
accepted date: 2017-02-13
in scheme: IPCC_variables_MMR

3.B.1.2 [CH4 Emissions][Other Sheep][Emissions][CH4][kt][no source][no method][no target][no option][no type]
type: Concept
definition: 3.B.1.2 [CH4 Emissions][Other Sheep][Emissions][CH4][kt][no source][no method][no target][no option][no type]
status: valid
status modified: 2017-02-13
accepted date: 2017-02-13
in scheme: IPCC_variables_MMR

3.B.1.2 [CH4 Emissions][Sheep][Emissions][CH4][kt][no source][no method][no target][no option][no type]
type: Concept
definition: 3.B.1.2 [CH4 Emissions][Sheep][Emissions][CH4][kt][no source][no method][no target][no option][no type]
status: valid
status modified: 2017-02-13
accepted date: 2017-02-13
in scheme: IPCC_variables_MMR

3.B.1.3 [CH4 Emissions][Other Swine][Emissions][CH4][kt][no source][no method][no target][no option][no type]
type: Concept
definition: 3.B.1.3 [CH4 Emissions][Other Swine][Emissions][CH4][kt][no source][no method][no target][no option][no type]
status: valid
status modified: 2017-02-13
accepted date: 2017-02-13
in scheme: IPCC_variables_MMR

3.B.1.3 [CH4 Emissions][Swine][Emissions][CH4][kt][no source][no method][no target][no option][no type]
type: Concept
definition: 3.B.1.3 [CH4 Emissions][Swine][Emissions][CH4][kt][no source][no method][no target][no option][no type]
status: valid
status modified: 2017-02-13
accepted date: 2017-02-13
in scheme: IPCC_variables_MMR

3.B.1.4 [CH4 Emissions][Other livestock][Emissions][CH4][kt][no source][no method][no target][no option][no type]
type: Concept
definition: 3.B.1.4 [CH4 Emissions][Other livestock][Emissions][CH4][kt][no source][no method][no target][no option][no type]
status: valid
status modified: 2017-02-13
accepted date: 2017-02-13
in scheme: IPCC_variables_MMR

3.B.1.4 [CH4 Emissions][Other Other Livestock][Emissions][CH4][kt][no source][no method][no target][no option][no type]
type: Concept
definition: 3.B.1.4 [CH4 Emissions][Other Other Livestock][Emissions][CH4][kt][no source][no method][no target][no option][no type]
status: valid
status modified: 2017-02-13
accepted date: 2017-02-13
in scheme: IPCC_variables_MMR

3.B.2.1 [N2O and NMVOC Emissions][Cattle][Emissions][N2O][kt][no source][no method][no target][no option][no type]
type: Concept
definition: 3.B.2.1 [N2O and NMVOC Emissions][Cattle][Emissions][N2O][kt][no source][no method][no target][no option][no type]
status: valid
status modified: 2017-02-13
accepted date: 2017-02-13
in scheme: IPCC_variables_MMR

3.B.2.1 [N2O and NMVOC Emissions][Other Cattle][Emissions][N2O][kt][no source][no method][no target][Option C][no type]
type: Concept
definition: 3.B.2.1 [N2O and NMVOC Emissions][Other Cattle][Emissions][N2O][kt][no source][no method][no target][Option C][no type]
status: valid
status modified: 2017-02-13
accepted date: 2017-02-13
in scheme: IPCC_variables_MMR

3.B.2.1 Dairy Cattle [N2O and NMVOC Emissions][Dairy Cattle][Emissions][N2O][kt][no source][no method][no target][Option A][no type]
type: Concept
definition: 3.B.2.1 Dairy Cattle [N2O and NMVOC Emissions][Dairy Cattle][Emissions][N2O][kt][no source][no method][no target][Option A][no type]
status: valid
status modified: 2017-02-13
accepted date: 2017-02-13
in scheme: IPCC_variables_MMR

3.B.2.1 Growing Cattle [N2O and NMVOC Emissions][Growing Cattle][Emissions][N2O][kt][no source][no method][no target][Option B][no type]
type: Concept
definition: 3.B.2.1 Growing Cattle [N2O and NMVOC Emissions][Growing Cattle][Emissions][N2O][kt][no source][no method][no target][Option B][no type]
status: valid
status modified: 2017-02-13
accepted date: 2017-02-13
in scheme: IPCC_variables_MMR

3.B.2.1 Mature Dairy Cattle [N2O and NMVOC Emissions][Mature Dairy Cattle][Emissions][N2O][kt][no source][no method][no target][Option B][no type]
type: Concept
definition: 3.B.2.1 Mature Dairy Cattle [N2O and NMVOC Emissions][Mature Dairy Cattle][Emissions][N2O][kt][no source][no method][no target][Option B][no type]
status: valid
status modified: 2017-02-13
accepted date: 2017-02-13
in scheme: IPCC_variables_MMR

3.B.2.1 Non-Dairy Cattle [N2O and NMVOC Emissions][Non-Dairy Cattle][Emissions][N2O][kt][no source][no method][no target][Option A][no type]
type: Concept
definition: 3.B.2.1 Non-Dairy Cattle [N2O and NMVOC Emissions][Non-Dairy Cattle][Emissions][N2O][kt][no source][no method][no target][Option A][no type]
status: valid
status modified: 2017-02-13
accepted date: 2017-02-13
in scheme: IPCC_variables_MMR

3.B.2.1 Other Mature Cattle [N2O and NMVOC Emissions][Other Mature Cattle][Emissions][N2O][kt][no source][no method][no target][Option B][no type]
type: Concept
definition: 3.B.2.1 Other Mature Cattle [N2O and NMVOC Emissions][Other Mature Cattle][Emissions][N2O][kt][no source][no method][no target][Option B][no type]
status: valid
status modified: 2017-02-13
accepted date: 2017-02-13
in scheme: IPCC_variables_MMR

3.B.2.2 [N2O and NMVOC Emissions][Other Sheep][Emissions][N2O][kt][no source][no method][no target][no option][no type]
type: Concept
definition: 3.B.2.2 [N2O and NMVOC Emissions][Other Sheep][Emissions][N2O][kt][no source][no method][no target][no option][no type]
status: valid
status modified: 2017-02-13
accepted date: 2017-02-13
in scheme: IPCC_variables_MMR

3.B.2.2 [N2O and NMVOC Emissions][Sheep][Emissions][N2O][kt][no source][no method][no target][no option][no type]
type: Concept
definition: 3.B.2.2 [N2O and NMVOC Emissions][Sheep][Emissions][N2O][kt][no source][no method][no target][no option][no type]
status: valid
status modified: 2017-02-13
accepted date: 2017-02-13
in scheme: IPCC_variables_MMR

3.B.2.3 [N2O and NMVOC Emissions][Other Swine][Emissions][N2O][kt][no source][no method][no target][no option][no type]
type: Concept
definition: 3.B.2.3 [N2O and NMVOC Emissions][Other Swine][Emissions][N2O][kt][no source][no method][no target][no option][no type]
status: valid
status modified: 2017-02-13
accepted date: 2017-02-13
in scheme: IPCC_variables_MMR

3.B.2.3 [N2O and NMVOC Emissions][Swine][Emissions][N2O][kt][no source][no method][no target][no option][no type]
type: Concept
definition: 3.B.2.3 [N2O and NMVOC Emissions][Swine][Emissions][N2O][kt][no source][no method][no target][no option][no type]
status: valid
status modified: 2017-02-13
accepted date: 2017-02-13
in scheme: IPCC_variables_MMR

3.B.2.4 [N2O and NMVOC Emissions][Other livestock][Emissions][N2O][kt][no source][no method][no target][no option][no type]
type: Concept
definition: 3.B.2.4 [N2O and NMVOC Emissions][Other livestock][Emissions][N2O][kt][no source][no method][no target][no option][no type]
status: valid
status modified: 2017-02-13
accepted date: 2017-02-13
in scheme: IPCC_variables_MMR

3.B.2.4 [N2O and NMVOC Emissions][Other Other Livestock][Emissions][N2O][kt][no source][no method][no target][no option][no type]
type: Concept
definition: 3.B.2.4 [N2O and NMVOC Emissions][Other Other Livestock][Emissions][N2O][kt][no source][no method][no target][no option][no type]
status: valid
status modified: 2017-02-13
accepted date: 2017-02-13
in scheme: IPCC_variables_MMR

3.B.2.5 [Indirect N2O Emissions][Farming][Emissions][N2O][kt][no source][no method][no target][no option][no type]
type: Concept
definition: 3.B.2.5 [Indirect N2O Emissions][Farming][Emissions][N2O][kt][no source][no method][no target][no option][no type]
status: valid
status modified: 2017-02-13
accepted date: 2017-02-13
in scheme: IPCC_variables_MMR

3.C.1 [Irrigated][Farming][Emissions][CH4][kt][no source][no method][no target][no option][no type]
type: Concept
definition: 3.C.1 [Irrigated][Farming][Emissions][CH4][kt][no source][no method][no target][no option][no type]
status: valid
status modified: 2017-02-13
accepted date: 2017-02-13
in scheme: IPCC_variables_MMR

3.C.1.1 [Continuously Flooded][Farming][Emissions][CH4][kt][no source][no method][no target][no option][no type]
type: Concept
definition: 3.C.1.1 [Continuously Flooded][Farming][Emissions][CH4][kt][no source][no method][no target][no option][no type]
status: valid
status modified: 2017-02-13
accepted date: 2017-02-13
in scheme: IPCC_variables_MMR

3.C.1.2.1 [Single Aeration][Farming][Emissions][CH4][kt][no source][no method][no target][no option][no type]
type: Concept
definition: 3.C.1.2.1 [Single Aeration][Farming][Emissions][CH4][kt][no source][no method][no target][no option][no type]
status: valid
status modified: 2017-02-13
accepted date: 2017-02-13
in scheme: IPCC_variables_MMR

3.C.1.2.2 [Multiple aeration][Farming][Emissions][CH4][kt][no source][no method][no target][no option][no type]
type: Concept
definition: 3.C.1.2.2 [Multiple aeration][Farming][Emissions][CH4][kt][no source][no method][no target][no option][no type]
status: valid
status modified: 2017-02-13
accepted date: 2017-02-13
in scheme: IPCC_variables_MMR

3.C.2 [Rainfed][Farming][Emissions][CH4][kt][no source][no method][no target][no option][no type]
type: Concept
definition: 3.C.2 [Rainfed][Farming][Emissions][CH4][kt][no source][no method][no target][no option][no type]
status: valid
status modified: 2017-02-13
accepted date: 2017-02-13
in scheme: IPCC_variables_MMR

3.C.2.1 [Flood Prone][Farming][Emissions][CH4][kt][no source][no method][no target][no option][no type]
type: Concept
definition: 3.C.2.1 [Flood Prone][Farming][Emissions][CH4][kt][no source][no method][no target][no option][no type]
status: valid
status modified: 2017-02-13
accepted date: 2017-02-13
in scheme: IPCC_variables_MMR

3.C.2.2 [Drought Prone][Farming][Emissions][CH4][kt][no source][no method][no target][no option][no type]
type: Concept
definition: 3.C.2.2 [Drought Prone][Farming][Emissions][CH4][kt][no source][no method][no target][no option][no type]
status: valid
status modified: 2017-02-13
accepted date: 2017-02-13
in scheme: IPCC_variables_MMR

3.C.3 [Deep Water][Farming][Emissions][CH4][kt][no source][no method][no target][no option][no type]
type: Concept
definition: 3.C.3 [Deep Water][Farming][Emissions][CH4][kt][no source][no method][no target][no option][no type]
status: valid
status modified: 2017-02-13
accepted date: 2017-02-13
in scheme: IPCC_variables_MMR

3.C.3.1 [Water Depth 50-100 cm][Farming][Emissions][CH4][kt][no source][no method][no target][no option][no type]
type: Concept
definition: 3.C.3.1 [Water Depth 50-100 cm][Farming][Emissions][CH4][kt][no source][no method][no target][no option][no type]
status: valid
status modified: 2017-02-13
accepted date: 2017-02-13
in scheme: IPCC_variables_MMR

3.C.3.2 [Water Depth > 100 cm][Farming][Emissions][CH4][kt][no source][no method][no target][no option][no type]
type: Concept
definition: 3.C.3.2 [Water Depth > 100 cm][Farming][Emissions][CH4][kt][no source][no method][no target][no option][no type]
status: valid
status modified: 2017-02-13
accepted date: 2017-02-13
in scheme: IPCC_variables_MMR

3.D.1 [Agricultural Soils][Direct N2O Emissions From Managed Soils][Emissions][N2O][kt][no source][no method][no target][no option][no type]
type: Concept
definition: 3.D.1 [Agricultural Soils][Direct N2O Emissions From Managed Soils][Emissions][N2O][kt][no source][no method][no target][no option][no type]
status: valid
status modified: 2017-02-13
accepted date: 2017-02-13
in scheme: IPCC_variables_MMR

3.D.1.1 [Agricultural Soils][Direct N2O Emissions From Managed Soils][Emissions][N2O][kt][no source][no method][no target][no option][Inorganic N Fertilizers]
type: Concept
definition: 3.D.1.1 [Agricultural Soils][Direct N2O Emissions From Managed Soils][Emissions][N2O][kt][no source][no method][no target][no option][Inorganic N Fertilizers]
status: valid
status modified: 2017-02-13
accepted date: 2017-02-13
in scheme: IPCC_variables_MMR

3.D.1.2 [Agricultural Soils][Direct N2O Emissions From Managed Soils][Emissions][N2O][kt][no source][no method][no target][no option][Organic N Fertilizers]
type: Concept
definition: 3.D.1.2 [Agricultural Soils][Direct N2O Emissions From Managed Soils][Emissions][N2O][kt][no source][no method][no target][no option][Organic N Fertilizers]
status: valid
status modified: 2017-02-13
accepted date: 2017-02-13
in scheme: IPCC_variables_MMR

3.D.1.2.a [Agricultural Soils][Animal Manure Applied to Soils][Emissions][N2O][kt][no source][no method][no target][no option][no type]
type: Concept
definition: 3.D.1.2.a [Agricultural Soils][Animal Manure Applied to Soils][Emissions][N2O][kt][no source][no method][no target][no option][no type]
status: valid
status modified: 2017-02-13
accepted date: 2017-02-13
in scheme: IPCC_variables_MMR

3.D.1.2.b [Agricultural Soils][Sewage Sludge Applied to Soils][Emissions][N2O][kt][no source][no method][no target][no option][no type]
type: Concept
definition: 3.D.1.2.b [Agricultural Soils][Sewage Sludge Applied to Soils][Emissions][N2O][kt][no source][no method][no target][no option][no type]
status: valid
status modified: 2017-02-13
accepted date: 2017-02-13
in scheme: IPCC_variables_MMR

3.D.1.2.c [Agricultural Soils][Other Organic Fertilizers Applied to Soils][Emissions][N2O][kt][no source][no method][no target][no option][no type]
type: Concept
definition: 3.D.1.2.c [Agricultural Soils][Other Organic Fertilizers Applied to Soils][Emissions][N2O][kt][no source][no method][no target][no option][no type]
status: valid
status modified: 2017-02-13
accepted date: 2017-02-13
in scheme: IPCC_variables_MMR

3.D.1.3 [Agricultural Soils][Urine and Dung Deposited by Grazing Animals][Emissions][N2O][kt][no source][no method][no target][no option][no type]
type: Concept
definition: 3.D.1.3 [Agricultural Soils][Urine and Dung Deposited by Grazing Animals][Emissions][N2O][kt][no source][no method][no target][no option][no type]
status: valid
status modified: 2017-02-13
accepted date: 2017-02-13
in scheme: IPCC_variables_MMR

3.D.1.4 [Agricultural Soils][Crop Residues][Emissions][N2O][kt][no source][no method][no target][no option][no type]
type: Concept
definition: 3.D.1.4 [Agricultural Soils][Crop Residues][Emissions][N2O][kt][no source][no method][no target][no option][no type]
status: valid
status modified: 2017-02-13
accepted date: 2017-02-13
in scheme: IPCC_variables_MMR

3.D.1.5 [Agricultural Soils][Mineralization of Soil Organic Matter][Emissions][N2O][kt][no source][no method][no target][no option][no type]
type: Concept
definition: 3.D.1.5 [Agricultural Soils][Mineralization of Soil Organic Matter][Emissions][N2O][kt][no source][no method][no target][no option][no type]
status: valid
status modified: 2017-02-13
accepted date: 2017-02-13
in scheme: IPCC_variables_MMR

3.D.1.6 [Agricultural Soils][Cultivation of Organic Soils][Emissions][N2O][kt][no source][no method][no target][no option][no type]
type: Concept
definition: 3.D.1.6 [Agricultural Soils][Cultivation of Organic Soils][Emissions][N2O][kt][no source][no method][no target][no option][no type]
status: valid
status modified: 2017-02-13
accepted date: 2017-02-13
in scheme: IPCC_variables_MMR

3.D.1.7 [Agricultural Soils][Other direct NO2 from managed Soils][Emissions][N2O][kt][no source][no method][no target][no option][no type]
type: Concept
definition: 3.D.1.7 [Agricultural Soils][Other direct NO2 from managed Soils][Emissions][N2O][kt][no source][no method][no target][no option][no type]
status: valid
status modified: 2017-02-13
accepted date: 2017-02-13
in scheme: IPCC_variables_MMR

3.D.2 [Agricultural Soils][Farming][Emissions][N2O][kt][no source][no method][Indirect N2O Emissions From Managed Soils][no option][no type]
type: Concept
definition: 3.D.2 [Agricultural Soils][Farming][Emissions][N2O][kt][no source][no method][Indirect N2O Emissions From Managed Soils][no option][no type]
status: valid
status modified: 2017-02-13
accepted date: 2017-02-13
in scheme: IPCC_variables_MMR

3.D.2.1 [Agricultural Soils][Farming][Emissions][N2O][kt][no source][no method][Atmospheric Deposition][no option][no type]
type: Concept
definition: 3.D.2.1 [Agricultural Soils][Farming][Emissions][N2O][kt][no source][no method][Atmospheric Deposition][no option][no type]
status: valid
status modified: 2017-02-13
accepted date: 2017-02-13
in scheme: IPCC_variables_MMR

3.D.2.2 [Agricultural Soils][Farming][Emissions][N2O][kt][no source][no method][Nitrogen Leaching and Run-off][no option][no type]
type: Concept
definition: 3.D.2.2 [Agricultural Soils][Farming][Emissions][N2O][kt][no source][no method][Nitrogen Leaching and Run-off][no option][no type]
status: valid
status modified: 2017-02-13
accepted date: 2017-02-13
in scheme: IPCC_variables_MMR

3.E [Prescribed Burning of Savannas][Farming][Emissions][CH4][kt][no source][no method][no target][no option][no type]
type: Concept
definition: 3.E [Prescribed Burning of Savannas][Farming][Emissions][CH4][kt][no source][no method][no target][no option][no type]
status: valid
status modified: 2017-02-13
accepted date: 2017-02-13
in scheme: IPCC_variables_MMR

3.E [Prescribed Burning of Savannas][Farming][Emissions][N2O][kt][no source][no method][no target][no option][no type]
type: Concept
definition: 3.E [Prescribed Burning of Savannas][Farming][Emissions][N2O][kt][no source][no method][no target][no option][no type]
status: valid
status modified: 2017-02-13
accepted date: 2017-02-13
in scheme: IPCC_variables_MMR

3.E Forest land [Forest land (specify ecological zone)][Farming][Emissions][CH4][kt][no source][no method][no target][no option][no type]
type: Concept
definition: 3.E Forest land [Forest land (specify ecological zone)][Farming][Emissions][CH4][kt][no source][no method][no target][no option][no type]
status: valid
status modified: 2017-02-13
accepted date: 2017-02-13
in scheme: IPCC_variables_MMR

3.E Forest land [Forest land (specify ecological zone)][Farming][Emissions][N2O][kt][no source][no method][no target][no option][no type]
type: Concept
definition: 3.E Forest land [Forest land (specify ecological zone)][Farming][Emissions][N2O][kt][no source][no method][no target][no option][no type]
status: valid
status modified: 2017-02-13
accepted date: 2017-02-13
in scheme: IPCC_variables_MMR

3.E Grassland [Grassland (specify ecological zone)][Farming][Emissions][CH4][kt][no source][no method][no target][no option][no type]
type: Concept
definition: 3.E Grassland [Grassland (specify ecological zone)][Farming][Emissions][CH4][kt][no source][no method][no target][no option][no type]
status: valid
status modified: 2017-02-13
accepted date: 2017-02-13
in scheme: IPCC_variables_MMR

3.E Grassland [Grassland (specify ecological zone)][Farming][Emissions][N2O][kt][no source][no method][no target][no option][no type]
type: Concept
definition: 3.E Grassland [Grassland (specify ecological zone)][Farming][Emissions][N2O][kt][no source][no method][no target][no option][no type]
status: valid
status modified: 2017-02-13
accepted date: 2017-02-13
in scheme: IPCC_variables_MMR

3.F.1 [Field Burning of Agricultural Residues][Cereals][Emissions][CH4][kt][no source][no method][no target][no option][no type]
type: Concept
definition: 3.F.1 [Field Burning of Agricultural Residues][Cereals][Emissions][CH4][kt][no source][no method][no target][no option][no type]
status: valid
status modified: 2017-02-13
accepted date: 2017-02-13
in scheme: IPCC_variables_MMR

3.F.1 [Field Burning of Agricultural Residues][Cereals][Emissions][N2O][kt][no source][no method][no target][no option][no type]
type: Concept
definition: 3.F.1 [Field Burning of Agricultural Residues][Cereals][Emissions][N2O][kt][no source][no method][no target][no option][no type]
status: valid
status modified: 2017-02-13
accepted date: 2017-02-13
in scheme: IPCC_variables_MMR

3.F.1.1 [Field Burning of Agricultural Residues][Wheat][Emissions][CH4][kt][no source][no method][no target][no option][no type]
type: Concept
definition: 3.F.1.1 [Field Burning of Agricultural Residues][Wheat][Emissions][CH4][kt][no source][no method][no target][no option][no type]
status: valid
status modified: 2017-02-13
accepted date: 2017-02-13
in scheme: IPCC_variables_MMR

3.F.1.1 [Field Burning of Agricultural Residues][Wheat][Emissions][N2O][kt][no source][no method][no target][no option][no type]
type: Concept
definition: 3.F.1.1 [Field Burning of Agricultural Residues][Wheat][Emissions][N2O][kt][no source][no method][no target][no option][no type]
status: valid
status modified: 2017-02-13
accepted date: 2017-02-13
in scheme: IPCC_variables_MMR

3.F.1.2 [Field Burning of Agricultural Residues][Barley][Emissions][CH4][kt][no source][no method][no target][no option][no type]
type: Concept
definition: 3.F.1.2 [Field Burning of Agricultural Residues][Barley][Emissions][CH4][kt][no source][no method][no target][no option][no type]
status: valid
status modified: 2017-02-13
accepted date: 2017-02-13
in scheme: IPCC_variables_MMR

3.F.1.2 [Field Burning of Agricultural Residues][Barley][Emissions][N2O][kt][no source][no method][no target][no option][no type]
type: Concept
definition: 3.F.1.2 [Field Burning of Agricultural Residues][Barley][Emissions][N2O][kt][no source][no method][no target][no option][no type]
status: valid
status modified: 2017-02-13
accepted date: 2017-02-13
in scheme: IPCC_variables_MMR

3.F.1.3 [Field Burning of Agricultural Residues][Maize][Emissions][CH4][kt][no source][no method][no target][no option][no type]
type: Concept
definition: 3.F.1.3 [Field Burning of Agricultural Residues][Maize][Emissions][CH4][kt][no source][no method][no target][no option][no type]
status: valid
status modified: 2017-02-13
accepted date: 2017-02-13
in scheme: IPCC_variables_MMR

3.F.1.3 [Field Burning of Agricultural Residues][Maize][Emissions][N2O][kt][no source][no method][no target][no option][no type]
type: Concept
definition: 3.F.1.3 [Field Burning of Agricultural Residues][Maize][Emissions][N2O][kt][no source][no method][no target][no option][no type]
status: valid
status modified: 2017-02-13
accepted date: 2017-02-13
in scheme: IPCC_variables_MMR

3.F.1.4 [Field Burning of Agricultural Residues][Other cereals][Emissions][CH4][kt][no source][no method][no target][no option][no type]
type: Concept
definition: 3.F.1.4 [Field Burning of Agricultural Residues][Other cereals][Emissions][CH4][kt][no source][no method][no target][no option][no type]
status: valid
status modified: 2017-02-13
accepted date: 2017-02-13
in scheme: IPCC_variables_MMR

3.F.1.4 [Field Burning of Agricultural Residues][Other cereals][Emissions][N2O][kt][no source][no method][no target][no option][no type]
type: Concept
definition: 3.F.1.4 [Field Burning of Agricultural Residues][Other cereals][Emissions][N2O][kt][no source][no method][no target][no option][no type]
status: valid
status modified: 2017-02-13
accepted date: 2017-02-13
in scheme: IPCC_variables_MMR

3.F.2 [Field Burning of Agricultural Residues][Pulses][Emissions][CH4][kt][no source][no method][no target][no option][no type]
type: Concept
definition: 3.F.2 [Field Burning of Agricultural Residues][Pulses][Emissions][CH4][kt][no source][no method][no target][no option][no type]
status: valid
status modified: 2017-02-13
accepted date: 2017-02-13
in scheme: IPCC_variables_MMR

3.F.2 [Field Burning of Agricultural Residues][Pulses][Emissions][N2O][kt][no source][no method][no target][no option][no type]
type: Concept
definition: 3.F.2 [Field Burning of Agricultural Residues][Pulses][Emissions][N2O][kt][no source][no method][no target][no option][no type]
status: valid
status modified: 2017-02-13
accepted date: 2017-02-13
in scheme: IPCC_variables_MMR

3.F.2.1 [Field Burning of Agricultural Residues][Other Pulses][Emissions][CH4][kt][no source][no method][no target][no option][no type]
type: Concept
definition: 3.F.2.1 [Field Burning of Agricultural Residues][Other Pulses][Emissions][CH4][kt][no source][no method][no target][no option][no type]
status: valid
status modified: 2017-02-13
accepted date: 2017-02-13
in scheme: IPCC_variables_MMR

3.F.2.1 [Field Burning of Agricultural Residues][Other Pulses][Emissions][N2O][kt][no source][no method][no target][no option][no type]
type: Concept
definition: 3.F.2.1 [Field Burning of Agricultural Residues][Other Pulses][Emissions][N2O][kt][no source][no method][no target][no option][no type]
status: valid
status modified: 2017-02-13
accepted date: 2017-02-13
in scheme: IPCC_variables_MMR

3.F.3 [Field Burning of Agricultural Residues][Tubers and Roots][Emissions][CH4][kt][no source][no method][no target][no option][no type]
type: Concept
definition: 3.F.3 [Field Burning of Agricultural Residues][Tubers and Roots][Emissions][CH4][kt][no source][no method][no target][no option][no type]
status: valid
status modified: 2017-02-13
accepted date: 2017-02-13
in scheme: IPCC_variables_MMR

3.F.3 [Field Burning of Agricultural Residues][Tubers and Roots][Emissions][N2O][kt][no source][no method][no target][no option][no type]
type: Concept
definition: 3.F.3 [Field Burning of Agricultural Residues][Tubers and Roots][Emissions][N2O][kt][no source][no method][no target][no option][no type]
status: valid
status modified: 2017-02-13
accepted date: 2017-02-13
in scheme: IPCC_variables_MMR

3.F.3.1 [Field Burning of Agricultural Residues][Other Tubers and Roots][Emissions][CH4][kt][no source][no method][no target][no option][no type]
type: Concept
definition: 3.F.3.1 [Field Burning of Agricultural Residues][Other Tubers and Roots][Emissions][CH4][kt][no source][no method][no target][no option][no type]
status: valid
status modified: 2017-02-13
accepted date: 2017-02-13
in scheme: IPCC_variables_MMR

3.F.3.1 [Field Burning of Agricultural Residues][Other Tubers and Roots][Emissions][N2O][kt][no source][no method][no target][no option][no type]
type: Concept
definition: 3.F.3.1 [Field Burning of Agricultural Residues][Other Tubers and Roots][Emissions][N2O][kt][no source][no method][no target][no option][no type]
status: valid
status modified: 2017-02-13
accepted date: 2017-02-13
in scheme: IPCC_variables_MMR

3.F.4 [Field Burning of Agricultural Residues][Sugar Cane][Emissions][CH4][kt][no source][no method][no target][no option][no type]
type: Concept
definition: 3.F.4 [Field Burning of Agricultural Residues][Sugar Cane][Emissions][CH4][kt][no source][no method][no target][no option][no type]
status: valid
status modified: 2017-02-13
accepted date: 2017-02-13
in scheme: IPCC_variables_MMR

3.F.4 [Field Burning of Agricultural Residues][Sugar Cane][Emissions][N2O][kt][no source][no method][no target][no option][no type]
type: Concept
definition: 3.F.4 [Field Burning of Agricultural Residues][Sugar Cane][Emissions][N2O][kt][no source][no method][no target][no option][no type]
status: valid
status modified: 2017-02-13
accepted date: 2017-02-13
in scheme: IPCC_variables_MMR

3.F.5 [Field Burning of Agricultural Residues][Other Agricultural residues][Emissions][CH4][kt][no source][no method][no target][no option][no type]
type: Concept
definition: 3.F.5 [Field Burning of Agricultural Residues][Other Agricultural residues][Emissions][CH4][kt][no source][no method][no target][no option][no type]
status: valid
status modified: 2017-02-13
accepted date: 2017-02-13
in scheme: IPCC_variables_MMR

3.F.5 [Field Burning of Agricultural Residues][Other Agricultural residues][Emissions][N2O][kt][no source][no method][no target][no option][no type]
type: Concept
definition: 3.F.5 [Field Burning of Agricultural Residues][Other Agricultural residues][Emissions][N2O][kt][no source][no method][no target][no option][no type]
status: valid
status modified: 2017-02-13
accepted date: 2017-02-13
in scheme: IPCC_variables_MMR

3.G.1 [Limestone CaCO3][Farming][Emissions][CO2][kt][no source][no method][no target][no option][no type]
type: Concept
definition: 3.G.1 [Limestone CaCO3][Farming][Emissions][CO2][kt][no source][no method][no target][no option][no type]
status: valid
status modified: 2017-02-13
accepted date: 2017-02-13
in scheme: IPCC_variables_MMR

3.G.2 [Dolomite CaMg(CO3)2][Farming][Emissions][CO2][kt][no source][no method][no target][no option][no type]
type: Concept
definition: 3.G.2 [Dolomite CaMg(CO3)2][Farming][Emissions][CO2][kt][no source][no method][no target][no option][no type]
status: valid
status modified: 2017-02-13
accepted date: 2017-02-13
in scheme: IPCC_variables_MMR

3.H [Urea Application][Farming][Emissions][CO2][kt][no source][no method][no target][no option][no type]
type: Concept
definition: 3.H [Urea Application][Farming][Emissions][CO2][kt][no source][no method][no target][no option][no type]
status: valid
status modified: 2017-02-13
accepted date: 2017-02-13
in scheme: IPCC_variables_MMR

4.A [Forest Land][Land Use][Emissions][CH4][kt][Land][no method][no target][no option][no type]
type: Concept
definition: 4.A [Forest Land][Land Use][Emissions][CH4][kt][Land][no method][no target][no option][no type]
status: valid
status modified: 2017-02-13
accepted date: 2017-02-13
in scheme: IPCC_variables_MMR

4.A [Forest Land][Land Use][Emissions][CO2][kt][Land][no method][no target][no option][no type]
type: Concept
definition: 4.A [Forest Land][Land Use][Emissions][CO2][kt][Land][no method][no target][no option][no type]
status: valid
status modified: 2017-02-13
accepted date: 2017-02-13
in scheme: IPCC_variables_MMR

4.A [Forest Land][Land Use][Emissions][N2O][kt][Land][no method][no target][no option][no type]
type: Concept
definition: 4.A [Forest Land][Land Use][Emissions][N2O][kt][Land][no method][no target][no option][no type]
status: valid
status modified: 2017-02-13
accepted date: 2017-02-13
in scheme: IPCC_variables_MMR

http://dd.eionet.europa.eu/vocabulary/ghg/IPCC_variables_MMR/8485FA2C-866A-4608-A3DD-EED73520F31E
type: Concept
preferred label: 4.A.1 Total Organic Soils [Forest Land][Emissions and removals from drainage and rewetting and other management of organic and mineral soils][Emissions][CH4][kt][Land][no method][Forest Land][no option][Organic soils]
definition: 4.A.1 Total Organic Soils [Forest Land][Emissions and removals from drainage and rewetting and other management of organic and mineral soils][Emissions][CH4][kt][Land][no method][Forest Land][no option][Organic soils]
status: valid
status modified: 2017-02-13
accepted date: 2017-02-13
in scheme: IPCC_variables_MMR

http://dd.eionet.europa.eu/vocabulary/ghg/IPCC_variables_MMR/6C2E438B-6777-4A60-8F57-3E3695B3D334
type: Concept
preferred label: 4.A.1 Total Organic Soils [Forest Land][Emissions and removals from drainage and rewetting and other management of organic and mineral soils][Emissions][N2O][kt][Land][no method][Forest Land][no option][Organic soils]
definition: 4.A.1 Total Organic Soils [Forest Land][Emissions and removals from drainage and rewetting and other management of organic and mineral soils][Emissions][N2O][kt][Land][no method][Forest Land][no option][Organic soils]
status: valid
status modified: 2017-02-13
accepted date: 2017-02-13
in scheme: IPCC_variables_MMR

4.A.1 [Forest Land][Land Use][Emissions][CH4][kt][Forest Land][no method][Forest Land][no option][no type]
type: Concept
definition: 4.A.1 [Forest Land][Land Use][Emissions][CH4][kt][Forest Land][no method][Forest Land][no option][no type]
status: valid
status modified: 2017-02-13
accepted date: 2017-02-13
in scheme: IPCC_variables_MMR

4.A.1 [Forest Land][Land Use][Emissions][CO2][kt][Forest Land][no method][Forest Land][no option][no type]
type: Concept
definition: 4.A.1 [Forest Land][Land Use][Emissions][CO2][kt][Forest Land][no method][Forest Land][no option][no type]
status: valid
status modified: 2017-02-13
accepted date: 2017-02-13
in scheme: IPCC_variables_MMR

4.A.1 [Forest Land][Land Use][Emissions][N2O][kt][Forest Land][no method][Forest Land][no option][no type]
type: Concept
definition: 4.A.1 [Forest Land][Land Use][Emissions][N2O][kt][Forest Land][no method][Forest Land][no option][no type]
status: valid
status modified: 2017-02-13
accepted date: 2017-02-13
in scheme: IPCC_variables_MMR

4.A.1 Biomass Burning [Forest Land][Biomass Burning][Emissions][CH4][kt][Forest Land][no method][Forest Land][no option][no type]
type: Concept
definition: 4.A.1 Biomass Burning [Forest Land][Biomass Burning][Emissions][CH4][kt][Forest Land][no method][Forest Land][no option][no type]
status: valid
status modified: 2017-02-13
accepted date: 2017-02-13
in scheme: IPCC_variables_MMR

4.A.1 Biomass Burning [Forest Land][Biomass Burning][Emissions][N2O][kt][Forest Land][no method][Forest Land][no option][no type]
type: Concept
definition: 4.A.1 Biomass Burning [Forest Land][Biomass Burning][Emissions][N2O][kt][Forest Land][no method][Forest Land][no option][no type]
status: valid
status modified: 2017-02-13
accepted date: 2017-02-13
in scheme: IPCC_variables_MMR

4.A.1 Controlled Burning [Forest Land][Controlled Burning][Emissions][CH4][kt][Forest Land][no method][Forest Land][no option][no type]
type: Concept
definition: 4.A.1 Controlled Burning [Forest Land][Controlled Burning][Emissions][CH4][kt][Forest Land][no method][Forest Land][no option][no type]
status: valid
status modified: 2017-02-13
accepted date: 2017-02-13
in scheme: IPCC_variables_MMR

4.A.1 Controlled Burning [Forest Land][Controlled Burning][Emissions][N2O][kt][Forest Land][no method][Forest Land][no option][no type]
type: Concept
definition: 4.A.1 Controlled Burning [Forest Land][Controlled Burning][Emissions][N2O][kt][Forest Land][no method][Forest Land][no option][no type]
status: valid
status modified: 2017-02-13
accepted date: 2017-02-13
in scheme: IPCC_variables_MMR

4.A.1 Direct N2O Emissions [Forest Land][Direct N2O Emissions from N inputs][Emissions][N2O][kt][Forest Land][no method][Forest Land][no option][no type]
type: Concept
definition: 4.A.1 Direct N2O Emissions [Forest Land][Direct N2O Emissions from N inputs][Emissions][N2O][kt][Forest Land][no method][Forest Land][no option][no type]
status: valid
status modified: 2017-02-13
accepted date: 2017-02-13
in scheme: IPCC_variables_MMR

4.A.1 Inorganic N Fertilizers [Forest Land][Inorganic N Fertilizers][Emissions][N2O][kt][Forest Land][no method][Forest Land][no option][no type]
type: Concept
definition: 4.A.1 Inorganic N Fertilizers [Forest Land][Inorganic N Fertilizers][Emissions][N2O][kt][Forest Land][no method][Forest Land][no option][no type]
status: valid
status modified: 2017-02-13
accepted date: 2017-02-13
in scheme: IPCC_variables_MMR

4.A.1 Mineralization [Forest Land][Direct N2O Emissions from N Mineralization/Immobilization][Emissions][N2O][kt][Forest Land][no method][Forest Land][no option][no type]
type: Concept
definition: 4.A.1 Mineralization [Forest Land][Direct N2O Emissions from N Mineralization/Immobilization][Emissions][N2O][kt][Forest Land][no method][Forest Land][no option][no type]
status: valid
status modified: 2017-02-13
accepted date: 2017-02-13
in scheme: IPCC_variables_MMR

4.A.1 Organic N Fertilizers [Forest Land][Organic N Fertilizers][Emissions][N2O][kt][Forest Land][no method][Forest Land][no option][no type]
type: Concept
definition: 4.A.1 Organic N Fertilizers [Forest Land][Organic N Fertilizers][Emissions][N2O][kt][Forest Land][no method][Forest Land][no option][no type]
status: valid
status modified: 2017-02-13
accepted date: 2017-02-13
in scheme: IPCC_variables_MMR

4.A.1 Wildfires [Forest Land][Wildfires][Emissions][CH4][kt][Forest Land][no method][Forest Land][no option][no type]
type: Concept
definition: 4.A.1 Wildfires [Forest Land][Wildfires][Emissions][CH4][kt][Forest Land][no method][Forest Land][no option][no type]
status: valid
status modified: 2017-02-13
accepted date: 2017-02-13
in scheme: IPCC_variables_MMR

4.A.1 Wildfires [Forest Land][Wildfires][Emissions][N2O][kt][Forest Land][no method][Forest Land][no option][no type]
type: Concept
definition: 4.A.1 Wildfires [Forest Land][Wildfires][Emissions][N2O][kt][Forest Land][no method][Forest Land][no option][no type]
status: valid
status modified: 2017-02-13
accepted date: 2017-02-13
in scheme: IPCC_variables_MMR

http://dd.eionet.europa.eu/vocabulary/ghg/IPCC_variables_MMR/AFF37D56-0C0D-41DF-91BD-2B96AC5A4F1E
type: Concept
preferred label: 4.A.1.1 Drained Organic Soils [Forest Land][Emissions and removals from drainage and rewetting and other management of organic and mineral soils][Emissions][CH4][kt][Land][no method][Forest Land][no option][Drained Organic Soils]
definition: 4.A.1.1 Drained Organic Soils [Forest Land][Emissions and removals from drainage and rewetting and other management of organic and mineral soils][Emissions][CH4][kt][Land][no method][Forest Land][no option][Drained Organic Soils]
status: valid
status modified: 2017-02-13
accepted date: 2017-02-13
in scheme: IPCC_variables_MMR

http://dd.eionet.europa.eu/vocabulary/ghg/IPCC_variables_MMR/43FAEB33-59C1-4106-A15E-EB016A6A156A
type: Concept
preferred label: 4.A.1.1 Drained Organic Soils [Forest Land][Emissions and removals from drainage and rewetting and other management of organic and mineral soils][Emissions][N2O][kt][Land][no method][Forest Land][no option][Drained Organic Soils]
definition: 4.A.1.1 Drained Organic Soils [Forest Land][Emissions and removals from drainage and rewetting and other management of organic and mineral soils][Emissions][N2O][kt][Land][no method][Forest Land][no option][Drained Organic Soils]
status: valid
status modified: 2017-02-13
accepted date: 2017-02-13
in scheme: IPCC_variables_MMR

http://dd.eionet.europa.eu/vocabulary/ghg/IPCC_variables_MMR/B6225A6E-D393-4CE1-9D3F-F2EFBA5FA1A6
type: Concept
preferred label: 4.A.1.2 Rewetted Organic Soils [Forest Land][Emissions and removals from drainage and rewetting and other management of organic and mineral soils][Emissions][CH4][kt][Land][no method][Forest Land][no option][Rewetted Organic Soils]
definition: 4.A.1.2 Rewetted Organic Soils [Forest Land][Emissions and removals from drainage and rewetting and other management of organic and mineral soils][Emissions][CH4][kt][Land][no method][Forest Land][no option][Rewetted Organic Soils]
status: valid
status modified: 2017-02-13
accepted date: 2017-02-13
in scheme: IPCC_variables_MMR

http://dd.eionet.europa.eu/vocabulary/ghg/IPCC_variables_MMR/02B7E1D2-CF7C-4015-8CE4-169C1DE686CD
type: Concept
preferred label: 4.A.1.2 Rewetted Organic Soils [Forest Land][Emissions and removals from drainage and rewetting and other management of organic and mineral soils][Emissions][N2O][kt][Land][no method][Forest Land][no option][Rewetted Organic Soils]
definition: 4.A.1.2 Rewetted Organic Soils [Forest Land][Emissions and removals from drainage and rewetting and other management of organic and mineral soils][Emissions][N2O][kt][Land][no method][Forest Land][no option][Rewetted Organic Soils]
status: valid
status modified: 2017-02-13
accepted date: 2017-02-13
in scheme: IPCC_variables_MMR

http://dd.eionet.europa.eu/vocabulary/ghg/IPCC_variables_MMR/CDDD2205-F1B6-47F2-A279-B4F9A46DFB29
type: Concept
preferred label: 4.A.1.3 Other Organic Soils [Forest Land][Emissions and removals from drainage and rewetting and other management of organic and mineral soils][Emissions][CH4][kt][Land][no method][Forest Land][no option][Other Organic Soils]
definition: 4.A.1.3 Other Organic Soils [Forest Land][Emissions and removals from drainage and rewetting and other management of organic and mineral soils][Emissions][CH4][kt][Land][no method][Forest Land][no option][Other Organic Soils]
status: valid
status modified: 2017-02-13
accepted date: 2017-02-13
in scheme: IPCC_variables_MMR

http://dd.eionet.europa.eu/vocabulary/ghg/IPCC_variables_MMR/9F80E2F8-6876-4346-826F-617C5A51FA10
type: Concept
preferred label: 4.A.1.3 Other Organic Soils [Forest Land][Emissions and removals from drainage and rewetting and other management of organic and mineral soils][Emissions][N2O][kt][Land][no method][Forest Land][no option][Other Organic Soils]
definition: 4.A.1.3 Other Organic Soils [Forest Land][Emissions and removals from drainage and rewetting and other management of organic and mineral soils][Emissions][N2O][kt][Land][no method][Forest Land][no option][Other Organic Soils]
status: valid
status modified: 2017-02-13
accepted date: 2017-02-13
in scheme: IPCC_variables_MMR

http://dd.eionet.europa.eu/vocabulary/ghg/IPCC_variables_MMR/51F6DD9E-7B3E-4FB1-B502-2A674C949BD6
type: Concept
preferred label: 4.A.2 Total Mineral Soils [Forest Land][Emissions and removals from drainage and rewetting and other management of organic and mineral soils][Emissions][CH4][kt][Land][no method][Forest Land][no option][Mineral soils]
definition: 4.A.2 Total Mineral Soils [Forest Land][Emissions and removals from drainage and rewetting and other management of organic and mineral soils][Emissions][CH4][kt][Land][no method][Forest Land][no option][Mineral soils]
status: valid
status modified: 2017-02-13
accepted date: 2017-02-13
in scheme: IPCC_variables_MMR

http://dd.eionet.europa.eu/vocabulary/ghg/IPCC_variables_MMR/17347E08-87B3-4028-B494-272EA55A06A0
type: Concept
preferred label: 4.A.2 Total Mineral Soils [Forest Land][Emissions and removals from drainage and rewetting and other management of organic and mineral soils][Emissions][N2O][kt][Land][no method][Forest Land][no option][Mineral soils]
definition: 4.A.2 Total Mineral Soils [Forest Land][Emissions and removals from drainage and rewetting and other management of organic and mineral soils][Emissions][N2O][kt][Land][no method][Forest Land][no option][Mineral soils]
status: valid
status modified: 2017-02-13
accepted date: 2017-02-13
in scheme: IPCC_variables_MMR

4.A.2 [Forest Land][Land Use][Emissions][CH4][kt][Land][no method][Forest Land][no option][no type]
type: Concept
definition: 4.A.2 [Forest Land][Land Use][Emissions][CH4][kt][Land][no method][Forest Land][no option][no type]
status: valid
status modified: 2017-02-13
accepted date: 2017-02-13
in scheme: IPCC_variables_MMR

4.A.2 [Forest Land][Land Use][Emissions][CO2][kt][Land][no method][Forest Land][no option][no type]
type: Concept
definition: 4.A.2 [Forest Land][Land Use][Emissions][CO2][kt][Land][no method][Forest Land][no option][no type]
status: valid
status modified: 2017-02-13
accepted date: 2017-02-13
in scheme: IPCC_variables_MMR

4.A.2 Biomass Burning [Forest Land][Biomass Burning][Emissions][CH4][kt][Land][no method][Forest Land][no option][no type]
type: Concept
definition: 4.A.2 Biomass Burning [Forest Land][Biomass Burning][Emissions][CH4][kt][Land][no method][Forest Land][no option][no type]
status: valid
status modified: 2017-02-13
accepted date: 2017-02-13
in scheme: IPCC_variables_MMR

4.A.2 Biomass Burning [Forest Land][Biomass Burning][Emissions][N2O][kt][Land][no method][Forest Land][no option][no type]
type: Concept
definition: 4.A.2 Biomass Burning [Forest Land][Biomass Burning][Emissions][N2O][kt][Land][no method][Forest Land][no option][no type]
status: valid
status modified: 2017-02-13
accepted date: 2017-02-13
in scheme: IPCC_variables_MMR

4.A.2 Controlled Burning [Forest Land][Controlled Burning][Emissions][CH4][kt][Land][no method][Forest Land][no option][no type]
type: Concept
definition: 4.A.2 Controlled Burning [Forest Land][Controlled Burning][Emissions][CH4][kt][Land][no method][Forest Land][no option][no type]
status: valid
status modified: 2017-02-13
accepted date: 2017-02-13
in scheme: IPCC_variables_MMR

4.A.2 Controlled Burning [Forest Land][Controlled Burning][Emissions][N2O][kt][Land][no method][Forest Land][no option][no type]
type: Concept
definition: 4.A.2 Controlled Burning [Forest Land][Controlled Burning][Emissions][N2O][kt][Land][no method][Forest Land][no option][no type]
status: valid
status modified: 2017-02-13
accepted date: 2017-02-13
in scheme: IPCC_variables_MMR

4.A.2 Direct N2O Emissions [Forest Land][Direct N2O Emissions from N inputs][Emissions][N2O][kt][Land][no method][Forest Land][no option][no type]
type: Concept
definition: 4.A.2 Direct N2O Emissions [Forest Land][Direct N2O Emissions from N inputs][Emissions][N2O][kt][Land][no method][Forest Land][no option][no type]
status: valid
status modified: 2017-02-13
accepted date: 2017-02-13
in scheme: IPCC_variables_MMR

4.A.2 Inorganic N Fertilizers [Forest Land][Inorganic N Fertilizers][Emissions][N2O][kt][Land][no method][Forest Land][no option][no type]
type: Concept
definition: 4.A.2 Inorganic N Fertilizers [Forest Land][Inorganic N Fertilizers][Emissions][N2O][kt][Land][no method][Forest Land][no option][no type]
status: valid
status modified: 2017-02-13
accepted date: 2017-02-13
in scheme: IPCC_variables_MMR

4.A.2 Mineralization [Forest Land][Direct N2O Emissions from N Mineralization/Immobilization][Emissions][N2O][kt][Land][no method][Forest Land][no option][no type]
type: Concept
definition: 4.A.2 Mineralization [Forest Land][Direct N2O Emissions from N Mineralization/Immobilization][Emissions][N2O][kt][Land][no method][Forest Land][no option][no type]
status: valid
status modified: 2017-02-13
accepted date: 2017-02-13
in scheme: IPCC_variables_MMR

4.A.2 Organic N Fertilizers [Forest Land][Organic N Fertilizers][Emissions][N2O][kt][Land][no method][Forest Land][no option][no type]
type: Concept
definition: 4.A.2 Organic N Fertilizers [Forest Land][Organic N Fertilizers][Emissions][N2O][kt][Land][no method][Forest Land][no option][no type]
status: valid
status modified: 2017-02-13
accepted date: 2017-02-13
in scheme: IPCC_variables_MMR

4.A.2 Wildfires [Forest Land][Wildfires][Emissions][CH4][kt][Land][no method][Forest Land][no option][no type]
type: Concept
definition: 4.A.2 Wildfires [Forest Land][Wildfires][Emissions][CH4][kt][Land][no method][Forest Land][no option][no type]
status: valid
status modified: 2017-02-13
accepted date: 2017-02-13
in scheme: IPCC_variables_MMR

4.A.2 Wildfires [Forest Land][Wildfires][Emissions][N2O][kt][Land][no method][Forest Land][no option][no type]
type: Concept
definition: 4.A.2 Wildfires [Forest Land][Wildfires][Emissions][N2O][kt][Land][no method][Forest Land][no option][no type]
status: valid
status modified: 2017-02-13
accepted date: 2017-02-13
in scheme: IPCC_variables_MMR

http://dd.eionet.europa.eu/vocabulary/ghg/IPCC_variables_MMR/FDED6B8C-A7D7-400F-8062-3F40968044D2
type: Concept
preferred label: 4.A.2.1 Rewetted Mineral Soils [Forest Land][Emissions and removals from drainage and rewetting and other management of organic and mineral soils][Emissions][CH4][kt][Land][no method][Forest Land][no option][Rewetted Mineral Soils]
definition: 4.A.2.1 Rewetted Mineral Soils [Forest Land][Emissions and removals from drainage and rewetting and other management of organic and mineral soils][Emissions][CH4][kt][Land][no method][Forest Land][no option][Rewetted Mineral Soils]
status: valid
status modified: 2017-02-13
accepted date: 2017-02-13
in scheme: IPCC_variables_MMR

http://dd.eionet.europa.eu/vocabulary/ghg/IPCC_variables_MMR/3967B4CB-777D-4244-A7D8-9A48D3DB811F
type: Concept
preferred label: 4.A.2.1 Rewetted Mineral Soils [Forest Land][Emissions and removals from drainage and rewetting and other management of organic and mineral soils][Emissions][N2O][kt][Land][no method][Forest Land][no option][Rewetted Mineral Soils]
definition: 4.A.2.1 Rewetted Mineral Soils [Forest Land][Emissions and removals from drainage and rewetting and other management of organic and mineral soils][Emissions][N2O][kt][Land][no method][Forest Land][no option][Rewetted Mineral Soils]
status: valid
status modified: 2017-02-13
accepted date: 2017-02-13
in scheme: IPCC_variables_MMR

http://dd.eionet.europa.eu/vocabulary/ghg/IPCC_variables_MMR/5DEEBCAF-F19F-4284-BB41-C695E730180D
type: Concept
preferred label: 4.A.2.2 Other Minaral Soils [Forest Land][Emissions and removals from drainage and rewetting and other management of organic and mineral soils][Emissions][CH4][kt][Land][no method][Forest Land][no option][Other Mineral Soils]
definition: 4.A.2.2 Other Minaral Soils [Forest Land][Emissions and removals from drainage and rewetting and other management of organic and mineral soils][Emissions][CH4][kt][Land][no method][Forest Land][no option][Other Mineral Soils]
status: valid
status modified: 2017-02-13
accepted date: 2017-02-13
in scheme: IPCC_variables_MMR

http://dd.eionet.europa.eu/vocabulary/ghg/IPCC_variables_MMR/C6ADBB54-B0F4-4948-9782-CB3912A00141
type: Concept
preferred label: 4.A.2.2 Other Minaral Soils [Forest Land][Emissions and removals from drainage and rewetting and other management of organic and mineral soils][Emissions][N2O][kt][Land][no method][Forest Land][no option][Other Mineral Soils]
definition: 4.A.2.2 Other Minaral Soils [Forest Land][Emissions and removals from drainage and rewetting and other management of organic and mineral soils][Emissions][N2O][kt][Land][no method][Forest Land][no option][Other Mineral Soils]
status: valid
status modified: 2017-02-13
accepted date: 2017-02-13
in scheme: IPCC_variables_MMR

4.B [Cropland][Land Use][Emissions][CH4][kt][no source][no method][Cropland][no option][no type]
type: Concept
definition: 4.B [Cropland][Land Use][Emissions][CH4][kt][no source][no method][Cropland][no option][no type]
status: valid
status modified: 2017-02-13
accepted date: 2017-02-13
in scheme: IPCC_variables_MMR

4.B [Cropland][Land Use][Emissions][CO2][kt][no source][no method][Cropland][no option][no type]
type: Concept
definition: 4.B [Cropland][Land Use][Emissions][CO2][kt][no source][no method][Cropland][no option][no type]
status: valid
status modified: 2017-02-13
accepted date: 2017-02-13
in scheme: IPCC_variables_MMR

4.B [Cropland][Land Use][Emissions][N2O][kt][no source][no method][Cropland][no option][no type]
type: Concept
definition: 4.B [Cropland][Land Use][Emissions][N2O][kt][no source][no method][Cropland][no option][no type]
status: valid
status modified: 2017-02-13
accepted date: 2017-02-13
in scheme: IPCC_variables_MMR

http://dd.eionet.europa.eu/vocabulary/ghg/IPCC_variables_MMR/58A22957-326E-43C5-ACF6-CAB20FFD0C41
type: Concept
preferred label: 4.B.1 Total Organic Soils [Cropland][Emissions and removals from drainage and rewetting and other management of organic and mineral soils][Emissions][CH4][kt][Land][no method][Cropland][no option][Organic soils]
definition: 4.B.1 Total Organic Soils [Cropland][Emissions and removals from drainage and rewetting and other management of organic and mineral soils][Emissions][CH4][kt][Land][no method][Cropland][no option][Organic soils]
status: valid
status modified: 2017-02-13
accepted date: 2017-02-13
in scheme: IPCC_variables_MMR

4.B.1 [Cropland][Land Use][Emissions][CH4][kt][Cropland][no method][Cropland][no option][no type]
type: Concept
definition: 4.B.1 [Cropland][Land Use][Emissions][CH4][kt][Cropland][no method][Cropland][no option][no type]
status: valid
status modified: 2017-02-13
accepted date: 2017-02-13
in scheme: IPCC_variables_MMR

4.B.1 [Cropland][Land Use][Emissions][CO2][kt][Cropland][no method][Cropland][no option][no type]
type: Concept
definition: 4.B.1 [Cropland][Land Use][Emissions][CO2][kt][Cropland][no method][Cropland][no option][no type]
status: valid
status modified: 2017-02-13
accepted date: 2017-02-13
in scheme: IPCC_variables_MMR

4.B.1 [Cropland][Land Use][Emissions][N2O][kt][Cropland][no method][Cropland][no option][no type]
type: Concept
definition: 4.B.1 [Cropland][Land Use][Emissions][N2O][kt][Cropland][no method][Cropland][no option][no type]
status: valid
status modified: 2017-02-13
accepted date: 2017-02-13
in scheme: IPCC_variables_MMR

4.B.1 Biomass Burning [Cropland][Biomass Burning][Emissions][CH4][kt][Cropland][no method][Cropland][no option][no type]
type: Concept
definition: 4.B.1 Biomass Burning [Cropland][Biomass Burning][Emissions][CH4][kt][Cropland][no method][Cropland][no option][no type]
status: valid
status modified: 2017-02-13
accepted date: 2017-02-13
in scheme: IPCC_variables_MMR

4.B.1 Biomass Burning [Cropland][Biomass Burning][Emissions][N2O][kt][Cropland][no method][Cropland][no option][no type]
type: Concept
definition: 4.B.1 Biomass Burning [Cropland][Biomass Burning][Emissions][N2O][kt][Cropland][no method][Cropland][no option][no type]
status: valid
status modified: 2017-02-13
accepted date: 2017-02-13
in scheme: IPCC_variables_MMR

4.B.1 Controlled Burning [Cropland][Controlled Burning][Emissions][CH4][kt][Cropland][no method][Cropland][no option][no type]
type: Concept
definition: 4.B.1 Controlled Burning [Cropland][Controlled Burning][Emissions][CH4][kt][Cropland][no method][Cropland][no option][no type]
status: valid
status modified: 2017-02-13
accepted date: 2017-02-13
in scheme: IPCC_variables_MMR

4.B.1 Controlled Burning [Cropland][Controlled Burning][Emissions][N2O][kt][Cropland][no method][Cropland][no option][no type]
type: Concept
definition: 4.B.1 Controlled Burning [Cropland][Controlled Burning][Emissions][N2O][kt][Cropland][no method][Cropland][no option][no type]
status: valid
status modified: 2017-02-13
accepted date: 2017-02-13
in scheme: IPCC_variables_MMR

4.B.1 Wildfires [Cropland][Wildfires][Emissions][CH4][kt][Cropland][no method][Cropland][no option][no type]
type: Concept
definition: 4.B.1 Wildfires [Cropland][Wildfires][Emissions][CH4][kt][Cropland][no method][Cropland][no option][no type]
status: valid
status modified: 2017-02-13
accepted date: 2017-02-13
in scheme: IPCC_variables_MMR

4.B.1 Wildfires [Cropland][Wildfires][Emissions][N2O][kt][Cropland][no method][Cropland][no option][no type]
type: Concept
definition: 4.B.1 Wildfires [Cropland][Wildfires][Emissions][N2O][kt][Cropland][no method][Cropland][no option][no type]
status: valid
status modified: 2017-02-13
accepted date: 2017-02-13
in scheme: IPCC_variables_MMR

http://dd.eionet.europa.eu/vocabulary/ghg/IPCC_variables_MMR/FC91E59B-026B-401F-BCC5-87D10D8EDA8A
type: Concept
preferred label: 4.B.1.1 Drained Organic Soils [Cropland][Emissions and removals from drainage and rewetting and other management of organic and mineral soils][Emissions][CH4][kt][Land][no method][Cropland][no option][Drained Organic Soils]
definition: 4.B.1.1 Drained Organic Soils [Cropland][Emissions and removals from drainage and rewetting and other management of organic and mineral soils][Emissions][CH4][kt][Land][no method][Cropland][no option][Drained Organic Soils]
status: valid
status modified: 2017-02-13
accepted date: 2017-02-13
in scheme: IPCC_variables_MMR

http://dd.eionet.europa.eu/vocabulary/ghg/IPCC_variables_MMR/7674C675-61A6-4030-BE3D-8AA971F10000
type: Concept
preferred label: 4.B.1.2 Rewetted Organic Soils [Cropland][Emissions and removals from drainage and rewetting and other management of organic and mineral soils][Emissions][CH4][kt][Land][no method][Cropland][no option][Rewetted Organic Soils]
definition: 4.B.1.2 Rewetted Organic Soils [Cropland][Emissions and removals from drainage and rewetting and other management of organic and mineral soils][Emissions][CH4][kt][Land][no method][Cropland][no option][Rewetted Organic Soils]
status: valid
status modified: 2017-02-13
accepted date: 2017-02-13
in scheme: IPCC_variables_MMR

http://dd.eionet.europa.eu/vocabulary/ghg/IPCC_variables_MMR/849F0A35-6788-4B4E-B4DE-130AB8B52FE9
type: Concept
preferred label: 4.B.1.3 Other Organic Soils [Cropland][Emissions and removals from drainage and rewetting and other management of organic and mineral soils][Emissions][CH4][kt][Land][no method][Cropland][no option][Other Organic Soils]
definition: 4.B.1.3 Other Organic Soils [Cropland][Emissions and removals from drainage and rewetting and other management of organic and mineral soils][Emissions][CH4][kt][Land][no method][Cropland][no option][Other Organic Soils]
status: valid
status modified: 2017-02-13
accepted date: 2017-02-13
in scheme: IPCC_variables_MMR

http://dd.eionet.europa.eu/vocabulary/ghg/IPCC_variables_MMR/5BA39769-2C0D-416E-90D5-0B4E8FD56065
type: Concept
preferred label: 4.B.2 Total Mineral Soils [Cropland][Emissions and removals from drainage and rewetting and other management of organic and mineral soils][Emissions][CH4][kt][Land][no method][Cropland][no option][Mineral soils]
definition: 4.B.2 Total Mineral Soils [Cropland][Emissions and removals from drainage and rewetting and other management of organic and mineral soils][Emissions][CH4][kt][Land][no method][Cropland][no option][Mineral soils]
status: valid
status modified: 2017-02-13
accepted date: 2017-02-13
in scheme: IPCC_variables_MMR

http://dd.eionet.europa.eu/vocabulary/ghg/IPCC_variables_MMR/B033C7F1-D228-4932-8371-23CED2D82282
type: Concept
preferred label: 4.B.2 Total Mineral Soils [Cropland][Emissions and removals from drainage and rewetting and other management of organic and mineral soils][Emissions][N2O][kt][Land][no method][Cropland][no option][Mineral soils]
definition: 4.B.2 Total Mineral Soils [Cropland][Emissions and removals from drainage and rewetting and other management of organic and mineral soils][Emissions][N2O][kt][Land][no method][Cropland][no option][Mineral soils]
status: valid
status modified: 2017-02-13
accepted date: 2017-02-13
in scheme: IPCC_variables_MMR

4.B.2 [Cropland][Land Use][Emissions][CH4][kt][Land][no method][Cropland][no option][no type]
type: Concept
definition: 4.B.2 [Cropland][Land Use][Emissions][CH4][kt][Land][no method][Cropland][no option][no type]
status: valid
status modified: 2017-02-13
accepted date: 2017-02-13
in scheme: IPCC_variables_MMR

4.B.2 [Cropland][Land Use][Emissions][CO2][kt][Land][no method][Cropland][no option][no type]
type: Concept
definition: 4.B.2 [Cropland][Land Use][Emissions][CO2][kt][Land][no method][Cropland][no option][no type]
status: valid
status modified: 2017-02-13
accepted date: 2017-02-13
in scheme: IPCC_variables_MMR

4.B.2 [Cropland][Land Use][Emissions][N2O][kt][Land][no method][Cropland][no option][no type]
type: Concept
definition: 4.B.2 [Cropland][Land Use][Emissions][N2O][kt][Land][no method][Cropland][no option][no type]
status: valid
status modified: 2017-02-13
accepted date: 2017-02-13
in scheme: IPCC_variables_MMR

4.B.2 Biomass Burning [Cropland][Biomass Burning][Emissions][CH4][kt][Land][no method][Cropland][no option][no type]
type: Concept
definition: 4.B.2 Biomass Burning [Cropland][Biomass Burning][Emissions][CH4][kt][Land][no method][Cropland][no option][no type]
status: valid
status modified: 2017-02-13
accepted date: 2017-02-13
in scheme: IPCC_variables_MMR

4.B.2 Biomass Burning [Cropland][Biomass Burning][Emissions][N2O][kt][Land][no method][Cropland][no option][no type]
type: Concept
definition: 4.B.2 Biomass Burning [Cropland][Biomass Burning][Emissions][N2O][kt][Land][no method][Cropland][no option][no type]
status: valid
status modified: 2017-02-13
accepted date: 2017-02-13
in scheme: IPCC_variables_MMR

4.B.2 Controlled Burning [Cropland][Controlled Burning][Emissions][CH4][kt][Land][no method][Cropland][no option][no type]
type: Concept
definition: 4.B.2 Controlled Burning [Cropland][Controlled Burning][Emissions][CH4][kt][Land][no method][Cropland][no option][no type]
status: valid
status modified: 2017-02-13
accepted date: 2017-02-13
in scheme: IPCC_variables_MMR

4.B.2 Controlled Burning [Cropland][Controlled Burning][Emissions][N2O][kt][Land][no method][Cropland][no option][no type]
type: Concept
definition: 4.B.2 Controlled Burning [Cropland][Controlled Burning][Emissions][N2O][kt][Land][no method][Cropland][no option][no type]
status: valid
status modified: 2017-02-13
accepted date: 2017-02-13
in scheme: IPCC_variables_MMR

4.B.2 Direct N2O Emissions [Cropland][Direct N2O Emissions from N Mineralization/Immobilization][Emissions][N2O][kt][Land][no method][Cropland][no option][no type]
type: Concept
definition: 4.B.2 Direct N2O Emissions [Cropland][Direct N2O Emissions from N Mineralization/Immobilization][Emissions][N2O][kt][Land][no method][Cropland][no option][no type]
status: valid
status modified: 2017-02-13
accepted date: 2017-02-13
in scheme: IPCC_variables_MMR

4.B.2 Wildfires [Cropland][Wildfires][Emissions][CH4][kt][Land][no method][Cropland][no option][no type]
type: Concept
definition: 4.B.2 Wildfires [Cropland][Wildfires][Emissions][CH4][kt][Land][no method][Cropland][no option][no type]
status: valid
status modified: 2017-02-13
accepted date: 2017-02-13
in scheme: IPCC_variables_MMR

4.B.2 Wildfires [Cropland][Wildfires][Emissions][N2O][kt][Land][no method][Cropland][no option][no type]
type: Concept
definition: 4.B.2 Wildfires [Cropland][Wildfires][Emissions][N2O][kt][Land][no method][Cropland][no option][no type]
status: valid
status modified: 2017-02-13
accepted date: 2017-02-13
in scheme: IPCC_variables_MMR

http://dd.eionet.europa.eu/vocabulary/ghg/IPCC_variables_MMR/9BC5AA1B-16E8-44A2-A0DD-747FD39745CB
type: Concept
preferred label: 4.B.2.1 Rewetted Mineral Soils [Cropland][Emissions and removals from drainage and rewetting and other management of organic and mineral soils][Emissions][CH4][kt][Land][no method][Cropland][no option][Rewetted Mineral Soils]
definition: 4.B.2.1 Rewetted Mineral Soils [Cropland][Emissions and removals from drainage and rewetting and other management of organic and mineral soils][Emissions][CH4][kt][Land][no method][Cropland][no option][Rewetted Mineral Soils]
status: valid
status modified: 2017-02-13
accepted date: 2017-02-13
in scheme: IPCC_variables_MMR

http://dd.eionet.europa.eu/vocabulary/ghg/IPCC_variables_MMR/17EA1E47-A213-4B5A-8245-DE8F5A7F0ECE
type: Concept
preferred label: 4.B.2.2 Other Minaral Soils [Cropland][Emissions and removals from drainage and rewetting and other management of organic and mineral soils][Emissions][CH4][kt][Land][no method][Cropland][no option][Other Mineral Soils]
definition: 4.B.2.2 Other Minaral Soils [Cropland][Emissions and removals from drainage and rewetting and other management of organic and mineral soils][Emissions][CH4][kt][Land][no method][Cropland][no option][Other Mineral Soils]
status: valid
status modified: 2017-02-13
accepted date: 2017-02-13
in scheme: IPCC_variables_MMR

http://dd.eionet.europa.eu/vocabulary/ghg/IPCC_variables_MMR/F63C3470-EF9D-4E1A-889D-0746734F99AA
type: Concept
preferred label: 4.B.2.2 Other Minaral Soils [Cropland][Emissions and removals from drainage and rewetting and other management of organic and mineral soils][Emissions][N2O][kt][Land][no method][Cropland][no option][Other Mineral Soils]
definition: 4.B.2.2 Other Minaral Soils [Cropland][Emissions and removals from drainage and rewetting and other management of organic and mineral soils][Emissions][N2O][kt][Land][no method][Cropland][no option][Other Mineral Soils]
status: valid
status modified: 2017-02-13
accepted date: 2017-02-13
in scheme: IPCC_variables_MMR

4.C [Grassland][Land Use][Emissions][CH4][kt][no source][no method][GrassLand][no option][no type]
type: Concept
definition: 4.C [Grassland][Land Use][Emissions][CH4][kt][no source][no method][GrassLand][no option][no type]
status: valid
status modified: 2017-02-13
accepted date: 2017-02-13
in scheme: IPCC_variables_MMR

4.C [Grassland][Land Use][Emissions][CO2][kt][no source][no method][GrassLand][no option][no type]
type: Concept
definition: 4.C [Grassland][Land Use][Emissions][CO2][kt][no source][no method][GrassLand][no option][no type]
status: valid
status modified: 2017-02-13
accepted date: 2017-02-13
in scheme: IPCC_variables_MMR

4.C [Grassland][Land Use][Emissions][N2O][kt][no source][no method][GrassLand][no option][no type]
type: Concept
definition: 4.C [Grassland][Land Use][Emissions][N2O][kt][no source][no method][GrassLand][no option][no type]
status: valid
status modified: 2017-02-13
accepted date: 2017-02-13
in scheme: IPCC_variables_MMR

http://dd.eionet.europa.eu/vocabulary/ghg/IPCC_variables_MMR/E0A6B874-15EE-411E-A314-2645BEF604FC
type: Concept
preferred label: 4.C.1 Total Organic Soils [Grassland][Emissions and removals from drainage and rewetting and other management of organic and mineral soils][Emissions][CH4][kt][Land][no method][GrassLand][no option][Organic soils]
definition: 4.C.1 Total Organic Soils [Grassland][Emissions and removals from drainage and rewetting and other management of organic and mineral soils][Emissions][CH4][kt][Land][no method][GrassLand][no option][Organic soils]
status: valid
status modified: 2017-02-13
accepted date: 2017-02-13
in scheme: IPCC_variables_MMR

4.C.1 [Grassland][Land Use][Emissions][CH4][kt][Grassland][no method][GrassLand][no option][no type]
type: Concept
definition: 4.C.1 [Grassland][Land Use][Emissions][CH4][kt][Grassland][no method][GrassLand][no option][no type]
status: valid
status modified: 2017-02-13
accepted date: 2017-02-13
in scheme: IPCC_variables_MMR

4.C.1 [Grassland][Land Use][Emissions][CO2][kt][Grassland][no method][GrassLand][no option][no type]
type: Concept
definition: 4.C.1 [Grassland][Land Use][Emissions][CO2][kt][Grassland][no method][GrassLand][no option][no type]
status: valid
status modified: 2017-02-13
accepted date: 2017-02-13
in scheme: IPCC_variables_MMR

4.C.1 [Grassland][Land Use][Emissions][N2O][kt][Grassland][no method][GrassLand][no option][no type]
type: Concept
definition: 4.C.1 [Grassland][Land Use][Emissions][N2O][kt][Grassland][no method][GrassLand][no option][no type]
status: valid
status modified: 2017-02-13
accepted date: 2017-02-13
in scheme: IPCC_variables_MMR

4.C.1 Biomass Burning [Grassland][Biomass Burning][Emissions][CH4][kt][Grassland][no method][GrassLand][no option][no type]
type: Concept
definition: 4.C.1 Biomass Burning [Grassland][Biomass Burning][Emissions][CH4][kt][Grassland][no method][GrassLand][no option][no type]
status: valid
status modified: 2017-02-13
accepted date: 2017-02-13
in scheme: IPCC_variables_MMR

4.C.1 Biomass Burning [Grassland][Biomass Burning][Emissions][N2O][kt][Grassland][no method][GrassLand][no option][no type]
type: Concept
definition: 4.C.1 Biomass Burning [Grassland][Biomass Burning][Emissions][N2O][kt][Grassland][no method][GrassLand][no option][no type]
status: valid
status modified: 2017-02-13
accepted date: 2017-02-13
in scheme: IPCC_variables_MMR

4.C.1 Controlled Burning [Grassland][Controlled Burning][Emissions][CH4][kt][Grassland][no method][GrassLand][no option][no type]
type: Concept
definition: 4.C.1 Controlled Burning [Grassland][Controlled Burning][Emissions][CH4][kt][Grassland][no method][GrassLand][no option][no type]
status: valid
status modified: 2017-02-13
accepted date: 2017-02-13
in scheme: IPCC_variables_MMR

4.C.1 Controlled Burning [Grassland][Controlled Burning][Emissions][N2O][kt][Grassland][no method][GrassLand][no option][no type]
type: Concept
definition: 4.C.1 Controlled Burning [Grassland][Controlled Burning][Emissions][N2O][kt][Grassland][no method][GrassLand][no option][no type]
status: valid
status modified: 2017-02-13
accepted date: 2017-02-13
in scheme: IPCC_variables_MMR

4.C.1 Direct N2O Emissions [Grassland][Direct N2O Emissions from N Mineralization/Immobilization][Emissions][N2O][kt][Grassland][no method][GrassLand][no option][no type]
type: Concept
definition: 4.C.1 Direct N2O Emissions [Grassland][Direct N2O Emissions from N Mineralization/Immobilization][Emissions][N2O][kt][Grassland][no method][GrassLand][no option][no type]
status: valid
status modified: 2017-02-13
accepted date: 2017-02-13
in scheme: IPCC_variables_MMR

4.C.1 Wildfires [Grassland][Wildfires][Emissions][CH4][kt][Grassland][no method][GrassLand][no option][no type]
type: Concept
definition: 4.C.1 Wildfires [Grassland][Wildfires][Emissions][CH4][kt][Grassland][no method][GrassLand][no option][no type]
status: valid
status modified: 2017-02-13
accepted date: 2017-02-13
in scheme: IPCC_variables_MMR

4.C.1 Wildfires [Grassland][Wildfires][Emissions][N2O][kt][Grassland][no method][GrassLand][no option][no type]
type: Concept
definition: 4.C.1 Wildfires [Grassland][Wildfires][Emissions][N2O][kt][Grassland][no method][GrassLand][no option][no type]
status: valid
status modified: 2017-02-13
accepted date: 2017-02-13
in scheme: IPCC_variables_MMR

http://dd.eionet.europa.eu/vocabulary/ghg/IPCC_variables_MMR/992EC34D-EB8C-4D81-B72F-55FEF4DB27FB
type: Concept
preferred label: 4.C.1.1 Drained Organic Soils [Grassland][Emissions and removals from drainage and rewetting and other management of organic and mineral soils][Emissions][CH4][kt][Land][no method][GrassLand][no option][Drained Organic Soils]
definition: 4.C.1.1 Drained Organic Soils [Grassland][Emissions and removals from drainage and rewetting and other management of organic and mineral soils][Emissions][CH4][kt][Land][no method][GrassLand][no option][Drained Organic Soils]
status: valid
status modified: 2017-02-13
accepted date: 2017-02-13
in scheme: IPCC_variables_MMR

http://dd.eionet.europa.eu/vocabulary/ghg/IPCC_variables_MMR/60816A39-DE56-4C79-A995-7244984A390B
type: Concept
preferred label: 4.C.1.2 Rewetted Organic Soils [Grassland][Emissions and removals from drainage and rewetting and other management of organic and mineral soils][Emissions][CH4][kt][Land][no method][GrassLand][no option][Rewetted Organic Soils]
definition: 4.C.1.2 Rewetted Organic Soils [Grassland][Emissions and removals from drainage and rewetting and other management of organic and mineral soils][Emissions][CH4][kt][Land][no method][GrassLand][no option][Rewetted Organic Soils]
status: valid
status modified: 2017-02-13
accepted date: 2017-02-13
in scheme: IPCC_variables_MMR

http://dd.eionet.europa.eu/vocabulary/ghg/IPCC_variables_MMR/0DD3E3A6-6B21-4B53-9670-6303B52E607E
type: Concept
preferred label: 4.C.1.3 Other Organic Soils [Grassland][Emissions and removals from drainage and rewetting and other management of organic and mineral soils][Emissions][CH4][kt][Land][no method][GrassLand][no option][Other Organic Soils]
definition: 4.C.1.3 Other Organic Soils [Grassland][Emissions and removals from drainage and rewetting and other management of organic and mineral soils][Emissions][CH4][kt][Land][no method][GrassLand][no option][Other Organic Soils]
status: valid
status modified: 2017-02-13
accepted date: 2017-02-13
in scheme: IPCC_variables_MMR

http://dd.eionet.europa.eu/vocabulary/ghg/IPCC_variables_MMR/C00EF1B6-F07E-4A85-AA46-21AE486180B2
type: Concept
preferred label: 4.C.2 Total Mineral Soils [Grassland][Emissions and removals from drainage and rewetting and other management of organic and mineral soils][Emissions][CH4][kt][Land][no method][GrassLand][no option][Mineral soils]
definition: 4.C.2 Total Mineral Soils [Grassland][Emissions and removals from drainage and rewetting and other management of organic and mineral soils][Emissions][CH4][kt][Land][no method][GrassLand][no option][Mineral soils]
status: valid
status modified: 2017-02-13
accepted date: 2017-02-13
in scheme: IPCC_variables_MMR

http://dd.eionet.europa.eu/vocabulary/ghg/IPCC_variables_MMR/5E193E3C-7780-4038-923D-D590CBA60C53
type: Concept
preferred label: 4.C.2 Total Mineral Soils [Grassland][Emissions and removals from drainage and rewetting and other management of organic and mineral soils][Emissions][N2O][kt][Land][no method][GrassLand][no option][Mineral soils]
definition: 4.C.2 Total Mineral Soils [Grassland][Emissions and removals from drainage and rewetting and other management of organic and mineral soils][Emissions][N2O][kt][Land][no method][GrassLand][no option][Mineral soils]
status: valid
status modified: 2017-02-13
accepted date: 2017-02-13
in scheme: IPCC_variables_MMR

4.C.2 [Grassland][Land Use][Emissions][CH4][kt][Land][no method][GrassLand][no option][no type]
type: Concept
definition: 4.C.2 [Grassland][Land Use][Emissions][CH4][kt][Land][no method][GrassLand][no option][no type]
status: valid
status modified: 2017-02-13
accepted date: 2017-02-13
in scheme: IPCC_variables_MMR

4.C.2 [Grassland][Land Use][Emissions][CO2][kt][Land][no method][GrassLand][no option][no type]
type: Concept
definition: 4.C.2 [Grassland][Land Use][Emissions][CO2][kt][Land][no method][GrassLand][no option][no type]
status: valid
status modified: 2017-02-13
accepted date: 2017-02-13
in scheme: IPCC_variables_MMR

4.C.2 [Grassland][Land Use][Emissions][N2O][kt][Land][no method][GrassLand][no option][no type]
type: Concept
definition: 4.C.2 [Grassland][Land Use][Emissions][N2O][kt][Land][no method][GrassLand][no option][no type]
status: valid
status modified: 2017-02-13
accepted date: 2017-02-13
in scheme: IPCC_variables_MMR

4.C.2 Biomass Burning [Grassland][Biomass Burning][Emissions][CH4][kt][Land][no method][GrassLand][no option][no type]
type: Concept
definition: 4.C.2 Biomass Burning [Grassland][Biomass Burning][Emissions][CH4][kt][Land][no method][GrassLand][no option][no type]
status: valid
status modified: 2017-02-13
accepted date: 2017-02-13
in scheme: IPCC_variables_MMR

4.C.2 Biomass Burning [Grassland][Biomass Burning][Emissions][N2O][kt][Land][no method][GrassLand][no option][no type]
type: Concept
definition: 4.C.2 Biomass Burning [Grassland][Biomass Burning][Emissions][N2O][kt][Land][no method][GrassLand][no option][no type]
status: valid
status modified: 2017-02-13
accepted date: 2017-02-13
in scheme: IPCC_variables_MMR

4.C.2 Controlled Burning [Grassland][Controlled Burning][Emissions][CH4][kt][Land][no method][GrassLand][no option][no type]
type: Concept
definition: 4.C.2 Controlled Burning [Grassland][Controlled Burning][Emissions][CH4][kt][Land][no method][GrassLand][no option][no type]
status: valid
status modified: 2017-02-13
accepted date: 2017-02-13
in scheme: IPCC_variables_MMR

4.C.2 Controlled Burning [Grassland][Controlled Burning][Emissions][N2O][kt][Land][no method][GrassLand][no option][no type]
type: Concept
definition: 4.C.2 Controlled Burning [Grassland][Controlled Burning][Emissions][N2O][kt][Land][no method][GrassLand][no option][no type]
status: valid
status modified: 2017-02-13
accepted date: 2017-02-13
in scheme: IPCC_variables_MMR

4.C.2 Direct N2O Emissions [Grassland][Direct N2O Emissions from N Mineralization/Immobilization][Emissions][N2O][kt][Land][no method][GrassLand][no option][no type]
type: Concept
definition: 4.C.2 Direct N2O Emissions [Grassland][Direct N2O Emissions from N Mineralization/Immobilization][Emissions][N2O][kt][Land][no method][GrassLand][no option][no type]
status: valid
status modified: 2017-02-13
accepted date: 2017-02-13
in scheme: IPCC_variables_MMR

4.C.2 Wildfires [Grassland][Wildfires][Emissions][CH4][kt][Land][no method][GrassLand][no option][no type]
type: Concept
definition: 4.C.2 Wildfires [Grassland][Wildfires][Emissions][CH4][kt][Land][no method][GrassLand][no option][no type]
status: valid
status modified: 2017-02-13
accepted date: 2017-02-13
in scheme: IPCC_variables_MMR

4.C.2 Wildfires [Grassland][Wildfires][Emissions][N2O][kt][Land][no method][GrassLand][no option][no type]
type: Concept
definition: 4.C.2 Wildfires [Grassland][Wildfires][Emissions][N2O][kt][Land][no method][GrassLand][no option][no type]
status: valid
status modified: 2017-02-13
accepted date: 2017-02-13
in scheme: IPCC_variables_MMR

http://dd.eionet.europa.eu/vocabulary/ghg/IPCC_variables_MMR/DAA352F9-E836-42DB-A4EC-3F9F38A3C33F
type: Concept
preferred label: 4.C.2.1 Rewetted Mineral Soils [Grassland][Emissions and removals from drainage and rewetting and other management of organic and mineral soils][Emissions][CH4][kt][Land][no method][GrassLand][no option][Rewetted Mineral Soils]
definition: 4.C.2.1 Rewetted Mineral Soils [Grassland][Emissions and removals from drainage and rewetting and other management of organic and mineral soils][Emissions][CH4][kt][Land][no method][GrassLand][no option][Rewetted Mineral Soils]
status: valid
status modified: 2017-02-13
accepted date: 2017-02-13
in scheme: IPCC_variables_MMR

http://dd.eionet.europa.eu/vocabulary/ghg/IPCC_variables_MMR/73260D78-5785-4905-B3B5-00CEB49BD738
type: Concept
preferred label: 4.C.2.2 Other Minaral Soils [Grassland][Emissions and removals from drainage and rewetting and other management of organic and mineral soils][Emissions][CH4][kt][Land][no method][GrassLand][no option][Other Mineral Soils]
definition: 4.C.2.2 Other Minaral Soils [Grassland][Emissions and removals from drainage and rewetting and other management of organic and mineral soils][Emissions][CH4][kt][Land][no method][GrassLand][no option][Other Mineral Soils]
status: valid
status modified: 2017-02-13
accepted date: 2017-02-13
in scheme: IPCC_variables_MMR

http://dd.eionet.europa.eu/vocabulary/ghg/IPCC_variables_MMR/C1951E78-6DC7-4E35-B919-02395CBAF26D
type: Concept
preferred label: 4.C.2.2 Other Minaral Soils [Grassland][Emissions and removals from drainage and rewetting and other management of organic and mineral soils][Emissions][N2O][kt][Land][no method][GrassLand][no option][Other Mineral Soils]
definition: 4.C.2.2 Other Minaral Soils [Grassland][Emissions and removals from drainage and rewetting and other management of organic and mineral soils][Emissions][N2O][kt][Land][no method][GrassLand][no option][Other Mineral Soils]
status: valid
status modified: 2017-02-13
accepted date: 2017-02-13
in scheme: IPCC_variables_MMR

4.D [Wetlands][Land Use][Emissions][CH4][kt][no source][no method][Wetlands][no option][no type]
type: Concept
definition: 4.D [Wetlands][Land Use][Emissions][CH4][kt][no source][no method][Wetlands][no option][no type]
status: valid
status modified: 2017-02-13
accepted date: 2017-02-13
in scheme: IPCC_variables_MMR

4.D [Wetlands][Land Use][Emissions][CO2][kt][no source][no method][Wetlands][no option][no type]
type: Concept
definition: 4.D [Wetlands][Land Use][Emissions][CO2][kt][no source][no method][Wetlands][no option][no type]
status: valid
status modified: 2017-02-13
accepted date: 2017-02-13
in scheme: IPCC_variables_MMR

4.D [Wetlands][Land Use][Emissions][N2O][kt][no source][no method][Wetlands][no option][no type]
type: Concept
definition: 4.D [Wetlands][Land Use][Emissions][N2O][kt][no source][no method][Wetlands][no option][no type]
status: valid
status modified: 2017-02-13
accepted date: 2017-02-13
in scheme: IPCC_variables_MMR

http://dd.eionet.europa.eu/vocabulary/ghg/IPCC_variables_MMR/B5996266-1FE1-4CE9-8465-CC4848B2DD74
type: Concept
preferred label: 4.D.1 .1 Total Organic Soils [Wetlands][Emissions and removals from drainage and rewetting and other management of organic and mineral soils][Emissions][CH4][kt][Land][no method][Peat Extraction][no option][Organic soils]
definition: 4.D.1 .1 Total Organic Soils [Wetlands][Emissions and removals from drainage and rewetting and other management of organic and mineral soils][Emissions][CH4][kt][Land][no method][Peat Extraction][no option][Organic soils]
status: valid
status modified: 2017-02-13
accepted date: 2017-02-13
in scheme: IPCC_variables_MMR

http://dd.eionet.europa.eu/vocabulary/ghg/IPCC_variables_MMR/B2231E30-7CB7-42A1-85DE-F7E96AC56DD9
type: Concept
preferred label: 4.D.1 .1 Total Organic Soils [Wetlands][Emissions and removals from drainage and rewetting and other management of organic and mineral soils][Emissions][N2O][kt][Land][no method][Peat Extraction][no option][Organic soils]
definition: 4.D.1 .1 Total Organic Soils [Wetlands][Emissions and removals from drainage and rewetting and other management of organic and mineral soils][Emissions][N2O][kt][Land][no method][Peat Extraction][no option][Organic soils]
status: valid
status modified: 2017-02-13
accepted date: 2017-02-13
in scheme: IPCC_variables_MMR

4.D.1 [Wetlands][Land Use][Emissions][CH4][kt][Wetlands][no method][Wetlands][no option][no type]
type: Concept
definition: 4.D.1 [Wetlands][Land Use][Emissions][CH4][kt][Wetlands][no method][Wetlands][no option][no type]
status: valid
status modified: 2017-02-13
accepted date: 2017-02-13
in scheme: IPCC_variables_MMR

4.D.1 [Wetlands][Land Use][Emissions][CO2][kt][Wetlands][no method][Wetlands][no option][no type]
type: Concept
definition: 4.D.1 [Wetlands][Land Use][Emissions][CO2][kt][Wetlands][no method][Wetlands][no option][no type]
status: valid
status modified: 2017-02-13
accepted date: 2017-02-13
in scheme: IPCC_variables_MMR

4.D.1 [Wetlands][Land Use][Emissions][N2O][kt][Wetlands][no method][Wetlands][no option][no type]
type: Concept
definition: 4.D.1 [Wetlands][Land Use][Emissions][N2O][kt][Wetlands][no method][Wetlands][no option][no type]
status: valid
status modified: 2017-02-13
accepted date: 2017-02-13
in scheme: IPCC_variables_MMR

4.D.1 Biomass Burning [Wetlands][Biomass Burning][Emissions][CH4][kt][Wetlands][no method][Wetlands][no option][no type]
type: Concept
definition: 4.D.1 Biomass Burning [Wetlands][Biomass Burning][Emissions][CH4][kt][Wetlands][no method][Wetlands][no option][no type]
status: valid
status modified: 2017-02-13
accepted date: 2017-02-13
in scheme: IPCC_variables_MMR

4.D.1 Biomass Burning [Wetlands][Biomass Burning][Emissions][N2O][kt][Wetlands][no method][Wetlands][no option][no type]
type: Concept
definition: 4.D.1 Biomass Burning [Wetlands][Biomass Burning][Emissions][N2O][kt][Wetlands][no method][Wetlands][no option][no type]
status: valid
status modified: 2017-02-13
accepted date: 2017-02-13
in scheme: IPCC_variables_MMR

4.D.1 Controlled Burning [Wetlands][Controlled Burning][Emissions][CH4][kt][Wetlands][no method][Wetlands][no option][no type]
type: Concept
definition: 4.D.1 Controlled Burning [Wetlands][Controlled Burning][Emissions][CH4][kt][Wetlands][no method][Wetlands][no option][no type]
status: valid
status modified: 2017-02-13
accepted date: 2017-02-13
in scheme: IPCC_variables_MMR

4.D.1 Controlled Burning [Wetlands][Controlled Burning][Emissions][N2O][kt][Wetlands][no method][Wetlands][no option][no type]
type: Concept
definition: 4.D.1 Controlled Burning [Wetlands][Controlled Burning][Emissions][N2O][kt][Wetlands][no method][Wetlands][no option][no type]
status: valid
status modified: 2017-02-13
accepted date: 2017-02-13
in scheme: IPCC_variables_MMR

4.D.1 Direct N2O Emissions [Wetlands][Direct N2O Emissions from N Mineralization/Immobilization][Emissions][N2O][kt][Wetlands][no method][Wetlands][no option][no type]
type: Concept
definition: 4.D.1 Direct N2O Emissions [Wetlands][Direct N2O Emissions from N Mineralization/Immobilization][Emissions][N2O][kt][Wetlands][no method][Wetlands][no option][no type]
status: valid
status modified: 2017-02-13
accepted date: 2017-02-13
in scheme: IPCC_variables_MMR

4.D.1 Direct N2O Emissions from N Inputs [Wetlands][Direct N2O Emissions from N inputs][Emissions][N2O][kt][Wetlands][no method][Wetlands][no option][no type]
type: Concept
definition: 4.D.1 Direct N2O Emissions from N Inputs [Wetlands][Direct N2O Emissions from N inputs][Emissions][N2O][kt][Wetlands][no method][Wetlands][no option][no type]
status: valid
status modified: 2017-02-13
accepted date: 2017-02-13
in scheme: IPCC_variables_MMR

4.D.1 Inorganic N Fertilizers [Wetlands][Inorganic N Fertilizers][Emissions][N2O][kt][Wetlands][no method][Wetlands][no option][no type]
type: Concept
definition: 4.D.1 Inorganic N Fertilizers [Wetlands][Inorganic N Fertilizers][Emissions][N2O][kt][Wetlands][no method][Wetlands][no option][no type]
status: valid
status modified: 2017-02-13
accepted date: 2017-02-13
in scheme: IPCC_variables_MMR

4.D.1 Organic N Fertilizers [Wetlands][Organic N Fertilizers][Emissions][N2O][kt][Wetlands][no method][Wetlands][no option][no type]
type: Concept
definition: 4.D.1 Organic N Fertilizers [Wetlands][Organic N Fertilizers][Emissions][N2O][kt][Wetlands][no method][Wetlands][no option][no type]
status: valid
status modified: 2017-02-13
accepted date: 2017-02-13
in scheme: IPCC_variables_MMR

http://dd.eionet.europa.eu/vocabulary/ghg/IPCC_variables_MMR/EDD66F29-E970-4B44-84CD-0E70F1B6F33F
type: Concept
preferred label: 4.D.1 Peat Extraction [Wetlands][Emissions and removals from drainage and rewetting and other management of organic and mineral soils][Emissions][CH4][kt][Land][no method][Peat Extraction][no option][Soils]
definition: 4.D.1 Peat Extraction [Wetlands][Emissions and removals from drainage and rewetting and other management of organic and mineral soils][Emissions][CH4][kt][Land][no method][Peat Extraction][no option][Soils]
status: valid
status modified: 2017-02-13
accepted date: 2017-02-13
in scheme: IPCC_variables_MMR

http://dd.eionet.europa.eu/vocabulary/ghg/IPCC_variables_MMR/861B721A-BF61-4923-BE60-135FC4DBFBB5
type: Concept
preferred label: 4.D.1 Peat Extraction [Wetlands][Emissions and removals from drainage and rewetting and other management of organic and mineral soils][Emissions][N2O][kt][Land][no method][Peat Extraction][no option][Soils]
definition: 4.D.1 Peat Extraction [Wetlands][Emissions and removals from drainage and rewetting and other management of organic and mineral soils][Emissions][N2O][kt][Land][no method][Peat Extraction][no option][Soils]
status: valid
status modified: 2017-02-13
accepted date: 2017-02-13
in scheme: IPCC_variables_MMR

4.D.1 Wildfires [Wetlands][Wildfires][Emissions][CH4][kt][Wetlands][no method][Wetlands][no option][no type]
type: Concept
definition: 4.D.1 Wildfires [Wetlands][Wildfires][Emissions][CH4][kt][Wetlands][no method][Wetlands][no option][no type]
status: valid
status modified: 2017-02-13
accepted date: 2017-02-13
in scheme: IPCC_variables_MMR

4.D.1 Wildfires [Wetlands][Wildfires][Emissions][N2O][kt][Wetlands][no method][Wetlands][no option][no type]
type: Concept
definition: 4.D.1 Wildfires [Wetlands][Wildfires][Emissions][N2O][kt][Wetlands][no method][Wetlands][no option][no type]
status: valid
status modified: 2017-02-13
accepted date: 2017-02-13
in scheme: IPCC_variables_MMR

http://dd.eionet.europa.eu/vocabulary/ghg/IPCC_variables_MMR/BF594747-E8EF-4373-AF89-3072B9B7872B
type: Concept
preferred label: 4.D.1.1.1 Drained Organic Soils [Wetlands][Emissions and removals from drainage and rewetting and other management of organic and mineral soils][Emissions][CH4][kt][Land][no method][Peat Extraction][no option][Drained Organic Soils]
definition: 4.D.1.1.1 Drained Organic Soils [Wetlands][Emissions and removals from drainage and rewetting and other management of organic and mineral soils][Emissions][CH4][kt][Land][no method][Peat Extraction][no option][Drained Organic Soils]
status: valid
status modified: 2017-02-13
accepted date: 2017-02-13
in scheme: IPCC_variables_MMR

http://dd.eionet.europa.eu/vocabulary/ghg/IPCC_variables_MMR/FE856E75-DA38-45B0-856D-79A739A154C8
type: Concept
preferred label: 4.D.1.1.1 Drained Organic Soils [Wetlands][Emissions and removals from drainage and rewetting and other management of organic and mineral soils][Emissions][N2O][kt][Land][no method][Peat Extraction][no option][Drained Organic Soils]
definition: 4.D.1.1.1 Drained Organic Soils [Wetlands][Emissions and removals from drainage and rewetting and other management of organic and mineral soils][Emissions][N2O][kt][Land][no method][Peat Extraction][no option][Drained Organic Soils]
status: valid
status modified: 2017-02-13
accepted date: 2017-02-13
in scheme: IPCC_variables_MMR

http://dd.eionet.europa.eu/vocabulary/ghg/IPCC_variables_MMR/6533D186-5836-4E8B-AE1E-BF2FC73690A8
type: Concept
preferred label: 4.D.1.1.2 Rewetted Organic Soils [Wetlands][Emissions and removals from drainage and rewetting and other management of organic and mineral soils][Emissions][CH4][kt][Land][no method][Peat Extraction][no option][Rewetted Organic Soils]
definition: 4.D.1.1.2 Rewetted Organic Soils [Wetlands][Emissions and removals from drainage and rewetting and other management of organic and mineral soils][Emissions][CH4][kt][Land][no method][Peat Extraction][no option][Rewetted Organic Soils]
status: valid
status modified: 2017-02-13
accepted date: 2017-02-13
in scheme: IPCC_variables_MMR

http://dd.eionet.europa.eu/vocabulary/ghg/IPCC_variables_MMR/E11E7275-170C-4B39-AEAE-80DE0F7F4514
type: Concept
preferred label: 4.D.1.1.2 Rewetted Organic Soils [Wetlands][Emissions and removals from drainage and rewetting and other management of organic and mineral soils][Emissions][N2O][kt][Land][no method][Peat Extraction][no option][Rewetted Organic Soils]
definition: 4.D.1.1.2 Rewetted Organic Soils [Wetlands][Emissions and removals from drainage and rewetting and other management of organic and mineral soils][Emissions][N2O][kt][Land][no method][Peat Extraction][no option][Rewetted Organic Soils]
status: valid
status modified: 2017-02-13
accepted date: 2017-02-13
in scheme: IPCC_variables_MMR

http://dd.eionet.europa.eu/vocabulary/ghg/IPCC_variables_MMR/B44F8E86-B0A4-48CB-AB51-D2671D26AEE0
type: Concept
preferred label: 4.D.1.1.3 Other Organic Soils [Wetlands][Emissions and removals from drainage and rewetting and other management of organic and mineral soils][Emissions][CH4][kt][Land][no method][Peat Extraction][no option][Other Organic Soils]
definition: 4.D.1.1.3 Other Organic Soils [Wetlands][Emissions and removals from drainage and rewetting and other management of organic and mineral soils][Emissions][CH4][kt][Land][no method][Peat Extraction][no option][Other Organic Soils]
status: valid
status modified: 2017-02-13
accepted date: 2017-02-13
in scheme: IPCC_variables_MMR

http://dd.eionet.europa.eu/vocabulary/ghg/IPCC_variables_MMR/4EF5BD35-FA08-4E0A-87EF-BED1BEC03C0A
type: Concept
preferred label: 4.D.1.1.3 Other Organic Soils [Wetlands][Emissions and removals from drainage and rewetting and other management of organic and mineral soils][Emissions][N2O][kt][Land][no method][Peat Extraction][no option][Other Organic Soils]
definition: 4.D.1.1.3 Other Organic Soils [Wetlands][Emissions and removals from drainage and rewetting and other management of organic and mineral soils][Emissions][N2O][kt][Land][no method][Peat Extraction][no option][Other Organic Soils]
status: valid
status modified: 2017-02-13
accepted date: 2017-02-13
in scheme: IPCC_variables_MMR

http://dd.eionet.europa.eu/vocabulary/ghg/IPCC_variables_MMR/520D08FB-05D3-4D16-9D2E-958F15BF1848
type: Concept
preferred label: 4.D.1.2 Total Mineral Soils [Wetlands][Emissions and removals from drainage and rewetting and other management of organic and mineral soils][Emissions][CH4][kt][Land][no method][Peat Extraction][no option][Mineral soils]
definition: 4.D.1.2 Total Mineral Soils [Wetlands][Emissions and removals from drainage and rewetting and other management of organic and mineral soils][Emissions][CH4][kt][Land][no method][Peat Extraction][no option][Mineral soils]
status: valid
status modified: 2017-02-13
accepted date: 2017-02-13
in scheme: IPCC_variables_MMR

http://dd.eionet.europa.eu/vocabulary/ghg/IPCC_variables_MMR/695FA791-1323-4081-8F22-22224CD64612
type: Concept
preferred label: 4.D.1.2 Total Mineral Soils [Wetlands][Emissions and removals from drainage and rewetting and other management of organic and mineral soils][Emissions][N2O][kt][Land][no method][Peat Extraction][no option][Mineral soils]
definition: 4.D.1.2 Total Mineral Soils [Wetlands][Emissions and removals from drainage and rewetting and other management of organic and mineral soils][Emissions][N2O][kt][Land][no method][Peat Extraction][no option][Mineral soils]
status: valid
status modified: 2017-02-13
accepted date: 2017-02-13
in scheme: IPCC_variables_MMR

http://dd.eionet.europa.eu/vocabulary/ghg/IPCC_variables_MMR/D392E5D5-D889-4A13-BD4E-B4026A43583A
type: Concept
preferred label: 4.D.1.2.1 Rewetted Mineral Soils [Wetlands][Emissions and removals from drainage and rewetting and other management of organic and mineral soils][Emissions][CH4][kt][Land][no method][Peat Extraction][no option][Rewetted Mineral Soils]
definition: 4.D.1.2.1 Rewetted Mineral Soils [Wetlands][Emissions and removals from drainage and rewetting and other management of organic and mineral soils][Emissions][CH4][kt][Land][no method][Peat Extraction][no option][Rewetted Mineral Soils]
status: valid
status modified: 2017-02-13
accepted date: 2017-02-13
in scheme: IPCC_variables_MMR

http://dd.eionet.europa.eu/vocabulary/ghg/IPCC_variables_MMR/355A5BED-E724-4C63-BF17-351160A1B1B2
type: Concept
preferred label: 4.D.1.2.1 Rewetted Mineral Soils [Wetlands][Emissions and removals from drainage and rewetting and other management of organic and mineral soils][Emissions][N2O][kt][Land][no method][Peat Extraction][no option][Rewetted Mineral Soils]
definition: 4.D.1.2.1 Rewetted Mineral Soils [Wetlands][Emissions and removals from drainage and rewetting and other management of organic and mineral soils][Emissions][N2O][kt][Land][no method][Peat Extraction][no option][Rewetted Mineral Soils]
status: valid
status modified: 2017-02-13
accepted date: 2017-02-13
in scheme: IPCC_variables_MMR

http://dd.eionet.europa.eu/vocabulary/ghg/IPCC_variables_MMR/252AD91B-C65A-48FA-AC3A-5AD106B05AB3
type: Concept
preferred label: 4.D.1.2.2 Other Minaral Soils [Wetlands][Emissions and removals from drainage and rewetting and other management of organic and mineral soils][Emissions][CH4][kt][Land][no method][Peat Extraction][no option][Other Mineral Soils]
definition: 4.D.1.2.2 Other Minaral Soils [Wetlands][Emissions and removals from drainage and rewetting and other management of organic and mineral soils][Emissions][CH4][kt][Land][no method][Peat Extraction][no option][Other Mineral Soils]
status: valid
status modified: 2017-02-13
accepted date: 2017-02-13
in scheme: IPCC_variables_MMR

http://dd.eionet.europa.eu/vocabulary/ghg/IPCC_variables_MMR/3280B3D8-CC27-4B27-978E-1EC85CBB9635
type: Concept
preferred label: 4.D.1.2.2 Other Minaral Soils [Wetlands][Emissions and removals from drainage and rewetting and other management of organic and mineral soils][Emissions][N2O][kt][Land][no method][Peat Extraction][no option][Other Mineral Soils]
definition: 4.D.1.2.2 Other Minaral Soils [Wetlands][Emissions and removals from drainage and rewetting and other management of organic and mineral soils][Emissions][N2O][kt][Land][no method][Peat Extraction][no option][Other Mineral Soils]
status: valid
status modified: 2017-02-13
accepted date: 2017-02-13
in scheme: IPCC_variables_MMR

http://dd.eionet.europa.eu/vocabulary/ghg/IPCC_variables_MMR/F14C7349-BBEE-459B-A7F3-4871F671973C
type: Concept
preferred label: 4.D.2 .1 Total Organic Soils [Wetlands][Emissions and removals from drainage and rewetting and other management of organic and mineral soils][Emissions][CH4][kt][Land][no method][Flooded Land][no option][Organic soils]
definition: 4.D.2 .1 Total Organic Soils [Wetlands][Emissions and removals from drainage and rewetting and other management of organic and mineral soils][Emissions][CH4][kt][Land][no method][Flooded Land][no option][Organic soils]
status: valid
status modified: 2017-02-13
accepted date: 2017-02-13
in scheme: IPCC_variables_MMR

http://dd.eionet.europa.eu/vocabulary/ghg/IPCC_variables_MMR/6B96E0C3-CB4C-4A8B-BDD5-DC7192003792
type: Concept
preferred label: 4.D.2 .1 Total Organic Soils [Wetlands][Emissions and removals from drainage and rewetting and other management of organic and mineral soils][Emissions][N2O][kt][Land][no method][Flooded Land][no option][Organic soils]
definition: 4.D.2 .1 Total Organic Soils [Wetlands][Emissions and removals from drainage and rewetting and other management of organic and mineral soils][Emissions][N2O][kt][Land][no method][Flooded Land][no option][Organic soils]
status: valid
status modified: 2017-02-13
accepted date: 2017-02-13
in scheme: IPCC_variables_MMR

4.D.2 [Wetlands][Land Use][Emissions][CH4][kt][Land][no method][Wetlands][no option][no type]
type: Concept
definition: 4.D.2 [Wetlands][Land Use][Emissions][CH4][kt][Land][no method][Wetlands][no option][no type]
status: valid
status modified: 2017-02-13
accepted date: 2017-02-13
in scheme: IPCC_variables_MMR

4.D.2 [Wetlands][Land Use][Emissions][CO2][kt][Land][no method][Wetlands][no option][no type]
type: Concept
definition: 4.D.2 [Wetlands][Land Use][Emissions][CO2][kt][Land][no method][Wetlands][no option][no type]
status: valid
status modified: 2017-02-13
accepted date: 2017-02-13
in scheme: IPCC_variables_MMR

4.D.2 [Wetlands][Land Use][Emissions][N2O][kt][Land][no method][Wetlands][no option][no type]
type: Concept
definition: 4.D.2 [Wetlands][Land Use][Emissions][N2O][kt][Land][no method][Wetlands][no option][no type]
status: valid
status modified: 2017-02-13
accepted date: 2017-02-13
in scheme: IPCC_variables_MMR

4.D.2 Biomass Burning [Wetlands][Biomass Burning][Emissions][CH4][kt][Land][no method][Wetlands][no option][no type]
type: Concept
definition: 4.D.2 Biomass Burning [Wetlands][Biomass Burning][Emissions][CH4][kt][Land][no method][Wetlands][no option][no type]
status: valid
status modified: 2017-02-13
accepted date: 2017-02-13
in scheme: IPCC_variables_MMR

4.D.2 Biomass Burning [Wetlands][Biomass Burning][Emissions][N2O][kt][Land][no method][Wetlands][no option][no type]
type: Concept
definition: 4.D.2 Biomass Burning [Wetlands][Biomass Burning][Emissions][N2O][kt][Land][no method][Wetlands][no option][no type]
status: valid
status modified: 2017-02-13
accepted date: 2017-02-13
in scheme: IPCC_variables_MMR

4.D.2 Controlled Burning [Wetlands][Controlled Burning][Emissions][CH4][kt][Land][no method][Wetlands][no option][no type]
type: Concept
definition: 4.D.2 Controlled Burning [Wetlands][Controlled Burning][Emissions][CH4][kt][Land][no method][Wetlands][no option][no type]
status: valid
status modified: 2017-02-13
accepted date: 2017-02-13
in scheme: IPCC_variables_MMR

4.D.2 Controlled Burning [Wetlands][Controlled Burning][Emissions][N2O][kt][Land][no method][Wetlands][no option][no type]
type: Concept
definition: 4.D.2 Controlled Burning [Wetlands][Controlled Burning][Emissions][N2O][kt][Land][no method][Wetlands][no option][no type]
status: valid
status modified: 2017-02-13
accepted date: 2017-02-13
in scheme: IPCC_variables_MMR

4.D.2 Direct N2O Emissions [Wetlands][Direct N2O Emissions from N inputs][Emissions][N2O][kt][Land][no method][Wetlands][no option][no type]
type: Concept
definition: 4.D.2 Direct N2O Emissions [Wetlands][Direct N2O Emissions from N inputs][Emissions][N2O][kt][Land][no method][Wetlands][no option][no type]
status: valid
status modified: 2017-02-13
accepted date: 2017-02-13
in scheme: IPCC_variables_MMR

4.D.2 Direct N2O Emissions [Wetlands][Direct N2O Emissions from N Mineralization/Immobilization][Emissions][N2O][kt][Land][no method][Wetlands][no option][no type]
type: Concept
definition: 4.D.2 Direct N2O Emissions [Wetlands][Direct N2O Emissions from N Mineralization/Immobilization][Emissions][N2O][kt][Land][no method][Wetlands][no option][no type]
status: valid
status modified: 2017-02-13
accepted date: 2017-02-13
in scheme: IPCC_variables_MMR

4.D.2 Floaded Land [Wetlands][Emissions and removals from drainage and rewetting and other management of organic and mineral soils][Emissions][CH4][kt][Land][no method][Flooded Land][no option][Soils]
type: Concept
definition: 4.D.2 Floaded Land [Wetlands][Emissions and removals from drainage and rewetting and other management of organic and mineral soils][Emissions][CH4][kt][Land][no method][Flooded Land][no option][Soils]
status: valid
status modified: 2017-02-13
accepted date: 2017-02-13
in scheme: IPCC_variables_MMR

4.D.2 Floaded Land [Wetlands][Emissions and removals from drainage and rewetting and other management of organic and mineral soils][Emissions][N2O][kt][Land][no method][Flooded Land][no option][Soils]
type: Concept
definition: 4.D.2 Floaded Land [Wetlands][Emissions and removals from drainage and rewetting and other management of organic and mineral soils][Emissions][N2O][kt][Land][no method][Flooded Land][no option][Soils]
status: valid
status modified: 2017-02-13
accepted date: 2017-02-13
in scheme: IPCC_variables_MMR

4.D.2 Wildfires [Wetlands][Wildfires][Emissions][CH4][kt][Land][no method][Wetlands][no option][no type]
type: Concept
definition: 4.D.2 Wildfires [Wetlands][Wildfires][Emissions][CH4][kt][Land][no method][Wetlands][no option][no type]
status: valid
status modified: 2017-02-13
accepted date: 2017-02-13
in scheme: IPCC_variables_MMR

4.D.2 Wildfires [Wetlands][Wildfires][Emissions][N2O][kt][Land][no method][Wetlands][no option][no type]
type: Concept
definition: 4.D.2 Wildfires [Wetlands][Wildfires][Emissions][N2O][kt][Land][no method][Wetlands][no option][no type]
status: valid
status modified: 2017-02-13
accepted date: 2017-02-13
in scheme: IPCC_variables_MMR

4.D.2.1 Inorganic N Fertilizers [Wetlands][Inorganic N Fertilizers][Emissions][N2O][kt][Land][no method][Wetlands][no option][no type]
type: Concept
definition: 4.D.2.1 Inorganic N Fertilizers [Wetlands][Inorganic N Fertilizers][Emissions][N2O][kt][Land][no method][Wetlands][no option][no type]
status: valid
status modified: 2017-02-13
accepted date: 2017-02-13
in scheme: IPCC_variables_MMR

http://dd.eionet.europa.eu/vocabulary/ghg/IPCC_variables_MMR/F41F15FC-05E3-4088-8BED-7184F90C60DE
type: Concept
preferred label: 4.D.2.1.1 Drained Organic Soils [Wetlands][Emissions and removals from drainage and rewetting and other management of organic and mineral soils][Emissions][CH4][kt][Land][no method][Flooded Land][no option][Drained Organic Soils]
definition: 4.D.2.1.1 Drained Organic Soils [Wetlands][Emissions and removals from drainage and rewetting and other management of organic and mineral soils][Emissions][CH4][kt][Land][no method][Flooded Land][no option][Drained Organic Soils]
status: valid
status modified: 2017-02-13
accepted date: 2017-02-13
in scheme: IPCC_variables_MMR

http://dd.eionet.europa.eu/vocabulary/ghg/IPCC_variables_MMR/13CB611F-69AD-4F0A-9108-3DF8CEEFB5E0
type: Concept
preferred label: 4.D.2.1.1 Drained Organic Soils [Wetlands][Emissions and removals from drainage and rewetting and other management of organic and mineral soils][Emissions][N2O][kt][Land][no method][Flooded Land][no option][Drained Organic Soils]
definition: 4.D.2.1.1 Drained Organic Soils [Wetlands][Emissions and removals from drainage and rewetting and other management of organic and mineral soils][Emissions][N2O][kt][Land][no method][Flooded Land][no option][Drained Organic Soils]
status: valid
status modified: 2017-02-13
accepted date: 2017-02-13
in scheme: IPCC_variables_MMR

http://dd.eionet.europa.eu/vocabulary/ghg/IPCC_variables_MMR/AE3E15C8-7251-4283-BAEA-E41DC0C55E8B
type: Concept
preferred label: 4.D.2.1.2 Rewetted Organic Soils [Wetlands][Emissions and removals from drainage and rewetting and other management of organic and mineral soils][Emissions][CH4][kt][Land][no method][Flooded Land][no option][Rewetted Organic Soils]
definition: 4.D.2.1.2 Rewetted Organic Soils [Wetlands][Emissions and removals from drainage and rewetting and other management of organic and mineral soils][Emissions][CH4][kt][Land][no method][Flooded Land][no option][Rewetted Organic Soils]
status: valid
status modified: 2017-02-13
accepted date: 2017-02-13
in scheme: IPCC_variables_MMR

http://dd.eionet.europa.eu/vocabulary/ghg/IPCC_variables_MMR/37352475-0B96-4966-B812-AC2A61E048CA
type: Concept
preferred label: 4.D.2.1.2 Rewetted Organic Soils [Wetlands][Emissions and removals from drainage and rewetting and other management of organic and mineral soils][Emissions][N2O][kt][Land][no method][Flooded Land][no option][Rewetted Organic Soils]
definition: 4.D.2.1.2 Rewetted Organic Soils [Wetlands][Emissions and removals from drainage and rewetting and other management of organic and mineral soils][Emissions][N2O][kt][Land][no method][Flooded Land][no option][Rewetted Organic Soils]
status: valid
status modified: 2017-02-13
accepted date: 2017-02-13
in scheme: IPCC_variables_MMR

http://dd.eionet.europa.eu/vocabulary/ghg/IPCC_variables_MMR/2AA64051-6EE9-45A7-92B7-E9E494B15737
type: Concept
preferred label: 4.D.2.1.3 Other Organic Soils [Wetlands][Emissions and removals from drainage and rewetting and other management of organic and mineral soils][Emissions][CH4][kt][Land][no method][Flooded Land][no option][Other Organic Soils]
definition: 4.D.2.1.3 Other Organic Soils [Wetlands][Emissions and removals from drainage and rewetting and other management of organic and mineral soils][Emissions][CH4][kt][Land][no method][Flooded Land][no option][Other Organic Soils]
status: valid
status modified: 2017-02-13
accepted date: 2017-02-13
in scheme: IPCC_variables_MMR

http://dd.eionet.europa.eu/vocabulary/ghg/IPCC_variables_MMR/A899BC73-7E4B-44DF-9B7B-B1E4CE1AB29F
type: Concept
preferred label: 4.D.2.1.3 Other Organic Soils [Wetlands][Emissions and removals from drainage and rewetting and other management of organic and mineral soils][Emissions][N2O][kt][Land][no method][Flooded Land][no option][Other Organic Soils]
definition: 4.D.2.1.3 Other Organic Soils [Wetlands][Emissions and removals from drainage and rewetting and other management of organic and mineral soils][Emissions][N2O][kt][Land][no method][Flooded Land][no option][Other Organic Soils]
status: valid
status modified: 2017-02-13
accepted date: 2017-02-13
in scheme: IPCC_variables_MMR

http://dd.eionet.europa.eu/vocabulary/ghg/IPCC_variables_MMR/A6BDA4EE-C14F-44FD-AA67-0BC6730476BE
type: Concept
preferred label: 4.D.2.2 Total Mineral Soils [Wetlands][Emissions and removals from drainage and rewetting and other management of organic and mineral soils][Emissions][CH4][kt][Land][no method][Flooded Land][no option][Mineral soils]
definition: 4.D.2.2 Total Mineral Soils [Wetlands][Emissions and removals from drainage and rewetting and other management of organic and mineral soils][Emissions][CH4][kt][Land][no method][Flooded Land][no option][Mineral soils]
status: valid
status modified: 2017-02-13
accepted date: 2017-02-13
in scheme: IPCC_variables_MMR

http://dd.eionet.europa.eu/vocabulary/ghg/IPCC_variables_MMR/E3EAC078-7AAA-423E-9FE3-EDB3B1DBFCA0
type: Concept
preferred label: 4.D.2.2 Total Mineral Soils [Wetlands][Emissions and removals from drainage and rewetting and other management of organic and mineral soils][Emissions][N2O][kt][Land][no method][Flooded Land][no option][Mineral soils]
definition: 4.D.2.2 Total Mineral Soils [Wetlands][Emissions and removals from drainage and rewetting and other management of organic and mineral soils][Emissions][N2O][kt][Land][no method][Flooded Land][no option][Mineral soils]
status: valid
status modified: 2017-02-13
accepted date: 2017-02-13
in scheme: IPCC_variables_MMR

4.D.2.2 Organic N Fertilizers [Wetlands][Organic N Fertilizers][Emissions][N2O][kt][Land][no method][Wetlands][no option][no type]
type: Concept
definition: 4.D.2.2 Organic N Fertilizers [Wetlands][Organic N Fertilizers][Emissions][N2O][kt][Land][no method][Wetlands][no option][no type]
status: valid
status modified: 2017-02-13
accepted date: 2017-02-13
in scheme: IPCC_variables_MMR

http://dd.eionet.europa.eu/vocabulary/ghg/IPCC_variables_MMR/DB5F97D2-09E3-4B34-B6C8-82493A05470F
type: Concept
preferred label: 4.D.2.2.1 Rewetted Mineral Soils [Wetlands][Emissions and removals from drainage and rewetting and other management of organic and mineral soils][Emissions][CH4][kt][Land][no method][Flooded Land][no option][Rewetted Mineral Soils]
definition: 4.D.2.2.1 Rewetted Mineral Soils [Wetlands][Emissions and removals from drainage and rewetting and other management of organic and mineral soils][Emissions][CH4][kt][Land][no method][Flooded Land][no option][Rewetted Mineral Soils]
status: valid
status modified: 2017-02-13
accepted date: 2017-02-13
in scheme: IPCC_variables_MMR

http://dd.eionet.europa.eu/vocabulary/ghg/IPCC_variables_MMR/D3BACE01-1A74-46D3-8F27-6FCC5E7F31E6
type: Concept
preferred label: 4.D.2.2.1 Rewetted Mineral Soils [Wetlands][Emissions and removals from drainage and rewetting and other management of organic and mineral soils][Emissions][N2O][kt][Land][no method][Flooded Land][no option][Rewetted Mineral Soils]
definition: 4.D.2.2.1 Rewetted Mineral Soils [Wetlands][Emissions and removals from drainage and rewetting and other management of organic and mineral soils][Emissions][N2O][kt][Land][no method][Flooded Land][no option][Rewetted Mineral Soils]
status: valid
status modified: 2017-02-13
accepted date: 2017-02-13
in scheme: IPCC_variables_MMR

http://dd.eionet.europa.eu/vocabulary/ghg/IPCC_variables_MMR/2B9AD9A1-1A3C-4DAF-AB3A-48EB40D23D9C
type: Concept
preferred label: 4.D.2.2.2 Other Minaral Soils [Wetlands][Emissions and removals from drainage and rewetting and other management of organic and mineral soils][Emissions][CH4][kt][Land][no method][Flooded Land][no option][Other Mineral Soils]
definition: 4.D.2.2.2 Other Minaral Soils [Wetlands][Emissions and removals from drainage and rewetting and other management of organic and mineral soils][Emissions][CH4][kt][Land][no method][Flooded Land][no option][Other Mineral Soils]
status: valid
status modified: 2017-02-13
accepted date: 2017-02-13
in scheme: IPCC_variables_MMR

http://dd.eionet.europa.eu/vocabulary/ghg/IPCC_variables_MMR/705D50D1-2498-4C5D-A6FD-3A504B6DA4DA
type: Concept
preferred label: 4.D.2.2.2 Other Minaral Soils [Wetlands][Emissions and removals from drainage and rewetting and other management of organic and mineral soils][Emissions][N2O][kt][Land][no method][Flooded Land][no option][Other Mineral Soils]
definition: 4.D.2.2.2 Other Minaral Soils [Wetlands][Emissions and removals from drainage and rewetting and other management of organic and mineral soils][Emissions][N2O][kt][Land][no method][Flooded Land][no option][Other Mineral Soils]
status: valid
status modified: 2017-02-13
accepted date: 2017-02-13
in scheme: IPCC_variables_MMR

http://dd.eionet.europa.eu/vocabulary/ghg/IPCC_variables_MMR/D9244D4E-A8DE-4DE8-8471-19DED97E95F0
type: Concept
preferred label: 4.D.3 Other Wetlands [Wetlands][Emissions and removals from drainage and rewetting and other management of organic and mineral soils][Emissions][CH4][kt][Land][no method][Other Wetlands][no option][Soils]
definition: 4.D.3 Other Wetlands [Wetlands][Emissions and removals from drainage and rewetting and other management of organic and mineral soils][Emissions][CH4][kt][Land][no method][Other Wetlands][no option][Soils]
status: valid
status modified: 2017-02-13
accepted date: 2017-02-13
in scheme: IPCC_variables_MMR

http://dd.eionet.europa.eu/vocabulary/ghg/IPCC_variables_MMR/2EFF9018-A46A-4981-8D9C-DA517A310E7B
type: Concept
preferred label: 4.D.3 Other Wetlands [Wetlands][Emissions and removals from drainage and rewetting and other management of organic and mineral soils][Emissions][N2O][kt][Land][no method][Other Wetlands][no option][Soils]
definition: 4.D.3 Other Wetlands [Wetlands][Emissions and removals from drainage and rewetting and other management of organic and mineral soils][Emissions][N2O][kt][Land][no method][Other Wetlands][no option][Soils]
status: valid
status modified: 2017-02-13
accepted date: 2017-02-13
in scheme: IPCC_variables_MMR

4.E [Settlements][Land Use][Emissions][CH4][kt][no source][no method][Settlements][no option][no type]
type: Concept
definition: 4.E [Settlements][Land Use][Emissions][CH4][kt][no source][no method][Settlements][no option][no type]
status: valid
status modified: 2017-02-13
accepted date: 2017-02-13
in scheme: IPCC_variables_MMR

4.E [Settlements][Land Use][Emissions][CO2][kt][no source][no method][Settlements][no option][no type]
type: Concept
definition: 4.E [Settlements][Land Use][Emissions][CO2][kt][no source][no method][Settlements][no option][no type]
status: valid
status modified: 2017-02-13
accepted date: 2017-02-13
in scheme: IPCC_variables_MMR

4.E [Settlements][Land Use][Emissions][N2O][kt][no source][no method][Settlements][no option][no type]
type: Concept
definition: 4.E [Settlements][Land Use][Emissions][N2O][kt][no source][no method][Settlements][no option][no type]
status: valid
status modified: 2017-02-13
accepted date: 2017-02-13
in scheme: IPCC_variables_MMR

4.E.1 [Settlements][Land Use][Emissions][CH4][kt][Settlements][no method][Settlements][no option][no type]
type: Concept
definition: 4.E.1 [Settlements][Land Use][Emissions][CH4][kt][Settlements][no method][Settlements][no option][no type]
status: valid
status modified: 2017-02-13
accepted date: 2017-02-13
in scheme: IPCC_variables_MMR

4.E.1 [Settlements][Land Use][Emissions][CO2][kt][Settlements][no method][Settlements][no option][no type]
type: Concept
definition: 4.E.1 [Settlements][Land Use][Emissions][CO2][kt][Settlements][no method][Settlements][no option][no type]
status: valid
status modified: 2017-02-13
accepted date: 2017-02-13
in scheme: IPCC_variables_MMR

4.E.1 [Settlements][Land Use][Emissions][N2O][kt][Settlements][no method][Settlements][no option][no type]
type: Concept
definition: 4.E.1 [Settlements][Land Use][Emissions][N2O][kt][Settlements][no method][Settlements][no option][no type]
status: valid
status modified: 2017-02-13
accepted date: 2017-02-13
in scheme: IPCC_variables_MMR

4.E.1 Direct N2O Emissions [Settlements][Direct N2O Emissions from N Mineralization/Immobilization][Emissions][N2O][kt][Settlements][no method][Settlements][no option][no type]
type: Concept
definition: 4.E.1 Direct N2O Emissions [Settlements][Direct N2O Emissions from N Mineralization/Immobilization][Emissions][N2O][kt][Settlements][no method][Settlements][no option][no type]
status: valid
status modified: 2017-02-13
accepted date: 2017-02-13
in scheme: IPCC_variables_MMR

4.E.1.1 Inorganic N Fertilizers [Settlements][Inorganic N Fertilizers][Emissions][N2O][kt][Settlements][no method][Settlements][no option][no type]
type: Concept
definition: 4.E.1.1 Inorganic N Fertilizers [Settlements][Inorganic N Fertilizers][Emissions][N2O][kt][Settlements][no method][Settlements][no option][no type]
status: valid
status modified: 2017-02-13
accepted date: 2017-02-13
in scheme: IPCC_variables_MMR

4.E.1.2 Organic N Fertilizers [Settlements][Organic N Fertilizers][Emissions][N2O][kt][Settlements][no method][Settlements][no option][no type]
type: Concept
definition: 4.E.1.2 Organic N Fertilizers [Settlements][Organic N Fertilizers][Emissions][N2O][kt][Settlements][no method][Settlements][no option][no type]
status: valid
status modified: 2017-02-13
accepted date: 2017-02-13
in scheme: IPCC_variables_MMR

4.E.1Direct N2O Emissions [Settlements][Direct N2O Emissions from N inputs][Emissions][N2O][kt][Settlements][no method][Settlements][no option][no type]
type: Concept
definition: 4.E.1Direct N2O Emissions [Settlements][Direct N2O Emissions from N inputs][Emissions][N2O][kt][Settlements][no method][Settlements][no option][no type]
status: valid
status modified: 2017-02-13
accepted date: 2017-02-13
in scheme: IPCC_variables_MMR

4.E.2 [Settlements][Land Use][Emissions][CH4][kt][Land][no method][Settlements][no option][no type]
type: Concept
definition: 4.E.2 [Settlements][Land Use][Emissions][CH4][kt][Land][no method][Settlements][no option][no type]
status: valid
status modified: 2017-02-13
accepted date: 2017-02-13
in scheme: IPCC_variables_MMR

4.E.2 [Settlements][Land Use][Emissions][CO2][kt][Land][no method][Settlements][no option][no type]
type: Concept
definition: 4.E.2 [Settlements][Land Use][Emissions][CO2][kt][Land][no method][Settlements][no option][no type]
status: valid
status modified: 2017-02-13
accepted date: 2017-02-13
in scheme: IPCC_variables_MMR

4.E.2 [Settlements][Land Use][Emissions][N2O][kt][Land][no method][Settlements][no option][no type]
type: Concept
definition: 4.E.2 [Settlements][Land Use][Emissions][N2O][kt][Land][no method][Settlements][no option][no type]
status: valid
status modified: 2017-02-13
accepted date: 2017-02-13
in scheme: IPCC_variables_MMR

4.E.2 Direct N2O Emissions [Settlements][Direct N2O Emissions from N inputs][Emissions][N2O][kt][Land][no method][Settlements][no option][no type]
type: Concept
definition: 4.E.2 Direct N2O Emissions [Settlements][Direct N2O Emissions from N inputs][Emissions][N2O][kt][Land][no method][Settlements][no option][no type]
status: valid
status modified: 2017-02-13
accepted date: 2017-02-13
in scheme: IPCC_variables_MMR

4.E.2.1 Inorganic N Fertilizers [Settlements][Inorganic N Fertilizers][Emissions][N2O][kt][Land][no method][Settlements][no option][no type]
type: Concept
definition: 4.E.2.1 Inorganic N Fertilizers [Settlements][Inorganic N Fertilizers][Emissions][N2O][kt][Land][no method][Settlements][no option][no type]
status: valid
status modified: 2017-02-13
accepted date: 2017-02-13
in scheme: IPCC_variables_MMR

4.E.2.2 Organic N Fertilizers [Settlements][Organic N Fertilizers][Emissions][N2O][kt][Land][no method][Settlements][no option][no type]
type: Concept
definition: 4.E.2.2 Organic N Fertilizers [Settlements][Organic N Fertilizers][Emissions][N2O][kt][Land][no method][Settlements][no option][no type]
status: valid
status modified: 2017-02-13
accepted date: 2017-02-13
in scheme: IPCC_variables_MMR

4.F [Other Land][Land Use][Emissions][CH4][kt][no source][no method][Other Land][no option][no type]
type: Concept
definition: 4.F [Other Land][Land Use][Emissions][CH4][kt][no source][no method][Other Land][no option][no type]
status: valid
status modified: 2017-02-13
accepted date: 2017-02-13
in scheme: IPCC_variables_MMR

4.F [Other Land][Land Use][Emissions][CO2][kt][no source][no method][Other Land][no option][no type]
type: Concept
definition: 4.F [Other Land][Land Use][Emissions][CO2][kt][no source][no method][Other Land][no option][no type]
status: valid
status modified: 2017-02-13
accepted date: 2017-02-13
in scheme: IPCC_variables_MMR

4.F [Other Land][Land Use][Emissions][N2O][kt][no source][no method][Other Land][no option][no type]
type: Concept
definition: 4.F [Other Land][Land Use][Emissions][N2O][kt][no source][no method][Other Land][no option][no type]
status: valid
status modified: 2017-02-13
accepted date: 2017-02-13
in scheme: IPCC_variables_MMR

4.F.2 [Other Land][Land Use][Emissions][CH4][kt][Land][no method][Other Land][no option][no type]
type: Concept
definition: 4.F.2 [Other Land][Land Use][Emissions][CH4][kt][Land][no method][Other Land][no option][no type]
status: valid
status modified: 2017-02-13
accepted date: 2017-02-13
in scheme: IPCC_variables_MMR

4.F.2 [Other Land][Land Use][Emissions][CO2][kt][Land][no method][Other Land][no option][no type]
type: Concept
definition: 4.F.2 [Other Land][Land Use][Emissions][CO2][kt][Land][no method][Other Land][no option][no type]
status: valid
status modified: 2017-02-13
accepted date: 2017-02-13
in scheme: IPCC_variables_MMR

4.F.2 [Other Land][Land Use][Emissions][N2O][kt][Land][no method][Other Land][no option][no type]
type: Concept
definition: 4.F.2 [Other Land][Land Use][Emissions][N2O][kt][Land][no method][Other Land][no option][no type]
status: valid
status modified: 2017-02-13
accepted date: 2017-02-13
in scheme: IPCC_variables_MMR

4.G [Harvested Wood Products][Wood product][Emissions][CO2][kt][no source][no method][no target][no option][no type]
type: Concept
definition: 4.G [Harvested Wood Products][Wood product][Emissions][CO2][kt][no source][no method][no target][no option][no type]
status: valid
status modified: 2017-02-13
accepted date: 2017-02-13
in scheme: IPCC_variables_MMR

4.H [Other LULUCF][Biomass Burning][Emissions][CH4][kt][no source][no method][no target][no option][no type]
type: Concept
definition: 4.H [Other LULUCF][Biomass Burning][Emissions][CH4][kt][no source][no method][no target][no option][no type]
status: valid
status modified: 2017-02-13
accepted date: 2017-02-13
in scheme: IPCC_variables_MMR

4.H [Other LULUCF][Biomass Burning][Emissions][N2O][kt][no source][no method][no target][no option][no type]
type: Concept
definition: 4.H [Other LULUCF][Biomass Burning][Emissions][N2O][kt][no source][no method][no target][no option][no type]
status: valid
status modified: 2017-02-13
accepted date: 2017-02-13
in scheme: IPCC_variables_MMR

4.H [Other LULUCF][Direct N2O Emissions from N inputs][Emissions][N2O][kt][no source][no method][no target][no option][no type]
type: Concept
definition: 4.H [Other LULUCF][Direct N2O Emissions from N inputs][Emissions][N2O][kt][no source][no method][no target][no option][no type]
status: valid
status modified: 2017-02-13
accepted date: 2017-02-13
in scheme: IPCC_variables_MMR

4.H [Other LULUCF][Emissions and removals from drainage and rewetting and other management of organic and mineral soils][Emissions][CH4][kt][no source][no method][no target][no option][no type]
type: Concept
definition: 4.H [Other LULUCF][Emissions and removals from drainage and rewetting and other management of organic and mineral soils][Emissions][CH4][kt][no source][no method][no target][no option][no type]
status: valid
status modified: 2017-02-13
accepted date: 2017-02-13
in scheme: IPCC_variables_MMR

4.H [Other LULUCF][Emissions and removals from drainage and rewetting and other management of organic and mineral soils][Emissions][N2O][kt][no source][no method][no target][no option][no type]
type: Concept
definition: 4.H [Other LULUCF][Emissions and removals from drainage and rewetting and other management of organic and mineral soils][Emissions][N2O][kt][no source][no method][no target][no option][no type]
status: valid
status modified: 2017-02-13
accepted date: 2017-02-13
in scheme: IPCC_variables_MMR

4.H [Other LULUCF][Land Use][Emissions][CH4][kt][no source][no method][no target][no option][no type]
type: Concept
definition: 4.H [Other LULUCF][Land Use][Emissions][CH4][kt][no source][no method][no target][no option][no type]
status: valid
status modified: 2017-02-13
accepted date: 2017-02-13
in scheme: IPCC_variables_MMR

4.H [Other LULUCF][Land Use][Emissions][N2O][kt][no source][no method][no target][no option][no type]
type: Concept
definition: 4.H [Other LULUCF][Land Use][Emissions][N2O][kt][no source][no method][no target][no option][no type]
status: valid
status modified: 2017-02-13
accepted date: 2017-02-13
in scheme: IPCC_variables_MMR

5.A.1 [Managed Waste Disposal Sites][Waste][Emissions][CH4][kt][no source][no method][no target][no option][no type]
type: Concept
definition: 5.A.1 [Managed Waste Disposal Sites][Waste][Emissions][CH4][kt][no source][no method][no target][no option][no type]
status: valid
status modified: 2017-02-13
accepted date: 2017-02-13
in scheme: IPCC_variables_MMR

5.A.1 [Managed Waste Disposal Sites][Waste][Emissions][CO2][kt][no source][no method][no target][no option][no type]
type: Concept
definition: 5.A.1 [Managed Waste Disposal Sites][Waste][Emissions][CO2][kt][no source][no method][no target][no option][no type]
status: valid
status modified: 2017-02-13
accepted date: 2017-02-13
in scheme: IPCC_variables_MMR

5.A.1.a [Anaerobic][Waste][Emissions][CH4][kt][no source][no method][no target][no option][no type]
type: Concept
definition: 5.A.1.a [Anaerobic][Waste][Emissions][CH4][kt][no source][no method][no target][no option][no type]
status: valid
status modified: 2017-02-13
accepted date: 2017-02-13
in scheme: IPCC_variables_MMR

5.A.1.a [Anaerobic][Waste][Emissions][CO2][kt][no source][no method][no target][no option][no type]
type: Concept
definition: 5.A.1.a [Anaerobic][Waste][Emissions][CO2][kt][no source][no method][no target][no option][no type]
status: valid
status modified: 2017-02-13
accepted date: 2017-02-13
in scheme: IPCC_variables_MMR

5.A.1.b [Semi-aerobic][Waste][Emissions][CH4][kt][no source][no method][no target][no option][no type]
type: Concept
definition: 5.A.1.b [Semi-aerobic][Waste][Emissions][CH4][kt][no source][no method][no target][no option][no type]
status: valid
status modified: 2017-02-13
accepted date: 2017-02-13
in scheme: IPCC_variables_MMR

5.A.1.b [Semi-aerobic][Waste][Emissions][CO2][kt][no source][no method][no target][no option][no type]
type: Concept
definition: 5.A.1.b [Semi-aerobic][Waste][Emissions][CO2][kt][no source][no method][no target][no option][no type]
status: valid
status modified: 2017-02-13
accepted date: 2017-02-13
in scheme: IPCC_variables_MMR

5.A.2 [Unmanaged Waste Disposal Sites][Waste][Emissions][CH4][kt][no source][no method][no target][no option][no type]
type: Concept
definition: 5.A.2 [Unmanaged Waste Disposal Sites][Waste][Emissions][CH4][kt][no source][no method][no target][no option][no type]
status: valid
status modified: 2017-02-13
accepted date: 2017-02-13
in scheme: IPCC_variables_MMR

5.A.2 [Unmanaged Waste Disposal Sites][Waste][Emissions][CO2][kt][no source][no method][no target][no option][no type]
type: Concept
definition: 5.A.2 [Unmanaged Waste Disposal Sites][Waste][Emissions][CO2][kt][no source][no method][no target][no option][no type]
status: valid
status modified: 2017-02-13
accepted date: 2017-02-13
in scheme: IPCC_variables_MMR

5.A.3 [Uncategorized Waste Disposal Sites][Waste][Emissions][CH4][kt][no source][no method][no target][no option][no type]
type: Concept
definition: 5.A.3 [Uncategorized Waste Disposal Sites][Waste][Emissions][CH4][kt][no source][no method][no target][no option][no type]
status: valid
status modified: 2017-02-13
accepted date: 2017-02-13
in scheme: IPCC_variables_MMR

5.A.3 [Uncategorized Waste Disposal Sites][Waste][Emissions][CO2][kt][no source][no method][no target][no option][no type]
type: Concept
definition: 5.A.3 [Uncategorized Waste Disposal Sites][Waste][Emissions][CO2][kt][no source][no method][no target][no option][no type]
status: valid
status modified: 2017-02-13
accepted date: 2017-02-13
in scheme: IPCC_variables_MMR

5.B.1 [Waste Composting][Waste][Emissions][CH4][kt][no source][no method][no target][no option][no type]
type: Concept
definition: 5.B.1 [Waste Composting][Waste][Emissions][CH4][kt][no source][no method][no target][no option][no type]
status: valid
status modified: 2017-02-13
accepted date: 2017-02-13
in scheme: IPCC_variables_MMR

5.B.1 [Waste Composting][Waste][Emissions][N2O][kt][no source][no method][no target][no option][no type]
type: Concept
definition: 5.B.1 [Waste Composting][Waste][Emissions][N2O][kt][no source][no method][no target][no option][no type]
status: valid
status modified: 2017-02-13
accepted date: 2017-02-13
in scheme: IPCC_variables_MMR

5.B.1.a [Waste Composting][Municipal Solid Waste][Emissions][CH4][kt][no source][no method][no target][no option][no type]
type: Concept
definition: 5.B.1.a [Waste Composting][Municipal Solid Waste][Emissions][CH4][kt][no source][no method][no target][no option][no type]
status: valid
status modified: 2017-02-13
accepted date: 2017-02-13
in scheme: IPCC_variables_MMR

5.B.1.a [Waste Composting][Municipal Solid Waste][Emissions][N2O][kt][no source][no method][no target][no option][no type]
type: Concept
definition: 5.B.1.a [Waste Composting][Municipal Solid Waste][Emissions][N2O][kt][no source][no method][no target][no option][no type]
status: valid
status modified: 2017-02-13
accepted date: 2017-02-13
in scheme: IPCC_variables_MMR

5.B.2 [Anaerobic Digestion at Biogas Facilities][Waste][Emissions][CH4][kt][no source][no method][no target][no option][no type]
type: Concept
definition: 5.B.2 [Anaerobic Digestion at Biogas Facilities][Waste][Emissions][CH4][kt][no source][no method][no target][no option][no type]
status: valid
status modified: 2017-02-13
accepted date: 2017-02-13
in scheme: IPCC_variables_MMR

5.B.2 [Anaerobic Digestion at Biogas Facilities][Waste][Emissions][N2O][kt][no source][no method][no target][no option][no type]
type: Concept
definition: 5.B.2 [Anaerobic Digestion at Biogas Facilities][Waste][Emissions][N2O][kt][no source][no method][no target][no option][no type]
status: valid
status modified: 2017-02-13
accepted date: 2017-02-13
in scheme: IPCC_variables_MMR

5.B.2.a [Anaerobic Digestion at Biogas Facilities][Municipal Solid Waste][Emissions][CH4][kt][no source][no method][no target][no option][no type]
type: Concept
definition: 5.B.2.a [Anaerobic Digestion at Biogas Facilities][Municipal Solid Waste][Emissions][CH4][kt][no source][no method][no target][no option][no type]
status: valid
status modified: 2017-02-13
accepted date: 2017-02-13
in scheme: IPCC_variables_MMR

5.B.2.a [Anaerobic Digestion at Biogas Facilities][Municipal Solid Waste][Emissions][N2O][kt][no source][no method][no target][no option][no type]
type: Concept
definition: 5.B.2.a [Anaerobic Digestion at Biogas Facilities][Municipal Solid Waste][Emissions][N2O][kt][no source][no method][no target][no option][no type]
status: valid
status modified: 2017-02-13
accepted date: 2017-02-13
in scheme: IPCC_variables_MMR

5.C.1 [Waste Incineration][Waste][Emissions][CH4][kt][no source][no method][no target][no option][no type]
type: Concept
definition: 5.C.1 [Waste Incineration][Waste][Emissions][CH4][kt][no source][no method][no target][no option][no type]
status: valid
status modified: 2017-02-13
accepted date: 2017-02-13
in scheme: IPCC_variables_MMR

5.C.1 [Waste Incineration][Waste][Emissions][CO2][kt][no source][no method][no target][no option][no type]
type: Concept
definition: 5.C.1 [Waste Incineration][Waste][Emissions][CO2][kt][no source][no method][no target][no option][no type]
status: valid
status modified: 2017-02-13
accepted date: 2017-02-13
in scheme: IPCC_variables_MMR

5.C.1 [Waste Incineration][Waste][Emissions][N2O][kt][no source][no method][no target][no option][no type]
type: Concept
definition: 5.C.1 [Waste Incineration][Waste][Emissions][N2O][kt][no source][no method][no target][no option][no type]
status: valid
status modified: 2017-02-13
accepted date: 2017-02-13
in scheme: IPCC_variables_MMR

5.C.1.1 [Waste Incineration][Waste][Emissions][CH4][kt][no source][no method][no target][no option][Biogenic]
type: Concept
definition: 5.C.1.1 [Waste Incineration][Waste][Emissions][CH4][kt][no source][no method][no target][no option][Biogenic]
status: valid
status modified: 2017-02-13
accepted date: 2017-02-13
in scheme: IPCC_variables_MMR

5.C.1.1 [Waste Incineration][Waste][Emissions][CO2][kt][no source][no method][no target][no option][Biogenic]
type: Concept
definition: 5.C.1.1 [Waste Incineration][Waste][Emissions][CO2][kt][no source][no method][no target][no option][Biogenic]
status: valid
status modified: 2017-02-13
accepted date: 2017-02-13
in scheme: IPCC_variables_MMR

5.C.1.1 [Waste Incineration][Waste][Emissions][N2O][kt][no source][no method][no target][no option][Biogenic]
type: Concept
definition: 5.C.1.1 [Waste Incineration][Waste][Emissions][N2O][kt][no source][no method][no target][no option][Biogenic]
status: valid
status modified: 2017-02-13
accepted date: 2017-02-13
in scheme: IPCC_variables_MMR

5.C.1.1.a [Waste Incineration][Municipal Solid Waste][Emissions][CH4][kt][no source][no method][no target][no option][Biogenic]
type: Concept
definition: 5.C.1.1.a [Waste Incineration][Municipal Solid Waste][Emissions][CH4][kt][no source][no method][no target][no option][Biogenic]
status: valid
status modified: 2017-02-13
accepted date: 2017-02-13
in scheme: IPCC_variables_MMR

5.C.1.1.a [Waste Incineration][Municipal Solid Waste][Emissions][CO2][kt][no source][no method][no target][no option][Biogenic]
type: Concept
definition: 5.C.1.1.a [Waste Incineration][Municipal Solid Waste][Emissions][CO2][kt][no source][no method][no target][no option][Biogenic]
status: valid
status modified: 2017-02-13
accepted date: 2017-02-13
in scheme: IPCC_variables_MMR

5.C.1.1.a [Waste Incineration][Municipal Solid Waste][Emissions][N2O][kt][no source][no method][no target][no option][Biogenic]
type: Concept
definition: 5.C.1.1.a [Waste Incineration][Municipal Solid Waste][Emissions][N2O][kt][no source][no method][no target][no option][Biogenic]
status: valid
status modified: 2017-02-13
accepted date: 2017-02-13
in scheme: IPCC_variables_MMR

5.C.1.2 [Waste Incineration][Waste][Emissions][CH4][kt][no source][no method][no target][no option][Non-biogenic]
type: Concept
definition: 5.C.1.2 [Waste Incineration][Waste][Emissions][CH4][kt][no source][no method][no target][no option][Non-biogenic]
status: valid
status modified: 2017-02-13
accepted date: 2017-02-13
in scheme: IPCC_variables_MMR

5.C.1.2 [Waste Incineration][Waste][Emissions][CO2][kt][no source][no method][no target][no option][Non-biogenic]
type: Concept
definition: 5.C.1.2 [Waste Incineration][Waste][Emissions][CO2][kt][no source][no method][no target][no option][Non-biogenic]
status: valid
status modified: 2017-02-13
accepted date: 2017-02-13
in scheme: IPCC_variables_MMR

5.C.1.2 [Waste Incineration][Waste][Emissions][N2O][kt][no source][no method][no target][no option][Non-biogenic]
type: Concept
definition: 5.C.1.2 [Waste Incineration][Waste][Emissions][N2O][kt][no source][no method][no target][no option][Non-biogenic]
status: valid
status modified: 2017-02-13
accepted date: 2017-02-13
in scheme: IPCC_variables_MMR

5.C.1.2.a [Waste Incineration][Municipal Solid Waste][Emissions][CH4][kt][no source][no method][no target][no option][Non-biogenic]
type: Concept
definition: 5.C.1.2.a [Waste Incineration][Municipal Solid Waste][Emissions][CH4][kt][no source][no method][no target][no option][Non-biogenic]
status: valid
status modified: 2017-02-13
accepted date: 2017-02-13
in scheme: IPCC_variables_MMR

5.C.1.2.a [Waste Incineration][Municipal Solid Waste][Emissions][CO2][kt][no source][no method][no target][no option][Non-biogenic]
type: Concept
definition: 5.C.1.2.a [Waste Incineration][Municipal Solid Waste][Emissions][CO2][kt][no source][no method][no target][no option][Non-biogenic]
status: valid
status modified: 2017-02-13
accepted date: 2017-02-13
in scheme: IPCC_variables_MMR

5.C.1.2.a [Waste Incineration][Municipal Solid Waste][Emissions][N2O][kt][no source][no method][no target][no option][Non-biogenic]
type: Concept
definition: 5.C.1.2.a [Waste Incineration][Municipal Solid Waste][Emissions][N2O][kt][no source][no method][no target][no option][Non-biogenic]
status: valid
status modified: 2017-02-13
accepted date: 2017-02-13
in scheme: IPCC_variables_MMR

5.C.2 [Open Burning of Waste][Waste][Emissions][CH4][kt][no source][no method][no target][no option][no type]
type: Concept
definition: 5.C.2 [Open Burning of Waste][Waste][Emissions][CH4][kt][no source][no method][no target][no option][no type]
status: valid
status modified: 2017-02-13
accepted date: 2017-02-13
in scheme: IPCC_variables_MMR

5.C.2 [Open Burning of Waste][Waste][Emissions][CO2][kt][no source][no method][no target][no option][no type]
type: Concept
definition: 5.C.2 [Open Burning of Waste][Waste][Emissions][CO2][kt][no source][no method][no target][no option][no type]
status: valid
status modified: 2017-02-13
accepted date: 2017-02-13
in scheme: IPCC_variables_MMR

5.C.2 [Open Burning of Waste][Waste][Emissions][N2O][kt][no source][no method][no target][no option][no type]
type: Concept
definition: 5.C.2 [Open Burning of Waste][Waste][Emissions][N2O][kt][no source][no method][no target][no option][no type]
status: valid
status modified: 2017-02-13
accepted date: 2017-02-13
in scheme: IPCC_variables_MMR

5.C.2.1 [Open Burning of Waste][Waste][Emissions][CH4][kt][no source][no method][no target][no option][Biogenic]
type: Concept
definition: 5.C.2.1 [Open Burning of Waste][Waste][Emissions][CH4][kt][no source][no method][no target][no option][Biogenic]
status: valid
status modified: 2017-02-13
accepted date: 2017-02-13
in scheme: IPCC_variables_MMR

5.C.2.1 [Open Burning of Waste][Waste][Emissions][CO2][kt][no source][no method][no target][no option][Biogenic]
type: Concept
definition: 5.C.2.1 [Open Burning of Waste][Waste][Emissions][CO2][kt][no source][no method][no target][no option][Biogenic]
status: valid
status modified: 2017-02-13
accepted date: 2017-02-13
in scheme: IPCC_variables_MMR

5.C.2.1 [Open Burning of Waste][Waste][Emissions][N2O][kt][no source][no method][no target][no option][Biogenic]
type: Concept
definition: 5.C.2.1 [Open Burning of Waste][Waste][Emissions][N2O][kt][no source][no method][no target][no option][Biogenic]
status: valid
status modified: 2017-02-13
accepted date: 2017-02-13
in scheme: IPCC_variables_MMR

5.C.2.1.a [Open Burning of Waste][Municipal Solid Waste][Emissions][CH4][kt][no source][no method][no target][no option][Biogenic]
type: Concept
definition: 5.C.2.1.a [Open Burning of Waste][Municipal Solid Waste][Emissions][CH4][kt][no source][no method][no target][no option][Biogenic]
status: valid
status modified: 2017-02-13
accepted date: 2017-02-13
in scheme: IPCC_variables_MMR

5.C.2.1.a [Open Burning of Waste][Municipal Solid Waste][Emissions][CO2][kt][no source][no method][no target][no option][Biogenic]
type: Concept
definition: 5.C.2.1.a [Open Burning of Waste][Municipal Solid Waste][Emissions][CO2][kt][no source][no method][no target][no option][Biogenic]
status: valid
status modified: 2017-02-13
accepted date: 2017-02-13
in scheme: IPCC_variables_MMR

5.C.2.1.a [Open Burning of Waste][Municipal Solid Waste][Emissions][N2O][kt][no source][no method][no target][no option][Biogenic]
type: Concept
definition: 5.C.2.1.a [Open Burning of Waste][Municipal Solid Waste][Emissions][N2O][kt][no source][no method][no target][no option][Biogenic]
status: valid
status modified: 2017-02-13
accepted date: 2017-02-13
in scheme: IPCC_variables_MMR

5.C.2.2 [Open Burning of Waste][Waste][Emissions][CH4][kt][no source][no method][no target][no option][Non-biogenic]
type: Concept
definition: 5.C.2.2 [Open Burning of Waste][Waste][Emissions][CH4][kt][no source][no method][no target][no option][Non-biogenic]
status: valid
status modified: 2017-02-13
accepted date: 2017-02-13
in scheme: IPCC_variables_MMR

5.C.2.2 [Open Burning of Waste][Waste][Emissions][CO2][kt][no source][no method][no target][no option][Non-biogenic]
type: Concept
definition: 5.C.2.2 [Open Burning of Waste][Waste][Emissions][CO2][kt][no source][no method][no target][no option][Non-biogenic]
status: valid
status modified: 2017-02-13
accepted date: 2017-02-13
in scheme: IPCC_variables_MMR

5.C.2.2 [Open Burning of Waste][Waste][Emissions][N2O][kt][no source][no method][no target][no option][Non-biogenic]
type: Concept
definition: 5.C.2.2 [Open Burning of Waste][Waste][Emissions][N2O][kt][no source][no method][no target][no option][Non-biogenic]
status: valid
status modified: 2017-02-13
accepted date: 2017-02-13
in scheme: IPCC_variables_MMR

5.C.2.2.a [Open Burning of Waste][Municipal Solid Waste][Emissions][CH4][kt][no source][no method][no target][no option][Non-biogenic]
type: Concept
definition: 5.C.2.2.a [Open Burning of Waste][Municipal Solid Waste][Emissions][CH4][kt][no source][no method][no target][no option][Non-biogenic]
status: valid
status modified: 2017-02-13
accepted date: 2017-02-13
in scheme: IPCC_variables_MMR

5.C.2.2.a [Open Burning of Waste][Municipal Solid Waste][Emissions][CO2][kt][no source][no method][no target][no option][Non-biogenic]
type: Concept
definition: 5.C.2.2.a [Open Burning of Waste][Municipal Solid Waste][Emissions][CO2][kt][no source][no method][no target][no option][Non-biogenic]
status: valid
status modified: 2017-02-13
accepted date: 2017-02-13
in scheme: IPCC_variables_MMR

5.C.2.2.a [Open Burning of Waste][Municipal Solid Waste][Emissions][N2O][kt][no source][no method][no target][no option][Non-biogenic]
type: Concept
definition: 5.C.2.2.a [Open Burning of Waste][Municipal Solid Waste][Emissions][N2O][kt][no source][no method][no target][no option][Non-biogenic]
status: valid
status modified: 2017-02-13
accepted date: 2017-02-13
in scheme: IPCC_variables_MMR

5.D.1 [Wastewater Treatment and Discharge][Domestic Wastewater][Emissions][CH4][kt][no source][no method][no target][no option][no type]
type: Concept
definition: 5.D.1 [Wastewater Treatment and Discharge][Domestic Wastewater][Emissions][CH4][kt][no source][no method][no target][no option][no type]
status: valid
status modified: 2017-02-13
accepted date: 2017-02-13
in scheme: IPCC_variables_MMR

5.D.1 [Wastewater Treatment and Discharge][Domestic Wastewater][Emissions][N2O][kt][no source][no method][no target][no option][no type]
type: Concept
definition: 5.D.1 [Wastewater Treatment and Discharge][Domestic Wastewater][Emissions][N2O][kt][no source][no method][no target][no option][no type]
status: valid
status modified: 2017-02-13
accepted date: 2017-02-13
in scheme: IPCC_variables_MMR

5.D.2 [Wastewater Treatment and Discharge][Industrial Wastewater][Emissions][CH4][kt][no source][no method][no target][no option][no type]
type: Concept
definition: 5.D.2 [Wastewater Treatment and Discharge][Industrial Wastewater][Emissions][CH4][kt][no source][no method][no target][no option][no type]
status: valid
status modified: 2017-02-13
accepted date: 2017-02-13
in scheme: IPCC_variables_MMR