List hosts the classification for the activities according to the Council Regulation 3037/90/EEC.
type: ConceptScheme
notation: NACEValue
is part of: euregistryonindustrialsites
registration status: Released
user modified: demo_user
date modified: 2017-02-16 10:21:01.0
vocabulary type: Common
is numeric concept identifiers: false
is notations equal identifiers: false

Growing of cereals except rice leguminous crops and oil seeds
type: Concept
notation: 01.11
definition: List hosts the classification for the activities according to the Council Regulation 3037 90 EEC
status: valid
status modified: 2016-06-08
accepted date: 2016-06-08
in scheme: List hosts the classification for the activities according to the Council Regulation 3037/90/EEC.

Growing of rice
type: Concept
notation: 01.12
definition: List hosts the classification for the activities according to the Council Regulation 3037 90 EEC
status: valid
status modified: 2016-06-08
accepted date: 2016-06-08
in scheme: List hosts the classification for the activities according to the Council Regulation 3037/90/EEC.

Growing of vegetables and melons roots and tubers
type: Concept
notation: 01.13
definition: List hosts the classification for the activities according to the Council Regulation 3037 90 EEC
status: valid
status modified: 2016-06-08
accepted date: 2016-06-08
in scheme: List hosts the classification for the activities according to the Council Regulation 3037/90/EEC.

Growing of sugar cane
type: Concept
notation: 01.14
definition: List hosts the classification for the activities according to the Council Regulation 3037 90 EEC
status: valid
status modified: 2016-06-08
accepted date: 2016-06-08
in scheme: List hosts the classification for the activities according to the Council Regulation 3037/90/EEC.

Growing of tobacco
type: Concept
notation: 01.15
definition: List hosts the classification for the activities according to the Council Regulation 3037 90 EEC
status: valid
status modified: 2016-06-08
accepted date: 2016-06-08
in scheme: List hosts the classification for the activities according to the Council Regulation 3037/90/EEC.

Growing of fibre crops
type: Concept
notation: 01.16
definition: List hosts the classification for the activities according to the Council Regulation 3037 90 EEC
status: valid
status modified: 2016-06-08
accepted date: 2016-06-08
in scheme: List hosts the classification for the activities according to the Council Regulation 3037/90/EEC.

Growing of other non-perennial crops
type: Concept
notation: 01.19
definition: List hosts the classification for the activities according to the Council Regulation 3037 90 EEC
status: valid
status modified: 2016-06-08
accepted date: 2016-06-08
in scheme: List hosts the classification for the activities according to the Council Regulation 3037/90/EEC.

Growing of grapes
type: Concept
notation: 01.21
definition: List hosts the classification for the activities according to the Council Regulation 3037 90 EEC
status: valid
status modified: 2016-06-08
accepted date: 2016-06-08
in scheme: List hosts the classification for the activities according to the Council Regulation 3037/90/EEC.

Growing of tropical and subtropical fruits
type: Concept
notation: 01.22
definition: List hosts the classification for the activities according to the Council Regulation 3037 90 EEC
status: valid
status modified: 2016-06-08
accepted date: 2016-06-08
in scheme: List hosts the classification for the activities according to the Council Regulation 3037/90/EEC.

Growing of citrus fruits
type: Concept
notation: 01.23
definition: List hosts the classification for the activities according to the Council Regulation 3037 90 EEC
status: valid
status modified: 2016-06-08
accepted date: 2016-06-08
in scheme: List hosts the classification for the activities according to the Council Regulation 3037/90/EEC.

Growing of pome fruits and stone fruits
type: Concept
notation: 01.24
definition: List hosts the classification for the activities according to the Council Regulation 3037 90 EEC
status: valid
status modified: 2016-06-08
accepted date: 2016-06-08
in scheme: List hosts the classification for the activities according to the Council Regulation 3037/90/EEC.

Growing of other tree and bush fruits and nuts
type: Concept
notation: 01.25
definition: List hosts the classification for the activities according to the Council Regulation 3037 90 EEC
status: valid
status modified: 2016-06-08
accepted date: 2016-06-08
in scheme: List hosts the classification for the activities according to the Council Regulation 3037/90/EEC.

Growing of oleaginous fruits
type: Concept
notation: 01.26
definition: List hosts the classification for the activities according to the Council Regulation 3037 90 EEC
status: valid
status modified: 2016-06-08
accepted date: 2016-06-08
in scheme: List hosts the classification for the activities according to the Council Regulation 3037/90/EEC.

Growing of beverage crops
type: Concept
notation: 01.27
definition: List hosts the classification for the activities according to the Council Regulation 3037 90 EEC
status: valid
status modified: 2016-06-08
accepted date: 2016-06-08
in scheme: List hosts the classification for the activities according to the Council Regulation 3037/90/EEC.

Growing of spices aromatic drug and pharmaceutical crops
type: Concept
notation: 01.28
definition: List hosts the classification for the activities according to the Council Regulation 3037 90 EEC
status: valid
status modified: 2016-06-08
accepted date: 2016-06-08
in scheme: List hosts the classification for the activities according to the Council Regulation 3037/90/EEC.

Growing of other perennial crops
type: Concept
notation: 01.29
definition: List hosts the classification for the activities according to the Council Regulation 3037 90 EEC
status: valid
status modified: 2016-06-08
accepted date: 2016-06-08
in scheme: List hosts the classification for the activities according to the Council Regulation 3037/90/EEC.

Plant propagation
type: Concept
notation: 01.30
definition: List hosts the classification for the activities according to the Council Regulation 3037 90 EEC
status: valid
status modified: 2016-06-08
accepted date: 2016-06-08
in scheme: List hosts the classification for the activities according to the Council Regulation 3037/90/EEC.

Raising of dairy cattle
type: Concept
notation: 01.41
definition: List hosts the classification for the activities according to the Council Regulation 3037 90 EEC
status: valid
status modified: 2016-06-08
accepted date: 2016-06-08
in scheme: List hosts the classification for the activities according to the Council Regulation 3037/90/EEC.

Raising of other cattle and buffaloes
type: Concept
notation: 01.42
definition: List hosts the classification for the activities according to the Council Regulation 3037 90 EEC
status: valid
status modified: 2016-06-08
accepted date: 2016-06-08
in scheme: List hosts the classification for the activities according to the Council Regulation 3037/90/EEC.

Raising of horses and other equines
type: Concept
notation: 01.43
definition: List hosts the classification for the activities according to the Council Regulation 3037 90 EEC
status: valid
status modified: 2016-06-08
accepted date: 2016-06-08
in scheme: List hosts the classification for the activities according to the Council Regulation 3037/90/EEC.

Raising of camels and camelids
type: Concept
notation: 01.44
definition: List hosts the classification for the activities according to the Council Regulation 3037 90 EEC
status: valid
status modified: 2016-06-08
accepted date: 2016-06-08
in scheme: List hosts the classification for the activities according to the Council Regulation 3037/90/EEC.

Raising of sheep and goats
type: Concept
notation: 01.45
definition: List hosts the classification for the activities according to the Council Regulation 3037 90 EEC
status: valid
status modified: 2016-06-08
accepted date: 2016-06-08
in scheme: List hosts the classification for the activities according to the Council Regulation 3037/90/EEC.

Raising of swine/pigs
type: Concept
notation: 01.46
definition: List hosts the classification for the activities according to the Council Regulation 3037 90 EEC
status: valid
status modified: 2016-06-08
accepted date: 2016-06-08
in scheme: List hosts the classification for the activities according to the Council Regulation 3037/90/EEC.

Raising of poultry
type: Concept
notation: 01.47
definition: List hosts the classification for the activities according to the Council Regulation 3037 90 EEC
status: valid
status modified: 2016-06-08
accepted date: 2016-06-08
in scheme: List hosts the classification for the activities according to the Council Regulation 3037/90/EEC.

Raising of other animals
type: Concept
notation: 01.49
definition: List hosts the classification for the activities according to the Council Regulation 3037 90 EEC
status: valid
status modified: 2016-06-08
accepted date: 2016-06-08
in scheme: List hosts the classification for the activities according to the Council Regulation 3037/90/EEC.

Mixed farming
type: Concept
notation: 01.50
definition: List hosts the classification for the activities according to the Council Regulation 3037 90 EEC
status: valid
status modified: 2016-06-08
accepted date: 2016-06-08
in scheme: List hosts the classification for the activities according to the Council Regulation 3037/90/EEC.

Support activities for crop production
type: Concept
notation: 01.61
definition: List hosts the classification for the activities according to the Council Regulation 3037 90 EEC
status: valid
status modified: 2016-06-08
accepted date: 2016-06-08
in scheme: List hosts the classification for the activities according to the Council Regulation 3037/90/EEC.

Support activities for animal production
type: Concept
notation: 01.62
definition: List hosts the classification for the activities according to the Council Regulation 3037 90 EEC
status: valid
status modified: 2016-06-08
accepted date: 2016-06-08
in scheme: List hosts the classification for the activities according to the Council Regulation 3037/90/EEC.

Post-harvest crop activities
type: Concept
notation: 01.63
definition: List hosts the classification for the activities according to the Council Regulation 3037 90 EEC
status: valid
status modified: 2016-06-08
accepted date: 2016-06-08
in scheme: List hosts the classification for the activities according to the Council Regulation 3037/90/EEC.

Seed processing for propagation
type: Concept
notation: 01.64
definition: List hosts the classification for the activities according to the Council Regulation 3037 90 EEC
status: valid
status modified: 2016-06-08
accepted date: 2016-06-08
in scheme: List hosts the classification for the activities according to the Council Regulation 3037/90/EEC.

Hunting trapping and related service activities
type: Concept
notation: 01.70
definition: List hosts the classification for the activities according to the Council Regulation 3037 90 EEC
status: valid
status modified: 2016-06-08
accepted date: 2016-06-08
in scheme: List hosts the classification for the activities according to the Council Regulation 3037/90/EEC.

Silviculture and other forestry activities
type: Concept
notation: 02.10
definition: List hosts the classification for the activities according to the Council Regulation 3037 90 EEC
status: valid
status modified: 2016-06-08
accepted date: 2016-06-08
in scheme: List hosts the classification for the activities according to the Council Regulation 3037/90/EEC.

Logging
type: Concept
notation: 02.20
definition: List hosts the classification for the activities according to the Council Regulation 3037 90 EEC
status: valid
status modified: 2016-06-08
accepted date: 2016-06-08
in scheme: List hosts the classification for the activities according to the Council Regulation 3037/90/EEC.

Gathering of wild growing non-wood products
type: Concept
notation: 02.30
definition: List hosts the classification for the activities according to the Council Regulation 3037 90 EEC
status: valid
status modified: 2016-06-08
accepted date: 2016-06-08
in scheme: List hosts the classification for the activities according to the Council Regulation 3037/90/EEC.

Support services to forestry
type: Concept
notation: 02.40
definition: List hosts the classification for the activities according to the Council Regulation 3037 90 EEC
status: valid
status modified: 2016-06-08
accepted date: 2016-06-08
in scheme: List hosts the classification for the activities according to the Council Regulation 3037/90/EEC.

Marine fishing
type: Concept
notation: 03.11
definition: List hosts the classification for the activities according to the Council Regulation 3037 90 EEC
status: valid
status modified: 2016-06-08
accepted date: 2016-06-08
in scheme: List hosts the classification for the activities according to the Council Regulation 3037/90/EEC.

Freshwater fishing
type: Concept
notation: 03.12
definition: List hosts the classification for the activities according to the Council Regulation 3037 90 EEC
status: valid
status modified: 2016-06-08
accepted date: 2016-06-08
in scheme: List hosts the classification for the activities according to the Council Regulation 3037/90/EEC.

Marine aquaculture
type: Concept
notation: 03.21
definition: List hosts the classification for the activities according to the Council Regulation 3037 90 EEC
status: valid
status modified: 2016-06-08
accepted date: 2016-06-08
in scheme: List hosts the classification for the activities according to the Council Regulation 3037/90/EEC.

Freshwater aquaculture
type: Concept
notation: 03.22
definition: List hosts the classification for the activities according to the Council Regulation 3037 90 EEC
status: valid
status modified: 2016-06-08
accepted date: 2016-06-08
in scheme: List hosts the classification for the activities according to the Council Regulation 3037/90/EEC.

Mining of hard coal
type: Concept
notation: 05.10
definition: List hosts the classification for the activities according to the Council Regulation 3037 90 EEC
status: valid
status modified: 2016-06-08
accepted date: 2016-06-08
in scheme: List hosts the classification for the activities according to the Council Regulation 3037/90/EEC.

Mining of lignite
type: Concept
notation: 05.20
definition: List hosts the classification for the activities according to the Council Regulation 3037 90 EEC
status: valid
status modified: 2016-06-08
accepted date: 2016-06-08
in scheme: List hosts the classification for the activities according to the Council Regulation 3037/90/EEC.

Extraction of crude petroleum
type: Concept
notation: 06.10
definition: List hosts the classification for the activities according to the Council Regulation 3037 90 EEC
status: valid
status modified: 2016-06-08
accepted date: 2016-06-08
in scheme: List hosts the classification for the activities according to the Council Regulation 3037/90/EEC.

Extraction of natural gas
type: Concept
notation: 06.20
definition: List hosts the classification for the activities according to the Council Regulation 3037 90 EEC
status: valid
status modified: 2016-06-08
accepted date: 2016-06-08
in scheme: List hosts the classification for the activities according to the Council Regulation 3037/90/EEC.

Mining of iron ores
type: Concept
notation: 07.10
definition: List hosts the classification for the activities according to the Council Regulation 3037 90 EEC
status: valid
status modified: 2016-06-08
accepted date: 2016-06-08
in scheme: List hosts the classification for the activities according to the Council Regulation 3037/90/EEC.

Mining of uranium and thorium ores
type: Concept
notation: 07.21
definition: List hosts the classification for the activities according to the Council Regulation 3037 90 EEC
status: valid
status modified: 2016-06-08
accepted date: 2016-06-08
in scheme: List hosts the classification for the activities according to the Council Regulation 3037/90/EEC.

Mining of other non-ferrous metal ores
type: Concept
notation: 07.29
definition: List hosts the classification for the activities according to the Council Regulation 3037 90 EEC
status: valid
status modified: 2016-06-08
accepted date: 2016-06-08
in scheme: List hosts the classification for the activities according to the Council Regulation 3037/90/EEC.

Quarrying of ornamental and building stone limestone gypsum chalk and slate
type: Concept
notation: 08.11
definition: List hosts the classification for the activities according to the Council Regulation 3037 90 EEC
status: valid
status modified: 2016-06-08
accepted date: 2016-06-08
in scheme: List hosts the classification for the activities according to the Council Regulation 3037/90/EEC.

Operation of gravel and sand pits mining of clays and kaolin
type: Concept
notation: 08.12
definition: List hosts the classification for the activities according to the Council Regulation 3037 90 EEC
status: valid
status modified: 2016-06-08
accepted date: 2016-06-08
in scheme: List hosts the classification for the activities according to the Council Regulation 3037/90/EEC.

Mining of chemical and fertiliser minerals
type: Concept
notation: 08.91
definition: List hosts the classification for the activities according to the Council Regulation 3037 90 EEC
status: valid
status modified: 2016-06-08
accepted date: 2016-06-08
in scheme: List hosts the classification for the activities according to the Council Regulation 3037/90/EEC.

Extraction of peat
type: Concept
notation: 08.92
definition: List hosts the classification for the activities according to the Council Regulation 3037 90 EEC
status: valid
status modified: 2016-06-08
accepted date: 2016-06-08
in scheme: List hosts the classification for the activities according to the Council Regulation 3037/90/EEC.

Extraction of salt
type: Concept
notation: 08.93
definition: List hosts the classification for the activities according to the Council Regulation 3037 90 EEC
status: valid
status modified: 2016-06-08
accepted date: 2016-06-08
in scheme: List hosts the classification for the activities according to the Council Regulation 3037/90/EEC.

Other mining and quarrying n e c
type: Concept
notation: 08.99
definition: List hosts the classification for the activities according to the Council Regulation 3037 90 EEC
status: valid
status modified: 2016-06-08
accepted date: 2016-06-08
in scheme: List hosts the classification for the activities according to the Council Regulation 3037/90/EEC.

Support activities for petroleum and natural gas extraction
type: Concept
notation: 09.10
definition: List hosts the classification for the activities according to the Council Regulation 3037 90 EEC
status: valid
status modified: 2016-06-08
accepted date: 2016-06-08
in scheme: List hosts the classification for the activities according to the Council Regulation 3037/90/EEC.

Support activities for other mining and quarrying
type: Concept
notation: 09.90
definition: List hosts the classification for the activities according to the Council Regulation 3037 90 EEC
status: valid
status modified: 2016-06-08
accepted date: 2016-06-08
in scheme: List hosts the classification for the activities according to the Council Regulation 3037/90/EEC.

Processing and preserving of meat
type: Concept
notation: 10.11
definition: List hosts the classification for the activities according to the Council Regulation 3037 90 EEC
status: valid
status modified: 2016-06-08
accepted date: 2016-06-08
in scheme: List hosts the classification for the activities according to the Council Regulation 3037/90/EEC.

Processing and preserving of poultry meat
type: Concept
notation: 10.12
definition: List hosts the classification for the activities according to the Council Regulation 3037 90 EEC
status: valid
status modified: 2016-06-08
accepted date: 2016-06-08
in scheme: List hosts the classification for the activities according to the Council Regulation 3037/90/EEC.

Production of meat and poultry meat products
type: Concept
notation: 10.13
definition: List hosts the classification for the activities according to the Council Regulation 3037 90 EEC
status: valid
status modified: 2016-06-08
accepted date: 2016-06-08
in scheme: List hosts the classification for the activities according to the Council Regulation 3037/90/EEC.

Processing and preserving of fish crustaceans and molluscs
type: Concept
notation: 10.20
definition: List hosts the classification for the activities according to the Council Regulation 3037 90 EEC
status: valid
status modified: 2016-06-08
accepted date: 2016-06-08
in scheme: List hosts the classification for the activities according to the Council Regulation 3037/90/EEC.

Processing and preserving of potatoes
type: Concept
notation: 10.31
definition: List hosts the classification for the activities according to the Council Regulation 3037 90 EEC
status: valid
status modified: 2016-06-08
accepted date: 2016-06-08
in scheme: List hosts the classification for the activities according to the Council Regulation 3037/90/EEC.

Manufacture of fruit and vegetable juice
type: Concept
notation: 10.32
definition: List hosts the classification for the activities according to the Council Regulation 3037 90 EEC
status: valid
status modified: 2016-06-08
accepted date: 2016-06-08
in scheme: List hosts the classification for the activities according to the Council Regulation 3037/90/EEC.

Other processing and preserving of fruit and vegetables
type: Concept
notation: 10.39
definition: List hosts the classification for the activities according to the Council Regulation 3037 90 EEC
status: valid
status modified: 2016-06-08
accepted date: 2016-06-08
in scheme: List hosts the classification for the activities according to the Council Regulation 3037/90/EEC.

Manufacture of oils and fats
type: Concept
notation: 10.41
definition: List hosts the classification for the activities according to the Council Regulation 3037 90 EEC
status: valid
status modified: 2016-06-08
accepted date: 2016-06-08
in scheme: List hosts the classification for the activities according to the Council Regulation 3037/90/EEC.

Manufacture of margarine and similar edible fats
type: Concept
notation: 10.42
definition: List hosts the classification for the activities according to the Council Regulation 3037 90 EEC
status: valid
status modified: 2016-06-08
accepted date: 2016-06-08
in scheme: List hosts the classification for the activities according to the Council Regulation 3037/90/EEC.

Operation of dairies and cheese making
type: Concept
notation: 10.51
definition: List hosts the classification for the activities according to the Council Regulation 3037 90 EEC
status: valid
status modified: 2016-06-08
accepted date: 2016-06-08
in scheme: List hosts the classification for the activities according to the Council Regulation 3037/90/EEC.

Manufacture of ice cream
type: Concept
notation: 10.52
definition: List hosts the classification for the activities according to the Council Regulation 3037 90 EEC
status: valid
status modified: 2016-06-08
accepted date: 2016-06-08
in scheme: List hosts the classification for the activities according to the Council Regulation 3037/90/EEC.

Manufacture of grain mill products
type: Concept
notation: 10.61
definition: List hosts the classification for the activities according to the Council Regulation 3037 90 EEC
status: valid
status modified: 2016-06-08
accepted date: 2016-06-08
in scheme: List hosts the classification for the activities according to the Council Regulation 3037/90/EEC.

Manufacture of starches and starch products
type: Concept
notation: 10.62
definition: List hosts the classification for the activities according to the Council Regulation 3037 90 EEC
status: valid
status modified: 2016-06-08
accepted date: 2016-06-08
in scheme: List hosts the classification for the activities according to the Council Regulation 3037/90/EEC.

Manufacture of bread manufacture of fresh pastry goods and cakes
type: Concept
notation: 10.71
definition: List hosts the classification for the activities according to the Council Regulation 3037 90 EEC
status: valid
status modified: 2016-06-08
accepted date: 2016-06-08
in scheme: List hosts the classification for the activities according to the Council Regulation 3037/90/EEC.

Manufacture of rusks and biscuits manufacture of preserved pastry goods and cakes
type: Concept
notation: 10.72
definition: List hosts the classification for the activities according to the Council Regulation 3037 90 EEC
status: valid
status modified: 2016-06-08
accepted date: 2016-06-08
in scheme: List hosts the classification for the activities according to the Council Regulation 3037/90/EEC.

Manufacture of macaroni noodles couscous and similar farinaceous products
type: Concept
notation: 10.73
definition: List hosts the classification for the activities according to the Council Regulation 3037 90 EEC
status: valid
status modified: 2016-06-08
accepted date: 2016-06-08
in scheme: List hosts the classification for the activities according to the Council Regulation 3037/90/EEC.

Manufacture of sugar
type: Concept
notation: 10.81
definition: List hosts the classification for the activities according to the Council Regulation 3037 90 EEC
status: valid
status modified: 2016-06-08
accepted date: 2016-06-08
in scheme: List hosts the classification for the activities according to the Council Regulation 3037/90/EEC.

Manufacture of cocoa chocolate and sugar confectionery
type: Concept
notation: 10.82
definition: List hosts the classification for the activities according to the Council Regulation 3037 90 EEC
status: valid
status modified: 2016-06-08
accepted date: 2016-06-08
in scheme: List hosts the classification for the activities according to the Council Regulation 3037/90/EEC.

Processing of tea and coffee
type: Concept
notation: 10.83
definition: List hosts the classification for the activities according to the Council Regulation 3037 90 EEC
status: valid
status modified: 2016-06-08
accepted date: 2016-06-08
in scheme: List hosts the classification for the activities according to the Council Regulation 3037/90/EEC.

Manufacture of condiments and seasonings
type: Concept
notation: 10.84
definition: List hosts the classification for the activities according to the Council Regulation 3037 90 EEC
status: valid
status modified: 2016-06-08
accepted date: 2016-06-08
in scheme: List hosts the classification for the activities according to the Council Regulation 3037/90/EEC.

Manufacture of prepared meals and dishes
type: Concept
notation: 10.85
definition: List hosts the classification for the activities according to the Council Regulation 3037 90 EEC
status: valid
status modified: 2016-06-08
accepted date: 2016-06-08
in scheme: List hosts the classification for the activities according to the Council Regulation 3037/90/EEC.

Manufacture of homogenised food preparations and dietetic food
type: Concept
notation: 10.86
definition: List hosts the classification for the activities according to the Council Regulation 3037 90 EEC
status: valid
status modified: 2016-06-08
accepted date: 2016-06-08
in scheme: List hosts the classification for the activities according to the Council Regulation 3037/90/EEC.

Manufacture of other food products n e c
type: Concept
notation: 10.89
definition: List hosts the classification for the activities according to the Council Regulation 3037 90 EEC
status: valid
status modified: 2016-06-08
accepted date: 2016-06-08
in scheme: List hosts the classification for the activities according to the Council Regulation 3037/90/EEC.

Manufacture of prepared feeds for farm animals
type: Concept
notation: 10.91
definition: List hosts the classification for the activities according to the Council Regulation 3037 90 EEC
status: valid
status modified: 2016-06-08
accepted date: 2016-06-08
in scheme: List hosts the classification for the activities according to the Council Regulation 3037/90/EEC.

Manufacture of prepared pet foods
type: Concept
notation: 10.92
definition: List hosts the classification for the activities according to the Council Regulation 3037 90 EEC
status: valid
status modified: 2016-06-08
accepted date: 2016-06-08
in scheme: List hosts the classification for the activities according to the Council Regulation 3037/90/EEC.

Distilling rectifying and blending of spirits
type: Concept
notation: 11.01
definition: List hosts the classification for the activities according to the Council Regulation 3037 90 EEC
status: valid
status modified: 2016-06-08
accepted date: 2016-06-08
in scheme: List hosts the classification for the activities according to the Council Regulation 3037/90/EEC.

Manufacture of wine from grape
type: Concept
notation: 11.02
definition: List hosts the classification for the activities according to the Council Regulation 3037 90 EEC
status: valid
status modified: 2016-06-08
accepted date: 2016-06-08
in scheme: List hosts the classification for the activities according to the Council Regulation 3037/90/EEC.

Manufacture of cider and other fruit wines
type: Concept
notation: 11.03
definition: List hosts the classification for the activities according to the Council Regulation 3037 90 EEC
status: valid
status modified: 2016-06-08
accepted date: 2016-06-08
in scheme: List hosts the classification for the activities according to the Council Regulation 3037/90/EEC.

Manufacture of other non-distilled fermented beverages
type: Concept
notation: 11.04
definition: List hosts the classification for the activities according to the Council Regulation 3037 90 EEC
status: valid
status modified: 2016-06-08
accepted date: 2016-06-08
in scheme: List hosts the classification for the activities according to the Council Regulation 3037/90/EEC.

Manufacture of beer
type: Concept
notation: 11.05
definition: List hosts the classification for the activities according to the Council Regulation 3037 90 EEC
status: valid
status modified: 2016-06-08
accepted date: 2016-06-08
in scheme: List hosts the classification for the activities according to the Council Regulation 3037/90/EEC.

Manufacture of malt
type: Concept
notation: 11.06
definition: List hosts the classification for the activities according to the Council Regulation 3037 90 EEC
status: valid
status modified: 2016-06-08
accepted date: 2016-06-08
in scheme: List hosts the classification for the activities according to the Council Regulation 3037/90/EEC.

Manufacture of soft drinks production of mineral waters and other bottled waters
type: Concept
notation: 11.07
definition: List hosts the classification for the activities according to the Council Regulation 3037 90 EEC
status: valid
status modified: 2016-06-08
accepted date: 2016-06-08
in scheme: List hosts the classification for the activities according to the Council Regulation 3037/90/EEC.

Manufacture of tobacco products
type: Concept
notation: 12.00
definition: List hosts the classification for the activities according to the Council Regulation 3037 90 EEC
status: valid
status modified: 2016-06-08
accepted date: 2016-06-08
in scheme: List hosts the classification for the activities according to the Council Regulation 3037/90/EEC.

Preparation and spinning of textile fibres
type: Concept
notation: 13.10
definition: List hosts the classification for the activities according to the Council Regulation 3037 90 EEC
status: valid
status modified: 2016-06-08
accepted date: 2016-06-08
in scheme: List hosts the classification for the activities according to the Council Regulation 3037/90/EEC.

Weaving of textiles
type: Concept
notation: 13.20
definition: List hosts the classification for the activities according to the Council Regulation 3037 90 EEC
status: valid
status modified: 2016-06-08
accepted date: 2016-06-08
in scheme: List hosts the classification for the activities according to the Council Regulation 3037/90/EEC.

Finishing of textiles
type: Concept
notation: 13.30
definition: List hosts the classification for the activities according to the Council Regulation 3037 90 EEC
status: valid
status modified: 2016-06-08
accepted date: 2016-06-08
in scheme: List hosts the classification for the activities according to the Council Regulation 3037/90/EEC.

Manufacture of knitted and crocheted fabrics
type: Concept
notation: 13.91
definition: List hosts the classification for the activities according to the Council Regulation 3037 90 EEC
status: valid
status modified: 2016-06-08
accepted date: 2016-06-08
in scheme: List hosts the classification for the activities according to the Council Regulation 3037/90/EEC.

Manufacture of made-up textile articles except apparel
type: Concept
notation: 13.92
definition: List hosts the classification for the activities according to the Council Regulation 3037 90 EEC
status: valid
status modified: 2016-06-08
accepted date: 2016-06-08
in scheme: List hosts the classification for the activities according to the Council Regulation 3037/90/EEC.

Manufacture of carpets and rugs
type: Concept
notation: 13.93
definition: List hosts the classification for the activities according to the Council Regulation 3037 90 EEC
status: valid
status modified: 2016-06-08
accepted date: 2016-06-08
in scheme: List hosts the classification for the activities according to the Council Regulation 3037/90/EEC.

Manufacture of cordage rope twine and netting
type: Concept
notation: 13.94
definition: List hosts the classification for the activities according to the Council Regulation 3037 90 EEC
status: valid
status modified: 2016-06-08
accepted date: 2016-06-08
in scheme: List hosts the classification for the activities according to the Council Regulation 3037/90/EEC.

Manufacture of non-wovens and articles made from non-wovens except apparel
type: Concept
notation: 13.95
definition: List hosts the classification for the activities according to the Council Regulation 3037 90 EEC
status: valid
status modified: 2016-06-08
accepted date: 2016-06-08
in scheme: List hosts the classification for the activities according to the Council Regulation 3037/90/EEC.

Manufacture of other technical and industrial textiles
type: Concept
notation: 13.96
definition: List hosts the classification for the activities according to the Council Regulation 3037 90 EEC
status: valid
status modified: 2016-06-08
accepted date: 2016-06-08
in scheme: List hosts the classification for the activities according to the Council Regulation 3037/90/EEC.

Manufacture of other textiles n e c
type: Concept
notation: 13.99
definition: List hosts the classification for the activities according to the Council Regulation 3037 90 EEC
status: valid
status modified: 2016-06-08
accepted date: 2016-06-08
in scheme: List hosts the classification for the activities according to the Council Regulation 3037/90/EEC.

Manufacture of leather clothes
type: Concept
notation: 14.11
definition: List hosts the classification for the activities according to the Council Regulation 3037 90 EEC
status: valid
status modified: 2016-06-08
accepted date: 2016-06-08
in scheme: List hosts the classification for the activities according to the Council Regulation 3037/90/EEC.

Manufacture of workwear
type: Concept
notation: 14.12
definition: List hosts the classification for the activities according to the Council Regulation 3037 90 EEC
status: valid
status modified: 2016-06-08
accepted date: 2016-06-08
in scheme: List hosts the classification for the activities according to the Council Regulation 3037/90/EEC.

Manufacture of other outerwear
type: Concept
notation: 14.13
definition: List hosts the classification for the activities according to the Council Regulation 3037 90 EEC
status: valid
status modified: 2016-06-08
accepted date: 2016-06-08
in scheme: List hosts the classification for the activities according to the Council Regulation 3037/90/EEC.

Manufacture of underwear
type: Concept
notation: 14.14
definition: List hosts the classification for the activities according to the Council Regulation 3037 90 EEC
status: valid
status modified: 2016-06-08
accepted date: 2016-06-08
in scheme: List hosts the classification for the activities according to the Council Regulation 3037/90/EEC.

Manufacture of other wearing apparel and accessories
type: Concept
notation: 14.19
definition: List hosts the classification for the activities according to the Council Regulation 3037 90 EEC
status: valid
status modified: 2016-06-08
accepted date: 2016-06-08
in scheme: List hosts the classification for the activities according to the Council Regulation 3037/90/EEC.

Manufacture of articles of fur
type: Concept
notation: 14.20
definition: List hosts the classification for the activities according to the Council Regulation 3037 90 EEC
status: valid
status modified: 2016-06-08
accepted date: 2016-06-08
in scheme: List hosts the classification for the activities according to the Council Regulation 3037/90/EEC.

Manufacture of knitted and crocheted hosiery
type: Concept
notation: 14.31
definition: List hosts the classification for the activities according to the Council Regulation 3037 90 EEC
status: valid
status modified: 2016-06-08
accepted date: 2016-06-08
in scheme: List hosts the classification for the activities according to the Council Regulation 3037/90/EEC.

Manufacture of other knitted and crocheted apparel
type: Concept
notation: 14.39
definition: List hosts the classification for the activities according to the Council Regulation 3037 90 EEC
status: valid
status modified: 2016-06-08
accepted date: 2016-06-08
in scheme: List hosts the classification for the activities according to the Council Regulation 3037/90/EEC.

Tanning and dressing of leather dressing and dyeing of fur
type: Concept
notation: 15.11
definition: List hosts the classification for the activities according to the Council Regulation 3037 90 EEC
status: valid
status modified: 2016-06-08
accepted date: 2016-06-08
in scheme: List hosts the classification for the activities according to the Council Regulation 3037/90/EEC.

Manufacture of luggage handbags and the like saddlery and harness
type: Concept
notation: 15.12
definition: List hosts the classification for the activities according to the Council Regulation 3037 90 EEC
status: valid
status modified: 2016-06-08
accepted date: 2016-06-08
in scheme: List hosts the classification for the activities according to the Council Regulation 3037/90/EEC.

Manufacture of footwear
type: Concept
notation: 15.20
definition: List hosts the classification for the activities according to the Council Regulation 3037 90 EEC
status: valid
status modified: 2016-06-08
accepted date: 2016-06-08
in scheme: List hosts the classification for the activities according to the Council Regulation 3037/90/EEC.

Sawmilling and planing of wood
type: Concept
notation: 16.10
definition: List hosts the classification for the activities according to the Council Regulation 3037 90 EEC
status: valid
status modified: 2016-06-08
accepted date: 2016-06-08
in scheme: List hosts the classification for the activities according to the Council Regulation 3037/90/EEC.

Manufacture of veneer sheets and wood-based panels
type: Concept
notation: 16.21
definition: List hosts the classification for the activities according to the Council Regulation 3037 90 EEC
status: valid
status modified: 2016-06-08
accepted date: 2016-06-08
in scheme: List hosts the classification for the activities according to the Council Regulation 3037/90/EEC.

Manufacture of assembled parquet floors
type: Concept
notation: 16.22
definition: List hosts the classification for the activities according to the Council Regulation 3037 90 EEC
status: valid
status modified: 2016-06-08
accepted date: 2016-06-08
in scheme: List hosts the classification for the activities according to the Council Regulation 3037/90/EEC.

Manufacture of other builders carpentry and joinery
type: Concept
notation: 16.23
definition: List hosts the classification for the activities according to the Council Regulation 3037 90 EEC
status: valid
status modified: 2016-06-08
accepted date: 2016-06-08
in scheme: List hosts the classification for the activities according to the Council Regulation 3037/90/EEC.

Manufacture of wooden containers
type: Concept
notation: 16.24
definition: List hosts the classification for the activities according to the Council Regulation 3037 90 EEC
status: valid
status modified: 2016-06-08
accepted date: 2016-06-08
in scheme: List hosts the classification for the activities according to the Council Regulation 3037/90/EEC.

Manufacture of other products of wood manufacture of articles of cork straw and plaiting materials
type: Concept
notation: 16.29
definition: List hosts the classification for the activities according to the Council Regulation 3037 90 EEC
status: valid
status modified: 2016-06-08
accepted date: 2016-06-08
in scheme: List hosts the classification for the activities according to the Council Regulation 3037/90/EEC.

Manufacture of pulp
type: Concept
notation: 17.11
definition: List hosts the classification for the activities according to the Council Regulation 3037 90 EEC
status: valid
status modified: 2016-06-08
accepted date: 2016-06-08
in scheme: List hosts the classification for the activities according to the Council Regulation 3037/90/EEC.

Manufacture of paper and paperboard
type: Concept
notation: 17.12
definition: List hosts the classification for the activities according to the Council Regulation 3037 90 EEC
status: valid
status modified: 2016-06-08
accepted date: 2016-06-08
in scheme: List hosts the classification for the activities according to the Council Regulation 3037/90/EEC.

Manufacture of corrugated paper and paperboard and of containers of paper and paperboard
type: Concept
notation: 17.21
definition: List hosts the classification for the activities according to the Council Regulation 3037 90 EEC
status: valid
status modified: 2016-06-08
accepted date: 2016-06-08
in scheme: List hosts the classification for the activities according to the Council Regulation 3037/90/EEC.

Manufacture of household and sanitary goods and of toilet requisites
type: Concept
notation: 17.22
definition: List hosts the classification for the activities according to the Council Regulation 3037 90 EEC
status: valid
status modified: 2016-06-08
accepted date: 2016-06-08
in scheme: List hosts the classification for the activities according to the Council Regulation 3037/90/EEC.

Manufacture of paper stationery
type: Concept
notation: 17.23
definition: List hosts the classification for the activities according to the Council Regulation 3037 90 EEC
status: valid
status modified: 2016-06-08
accepted date: 2016-06-08
in scheme: List hosts the classification for the activities according to the Council Regulation 3037/90/EEC.

Manufacture of wallpaper
type: Concept
notation: 17.24
definition: List hosts the classification for the activities according to the Council Regulation 3037 90 EEC
status: valid
status modified: 2016-06-08
accepted date: 2016-06-08
in scheme: List hosts the classification for the activities according to the Council Regulation 3037/90/EEC.

Manufacture of other articles of paper and paperboard
type: Concept
notation: 17.29
definition: List hosts the classification for the activities according to the Council Regulation 3037 90 EEC
status: valid
status modified: 2016-06-08
accepted date: 2016-06-08
in scheme: List hosts the classification for the activities according to the Council Regulation 3037/90/EEC.

Printing of newspapers
type: Concept
notation: 18.11
definition: List hosts the classification for the activities according to the Council Regulation 3037 90 EEC
status: valid
status modified: 2016-06-08
accepted date: 2016-06-08
in scheme: List hosts the classification for the activities according to the Council Regulation 3037/90/EEC.

Other printing
type: Concept
notation: 18.12
definition: List hosts the classification for the activities according to the Council Regulation 3037 90 EEC
status: valid
status modified: 2016-06-08
accepted date: 2016-06-08
in scheme: List hosts the classification for the activities according to the Council Regulation 3037/90/EEC.

Pre-press and pre-media services
type: Concept
notation: 18.13
definition: List hosts the classification for the activities according to the Council Regulation 3037 90 EEC
status: valid
status modified: 2016-06-08
accepted date: 2016-06-08
in scheme: List hosts the classification for the activities according to the Council Regulation 3037/90/EEC.

Binding and related services
type: Concept
notation: 18.14
definition: List hosts the classification for the activities according to the Council Regulation 3037 90 EEC
status: valid
status modified: 2016-06-08
accepted date: 2016-06-08
in scheme: List hosts the classification for the activities according to the Council Regulation 3037/90/EEC.

Reproduction of recorded media
type: Concept
notation: 18.20
definition: List hosts the classification for the activities according to the Council Regulation 3037 90 EEC
status: valid
status modified: 2016-06-08
accepted date: 2016-06-08
in scheme: List hosts the classification for the activities according to the Council Regulation 3037/90/EEC.

Manufacture of coke oven products
type: Concept
notation: 19.10
definition: List hosts the classification for the activities according to the Council Regulation 3037 90 EEC
status: valid
status modified: 2016-06-08
accepted date: 2016-06-08
in scheme: List hosts the classification for the activities according to the Council Regulation 3037/90/EEC.

Manufacture of refined petroleum products
type: Concept
notation: 19.20
definition: List hosts the classification for the activities according to the Council Regulation 3037 90 EEC
status: valid
status modified: 2016-06-08
accepted date: 2016-06-08
in scheme: List hosts the classification for the activities according to the Council Regulation 3037/90/EEC.

Manufacture of industrial gases
type: Concept
notation: 20.11
definition: List hosts the classification for the activities according to the Council Regulation 3037 90 EEC
status: valid
status modified: 2016-06-08
accepted date: 2016-06-08
in scheme: List hosts the classification for the activities according to the Council Regulation 3037/90/EEC.

Manufacture of dyes and pigments
type: Concept
notation: 20.12
definition: List hosts the classification for the activities according to the Council Regulation 3037 90 EEC
status: valid
status modified: 2016-06-08
accepted date: 2016-06-08
in scheme: List hosts the classification for the activities according to the Council Regulation 3037/90/EEC.

Manufacture of other inorganic basic chemicals
type: Concept
notation: 20.13
definition: List hosts the classification for the activities according to the Council Regulation 3037 90 EEC
status: valid
status modified: 2016-06-08
accepted date: 2016-06-08
in scheme: List hosts the classification for the activities according to the Council Regulation 3037/90/EEC.

Manufacture of other organic basic chemicals
type: Concept
notation: 20.14
definition: List hosts the classification for the activities according to the Council Regulation 3037 90 EEC
status: valid
status modified: 2016-06-08
accepted date: 2016-06-08
in scheme: List hosts the classification for the activities according to the Council Regulation 3037/90/EEC.

Manufacture of fertilisers and nitrogen compounds
type: Concept
notation: 20.15
definition: List hosts the classification for the activities according to the Council Regulation 3037 90 EEC
status: valid
status modified: 2016-06-08
accepted date: 2016-06-08
in scheme: List hosts the classification for the activities according to the Council Regulation 3037/90/EEC.

Manufacture of plastics in primary forms
type: Concept
notation: 20.16
definition: List hosts the classification for the activities according to the Council Regulation 3037 90 EEC
status: valid
status modified: 2016-06-08
accepted date: 2016-06-08
in scheme: List hosts the classification for the activities according to the Council Regulation 3037/90/EEC.

Manufacture of synthetic rubber in primary forms
type: Concept
notation: 20.17
definition: List hosts the classification for the activities according to the Council Regulation 3037 90 EEC
status: valid
status modified: 2016-06-08
accepted date: 2016-06-08
in scheme: List hosts the classification for the activities according to the Council Regulation 3037/90/EEC.

Manufacture of pesticides and other agrochemical products
type: Concept
notation: 20.20
definition: List hosts the classification for the activities according to the Council Regulation 3037 90 EEC
status: valid
status modified: 2016-06-08
accepted date: 2016-06-08
in scheme: List hosts the classification for the activities according to the Council Regulation 3037/90/EEC.

Manufacture of paints varnishes and similar coatings printing ink and mastics
type: Concept
notation: 20.30
definition: List hosts the classification for the activities according to the Council Regulation 3037 90 EEC
status: valid
status modified: 2016-06-08
accepted date: 2016-06-08
in scheme: List hosts the classification for the activities according to the Council Regulation 3037/90/EEC.

Manufacture of soap and detergents cleaning and polishing preparations
type: Concept
notation: 20.41
definition: List hosts the classification for the activities according to the Council Regulation 3037 90 EEC
status: valid
status modified: 2016-06-08
accepted date: 2016-06-08
in scheme: List hosts the classification for the activities according to the Council Regulation 3037/90/EEC.

Manufacture of perfumes and toilet preparations
type: Concept
notation: 20.42
definition: List hosts the classification for the activities according to the Council Regulation 3037 90 EEC
status: valid
status modified: 2016-06-08
accepted date: 2016-06-08
in scheme: List hosts the classification for the activities according to the Council Regulation 3037/90/EEC.

Manufacture of explosives
type: Concept
notation: 20.51
definition: List hosts the classification for the activities according to the Council Regulation 3037 90 EEC
status: valid
status modified: 2016-06-08
accepted date: 2016-06-08
in scheme: List hosts the classification for the activities according to the Council Regulation 3037/90/EEC.

Manufacture of glues
type: Concept
notation: 20.52
definition: List hosts the classification for the activities according to the Council Regulation 3037 90 EEC
status: valid
status modified: 2016-06-08
accepted date: 2016-06-08
in scheme: List hosts the classification for the activities according to the Council Regulation 3037/90/EEC.

Manufacture of essential oils
type: Concept
notation: 20.53
definition: List hosts the classification for the activities according to the Council Regulation 3037 90 EEC
status: valid
status modified: 2016-06-08
accepted date: 2016-06-08
in scheme: List hosts the classification for the activities according to the Council Regulation 3037/90/EEC.

Manufacture of other chemical products n e c
type: Concept
notation: 20.59
definition: List hosts the classification for the activities according to the Council Regulation 3037 90 EEC
status: valid
status modified: 2016-06-08
accepted date: 2016-06-08
in scheme: List hosts the classification for the activities according to the Council Regulation 3037/90/EEC.

Manufacture of man-made fibres
type: Concept
notation: 20.60
definition: List hosts the classification for the activities according to the Council Regulation 3037 90 EEC
status: valid
status modified: 2016-06-08
accepted date: 2016-06-08
in scheme: List hosts the classification for the activities according to the Council Regulation 3037/90/EEC.

Manufacture of basic pharmaceutical products
type: Concept
notation: 21.10
definition: List hosts the classification for the activities according to the Council Regulation 3037 90 EEC
status: valid
status modified: 2016-06-08
accepted date: 2016-06-08
in scheme: List hosts the classification for the activities according to the Council Regulation 3037/90/EEC.

Manufacture of pharmaceutical preparations
type: Concept
notation: 21.20
definition: List hosts the classification for the activities according to the Council Regulation 3037 90 EEC
status: valid
status modified: 2016-06-08
accepted date: 2016-06-08
in scheme: List hosts the classification for the activities according to the Council Regulation 3037/90/EEC.

Manufacture of rubber tyres and tubes retreading and rebuilding of rubber tyres
type: Concept
notation: 22.11
definition: List hosts the classification for the activities according to the Council Regulation 3037 90 EEC
status: valid
status modified: 2016-06-08
accepted date: 2016-06-08
in scheme: List hosts the classification for the activities according to the Council Regulation 3037/90/EEC.

Manufacture of other rubber products
type: Concept
notation: 22.19
definition: List hosts the classification for the activities according to the Council Regulation 3037 90 EEC
status: valid
status modified: 2016-06-08
accepted date: 2016-06-08
in scheme: List hosts the classification for the activities according to the Council Regulation 3037/90/EEC.

Manufacture of plastic plates sheets tubes and profiles
type: Concept
notation: 22.21
definition: List hosts the classification for the activities according to the Council Regulation 3037 90 EEC
status: valid
status modified: 2016-06-08
accepted date: 2016-06-08
in scheme: List hosts the classification for the activities according to the Council Regulation 3037/90/EEC.

Manufacture of plastic packing goods
type: Concept
notation: 22.22
definition: List hosts the classification for the activities according to the Council Regulation 3037 90 EEC
status: valid
status modified: 2016-06-08
accepted date: 2016-06-08
in scheme: List hosts the classification for the activities according to the Council Regulation 3037/90/EEC.

Manufacture of builders’ ware of plastic
type: Concept
notation: 22.23
definition: List hosts the classification for the activities according to the Council Regulation 3037 90 EEC
status: valid
status modified: 2016-06-08
accepted date: 2016-06-08
in scheme: List hosts the classification for the activities according to the Council Regulation 3037/90/EEC.

Manufacture of other plastic products
type: Concept
notation: 22.29
definition: List hosts the classification for the activities according to the Council Regulation 3037 90 EEC
status: valid
status modified: 2016-06-08
accepted date: 2016-06-08
in scheme: List hosts the classification for the activities according to the Council Regulation 3037/90/EEC.

Manufacture of flat glass
type: Concept
notation: 23.11
definition: List hosts the classification for the activities according to the Council Regulation 3037 90 EEC
status: valid
status modified: 2016-06-08
accepted date: 2016-06-08
in scheme: List hosts the classification for the activities according to the Council Regulation 3037/90/EEC.

Shaping and processing of flat glass
type: Concept
notation: 23.12
definition: List hosts the classification for the activities according to the Council Regulation 3037 90 EEC
status: valid
status modified: 2016-06-08
accepted date: 2016-06-08
in scheme: List hosts the classification for the activities according to the Council Regulation 3037/90/EEC.

Manufacture of hollow glass
type: Concept
notation: 23.13
definition: List hosts the classification for the activities according to the Council Regulation 3037 90 EEC
status: valid
status modified: 2016-06-08
accepted date: 2016-06-08
in scheme: List hosts the classification for the activities according to the Council Regulation 3037/90/EEC.

Manufacture of glass fibres
type: Concept
notation: 23.14
definition: List hosts the classification for the activities according to the Council Regulation 3037 90 EEC
status: valid
status modified: 2016-06-08
accepted date: 2016-06-08
in scheme: List hosts the classification for the activities according to the Council Regulation 3037/90/EEC.

Manufacture and processing of other glass including technical glassware
type: Concept
notation: 23.19
definition: List hosts the classification for the activities according to the Council Regulation 3037 90 EEC
status: valid
status modified: 2016-06-08
accepted date: 2016-06-08
in scheme: List hosts the classification for the activities according to the Council Regulation 3037/90/EEC.

Manufacture of refractory products
type: Concept
notation: 23.20
definition: List hosts the classification for the activities according to the Council Regulation 3037 90 EEC
status: valid
status modified: 2016-06-08
accepted date: 2016-06-08
in scheme: List hosts the classification for the activities according to the Council Regulation 3037/90/EEC.

Manufacture of ceramic tiles and flags
type: Concept
notation: 23.31
definition: List hosts the classification for the activities according to the Council Regulation 3037 90 EEC
status: valid
status modified: 2016-06-08
accepted date: 2016-06-08
in scheme: List hosts the classification for the activities according to the Council Regulation 3037/90/EEC.

Manufacture of bricks tiles and construction products in baked clay
type: Concept
notation: 23.32
definition: List hosts the classification for the activities according to the Council Regulation 3037 90 EEC
status: valid
status modified: 2016-06-08
accepted date: 2016-06-08
in scheme: List hosts the classification for the activities according to the Council Regulation 3037/90/EEC.

Manufacture of ceramic household and ornamental articles
type: Concept
notation: 23.41
definition: List hosts the classification for the activities according to the Council Regulation 3037 90 EEC
status: valid
status modified: 2016-06-08
accepted date: 2016-06-08
in scheme: List hosts the classification for the activities according to the Council Regulation 3037/90/EEC.

Manufacture of ceramic sanitary fixtures
type: Concept
notation: 23.42
definition: List hosts the classification for the activities according to the Council Regulation 3037 90 EEC
status: valid
status modified: 2016-06-08
accepted date: 2016-06-08
in scheme: List hosts the classification for the activities according to the Council Regulation 3037/90/EEC.

Manufacture of ceramic insulators and insulating fittings
type: Concept
notation: 23.43
definition: List hosts the classification for the activities according to the Council Regulation 3037 90 EEC
status: valid
status modified: 2016-06-08
accepted date: 2016-06-08
in scheme: List hosts the classification for the activities according to the Council Regulation 3037/90/EEC.

Manufacture of other technical ceramic products
type: Concept
notation: 23.44
definition: List hosts the classification for the activities according to the Council Regulation 3037 90 EEC
status: valid
status modified: 2016-06-08
accepted date: 2016-06-08
in scheme: List hosts the classification for the activities according to the Council Regulation 3037/90/EEC.

Manufacture of other ceramic products
type: Concept
notation: 23.49
definition: List hosts the classification for the activities according to the Council Regulation 3037 90 EEC
status: valid
status modified: 2016-06-08
accepted date: 2016-06-08
in scheme: List hosts the classification for the activities according to the Council Regulation 3037/90/EEC.

Manufacture of cement
type: Concept
notation: 23.51
definition: List hosts the classification for the activities according to the Council Regulation 3037 90 EEC
status: valid
status modified: 2016-06-08
accepted date: 2016-06-08
in scheme: List hosts the classification for the activities according to the Council Regulation 3037/90/EEC.

Manufacture of lime and plaster
type: Concept
notation: 23.52
definition: List hosts the classification for the activities according to the Council Regulation 3037 90 EEC
status: valid
status modified: 2016-06-08
accepted date: 2016-06-08
in scheme: List hosts the classification for the activities according to the Council Regulation 3037/90/EEC.

Manufacture of concrete products for construction purposes
type: Concept
notation: 23.61
definition: List hosts the classification for the activities according to the Council Regulation 3037 90 EEC
status: valid
status modified: 2016-06-08
accepted date: 2016-06-08
in scheme: List hosts the classification for the activities according to the Council Regulation 3037/90/EEC.

Manufacture of plaster products for construction purposes
type: Concept
notation: 23.62
definition: List hosts the classification for the activities according to the Council Regulation 3037 90 EEC
status: valid
status modified: 2016-06-08
accepted date: 2016-06-08
in scheme: List hosts the classification for the activities according to the Council Regulation 3037/90/EEC.

Manufacture of ready-mixed concrete
type: Concept
notation: 23.63
definition: List hosts the classification for the activities according to the Council Regulation 3037 90 EEC
status: valid
status modified: 2016-06-08
accepted date: 2016-06-08
in scheme: List hosts the classification for the activities according to the Council Regulation 3037/90/EEC.

Manufacture of mortars
type: Concept
notation: 23.64
definition: List hosts the classification for the activities according to the Council Regulation 3037 90 EEC
status: valid
status modified: 2016-06-08
accepted date: 2016-06-08
in scheme: List hosts the classification for the activities according to the Council Regulation 3037/90/EEC.

Manufacture of fibre cement
type: Concept
notation: 23.65
definition: List hosts the classification for the activities according to the Council Regulation 3037 90 EEC
status: valid
status modified: 2016-06-08
accepted date: 2016-06-08
in scheme: List hosts the classification for the activities according to the Council Regulation 3037/90/EEC.

Manufacture of other articles of concrete plaster and cement
type: Concept
notation: 23.69
definition: List hosts the classification for the activities according to the Council Regulation 3037 90 EEC
status: valid
status modified: 2016-06-08
accepted date: 2016-06-08
in scheme: List hosts the classification for the activities according to the Council Regulation 3037/90/EEC.

Cutting shaping and finishing of stone
type: Concept
notation: 23.70
definition: List hosts the classification for the activities according to the Council Regulation 3037 90 EEC
status: valid
status modified: 2016-06-08
accepted date: 2016-06-08
in scheme: List hosts the classification for the activities according to the Council Regulation 3037/90/EEC.

Production of abrasive products
type: Concept
notation: 23.91
definition: List hosts the classification for the activities according to the Council Regulation 3037 90 EEC
status: valid
status modified: 2016-06-08
accepted date: 2016-06-08
in scheme: List hosts the classification for the activities according to the Council Regulation 3037/90/EEC.

Manufacture of other non-metallic mineral products n e c
type: Concept
notation: 23.99
definition: List hosts the classification for the activities according to the Council Regulation 3037 90 EEC
status: valid
status modified: 2016-06-08
accepted date: 2016-06-08
in scheme: List hosts the classification for the activities according to the Council Regulation 3037/90/EEC.

Manufacture of basic iron and steel and of ferro-alloys
type: Concept
notation: 24.10
definition: List hosts the classification for the activities according to the Council Regulation 3037 90 EEC
status: valid
status modified: 2016-06-08
accepted date: 2016-06-08
in scheme: List hosts the classification for the activities according to the Council Regulation 3037/90/EEC.

Manufacture of tubes pipes hollow profiles and related fittings of steel
type: Concept
notation: 24.20
definition: List hosts the classification for the activities according to the Council Regulation 3037 90 EEC
status: valid
status modified: 2016-06-08
accepted date: 2016-06-08
in scheme: List hosts the classification for the activities according to the Council Regulation 3037/90/EEC.

Cold drawing of bars
type: Concept
notation: 24.31
definition: List hosts the classification for the activities according to the Council Regulation 3037 90 EEC
status: valid
status modified: 2016-06-08
accepted date: 2016-06-08
in scheme: List hosts the classification for the activities according to the Council Regulation 3037/90/EEC.

Cold rolling of narrow strip
type: Concept
notation: 24.32
definition: List hosts the classification for the activities according to the Council Regulation 3037 90 EEC
status: valid
status modified: 2016-06-08
accepted date: 2016-06-08
in scheme: List hosts the classification for the activities according to the Council Regulation 3037/90/EEC.

Cold forming or folding
type: Concept
notation: 24.33
definition: List hosts the classification for the activities according to the Council Regulation 3037 90 EEC
status: valid
status modified: 2016-06-08
accepted date: 2016-06-08
in scheme: List hosts the classification for the activities according to the Council Regulation 3037/90/EEC.

Cold drawing of wire
type: Concept
notation: 24.34
definition: List hosts the classification for the activities according to the Council Regulation 3037 90 EEC
status: valid
status modified: 2016-06-08
accepted date: 2016-06-08
in scheme: List hosts the classification for the activities according to the Council Regulation 3037/90/EEC.

Precious metals production
type: Concept
notation: 24.41
definition: List hosts the classification for the activities according to the Council Regulation 3037 90 EEC
status: valid
status modified: 2016-06-08
accepted date: 2016-06-08
in scheme: List hosts the classification for the activities according to the Council Regulation 3037/90/EEC.

Aluminium production
type: Concept
notation: 24.42
definition: List hosts the classification for the activities according to the Council Regulation 3037 90 EEC
status: valid
status modified: 2016-06-08
accepted date: 2016-06-08
in scheme: List hosts the classification for the activities according to the Council Regulation 3037/90/EEC.

Lead zinc and tin production
type: Concept
notation: 24.43
definition: List hosts the classification for the activities according to the Council Regulation 3037 90 EEC
status: valid
status modified: 2016-06-08
accepted date: 2016-06-08
in scheme: List hosts the classification for the activities according to the Council Regulation 3037/90/EEC.

Copper production
type: Concept
notation: 24.44
definition: List hosts the classification for the activities according to the Council Regulation 3037 90 EEC
status: valid
status modified: 2016-06-08
accepted date: 2016-06-08
in scheme: List hosts the classification for the activities according to the Council Regulation 3037/90/EEC.

Other non-ferrous metal production
type: Concept
notation: 24.45
definition: List hosts the classification for the activities according to the Council Regulation 3037 90 EEC
status: valid
status modified: 2016-06-08
accepted date: 2016-06-08
in scheme: List hosts the classification for the activities according to the Council Regulation 3037/90/EEC.

Processing of nuclear fuel
type: Concept
notation: 24.46
definition: List hosts the classification for the activities according to the Council Regulation 3037 90 EEC
status: valid
status modified: 2016-06-08
accepted date: 2016-06-08
in scheme: List hosts the classification for the activities according to the Council Regulation 3037/90/EEC.

Casting of iron
type: Concept
notation: 24.51
definition: List hosts the classification for the activities according to the Council Regulation 3037 90 EEC
status: valid
status modified: 2016-06-08
accepted date: 2016-06-08
in scheme: List hosts the classification for the activities according to the Council Regulation 3037/90/EEC.

Casting of steel
type: Concept
notation: 24.52
definition: List hosts the classification for the activities according to the Council Regulation 3037 90 EEC
status: valid
status modified: 2016-06-08
accepted date: 2016-06-08
in scheme: List hosts the classification for the activities according to the Council Regulation 3037/90/EEC.

Casting of light metals
type: Concept
notation: 24.53
definition: List hosts the classification for the activities according to the Council Regulation 3037 90 EEC
status: valid
status modified: 2016-06-08
accepted date: 2016-06-08
in scheme: List hosts the classification for the activities according to the Council Regulation 3037/90/EEC.

Casting of other non-ferrous metals
type: Concept
notation: 24.54
definition: List hosts the classification for the activities according to the Council Regulation 3037 90 EEC
status: valid
status modified: 2016-06-08
accepted date: 2016-06-08
in scheme: List hosts the classification for the activities according to the Council Regulation 3037/90/EEC.

Manufacture of metal structures and parts of structures
type: Concept
notation: 25.11
definition: List hosts the classification for the activities according to the Council Regulation 3037 90 EEC
status: valid
status modified: 2016-06-08
accepted date: 2016-06-08
in scheme: List hosts the classification for the activities according to the Council Regulation 3037/90/EEC.

Manufacture of doors and windows of metal
type: Concept
notation: 25.12
definition: List hosts the classification for the activities according to the Council Regulation 3037 90 EEC
status: valid
status modified: 2016-06-08
accepted date: 2016-06-08
in scheme: List hosts the classification for the activities according to the Council Regulation 3037/90/EEC.

Manufacture of central heating radiators and boilers
type: Concept
notation: 25.21
definition: List hosts the classification for the activities according to the Council Regulation 3037 90 EEC
status: valid
status modified: 2016-06-08
accepted date: 2016-06-08
in scheme: List hosts the classification for the activities according to the Council Regulation 3037/90/EEC.

Manufacture of other tanks reservoirs and containers of metal
type: Concept
notation: 25.29
definition: List hosts the classification for the activities according to the Council Regulation 3037 90 EEC
status: valid
status modified: 2016-06-08
accepted date: 2016-06-08
in scheme: List hosts the classification for the activities according to the Council Regulation 3037/90/EEC.

Manufacture of steam generators except central heating hot water boilers
type: Concept
notation: 25.30
definition: List hosts the classification for the activities according to the Council Regulation 3037 90 EEC
status: valid
status modified: 2016-06-08
accepted date: 2016-06-08
in scheme: List hosts the classification for the activities according to the Council Regulation 3037/90/EEC.

Manufacture of weapons and ammunition
type: Concept
notation: 25.40
definition: List hosts the classification for the activities according to the Council Regulation 3037 90 EEC
status: valid
status modified: 2016-06-08
accepted date: 2016-06-08
in scheme: List hosts the classification for the activities according to the Council Regulation 3037/90/EEC.

Forging pressing stamping and roll-forming of metal powder metallurgy
type: Concept
notation: 25.50
definition: List hosts the classification for the activities according to the Council Regulation 3037 90 EEC
status: valid
status modified: 2016-06-08
accepted date: 2016-06-08
in scheme: List hosts the classification for the activities according to the Council Regulation 3037/90/EEC.

Treatment and coating of metals
type: Concept
notation: 25.61
definition: List hosts the classification for the activities according to the Council Regulation 3037 90 EEC
status: valid
status modified: 2016-06-08
accepted date: 2016-06-08
in scheme: List hosts the classification for the activities according to the Council Regulation 3037/90/EEC.

Machining
type: Concept
notation: 25.62
definition: List hosts the classification for the activities according to the Council Regulation 3037 90 EEC
status: valid
status modified: 2016-06-08
accepted date: 2016-06-08
in scheme: List hosts the classification for the activities according to the Council Regulation 3037/90/EEC.

Manufacture of cutlery
type: Concept
notation: 25.71
definition: List hosts the classification for the activities according to the Council Regulation 3037 90 EEC
status: valid
status modified: 2016-06-08
accepted date: 2016-06-08
in scheme: List hosts the classification for the activities according to the Council Regulation 3037/90/EEC.

Manufacture of locks and hinges
type: Concept
notation: 25.72
definition: List hosts the classification for the activities according to the Council Regulation 3037 90 EEC
status: valid
status modified: 2016-06-08
accepted date: 2016-06-08
in scheme: List hosts the classification for the activities according to the Council Regulation 3037/90/EEC.

Manufacture of tools
type: Concept
notation: 25.73
definition: List hosts the classification for the activities according to the Council Regulation 3037 90 EEC
status: valid
status modified: 2016-06-08
accepted date: 2016-06-08
in scheme: List hosts the classification for the activities according to the Council Regulation 3037/90/EEC.

Manufacture of steel drums and similar containers
type: Concept
notation: 25.91
definition: List hosts the classification for the activities according to the Council Regulation 3037 90 EEC
status: valid
status modified: 2016-06-08
accepted date: 2016-06-08
in scheme: List hosts the classification for the activities according to the Council Regulation 3037/90/EEC.

Manufacture of light metal packaging
type: Concept
notation: 25.92
definition: List hosts the classification for the activities according to the Council Regulation 3037 90 EEC
status: valid
status modified: 2016-06-08
accepted date: 2016-06-08
in scheme: List hosts the classification for the activities according to the Council Regulation 3037/90/EEC.

Manufacture of wire products chain and springs
type: Concept
notation: 25.93
definition: List hosts the classification for the activities according to the Council Regulation 3037 90 EEC
status: valid
status modified: 2016-06-08
accepted date: 2016-06-08
in scheme: List hosts the classification for the activities according to the Council Regulation 3037/90/EEC.

Manufacture of fasteners and screw machine products
type: Concept
notation: 25.94
definition: List hosts the classification for the activities according to the Council Regulation 3037 90 EEC
status: valid
status modified: 2016-06-08
accepted date: 2016-06-08
in scheme: List hosts the classification for the activities according to the Council Regulation 3037/90/EEC.

Manufacture of other fabricated metal products n e c
type: Concept
notation: 25.99
definition: List hosts the classification for the activities according to the Council Regulation 3037 90 EEC
status: valid
status modified: 2016-06-08
accepted date: 2016-06-08
in scheme: List hosts the classification for the activities according to the Council Regulation 3037/90/EEC.

Manufacture of electronic components
type: Concept
notation: 26.11
definition: List hosts the classification for the activities according to the Council Regulation 3037 90 EEC
status: valid
status modified: 2016-06-08
accepted date: 2016-06-08
in scheme: List hosts the classification for the activities according to the Council Regulation 3037/90/EEC.

Manufacture of loaded electronic boards
type: Concept
notation: 26.12
definition: List hosts the classification for the activities according to the Council Regulation 3037 90 EEC
status: valid
status modified: 2016-06-08
accepted date: 2016-06-08
in scheme: List hosts the classification for the activities according to the Council Regulation 3037/90/EEC.

Manufacture of computers and peripheral equipment
type: Concept
notation: 26.20
definition: List hosts the classification for the activities according to the Council Regulation 3037 90 EEC
status: valid
status modified: 2016-06-08
accepted date: 2016-06-08
in scheme: List hosts the classification for the activities according to the Council Regulation 3037/90/EEC.

Manufacture of communication equipment
type: Concept
notation: 26.30
definition: List hosts the classification for the activities according to the Council Regulation 3037 90 EEC
status: valid
status modified: 2016-06-08
accepted date: 2016-06-08
in scheme: List hosts the classification for the activities according to the Council Regulation 3037/90/EEC.

Manufacture of consumer electronics
type: Concept
notation: 26.40
definition: List hosts the classification for the activities according to the Council Regulation 3037 90 EEC
status: valid
status modified: 2016-06-08
accepted date: 2016-06-08
in scheme: List hosts the classification for the activities according to the Council Regulation 3037/90/EEC.

Manufacture of instruments and appliances for measuring testing and navigation
type: Concept
notation: 26.51
definition: List hosts the classification for the activities according to the Council Regulation 3037 90 EEC
status: valid
status modified: 2016-06-08
accepted date: 2016-06-08
in scheme: List hosts the classification for the activities according to the Council Regulation 3037/90/EEC.

Manufacture of watches and clocks
type: Concept
notation: 26.52
definition: List hosts the classification for the activities according to the Council Regulation 3037 90 EEC
status: valid
status modified: 2016-06-08
accepted date: 2016-06-08
in scheme: List hosts the classification for the activities according to the Council Regulation 3037/90/EEC.

Manufacture of irradiation electromedical and electrotherapeutic equipment
type: Concept
notation: 26.60
definition: List hosts the classification for the activities according to the Council Regulation 3037 90 EEC
status: valid
status modified: 2016-06-08
accepted date: 2016-06-08
in scheme: List hosts the classification for the activities according to the Council Regulation 3037/90/EEC.

Manufacture of optical instruments and photographic equipment
type: Concept
notation: 26.70
definition: List hosts the classification for the activities according to the Council Regulation 3037 90 EEC
status: valid
status modified: 2016-06-08
accepted date: 2016-06-08
in scheme: List hosts the classification for the activities according to the Council Regulation 3037/90/EEC.

Manufacture of magnetic and optical media
type: Concept
notation: 26.80
definition: List hosts the classification for the activities according to the Council Regulation 3037 90 EEC
status: valid
status modified: 2016-06-08
accepted date: 2016-06-08
in scheme: List hosts the classification for the activities according to the Council Regulation 3037/90/EEC.

Manufacture of electric motors generators and transformers
type: Concept
notation: 27.11
definition: List hosts the classification for the activities according to the Council Regulation 3037 90 EEC
status: valid
status modified: 2016-06-08
accepted date: 2016-06-08
in scheme: List hosts the classification for the activities according to the Council Regulation 3037/90/EEC.

Manufacture of electricity distribution and control apparatus
type: Concept
notation: 27.12
definition: List hosts the classification for the activities according to the Council Regulation 3037 90 EEC
status: valid
status modified: 2016-06-08
accepted date: 2016-06-08
in scheme: List hosts the classification for the activities according to the Council Regulation 3037/90/EEC.

Manufacture of batteries and accumulators
type: Concept
notation: 27.20
definition: List hosts the classification for the activities according to the Council Regulation 3037 90 EEC
status: valid
status modified: 2016-06-08
accepted date: 2016-06-08
in scheme: List hosts the classification for the activities according to the Council Regulation 3037/90/EEC.

Manufacture of fibre optic cables
type: Concept
notation: 27.31
definition: List hosts the classification for the activities according to the Council Regulation 3037 90 EEC
status: valid
status modified: 2016-06-08
accepted date: 2016-06-08
in scheme: List hosts the classification for the activities according to the Council Regulation 3037/90/EEC.

Manufacture of other electronic and electric wires and cables
type: Concept
notation: 27.32
definition: List hosts the classification for the activities according to the Council Regulation 3037 90 EEC
status: valid
status modified: 2016-06-08
accepted date: 2016-06-08
in scheme: List hosts the classification for the activities according to the Council Regulation 3037/90/EEC.

Manufacture of wiring devices
type: Concept
notation: 27.33
definition: List hosts the classification for the activities according to the Council Regulation 3037 90 EEC
status: valid
status modified: 2016-06-08
accepted date: 2016-06-08
in scheme: List hosts the classification for the activities according to the Council Regulation 3037/90/EEC.

Manufacture of electric lighting equipment
type: Concept
notation: 27.40
definition: List hosts the classification for the activities according to the Council Regulation 3037 90 EEC
status: valid
status modified: 2016-06-08
accepted date: 2016-06-08
in scheme: List hosts the classification for the activities according to the Council Regulation 3037/90/EEC.

Manufacture of electric domestic appliances
type: Concept
notation: 27.51
definition: List hosts the classification for the activities according to the Council Regulation 3037 90 EEC
status: valid
status modified: 2016-06-08
accepted date: 2016-06-08
in scheme: List hosts the classification for the activities according to the Council Regulation 3037/90/EEC.

Manufacture of non-electric domestic appliances
type: Concept
notation: 27.52
definition: List hosts the classification for the activities according to the Council Regulation 3037 90 EEC
status: valid
status modified: 2016-06-08
accepted date: 2016-06-08
in scheme: List hosts the classification for the activities according to the Council Regulation 3037/90/EEC.

Manufacture of other electrical equipment
type: Concept
notation: 27.90
definition: List hosts the classification for the activities according to the Council Regulation 3037 90 EEC
status: valid
status modified: 2016-06-08
accepted date: 2016-06-08
in scheme: List hosts the classification for the activities according to the Council Regulation 3037/90/EEC.

Manufacture of engines and turbines except aircraft vehicle and cycle engines
type: Concept
notation: 28.11
definition: List hosts the classification for the activities according to the Council Regulation 3037 90 EEC
status: valid
status modified: 2016-06-08
accepted date: 2016-06-08
in scheme: List hosts the classification for the activities according to the Council Regulation 3037/90/EEC.

Manufacture of fluid power equipment
type: Concept
notation: 28.12
definition: List hosts the classification for the activities according to the Council Regulation 3037 90 EEC
status: valid
status modified: 2016-06-08
accepted date: 2016-06-08
in scheme: List hosts the classification for the activities according to the Council Regulation 3037/90/EEC.

Manufacture of other pumps and compressors
type: Concept
notation: 28.13
definition: List hosts the classification for the activities according to the Council Regulation 3037 90 EEC
status: valid
status modified: 2016-06-08
accepted date: 2016-06-08
in scheme: List hosts the classification for the activities according to the Council Regulation 3037/90/EEC.

Manufacture of other taps and valves
type: Concept
notation: 28.14
definition: List hosts the classification for the activities according to the Council Regulation 3037 90 EEC
status: valid
status modified: 2016-06-08
accepted date: 2016-06-08
in scheme: List hosts the classification for the activities according to the Council Regulation 3037/90/EEC.

Manufacture of bearings gears gearing and driving elements
type: Concept
notation: 28.15
definition: List hosts the classification for the activities according to the Council Regulation 3037 90 EEC
status: valid
status modified: 2016-06-08
accepted date: 2016-06-08
in scheme: List hosts the classification for the activities according to the Council Regulation 3037/90/EEC.

Manufacture of ovens furnaces and furnace burners
type: Concept
notation: 28.21
definition: List hosts the classification for the activities according to the Council Regulation 3037 90 EEC
status: valid
status modified: 2016-06-08
accepted date: 2016-06-08
in scheme: List hosts the classification for the activities according to the Council Regulation 3037/90/EEC.

Manufacture of lifting and handling equipment
type: Concept
notation: 28.22
definition: List hosts the classification for the activities according to the Council Regulation 3037 90 EEC
status: valid
status modified: 2016-06-08
accepted date: 2016-06-08
in scheme: List hosts the classification for the activities according to the Council Regulation 3037/90/EEC.

Manufacture of office machinery and equipment except computers and peripheral equipment
type: Concept
notation: 28.23
definition: List hosts the classification for the activities according to the Council Regulation 3037 90 EEC
status: valid
status modified: 2016-06-08
accepted date: 2016-06-08
in scheme: List hosts the classification for the activities according to the Council Regulation 3037/90/EEC.

Manufacture of power-driven hand tools
type: Concept
notation: 28.24
definition: List hosts the classification for the activities according to the Council Regulation 3037 90 EEC
status: valid
status modified: 2016-06-08
accepted date: 2016-06-08
in scheme: List hosts the classification for the activities according to the Council Regulation 3037/90/EEC.

Manufacture of non-domestic cooling and ventilation equipment
type: Concept
notation: 28.25
definition: List hosts the classification for the activities according to the Council Regulation 3037 90 EEC
status: valid
status modified: 2016-06-08
accepted date: 2016-06-08
in scheme: List hosts the classification for the activities according to the Council Regulation 3037/90/EEC.

Manufacture of other general-purpose machinery n e c
type: Concept
notation: 28.29
definition: List hosts the classification for the activities according to the Council Regulation 3037 90 EEC
status: valid
status modified: 2016-06-08
accepted date: 2016-06-08
in scheme: List hosts the classification for the activities according to the Council Regulation 3037/90/EEC.

Manufacture of agricultural and forestry machinery
type: Concept
notation: 28.30
definition: List hosts the classification for the activities according to the Council Regulation 3037 90 EEC
status: valid
status modified: 2016-06-08
accepted date: 2016-06-08
in scheme: List hosts the classification for the activities according to the Council Regulation 3037/90/EEC.

Manufacture of metal forming machinery
type: Concept
notation: 28.41
definition: List hosts the classification for the activities according to the Council Regulation 3037 90 EEC
status: valid
status modified: 2016-06-08
accepted date: 2016-06-08
in scheme: List hosts the classification for the activities according to the Council Regulation 3037/90/EEC.

Manufacture of other machine tools
type: Concept
notation: 28.49
definition: List hosts the classification for the activities according to the Council Regulation 3037 90 EEC
status: valid
status modified: 2016-06-08
accepted date: 2016-06-08
in scheme: List hosts the classification for the activities according to the Council Regulation 3037/90/EEC.

Manufacture of machinery for metallurgy
type: Concept
notation: 28.91
definition: List hosts the classification for the activities according to the Council Regulation 3037 90 EEC
status: valid
status modified: 2016-06-08
accepted date: 2016-06-08
in scheme: List hosts the classification for the activities according to the Council Regulation 3037/90/EEC.

Manufacture of machinery for mining quarrying and construction
type: Concept
notation: 28.92
definition: List hosts the classification for the activities according to the Council Regulation 3037 90 EEC
status: valid
status modified: 2016-06-08
accepted date: 2016-06-08
in scheme: List hosts the classification for the activities according to the Council Regulation 3037/90/EEC.

Manufacture of machinery for food beverage and tobacco processing
type: Concept
notation: 28.93
definition: List hosts the classification for the activities according to the Council Regulation 3037 90 EEC
status: valid
status modified: 2016-06-08
accepted date: 2016-06-08
in scheme: List hosts the classification for the activities according to the Council Regulation 3037/90/EEC.

Manufacture of machinery for textile apparel and leather production
type: Concept
notation: 28.94
definition: List hosts the classification for the activities according to the Council Regulation 3037 90 EEC
status: valid
status modified: 2016-06-08
accepted date: 2016-06-08
in scheme: List hosts the classification for the activities according to the Council Regulation 3037/90/EEC.

Manufacture of machinery for paper and paperboard production
type: Concept
notation: 28.95
definition: List hosts the classification for the activities according to the Council Regulation 3037 90 EEC
status: valid
status modified: 2016-06-08
accepted date: 2016-06-08
in scheme: List hosts the classification for the activities according to the Council Regulation 3037/90/EEC.

Manufacture of plastics and rubber machinery
type: Concept
notation: 28.96
definition: List hosts the classification for the activities according to the Council Regulation 3037 90 EEC
status: valid
status modified: 2016-06-08
accepted date: 2016-06-08
in scheme: List hosts the classification for the activities according to the Council Regulation 3037/90/EEC.

Manufacture of other special-purpose machinery n e c
type: Concept
notation: 28.99
definition: List hosts the classification for the activities according to the Council Regulation 3037 90 EEC
status: valid
status modified: 2016-06-08
accepted date: 2016-06-08
in scheme: List hosts the classification for the activities according to the Council Regulation 3037/90/EEC.

Manufacture of motor vehicles
type: Concept
notation: 29.10
definition: List hosts the classification for the activities according to the Council Regulation 3037 90 EEC
status: valid
status modified: 2016-06-08
accepted date: 2016-06-08
in scheme: List hosts the classification for the activities according to the Council Regulation 3037/90/EEC.

Manufacture of bodies coachwork for motor vehicles manufacture of trailers and semi-trailers
type: Concept
notation: 29.20
definition: List hosts the classification for the activities according to the Council Regulation 3037 90 EEC
status: valid
status modified: 2016-06-08
accepted date: 2016-06-08
in scheme: List hosts the classification for the activities according to the Council Regulation 3037/90/EEC.

Manufacture of electrical and electronic equipment for motor vehicles
type: Concept
notation: 29.31
definition: List hosts the classification for the activities according to the Council Regulation 3037 90 EEC
status: valid
status modified: 2016-06-08
accepted date: 2016-06-08
in scheme: List hosts the classification for the activities according to the Council Regulation 3037/90/EEC.

Manufacture of other parts and accessories for motor vehicles
type: Concept
notation: 29.32
definition: List hosts the classification for the activities according to the Council Regulation 3037 90 EEC
status: valid
status modified: 2016-06-08
accepted date: 2016-06-08
in scheme: List hosts the classification for the activities according to the Council Regulation 3037/90/EEC.

Building of ships and floating structures
type: Concept
notation: 30.11
definition: List hosts the classification for the activities according to the Council Regulation 3037 90 EEC
status: valid
status modified: 2016-06-08
accepted date: 2016-06-08
in scheme: List hosts the classification for the activities according to the Council Regulation 3037/90/EEC.

Building of pleasure and sporting boats
type: Concept
notation: 30.12
definition: List hosts the classification for the activities according to the Council Regulation 3037 90 EEC
status: valid
status modified: 2016-06-08
accepted date: 2016-06-08
in scheme: List hosts the classification for the activities according to the Council Regulation 3037/90/EEC.

Manufacture of railway locomotives and rolling stock
type: Concept
notation: 30.20
definition: List hosts the classification for the activities according to the Council Regulation 3037 90 EEC
status: valid
status modified: 2016-06-08
accepted date: 2016-06-08
in scheme: List hosts the classification for the activities according to the Council Regulation 3037/90/EEC.

Manufacture of air and spacecraft and related machinery
type: Concept
notation: 30.30
definition: List hosts the classification for the activities according to the Council Regulation 3037 90 EEC
status: valid
status modified: 2016-06-08
accepted date: 2016-06-08
in scheme: List hosts the classification for the activities according to the Council Regulation 3037/90/EEC.

Manufacture of military fighting vehicles
type: Concept
notation: 30.40
definition: List hosts the classification for the activities according to the Council Regulation 3037 90 EEC
status: valid
status modified: 2016-06-08
accepted date: 2016-06-08
in scheme: List hosts the classification for the activities according to the Council Regulation 3037/90/EEC.

Manufacture of motorcycles
type: Concept
notation: 30.91
definition: List hosts the classification for the activities according to the Council Regulation 3037 90 EEC
status: valid
status modified: 2016-06-08
accepted date: 2016-06-08
in scheme: List hosts the classification for the activities according to the Council Regulation 3037/90/EEC.

Manufacture of bicycles and invalid carriages
type: Concept
notation: 30.92
definition: List hosts the classification for the activities according to the Council Regulation 3037 90 EEC
status: valid
status modified: 2016-06-08
accepted date: 2016-06-08
in scheme: List hosts the classification for the activities according to the Council Regulation 3037/90/EEC.

Manufacture of other transport equipment n e c
type: Concept
notation: 30.99
definition: List hosts the classification for the activities according to the Council Regulation 3037 90 EEC
status: valid
status modified: 2016-06-08
accepted date: 2016-06-08
in scheme: List hosts the classification for the activities according to the Council Regulation 3037/90/EEC.

Manufacture of office and shop furniture
type: Concept
notation: 31.01
definition: List hosts the classification for the activities according to the Council Regulation 3037 90 EEC
status: valid
status modified: 2016-06-08
accepted date: 2016-06-08
in scheme: List hosts the classification for the activities according to the Council Regulation 3037/90/EEC.

Manufacture of kitchen furniture
type: Concept
notation: 31.02
definition: List hosts the classification for the activities according to the Council Regulation 3037 90 EEC
status: valid
status modified: 2016-06-08
accepted date: 2016-06-08
in scheme: List hosts the classification for the activities according to the Council Regulation 3037/90/EEC.

Manufacture of mattresses
type: Concept
notation: 31.03
definition: List hosts the classification for the activities according to the Council Regulation 3037 90 EEC
status: valid
status modified: 2016-06-08
accepted date: 2016-06-08
in scheme: List hosts the classification for the activities according to the Council Regulation 3037/90/EEC.

Manufacture of other furniture
type: Concept
notation: 31.09
definition: List hosts the classification for the activities according to the Council Regulation 3037 90 EEC
status: valid
status modified: 2016-06-08
accepted date: 2016-06-08
in scheme: List hosts the classification for the activities according to the Council Regulation 3037/90/EEC.

Manufacture of jewellery, bijouterie and related articles
type: Concept
notation: 32.10
definition: Manufacture of jewellery, bijouterie and related articles
status: valid
status modified: 2017-02-08
in scheme: List hosts the classification for the activities according to the Council Regulation 3037/90/EEC.

Striking of coins
type: Concept
notation: 32.11
definition: List hosts the classification for the activities according to the Council Regulation 3037 90 EEC
status: valid
status modified: 2016-06-08
accepted date: 2016-06-08
in scheme: List hosts the classification for the activities according to the Council Regulation 3037/90/EEC.

Manufacture of jewellery and related articles
type: Concept
notation: 32.12
definition: List hosts the classification for the activities according to the Council Regulation 3037 90 EEC
status: valid
status modified: 2016-06-08
accepted date: 2016-06-08
in scheme: List hosts the classification for the activities according to the Council Regulation 3037/90/EEC.

Manufacture of imitation jewellery and related articles
type: Concept
notation: 32.13
definition: List hosts the classification for the activities according to the Council Regulation 3037 90 EEC
status: valid
status modified: 2016-06-08
accepted date: 2016-06-08
in scheme: List hosts the classification for the activities according to the Council Regulation 3037/90/EEC.

Manufacture of musical instruments
type: Concept
notation: 32.20
definition: List hosts the classification for the activities according to the Council Regulation 3037 90 EEC
status: valid
status modified: 2016-06-08
accepted date: 2016-06-08
in scheme: List hosts the classification for the activities according to the Council Regulation 3037/90/EEC.

Manufacture of sports goods
type: Concept
notation: 32.30
definition: List hosts the classification for the activities according to the Council Regulation 3037 90 EEC
status: valid
status modified: 2016-06-08
accepted date: 2016-06-08
in scheme: List hosts the classification for the activities according to the Council Regulation 3037/90/EEC.

Manufacture of games and toys
type: Concept
notation: 32.40
definition: List hosts the classification for the activities according to the Council Regulation 3037 90 EEC
status: valid
status modified: 2016-06-08
accepted date: 2016-06-08
in scheme: List hosts the classification for the activities according to the Council Regulation 3037/90/EEC.

Manufacture of medical and dental instruments and supplies
type: Concept
notation: 32.50
definition: List hosts the classification for the activities according to the Council Regulation 3037 90 EEC
status: valid
status modified: 2016-06-08
accepted date: 2016-06-08
in scheme: List hosts the classification for the activities according to the Council Regulation 3037/90/EEC.

Manufacture of brooms and brushes
type: Concept
notation: 32.91
definition: List hosts the classification for the activities according to the Council Regulation 3037 90 EEC
status: valid
status modified: 2016-06-08
accepted date: 2016-06-08
in scheme: List hosts the classification for the activities according to the Council Regulation 3037/90/EEC.

Other manufacturing n e c
type: Concept
notation: 32.99
definition: List hosts the classification for the activities according to the Council Regulation 3037 90 EEC
status: valid
status modified: 2016-06-08
accepted date: 2016-06-08
in scheme: List hosts the classification for the activities according to the Council Regulation 3037/90/EEC.

Repair of fabricated metal products
type: Concept
notation: 33.11
definition: List hosts the classification for the activities according to the Council Regulation 3037 90 EEC
status: valid
status modified: 2016-06-08
accepted date: 2016-06-08
in scheme: List hosts the classification for the activities according to the Council Regulation 3037/90/EEC.

Repair of machinery
type: Concept
notation: 33.12
definition: List hosts the classification for the activities according to the Council Regulation 3037 90 EEC
status: valid
status modified: 2016-06-08
accepted date: 2016-06-08
in scheme: List hosts the classification for the activities according to the Council Regulation 3037/90/EEC.

Repair of electronic and optical equipment
type: Concept
notation: 33.13
definition: List hosts the classification for the activities according to the Council Regulation 3037 90 EEC
status: valid
status modified: 2016-06-08
accepted date: 2016-06-08
in scheme: List hosts the classification for the activities according to the Council Regulation 3037/90/EEC.

Repair of electrical equipment
type: Concept
notation: 33.14
definition: List hosts the classification for the activities according to the Council Regulation 3037 90 EEC
status: valid
status modified: 2016-06-08
accepted date: 2016-06-08
in scheme: List hosts the classification for the activities according to the Council Regulation 3037/90/EEC.

Repair and maintenance of ships and boats
type: Concept
notation: 33.15
definition: List hosts the classification for the activities according to the Council Regulation 3037 90 EEC
status: valid
status modified: 2016-06-08
accepted date: 2016-06-08
in scheme: List hosts the classification for the activities according to the Council Regulation 3037/90/EEC.

Repair and maintenance of aircraft and spacecraft
type: Concept
notation: 33.16
definition: List hosts the classification for the activities according to the Council Regulation 3037 90 EEC
status: valid
status modified: 2016-06-08
accepted date: 2016-06-08
in scheme: List hosts the classification for the activities according to the Council Regulation 3037/90/EEC.

Repair and maintenance of other transport equipment
type: Concept
notation: 33.17
definition: List hosts the classification for the activities according to the Council Regulation 3037 90 EEC
status: valid
status modified: 2016-06-08
accepted date: 2016-06-08
in scheme: List hosts the classification for the activities according to the Council Regulation 3037/90/EEC.

Repair of other equipment
type: Concept
notation: 33.19
definition: List hosts the classification for the activities according to the Council Regulation 3037 90 EEC
status: valid
status modified: 2016-06-08
accepted date: 2016-06-08
in scheme: List hosts the classification for the activities according to the Council Regulation 3037/90/EEC.

Installation of industrial machinery and equipment
type: Concept
notation: 33.20
definition: List hosts the classification for the activities according to the Council Regulation 3037 90 EEC
status: valid
status modified: 2016-06-08
accepted date: 2016-06-08
in scheme: List hosts the classification for the activities according to the Council Regulation 3037/90/EEC.

Production of electricity
type: Concept
notation: 35.11
definition: List hosts the classification for the activities according to the Council Regulation 3037 90 EEC
status: valid
status modified: 2016-06-08
accepted date: 2016-06-08
in scheme: List hosts the classification for the activities according to the Council Regulation 3037/90/EEC.

Transmission of electricity
type: Concept
notation: 35.12
definition: List hosts the classification for the activities according to the Council Regulation 3037 90 EEC
status: valid
status modified: 2016-06-08
accepted date: 2016-06-08
in scheme: List hosts the classification for the activities according to the Council Regulation 3037/90/EEC.

Distribution of electricity
type: Concept
notation: 35.13
definition: List hosts the classification for the activities according to the Council Regulation 3037 90 EEC
status: valid
status modified: 2016-06-08
accepted date: 2016-06-08
in scheme: List hosts the classification for the activities according to the Council Regulation 3037/90/EEC.

Trade of electricity
type: Concept
notation: 35.14
definition: List hosts the classification for the activities according to the Council Regulation 3037 90 EEC
status: valid
status modified: 2016-06-08
accepted date: 2016-06-08
in scheme: List hosts the classification for the activities according to the Council Regulation 3037/90/EEC.

Manufacture of gas
type: Concept
notation: 35.21
definition: List hosts the classification for the activities according to the Council Regulation 3037 90 EEC
status: valid
status modified: 2016-06-08
accepted date: 2016-06-08
in scheme: List hosts the classification for the activities according to the Council Regulation 3037/90/EEC.

Distribution of gaseous fuels through mains
type: Concept
notation: 35.22
definition: List hosts the classification for the activities according to the Council Regulation 3037 90 EEC
status: valid
status modified: 2016-06-08
accepted date: 2016-06-08
in scheme: List hosts the classification for the activities according to the Council Regulation 3037/90/EEC.

Trade of gas through mains
type: Concept
notation: 35.23
definition: List hosts the classification for the activities according to the Council Regulation 3037 90 EEC
status: valid
status modified: 2016-06-08
accepted date: 2016-06-08
in scheme: List hosts the classification for the activities according to the Council Regulation 3037/90/EEC.

Steam and air conditioning supply
type: Concept
notation: 35.30
definition: List hosts the classification for the activities according to the Council Regulation 3037 90 EEC
status: valid
status modified: 2016-06-08
accepted date: 2016-06-08
in scheme: List hosts the classification for the activities according to the Council Regulation 3037/90/EEC.

Water collection treatment and supply
type: Concept
notation: 36.00
definition: List hosts the classification for the activities according to the Council Regulation 3037 90 EEC
status: valid
status modified: 2016-06-08
accepted date: 2016-06-08
in scheme: List hosts the classification for the activities according to the Council Regulation 3037/90/EEC.

Sewerage
type: Concept
notation: 37.00
definition: List hosts the classification for the activities according to the Council Regulation 3037 90 EEC
status: valid
status modified: 2016-06-08
accepted date: 2016-06-08
in scheme: List hosts the classification for the activities according to the Council Regulation 3037/90/EEC.

Collection of non-hazardous waste
type: Concept
notation: 38.11
definition: List hosts the classification for the activities according to the Council Regulation 3037 90 EEC
status: valid
status modified: 2016-06-08
accepted date: 2016-06-08
in scheme: List hosts the classification for the activities according to the Council Regulation 3037/90/EEC.

Collection of hazardous waste
type: Concept
notation: 38.12
definition: List hosts the classification for the activities according to the Council Regulation 3037 90 EEC
status: valid
status modified: 2016-06-08
accepted date: 2016-06-08
in scheme: List hosts the classification for the activities according to the Council Regulation 3037/90/EEC.

Treatment and disposal of non-hazardous waste
type: Concept
notation: 38.21
definition: List hosts the classification for the activities according to the Council Regulation 3037 90 EEC
status: valid
status modified: 2016-06-08
accepted date: 2016-06-08
in scheme: List hosts the classification for the activities according to the Council Regulation 3037/90/EEC.

Treatment and disposal of hazardous waste
type: Concept
notation: 38.22
definition: List hosts the classification for the activities according to the Council Regulation 3037 90 EEC
status: valid
status modified: 2016-06-08
accepted date: 2016-06-08
in scheme: List hosts the classification for the activities according to the Council Regulation 3037/90/EEC.

Dismantling of wrecks
type: Concept
notation: 38.31
definition: List hosts the classification for the activities according to the Council Regulation 3037 90 EEC
status: valid
status modified: 2016-06-08
accepted date: 2016-06-08
in scheme: List hosts the classification for the activities according to the Council Regulation 3037/90/EEC.

Recovery of sorted materials
type: Concept
notation: 38.32
definition: List hosts the classification for the activities according to the Council Regulation 3037 90 EEC
status: valid
status modified: 2016-06-08
accepted date: 2016-06-08
in scheme: List hosts the classification for the activities according to the Council Regulation 3037/90/EEC.

Remediation activities and other waste management services
type: Concept
notation: 39.00
definition: List hosts the classification for the activities according to the Council Regulation 3037 90 EEC
status: valid
status modified: 2016-06-08
accepted date: 2016-06-08
in scheme: List hosts the classification for the activities according to the Council Regulation 3037/90/EEC.

Development of building projects
type: Concept
notation: 41.10
definition: List hosts the classification for the activities according to the Council Regulation 3037 90 EEC
status: valid
status modified: 2016-06-08
accepted date: 2016-06-08
in scheme: List hosts the classification for the activities according to the Council Regulation 3037/90/EEC.

Construction of residential and non-residential buildings
type: Concept
notation: 41.20
definition: List hosts the classification for the activities according to the Council Regulation 3037 90 EEC
status: valid
status modified: 2016-06-08
accepted date: 2016-06-08
in scheme: List hosts the classification for the activities according to the Council Regulation 3037/90/EEC.

Construction of roads and motorways
type: Concept
notation: 42.11
definition: List hosts the classification for the activities according to the Council Regulation 3037 90 EEC
status: valid
status modified: 2016-06-08
accepted date: 2016-06-08
in scheme: List hosts the classification for the activities according to the Council Regulation 3037/90/EEC.

Construction of railways and underground railways
type: Concept
notation: 42.12
definition: List hosts the classification for the activities according to the Council Regulation 3037 90 EEC
status: valid
status modified: 2016-06-08
accepted date: 2016-06-08
in scheme: List hosts the classification for the activities according to the Council Regulation 3037/90/EEC.

Construction of bridges and tunnels
type: Concept
notation: 42.13
definition: List hosts the classification for the activities according to the Council Regulation 3037 90 EEC
status: valid
status modified: 2016-06-08
accepted date: 2016-06-08
in scheme: List hosts the classification for the activities according to the Council Regulation 3037/90/EEC.

Construction of utility projects for fluids
type: Concept
notation: 42.21
definition: List hosts the classification for the activities according to the Council Regulation 3037 90 EEC
status: valid
status modified: 2016-06-08
accepted date: 2016-06-08
in scheme: List hosts the classification for the activities according to the Council Regulation 3037/90/EEC.

Construction of utility projects for electricity and telecommunications
type: Concept
notation: 42.22
definition: List hosts the classification for the activities according to the Council Regulation 3037 90 EEC
status: valid
status modified: 2016-06-08
accepted date: 2016-06-08
in scheme: List hosts the classification for the activities according to the Council Regulation 3037/90/EEC.

Construction of water projects
type: Concept
notation: 42.91
definition: List hosts the classification for the activities according to the Council Regulation 3037 90 EEC
status: valid
status modified: 2016-06-08
accepted date: 2016-06-08
in scheme: List hosts the classification for the activities according to the Council Regulation 3037/90/EEC.

Construction of other civil engineering projects n e c
type: Concept
notation: 42.99
definition: List hosts the classification for the activities according to the Council Regulation 3037 90 EEC
status: valid
status modified: 2016-06-08
accepted date: 2016-06-08
in scheme: List hosts the classification for the activities according to the Council Regulation 3037/90/EEC.

Demolition
type: Concept
notation: 43.11
definition: List hosts the classification for the activities according to the Council Regulation 3037 90 EEC
status: valid
status modified: 2016-06-08
accepted date: 2016-06-08
in scheme: List hosts the classification for the activities according to the Council Regulation 3037/90/EEC.

Site preparation
type: Concept
notation: 43.12
definition: List hosts the classification for the activities according to the Council Regulation 3037 90 EEC
status: valid
status modified: 2016-06-08
accepted date: 2016-06-08
in scheme: List hosts the classification for the activities according to the Council Regulation 3037/90/EEC.

Test drilling and boring
type: Concept
notation: 43.13
definition: List hosts the classification for the activities according to the Council Regulation 3037 90 EEC
status: valid
status modified: 2016-06-08
accepted date: 2016-06-08
in scheme: List hosts the classification for the activities according to the Council Regulation 3037/90/EEC.

Electrical installation
type: Concept
notation: 43.21
definition: List hosts the classification for the activities according to the Council Regulation 3037 90 EEC
status: valid
status modified: 2016-06-08
accepted date: 2016-06-08
in scheme: List hosts the classification for the activities according to the Council Regulation 3037/90/EEC.

Plumbing heat and air-conditioning installation
type: Concept
notation: 43.22
definition: List hosts the classification for the activities according to the Council Regulation 3037 90 EEC
status: valid
status modified: 2016-06-08
accepted date: 2016-06-08
in scheme: List hosts the classification for the activities according to the Council Regulation 3037/90/EEC.

Other construction installation
type: Concept
notation: 43.29
definition: List hosts the classification for the activities according to the Council Regulation 3037 90 EEC
status: valid
status modified: 2016-06-08
accepted date: 2016-06-08
in scheme: List hosts the classification for the activities according to the Council Regulation 3037/90/EEC.

Plastering
type: Concept
notation: 43.31
definition: List hosts the classification for the activities according to the Council Regulation 3037 90 EEC
status: valid
status modified: 2016-06-08
accepted date: 2016-06-08
in scheme: List hosts the classification for the activities according to the Council Regulation 3037/90/EEC.

Joinery installation
type: Concept
notation: 43.32
definition: List hosts the classification for the activities according to the Council Regulation 3037 90 EEC
status: valid
status modified: 2016-06-08
accepted date: 2016-06-08
in scheme: List hosts the classification for the activities according to the Council Regulation 3037/90/EEC.

Floor and wall covering
type: Concept
notation: 43.33
definition: List hosts the classification for the activities according to the Council Regulation 3037 90 EEC
status: valid
status modified: 2016-06-08
accepted date: 2016-06-08
in scheme: List hosts the classification for the activities according to the Council Regulation 3037/90/EEC.

Painting and glazing
type: Concept
notation: 43.34
definition: List hosts the classification for the activities according to the Council Regulation 3037 90 EEC
status: valid
status modified: 2016-06-08
accepted date: 2016-06-08
in scheme: List hosts the classification for the activities according to the Council Regulation 3037/90/EEC.

Other building completion and finishing
type: Concept
notation: 43.39
definition: List hosts the classification for the activities according to the Council Regulation 3037 90 EEC
status: valid
status modified: 2016-06-08
accepted date: 2016-06-08
in scheme: List hosts the classification for the activities according to the Council Regulation 3037/90/EEC.

Roofing activities
type: Concept
notation: 43.91
definition: List hosts the classification for the activities according to the Council Regulation 3037 90 EEC
status: valid
status modified: 2016-06-08
accepted date: 2016-06-08
in scheme: List hosts the classification for the activities according to the Council Regulation 3037/90/EEC.

Other specialised construction activities n e c
type: Concept
notation: 43.99
definition: List hosts the classification for the activities according to the Council Regulation 3037 90 EEC
status: valid
status modified: 2016-06-08
accepted date: 2016-06-08
in scheme: List hosts the classification for the activities according to the Council Regulation 3037/90/EEC.

Sale of cars and light motor vehicles
type: Concept
notation: 45.11
definition: List hosts the classification for the activities according to the Council Regulation 3037 90 EEC
status: valid
status modified: 2016-06-08
accepted date: 2016-06-08
in scheme: List hosts the classification for the activities according to the Council Regulation 3037/90/EEC.

Sale of other motor vehicles
type: Concept
notation: 45.19
definition: List hosts the classification for the activities according to the Council Regulation 3037 90 EEC
status: valid
status modified: 2016-06-08
accepted date: 2016-06-08
in scheme: List hosts the classification for the activities according to the Council Regulation 3037/90/EEC.

Maintenance and repair of motor vehicles
type: Concept
notation: 45.20
definition: List hosts the classification for the activities according to the Council Regulation 3037 90 EEC
status: valid
status modified: 2016-06-08
accepted date: 2016-06-08
in scheme: List hosts the classification for the activities according to the Council Regulation 3037/90/EEC.

Wholesale trade of motor vehicle parts and accessories
type: Concept
notation: 45.31
definition: List hosts the classification for the activities according to the Council Regulation 3037 90 EEC
status: valid
status modified: 2016-06-08
accepted date: 2016-06-08
in scheme: List hosts the classification for the activities according to the Council Regulation 3037/90/EEC.

Retail trade of motor vehicle parts and accessories
type: Concept
notation: 45.32
definition: List hosts the classification for the activities according to the Council Regulation 3037 90 EEC
status: valid
status modified: 2016-06-08
accepted date: 2016-06-08
in scheme: List hosts the classification for the activities according to the Council Regulation 3037/90/EEC.

Sale maintenance and repair of motorcycles and related parts and accessories
type: Concept
notation: 45.40
definition: List hosts the classification for the activities according to the Council Regulation 3037 90 EEC
status: valid
status modified: 2016-06-08
accepted date: 2016-06-08
in scheme: List hosts the classification for the activities according to the Council Regulation 3037/90/EEC.

Agents involved in the sale of agricultural raw materials live animals textile raw materials and semi-finished goods
type: Concept
notation: 46.11
definition: List hosts the classification for the activities according to the Council Regulation 3037 90 EEC
status: valid
status modified: 2016-06-08
accepted date: 2016-06-08
in scheme: List hosts the classification for the activities according to the Council Regulation 3037/90/EEC.

Agents involved in the sale of fuels ores metals and industrial chemicals
type: Concept
notation: 46.12
definition: List hosts the classification for the activities according to the Council Regulation 3037 90 EEC
status: valid
status modified: 2016-06-08
accepted date: 2016-06-08
in scheme: List hosts the classification for the activities according to the Council Regulation 3037/90/EEC.

Agents involved in the sale of timber and building materials
type: Concept
notation: 46.13
definition: List hosts the classification for the activities according to the Council Regulation 3037 90 EEC
status: valid
status modified: 2016-06-08
accepted date: 2016-06-08
in scheme: List hosts the classification for the activities according to the Council Regulation 3037/90/EEC.

Agents involved in the sale of machinery industrial equipment ships and aircraft
type: Concept
notation: 46.14
definition: List hosts the classification for the activities according to the Council Regulation 3037 90 EEC
status: valid
status modified: 2016-06-08
accepted date: 2016-06-08
in scheme: List hosts the classification for the activities according to the Council Regulation 3037/90/EEC.

Agents involved in the sale of furniture household goods hardware and ironmongery
type: Concept
notation: 46.15
definition: List hosts the classification for the activities according to the Council Regulation 3037 90 EEC
status: valid
status modified: 2016-06-08
accepted date: 2016-06-08
in scheme: List hosts the classification for the activities according to the Council Regulation 3037/90/EEC.

Agents involved in the sale of textiles clothing fur footwear and leather goods
type: Concept
notation: 46.16
definition: List hosts the classification for the activities according to the Council Regulation 3037 90 EEC
status: valid
status modified: 2016-06-08
accepted date: 2016-06-08
in scheme: List hosts the classification for the activities according to the Council Regulation 3037/90/EEC.

Agents involved in the sale of food beverages and tobacco
type: Concept
notation: 46.17
definition: List hosts the classification for the activities according to the Council Regulation 3037 90 EEC
status: valid
status modified: 2016-06-08
accepted date: 2016-06-08
in scheme: List hosts the classification for the activities according to the Council Regulation 3037/90/EEC.

Agents specialised in the sale of other particular products
type: Concept
notation: 46.18
definition: List hosts the classification for the activities according to the Council Regulation 3037 90 EEC
status: valid
status modified: 2016-06-08
accepted date: 2016-06-08
in scheme: List hosts the classification for the activities according to the Council Regulation 3037/90/EEC.

Agents involved in the sale of a variety of goods
type: Concept
notation: 46.19
definition: List hosts the classification for the activities according to the Council Regulation 3037 90 EEC
status: valid
status modified: 2016-06-08
accepted date: 2016-06-08
in scheme: List hosts the classification for the activities according to the Council Regulation 3037/90/EEC.

Wholesale of grain unmanufactured tobacco seeds and animal feeds
type: Concept
notation: 46.21
definition: List hosts the classification for the activities according to the Council Regulation 3037 90 EEC
status: valid
status modified: 2016-06-08
accepted date: 2016-06-08
in scheme: List hosts the classification for the activities according to the Council Regulation 3037/90/EEC.

Wholesale of flowers and plants
type: Concept
notation: 46.22
definition: List hosts the classification for the activities according to the Council Regulation 3037 90 EEC
status: valid
status modified: 2016-06-08
accepted date: 2016-06-08
in scheme: List hosts the classification for the activities according to the Council Regulation 3037/90/EEC.

Wholesale of live animals
type: Concept
notation: 46.23
definition: List hosts the classification for the activities according to the Council Regulation 3037 90 EEC
status: valid
status modified: 2016-06-08
accepted date: 2016-06-08
in scheme: List hosts the classification for the activities according to the Council Regulation 3037/90/EEC.

Wholesale of hides skins and leather
type: Concept
notation: 46.24
definition: List hosts the classification for the activities according to the Council Regulation 3037 90 EEC
status: valid
status modified: 2016-06-08
accepted date: 2016-06-08
in scheme: List hosts the classification for the activities according to the Council Regulation 3037/90/EEC.

Wholesale of fruit and vegetables
type: Concept
notation: 46.31
definition: List hosts the classification for the activities according to the Council Regulation 3037 90 EEC
status: valid
status modified: 2016-06-08
accepted date: 2016-06-08
in scheme: List hosts the classification for the activities according to the Council Regulation 3037/90/EEC.

Wholesale of meat and meat products
type: Concept
notation: 46.32
definition: List hosts the classification for the activities according to the Council Regulation 3037 90 EEC
status: valid
status modified: 2016-06-08
accepted date: 2016-06-08
in scheme: List hosts the classification for the activities according to the Council Regulation 3037/90/EEC.

Wholesale of dairy products eggs and edible oils and fats
type: Concept
notation: 46.33
definition: List hosts the classification for the activities according to the Council Regulation 3037 90 EEC
status: valid
status modified: 2016-06-08
accepted date: 2016-06-08
in scheme: List hosts the classification for the activities according to the Council Regulation 3037/90/EEC.

Wholesale of beverages
type: Concept
notation: 46.34
definition: List hosts the classification for the activities according to the Council Regulation 3037 90 EEC
status: valid
status modified: 2016-06-08
accepted date: 2016-06-08
in scheme: List hosts the classification for the activities according to the Council Regulation 3037/90/EEC.

Wholesale of tobacco products
type: Concept
notation: 46.35
definition: List hosts the classification for the activities according to the Council Regulation 3037 90 EEC
status: valid
status modified: 2016-06-08
accepted date: 2016-06-08
in scheme: List hosts the classification for the activities according to the Council Regulation 3037/90/EEC.

Wholesale of sugar and chocolate and sugar confectionery
type: Concept
notation: 46.36
definition: List hosts the classification for the activities according to the Council Regulation 3037 90 EEC
status: valid
status modified: 2016-06-08
accepted date: 2016-06-08
in scheme: List hosts the classification for the activities according to the Council Regulation 3037/90/EEC.

Wholesale of coffee tea cocoa and spices
type: Concept
notation: 46.37
definition: List hosts the classification for the activities according to the Council Regulation 3037 90 EEC
status: valid
status modified: 2016-06-08
accepted date: 2016-06-08
in scheme: List hosts the classification for the activities according to the Council Regulation 3037/90/EEC.

Wholesale of other food including fish crustaceans and molluscs
type: Concept
notation: 46.38
definition: List hosts the classification for the activities according to the Council Regulation 3037 90 EEC
status: valid
status modified: 2016-06-08
accepted date: 2016-06-08
in scheme: List hosts the classification for the activities according to the Council Regulation 3037/90/EEC.

Non-specialised wholesale of food beverages and tobacco
type: Concept
notation: 46.39
definition: List hosts the classification for the activities according to the Council Regulation 3037 90 EEC
status: valid
status modified: 2016-06-08
accepted date: 2016-06-08
in scheme: List hosts the classification for the activities according to the Council Regulation 3037/90/EEC.

Wholesale of textiles
type: Concept
notation: 46.41
definition: List hosts the classification for the activities according to the Council Regulation 3037 90 EEC
status: valid
status modified: 2016-06-08
accepted date: 2016-06-08
in scheme: List hosts the classification for the activities according to the Council Regulation 3037/90/EEC.

Wholesale of clothing and footwear
type: Concept
notation: 46.42
definition: List hosts the classification for the activities according to the Council Regulation 3037 90 EEC
status: valid
status modified: 2016-06-08
accepted date: 2016-06-08
in scheme: List hosts the classification for the activities according to the Council Regulation 3037/90/EEC.

Wholesale of electrical household appliances
type: Concept
notation: 46.43
definition: List hosts the classification for the activities according to the Council Regulation 3037 90 EEC
status: valid
status modified: 2016-06-08
accepted date: 2016-06-08
in scheme: List hosts the classification for the activities according to the Council Regulation 3037/90/EEC.

Wholesale of china and glassware and cleaning materials
type: Concept
notation: 46.44
definition: List hosts the classification for the activities according to the Council Regulation 3037 90 EEC
status: valid
status modified: 2016-06-08
accepted date: 2016-06-08
in scheme: List hosts the classification for the activities according to the Council Regulation 3037/90/EEC.

Wholesale of perfume and cosmetics
type: Concept
notation: 46.45
definition: List hosts the classification for the activities according to the Council Regulation 3037 90 EEC
status: valid
status modified: 2016-06-08
accepted date: 2016-06-08
in scheme: List hosts the classification for the activities according to the Council Regulation 3037/90/EEC.

Wholesale of pharmaceutical goods
type: Concept
notation: 46.46
definition: List hosts the classification for the activities according to the Council Regulation 3037 90 EEC
status: valid
status modified: 2016-06-08
accepted date: 2016-06-08
in scheme: List hosts the classification for the activities according to the Council Regulation 3037/90/EEC.

Wholesale of furniture carpets and lighting equipment
type: Concept
notation: 46.47
definition: List hosts the classification for the activities according to the Council Regulation 3037 90 EEC
status: valid
status modified: 2016-06-08
accepted date: 2016-06-08
in scheme: List hosts the classification for the activities according to the Council Regulation 3037/90/EEC.

Wholesale of watches and jewellery
type: Concept
notation: 46.48
definition: List hosts the classification for the activities according to the Council Regulation 3037 90 EEC
status: valid
status modified: 2016-06-08
accepted date: 2016-06-08
in scheme: List hosts the classification for the activities according to the Council Regulation 3037/90/EEC.

Wholesale of other household goods
type: Concept
notation: 46.49
definition: List hosts the classification for the activities according to the Council Regulation 3037 90 EEC
status: valid
status modified: 2016-06-08
accepted date: 2016-06-08
in scheme: List hosts the classification for the activities according to the Council Regulation 3037/90/EEC.

Wholesale of computers computer peripheral equipment and software
type: Concept
notation: 46.51
definition: List hosts the classification for the activities according to the Council Regulation 3037 90 EEC
status: valid
status modified: 2016-06-08
accepted date: 2016-06-08
in scheme: List hosts the classification for the activities according to the Council Regulation 3037/90/EEC.

Wholesale of electronic and telecommunications equipment and parts
type: Concept
notation: 46.52
definition: List hosts the classification for the activities according to the Council Regulation 3037 90 EEC
status: valid
status modified: 2016-06-08
accepted date: 2016-06-08
in scheme: List hosts the classification for the activities according to the Council Regulation 3037/90/EEC.

Wholesale of agricultural machinery equipment and supplies
type: Concept
notation: 46.61
definition: List hosts the classification for the activities according to the Council Regulation 3037 90 EEC
status: valid
status modified: 2016-06-08
accepted date: 2016-06-08
in scheme: List hosts the classification for the activities according to the Council Regulation 3037/90/EEC.

Wholesale of machine tools
type: Concept
notation: 46.62
definition: List hosts the classification for the activities according to the Council Regulation 3037 90 EEC
status: valid
status modified: 2016-06-08
accepted date: 2016-06-08
in scheme: List hosts the classification for the activities according to the Council Regulation 3037/90/EEC.

Wholesale of mining construction and civil engineering machinery
type: Concept
notation: 46.63
definition: List hosts the classification for the activities according to the Council Regulation 3037 90 EEC
status: valid
status modified: 2016-06-08
accepted date: 2016-06-08
in scheme: List hosts the classification for the activities according to the Council Regulation 3037/90/EEC.

Wholesale of machinery for the textile industry and of sewing and knitting machines
type: Concept
notation: 46.64
definition: List hosts the classification for the activities according to the Council Regulation 3037 90 EEC
status: valid
status modified: 2016-06-08
accepted date: 2016-06-08
in scheme: List hosts the classification for the activities according to the Council Regulation 3037/90/EEC.

Wholesale of office furniture
type: Concept
notation: 46.65
definition: List hosts the classification for the activities according to the Council Regulation 3037 90 EEC
status: valid
status modified: 2016-06-08
accepted date: 2016-06-08
in scheme: List hosts the classification for the activities according to the Council Regulation 3037/90/EEC.

Wholesale of other office machinery and equipment
type: Concept
notation: 46.66
definition: List hosts the classification for the activities according to the Council Regulation 3037 90 EEC
status: valid
status modified: 2016-06-08
accepted date: 2016-06-08
in scheme: List hosts the classification for the activities according to the Council Regulation 3037/90/EEC.

Wholesale of other machinery and equipment
type: Concept
notation: 46.69
definition: List hosts the classification for the activities according to the Council Regulation 3037 90 EEC
status: valid
status modified: 2016-06-08
accepted date: 2016-06-08
in scheme: List hosts the classification for the activities according to the Council Regulation 3037/90/EEC.

Wholesale of solid liquid and gaseous fuels and related products
type: Concept
notation: 46.71
definition: List hosts the classification for the activities according to the Council Regulation 3037 90 EEC
status: valid
status modified: 2016-06-08
accepted date: 2016-06-08
in scheme: List hosts the classification for the activities according to the Council Regulation 3037/90/EEC.

Wholesale of metals and metal ores
type: Concept
notation: 46.72
definition: List hosts the classification for the activities according to the Council Regulation 3037 90 EEC
status: valid
status modified: 2016-06-08
accepted date: 2016-06-08
in scheme: List hosts the classification for the activities according to the Council Regulation 3037/90/EEC.

Wholesale of wood construction materials and sanitary equipment
type: Concept
notation: 46.73
definition: List hosts the classification for the activities according to the Council Regulation 3037 90 EEC
status: valid
status modified: 2016-06-08
accepted date: 2016-06-08
in scheme: List hosts the classification for the activities according to the Council Regulation 3037/90/EEC.

Wholesale of hardware plumbing and heating equipment and supplies
type: Concept
notation: 46.74
definition: List hosts the classification for the activities according to the Council Regulation 3037 90 EEC
status: valid
status modified: 2016-06-08
accepted date: 2016-06-08
in scheme: List hosts the classification for the activities according to the Council Regulation 3037/90/EEC.

Wholesale of chemical products
type: Concept
notation: 46.75
definition: List hosts the classification for the activities according to the Council Regulation 3037 90 EEC
status: valid
status modified: 2016-06-08
accepted date: 2016-06-08
in scheme: List hosts the classification for the activities according to the Council Regulation 3037/90/EEC.

Wholesale of other intermediate products
type: Concept
notation: 46.76
definition: List hosts the classification for the activities according to the Council Regulation 3037 90 EEC
status: valid
status modified: 2016-06-08
accepted date: 2016-06-08
in scheme: List hosts the classification for the activities according to the Council Regulation 3037/90/EEC.

Wholesale of waste and scrap
type: Concept
notation: 46.77
definition: List hosts the classification for the activities according to the Council Regulation 3037 90 EEC
status: valid
status modified: 2016-06-08
accepted date: 2016-06-08
in scheme: List hosts the classification for the activities according to the Council Regulation 3037/90/EEC.

Non-specialised wholesale trade
type: Concept
notation: 46.90
definition: List hosts the classification for the activities according to the Council Regulation 3037 90 EEC
status: valid
status modified: 2016-06-08
accepted date: 2016-06-08
in scheme: List hosts the classification for the activities according to the Council Regulation 3037/90/EEC.

Retail sale in non-specialised stores with food beverages or tobacco predominating
type: Concept
notation: 47.11
definition: List hosts the classification for the activities according to the Council Regulation 3037 90 EEC
status: valid
status modified: 2016-06-08
accepted date: 2016-06-08
in scheme: List hosts the classification for the activities according to the Council Regulation 3037/90/EEC.

Other retail sale in non-specialised stores
type: Concept
notation: 47.19
definition: List hosts the classification for the activities according to the Council Regulation 3037 90 EEC
status: valid
status modified: 2016-06-08
accepted date: 2016-06-08
in scheme: List hosts the classification for the activities according to the Council Regulation 3037/90/EEC.

Retail sale of fruit and vegetables in specialised stores
type: Concept
notation: 47.21
definition: List hosts the classification for the activities according to the Council Regulation 3037 90 EEC
status: valid
status modified: 2016-06-08
accepted date: 2016-06-08
in scheme: List hosts the classification for the activities according to the Council Regulation 3037/90/EEC.

Retail sale of meat and meat products in specialised stores
type: Concept
notation: 47.22
definition: List hosts the classification for the activities according to the Council Regulation 3037 90 EEC
status: valid
status modified: 2016-06-08
accepted date: 2016-06-08
in scheme: List hosts the classification for the activities according to the Council Regulation 3037/90/EEC.

Retail sale of fish crustaceans and molluscs in specialised stores
type: Concept
notation: 47.23
definition: List hosts the classification for the activities according to the Council Regulation 3037 90 EEC
status: valid
status modified: 2016-06-08
accepted date: 2016-06-08
in scheme: List hosts the classification for the activities according to the Council Regulation 3037/90/EEC.

Retail sale of bread cakes flour confectionery and sugar confectionery in specialised stores
type: Concept
notation: 47.24
definition: List hosts the classification for the activities according to the Council Regulation 3037 90 EEC
status: valid
status modified: 2016-06-08
accepted date: 2016-06-08
in scheme: List hosts the classification for the activities according to the Council Regulation 3037/90/EEC.

Retail sale of beverages in specialised stores
type: Concept
notation: 47.25
definition: List hosts the classification for the activities according to the Council Regulation 3037 90 EEC
status: valid
status modified: 2016-06-08
accepted date: 2016-06-08
in scheme: List hosts the classification for the activities according to the Council Regulation 3037/90/EEC.

Retail sale of tobacco products in specialised stores
type: Concept
notation: 47.26
definition: List hosts the classification for the activities according to the Council Regulation 3037 90 EEC
status: valid
status modified: 2016-06-08
accepted date: 2016-06-08
in scheme: List hosts the classification for the activities according to the Council Regulation 3037/90/EEC.

Other retail sale of food in specialised stores
type: Concept
notation: 47.29
definition: List hosts the classification for the activities according to the Council Regulation 3037 90 EEC
status: valid
status modified: 2016-06-08
accepted date: 2016-06-08
in scheme: List hosts the classification for the activities according to the Council Regulation 3037/90/EEC.

Retail sale of automotive fuel in specialised stores
type: Concept
notation: 47.30
definition: List hosts the classification for the activities according to the Council Regulation 3037 90 EEC
status: valid
status modified: 2016-06-08
accepted date: 2016-06-08
in scheme: List hosts the classification for the activities according to the Council Regulation 3037/90/EEC.

Retail sale of computers peripheral units and software in specialised stores
type: Concept
notation: 47.41
definition: List hosts the classification for the activities according to the Council Regulation 3037 90 EEC
status: valid
status modified: 2016-06-08
accepted date: 2016-06-08
in scheme: List hosts the classification for the activities according to the Council Regulation 3037/90/EEC.

Retail sale of telecommunications equipment in specialised stores
type: Concept
notation: 47.42
definition: List hosts the classification for the activities according to the Council Regulation 3037 90 EEC
status: valid
status modified: 2016-06-08
accepted date: 2016-06-08
in scheme: List hosts the classification for the activities according to the Council Regulation 3037/90/EEC.

Retail sale of audio and video equipment in specialised stores
type: Concept
notation: 47.43
definition: List hosts the classification for the activities according to the Council Regulation 3037 90 EEC
status: valid
status modified: 2016-06-08
accepted date: 2016-06-08
in scheme: List hosts the classification for the activities according to the Council Regulation 3037/90/EEC.

Retail sale of textiles in specialised stores
type: Concept
notation: 47.51
definition: List hosts the classification for the activities according to the Council Regulation 3037 90 EEC
status: valid
status modified: 2016-06-08
accepted date: 2016-06-08
in scheme: List hosts the classification for the activities according to the Council Regulation 3037/90/EEC.

Retail sale of hardware paints and glass in specialised stores
type: Concept
notation: 47.52
definition: List hosts the classification for the activities according to the Council Regulation 3037 90 EEC
status: valid
status modified: 2016-06-08
accepted date: 2016-06-08
in scheme: List hosts the classification for the activities according to the Council Regulation 3037/90/EEC.

Retail sale of carpets rugs wall and floor coverings in specialised stores
type: Concept
notation: 47.53
definition: List hosts the classification for the activities according to the Council Regulation 3037 90 EEC
status: valid
status modified: 2016-06-08
accepted date: 2016-06-08
in scheme: List hosts the classification for the activities according to the Council Regulation 3037/90/EEC.

Retail sale of electrical household appliances in specialised stores
type: Concept
notation: 47.54
definition: List hosts the classification for the activities according to the Council Regulation 3037 90 EEC
status: valid
status modified: 2016-06-08
accepted date: 2016-06-08
in scheme: List hosts the classification for the activities according to the Council Regulation 3037/90/EEC.

Retail sale of furniture lighting equipment and other household articles in specialised stores
type: Concept
notation: 47.59
definition: List hosts the classification for the activities according to the Council Regulation 3037 90 EEC
status: valid
status modified: 2016-06-08
accepted date: 2016-06-08
in scheme: List hosts the classification for the activities according to the Council Regulation 3037/90/EEC.

Retail sale of books in specialised stores
type: Concept
notation: 47.61
definition: List hosts the classification for the activities according to the Council Regulation 3037 90 EEC
status: valid
status modified: 2016-06-08
accepted date: 2016-06-08
in scheme: List hosts the classification for the activities according to the Council Regulation 3037/90/EEC.

Retail sale of newspapers and stationery in specialised stores
type: Concept
notation: 47.62
definition: List hosts the classification for the activities according to the Council Regulation 3037 90 EEC
status: valid
status modified: 2016-06-08
accepted date: 2016-06-08
in scheme: List hosts the classification for the activities according to the Council Regulation 3037/90/EEC.

Retail sale of music and video recordings in specialised stores
type: Concept
notation: 47.63
definition: List hosts the classification for the activities according to the Council Regulation 3037 90 EEC
status: valid
status modified: 2016-06-08
accepted date: 2016-06-08
in scheme: List hosts the classification for the activities according to the Council Regulation 3037/90/EEC.

Retail sale of sporting equipment in specialised stores
type: Concept
notation: 47.64
definition: List hosts the classification for the activities according to the Council Regulation 3037 90 EEC
status: valid
status modified: 2016-06-08
accepted date: 2016-06-08
in scheme: List hosts the classification for the activities according to the Council Regulation 3037/90/EEC.

Retail sale of games and toys in specialised stores
type: Concept
notation: 47.65
definition: List hosts the classification for the activities according to the Council Regulation 3037 90 EEC
status: valid
status modified: 2016-06-08
accepted date: 2016-06-08
in scheme: List hosts the classification for the activities according to the Council Regulation 3037/90/EEC.

Retail sale of clothing in specialised stores
type: Concept
notation: 47.71
definition: List hosts the classification for the activities according to the Council Regulation 3037 90 EEC
status: valid
status modified: 2016-06-08
accepted date: 2016-06-08
in scheme: List hosts the classification for the activities according to the Council Regulation 3037/90/EEC.

Retail sale of footwear and leather goods in specialised stores
type: Concept
notation: 47.72
definition: List hosts the classification for the activities according to the Council Regulation 3037 90 EEC
status: valid
status modified: 2016-06-08
accepted date: 2016-06-08
in scheme: List hosts the classification for the activities according to the Council Regulation 3037/90/EEC.

Dispensing chemist in specialised stores
type: Concept
notation: 47.73
definition: List hosts the classification for the activities according to the Council Regulation 3037 90 EEC
status: valid
status modified: 2016-06-08
accepted date: 2016-06-08
in scheme: List hosts the classification for the activities according to the Council Regulation 3037/90/EEC.

Retail sale of medical and orthopaedic goods in specialised stores
type: Concept
notation: 47.74
definition: List hosts the classification for the activities according to the Council Regulation 3037 90 EEC
status: valid
status modified: 2016-06-08
accepted date: 2016-06-08
in scheme: List hosts the classification for the activities according to the Council Regulation 3037/90/EEC.

Retail sale of cosmetic and toilet articles in specialised stores
type: Concept
notation: 47.75
definition: List hosts the classification for the activities according to the Council Regulation 3037 90 EEC
status: valid
status modified: 2016-06-08
accepted date: 2016-06-08
in scheme: List hosts the classification for the activities according to the Council Regulation 3037/90/EEC.

Retail sale of flowers plants seeds fertilisers pet animals and pet food in specialised stores
type: Concept
notation: 47.76
definition: List hosts the classification for the activities according to the Council Regulation 3037 90 EEC
status: valid
status modified: 2016-06-08
accepted date: 2016-06-08
in scheme: List hosts the classification for the activities according to the Council Regulation 3037/90/EEC.

Retail sale of watches and jewellery in specialised stores
type: Concept
notation: 47.77
definition: List hosts the classification for the activities according to the Council Regulation 3037 90 EEC
status: valid
status modified: 2016-06-08
accepted date: 2016-06-08
in scheme: List hosts the classification for the activities according to the Council Regulation 3037/90/EEC.

Other retail sale of new goods in specialised stores
type: Concept
notation: 47.78
definition: List hosts the classification for the activities according to the Council Regulation 3037 90 EEC
status: valid
status modified: 2016-06-08
accepted date: 2016-06-08
in scheme: List hosts the classification for the activities according to the Council Regulation 3037/90/EEC.

Retail sale of second-hand goods in stores
type: Concept
notation: 47.79
definition: List hosts the classification for the activities according to the Council Regulation 3037 90 EEC
status: valid
status modified: 2016-06-08
accepted date: 2016-06-08
in scheme: List hosts the classification for the activities according to the Council Regulation 3037/90/EEC.

Retail sale via stalls and markets of food beverages and tobacco products
type: Concept
notation: 47.81
definition: List hosts the classification for the activities according to the Council Regulation 3037 90 EEC
status: valid
status modified: 2016-06-08
accepted date: 2016-06-08
in scheme: List hosts the classification for the activities according to the Council Regulation 3037/90/EEC.

Retail sale via stalls and markets of textiles clothing and footwear
type: Concept
notation: 47.82
definition: List hosts the classification for the activities according to the Council Regulation 3037 90 EEC
status: valid
status modified: 2016-06-08
accepted date: 2016-06-08
in scheme: List hosts the classification for the activities according to the Council Regulation 3037/90/EEC.

Retail sale via stalls and markets of other goods
type: Concept
notation: 47.89
definition: List hosts the classification for the activities according to the Council Regulation 3037 90 EEC
status: valid
status modified: 2016-06-08
accepted date: 2016-06-08
in scheme: List hosts the classification for the activities according to the Council Regulation 3037/90/EEC.

Retail sale via mail order houses or via Internet
type: Concept
notation: 47.91
definition: List hosts the classification for the activities according to the Council Regulation 3037 90 EEC
status: valid
status modified: 2016-06-08
accepted date: 2016-06-08
in scheme: List hosts the classification for the activities according to the Council Regulation 3037/90/EEC.

Other retail sale not in stores stalls or markets
type: Concept
notation: 47.99
definition: List hosts the classification for the activities according to the Council Regulation 3037 90 EEC
status: valid
status modified: 2016-06-08
accepted date: 2016-06-08
in scheme: List hosts the classification for the activities according to the Council Regulation 3037/90/EEC.

Passenger rail transport interurban
type: Concept
notation: 49.10
definition: List hosts the classification for the activities according to the Council Regulation 3037 90 EEC
status: valid
status modified: 2016-06-08
accepted date: 2016-06-08
in scheme: List hosts the classification for the activities according to the Council Regulation 3037/90/EEC.

Freight rail transport
type: Concept
notation: 49.20
definition: List hosts the classification for the activities according to the Council Regulation 3037 90 EEC
status: valid
status modified: 2016-06-08
accepted date: 2016-06-08
in scheme: List hosts the classification for the activities according to the Council Regulation 3037/90/EEC.

Urban and suburban passenger land transport
type: Concept
notation: 49.31
definition: List hosts the classification for the activities according to the Council Regulation 3037 90 EEC
status: valid
status modified: 2016-06-08
accepted date: 2016-06-08
in scheme: List hosts the classification for the activities according to the Council Regulation 3037/90/EEC.

Taxi operation
type: Concept
notation: 49.32
definition: List hosts the classification for the activities according to the Council Regulation 3037 90 EEC
status: valid
status modified: 2016-06-08
accepted date: 2016-06-08
in scheme: List hosts the classification for the activities according to the Council Regulation 3037/90/EEC.

Other passenger land transport n e c
type: Concept
notation: 49.39
definition: List hosts the classification for the activities according to the Council Regulation 3037 90 EEC
status: valid
status modified: 2016-06-08
accepted date: 2016-06-08
in scheme: List hosts the classification for the activities according to the Council Regulation 3037/90/EEC.

Freight transport by road
type: Concept
notation: 49.41
definition: List hosts the classification for the activities according to the Council Regulation 3037 90 EEC
status: valid
status modified: 2016-06-08
accepted date: 2016-06-08
in scheme: List hosts the classification for the activities according to the Council Regulation 3037/90/EEC.

Removal services
type: Concept
notation: 49.42
definition: List hosts the classification for the activities according to the Council Regulation 3037 90 EEC
status: valid
status modified: 2016-06-08
accepted date: 2016-06-08
in scheme: List hosts the classification for the activities according to the Council Regulation 3037/90/EEC.

Transport via pipeline
type: Concept
notation: 49.50
definition: List hosts the classification for the activities according to the Council Regulation 3037 90 EEC
status: valid
status modified: 2016-06-08
accepted date: 2016-06-08
in scheme: List hosts the classification for the activities according to the Council Regulation 3037/90/EEC.

Sea and coastal passenger water transport
type: Concept
notation: 50.10
definition: List hosts the classification for the activities according to the Council Regulation 3037 90 EEC
status: valid
status modified: 2016-06-08
accepted date: 2016-06-08
in scheme: List hosts the classification for the activities according to the Council Regulation 3037/90/EEC.

Sea and coastal freight water transport
type: Concept
notation: 50.20
definition: List hosts the classification for the activities according to the Council Regulation 3037 90 EEC
status: valid
status modified: 2016-06-08
accepted date: 2016-06-08
in scheme: List hosts the classification for the activities according to the Council Regulation 3037/90/EEC.

Inland passenger water transport
type: Concept
notation: 50.30
definition: List hosts the classification for the activities according to the Council Regulation 3037 90 EEC
status: valid
status modified: 2016-06-08
accepted date: 2016-06-08
in scheme: List hosts the classification for the activities according to the Council Regulation 3037/90/EEC.

Inland freight water transport
type: Concept
notation: 50.40
definition: List hosts the classification for the activities according to the Council Regulation 3037 90 EEC
status: valid
status modified: 2016-06-08
accepted date: 2016-06-08
in scheme: List hosts the classification for the activities according to the Council Regulation 3037/90/EEC.

Passenger air transport
type: Concept
notation: 51.10
definition: List hosts the classification for the activities according to the Council Regulation 3037 90 EEC
status: valid
status modified: 2016-06-08
accepted date: 2016-06-08
in scheme: List hosts the classification for the activities according to the Council Regulation 3037/90/EEC.

Freight air transport
type: Concept
notation: 51.21
definition: List hosts the classification for the activities according to the Council Regulation 3037 90 EEC
status: valid
status modified: 2016-06-08
accepted date: 2016-06-08
in scheme: List hosts the classification for the activities according to the Council Regulation 3037/90/EEC.

Space transport
type: Concept
notation: 51.22
definition: List hosts the classification for the activities according to the Council Regulation 3037 90 EEC
status: valid
status modified: 2016-06-08
accepted date: 2016-06-08
in scheme: List hosts the classification for the activities according to the Council Regulation 3037/90/EEC.

Warehousing and storage
type: Concept
notation: 52.10
definition: List hosts the classification for the activities according to the Council Regulation 3037 90 EEC
status: valid
status modified: 2016-06-08
accepted date: 2016-06-08
in scheme: List hosts the classification for the activities according to the Council Regulation 3037/90/EEC.

Service activities incidental to land transportation
type: Concept
notation: 52.21
definition: List hosts the classification for the activities according to the Council Regulation 3037 90 EEC
status: valid
status modified: 2016-06-08
accepted date: 2016-06-08
in scheme: List hosts the classification for the activities according to the Council Regulation 3037/90/EEC.

Service activities incidental to water transportation
type: Concept
notation: 52.22
definition: List hosts the classification for the activities according to the Council Regulation 3037 90 EEC
status: valid
status modified: 2016-06-08
accepted date: 2016-06-08
in scheme: List hosts the classification for the activities according to the Council Regulation 3037/90/EEC.

Service activities incidental to air transportation
type: Concept
notation: 52.23
definition: List hosts the classification for the activities according to the Council Regulation 3037 90 EEC
status: valid
status modified: 2016-06-08
accepted date: 2016-06-08
in scheme: List hosts the classification for the activities according to the Council Regulation 3037/90/EEC.

Cargo handling
type: Concept
notation: 52.24
definition: List hosts the classification for the activities according to the Council Regulation 3037 90 EEC
status: valid
status modified: 2016-06-08
accepted date: 2016-06-08
in scheme: List hosts the classification for the activities according to the Council Regulation 3037/90/EEC.

Other transportation support activities
type: Concept
notation: 52.29
definition: List hosts the classification for the activities according to the Council Regulation 3037 90 EEC
status: valid
status modified: 2016-06-08
accepted date: 2016-06-08
in scheme: List hosts the classification for the activities according to the Council Regulation 3037/90/EEC.

Postal activities under universal service obligation
type: Concept
notation: 53.10
definition: List hosts the classification for the activities according to the Council Regulation 3037 90 EEC
status: valid
status modified: 2016-06-08
accepted date: 2016-06-08
in scheme: List hosts the classification for the activities according to the Council Regulation 3037/90/EEC.

Other postal and courier activities
type: Concept
notation: 53.20
definition: List hosts the classification for the activities according to the Council Regulation 3037 90 EEC
status: valid
status modified: 2016-06-08
accepted date: 2016-06-08
in scheme: List hosts the classification for the activities according to the Council Regulation 3037/90/EEC.

Hotels and similar accommodation
type: Concept
notation: 55.10
definition: List hosts the classification for the activities according to the Council Regulation 3037 90 EEC
status: valid
status modified: 2016-06-08
accepted date: 2016-06-08
in scheme: List hosts the classification for the activities according to the Council Regulation 3037/90/EEC.

Holiday and other short-stay accommodation
type: Concept
notation: 55.20
definition: List hosts the classification for the activities according to the Council Regulation 3037 90 EEC
status: valid
status modified: 2016-06-08
accepted date: 2016-06-08
in scheme: List hosts the classification for the activities according to the Council Regulation 3037/90/EEC.

Camping grounds recreational vehicle parks and trailer parks
type: Concept
notation: 55.30
definition: List hosts the classification for the activities according to the Council Regulation 3037 90 EEC
status: valid
status modified: 2016-06-08
accepted date: 2016-06-08
in scheme: List hosts the classification for the activities according to the Council Regulation 3037/90/EEC.

Other accommodation
type: Concept
notation: 55.90
definition: List hosts the classification for the activities according to the Council Regulation 3037 90 EEC
status: valid
status modified: 2016-06-08
accepted date: 2016-06-08
in scheme: List hosts the classification for the activities according to the Council Regulation 3037/90/EEC.

Restaurants and mobile food service activities
type: Concept
notation: 56.10
definition: List hosts the classification for the activities according to the Council Regulation 3037 90 EEC
status: valid
status modified: 2016-06-08
accepted date: 2016-06-08
in scheme: List hosts the classification for the activities according to the Council Regulation 3037/90/EEC.

Event catering activities
type: Concept
notation: 56.21
definition: List hosts the classification for the activities according to the Council Regulation 3037 90 EEC
status: valid
status modified: 2016-06-08
accepted date: 2016-06-08
in scheme: List hosts the classification for the activities according to the Council Regulation 3037/90/EEC.

Other food service activities
type: Concept
notation: 56.29
definition: List hosts the classification for the activities according to the Council Regulation 3037 90 EEC
status: valid
status modified: 2016-06-08
accepted date: 2016-06-08
in scheme: List hosts the classification for the activities according to the Council Regulation 3037/90/EEC.

Beverage serving activities
type: Concept
notation: 56.30
definition: List hosts the classification for the activities according to the Council Regulation 3037 90 EEC
status: valid
status modified: 2016-06-08
accepted date: 2016-06-08
in scheme: List hosts the classification for the activities according to the Council Regulation 3037/90/EEC.

Book publishing
type: Concept
notation: 58.11
definition: List hosts the classification for the activities according to the Council Regulation 3037 90 EEC
status: valid
status modified: 2016-06-08
accepted date: 2016-06-08
in scheme: List hosts the classification for the activities according to the Council Regulation 3037/90/EEC.

Publishing of directories and mailing lists
type: Concept
notation: 58.12
definition: List hosts the classification for the activities according to the Council Regulation 3037 90 EEC
status: valid
status modified: 2016-06-08
accepted date: 2016-06-08
in scheme: List hosts the classification for the activities according to the Council Regulation 3037/90/EEC.

Publishing of newspapers
type: Concept
notation: 58.13
definition: List hosts the classification for the activities according to the Council Regulation 3037 90 EEC
status: valid
status modified: 2016-06-08
accepted date: 2016-06-08
in scheme: List hosts the classification for the activities according to the Council Regulation 3037/90/EEC.

Publishing of journals and periodicals
type: Concept
notation: 58.14
definition: List hosts the classification for the activities according to the Council Regulation 3037 90 EEC
status: valid
status modified: 2016-06-08
accepted date: 2016-06-08
in scheme: List hosts the classification for the activities according to the Council Regulation 3037/90/EEC.

Other publishing activities
type: Concept
notation: 58.19
definition: List hosts the classification for the activities according to the Council Regulation 3037 90 EEC
status: valid
status modified: 2016-06-08
accepted date: 2016-06-08
in scheme: List hosts the classification for the activities according to the Council Regulation 3037/90/EEC.

Publishing of computer games
type: Concept
notation: 58.21
definition: List hosts the classification for the activities according to the Council Regulation 3037 90 EEC
status: valid
status modified: 2016-06-08
accepted date: 2016-06-08
in scheme: List hosts the classification for the activities according to the Council Regulation 3037/90/EEC.

Other software publishing
type: Concept
notation: 58.29
definition: List hosts the classification for the activities according to the Council Regulation 3037 90 EEC
status: valid
status modified: 2016-06-08
accepted date: 2016-06-08
in scheme: List hosts the classification for the activities according to the Council Regulation 3037/90/EEC.

Motion picture video and television programme production activities
type: Concept
notation: 59.11
definition: List hosts the classification for the activities according to the Council Regulation 3037 90 EEC
status: valid
status modified: 2016-06-08
accepted date: 2016-06-08
in scheme: List hosts the classification for the activities according to the Council Regulation 3037/90/EEC.

Motion picture video and television programme post-production activities
type: Concept
notation: 59.12
definition: List hosts the classification for the activities according to the Council Regulation 3037 90 EEC
status: valid
status modified: 2016-06-08
accepted date: 2016-06-08
in scheme: List hosts the classification for the activities according to the Council Regulation 3037/90/EEC.

Motion picture video and television programme distribution activities
type: Concept
notation: 59.13
definition: List hosts the classification for the activities according to the Council Regulation 3037 90 EEC
status: valid
status modified: 2016-06-08
accepted date: 2016-06-08
in scheme: List hosts the classification for the activities according to the Council Regulation 3037/90/EEC.

Motion picture projection activities
type: Concept
notation: 59.14
definition: List hosts the classification for the activities according to the Council Regulation 3037 90 EEC
status: valid
status modified: 2016-06-08
accepted date: 2016-06-08
in scheme: List hosts the classification for the activities according to the Council Regulation 3037/90/EEC.

Sound recording and music publishing activities
type: Concept
notation: 59.20
definition: List hosts the classification for the activities according to the Council Regulation 3037 90 EEC
status: valid
status modified: 2016-06-08
accepted date: 2016-06-08
in scheme: List hosts the classification for the activities according to the Council Regulation 3037/90/EEC.

Radio broadcasting
type: Concept
notation: 60.10
definition: List hosts the classification for the activities according to the Council Regulation 3037 90 EEC
status: valid
status modified: 2016-06-08
accepted date: 2016-06-08
in scheme: List hosts the classification for the activities according to the Council Regulation 3037/90/EEC.

Television programming and broadcasting activities
type: Concept
notation: 60.20
definition: List hosts the classification for the activities according to the Council Regulation 3037 90 EEC
status: valid
status modified: 2016-06-08
accepted date: 2016-06-08
in scheme: List hosts the classification for the activities according to the Council Regulation 3037/90/EEC.

Wired telecommunications activities
type: Concept
notation: 61.10
definition: List hosts the classification for the activities according to the Council Regulation 3037 90 EEC
status: valid
status modified: 2016-06-08
accepted date: 2016-06-08
in scheme: List hosts the classification for the activities according to the Council Regulation 3037/90/EEC.

Wireless telecommunications activities
type: Concept
notation: 61.20
definition: List hosts the classification for the activities according to the Council Regulation 3037 90 EEC
status: valid
status modified: 2016-06-08
accepted date: 2016-06-08
in scheme: List hosts the classification for the activities according to the Council Regulation 3037/90/EEC.

Satellite telecommunications activities
type: Concept
notation: 61.30
definition: List hosts the classification for the activities according to the Council Regulation 3037 90 EEC
status: valid
status modified: 2016-06-08
accepted date: 2016-06-08
in scheme: List hosts the classification for the activities according to the Council Regulation 3037/90/EEC.

Other telecommunications activities
type: Concept
notation: 61.90
definition: List hosts the classification for the activities according to the Council Regulation 3037 90 EEC
status: valid
status modified: 2016-06-08
accepted date: 2016-06-08
in scheme: List hosts the classification for the activities according to the Council Regulation 3037/90/EEC.

Computer programming activities
type: Concept
notation: 62.01
definition: List hosts the classification for the activities according to the Council Regulation 3037 90 EEC
status: valid
status modified: 2016-06-08
accepted date: 2016-06-08
in scheme: List hosts the classification for the activities according to the Council Regulation 3037/90/EEC.

Computer consultancy activities
type: Concept
notation: 62.02
definition: List hosts the classification for the activities according to the Council Regulation 3037 90 EEC
status: valid
status modified: 2016-06-08
accepted date: 2016-06-08
in scheme: List hosts the classification for the activities according to the Council Regulation 3037/90/EEC.

Computer facilities management activities
type: Concept
notation: 62.03
definition: List hosts the classification for the activities according to the Council Regulation 3037 90 EEC
status: valid
status modified: 2016-06-08
accepted date: 2016-06-08
in scheme: List hosts the classification for the activities according to the Council Regulation 3037/90/EEC.

Other information technology and computer service activities
type: Concept
notation: 62.09
definition: List hosts the classification for the activities according to the Council Regulation 3037 90 EEC
status: valid
status modified: 2016-06-08
accepted date: 2016-06-08
in scheme: List hosts the classification for the activities according to the Council Regulation 3037/90/EEC.

Data processing hosting and related activities
type: Concept
notation: 63.11
definition: List hosts the classification for the activities according to the Council Regulation 3037 90 EEC
status: valid
status modified: 2016-06-08
accepted date: 2016-06-08
in scheme: List hosts the classification for the activities according to the Council Regulation 3037/90/EEC.

Web portals
type: Concept
notation: 63.12
definition: List hosts the classification for the activities according to the Council Regulation 3037 90 EEC
status: valid
status modified: 2016-06-08
accepted date: 2016-06-08
in scheme: List hosts the classification for the activities according to the Council Regulation 3037/90/EEC.

News agency activities
type: Concept
notation: 63.91
definition: List hosts the classification for the activities according to the Council Regulation 3037 90 EEC
status: valid
status modified: 2016-06-08
accepted date: 2016-06-08
in scheme: List hosts the classification for the activities according to the Council Regulation 3037/90/EEC.

Other information service activities n e c
type: Concept
notation: 63.99
definition: List hosts the classification for the activities according to the Council Regulation 3037 90 EEC
status: valid
status modified: 2016-06-08
accepted date: 2016-06-08
in scheme: List hosts the classification for the activities according to the Council Regulation 3037/90/EEC.

Central banking
type: Concept
notation: 64.11
definition: List hosts the classification for the activities according to the Council Regulation 3037 90 EEC
status: valid
status modified: 2016-06-08
accepted date: 2016-06-08
in scheme: List hosts the classification for the activities according to the Council Regulation 3037/90/EEC.

Other monetary intermediation
type: Concept
notation: 64.19
definition: List hosts the classification for the activities according to the Council Regulation 3037 90 EEC
status: valid
status modified: 2016-06-08
accepted date: 2016-06-08
in scheme: List hosts the classification for the activities according to the Council Regulation 3037/90/EEC.

Activities of holding companies
type: Concept
notation: 64.20
definition: List hosts the classification for the activities according to the Council Regulation 3037 90 EEC
status: valid
status modified: 2016-06-08
accepted date: 2016-06-08
in scheme: List hosts the classification for the activities according to the Council Regulation 3037/90/EEC.

Trusts funds and similar financial entities
type: Concept
notation: 64.30
definition: List hosts the classification for the activities according to the Council Regulation 3037 90 EEC
status: valid
status modified: 2016-06-08
accepted date: 2016-06-08
in scheme: List hosts the classification for the activities according to the Council Regulation 3037/90/EEC.

Financial leasing
type: Concept
notation: 64.91
definition: List hosts the classification for the activities according to the Council Regulation 3037 90 EEC
status: valid
status modified: 2016-06-08
accepted date: 2016-06-08
in scheme: List hosts the classification for the activities according to the Council Regulation 3037/90/EEC.

Other credit granting
type: Concept
notation: 64.92
definition: List hosts the classification for the activities according to the Council Regulation 3037 90 EEC
status: valid
status modified: 2016-06-08
accepted date: 2016-06-08
in scheme: List hosts the classification for the activities according to the Council Regulation 3037/90/EEC.

Other financial service activities except insurance and pension funding n e c
type: Concept
notation: 64.99
definition: List hosts the classification for the activities according to the Council Regulation 3037 90 EEC
status: valid
status modified: 2016-06-08
accepted date: 2016-06-08
in scheme: List hosts the classification for the activities according to the Council Regulation 3037/90/EEC.

Life insurance
type: Concept
notation: 65.11
definition: List hosts the classification for the activities according to the Council Regulation 3037 90 EEC
status: valid
status modified: 2016-06-08
accepted date: 2016-06-08
in scheme: List hosts the classification for the activities according to the Council Regulation 3037/90/EEC.

Non-life insurance
type: Concept
notation: 65.12
definition: List hosts the classification for the activities according to the Council Regulation 3037 90 EEC
status: valid
status modified: 2016-06-08
accepted date: 2016-06-08
in scheme: List hosts the classification for the activities according to the Council Regulation 3037/90/EEC.

Reinsurance
type: Concept
notation: 65.20
definition: List hosts the classification for the activities according to the Council Regulation 3037 90 EEC
status: valid
status modified: 2016-06-08
accepted date: 2016-06-08
in scheme: List hosts the classification for the activities according to the Council Regulation 3037/90/EEC.

Pension funding
type: Concept
notation: 65.30
definition: List hosts the classification for the activities according to the Council Regulation 3037 90 EEC
status: valid
status modified: 2016-06-08
accepted date: 2016-06-08
in scheme: List hosts the classification for the activities according to the Council Regulation 3037/90/EEC.

Administration of financial markets
type: Concept
notation: 66.11
definition: List hosts the classification for the activities according to the Council Regulation 3037 90 EEC
status: valid
status modified: 2016-06-08
accepted date: 2016-06-08
in scheme: List hosts the classification for the activities according to the Council Regulation 3037/90/EEC.

Security and commodity contracts brokerage
type: Concept
notation: 66.12
definition: List hosts the classification for the activities according to the Council Regulation 3037 90 EEC
status: valid
status modified: 2016-06-08
accepted date: 2016-06-08
in scheme: List hosts the classification for the activities according to the Council Regulation 3037/90/EEC.

Other activities auxiliary to financial services except insurance and pension funding
type: Concept
notation: 66.19
definition: List hosts the classification for the activities according to the Council Regulation 3037 90 EEC
status: valid
status modified: 2016-06-08
accepted date: 2016-06-08
in scheme: List hosts the classification for the activities according to the Council Regulation 3037/90/EEC.

Risk and damage evaluation
type: Concept
notation: 66.21
definition: List hosts the classification for the activities according to the Council Regulation 3037 90 EEC
status: valid
status modified: 2016-06-08
accepted date: 2016-06-08
in scheme: List hosts the classification for the activities according to the Council Regulation 3037/90/EEC.

Activities of insurance agents and brokers
type: Concept
notation: 66.22
definition: List hosts the classification for the activities according to the Council Regulation 3037 90 EEC
status: valid
status modified: 2016-06-08
accepted date: 2016-06-08
in scheme: List hosts the classification for the activities according to the Council Regulation 3037/90/EEC.

Other activities auxiliary to insurance and pension funding
type: Concept
notation: 66.29
definition: List hosts the classification for the activities according to the Council Regulation 3037 90 EEC
status: valid
status modified: 2016-06-08
accepted date: 2016-06-08
in scheme: List hosts the classification for the activities according to the Council Regulation 3037/90/EEC.

Fund management activities
type: Concept
notation: 66.30
definition: List hosts the classification for the activities according to the Council Regulation 3037 90 EEC
status: valid
status modified: 2016-06-08
accepted date: 2016-06-08
in scheme: List hosts the classification for the activities according to the Council Regulation 3037/90/EEC.

Buying and selling of own real estate
type: Concept
notation: 68.10
definition: List hosts the classification for the activities according to the Council Regulation 3037 90 EEC
status: valid
status modified: 2016-06-08
accepted date: 2016-06-08
in scheme: List hosts the classification for the activities according to the Council Regulation 3037/90/EEC.

Renting and operating of own or leased real estate
type: Concept
notation: 68.20
definition: List hosts the classification for the activities according to the Council Regulation 3037 90 EEC
status: valid
status modified: 2016-06-08
accepted date: 2016-06-08
in scheme: List hosts the classification for the activities according to the Council Regulation 3037/90/EEC.

Real estate agencies
type: Concept
notation: 68.31
definition: List hosts the classification for the activities according to the Council Regulation 3037 90 EEC
status: valid
status modified: 2016-06-08
accepted date: 2016-06-08
in scheme: List hosts the classification for the activities according to the Council Regulation 3037/90/EEC.

Management of real estate on a fee or contract basis
type: Concept
notation: 68.32
definition: List hosts the classification for the activities according to the Council Regulation 3037 90 EEC
status: valid
status modified: 2016-06-08
accepted date: 2016-06-08
in scheme: List hosts the classification for the activities according to the Council Regulation 3037/90/EEC.

Legal activities
type: Concept
notation: 69.10
definition: List hosts the classification for the activities according to the Council Regulation 3037 90 EEC
status: valid
status modified: 2016-06-08
accepted date: 2016-06-08
in scheme: List hosts the classification for the activities according to the Council Regulation 3037/90/EEC.

Accounting bookkeeping and auditing activities tax consultancy
type: Concept
notation: 69.20
definition: List hosts the classification for the activities according to the Council Regulation 3037 90 EEC
status: valid
status modified: 2016-06-08
accepted date: 2016-06-08
in scheme: List hosts the classification for the activities according to the Council Regulation 3037/90/EEC.

Activities of head offices
type: Concept
notation: 70.10
definition: List hosts the classification for the activities according to the Council Regulation 3037 90 EEC
status: valid
status modified: 2016-06-08
accepted date: 2016-06-08
in scheme: List hosts the classification for the activities according to the Council Regulation 3037/90/EEC.

Public relations and communication activities
type: Concept
notation: 70.21
definition: List hosts the classification for the activities according to the Council Regulation 3037 90 EEC
status: valid
status modified: 2016-06-08
accepted date: 2016-06-08
in scheme: List hosts the classification for the activities according to the Council Regulation 3037/90/EEC.

Business and other management consultancy activities
type: Concept
notation: 70.22
definition: List hosts the classification for the activities according to the Council Regulation 3037 90 EEC
status: valid
status modified: 2016-06-08
accepted date: 2016-06-08
in scheme: List hosts the classification for the activities according to the Council Regulation 3037/90/EEC.

Architectural activities
type: Concept
notation: 71.11
definition: List hosts the classification for the activities according to the Council Regulation 3037 90 EEC
status: valid
status modified: 2016-06-08
accepted date: 2016-06-08
in scheme: List hosts the classification for the activities according to the Council Regulation 3037/90/EEC.

Engineering activities and related technical consultancy
type: Concept
notation: 71.12
definition: List hosts the classification for the activities according to the Council Regulation 3037 90 EEC
status: valid
status modified: 2016-06-08
accepted date: 2016-06-08
in scheme: List hosts the classification for the activities according to the Council Regulation 3037/90/EEC.

Technical testing and analysis
type: Concept
notation: 71.20
definition: List hosts the classification for the activities according to the Council Regulation 3037 90 EEC
status: valid
status modified: 2016-06-08
accepted date: 2016-06-08
in scheme: List hosts the classification for the activities according to the Council Regulation 3037/90/EEC.

Research and experimental development on biotechnology
type: Concept
notation: 72.11
definition: List hosts the classification for the activities according to the Council Regulation 3037 90 EEC
status: valid
status modified: 2016-06-08
accepted date: 2016-06-08
in scheme: List hosts the classification for the activities according to the Council Regulation 3037/90/EEC.

Other research and experimental development on natural sciences and engineering
type: Concept
notation: 72.19
definition: List hosts the classification for the activities according to the Council Regulation 3037 90 EEC
status: valid
status modified: 2016-06-08
accepted date: 2016-06-08
in scheme: List hosts the classification for the activities according to the Council Regulation 3037/90/EEC.

Research and experimental development on social sciences and humanities
type: Concept
notation: 72.20
definition: List hosts the classification for the activities according to the Council Regulation 3037 90 EEC
status: valid
status modified: 2016-06-08
accepted date: 2016-06-08
in scheme: List hosts the classification for the activities according to the Council Regulation 3037/90/EEC.

Advertising agencies
type: Concept
notation: 73.11
definition: List hosts the classification for the activities according to the Council Regulation 3037 90 EEC
status: valid
status modified: 2016-06-08
accepted date: 2016-06-08
in scheme: List hosts the classification for the activities according to the Council Regulation 3037/90/EEC.

Media representation
type: Concept
notation: 73.12
definition: List hosts the classification for the activities according to the Council Regulation 3037 90 EEC
status: valid
status modified: 2016-06-08
accepted date: 2016-06-08
in scheme: List hosts the classification for the activities according to the Council Regulation 3037/90/EEC.

Market research and public opinion polling
type: Concept
notation: 73.20
definition: List hosts the classification for the activities according to the Council Regulation 3037 90 EEC
status: valid
status modified: 2016-06-08
accepted date: 2016-06-08
in scheme: List hosts the classification for the activities according to the Council Regulation 3037/90/EEC.

Specialised design activities
type: Concept
notation: 74.10
definition: List hosts the classification for the activities according to the Council Regulation 3037 90 EEC
status: valid
status modified: 2016-06-08
accepted date: 2016-06-08
in scheme: List hosts the classification for the activities according to the Council Regulation 3037/90/EEC.

Photographic activities
type: Concept
notation: 74.20
definition: List hosts the classification for the activities according to the Council Regulation 3037 90 EEC
status: valid
status modified: 2016-06-08
accepted date: 2016-06-08
in scheme: List hosts the classification for the activities according to the Council Regulation 3037/90/EEC.

Translation and interpretation activities
type: Concept
notation: 74.30
definition: List hosts the classification for the activities according to the Council Regulation 3037 90 EEC
status: valid
status modified: 2016-06-08
accepted date: 2016-06-08
in scheme: List hosts the classification for the activities according to the Council Regulation 3037/90/EEC.

Other professional scientific and technical activities n e c
type: Concept
notation: 74.90
definition: List hosts the classification for the activities according to the Council Regulation 3037 90 EEC
status: valid
status modified: 2016-06-08
accepted date: 2016-06-08
in scheme: List hosts the classification for the activities according to the Council Regulation 3037/90/EEC.

Veterinary activities
type: Concept
notation: 75.00
definition: List hosts the classification for the activities according to the Council Regulation 3037 90 EEC
status: valid
status modified: 2016-06-08
accepted date: 2016-06-08
in scheme: List hosts the classification for the activities according to the Council Regulation 3037/90/EEC.

Renting and leasing of cars and light motor vehicles
type: Concept
notation: 77.11
definition: List hosts the classification for the activities according to the Council Regulation 3037 90 EEC
status: valid
status modified: 2016-06-08
accepted date: 2016-06-08
in scheme: List hosts the classification for the activities according to the Council Regulation 3037/90/EEC.

Renting and leasing of trucks
type: Concept
notation: 77.12
definition: List hosts the classification for the activities according to the Council Regulation 3037 90 EEC
status: valid
status modified: 2016-06-08
accepted date: 2016-06-08
in scheme: List hosts the classification for the activities according to the Council Regulation 3037/90/EEC.

Renting and leasing of recreational and sports goods
type: Concept
notation: 77.21
definition: List hosts the classification for the activities according to the Council Regulation 3037 90 EEC
status: valid
status modified: 2016-06-08
accepted date: 2016-06-08
in scheme: List hosts the classification for the activities according to the Council Regulation 3037/90/EEC.

Renting of video tapes and disks
type: Concept
notation: 77.22
definition: List hosts the classification for the activities according to the Council Regulation 3037 90 EEC
status: valid
status modified: 2016-06-08
accepted date: 2016-06-08
in scheme: List hosts the classification for the activities according to the Council Regulation 3037/90/EEC.

Renting and leasing of other personal and household goods
type: Concept
notation: 77.29
definition: List hosts the classification for the activities according to the Council Regulation 3037 90 EEC
status: valid
status modified: 2016-06-08
accepted date: 2016-06-08
in scheme: List hosts the classification for the activities according to the Council Regulation 3037/90/EEC.

Renting and leasing of agricultural machinery and equipment
type: Concept
notation: 77.31
definition: List hosts the classification for the activities according to the Council Regulation 3037 90 EEC
status: valid
status modified: 2016-06-08
accepted date: 2016-06-08
in scheme: List hosts the classification for the activities according to the Council Regulation 3037/90/EEC.

Renting and leasing of construction and civil engineering machinery and equipment
type: Concept
notation: 77.32
definition: List hosts the classification for the activities according to the Council Regulation 3037 90 EEC
status: valid
status modified: 2016-06-08
accepted date: 2016-06-08
in scheme: List hosts the classification for the activities according to the Council Regulation 3037/90/EEC.

Renting and leasing of office machinery and equipment including computers
type: Concept
notation: 77.33
definition: List hosts the classification for the activities according to the Council Regulation 3037 90 EEC
status: valid
status modified: 2016-06-08
accepted date: 2016-06-08
in scheme: List hosts the classification for the activities according to the Council Regulation 3037/90/EEC.

Renting and leasing of water transport equipment
type: Concept
notation: 77.34
definition: List hosts the classification for the activities according to the Council Regulation 3037 90 EEC
status: valid
status modified: 2016-06-08
accepted date: 2016-06-08
in scheme: List hosts the classification for the activities according to the Council Regulation 3037/90/EEC.

Renting and leasing of air transport equipment
type: Concept
notation: 77.35
definition: List hosts the classification for the activities according to the Council Regulation 3037 90 EEC
status: valid
status modified: 2016-06-08
accepted date: 2016-06-08
in scheme: List hosts the classification for the activities according to the Council Regulation 3037/90/EEC.

Renting and leasing of other machinery equipment and tangible goods n e c
type: Concept
notation: 77.39
definition: List hosts the classification for the activities according to the Council Regulation 3037 90 EEC
status: valid
status modified: 2016-06-08
accepted date: 2016-06-08
in scheme: List hosts the classification for the activities according to the Council Regulation 3037/90/EEC.

Leasing of intellectual property and similar products except copyrighted works
type: Concept
notation: 77.40
definition: List hosts the classification for the activities according to the Council Regulation 3037 90 EEC
status: valid
status modified: 2016-06-08
accepted date: 2016-06-08
in scheme: List hosts the classification for the activities according to the Council Regulation 3037/90/EEC.

Activities of employment placement agencies
type: Concept
notation: 78.10
definition: List hosts the classification for the activities according to the Council Regulation 3037 90 EEC
status: valid
status modified: 2016-06-08
accepted date: 2016-06-08
in scheme: List hosts the classification for the activities according to the Council Regulation 3037/90/EEC.

Temporary employment agency activities
type: Concept
notation: 78.20
definition: List hosts the classification for the activities according to the Council Regulation 3037 90 EEC
status: valid
status modified: 2016-06-08
accepted date: 2016-06-08
in scheme: List hosts the classification for the activities according to the Council Regulation 3037/90/EEC.

Other human resources provision
type: Concept
notation: 78.30
definition: List hosts the classification for the activities according to the Council Regulation 3037 90 EEC
status: valid
status modified: 2016-06-08
accepted date: 2016-06-08
in scheme: List hosts the classification for the activities according to the Council Regulation 3037/90/EEC.

Travel agency activities
type: Concept
notation: 79.11
definition: List hosts the classification for the activities according to the Council Regulation 3037 90 EEC
status: valid
status modified: 2016-06-08
accepted date: 2016-06-08
in scheme: List hosts the classification for the activities according to the Council Regulation 3037/90/EEC.

Tour operator activities
type: Concept
notation: 79.12
definition: List hosts the classification for the activities according to the Council Regulation 3037 90 EEC
status: valid
status modified: 2016-06-08
accepted date: 2016-06-08
in scheme: List hosts the classification for the activities according to the Council Regulation 3037/90/EEC.

Other reservation service and related activities
type: Concept
notation: 79.90
definition: List hosts the classification for the activities according to the Council Regulation 3037 90 EEC
status: valid
status modified: 2016-06-08
accepted date: 2016-06-08
in scheme: List hosts the classification for the activities according to the Council Regulation 3037/90/EEC.

Private security activities
type: Concept
notation: 80.10
definition: List hosts the classification for the activities according to the Council Regulation 3037 90 EEC
status: valid
status modified: 2016-06-08
accepted date: 2016-06-08
in scheme: List hosts the classification for the activities according to the Council Regulation 3037/90/EEC.

Security systems service activities
type: Concept
notation: 80.20
definition: List hosts the classification for the activities according to the Council Regulation 3037 90 EEC
status: valid
status modified: 2016-06-08
accepted date: 2016-06-08
in scheme: List hosts the classification for the activities according to the Council Regulation 3037/90/EEC.

Investigation activities
type: Concept
notation: 80.30
definition: List hosts the classification for the activities according to the Council Regulation 3037 90 EEC
status: valid
status modified: 2016-06-08
accepted date: 2016-06-08
in scheme: List hosts the classification for the activities according to the Council Regulation 3037/90/EEC.

Combined facilities support activities
type: Concept
notation: 81.10
definition: List hosts the classification for the activities according to the Council Regulation 3037 90 EEC
status: valid
status modified: 2016-06-08
accepted date: 2016-06-08
in scheme: List hosts the classification for the activities according to the Council Regulation 3037/90/EEC.

General cleaning of buildings
type: Concept
notation: 81.21
definition: List hosts the classification for the activities according to the Council Regulation 3037 90 EEC
status: valid
status modified: 2016-06-08
accepted date: 2016-06-08
in scheme: List hosts the classification for the activities according to the Council Regulation 3037/90/EEC.

Other building and industrial cleaning activities
type: Concept
notation: 81.22
definition: List hosts the classification for the activities according to the Council Regulation 3037 90 EEC
status: valid
status modified: 2016-06-08
accepted date: 2016-06-08
in scheme: List hosts the classification for the activities according to the Council Regulation 3037/90/EEC.

Other cleaning activities
type: Concept
notation: 81.29
definition: List hosts the classification for the activities according to the Council Regulation 3037 90 EEC
status: valid
status modified: 2016-06-08
accepted date: 2016-06-08
in scheme: List hosts the classification for the activities according to the Council Regulation 3037/90/EEC.

Landscape service activities
type: Concept
notation: 81.30
definition: List hosts the classification for the activities according to the Council Regulation 3037 90 EEC
status: valid
status modified: 2016-06-08
accepted date: 2016-06-08
in scheme: List hosts the classification for the activities according to the Council Regulation 3037/90/EEC.

Combined office administrative service activities
type: Concept
notation: 82.11
definition: List hosts the classification for the activities according to the Council Regulation 3037 90 EEC
status: valid
status modified: 2016-06-08
accepted date: 2016-06-08
in scheme: List hosts the classification for the activities according to the Council Regulation 3037/90/EEC.

Photocopying document preparation and other specialised office support activities
type: Concept
notation: 82.19
definition: List hosts the classification for the activities according to the Council Regulation 3037 90 EEC
status: valid
status modified: 2016-06-08
accepted date: 2016-06-08
in scheme: List hosts the classification for the activities according to the Council Regulation 3037/90/EEC.

Activities of call centres
type: Concept
notation: 82.20
definition: List hosts the classification for the activities according to the Council Regulation 3037 90 EEC
status: valid
status modified: 2016-06-08
accepted date: 2016-06-08
in scheme: List hosts the classification for the activities according to the Council Regulation 3037/90/EEC.

Organisation of conventions and trade shows
type: Concept
notation: 82.30
definition: List hosts the classification for the activities according to the Council Regulation 3037 90 EEC
status: valid
status modified: 2016-06-08
accepted date: 2016-06-08
in scheme: List hosts the classification for the activities according to the Council Regulation 3037/90/EEC.

Activities of collection agencies and credit bureaus
type: Concept
notation: 82.91
definition: List hosts the classification for the activities according to the Council Regulation 3037 90 EEC
status: valid
status modified: 2016-06-08
accepted date: 2016-06-08
in scheme: List hosts the classification for the activities according to the Council Regulation 3037/90/EEC.

Packaging activities
type: Concept
notation: 82.92
definition: List hosts the classification for the activities according to the Council Regulation 3037 90 EEC
status: valid
status modified: 2016-06-08
accepted date: 2016-06-08
in scheme: List hosts the classification for the activities according to the Council Regulation 3037/90/EEC.

Other business support service activities n e c
type: Concept
notation: 82.99
definition: List hosts the classification for the activities according to the Council Regulation 3037 90 EEC
status: valid
status modified: 2016-06-08
accepted date: 2016-06-08
in scheme: List hosts the classification for the activities according to the Council Regulation 3037/90/EEC.

General public administration activities
type: Concept
notation: 84.11
definition: List hosts the classification for the activities according to the Council Regulation 3037 90 EEC
status: valid
status modified: 2016-06-08
accepted date: 2016-06-08
in scheme: List hosts the classification for the activities according to the Council Regulation 3037/90/EEC.

Regulation of the activities of providing health care education cultural services and other social services excluding social security
type: Concept
notation: 84.12
definition: List hosts the classification for the activities according to the Council Regulation 3037 90 EEC
status: valid
status modified: 2016-06-08
accepted date: 2016-06-08
in scheme: List hosts the classification for the activities according to the Council Regulation 3037/90/EEC.

Regulation of and contribution to more efficient operation of businesses
type: Concept
notation: 84.13
definition: List hosts the classification for the activities according to the Council Regulation 3037 90 EEC
status: valid
status modified: 2016-06-08
accepted date: 2016-06-08
in scheme: List hosts the classification for the activities according to the Council Regulation 3037/90/EEC.

Foreign affairs
type: Concept
notation: 84.21
definition: List hosts the classification for the activities according to the Council Regulation 3037 90 EEC
status: valid
status modified: 2016-06-08
accepted date: 2016-06-08
in scheme: List hosts the classification for the activities according to the Council Regulation 3037/90/EEC.

Defence activities
type: Concept
notation: 84.22
definition: List hosts the classification for the activities according to the Council Regulation 3037 90 EEC
status: valid
status modified: 2016-06-08
accepted date: 2016-06-08
in scheme: List hosts the classification for the activities according to the Council Regulation 3037/90/EEC.

Justice and judicial activities
type: Concept
notation: 84.23
definition: List hosts the classification for the activities according to the Council Regulation 3037 90 EEC
status: valid
status modified: 2016-06-08
accepted date: 2016-06-08
in scheme: List hosts the classification for the activities according to the Council Regulation 3037/90/EEC.

Public order and safety activities
type: Concept
notation: 84.24
definition: List hosts the classification for the activities according to the Council Regulation 3037 90 EEC
status: valid
status modified: 2016-06-08
accepted date: 2016-06-08
in scheme: List hosts the classification for the activities according to the Council Regulation 3037/90/EEC.

Fire service activities
type: Concept
notation: 84.25
definition: List hosts the classification for the activities according to the Council Regulation 3037 90 EEC
status: valid
status modified: 2016-06-08
accepted date: 2016-06-08
in scheme: List hosts the classification for the activities according to the Council Regulation 3037/90/EEC.

Compulsory social security activities
type: Concept
notation: 84.30
definition: List hosts the classification for the activities according to the Council Regulation 3037 90 EEC
status: valid
status modified: 2016-06-08
accepted date: 2016-06-08
in scheme: List hosts the classification for the activities according to the Council Regulation 3037/90/EEC.

Pre-primary education
type: Concept
notation: 85.10
definition: List hosts the classification for the activities according to the Council Regulation 3037 90 EEC
status: valid
status modified: 2016-06-08
accepted date: 2016-06-08
in scheme: List hosts the classification for the activities according to the Council Regulation 3037/90/EEC.

Primary education
type: Concept
notation: 85.20
definition: List hosts the classification for the activities according to the Council Regulation 3037 90 EEC
status: valid
status modified: 2016-06-08
accepted date: 2016-06-08
in scheme: List hosts the classification for the activities according to the Council Regulation 3037/90/EEC.

General secondary education
type: Concept
notation: 85.31
definition: List hosts the classification for the activities according to the Council Regulation 3037 90 EEC
status: valid
status modified: 2016-06-08
accepted date: 2016-06-08
in scheme: List hosts the classification for the activities according to the Council Regulation 3037/90/EEC.

Technical and vocational secondary education
type: Concept
notation: 85.32
definition: List hosts the classification for the activities according to the Council Regulation 3037 90 EEC
status: valid
status modified: 2016-06-08
accepted date: 2016-06-08
in scheme: List hosts the classification for the activities according to the Council Regulation 3037/90/EEC.

Post-secondary non-tertiary education
type: Concept
notation: 85.41
definition: List hosts the classification for the activities according to the Council Regulation 3037 90 EEC
status: valid
status modified: 2016-06-08
accepted date: 2016-06-08
in scheme: List hosts the classification for the activities according to the Council Regulation 3037/90/EEC.

Tertiary education
type: Concept
notation: 85.42
definition: List hosts the classification for the activities according to the Council Regulation 3037 90 EEC
status: valid
status modified: 2016-06-08
accepted date: 2016-06-08
in scheme: List hosts the classification for the activities according to the Council Regulation 3037/90/EEC.

Sports and recreation education
type: Concept
notation: 85.51
definition: List hosts the classification for the activities according to the Council Regulation 3037 90 EEC
status: valid
status modified: 2016-06-08
accepted date: 2016-06-08
in scheme: List hosts the classification for the activities according to the Council Regulation 3037/90/EEC.

Cultural education
type: Concept
notation: 85.52
definition: List hosts the classification for the activities according to the Council Regulation 3037 90 EEC
status: valid
status modified: 2016-06-08
accepted date: 2016-06-08
in scheme: List hosts the classification for the activities according to the Council Regulation 3037/90/EEC.

Driving school activities
type: Concept
notation: 85.53
definition: List hosts the classification for the activities according to the Council Regulation 3037 90 EEC
status: valid
status modified: 2016-06-08
accepted date: 2016-06-08
in scheme: List hosts the classification for the activities according to the Council Regulation 3037/90/EEC.

Other education n e c
type: Concept
notation: 85.59
definition: List hosts the classification for the activities according to the Council Regulation 3037 90 EEC
status: valid
status modified: 2016-06-08
accepted date: 2016-06-08
in scheme: List hosts the classification for the activities according to the Council Regulation 3037/90/EEC.

Educational support activities
type: Concept
notation: 85.60
definition: List hosts the classification for the activities according to the Council Regulation 3037 90 EEC
status: valid
status modified: 2016-06-08
accepted date: 2016-06-08
in scheme: List hosts the classification for the activities according to the Council Regulation 3037/90/EEC.

Hospital activities
type: Concept
notation: 86.10
definition: List hosts the classification for the activities according to the Council Regulation 3037 90 EEC
status: valid
status modified: 2016-06-08
accepted date: 2016-06-08
in scheme: List hosts the classification for the activities according to the Council Regulation 3037/90/EEC.

General medical practice activities
type: Concept
notation: 86.21
definition: List hosts the classification for the activities according to the Council Regulation 3037 90 EEC
status: valid
status modified: 2016-06-08
accepted date: 2016-06-08
in scheme: List hosts the classification for the activities according to the Council Regulation 3037/90/EEC.

Specialist medical practice activities
type: Concept
notation: 86.22
definition: List hosts the classification for the activities according to the Council Regulation 3037 90 EEC
status: valid
status modified: 2016-06-08
accepted date: 2016-06-08
in scheme: List hosts the classification for the activities according to the Council Regulation 3037/90/EEC.

Dental practice activities
type: Concept
notation: 86.23
definition: List hosts the classification for the activities according to the Council Regulation 3037 90 EEC
status: valid
status modified: 2016-06-08
accepted date: 2016-06-08
in scheme: List hosts the classification for the activities according to the Council Regulation 3037/90/EEC.

Other human health activities
type: Concept
notation: 86.90
definition: List hosts the classification for the activities according to the Council Regulation 3037 90 EEC
status: valid
status modified: 2016-06-08
accepted date: 2016-06-08
in scheme: List hosts the classification for the activities according to the Council Regulation 3037/90/EEC.

Residential nursing care activities
type: Concept
notation: 87.10
definition: List hosts the classification for the activities according to the Council Regulation 3037 90 EEC
status: valid
status modified: 2016-06-08
accepted date: 2016-06-08
in scheme: List hosts the classification for the activities according to the Council Regulation 3037/90/EEC.

Residential care activities for mental retardation mental health and substance abuse
type: Concept
notation: 87.20
definition: List hosts the classification for the activities according to the Council Regulation 3037 90 EEC
status: valid
status modified: 2016-06-08
accepted date: 2016-06-08
in scheme: List hosts the classification for the activities according to the Council Regulation 3037/90/EEC.

Residential care activities for the elderly and disabled
type: Concept
notation: 87.30
definition: List hosts the classification for the activities according to the Council Regulation 3037 90 EEC
status: valid
status modified: 2016-06-08
accepted date: 2016-06-08
in scheme: List hosts the classification for the activities according to the Council Regulation 3037/90/EEC.

Other residential care activities
type: Concept
notation: 87.90
definition: List hosts the classification for the activities according to the Council Regulation 3037 90 EEC
status: valid
status modified: 2016-06-08
accepted date: 2016-06-08
in scheme: List hosts the classification for the activities according to the Council Regulation 3037/90/EEC.

Social work activities without accommodation for the elderly and disabled
type: Concept
notation: 88.10
definition: List hosts the classification for the activities according to the Council Regulation 3037 90 EEC
status: valid
status modified: 2016-06-08
accepted date: 2016-06-08
in scheme: List hosts the classification for the activities according to the Council Regulation 3037/90/EEC.

Child day-care activities
type: Concept
notation: 88.91
definition: List hosts the classification for the activities according to the Council Regulation 3037 90 EEC
status: valid
status modified: 2016-06-08
accepted date: 2016-06-08
in scheme: List hosts the classification for the activities according to the Council Regulation 3037/90/EEC.

Other social work activities without accommodation n e c
type: Concept
notation: 88.99
definition: List hosts the classification for the activities according to the Council Regulation 3037 90 EEC
status: valid
status modified: 2016-06-08
accepted date: 2016-06-08
in scheme: List hosts the classification for the activities according to the Council Regulation 3037/90/EEC.

Performing arts
type: Concept
notation: 90.01
definition: List hosts the classification for the activities according to the Council Regulation 3037 90 EEC
status: valid
status modified: 2016-06-08
accepted date: 2016-06-08
in scheme: List hosts the classification for the activities according to the Council Regulation 3037/90/EEC.

Support activities to performing arts
type: Concept
notation: 90.02
definition: List hosts the classification for the activities according to the Council Regulation 3037 90 EEC
status: valid
status modified: 2016-06-08
accepted date: 2016-06-08
in scheme: List hosts the classification for the activities according to the Council Regulation 3037/90/EEC.

Artistic creation
type: Concept
notation: 90.03
definition: List hosts the classification for the activities according to the Council Regulation 3037 90 EEC
status: valid
status modified: 2016-06-08
accepted date: 2016-06-08
in scheme: List hosts the classification for the activities according to the Council Regulation 3037/90/EEC.

Operation of arts facilities
type: Concept
notation: 90.04
definition: List hosts the classification for the activities according to the Council Regulation 3037 90 EEC
status: valid
status modified: 2016-06-08
accepted date: 2016-06-08
in scheme: List hosts the classification for the activities according to the Council Regulation 3037/90/EEC.

Library and archives activities
type: Concept
notation: 91.01
definition: List hosts the classification for the activities according to the Council Regulation 3037 90 EEC
status: valid
status modified: 2016-06-08
accepted date: 2016-06-08
in scheme: List hosts the classification for the activities according to the Council Regulation 3037/90/EEC.

Museums activities
type: Concept
notation: 91.02
definition: List hosts the classification for the activities according to the Council Regulation 3037 90 EEC
status: valid
status modified: 2016-06-08
accepted date: 2016-06-08
in scheme: List hosts the classification for the activities according to the Council Regulation 3037/90/EEC.

Operation of historical sites and buildings and similar visitor attractions
type: Concept
notation: 91.03
definition: List hosts the classification for the activities according to the Council Regulation 3037 90 EEC
status: valid
status modified: 2016-06-08
accepted date: 2016-06-08
in scheme: List hosts the classification for the activities according to the Council Regulation 3037/90/EEC.

Botanical and zoological gardens and nature reserves activities
type: Concept
notation: 91.04
definition: List hosts the classification for the activities according to the Council Regulation 3037 90 EEC
status: valid
status modified: 2016-06-08
accepted date: 2016-06-08
in scheme: List hosts the classification for the activities according to the Council Regulation 3037/90/EEC.

Gambling and betting activities
type: Concept
notation: 92.00
definition: List hosts the classification for the activities according to the Council Regulation 3037 90 EEC
status: valid
status modified: 2016-06-08
accepted date: 2016-06-08
in scheme: List hosts the classification for the activities according to the Council Regulation 3037/90/EEC.

Operation of sports facilities
type: Concept
notation: 93.11
definition: List hosts the classification for the activities according to the Council Regulation 3037 90 EEC
status: valid
status modified: 2016-06-08
accepted date: 2016-06-08
in scheme: List hosts the classification for the activities according to the Council Regulation 3037/90/EEC.

Activities of sport clubs
type: Concept
notation: 93.12
definition: List hosts the classification for the activities according to the Council Regulation 3037 90 EEC
status: valid
status modified: 2016-06-08
accepted date: 2016-06-08
in scheme: List hosts the classification for the activities according to the Council Regulation 3037/90/EEC.

Fitness facilities
type: Concept
notation: 93.13
definition: List hosts the classification for the activities according to the Council Regulation 3037 90 EEC
status: valid
status modified: 2016-06-08
accepted date: 2016-06-08
in scheme: List hosts the classification for the activities according to the Council Regulation 3037/90/EEC.

Other sports activities
type: Concept
notation: 93.19
definition: List hosts the classification for the activities according to the Council Regulation 3037 90 EEC
status: valid
status modified: 2016-06-08
accepted date: 2016-06-08
in scheme: List hosts the classification for the activities according to the Council Regulation 3037/90/EEC.

Activities of amusement parks and theme parks
type: Concept
notation: 93.21
definition: List hosts the classification for the activities according to the Council Regulation 3037 90 EEC
status: valid
status modified: 2016-06-08
accepted date: 2016-06-08
in scheme: List hosts the classification for the activities according to the Council Regulation 3037/90/EEC.

Other amusement and recreation activities
type: Concept
notation: 93.29
definition: List hosts the classification for the activities according to the Council Regulation 3037 90 EEC
status: valid
status modified: 2016-06-08
accepted date: 2016-06-08
in scheme: List hosts the classification for the activities according to the Council Regulation 3037/90/EEC.

Activities of business and employers membership organisations
type: Concept
notation: 94.11
definition: List hosts the classification for the activities according to the Council Regulation 3037 90 EEC
status: valid
status modified: 2016-06-08
accepted date: 2016-06-08
in scheme: List hosts the classification for the activities according to the Council Regulation 3037/90/EEC.

Activities of professional membership organisations
type: Concept
notation: 94.12
definition: List hosts the classification for the activities according to the Council Regulation 3037 90 EEC
status: valid
status modified: 2016-06-08
accepted date: 2016-06-08
in scheme: List hosts the classification for the activities according to the Council Regulation 3037/90/EEC.

Activities of trade unions
type: Concept
notation: 94.20
definition: List hosts the classification for the activities according to the Council Regulation 3037 90 EEC
status: valid
status modified: 2016-06-08
accepted date: 2016-06-08
in scheme: List hosts the classification for the activities according to the Council Regulation 3037/90/EEC.

Activities of religious organisations
type: Concept
notation: 94.91
definition: List hosts the classification for the activities according to the Council Regulation 3037 90 EEC
status: valid
status modified: 2016-06-08
accepted date: 2016-06-08
in scheme: List hosts the classification for the activities according to the Council Regulation 3037/90/EEC.

Activities of political organisations
type: Concept
notation: 94.92
definition: List hosts the classification for the activities according to the Council Regulation 3037 90 EEC
status: valid
status modified: 2016-06-08
accepted date: 2016-06-08
in scheme: List hosts the classification for the activities according to the Council Regulation 3037/90/EEC.

Activities of other membership organisations n e c
type: Concept
notation: 94.99
definition: List hosts the classification for the activities according to the Council Regulation 3037 90 EEC
status: valid
status modified: 2016-06-08
accepted date: 2016-06-08
in scheme: List hosts the classification for the activities according to the Council Regulation 3037/90/EEC.

Repair of computers and peripheral equipment
type: Concept
notation: 95.11
definition: List hosts the classification for the activities according to the Council Regulation 3037 90 EEC
status: valid
status modified: 2016-06-08
accepted date: 2016-06-08
in scheme: List hosts the classification for the activities according to the Council Regulation 3037/90/EEC.

Repair of communication equipment
type: Concept
notation: 95.12
definition: List hosts the classification for the activities according to the Council Regulation 3037 90 EEC
status: valid
status modified: 2016-06-08
accepted date: 2016-06-08
in scheme: List hosts the classification for the activities according to the Council Regulation 3037/90/EEC.

Repair of consumer electronics
type: Concept
notation: 95.21
definition: List hosts the classification for the activities according to the Council Regulation 3037 90 EEC
status: valid
status modified: 2016-06-08
accepted date: 2016-06-08
in scheme: List hosts the classification for the activities according to the Council Regulation 3037/90/EEC.

Repair of household appliances and home and garden equipment
type: Concept
notation: 95.22
definition: List hosts the classification for the activities according to the Council Regulation 3037 90 EEC
status: valid
status modified: 2016-06-08
accepted date: 2016-06-08
in scheme: List hosts the classification for the activities according to the Council Regulation 3037/90/EEC.

Repair of footwear and leather goods
type: Concept
notation: 95.23
definition: List hosts the classification for the activities according to the Council Regulation 3037 90 EEC
status: valid
status modified: 2016-06-08
accepted date: 2016-06-08
in scheme: List hosts the classification for the activities according to the Council Regulation 3037/90/EEC.

Repair of furniture and home furnishings
type: Concept
notation: 95.24
definition: List hosts the classification for the activities according to the Council Regulation 3037 90 EEC
status: valid
status modified: 2016-06-08
accepted date: 2016-06-08
in scheme: List hosts the classification for the activities according to the Council Regulation 3037/90/EEC.

Repair of watches clocks and jewellery
type: Concept
notation: 95.25
definition: List hosts the classification for the activities according to the Council Regulation 3037 90 EEC
status: valid
status modified: 2016-06-08
accepted date: 2016-06-08
in scheme: List hosts the classification for the activities according to the Council Regulation 3037/90/EEC.

Repair of other personal and household goods
type: Concept
notation: 95.29
definition: List hosts the classification for the activities according to the Council Regulation 3037 90 EEC
status: valid
status modified: 2016-06-08
accepted date: 2016-06-08
in scheme: List hosts the classification for the activities according to the Council Regulation 3037/90/EEC.

Washing and dry- cleaning of textile and fur products
type: Concept
notation: 96.01
definition: List hosts the classification for the activities according to the Council Regulation 3037 90 EEC
status: valid
status modified: 2016-06-08
accepted date: 2016-06-08
in scheme: List hosts the classification for the activities according to the Council Regulation 3037/90/EEC.

Hairdressing and other beauty treatment
type: Concept
notation: 96.02
definition: List hosts the classification for the activities according to the Council Regulation 3037 90 EEC
status: valid
status modified: 2016-06-08
accepted date: 2016-06-08
in scheme: List hosts the classification for the activities according to the Council Regulation 3037/90/EEC.

Funeral and related activities
type: Concept
notation: 96.03
definition: List hosts the classification for the activities according to the Council Regulation 3037 90 EEC
status: valid
status modified: 2016-06-08
accepted date: 2016-06-08
in scheme: List hosts the classification for the activities according to the Council Regulation 3037/90/EEC.

Physical well-being activities
type: Concept
notation: 96.04
definition: List hosts the classification for the activities according to the Council Regulation 3037 90 EEC
status: valid
status modified: 2016-06-08
accepted date: 2016-06-08
in scheme: List hosts the classification for the activities according to the Council Regulation 3037/90/EEC.

Other personal service activities n e c
type: Concept
notation: 96.09
definition: List hosts the classification for the activities according to the Council Regulation 3037 90 EEC
status: valid
status modified: 2016-06-08
accepted date: 2016-06-08
in scheme: List hosts the classification for the activities according to the Council Regulation 3037/90/EEC.

Activities of households as employers of domestic personnel
type: Concept
notation: 97.00
definition: List hosts the classification for the activities according to the Council Regulation 3037 90 EEC
status: valid
status modified: 2016-06-08
accepted date: 2016-06-08
in scheme: List hosts the classification for the activities according to the Council Regulation 3037/90/EEC.

Undifferentiated goods- and services-producing activities of private households for own use
type: Concept
notation: 98.00
definition: Undifferentiated goods- and services-producing activities of private households for own use
status: valid
status modified: 2017-02-08
in scheme: List hosts the classification for the activities according to the Council Regulation 3037/90/EEC.

Undifferentiated goods-producing activities of private households for own use
type: Concept
notation: 98.10
definition: List hosts the classification for the activities according to the Council Regulation 3037 90 EEC
status: valid
status modified: 2016-06-08
accepted date: 2016-06-08
in scheme: List hosts the classification for the activities according to the Council Regulation 3037/90/EEC.

Undifferentiated service-producing activities of private households for own use
type: Concept
notation: 98.20
definition: List hosts the classification for the activities according to the Council Regulation 3037 90 EEC
status: valid
status modified: 2016-06-08
accepted date: 2016-06-08
in scheme: List hosts the classification for the activities according to the Council Regulation 3037/90/EEC.

Activities of extraterritorial organisations and bodies
type: Concept
notation: 99.00
definition: List hosts the classification for the activities according to the Council Regulation 3037 90 EEC
status: valid
status modified: 2016-06-08
accepted date: 2016-06-08
in scheme: List hosts the classification for the activities according to the Council Regulation 3037/90/EEC.