Statistical Classification of Economic Activities in the European Community, Rev. 2 (2008)
type: ConceptScheme
notation: nace_r2
is part of: common
registration status: Released
user modified: demo_user
date modified: 2013-10-18 14:48:51.0
vocabulary type: Common
version: Rev. 2
is numeric concept identifiers: false
is notations equal identifiers: false

Crop and animal production, hunting and related service activities
type: Concept
notation: 01
status: valid
status modified: 2013-10-18
accepted date: 2013-10-18
in scheme: Statistical Classification of Economic Activities in the European Community, Rev. 2 (2008)
scope note: Този раздел включва две основни дейности: производство на растителни продукти и производство на животински продукти. Обхваща също биологичното селско стопанство (растениевъдство, животновъдство), отглеждането на генетично модифицирани растения и животни, както и отглеждането на посеви на открити площи или в парници и оранжерии. Включват се спомагателните дейности, съпътстващи селското стопанство, ловът и свързаните с него дейности. Група 01.5 „Комбинирано растениевъдно-животновъдно стопанство“ не се подчинява на обичайните правила за определяне на основната дейност. Тук се отчита, че много стопанства поддържат сравнително равновесие между производството на растителни и животински продукти и класифицирането им в едната или другата категория би било условно. Селскостопанските дейности изключват каквато и да било последваща преработка на селскостопанските продукти (класифицирани в раздели 10, 11 и 12 „Производство на хранителни продукти“, „Производство на напитки“ и „Производство на тютюневи изделия“) освен това, което е необходимо за тяхната подготовка за пазара. Разделът не включва: технически дейности като терасиране на селскостопанските земи, дренажни работи, подготвяне на оризищата и други - сектор F „Строителство“, и търговия със селскостопански продукти, осъществена от посредници или асоциации на кооперативи - сектор G, поддържането на земята (почвената покривка) в добро агроекологично състояние - 81.30 „Оформяне и поддържане на озеленени площи“. @bg
scope note: Tento oddíl zahrnuje dvě oblasti činnosti – výrobu rostlinných produktů a výrobu živočišných produktů. Dále zahrnuje ekologické zemědělství a pěstování geneticky modifikovaných užitkových plodin a chov geneticky modifikovaných hospodářských zvířat. Oddíl zahrnuje kultury pěstované na volném prostranství i ve sklenících. Skupina 01.5 (Smíšené hospodářství) tvoří výjimku ze základních pravidel určování hlavní činnosti. Při určování se zde vychází z toho, že v četných zemědělských podnicích je rostlinná a živočišná výroba v přiměřené rovnováze a jejich zařazení do jedné či druhé kategorie by bylo svévolné. Oddíl zahrnuje také poskytování služeb spojených se zemědělstvím a s lovem a odchytem divokých zvířat a činnostmi s tím spojenými. Zemědělství nezahrnuje následné zpracování zemědělských produktů (zařazeno v oddílu 10 (Výroba potravinářských výrobků a krmiv) a oddílu 12 (Zpracování tabáku), jež přesahuje stupeň přípravy pro primární trhy. Zahrnuje přípravu zemědělských produktů pro primární trhy. Do zemědělství se dále nezahrnují polní stavební práce (např. terasování a odvodňování zemědělské půdy, příprava rýžových polí atd.), které zahrnuje sekce F (Stavebnictví), a činnosti nákupních družstev a odbytových sdružení, která se zabývají prodejem zemědělských produktů, zařazené do sekce G. Zemědělství nezahrnuje ani péči o krajinu a zachování krajiny, které patří do třídy 81.30. @cs
scope note: Diese Abteilung umfasst die beiden Tätigkeitsbereiche Gewinnung pflanzlicher Erzeugnisse und Gewinnung tierischer Erzeugnisse. Sie umfasst ferner die ökologische Landwirtschaft sowie den Anbau gentechnisch veränderter Nutzpflanzen und die Haltung gentechnisch veränderter Nutztiere. Diese Abteilung umfasst Freiland- wie auch Gewächshauskulturen. Gruppe 01.5 (Gemischte Landwirtschaft) bildet eine Ausnahme von den Grundregeln zur Bestimmung der Haupttätigkeit. Man geht hier davon aus, dass in zahlreichen landwirtschaftlichen Betrieben ein Gleichgewicht zwischen pflanzlicher und tierischer Erzeugung besteht und es willkürlich wäre, sie in die eine oder die andere Kategorie einzuordnen. Ferner in dieser Abteilung eingeschlossen sind die Erbringung von mit der Landwirtschaft und der kommerziellen Jagd verbundenen Dienstleistungen sowie die Fallenstellerei und damit verbundene Tätigkeiten. Nicht zur Landwirtschaft gerechnet wird die nachfolgende Verarbeitung landwirtschaftlicher Erzeugnisse (eingeordnet in Abteilung 10 (Herstellung von Nahrungs- und Futtermitteln) und Abteilung 12 (Tabakverarbeitung)), die über die Aufbereitung für die Rohstoffmärkte hinausgeht. Eingeschlossen ist die Aufbereitung von Erzeugnissen für die Rohstoffmärkte. Nicht zur Landwirtschaft gerechnet werden ferner die Anlage von Feldern (z. B. Terrassierung und Entwässerung von Landwirtschaftsflächen, Anlage von Reisfeldern usw.), die in Abschnitt F (Baugewerbe/Bau) eingeordnet ist, sowie die in Abschnitt G eingeordneten Einkaufsvereinigungen und Genossenschaften, welche landwirtschaftliche Erzeugnisse vermarkten. Ferner nicht eingeschlossen sind die Landschaftspflege und Landschaftserhaltung, die zur Klasse 81.30 zählen. @de
scope note: This division includes two basic activities, namely the production of crop products and production of animal products, covering also the forms of organic agriculture, the growing of genetically modified crops and the raising of genetically modified animals. This division includes growing of crops in open fields as well in greenhouses. Group 01.5 (Mixed farming) breaks with the usual principles for identifying main activity. It accepts that many agricultural holdings have reasonably balanced crop and animal production, and that it would be arbitrary to classify them in one category or the other. This division also includes service activities incidental to agriculture, as well as hunting, trapping and related activities. Agricultural activities exclude any subsequent processing of the agricultural products (classified under divisions 10 and 11 (Manufacture of food products and beverages) and division 12 (Manufacture of tobacco products)), beyond that needed to prepare them for the primary markets. The preparation of products for the primary markets is included here. The division excludes field construction (e.g. agricultural land terracing, drainage, preparing rice paddies etc.) classified in section F (Construction) and buyers and cooperative associations engaged in the marketing of farm products classified in section G. Also excluded is the landscape care and maintenance, which is classified in class 81.30. @en
scope note: Esta división incluye dos actividades fundamentales, la producción agrícola y la producción animal, incluyendo asimismo la agricultura orgánica, el cultivo de productos agrarios modificados genéticamente y la cría de animales modificados genéticamente. Esta división incluye la producción agrícola tanto en superficies a cielo abierto como en invernaderos. Esta división incluye también los servicios de apoyo a la agricultura, así como la caza, la captura de animales y las actividades relacionadas con las mismas. El grupo 01.5 (Producción agrícola combinada con la producción ganadera) se aparta de los principios habituales de determinación de la actividad principal. En él se acepta que muchas explotaciones agrarias tienen una producción agrícola y ganadera razonablemente equilibrada y que sería arbitrario clasificarlas en una categoría u otra. Las actividades agrarias excluyen cualquier elaboración posterior de los productos agrarios [clasificada en las divisiones 10 y 11 (Industrias de la alimentación y las bebidas), y 12 (Industria del tabaco)], aparte de la que resulta necesaria para prepararlos para los mercados primarios. Se incluye en este apartado la preparación de productos para los mercados primarios. La división excluye los trabajos de construcción para la preparación de terrenos (por ejemplo, el abancalamiento, el drenaje, la preparación de arrozales, etc.), clasificada en la sección F (Construcción), y los compradores y asociaciones cooperativas que se dedican a la comercialización de productos agrarios clasificados en la sección G. Excluye también el mantenimiento y cuidado de jardines, clasificado en la clase 81.30 (Actividades de jardinería). @es
scope note: Cette division comprend deux activités de base, à savoir la production de produits végétaux et la production de produits animaux, ainsi que l’agriculture biologique, la culture de plantes génétiquement modifiées et l’élevage d’animaux génétiquement modifiés. Cette division comprend la culture de plein champ et la culture sous abris. Le groupe 01.5 (Culture et élevage associés) rompt avec les principes usuels pour définir l’activité principale. Il tient compte du fait que de nombreuses exploitations agricoles ont une production végétale et animale assez équilibrée et qu’il serait arbitraire de les classer dans l’une ou l’autre catégorie. Cette division comprend également les services annexes à l’agriculture, à la chasse, au piégeage et aux activités connexes. Les activités agricoles excluent, en aval, les activités de transformation des produits agricoles (relevant des divisions 10 et 11 (Industries alimentaires et Industrie des boissons) et de la division 12 (Industrie du tabac)), au-delà de leur préparation pour les marchés primaires. La préparation de ces produits pour les marchés primaires est comprise dans cette division. Cette division ne comprend pas la mise en état des terres (terrassements, drainage, préparation de rizières, etc.) classée dans la section F (Construction), ni la commercialisation de produits agricoles par des centrales d’achat et coopératives, classée dans la section G. Sont également exclus les services d’aménagement et d’entretien paysager, rangés dans la classe 81.30. @fr
scope note: Ovaj odjeljak uključuje dvije temeljne djelatnosti: biljnu proizvodnju i stočarsku proizvodnju, tako što uključuje ekološku poljoprivredu, uzgoj genetički modificiranih usjeva te uzgoj genetički modificiranih životinja. Uključuje i uzgoj usjeva na otvorenom, kao i u zaštićenom prostoru. Ovaj odjeljak uključuje uslužne djelatnosti koje se odnose na poljoprivredu, lov, stupičarenje i usluge povezane s njima. Skupina 01.5 Mješovita proizvodnja raščlanjena je prema uobičajenim načelima za određivanje glavne djelatnosti. Prihvaćena je činjenica da mnoga poljoprivredna gospodarstva imaju odgovarajuće uravnoteženu biljnu i stočarsku proizvodnju te da bi bilo upitno njihovo razvrstavanje u jednu, odnosno u drugu kategoriju. Poljoprivredne djelatnosti isključuju svaku daljnju preradu poljoprivrednih proizvoda (razvrstanu u odjeljke 10 i 11 Proizvodnja hrane i pića i odjeljak 12 Proizvodnja duhanskih proizvoda), osim one koja se odnosi na primarnu pripremu za tržište. Ovdje je uključena primarna priprema proizvoda za tržište. Odjeljak isključuje građevinske radove na polju (npr. poravnanje poljoprivrednog zemljišta, drenažu, pripremu rižinih polja itd.), koji su razvrstani u područje F Građevinarstvo, te udruge kupaca i zadružnih organizacija koje se bave marketingom poljoprivrednih proizvoda razvrstane u područje G Trgovina na veliko i na malo; popravak motornih vozila i motocikla. Također je isključeno uređenje i održavanje krajolika, a razvrstano je u razred 81.30.
scope note: Šiame skyriuje išskiriamos dvi pagrindinės veiklos sritys: augalininkystė ir gyvulininkystė. Į šį skyrių įeina organinė (ekologinė) žemdirbystė, taip pat ir genetiškai modifikuotų augalų ir gyvūnų auginimas. Taip pat įeina augalų auginimas atvirame grunte ir šiltnamiuose. Taip pat įeina būdingų žemės ūkiui ir medžioklei, gaudymo spąstais ir susijusių paslaugų veikla. 01.5 grupėje (Mišrusis žemės ūkis) yra nepaisoma įprastinių taisyklių nustatant pagrindinę veiklos rūšį. Taip yra todėl, kad daugelis žemės ūkio valdų, tinkamai suderinę, užsiima augalininkyste ir gyvulininkyste, ir kurios pasirinktinai gali būti klasifikuojamos vienoje ar kitoje klasėje. Žemės ūkio veiklai nepriskiriamas tolesnis žemės ūkio produktų perdirbimas (klasifikuojamas 10 arba 11 skyriuose (Maisto produktų ir gėrimų gamyba) ir 12 skyriuje (Tabako gaminių gamyba)), išskyrus pirminį, reikalingą parduoti rinkoje, žemės ūkio produktų paruošimą. Produktų ruošimas pirminei rinkai priskirtas šiam skyriui. Į šį skyrių neįeina laukų paruošimas žemės ūkio darbams (pvz., dirbamos žemės terasų formavimas, drenažo sistemų įrengimas, ryžių auginimo laukų paruošimas ir pan.), ir klasifikuojamas F sekcijoje (Statyba) bei supirkėjų ir kooperatinių asociacijų, susijusių su žemės ūkio produktų pardavimu, veikla, klasifikuojama G sekcijoje. Taip pat neįeina kraštotvarka, kuri klasifikuojama 81.30 klasėje. @lt
scope note: Данная группа включает выращивание не многолетних культур, т.е. растений, которые существуют не более двух вегетационных периодов. Сюда также включено выращивание и подготовка семян. @ru
scope note: Bu bölüm, organik tarım, genetik olarak değiştirilmiş bitkisel ürünlerin ve genetik olarak değiştirilmiş hayvanların yetiştirilmesini de içeren iki temel faaliyeti yani, bitkisel ve hayvansal ürünlerin üretimini kapsamaktadır. Ayrıca, bu bölüm seralar (örtü altı) da dahil olmak üzere, açık alanlardaki tarımsal ürünlerin yetiştirilmesini de kapsar.Bu bölüm ayrıca, tarım, avcılık, tuzakla avlanma ve ilgili faaliyetlere ilişkin hizmet faaliyetlerini de kapsanmaktadır. Grup 01.5 (Karma çiftçilik) ana faaliyetin belirlenmesinde kullanılan geleneksel kurallara uymamaktadır. Bu yaklaşımda, işletmelerin pekçoğunda bitkisel ve hayvansal üretim değerlerinin birbirine oldukça yakın olduğu kabul edilmekte, bu nedenle de işletmelerin bu iki gruptan sadece birine dahil edilmelerinin subjektif olacağına inanılmaktadır. Tarımsal faaliyetler, tarımsal ürünlerin ilk pazar için hazırlanması için yapılan faaliyetler dışında kalan sonraki faaliyetleri hariç tutmaktadır [Bölüm 10 ve 11`de sınıflandırılan (Gıda maddelerinin ve içeceklerin imalatı) ve Bölüm 12`de sınıflandırılan (Tütün mamullerinin imalatı)]. Yani, ilk pazar için ürünlerin hazırlanması buraya dahil edilmektedir.Bu bölüm, kısım F`de (İnşaat) sınıflandırılan arazi inşaatını (örn. tarımsal arazinin teraslanması, drenajı, çeltik tarlasının hazırlanması vb.) ve kısım G`de sınıflandırılan tarımsal ürünlerin pazarlanmasında faaliyet gösteren alıcıları ve kooperatif birliklerini hariç tutmaktadır. Ayrıca, Sınıf 81.30`da sınıflandırılan, peyzaj bakım ve muhafazası da hariç tutulmaktadır. @tr
preferred label: Растениевъдство, животновъдство и лов; спомагателни дейности @bg
preferred label: Rostlinná a živočišná výroba, myslivost a související činnosti @cs
preferred label: Plante- og husdyravl, jagt og serviceydelser i forbindelse hermed @da
preferred label: Landwirtschaft, Jagd und damit verbundene Tätigkeiten @de
preferred label: Φυτική και ζωική παραγωγή, θήρα και συναφείς δραστηριότητες @el
preferred label: Agricultura, ganadería, caza y servicios relacionados con las mismas @es
preferred label: Taime- ja loomakasvatus, jahindus ja neid teenindavad tegevusalad @et
preferred label: Kasvinviljely ja kotieläintalous, riistatalous ja niihin liittyvät palvelut @fi
preferred label: Culture et production animale, chasse et services annexes @fr
preferred label: Növénytermesztés, állattenyésztés, vadgazdálkodás és kapcsolódó szolgáltatások
preferred label: Produzioni vegetali e animali, caccia e servizi connessi @it
preferred label: Augalininkystė ir gyvulininkystė, medžioklė ir susijusių paslaugų veikla @lt
preferred label: Augkopība un lopkopība, medniecība un saistītas palīgdarbības @lv
preferred label: Produzzjoni ta' għelejjel u annimali, kaċċa u attivitajiet relatati @mt
preferred label: Teelt van gewassen, veeteelt, jacht en diensten in verband met deze activiteiten @nl
preferred label: Jordbruk og tjenester tilknyttet jordbruk, jakt og viltstell @no
preferred label: Uprawy rolne, chów i hodowla zwierząt, łowiectwo, włączając działalność usługową @pl
preferred label: Produção vegetal e animal, caça e actividades dos serviços relacionados @pt
preferred label: Agricultură, vânătoare şi servicii anexe @ro
preferred label: Растениеводство и животноводство, охота и предоставление услуг в этих областях @ru
preferred label: Pestovanie plodín a chov zvierat, poľovníctvo a služby s tým súvisiace @sk
preferred label: Kmetijska proizvodnja in lov ter z njima povezane storitve @sl
preferred label: Jordbruk och jakt samt service i anslutning härtill @sv
preferred label: Bitkisel ve hayvansal üretim ile avcılık ve ilgili hizmet faaliyetleri @tr
broader: AGRICULTURE, FORESTRY AND FISHING
narrower: Growing of non-perennial crops
narrower: Growing of perennial crops
narrower: Plant propagation
narrower: Animal production
narrower: Mixed farming
narrower: Support activities to agriculture and post-harvest crop activities
narrower: Hunting, trapping and related service activities

Growing of non-perennial crops
type: Concept
notation: 01.1
status: valid
status modified: 2013-10-18
accepted date: 2013-10-18
in scheme: Statistical Classification of Economic Activities in the European Community, Rev. 2 (2008)
scope note: Тази група включва отглеждане на едногодишни растения, т.е. растения, чието отглеждане не продължава повече от два сезона. Тук се включва също отглеждането на тези растения с цел производството на семена. @bg
scope note: Tato skupina zahrnuje pěstování plodin jiných než trvalých, tzn. plodin s životností ne delší než dvě růstová období. Skupina rovněž zahrnuje pěstování těchto plodin za účelem získávání osiva. @cs
scope note: Diese Gruppe umfasst den Anbau einjähriger Pflanzen, d. h. von Pflanzen mit einer Lebensdauer von zwei oder weniger Wachstumsperioden. Eingeschlossen ist der Anbau dieser Pflanzen zum Zwecke der Erzeugung von Saatgut. @de
scope note: This group includes the growing of non-perennial crops, i.e. plants that do not last for more than two growing seasons. Included is the growing of these plants for the purpose of seed production. @en
scope note: Se incluye en este grupo el cultivo de plantas no perennes, por ejemplo, plantas que no duran más de dos temporadas. Se incluye el cultivo de estas plantas para la producción de semillas. @es
scope note: Ce groupe comprend les cultures non permanentes, c’est-à-dire les plantes dont la durée de vie ne dépasse pas deux saisons de croissance végétale. La culture de ces plantes aux fins de la production de semences est comprise. @fr
scope note: Ova skupina uključuje uzgoj jednogodišnjih usjeva, tj. biljaka koje traju kraće od dvije uzgojne sezone. Uključen je i uzgoj tih biljaka za potrebe sjemenske proizvodnje.
scope note: Į šią grupę įeina vienmečių augalų auginimas, t.y. augalų, kurių augimo periodas yra ne didesnis kaip du augimo sezonai. Taip pat įeina šių augalų auginimas sėkloms paruošti. @lt
scope note: Данный класс включает все виды выращивания зерновых, бобовых культур и масличных семян в открытом поле. Выращивание данных культур часто комбинируется в тех или иных сельскохозяйственных подразделениях. Этот класс включает: - выращивание зерновых культур, таких как: • пшеница • кукуруза • сорго • ячмень • рожь • овес • просо • прочие зерновые культуры и т.д. - выращивание бобовых культур, таких как: • бобы • конские бобы • турецкий горох • вигна • чечевица • люпин • горох • кайанус • прочие бобовые культуры - выращивание масличных семян, таких как: • соевые бобы • земляной орех • клещевина обыкновенная • семена льна • семена горчицы • семена масличной нуги • семена рапса • семена сафлора красильного • семена кунжута • семена подсолнуха • прочие масличные семена Этот класс исключает: - выращивание риса, см. 01.12 - выращивание кукурузы, см. 01.13 - выращивание кормовой кукурузы, см. 01.19 - выращивание масличных плодов, см. 01.26 @ru
scope note: Bu grup, tek yıllık bitkisel ürünlerin, yani toprakta iki yetiştirme döneminden daha fazla kalmayan bitkilerin yetiştirilmesini içermektedir. Bu bitkilerin tohum üretimi amacıyla yetiştirilmesi de kapsanmaktadır. @tr
preferred label: Отглеждане на едногодишни растения @bg
preferred label: Pěstování plodin jiných než trvalých @cs
preferred label: Dyrkning af etårige afgrøder @da
preferred label: Anbau einjähriger Pflanzen @de
preferred label: Καλλιέργεια μη πολυετών φυτών @el
preferred label: Cultivos no perennes @es
preferred label: Üheaastaste põllukultuuride kasvatus @et
preferred label: Yksivuotisten kasvien viljely @fi
preferred label: Cultures non permanentes @fr
preferred label: Nem évelő növény termesztése
preferred label: Coltivazione di colture agricole non permanenti @it
preferred label: Vienmečių augalų auginimas @lt
preferred label: Viengadīgo kultūru audzēšana @lv
preferred label: Tkabbir ta' għelejjel mhux perenni @mt
preferred label: Teelt van eenjarige gewassen @nl
preferred label: Dyrking av ettårige vekster @no
preferred label: Uprawy rolne inne niż wieloletnie @pl
preferred label: Culturas temporárias @pt
preferred label: Cultivarea plantelor nepermanente @ro
preferred label: Выращивание сезонных культур @ru
preferred label: Pestovanie netrvácnych plodín @sk
preferred label: Pridelovanje netrajnih rastlin @sl
preferred label: Odling av ett- och tvååriga växter @sv
preferred label: Tek yıllık (uzun ömürlü olmayan) bitkisel ürünlerin yetiştirilmesi @tr
broader: Crop and animal production, hunting and related service activities
narrower: Growing of cereals (except rice), leguminous crops and oil seeds
narrower: Growing of rice
narrower: Growing of vegetables and melons, roots and tubers
narrower: Growing of sugar cane
narrower: Growing of tobacco
narrower: Growing of fibre crops
narrower: Growing of other non-perennial crops

Growing of cereals (except rice), leguminous crops and oil seeds
type: Concept
notation: 01.11
status: valid
status modified: 2013-10-18
accepted date: 2013-10-18
in scheme: Statistical Classification of Economic Activities in the European Community, Rev. 2 (2008)
scope note: Този клас включва всички начини на засяване и отглеждане на зърнени (без ориз) и бобови растения и маслодайни семена на открити площи, в това число биологично производство и отглеждане на генномодифицирани растения. Селскостопанските единици често извършват комбинирано отглеждането на различни видове растения. Включва: - отглеждане на зърнени растения: • пшеница • царевица за зърно • сорго • ечемик • ръж • овес • просо • други зърнени растения - отглеждане на бобови растения с шушулки (зелени или сухи): • боб • бакла • нахут • папуда (боб „кравешки грах“) • леща • лупина (вълчи боб) • грах • каянус • други бобови растения с шушулки (зелени или сухи) - отглеждане на маслодайни семена: • соя • фъстъци • семена от памук • рицина • семена от лен • семена от синап • нуг, гвизоция (Guizоtia) (Абисинска гвизоция - G. abyssinica) • рапица • шафран • сусам • слънчоглед • други маслодайни семена - отглеждане на ориз - 01.12 - отглеждане на сладка царевица - 01.13 - отглеждане на фуражна царевица - 01.19 - отглеждане на маслосъдържащи плодове - 01.26 @bg
scope note: Tato třída zahrnuje všechny druhy pěstování obilovin, luštěnin a olejnatých semen na volném prostranství. Tyto plodiny jsou v zemědělských podnicích často pěstovány společně. Z: - pěstování obilovin, např.: • pšenice • kukuřice na zrno • čiroku (sorghum) • ječmene • žita • ovsa • prosa • ostatních obilovin j. n. - pěstování luštěnin, např.: • fazolí • bobů • cizrny • dlouhatce čínského • čočky • lupiny (bob vlčí) • hrachu • Cajanus cajan • ostatních luštěnin - pěstování olejnatých semen, např.: • sojových bobů • podzemnice olejné • semen bavlny • semen ricinových bobů • lněných semen • hořčičných semen • semen mastňáku habešského (Guizotia abyssinica) • semen řepky olejné • semen světlice (safloru) • sezamových semen • slunečnicových semen • jiných olejnatých semen N: - pěstování rýže (01.12) - pěstování sladké kukuřice (01.13) - pěstování krmné kukuřice (01.19) - pěstování olejnatých plodů (01.26) @cs
scope note: Diese Klasse umfasst alle Arten des Anbaus von Getreide, Hülsenfrüchten und Ölsaaten im Freiland. Diese Pflanzen werden in landwirtschaftlichen Betrieben häufig nebeneinander angebaut. Diese Klasse umfasst: - Anbau von Getreide, z. B.: • Weizen • Körnermais • Sorghum • Gerste • Roggen • Hafer • Hirsearten • sonstiges Getreide a. n. g. - Anbau von Hülsenfrüchten, z. B.: • Bohnen • Puffbohnen • Kichererbsen • Kuhbohnen • Linsen • Lupinen • Erbsen • Straucherbsen • sonstige Hülsenfrüchte - Anbau von Ölsaaten, z. B.: • Sojabohnen • Erdnüsse • Rizinussamen • Leinsamen • Senfkörner • Nigersaat • Rapssamen • Saflorsaat • Sesamsamen • Sonnenblumenkerne • andere Ölsaaten Diese Klasse umfasst nicht: - Anbau von Reis (s. 01.12) - Anbau von Zuckermais (s. 01.13) - Anbau von Futtermais (s. 01.19) - Anbau von ölhaltigen Früchten (s. 01.26) @de
scope note: This class includes all forms of growing of cereals, leguminous crops and oil seeds in open fields. The growing of these crops is often combined within agricultural units. This class includes: - growing of cereals such as: • wheat • grain maize • sorghum • barley • rye • oats • millets • other cereals n.e.c. - growing of leguminous crops such as: • beans • broad beans • chick peas • cow peas • lentils • lupines • peas • pigeon peas • other leguminous crops - growing of oil seeds such as: • soya beans • groundnuts • castor bean • linseed • mustard seed • niger seed • rapeseed • safflower seed • sesame seed • sunflower seed • other oil seeds This class excludes: - growing of rice, see 01.12 - growing of sweet corn, see 01.13 - growing of maize for fodder, see 01.19 - growing of oleaginous fruits, see 01.26 @en
scope note: Esta clase comprende todos los tipos de cultivo de cereales, leguminosas y semillas oleaginosas en superficies a cielo abierto. El cultivo de estos productos suele combinarse dentro de cada unidad agraria. Esta clase comprende: - el cultivo de cereales como: • trigo • maíz en grano • sorgo • cebada • centeno • avena • mijo • otros cereales n.c.o.p. - el cultivo de leguminosas como: • alubias • habas • garbanzos • judía carilla • lentejas • altramuces • guisantes • guisante de Angola • otras leguminosas - el cultivo de semillas oleaginosas como: • habas de soja • cacahuetes • semilla de algodón • semilla de ricino • semilla de linaza • semilla de mostaza • semilla de níger • colza • semilla de cártamo • semilla de sésamo • semillas de girasol • otras semillas oleaginosas Esta clase no comprende: - el cultivo de arroz (véase 01.12) - el cultivo de maíz dulce (véase 01.13) - el cultivo de maíz para pienso y forraje (véase 01.19) - el cultivo de frutos oleaginosos (véase 01.26) @es
scope note: Cette classe comprend toutes les formes de culture de plein champ de céréales, de légumineuses et de graines oléagineuses. Ces cultures sont souvent combinées au sein des unités agricoles. Cette classe comprend: - la culture de céréales telles que: • blé • maïs-grain • sorgho • orge • seigle • avoine • millet • autres céréales n.c.a. - la culture de légumineuses telles que: • haricots • fèves • pois chiches • pois à vache • lentilles • lupins • pois • pois cajans • autres légumineuses - la culture de graines oléagineuses telles que: • graines de soja • arachides • graines de ricin • graines de lin • graines de moutarde • graines de niger • graines de colza • graines de carthame • graines de sésame • graines de tournesol • autres graines oléagineuses Cette classe ne comprend pas: - la culture du riz, voir 01.12 - la culture du maïs doux, voir 01.13 - la culture du maïs fourrager, voir 01.19 - la culture de fruits oléagineux, voir 01.26 @fr
scope note: Ovaj razred uključuje sve načine uzgoja žitarica, mahunarki i uljanog sjemenja na otvorenom polju. Uzgoj tih usjeva često je kombiniran unutar poljoprivrednih jedinica. Ovaj razred uključuje: - uzgoj žitarica kao što su: • pšenica • kukuruz • sirak • ječam • raž • zob • proso • ostale žitarice d. n. - uzgoj mahunarki kao što su: • grah • bob • slanutak • crni grah • leća • lupina • grašak • golubinji grašak • ostale mahunarke - uzgoj uljanog sjemenja kao što je: • sjeme soje • sjeme kikirikija • sjeme pamuka • sjeme ricinusa • sjeme lana • sjeme gorušice • crno sjeme (niger) • sjeme uljane repice • sjeme srpka • sjeme sezama • sjeme suncokreta • ostalo uljano sjemenje Ovaj razred isključuje: - uzgoj riže, vidi 01.12 - uzgoj kukuruza šećerca, vidi 01.13 - uzgoj kukuruza za stoku, vidi 01.19 - uzgoj uljanih plodova, 01.26
scope note: Į šią klasę įeina visų rūšių grūdinių, ankštinių ir aliejingųjų sėklų augalų auginimas atvirame grunte. Ūkio ribose šių augalų auginimas dažniausiai yra derinamas tarpusavyje. Į šią klasę įeina: - auginimas grūdinių augalų, tokių kaip: • kviečiai • kukurūzai • sorgai • miežiai • rugiai • avižos • soros • kiti, niekur kitur nepriskirti, grūdiniai augalai - auginimas ankštinių augalų, tokių kaip: • pupos • pupelės • sėjamieji avinžirniai • kininės pupuolės • lęšiai • lubinai • žirniai • tikrieji kajanai • kiti ankštiniai augalai - auginimas aliejingųjų sėklų, tokių kaip: • sojos pupelės • žemės riešutai • medvilnės sėklos • ricinmedžio sėklos • linų sėmenys • garstyčių sėklos • aliejinės juodvos sėklos • rapsų sėklos • dažinio dygmino sėklos • sezamo sėklos • saulėgrąžų sėklos • kitos aliejingosios sėklos Į šią klasę neįeina: - ryžių auginimas, žr. 01.12 - cukrinių kukurūzų auginimas, žr. 01.13 - pašarinių kukurūzų auginimas, žr. 01.19 - aliejinių augalų vaisių ir uogų auginimas, žr. 01.26 @lt
scope note: Bu sınıf, açık alanlarda tahılların, baklagillerin ve yağlı tohumların yetiştirilmesini içermektedir. Bir tarımsal işletmede, çoğunlukla, bu ürünlerin birden fazlası, bir arada yetiştirilmektedir. Bu sınıf aşağıdakileri kapsamaktadır; - tahılların yetiştirilmesi, örneğin; • buğday, • dane mısır, • süpürge darısı, • arpa, • çavdar, • yulaf, • darı, • b.y.s. diğer tahıllar, - baklagillerin yetiştirilmesi, örneğin; • fasulye (taze ve kuru), • bakla, • nohut, • börülce, • mercimek, • acı bakla, • bezelye, • araka, • diğer baklagiller, - yağlı tohumların yetiştirilmesi, örneğin; • soya fasulyesi, • yer fıstığı, • pamuk çekirdeği, • kene otu tohumu (hint yağı çekirdeği), • keten tohumu, • hardal tohumu, • nijer tohumu, • kolza, • aspir tohumu, • susam tohumu, • ayçiçeği tohumu, • diğer yağlı tohumlar. Kapsam dışı olanlar; - çeltik (kabuklu pirinç) yetiştirilmesi, bkz. 01.12, - tatlı mısır yetiştirilmesi, bkz. 01.13, - yemlik mısır yetiştirilmesi, bkz. 01.19, - yağlı meyvelerin yetiştirilmesi, bkz. 01.26. @tr
preferred label: Отглеждане на зърнени (без ориз) и бобови растения и маслодайни семена @bg
preferred label: Pěstování obilovin (kromě rýže), luštěnin a olejnatých semen @cs
preferred label: Dyrkning af korn (undtagen ris), bælgfrugter og olieholdige frø @da
preferred label: Anbau von Getreide (ohne Reis), Hülsenfrüchten und Ölsaaten @de
preferred label: Καλλιέργεια δημητριακών (εκτός ρυζιού), οσπρίων και ελαιούχων σπόρων @el
preferred label: Cultivo de cereales (excepto arroz), leguminosas y semillas oleaginosas @es
preferred label: Teravilja- (v.a riis), kaunvilja- ja õlitaimede seemnete kasvatus @et
preferred label: Viljakasvien (pl. riisin), palkokasvien ja öljysiemenkasvien viljely @fi
preferred label: Culture de céréales (à l'exception du riz), de légumineuses et de graines oléagineuses @fr
preferred label: Gabonaféle (kivéve: rizs), hüvelyes növény, olajos mag termesztése
preferred label: Coltivazione di cereali (tranne il riso), legumi da granella e semi oleosi @it
preferred label: Grūdinių (išskyrus ryžius), ankštinių ir aliejingų sėklų augalų auginimas @lt
preferred label: Graudaugu (izņemot rīsu), pākšaugu un eļļas augu sēklu audzēšana @lv
preferred label: Tkabbir ta' qmuħ (għajr ross), legumi u żrieragħ żejtnija @mt
preferred label: Teelt van granen (m.u.v. rijst), peulgewassen en oliehoudende zaden @nl
preferred label: Dyrking av korn (unntatt ris), belgvekster og oljeholdige vekster @no
preferred label: Uprawa zbóż, roślin strączkowych i roślin oleistych na nasiona, z wyłączeniem ryżu @pl
preferred label: Cerealicultura (excepto arroz), leguminosas e sementes oleaginosas @pt
preferred label: Cultivarea cerealelor (exclusiv orez), plantelor leguminoase şi a plantelor producătoare de seminţe oleaginoase @ro
preferred label: Выращивание зерновых культур (за исключением риса), бобовых культур и масличных семян @ru
preferred label: Pestovanie obilnín (okrem ryže), strukovín a olejnatých semien @sk
preferred label: Pridelovanje žit (razen riža), stročnic in oljnic @sl
preferred label: Odling av spannmål (utom ris), baljväxter och oljeväxter @sv
preferred label: Tahılların (pirinç hariç), baklagillerin ve yağlı tohumların yetiştirilmesi @tr
broader: Growing of non-perennial crops

Growing of rice
type: Concept
notation: 01.12
status: valid
status modified: 2013-10-18
accepted date: 2013-10-18
in scheme: Statistical Classification of Economic Activities in the European Community, Rev. 2 (2008)
scope note: Этот класс включает: - выращивание листовых и стебельных овощей, таких как: • артишок • аспарагус • капуста • цветная капуста и брокколи • салат-латук и цикорий • шпинат • прочие листовые или стебельные сорта овощей - выращивание бахчевых культур и овощей, таких как: • огурцы и корнишоны • баклажаны • помидоры • арбузы • мускусная дыня • прочие виды бахчевых культур - выращивание корневидных, луковичных и клубневых видов овощей, таких как: • морковь • турнепс • чеснок • лук (включая шалот) • лук-порей и прочие относящиеся к луковичным видам • прочие корневые, луковичные или клубневые виды овощей - выращивание грибов и трюфелей - выращивание овощных семян, включая семена сахарной свеклы, кроме семян других видов свеклы - выращивание сахарной свеклы - выращивание других овощей - выращивание корневидных и клубневых видов овощей: • картофель • сладкий картофель • маниока • ямс • прочие корневидные и клубневые виды овощей Этот класс исключает: - выращивание стручкового перца, горошкового черного перца и прочих видов приправ и ароматических культур, см. 01.28 - выращивание грибниц, см. 01.30 @ru
preferred label: Отглеждане на ориз @bg
preferred label: Pěstování rýže @cs
preferred label: Dyrkning af ris @da
preferred label: Anbau von Reis @de
preferred label: Καλλιέργεια ρυζιού @el
preferred label: Cultivo de arroz @es
preferred label: Riisikasvatus @et
preferred label: Riisin viljely @fi
preferred label: Culture du riz @fr
preferred label: Rizstermesztés
preferred label: Coltivazione del riso @it
preferred label: Ryžių auginimas @lt
preferred label: Rīsu audzēšana @lv
preferred label: Tkabbir ta' ross @mt
preferred label: Teelt van rijst @nl
preferred label: Dyrking av ris @no
preferred label: Uprawa ryżu @pl
preferred label: Cultura de arroz @pt
preferred label: Cultivarea orezului @ro
preferred label: Выращивание риса @ru
preferred label: Pestovanie ryže @sk
preferred label: Pridelovanje riža @sl
preferred label: Odling av ris @sv
preferred label: Çeltik (kabuklu pirinç) yetiştirilmesi @tr
broader: Growing of non-perennial crops

Growing of vegetables and melons, roots and tubers
type: Concept
notation: 01.13
status: valid
status modified: 2013-10-18
accepted date: 2013-10-18
in scheme: Statistical Classification of Economic Activities in the European Community, Rev. 2 (2008)
scope note: - отглеждане на листни или стъблени зеленчуци: • артишок • аспержи • зеле • карфиол и броколи • маруля и цикория • спанак • други листни или стъблени зеленчуци - отглеждане на плодови зеленчуци: • краставици • патладжани • домати • пипер • дини • пъпеши • други пъпешови и плодови зеленчуци - отглеждане на кореноплодни, луковични и грудкови зеленчуци: • моркови • ряпа • чесън • лук, вкл. шалот • праз лук и други лукови зеленчуци • други кореноплодни, луковични и грудкови зеленчуци - отглеждане на гъби и трюфели - отглеждане на зеленчуци за производство на семена, вкл. на семе от захарно цвекло, без семена от друго (фуражно) цвекло - отглеждане на захарно цвекло - отглеждане на други зеленчуци - отглеждане на кореноплодни и грудкови зеленчуци с високо съдържание на нишесте или инулин: • картофи • патати (сладки картофи) • маниока • ямс (сладък тропически картоф) • други кореноплодни и грудкови зеленчуци с високо съдържание на нишесте или инулин - отглеждане на лютив и сладък червен пипер (Capsicum sop.) и други растения за подправки и етеричномаслени растения - 01.28 - отглеждане на гъбен мицел - 01.30 @bg
scope note: Z: - pěstování listové nebo košťálové zeleniny, např.: • artyčoku • chřestu • zelí • květáku a brokolice • hlávkového salátu a čekanky obecné • špenátu • jiné listové nebo košťálové zeleniny - pěstování plodové zeleniny, např.: • okurek salátových a nakládaček • lilku • rajčat • vodních melounů • cukrových melounů • ostatních melounů a ostatní plodové zeleniny - pěstování kořenové, cibulové a hlízové zeleniny, např.: • mrkve • vodnice • česneku • cibule (vč. šalotky) • póru a jiné cibulové zeleniny • ostatní kořenové nebo hlízové zeleniny - pěstování hub a lanýžů - pěstování zeleninových semen, vč. osiva cukrové řepy, avšak kromě osiva ostatní řepy - pěstování cukrové řepy - pěstování ostatní zeleniny - pěstování kořenů a hlíz, např.: • brambor • batátů (sladkých brambor) • manioku • jamů • ostatních kořenů a hlíz N: - pěstování papriky (capsicum spp.), jiného koření a aromatických rostlin (01.28) - pěstování podhoubí (01.30) @cs
scope note: Diese Klasse umfasst: - Anbau von Blatt- oder Stängelgemüse, z. B.: • Artischocken • Spargel • Kohl • Blumenkohl und Broccoli • Kopfsalat und Chicorée • Spinat • anderes Blatt- oder Stängelgemüse - Anbau von Fruchtgemüse, z. B.: • Gurken und Cornichons • Eierfrüchte (Auberginen/Melanzani) • Tomaten • Wassermelonen • Zuckermelonen/Honigmelonen • sonstige Melonen und sonstiges Fruchtgemüse - Anbau von Wurzel-, Zwiebel- oder Knollengemüse, z. B.: • Möhren/Karotten • Speiserüben • Knoblauch • Zwiebeln (einschl. Schalotten) • Porree/Lauch und andere Gemüse der Allium-Arten • sonstiges Wurzel-, Zwiebel- oder Knollengemüse - Anbau von Pilzen und Trüffeln - Anbau von Gemüsesamen einschließlich Saatgut für Zuckerrüben, jedoch ohne Saatgut für sonstige Rüben - Anbau von Zuckerrüben - Anbau von sonstigem Gemüse - Anbau von Wurzeln und Knollen, z. B.: • Kartoffeln • Süßkartoffeln, Bataten • Maniok, Kassava • Yamswurzeln • sonstige Wurzeln und Knollen Diese Klasse umfasst nicht: - Anbau von Paprika (capsicum sop.) und sonstigen Gewürz- und Duftpflanzen (s. 01.28) - Anbau von Pilzmycel (s. 01.30) @de
scope note: This class includes: - growing of leafy or stem vegetables such as: • artichokes • asparagus • cabbages • cauliflower and broccoli • lettuce and chicory • spinach • other leafy or stem vegetables - growing of fruit bearing vegetables such as: • cucumbers and gherkins • eggplants (aubergines) • tomatoes • watermelons • cantaloupes • other melons and fruit-bearing vegetables - growing of root, bulb or tuberous vegetables such as: • carrots • turnips • garlic • onions (incl. shallots) • leeks and other alliaceous vegetables • other root, bulb or tuberous vegetables - growing of mushrooms and truffles - growing of vegetable seeds, including sugar beet seeds, excluding other beet seeds - growing of sugar beet - growing of other vegetables - growing of roots and tubers such as: • potatoes • sweet potatoes • cassava • yams • other roots and tubers This class excludes: - growing of chillies, peppers (capsicum sop.) and other spices and aromatic crops, see 01.28 - growing of mushroom spawn, see 01.30 @en
scope note: Esta clase comprende: - el cultivo de hortalizas de hoja o tallo, como: • alcachofas • espárragos • coles • coliflor y brécol • lechuga y escarola • espinacas • otras hortalizas de hoja grande o tallo endeble - el cultivo de hortalizas que dan frutos, como: • pepinos y pepinillos • berenjenas • tomates • sandías • melón cantalupo • otros melones y hortalizas que dan frutos - el cultivo de hortalizas con raíces, bulbos o tubérculos, como: • zanahorias • nabos • ajos • cebollas (incluidos chalotas) • puerros y otras hortalizas aliáceas • otras hortalizas con raíces, bulbos o tubérculos - el cultivo de setas y trufas - el cultivo de semillas de hortalizas, incluidas las semillas de remolacha azucarera y excluidas otras semillas de remolacha - el cultivo de remolacha azucarera - el cultivo de otras hortalizas - el cultivo de raíces y tubérculos como: • patatas • boniatos y batatas • mandioca • ñame • otras raíces y tubérculos Esta clase no comprende: - el cultivo de chiles, pimientos (capsicum sop.) y otras especias y plantas aromáticas (véase 01.28) - el cultivo de blanco de seta (véase 01.30) @es
scope note: Cette classe comprend: - la culture des légumes à feuilles et à tiges, tels que: • artichauts • asperges • choux • choux-fleurs et brocolis • laitues et chicorées • épinards • autres légumes à feuilles et à tiges - la culture de plantes cultivées pour leurs fruits, telles que: • concombres et cornichons • aubergines • tomates • pastèques • melons cantaloups • autres melons et plantes cultivées pour leurs fruits - la culture des légumes à racines, à bulbes ou à tubercules, tels que: • carottes • navets • ail • oignons (et échalotes) • poireaux et autres légumes alliacés • autres légumes à racines, à bulbes ou à tubercules - la culture des champignons et des truffes - la production de semences de légumes, y compris de graines de betteraves sucrières, à l’exclusion des graines d’autres betteraves - la culture des betteraves sucrières - la culture d’autres légumes - la culture de racines et de tubercules, tels que: • pommes de terre • patates douces • manioc • ignames • autres racines et tubercules Cette classe ne comprend pas: - la culture de piments, de poivrons et d’autres plantes à épices et aromatiques, voir 01.28 - la culture de blanc de champignons, voir 01.30 @fr
scope note: Ovaj razred uključuje: - uzgoj lisnatog i stabljičastog povrća kao što su: • artičoke • šparoge • kupus • cvjetača i brokula • salata i radič • špinat • ostalo lisnato i stabljičasto povrće - uzgoj plodovitog povrća kao što su: • krastavci i kornišoni • patlidžani • rajčice • lubenice • dinje • ostale dinje i ostalo plodovito povrće - uzgoj korjenastog, lukovičastog ili gomoljastog povrća kao što je: • mrkva • bijela repa • češnjak • luk (uključujući luk kozjak) • poriluk i ostale vrste luka • ostalo korjenasto, lukovičasto ili gomoljasto povrće - uzgoj gljiva i tartufa - uzgoj sjemenja povrća, uključujući sjeme šećerne repe, isključujući sjemenje ostalih vrsta repa - uzgoj šećerne repe - uzgoj ostalog povrća - uzgoj korjenastog i gomoljastog povrća kao što je: • krumpir • slatki krumpir • manioka • jam • ostalo korjenasto i gomoljasto povrće Ovaj razred isključuje: - uzgoj feferona, paprike te ostalih začinskih i aromatskih usjeva, vidi 01.28 - uzgoj micelija gljiva, vidi 01.30
scope note: Į šią klasę įeina: - lapinių ar stiebinių daržovių, tokių kaip: • artišokai • šparagai • gūžiniai kopūstai • žiediniai ir brokoliniai kopūstai • salotos ir trūkažolės (cikorijos) • špinatai • kitos lapinės ar stiebinės daržovės, auginimas - vaisinių daržovių, tokių kaip: • agurkai ir kornišonai • baklažanai • pomidorai • tikrieji arbūzai • raukšlėtieji melionai • kiti arbūzai ir vaisius vedančios daržovės, auginimas - šakniavaisinių, svogūninių ar gumbavaisinių daržovių, tokių kaip: • morkos • ropės • česnakai • svogūnai, įskaitant „shallots“ veislę • porai ir kitos česnakinės ar svogūninės daržovės • kitos šakniavaisinės, svogūninės ar gumbavaisinės daržovės, auginimas - grybų ir valgomųjų trumų auginimas - sėklinių daržovių, įskaitant cukrinius sėklinius runkelius ir išskyrus kitus sėklinius runkelius, auginimas - cukrinių runkelių auginimas - kitų daržovių auginimas - šakniavaisių ir gumbavaisių, tokių kaip: • bulvės • batatos • maniokai • diskorėjos • kiti šakniavaisiai ir gumbavaisiai, auginimas Į šią klasę neįeina: - ankštinių pipirų, vienamečių paprikų ir kitų prieskoninių ir kvapiųjų augalų auginimas, žr. 01.28 - grybienos auginimas, žr. 01.30 @lt
scope note: Этот класс исключает: - выращивание сахарной свеклы, см. 01.13 @ru
scope note: Bu sınıf aşağıdakileri kapsamaktadır; - yapraklı veya saplı sebzelerin yetiştirilmesi, örneğin; • enginar, • kuşkonmaz, • lahana, • karnabahar ve brokoli, • marul ve hindiba, • ıspanak, • diğer yapraklı veya saplı sebzeler, - meyvesi yenen sebzelerin yetiştirilmesi, örneğin; • hıyar ve kornişon, • patlıcan, • domates, • sivri ve dolmalık biberler, • karpuz, • kantalup kavunu, • diğer kabakgil türleri ve meyvesi tüketilen sebzeler , - kökleri, soğanları, yumruları tüketilen sebzelerin yetiştirilmesi, örneğin; • havuç, • şalgam, • sarımsak, • soğan (arpacık soğan da dahil), • pırasa ve diğer benzer sebzeler (soğangil, Allium familyası), • kökleri, soğanları, yumruları tüketilen diğer sebzeler, - mantar ve yer mantarı (domalan) yetiştirilmesi, - şeker pancarı tohumları dahil, diğer pancar tohumları hariç, sebze tohumu yetiştirilmesi, - şeker pancarı yetiştirilmesi, - diğer sebzelerin yetiştirilmesi, - tatlı mısır, - kök ve yumruların yetiştirilmesi, örneğin; • patates, • tatlı patates, • manyok, • hint yer elması (yam), • diğer kök ve yumru sebzeler. Kapsam dışı olanlar; - acı ve küçük meyveli baharatlık biberler (capsicum çeşitleri) ve diğer baharat grubu ve aromatik (ıtırlı) bitkilerin yetiştirilmesi, bkz. 01.28, - mantar tohumu üretimi, bkz. 01.30, - yemlik kıvırcık lahana, bkz. 01.19. @tr
preferred label: Отглеждане на зеленчуци, дини и пъпеши, кореноплодни и грудкови @bg
preferred label: Pěstování zeleniny a melounů, kořenů a hlíz @cs
preferred label: Dyrkning af grøntsager og meloner, rødder og rodknolde @da
preferred label: Anbau von Gemüse und Melonen sowie Wurzeln und Knollen @de
preferred label: Καλλιέργεια λαχανικών και πεπονοειδών, ριζών και κονδύλων @el
preferred label: Cultivo de hortalizas, raíces y tubérculos @es
preferred label: Köögivilja- ja melonikasvatus, juur- ja mugulvilja kasvatus @et
preferred label: Vihannesten ja melonien, juuresten ja mukulakasvien viljely @fi
preferred label: Culture de légumes, de melons, de racines et de tubercules @fr
preferred label: Zöldségféle, dinnye, gyökér-, gumósnövény termesztése
preferred label: Coltivazione di ortaggi e meloni, radici e tuberi @it
preferred label: Daržovių ir melionų, šakniavaisių ir gumbavaisių auginimas @lt
preferred label: Dārzeņu audzēšana @lv
preferred label: Tkabbir ta' ħxejjex u bettiegħ u dulliegħ, ħxejjex ikkultivati għall-għeruq tagħhom (bħaz-zunnarija u l-pitravi) u tuberi @mt
preferred label: Teelt van groenten, meloenen en wortel- en knolgewassen @nl
preferred label: Dyrking av grønnsaker, meloner, rot- og knollvekster @no
preferred label: Uprawa warzyw, włączając melony, oraz uprawa roślin korzeniowych i roślin bulwiastych @pl
preferred label: Cultura de produtos hortícolas e melões, raízes e tubérculos @pt
preferred label: Cultivarea legumelor şi a pepenilor, a rădăcinoaselor şi tuberculilor @ro
preferred label: Выращивание овощей и бахчевых, корнеплодов и клубнеплодов @ru
preferred label: Pestovanie zeleniny a melónov, koreňovej a hľúzovej zeleniny @sk
preferred label: Pridelovanje zelenjadnic in melon, korenovk in gomoljnic @sl
preferred label: Odling av grönsaker och meloner, rotfrukter och stam- eller rotknölar @sv
preferred label: Sebze, kavun-karpuz, kök ve yumru sebzelerin yetiştirilmesi @tr
broader: Growing of non-perennial crops

Growing of sugar cane
type: Concept
notation: 01.14
status: valid
status modified: 2013-10-18
accepted date: 2013-10-18
in scheme: Statistical Classification of Economic Activities in the European Community, Rev. 2 (2008)
scope note: - отглеждане на захарно цвекло - 01.13 @bg
scope note: N: - pěstování cukrové řepy (01.13) @cs
scope note: Diese Klasse umfasst nicht: - Anbau von Zuckerrüben (s. 01.13) @de
scope note: This class excludes: - growing of sugar beet, see 01.13 @en
scope note: Esta clase no comprende: - el cultivo de remolacha azucarera (véase 01.13) @es
scope note: Cette classe ne comprend pas: - la culture de betteraves sucrières, voir 01.13 @fr
scope note: Ovaj razred isključuje: - uzgoj šećerne repe, vidi 01.13
scope note: Į šią klasę neįeina: - cukrinių runkelių auginimas, žr. 01.13 @lt
scope note: Этот класс исключает: - производство табачных изделий, см. 12.00 @ru
scope note: Kapsam dışı olanlar; - şeker pancarı yetiştirilmesi, bkz. 01.13. @tr
preferred label: Отглеждане на захарна тръстика @bg
preferred label: Pěstování cukrové třtiny @cs
preferred label: Dyrkning af sukkerrør @da
preferred label: Anbau von Zuckerrohr @de
preferred label: Καλλιέργεια ζαχαροκάλαμου @el
preferred label: Cultivo de caña de azúcar @es
preferred label: Suhkrurookasvatus @et
preferred label: Sokeriruo'on viljely @fi
preferred label: Culture de la canne à sucre @fr
preferred label: Cukornádtermesztés
preferred label: Coltivazione di canna da zucchero @it
preferred label: Cukranendrių auginimas @lt
preferred label: Cukurniedru audzēšana @lv
preferred label: Tkabbir ta' kannamieli @mt
preferred label: Teelt van suikerriet @nl
preferred label: Dyrking av sukkerrør @no
preferred label: Uprawa trzciny cukrowej @pl
preferred label: Cultura de cana-de-açúcar @pt
preferred label: Cultivarea trestiei de zahăr @ro
preferred label: Выращивание сахарного тростника @ru
preferred label: Pestovanie cukrovej trstiny @sk
preferred label: Pridelovanje sladkornega trsa @sl
preferred label: Odling av sockerrör @sv
preferred label: Şeker kamışı yetiştirilmesi @tr
broader: Growing of non-perennial crops

Growing of tobacco
type: Concept
notation: 01.15
status: valid
status modified: 2013-10-18
accepted date: 2013-10-18
in scheme: Statistical Classification of Economic Activities in the European Community, Rev. 2 (2008)
scope note: - първична обработка на тютюневите листа, например сушене - 01.63 - производство на тютюневи изделия - 12.00 @bg
scope note: N: - zpracování tabáku (12.00) @cs
scope note: Diese Klasse umfasst nicht: - Tabakverarbeitung (s. 12.00) @de
scope note: This class excludes: - manufacture of tobacco products, see 12.00 @en
scope note: Esta clase no comprende: - la fabricación de productos del tabaco (véase 12.00) @es
scope note: Cette classe ne comprend pas: - la fabrication de produits à base de tabac, voir 12.00 @fr
scope note: Ovaj razred isključuje: - proizvodnju duhanskih proizvoda, vidi 12.00
scope note: Į šią klasę neįeina - tabako gaminių gamyba, žr. 12.00 @lt
scope note: Этот класс включает: - выращивание хлопка-сырца - выращивание джута, кенафа и прочих текстильных и лубяных волокон - выращивание льна и конопли - выращивание мексиканской агавы и прочих видов лубяных волокон и агавы - выращивание манильской пеньки, китайской крапивы и прочих овощных текстильных волокон - выращивание прочих волокнистых культур @ru
scope note: Kapsam dışı olanlar; - tütün mamullerinin imalatı, bkz. 12.00. @tr
preferred label: Отглеждане на тютюн @bg
preferred label: Pěstování tabáku @cs
preferred label: Dyrkning af tobak @da
preferred label: Anbau von Tabak @de
preferred label: Καλλιέργεια καπνού @el
preferred label: Cultivo de tabaco @es
preferred label: Tubakakasvatus @et
preferred label: Tupakan viljely @fi
preferred label: Culture du tabac @fr
preferred label: Dohánytermesztés
preferred label: Coltivazione di tabacco @it
preferred label: Tabako auginimas @lt
preferred label: Tabakas audzēšana @lv
preferred label: Tkabbir ta' tabakk @mt
preferred label: Teelt van tabak @nl
preferred label: Dyrking av tobakk @no
preferred label: Uprawa tytoniu @pl
preferred label: Cultura de tabaco @pt
preferred label: Cultivarea tutunului @ro
preferred label: Выращивание табака @ru
preferred label: Pestovanie tabaku @sk
preferred label: Pridelovanje tobaka @sl
preferred label: Odling av tobak @sv
preferred label: Tütün yetiştirilmesi @tr
broader: Growing of non-perennial crops

Growing of fibre crops
type: Concept
notation: 01.16
status: valid
status modified: 2013-10-18
accepted date: 2013-10-18
in scheme: Statistical Classification of Economic Activities in the European Community, Rev. 2 (2008)
scope note: - отглеждане на памук - отглеждане на юта, кенаф и други ликови влакнодайни растения - отглеждане на лен и коноп - отглеждане на сизал и други влакнодайни растения от род "Агаве" - отглеждане на абака, рами и други подобни влакнодайни растения - отглеждане на други влакнодайни растения - топене (отопяване) на влакнодайни растения (юта, лен, влакна от кокосов орех и други) @bg
scope note: Z: - pěstování bavlny - pěstování juty, kenafu a ostatních textilních lýkových vláken - pěstování lnu a pravého konopí - pěstování sisalu a ostatních textilních agávových vláken - pěstování abakových, ramiových a ostatních rostlinných přadných vláken - pěstování ostatních přadných rostlin @cs
scope note: Diese Klasse umfasst: - Anbau von Baumwolle - Anbau von Jute, Kenaf und sonstigen textilen Bastfasern - Anbau von Flachs und Hanf - Anbau von Sisal und sonstigen textilen Agavefasern - Anbau von Abaca, Ramie und sonstigen pflanzlichen Spinnstoffen - Anbau sonstiger Faserpflanzen @de
scope note: This class includes: - growing of cotton - growing of jute, kenaf and other textile bast fibres - growing of flax and true hemp - growing of sisal and other textile fibre of the genus agave - growing of abaca, ramie and other vegetable textile fibres - growing of other fibre crops @en
scope note: Esta clase comprende: - el cultivo de algodón - el cultivo de yute, kenaf y otras fibras textiles blandas - el cultivo de lino y cáñamo - el cultivo de sisal y otras fibras textiles del género agave - el cultivo de abacá, ramio y otras fibras textiles de origen vegetal - el cultivo de otras plantas textiles @es
scope note: Cette classe comprend: - la culture du coton - la culture de jute, de kenaf et d’autres fibres textiles libériennes - la culture de lin ou de chanvre - la culture de sisal et d’autres fibres textiles du genre agave - la culture de l’abaca, de la ramie et d’autres fibres textiles végétales - la culture d’autres plantes à fibres @fr
scope note: Ovaj razred uključuje: - uzgoj pamuka - uzgoj jute, kenafa i ostalih biljaka za proizvodnju vlakana koje sadrže liko - uzgoj lana i konoplje - uzgoj sisala i ostaloga bilja za proizvodnju vlakana iz porodice agava - uzgoj abake, ramije i ostaloga povrtnog bilja za proizvodnju vlakana - uzgoj ostalog bilja za proizvodnju vlakana
scope note: Į šią klasę įeina: - medvilnės auginimas - džiuto, kenafo ir kitų karnienos tekstilės pluoštinių augalų auginimas - linų ir tikrųjų kanapių auginimas - sizalio ir kitų agavos šeimos tekstilės pluoštinių augalų auginimas - abakos, ramės ir kitų panašių tekstilės pluoštinių augalų auginimas - kitų pluoštinių augalų auginimas @lt
scope note: Этот класс включает в себя выращивание прочих сезонных культур: - выращивание брюквы, кормовой свеклы, кормовой зелени, клевера, люцерны, эспарцета, кормовой кукурузы и прочих трав, кормовой капусты и подобных кормовых продуктов - выращивание семян свеклы (за исключением семян сахарной свеклы) и семян кормовых растений - выращивание цветов - производство свежесрезанных цветов и цветов в бутонах - выращивание семян цветов Этот класс исключает: - выращивание не многолетних приправ, ароматических трав, лекарственных и фармацевтических культур, см. 01.28 @ru
scope note: Bu sınıf aşağıdakileri kapsamaktadır; - pamuk yetiştirilmesi, - Jüt, kenaf ve tekstilde kullanılan diğer lifli ürünlerin yetiştirilmesi, - keten ve kenevir yetiştirilmesi, - Sisal keneviri ve agave sınıfından diğer tekstil liflerinin yetiştirilmesi, - abaka (kenevir muzu), rami ve diğer lifli tekstil bitkilerinin yetiştirilmesi, - diğer lifli bitkilerin yetiştirilmesi. @tr
preferred label: Отглеждане на влакнодайни растения @bg
preferred label: Pěstování přadných rostlin @cs
preferred label: Dyrkning af tekstilplanter @da
preferred label: Anbau von Faserpflanzen @de
preferred label: Καλλιέργεια ινωδών φυτών @el
preferred label: Cultivo de plantas para fibras textiles @es
preferred label: Kiutaimede kasvatus @et
preferred label: Kuitukasvien viljely @fi
preferred label: Culture de plantes à fibres @fr
preferred label: Rostnövénytermesztés
preferred label: Coltivazione di piante tessili @it
preferred label: Pluoštinių augalų auginimas @lt
preferred label: Šķiedraugu audzēšana @lv
preferred label: Tkabbir ta' għelejjel fibrużi @mt
preferred label: Teelt van vezelgewassen @nl
preferred label: Dyrking av fibervekster @no
preferred label: Uprawa roślin włóknistych @pl
preferred label: Cultura de plantas têxteis @pt
preferred label: Cultivarea plantelor pentru fibre textile @ro
preferred label: Выращивание волокнистых прядильных культур @ru
preferred label: Pestovanie plodín na vlákno @sk
preferred label: Pridelovanje rastlin za vlakna @sl
preferred label: Odling av fiberväxter @sv
preferred label: Lifli bitkilerin yetiştirilmesi @tr
broader: Growing of non-perennial crops

Growing of other non-perennial crops
type: Concept
notation: 01.19
status: valid
status modified: 2013-10-18
accepted date: 2013-10-18
in scheme: Statistical Classification of Economic Activities in the European Community, Rev. 2 (2008)
scope note: Този клас включва отглеждането на всички останали едногодишни растения: - отглеждане на шведска ряпа, кръмно цвекло, фуражни корени, детелина, люцерна, еспарзета, фуражна царевица, фуражно зеле и подобни фуражни растения - отглеждане на елда - отглеждане на цвекло (без захарно цвекло) и фуражни растения за производство на семена - отглеждане на цветя - производство на рязани цветя и цветни пъпки - отглеждане на цветя за производство на семена - отглеждане на едногодишни растения, използвани като подправки, етеричномаслени и лечебни растения - 01.28 @bg
scope note: Z: - pěstování všech ostatních plodin jiných než trvalých: • pěstování tuřínu, krmné řepy, kořenů pro krmné účely, jetele, vojtěšky, vičence, krmné kukuřice a ostatních trav, krmné kapusty a podobného krmiva • pěstování pohanky • pěstování semen řepy (kromě cukrové řepy) a krmných plodin • pěstování květin • produkci řezaných květin a květinových poupat • pěstování semen květin N: - pěstování jednoletých rostlin pro výrobu koření, rostlin pro aromatické, léčivé a farmaceutické účely (01.28) @cs
scope note: Diese Klasse umfasst den Anbau aller sonstigen einjährigen Pflanzen: - Steckrüben, Futterrüben, Wurzeln zu Futterzwecken, Klee, Luzerne, Esparsette, Futtermais und sonstige Gräser, Futterkohl und ähnliches Futter - Anbau von Blumen - Samen von Rüben (außer von Zuckerrüben) und von Futterpflanzen - Blumen- Schnittblumen und Blütenknospen - Blumensamen Diese Klasse umfasst nicht: - Anbau von einjährigen Gewürzpflanzen, Pflanzen für aromatische, narkotische und pharmazeutische Zwecke (s. 01.28) @de
scope note: This class includes the growing of all other non-perennial crops: - growing of swedes, mangolds, fodder roots, clover, alfalfa, sainfoin, fodder maize and other grasses, forage kale and similar forage products - growing of beet seeds (excluding sugar beet seeds) and seeds of forage plants - growing of flowers - production of cut flowers and flower buds - growing of flower seeds This class excludes: - growing of non-perennial spices, aromatic, drug and pharmaceutical crops, see 01.28 @en
scope note: Esta clase comprende el cultivo de las demás plantas no perennes: - el cultivo de colinabos, remolacha forrajera, raíces forrajeras, tréboles, alfalfa, pipirigallo, maíz para pienso y forraje y otras gramíneas, coles forrajeras y productos similares para forraje - el cultivo de trigo sarraceno - el cultivo de semillas de remolacha (excluidas las semillas de remolacha azucarera) y las semillas de plantas forrajeras - el cultivo de flores - la producción de flores cortadas y capullos - el cultivo de semillas de flores Esta clase no comprende: - el cultivo de especias no perennes, plantas aromáticas, plantas para la elaboración de fármacos y narcóticos (véase 01.28) @es
scope note: Cette classe comprend toutes les autres cultures non permanentes: - la culture de rutabagas, betteraves fourragères, racines fourragères, luzerne, trèfle, sainfoin, maïs fourrager, choux fourragers et autres produits fourragers similaires - la production de graines de betteraves (à l’exclusion des graines de betteraves sucrières) et de graines de plantes fourragères - la culture de fleurs - la production de fleurs coupées et de boutons de fleurs - la production de semences de fleurs Cette classe ne comprend pas: - les cultures non permanentes de plantes à épices, aromatiques, médicinales et pharmaceutiques, voir 01.28 @fr
scope note: Ovaj razred uključuje uzgoj svih ostalih jednogodišnjih i dvogodišnjih usjeva: - uzgoj stočne korabe i repe, ostalih krmnih korjenastih usjeva, djeteline, lucerne, esparzete, stočnog kukuruza i ostalih trava, stočnoga kelja i ostaloga krmnog bilja - uzgoj heljde - uzgoj sjemenja repe (isključujući sjemenje šećerne repe) i sjemenja krmnog bilja - uzgoj cvijeća - proizvodnju rezanog cvijeća i cvjetnih pupova - uzgoj sjemenja cvijeća Ovaj razred isključuje: - uzgoj jednogodišnjeg i višegodišnjeg bilja za uporabu u farmaciji, aromatskog, začinskog i ljekovitog bilja, vidi 01.28
scope note: Į šia klasę įeina kitų vienmečių augalų auginimas: - griežčių, mangoldų (lapinių runkelių), pašarinių runkelių, dobilų, liucernų, kirvenių, pašarinių kukurūzų ir kitų žolių, pašarinių lapinių kopūstų ir panašių pašarinių augalų auginimas - grikių auginimas - sėklinių runkelių (išskyrus cukrinius sėklinius runkelius) ir sėklinių pašarinių augalų auginimas - gėlių auginimas - nuskintų gėlių ir gėlių pumpurų gavyba - sėklinių gėlių auginimas Į šią klasę neįeina: - vienmečių prieskoninių, kvapiųjų, vaistinių ir farmacijos pramonėje naudojamų augalų auginimas, žr. 01.28 @lt
scope note: Данная группа включает выращивание многолетних культур, то есть растений, которые претерпевают более двух вегетационных периодов либо отмирают после каждого сезона или непрерывное выращивание. Сюда также включено выращивание и подготовка семян. @ru
scope note: Bu sınıf, diğer tüm tek yıllık bitkisel ürünlerin yetiştirilmesini içermektedir; - sarı şalgam, mangoldlar, yemlik kökleri, yonca, alfalfa (kabayonca), korunga, yemlik mısır ve diğer otlar, yemlik kıvırcık lahana ve benzeri yem ürünlerinin yetiştirilmesi, - kara buğdayın yetiştirilmesi, - pancar tohumlarının (şeker pancarı tohumları hariç) ve yem bitkilerinin tohumlarının yetiştirilmesi - çiçek yetiştiriciliği, - kesme çiçek ve çiçek tomurcuğu üretimi,, - çiçek tohumlarının yetiştirilmesi. Kapsam dışı olanlar; - tek yıllık baharatların, aromatik (ıtırlı), uyuşturucu nitelikte ve eczacılıkla ilgili bitkisel ürünlerin yetiştirilmesi için, bkz. 01.28. @tr
preferred label: Отглеждане на други едногодишни растения @bg
preferred label: Pěstování ostatních plodin jiných než trvalých @cs
preferred label: Dyrkning af andre etårige afgrøder @da
preferred label: Anbau von sonstigen einjährigen Pflanzen @de
preferred label: Καλλιέργεια άλλων μη πολυετών φυτών @el
preferred label: Otros cultivos no perennes @es
preferred label: Muude üheaastaste põllukultuuride kasvatus @et
preferred label: Muu yksivuotisten ja koristekasvien viljely @fi
preferred label: Autres cultures non permanentes @fr
preferred label: Egyéb, nem évelő növény termesztése
preferred label: Coltivazione di altre colture non permanenti @it
preferred label: Kitų vienmečių augalų auginimas @lt
preferred label: Citu viengadīgo kultūru audzēšana @lv
preferred label: Tkabbir ta' għelejjel oħra mhux perenni @mt
preferred label: Teelt van andere eenjarige gewassen @nl
preferred label: Dyrking av ettårige vekster ellers @no
preferred label: Uprawy rolne inne niż wieloletnie, pozostałe @pl
preferred label: Outras culturas temporárias @pt
preferred label: Cultivarea altor plante din culturi nepermanente @ro
preferred label: Выращивание прочих сезонных культур @ru
preferred label: Pestovanie ostatných netrvácnych plodín @sk
preferred label: Pridelovanje cvetja in drugih enoletnih rastlin @sl
preferred label: Odling av andra ett- och tvååriga växter @sv
preferred label: Tek yıllık (uzun ömürlü olmayan) diğer bitkisel ürünlerin yetiştirilmesi @tr
broader: Growing of non-perennial crops

Growing of perennial crops
type: Concept
notation: 01.2
status: valid
status modified: 2013-10-18
accepted date: 2013-10-18
in scheme: Statistical Classification of Economic Activities in the European Community, Rev. 2 (2008)
scope note: Тази група включва отглеждането на многогодишни насаждения, т.е. растения, чието развитие обхваща повече от два вегетационни периода, подновява се отново през всеки вегетационен период или продължава вечно. Тук се включва също отглеждането на тези растения с цел производството на семена. @bg
scope note: Tato skupina zahrnuje pěstování trvalých plodin, tzn. plodin, které přežijí více než dvě růstová období a které buď po každém období odumřou nebo rostou nepřetržitě. Patří sem rovněž pěstování těchto plodin za účelem získávání osiva. @cs
scope note: Diese Gruppe umfasst den Anbau von mehrjährigen Pflanzen, d. h. Pflanzen, die mehr als zwei Wachstumsperioden überleben und die entweder nach jeder Periode absterben oder die kontinuierlich weiter wachsen. Ebenfalls dazu zählt der Anbau dieser Pflanzen zum Zwecke der Saatguterzeugung. @de
scope note: This group includes the growing of perennial crops, i.e. plants that lasts for more than two growing seasons, either dying back after each season or growing continuously. Included is the growing of these plants for the purpose of seed production. @en
scope note: Este grupo comprende el cultivo de productos perennes, es decir, plantas que duran más de dos temporadas, bien porque se secan después de cada estación o porque crecen continuamente. Se incluye el cultivo de estas plantas para la producción de semillas. @es
scope note: Ce groupe comprend les cultures permanentes, c’est-à-dire les plantes dont la durée de vie est supérieure à deux saisons de croissance végétale et qui perdent leurs feuilles après chaque saison ou dont la croissance est continue. La culture de ces plantes aux fins de la production de semences est comprise. @fr
scope note: Ova skupina uključuje uzgoj višegodišnjih usjeva, tj. biljaka koje traju više od dvije uzgojne sezone, bilo da njihovi nadzemni dijelovi odumiru na kraju sezone, bilo da konstantno rastu. Uključen je i uzgoj tih biljaka za potrebe sjemenske proizvodnje.
scope note: Į šią grupę įeina daugiamečių augalų auginimas, t.y. augalų, kurių augimo trukmė yra didesnė kaip du augimo sezonai, arba kiekvieną sezoną atželiantys iš naujo, arba ištisai žaliuojantys. Taip pat įeina šių augalų auginimas sėkloms paruošti. @lt
scope note: Этот класс включает: - выращивание винного винограда и столовых сортов винограда в виноградниках Этот класс исключает: - производство вина, см. 11.02 @ru
scope note: Bu grup, çokyıllık bitkilerin , yani her yetiştirme döneminden sonra toprak üstü kısımları ölüp sonraki yıl yenilenen veya devamlı olarak büyüyerek toprakta iki yetiştirme döneminden daha fazla kalan bitkilerin yetiştirilmesini içermektedir. Bu bitkilerin tohum üretimi amacıyla yetiştirilmesini de kapsamaktadır. @tr
preferred label: Отглеждане на многогодишни насаждения @bg
preferred label: Pěstování trvalých plodin @cs
preferred label: Dyrkning af flerårige afgrøder @da
preferred label: Anbau mehrjähriger Pflanzen @de
preferred label: Πολυετείς καλλιέργειες @el
preferred label: Cultivos perennes @es
preferred label: Mitmeaastaste taimede kasvatus @et
preferred label: Monivuotisten kasvien viljely @fi
preferred label: Cultures permanentes @fr
preferred label: Évelő növény termesztése
preferred label: Coltivazione di colture permanenti @it
preferred label: Daugiamečių augalų auginimas @lt
preferred label: Daudzgadīgo kultūru audzēšana @lv
preferred label: Tkabbir ta' għelejjel perenni @mt
preferred label: Teelt van meerjarige gewassen @nl
preferred label: Dyrking av flerårige vekster @no
preferred label: Uprawa roślin wieloletnich @pl
preferred label: Culturas permanentes @pt
preferred label: Cultivarea plantelor din culturi permanente @ro
preferred label: Выращивание многолетних культур @ru
preferred label: Pestovanie trvácnych plodín @sk
preferred label: Gojenje trajnih nasadov @sl
preferred label: Odling av fleråriga växter @sv
preferred label: Çok yıllık (uzun ömürlü) bitkisel ürünlerin yetiştirilmesi @tr
broader: Crop and animal production, hunting and related service activities
narrower: Growing of grapes
narrower: Growing of tropical and subtropical fruits
narrower: Growing of citrus fruits
narrower: Growing of pome fruits and stone fruits
narrower: Growing of other tree and bush fruits and nuts
narrower: Growing of oleaginous fruits
narrower: Growing of beverage crops
narrower: Growing of spices, aromatic, drug and pharmaceutical crops
narrower: Growing of other perennial crops

Growing of grapes
type: Concept
notation: 01.21
status: valid
status modified: 2013-10-18
accepted date: 2013-10-18
in scheme: Statistical Classification of Economic Activities in the European Community, Rev. 2 (2008)
scope note: - отглеждане на винено и десертно грозде - производство на вино от грозде собствено производство, когато приходите от тази дейност превишават тези, от отглеждането на грозде - 11.02 @bg
scope note: Z: - pěstování vinných hroznů na vinicích N: - výrobu vína z vinných hroznů (11.02) @cs
scope note: Diese Klasse umfasst: - Anbau von Wein- und Tafeltrauben in Rebanlagen Diese Klasse umfasst nicht: - Herstellung von Traubenwein (s. 11.02) @de
scope note: This class includes: - growing of wine grapes and table grapes in vineyards This class excludes: - manufacture of wine, see 11.02 @en
scope note: Esta clase comprende: - el cultivo de uva de para producción de vino y de uva de mesa en viñedos Esta clase no comprende: - la elaboración de vinos (véase 11.02) @es
scope note: Cette classe comprend: - la production de raisins de cuve et de raisins de table dans des vignobles Cette classe ne comprend pas: - la production de vins, voir 11.02 @fr
scope note: Ovaj razred uključuje: - uzgoj vinskoga i stolnoga grožđa u vinogradima Ovaj razred isključuje: - proizvodnju vina od grožđa, vidi 11.02
scope note: Į šią klasę įeina: - vynui gaminti naudojamų vynuogių ir valgomųjų vynuogių auginimas vynuogynuose Į šią klasę neįeina: - vyno gamyba, žr. 11.02 @lt
scope note: Этот класс включает: - выращивание тропических и субтропических фруктов: • авокадо • бананы и овощные бананы • финики • инжир • манго • папайя • ананасы • прочие тропические и субтропические фрукты @ru
scope note: Bu sınıf aşağıdakileri kapsamaktadır; - üzüm bağlarında şaraplık üzüm ve sofralık üzüm yetiştirilmesi. Kapsam dışı olanlar; - şarap imalatı, bkz. 11.02. @tr
preferred label: Отглеждане на грозде @bg
preferred label: Pěstování vinných hroznů @cs
preferred label: Dyrkning af druer @da
preferred label: Anbau von Wein- und Tafeltrauben @de
preferred label: Καλλιέργεια σταφυλιών @el
preferred label: Cultivo de la vid @es
preferred label: Viinamarjakasvatus @et
preferred label: Rypäleiden viljely @fi
preferred label: Culture de la vigne @fr
preferred label: Szőlőtermesztés
preferred label: Coltivazione di uva @it
preferred label: Vynuogių auginimas @lt
preferred label: Vīnogu audzēšana @lv
preferred label: Tkabbir ta' għeneb @mt
preferred label: Teelt van druiven @nl
preferred label: Dyrking av druer @no
preferred label: Uprawa winogron @pl
preferred label: Viticultura @pt
preferred label: Cultivarea strugurilor @ro
preferred label: Выращивание винограда @ru
preferred label: Pestovanie hrozna @sk
preferred label: Vinogradništvo @sl
preferred label: Odling av druvor @sv
preferred label: Üzüm yetiştirilmesi @tr
broader: Growing of perennial crops

Growing of tropical and subtropical fruits
type: Concept
notation: 01.22
status: valid
status modified: 2013-10-18
accepted date: 2013-10-18
in scheme: Statistical Classification of Economic Activities in the European Community, Rev. 2 (2008)
scope note: - отглеждане на тропични и субтропични плодове: • авокадо • банани • фурми • смокини • манго • папая • ананас • други тропични и субтропични плодове @bg
scope note: Z: - pěstování tropického a subtropického ovoce: • avokád • banánů a plantejnů (zeleninových banánů) • datlí • fíků • manga • papaji • ananasu • jiného tropického a subtropického ovoce @cs
scope note: Diese Klasse umfasst: - Anbau von tropischen und subtropischen Früchten: • Avocados • Bananen und Mehlbananen • Datteln • Feigen • Mangofrüchte • Papayafrüchte • Ananas • andere tropische und subtropische Früchte @de
scope note: This class includes: - growing of tropical and subtropical fruits: • avocados • bananas and plantains • dates • figs • mangoes • papayas • pineapples • other tropical and subtropical fruits @en
scope note: Esta clase comprende: - el cultivo de frutas tropicales y subtropicales: • aguacates • plátanos y llantenes • dátiles • higos • mangos • papayas • piñas • otras frutas tropicales y subtropicales @es
scope note: Cette classe comprend: - la culture de fruits tropicaux et subtropicaux • avocats • bananes et plantains • dattes • figues • mangues • papayes • ananas • autres fruits tropicaux et subtropicaux @fr
scope note: Ovaj razred uključuje: - uzgoj tropskog i suptropskog voća: • avokada • banana (stolnih i za preradu) • datulja • smokvi • manga • papaje • ananasa • ostalog tropskog i suptropskog voća
scope note: Į šią klasę įeina: - tropinių ir subtropinių vaisių ir uogų auginimas: • avokadų • bananų ir plantanų • datulių • figų • mangų • amerikinių papajų • ananasų • kitų tropinių ir subtropinių vaisių ir uogų @lt
scope note: Этот класс включает: - выращивание цитрусовых фруктов: • грейпфрута и помело • лимонов и лайма • апельсинов • мандаринов всех видов • прочих цитрусовых фруктов @ru
scope note: Bu sınıf aşağıdakileri kapsamaktadır; - tropikal ve subtropikal meyvelerin yetiştirilmesi; • avokado, • muz ve plantain (bir tür muz), • hurma, • incir, • mango, • papaya, • ananas, • diğer tropikal ve subtropikal meyveler. @tr
preferred label: Отглеждане на тропични и субтропични плодове @bg
preferred label: Pěstování tropického a subtropického ovoce @cs
preferred label: Dyrkning af tropiske og subtropiske frugter @da
preferred label: Anbau von tropischen und subtropischen Früchten @de
preferred label: Καλλιέργεια τροπικών και υποτροπικών φρούτων @el
preferred label: Cultivo de frutos tropicales y subtropicales @es
preferred label: Troopiliste ja subtroopiliste viljade kasvatus @et
preferred label: Trooppisten ja subtrooppisten hedelmien viljely @fi
preferred label: Culture de fruits tropicaux et subtropicaux @fr
preferred label: Trópusi gyümölcs termesztése
preferred label: Coltivazione di frutta di origine tropicale e subtropicale @it
preferred label: Tropinių ir subtropinių vaisių ir uogų auginimas @lt
preferred label: Tropu un subtropu augļu audzēšana @lv
preferred label: Tkabbir ta' frott tropikali u subtropikali @mt
preferred label: Teelt van tropisch en subtropisch fruit @nl
preferred label: Dyrking av tropiske og subtropiske frukter @no
preferred label: Uprawa drzew i krzewów owocowych tropikalnych i podzwrotnikowych @pl
preferred label: Cultura de frutos tropicais e subtropicais @pt
preferred label: Cultivarea fructelor tropicale şi subtropicale @ro
preferred label: Выращивание тропических и субтропических фруктов @ru
preferred label: Pestovanie tropického a subtropického ovocia @sk
preferred label: Gojenje tropskega in subtropskega sadja @sl
preferred label: Odling av tropiska och subtropiska frukter @sv
preferred label: Tropikal ve subtropikal meyvelerin yetiştirilmesi @tr
broader: Growing of perennial crops

Growing of citrus fruits
type: Concept
notation: 01.23
status: valid
status modified: 2013-10-18
accepted date: 2013-10-18
in scheme: Statistical Classification of Economic Activities in the European Community, Rev. 2 (2008)
scope note: - отглеждане на цитрусови плодове: • грейпфрут и помело • лимони и сладки лимони • портокали • мандарини и нейните хибриди (тангерини, сатсумаси, клементини и други) • други цитрусови плодове @bg
scope note: Z: - pěstování citrusových plodů: • grapefruitů, vč. pomel (šedoků) • citronů a limet • pomerančů • tangerinek, mandarinek, klementinek • jiných citrusových plodů @cs
scope note: Diese Klasse umfasst: - Anbau von Zitrusfrüchten: • Pampelmusen, Pomelos und Grapefruits • Zitronen und Limetten • Orangen • Tangerinen, Mandarinen, Klementinen • andere Zitrusfrüchte @de
scope note: This class includes: - growing of citrus fruits: • grapefruit and pomelo • lemons and limes • oranges • tangerines, mandarins and clementines • other citrus fruits @en
scope note: Esta clase comprende: - el cultivo de agrios: • toronjas y pomelos • limones y limas • naranjas • tangerinas, mandarinas y clementinas • otros agrios @es
scope note: Cette classe comprend: - la culture d’agrumes • pamplemousses et pomelos • citrons et limettes • oranges • tangerines, mandarines et clémentines • autres agrumes @fr
scope note: Ovaj razred uključuje: - uzgoj agruma: • grejpa i pomela • limuna i limeta • naranči • tangerina, mandarina i klementina • ostalih agruma
scope note: Į šią klasę įeina: - citrusų vaisių auginimas: • greipfrutų ir didžiųjų greipfrutų • citrinų ir saldžiųjų citrinų • apelsinų • tikrųjų mandarinų, mandarinų ir klementinų • kitų citrusinių vaisių @lt
scope note: Этот класс включает: - выращивание семечковых и косточковых плодов: • яблок • абрикос • вишни и черешни • персиков и гладких персиков • груш и айвы • сливы и терна • прочих видов семечковых и косточковых плодов @ru
scope note: Bu sınıf aşağıdakileri kapsamaktadır; - turunçgillerin yetiştirilmesi; • greyfurt ve pomelo, • limon ve misket limonu, • portakal, • tangerin(Amerika ile Güney Afrika`da yetişen bir tür mandalina), mandalina ve klementin (Akdeniz ile güney Afrika`da yetişen bir tür mandalina), • diğer turunçgiller. @tr
preferred label: Отглеждане на цитрусови плодове @bg
preferred label: Pěstování citrusových plodů @cs
preferred label: Dyrkning af citrusfrugter @da
preferred label: Anbau von Zitrusfrüchten @de
preferred label: Καλλιέργεια εσπεριδοειδών @el
preferred label: Cultivo de cítricos @es
preferred label: Tsitruseliste kasvatus @et
preferred label: Sitrushedelmien viljely @fi
preferred label: Culture d'agrumes @fr
preferred label: Citrusféle termesztése
preferred label: Coltivazione di agrumi @it
preferred label: Citrusų vaisių auginimas @lt
preferred label: Citrusaugļu audzēšana @lv
preferred label: Tkabbir ta' frott taċ-ċitru @mt
preferred label: Teelt van citrusvruchten @nl
preferred label: Dyrking av sitrusfrukter @no
preferred label: Uprawa drzew i krzewów owocowych cytrusowych @pl
preferred label: Cultura de citrinos @pt
preferred label: Cultivarea fructelor citrice @ro
preferred label: Выращивание цитрусовых фруктов @ru
preferred label: Pestovanie citrusových plodov @sk
preferred label: Gojenje citrusov @sl
preferred label: Odling av citrusfrukter @sv
preferred label: Turunçgillerin yetiştirilmesi @tr
broader: Growing of perennial crops

Growing of pome fruits and stone fruits
type: Concept
notation: 01.24
status: valid
status modified: 2013-10-18
accepted date: 2013-10-18
in scheme: Statistical Classification of Economic Activities in the European Community, Rev. 2 (2008)
scope note: - отглеждане на семкови и костилкови плодове: • ябълки • кайсии • череши и вишни • праскови и нектарини • круши и дюли • сливи и трънки • други семкови и костилкови плодове @bg
scope note: Z: - pěstování jádrového a peckového ovoce: • jablek • meruněk • třešní a višní • broskví a nektarinek • hrušek a kdoulí • švestek a trnek • jiného jádrového a peckového ovoce @cs
scope note: Diese Klasse umfasst: - Anbau von Kern- und Steinobst: • Äpfel • Aprikosen/Marillen • Kirschen • Pfirsiche und Nektarinen • Birnen und Quitten • Pflaumen/Zwetschken und Schlehen • anderes Kern- und Steinobst @de
scope note: This class includes: - growing of pome fruits and stone fruits: • apples • apricots • cherries and sour cherries • peaches and nectarines • pears and quinces • plums and sloes • other pome fruits and stone fruits @en
scope note: Esta clase comprende: - el cultivo de frutas de pepita y frutas de hueso: • manzanas • albaricoques • cerezas y guindas • melocotones y nectarinas • peras y membrillos • ciruelas y endrinas • otras frutas de pepita y de hueso @es
scope note: Cette classe comprend: - la culture de fruits à pépins et à noyau: • pommes • abricots • cerises et griottes • pêches et nectarines • poires et coings • prunes et prunelles • autres fruits à pépins et à noyau @fr
scope note: Ovaj razred uključuje: - uzgoj jezgričavog i koštuničavog voća: • jabuka • marelica • trešanja i višanja • bresaka i nektarina • krušaka i dunja • šljiva i trnjine • ostalog jezgričavog i koštuničavog voća
scope note: Į šią klasę įeina: - sėklavaisių ir kaulavaisių auginimas: • obuolių • abrikosų • vyšnių ir paprastųjų vyšnių • persikų ir nektarinų • kriaušių ir svarainių • slyvų ir dygiųjų slyvų • kitų sėklavaisių ir kaulavaisių @lt
scope note: Этот класс включает: - выращивание ягод: • черники/голубики • смородины • крыжовника • киви • малины • клубники/земляники • прочих видов ягод - выращивание семян плодов - выращивание съедобных орехов: • миндаля • кешью • каштанов • фундука/лесного ореха • фисташек • грецкого ореха • прочих видов орехов - выращивание прочих видов плодовых деревьев и кустарников: • плодов рожкового дерева Этот класс исключает: - выращивание кокосовых орехов, см. 01.26 @ru
scope note: Bu sınıf aşağıdakileri kapsamaktadır; - yumuşak çekirdekli meyvelerin ve sert çekirdekli meyvelerin yetiştirilmesi; • elma, • kayısı, • kiraz ve vişne, • şeftali ve nektarın, • armut ve ayva, • erik, çakal eriği, dağ eriği, • diğer yumuşak çekirdekli meyveler ve sert çekirdekli @tr
preferred label: Отглеждане на семкови и костилкови плодове @bg
preferred label: Pěstování jádrového a peckového ovoce @cs
preferred label: Dyrkning af kernefrugter og stenfrugter @da
preferred label: Anbau von Kern- und Steinobst @de
preferred label: Καλλιέργεια μηλοειδών και πυρηνόκαρπων @el
preferred label: Cultivo de frutos con hueso y pepitas @es
preferred label: Õunviljaliste ja luuviljaliste puuviljade kasvatus @et
preferred label: Omenoiden, kirsikoiden, luumujen ym. kota- ja kivihedelmien viljely @fi
preferred label: Culture de fruits à pépins et à noyau @fr
preferred label: Almatermésű, csonthéjas termesztése
preferred label: Coltivazione di pomacee e frutta a nocciolo @it
preferred label: Sėklavaisių ir kaulavaisių auginimas @lt
preferred label: Sēkleņu un kauleņu audzēšana @lv
preferred label: Tkabbir ta' frott pomaċi u frott bl-għadma @mt
preferred label: Teelt van pit- en steenvruchten @nl
preferred label: Dyrking av kjernefrukter og steinfrukter @no
preferred label: Uprawa drzew i krzewów owoców ziarnkowych i pestkowych @pl
preferred label: Cultura de pomóideas e de prunóideas @pt
preferred label: Cultivarea fructelor seminţoase şi sâmburoase @ro
preferred label: Выращивание семечковых и косточковых плодов @ru
preferred label: Pestovanie jadrového a kôstkového ovocia @sk
preferred label: Gojenje pečkatega in koščičastega sadja @sl
preferred label: Odling av kärnfrukter och stenfrukter @sv
preferred label: Yumuşak çekirdekli meyvelerin ve sert çekirdekli meyvelerin yetiştirilmesi @tr
broader: Growing of perennial crops

Growing of other tree and bush fruits and nuts
type: Concept
notation: 01.25
status: valid
status modified: 2013-10-18
accepted date: 2013-10-18
in scheme: Statistical Classification of Economic Activities in the European Community, Rev. 2 (2008)
scope note: - отглеждане на плодове от ягодоплодни растения: • боровинки • френско грозде (червено, бяло, черно) • цариградско грозде • киви • малини • ягоди • други плодове от ягодоплодни растения - отглеждане на овощни растения за производство на семена - отглеждане на ядливи черупкови плодове: • бадеми • кашу • кестени • лешник • шамфъстък • орехи • други ядливи черупкови плодове - отглеждане на други плодове, некласифицирани другаде: • плодове от рожкови - отглеждане на кокосови орехи - 01.26 @bg
scope note: Z: - pěstování bobulového ovoce: • borůvek • rybízu • angreštu • kiwi • malin • jahod • ostatních bobulovin - pěstování ovocných semen - pěstování jedlých ořechů: • mandlí • oříšků kešu • jedlých kaštanů • lískových ořechů • pistáciových oříšků • vlašských ořechů • jiných ořechů - pěstování ostatního stromového a keřového ovoce a ořechů • semen rohovníku (svatojánského chleba) N: - pěstování kokosových ořechů (01.26) @cs
scope note: Diese Klasse umfasst: - Anbau von Beeren: • Blaubeeren • Johannisbeeren • Stachelbeeren • Chinesische Stachelbeeren (Kiwifrüchte) • Himbeeren • Erdbeeren • andere Beeren - Anbau von Obstsamen: - Anbau von essbaren Nüssen: • Mandeln • Kaschunüsse • Esskastanien • Haselnüsse • Pistazienkerne • Walnüsse • andere Nüsse - Anbau von sonstigem Baum- und Strauchobst • Johannisbrotsamen Diese Klasse umfasst nicht: - Anbau von Kokosnüssen (s. 01.26) @de
scope note: This class includes: - growing of berries: • blueberries • currants • gooseberries • kiwi fruit • raspberries • strawberries • other berries - growing of fruit seeds - growing of edible nuts: • almonds • cashew nuts • chestnuts • hazelnuts • pistachios • walnuts • other nuts - growing of other tree and bush fruits: • locust beans This class excludes: - growing of coconuts, see 01.26 @en
scope note: Esta clase comprende: - el cultivo de bayas: • arándanos • grosellas • grosella espinosa • kiwis • frambuesas • fresas • otras bayas - el cultivo de semillas de frutas - el cultivo de frutos secos comestibles • almendras • anacardos • castañas • avellanas • pistachos • nueces • otros frutos secos - el cultivo de otras frutas de árbol y de arbusto • algarrobas Esta clase no comprende: - el cultivo de cocos (véase 01.26) @es
scope note: Cette classe comprend: - la culture de baies: • myrtilles • groseilles • groseilles à maquereaux • kiwis • framboises • fraises • autres baies - la production de semences de fruits - la production de fruits à coque comestibles: • amandes • noix de cajou • châtaignes • noisettes • pistaches • noix communes • autres fruits à coques - la culture d’autres fruits d’arbres ou d’arbustes • caroubes Cette classe ne comprend pas: - la culture de la noix de coco, voir 01.26 @fr
scope note: Ovaj razred uključuje: - uzgoj bobičastog voća: • borovnica • ribizla • ogrozda • kivija • malina • jagoda • ostaloga bobičastog voća - uzgoj sjemenja voća - uzgoj orašastog voća: • badema • indijskog oraščića • kestena • lješnjaka • pistacija • oraha • ostalog orašastog voća - uzgoj bobičastog i ostalog voća: • rogača Ovaj razred isključuje: - uzgoj kokosovog oraha, vidi 01.26
scope note: Į šią klasę įeina: - uogų auginimas: • šilauogių • serbentų • agrastų • kivi • aviečių • braškių ir žemuogių • kitų uogų - vaisių sėklų gavyba - valgomųjų riešutų auginimas: • migdolų • anakardžio riešutų • kaštainių • lazdyno riešutų • pistacijų • graikinių riešutų • kitų riešutų - kitų vaismedžių ir uogakrūmių vaisių auginimas: • kopalmedžio pupelių Į šią klasę neįeina: - riešutinių kokosų auginimas, žr. 01.26 @lt
scope note: Этот класс включает: - выращивание масленичных фруктов: • кокосового ореха • оливок • гвинейской масличной пальмы • прочих видов масленичных фруктов Этот класс исключает: - выращивание соевых бобов, земляных орехов и прочих масличных семян, см. 01.11 @ru
scope note: Bu sınıf aşağıdakileri kapsamaktadır; - üzümsü meyvelerin yetiştirilmesi; • yaban mersini, • kuş üzümü, • bektaşi üzümü, • kivi meyvesi, • ahududu (frambuaz), • çilek, • diğer üzümsü meyveler, • nar, - meyve tohumu yetiştirilmesi, - yenilebilir sert kabuklu meyvelerin (fındık, ceviz, vs) yetiştirilmesi; • badem, • kaju (maun cevizi, kaju cevizi, anakardiyum), • kestane, • fındık, • fıstık, • ceviz, • diğer sert kabuklu meyveler, - diğer ağaç ve çalı meyvelerinin yetiştirilmesi, • keçi boynuzu. Kapsam dışı olanlar; - hindistan cevizi yetiştirilmesi, bkz. 01.26. @tr
preferred label: Отглеждане на черупкови, ягодоплодни и други плодове @bg
preferred label: Pěstování ostatního stromového a keřového ovoce a ořechů @cs
preferred label: Dyrkning af andre træfrugter, bær og nødder @da
preferred label: Anbau von sonstigem Obst und Nüssen @de
preferred label: Άλλες δενδρώδεις και θαμνώδεις καλλιέργειες φρούτων και καρπών με κέλυφος @el
preferred label: Cultivo de otros árboles y arbustos frutales y frutos secos @es
preferred label: Muu puuvilja-, marja- ning pähklikasvatus @et
preferred label: Marjojen, pähkinöiden ja muiden puissa ja pensaissa kasvavien hedelmien viljely @fi
preferred label: Culture d'autres fruits d'arbres ou d'arbustes et de fruits à coque @fr
preferred label: Egyéb gyümölcs, héjastermésű termesztése
preferred label: Coltivazione di altri alberi da frutta, frutti di bosco e in guscio @it
preferred label: Kitų vaismedžių, uogakrūmių ir riešutmedžių vaisių auginimas @lt
preferred label: Citu koku un krūmu augļu un riekstu audzēšana @lv
preferred label: Tkabbir ta' frott ieħor tas-siġar u ta' l-arbuxxell u ġewż @mt
preferred label: Teelt van andere boomvruchten, kleinfruit en noten @nl
preferred label: Dyrking av annen frukt som vokser på trær eller busker samt nøtter @no
preferred label: Uprawa pozostałych drzew i krzewów owocowych oraz orzechów @pl
preferred label: Cultura de outros frutos (incluindo de casca rija) em árvores e arbustos @pt
preferred label: Cultivarea fructelor arbuştilor fructiferi, căpşunilor, nuciferilor şi a altor pomi fructiferi @ro
preferred label: Выращивание прочих видов плодовых деревьев, кустарников и орехов @ru
preferred label: Pestovanie ostatného stromového a kríkového ovocia a orechov @sk
preferred label: Gojenje drugih sadnih dreves in grmovnic @sl
preferred label: Odling av andra frukter, bär samt nötter @sv
preferred label: Diğer ağaç ve çalı meyvelerinin ve sert kabuklu meyvelerin yetiştirilmesi @tr
broader: Growing of perennial crops

Growing of oleaginous fruits
type: Concept
notation: 01.26
status: valid
status modified: 2013-10-18
accepted date: 2013-10-18
in scheme: Statistical Classification of Economic Activities in the European Community, Rev. 2 (2008)
scope note: - отглеждане на маслосъдържащи плодове: • кокосови орехи • маслини • производство на маслинено масло от маслини собствено производство, когато приходите от тази дейност не превишават тези от отглеждането на маслини • орехи и ядки от маслодайни палми • други маслосъдържащи плодове - отглеждане на соя, фъстъци и други маслодайни семена - 01.11 @bg
scope note: Z: - pěstování olejnatých plodů: • kokosových ořechů • oliv • palem olejných • ostatních olejnatých plodů N: - pěstování sojových bobů, plodů podzemnice olejné a jiných olejnatých semen (01.11) @cs
scope note: Diese Klasse umfasst: - Anbau von ölhaltigen Früchten • Kokosnüsse • Oliven • Ölpalmen • sonstige ölhaltige Früchte Diese Klasse umfasst nicht: - Anbau von Sojabohnen, Erdnüssen und anderen Ölsaaten (s. 01.11) @de
scope note: This class includes: - growing of oleaginous fruits: • coconuts • olives • oil palms • other oleaginous fruits This class excludes: - growing of soya beans, groundnuts and other oil seeds, see 01.11 @en
scope note: Esta clase comprende: - el cultivo de frutos oleaginosos: • cocos • aceitunas • palma de aceite • otros frutos oleaginosos Esta clase no comprende: - el cultivo de habas de soja, cacahuetes y otras semillas oleaginosas (véase 01.11) @es
scope note: Cette classe comprend: - la culture de fruits oléagineux: • noix de coco • olives • palmiers à huile • autres fruits oléagineux Cette classe ne comprend pas: - la culture de fèves de soja, d’arachides et d’autres graines oléagineuses, voir 01.11 @fr
scope note: Ovaj razred uključuje: - uzgoj uljanih plodova: • kokosovog oraha • maslina • uljanih palmi • ostalih uljanih plodova Ovaj razred isključuje: - uzgoj sjemenja soje, kikirikija i ostaloga uljanog sjemenja, vidi 01.11
scope note: Į šią klasę įeina: - aliejinių augalų vaisių ir uogų auginimas: • riešutinių kokosų • alyvuogių • alyvpalmių • kitų aliejinių augalų vaisių ir uogų Į šią klasę neįeina: - sojos pupelių, žemės riešutų ir kitų aliejingųjų sėklų augalų auginimas, žr. 01.11 @lt
scope note: Этот класс включает: - выращивание культур для производства напитков: • кофе • чая • мате • какао • прочих видов культур для приготовления напитков @ru
scope note: Bu sınıf aşağıdakileri kapsamaktadır; - yağlı meyvelerin yetiştirilmesi; • Hindistan cevizi, • zeytin, • hurma palmiyeleri, • diğer yağlı meyveler. Kapsam dışı olanlar; - soya fasulyesi, yerfıstığı ve diğer yağlı tohumların yetiştirilmesi, bkz. 01.11. @tr
preferred label: Отглеждане на маслосъдържащи плодове @bg
preferred label: Pěstování olejnatých plodů @cs
preferred label: Dyrkning af olieholdige frugter @da
preferred label: Anbau von ölhaltigen Früchten @de
preferred label: Καλλιέργεια ελαιωδών καρπών @el
preferred label: Cultivo de frutos oleaginosos @es
preferred label: Õlitaimede kasvatus @et
preferred label: Öljyä sisältävien hedelmien viljely @fi
preferred label: Culture de fruits oléagineux @fr
preferred label: Olajtartalmú gyümölcs termesztése
preferred label: Coltivazione di frutti oleosi @it
preferred label: Aliejinių augalų vaisių ir uogų auginimas @lt
preferred label: Eļļas augu audzēšana @lv
preferred label: Tkabbir ta' frott żejtni @mt
preferred label: Teelt van oliehoudende vruchten @nl
preferred label: Dyrking av oljeholdige frukter @no
preferred label: Uprawa drzew oleistych @pl
preferred label: Cultura de frutos oleaginosos @pt
preferred label: Cultivarea fructelor oleaginoase @ro
preferred label: Выращивание масленичных фруктов @ru
preferred label: Pestovanie olejnatého ovocia @sk
preferred label: Pridelovanje oljnih sadežev @sl
preferred label: Odling av oljehaltiga frukter @sv
preferred label: Yağlı meyvelerin yetiştirilmesi @tr
broader: Growing of perennial crops

Growing of beverage crops
type: Concept
notation: 01.27
status: valid
status modified: 2013-10-18
accepted date: 2013-10-18
in scheme: Statistical Classification of Economic Activities in the European Community, Rev. 2 (2008)
scope note: - отглеждане на растения за напитки: • кафе • чай • мате • какао • други растения за напитки @bg
scope note: Z: - pěstování rostlin pro výrobu nápojů: • kávy • čaje • maté • kakaa • ostatních rostlin pro výrobu nápojů @cs
scope note: Diese Klasse umfasst: - Anbau von Pflanzen zur Herstellung von Getränken: • Kaffee • Tee • Mate • Kakao • sonstige Pflanzen zur Herstellung von Getränken @de
scope note: This class includes: - growing of beverage crops: • coffee • tea • maté • cocoa • other beverage crops @en
scope note: Esta clase comprende: - el cultivo de plantas para bebidas: • café • té • mate • cacao • otras plantas para bebidas @es
scope note: Cette classe comprend: - la culture de plantes à boissons: • café • thé • maté • cacao • autres plantes à boissons @fr
scope note: Ovaj razred uključuje: - uzgoj usjeva za pripremanje napitaka: • kave • čaja • mate-čaja • kakaa • ostalih usjeva za pripremanje napitaka
scope note: Į šią klasę įeina: - gėrimams gaminti naudojamų augalų auginimas: • kavos • arbatos • mate • kakavos • kitų gėrimams gaminti naudojamų augalų @lt
scope note: Этот класс включает: - выращивание многолетних и не многолетних приправ и ароматических культур: • перца (piper sop.) • чили и паприки (capsicum sop.) • мускатного ореха, кардамона и видов ароматных специй, изготовленных из сушеной шелухи мускатного ореха • аниса, базилика и фенхеля • корицы • гвоздики • имбиря • ванили • хмеля • прочих видов приправ и ароматических культур - выращивание сильнодействующих и наркотических культур @ru
scope note: Bu sınıf aşağıdakileri kapsamaktadır; - içecek üretiminde kullanılan bitkisel ürünlerin yetiştirilmesi; • kahve, • çay, • Paraguay çayı (maté), • kakao, • içecek üretiminde kullanılan diğer bitkisel ürünler. @tr
preferred label: Отглеждане на растения за напитки @bg
preferred label: Pěstování rostlin pro výrobu nápojů @cs
preferred label: Dyrkning af planter til fremstilling af drikkevarer @da
preferred label: Anbau von Pflanzen zur Herstellung von Getränken @de
preferred label: Καλλιέργεια φυτών για αφεψήματα @el
preferred label: Cultivo de plantas para bebidas @es
preferred label: Joogitaimekasvatus @et
preferred label: Juomakasvien viljely @fi
preferred label: Culture de plantes à boissons @fr
preferred label: Italgyártási növény termesztése
preferred label: Coltivazione di piante per la produzione di bevande @it
preferred label: Gėrimams gaminti vartojamų augalų auginimas @lt
preferred label: Dzērienu ražošanā izmantojamo kultūru audzēšana @lv
preferred label: Tkabbir ta' għelejjel li minnhom isiru xarbiet @mt
preferred label: Teelt van gewassen bestemd voor de vervaardiging van dranken @nl
preferred label: Dyrking av vekster for produksjon av drikkevarer @no
preferred label: Uprawa roślin służących do produkcji napojów @pl
preferred label: Cultura de plantas destinadas à preparação de bebidas @pt
preferred label: Cultivarea plantelor pentru prepararea băuturilor @ro
preferred label: Выращивание культур для производства напитков @ru
preferred label: Pestovanie nápojových plodín @sk
preferred label: Gojenje rastlin za izdelavo napitkov @sl
preferred label: Odling av växter för dryckesframställning @sv
preferred label: İçecek üretiminde kullanılan bitkisel ürünlerin yetiştirilmesi @tr
broader: Growing of perennial crops

Growing of spices, aromatic, drug and pharmaceutical crops
type: Concept
notation: 01.28
status: valid
status modified: 2013-10-18
accepted date: 2013-10-18
in scheme: Statistical Classification of Economic Activities in the European Community, Rev. 2 (2008)
scope note: - отглеждане на трайни насаждения и едногодишни растения, използвани като подправки, и етеричномаслени растения: • черен пипер • лютив и сладък червен пипер за подправка (capsicum sop.) • индийско орехче (мускатов орех), кора (обвивки) от мускатов орех и кардамон • анасон, звезден анасон и копър • канела • карамфил • джинджифил • ванилия • хмел • други трайни насаждения и едногодишни растения, използвани като подправки, и етеричномаслени растения - отглеждане на лечебни растения @bg
scope note: Z: - pěstování netrvalých i trvalých rostlin koření a aromatických rostlin: • pepře (piper spp.) • papriky (Capsicum spp.) • muškátového oříšku, muškátového květu, amomu a kardamomu • anýzu, badyánu a fenyklu • skořice • hřebíčku • zázvoru • vanilky • chmele • ostatního koření a aromatických rostlin - pěstování rostlin za účelem výroby léčiv a narkotik @cs
scope note: Diese Klasse umfasst: - Anbau von ein- und mehrjährigen Gewürz- und Duftpflanzen: • Pfeffer (piper spp.) • Paprika (Capsicum spp.) • Muskatnüsse, Muskatblüte, Amomen und Kardamomen • Anis-, Sternanis- und Fenchelfrüchte • Zimt • Gewürznelken • Ingwer • Vanille • Hopfen • sonstige Gewürz- und Duftpflanzen - Anbau von Pflanzen für die Gewinnung von Arzneimitteln und Drogen @de
scope note: This class includes: - growing of perennial and non-perennial spices and aromatic crops: • pepper (piper sop.) • chillies and peppers (capsicum sop.) • nutmeg, mace and cardamoms • anise, badian and fennel • cinnamon (canella) • cloves • ginger • vanilla • hops • other spices and aromatic crops - growing of drug and narcotic crops @en
scope note: Esta clase comprende: - el cultivo de plantas aromáticas y especias perennes y no perennes: • pimienta (piper sop.) • chiles y pimientos (capsicum sop.) • nuez moscada, macis y cardamomo • anís, anís estrellado e hinojo • canela • clavo • jengibre • vainilla • lúpulos • otras plantas aromáticas y especias - el cultivo de plantas para la elaboración de fármacos y narcóticos @es
scope note: Cette classe comprend: - les cultures permanentes et non permanentes de plantes à épices et aromatiques: • poivre • piments et poivrons • noix muscades, macis, amomes et cardamomes • anis, badiane et fenouil • cannelle • clous de girofle • gingembre • vanille • houblon • autres plantes à épices et aromatiques - la culture de plantes médicinales et narcotiques @fr
scope note: Ovaj razred uključuje: - uzgoj jednogodišnjeg i višegodišnjeg začinskog i aromatskog bilja: • papra • feferona i paprike • muškatnog oraščića, macisa i kardamona • anisa, zvjezdastog anisa i koromača • cimeta • mirte • đumbira • vanilije • hmelja • ostalih začinskih i aromatskih usjeva - uzgoj ljekovitih i opojnih biljaka
scope note: Į šią klasę įeina: - prieskoninių ir kvapiųjų vienmečių ir daugiamečių augalų auginimas: • pipirų (piper sop.) • ankštinių pipirų, vienamečių paprikų • muskato riešutų ir kevalų, kardamono • anyžinės ožiažolės, tikrojo žvaigždanyžio ir pankolių • cinamono (canella) • tikrojo gvazdikėlio • imbiero • vanilės • apynių • kitų prieskoninių ir kvapiųjų augalų - vaistinių ir narkotinių augalų auginimas @lt
scope note: Этот класс включает: - выращивание каучуковых деревьев для сбора латекса - выращивание новогодних/рождественских елок - выращивание деревьев для получения сока - выращивание растений, пригодных для плетения Этот класс исключает: - выращивание цветов, производство цветов в бутонах и семян цветов, см. 01.19 - сбор древесного сока или смолы с дикорастущих деревьев, см. 02.30 @ru
scope note: Bu sınıf aşağıdakileri kapsamaktadır; - tek ve çok yıllık baharatların ve aromatik (ıtırlı) bitkisel ürünlerin yetiştirilmesi; • beyaz, kara biber (piper türü ve alt türleri), • küçük ve acı biberler ve baharatlık diğer biberler (capsicum türleri ve alt türleri), • muskat (küçük Hindistan cevizi), baharat olarak kullanılan Hindistan cevizi kabuğu kurusu ve kakule, • anason, Çin anasonu ve rezene, • tarçın, • karanfil, • zencefil, • vanilya, • şerbetçiotu, • diğer baharatlar ve aromatik (ıtırlı) ürünler, - ilaç ve uyuşturucu nitelikteki ürünlerin yetiştirilmesi. @tr
preferred label: Отглеждане на подправки, етеричномаслени и лечебни растения @bg
preferred label: Pěstování koření a aromatických, léčivých a farmaceutických rostlin @cs
preferred label: Dyrkning af krydderiplanter, aromaplanter og lægeplanter @da
preferred label: Anbau von Gewürzpflanzen, Pflanzen für aromatische, narkotische und pharmazeutische Zwecke @de
preferred label: Καλλιέργεια καρυκευτικών, αρωματικών, θεραπευτικών και φαρμακευτικών φυτών @el
preferred label: Cultivo de especias, plantas aromáticas, medicinales y farmacéuticas @es
preferred label: Vürtsi-, maitse-, uimastavate taimede ja ravimtaimede kasvatus @et
preferred label: Mauste-, aromi-, rohdos- ja lääkekasvien viljely @fi
preferred label: Culture de plantes à épices, aromatiques, médicinales et pharmaceutiques @fr
preferred label: Fűszer-, aroma-, narkotikus-, gyógynövény termesztése
preferred label: Coltivazione di spezie, piante aromatiche e farmaceutiche @it
preferred label: Prieskoninių, kvapiųjų, vaistinių ir kitokių farmacijos pramonėje naudojamų augalų auginimas @lt
preferred label: Garšaugu, aromātisko un ārstniecisko augu audzēšana @lv
preferred label: Tkabbir ta' ħwawar, għelejjel aromatiċi, għelejjel mediċinali u għelejjel farmaċewtiċi @mt
preferred label: Teelt van specerijgewassen en van aromatische en medicinale gewassen @nl
preferred label: Dyrking av krydder og aromatiske, medisinske og farmasøytiske vekster @no
preferred label: Uprawa roślin przyprawowych i aromatycznych oraz roślin do produkcji leków i wyrobów farmaceutycznych @pl
preferred label: Culturas de especiariase de plantas aromáticasmedicinais e farmacêuticas @pt
preferred label: Cultivarea condimentelor, plantelor aromatice, medicinale şi a plantelor de uz farmaceutic @ro
preferred label: Выращивание специй, ароматических, сильнодействующих наркотических и фармацевтических культур @ru
preferred label: Pestovanie korenín, aromatických, liečivých a farmaceutických plodín @sk
preferred label: Gojenje začimbnih, aromatskih in zdravilnih rastlin @sl
preferred label: Odling av kryddväxter, drog- och medicinalväxter @sv
preferred label: Baharatlık, aromatik (ıtırlı), uyuşturucu nitelikte ve eczacılıkla ilgili bitkisel ürünlerin yetiştirilmesi @tr
broader: Growing of perennial crops

Growing of other perennial crops
type: Concept
notation: 01.29
status: valid
status modified: 2013-10-18
accepted date: 2013-10-18
in scheme: Statistical Classification of Economic Activities in the European Community, Rev. 2 (2008)
scope note: - отглеждане на каучуконосни дървета за събиране на латекс - отглеждане на коледни елхи - отглеждане на дървета за събиране на сокове, клейове, смоли - отглеждане на растителни материали от видовете, използвани главно за плетене (рогозки, в кошничарството) - отглеждане на цветя, производство на рязани цветя и цветни пъпки и отглеждане на цветя за производство на семена - 01.19 - събиране на сокове, клейове, смоли и каучукоподобни клейове (смола) в гората - 02.30 @bg
scope note: Z: - pěstování gumovníku za účelem výroby latexu - pěstování vánočních stromků - pěstování stromů za účelem získávání mízy - pěstování rostlin druhů převážně využívaných ke splétání N: - pěstování květin, produkci řezaných květin a poupat a pěstování semen květin (01.19) - získávání mízy nebo přírodní gumy podobné kaučuku z divoce rostoucích stromů (02.30) @cs
scope note: Diese Klasse umfasst: - Anbau von Gummibäumen zur Gewinnung von Latex - Forstung von Weihnachtsbäumen - Forstung von Bäumen zur Gewinnung von Pflanzensäften - Anbau von Pflanzen von der vorwiegend als Flechtwerkstoff verwendeten Art Diese Klasse umfasst nicht: - Anbau von Blumen, Erzeugung von Schnittblumen und Blütenknospen sowie Anbau von Blumensamen (s. 01.19) - Gewinnung von Pflanzensäften oder kautschukähnlichen Gummiarten aus wild wachsenden Bäumen (s. 02.30) @de
scope note: This class includes: - growing of rubber trees for harvesting of latex - growing of Christmas trees - growing of trees for extraction of sap - growing of vegetable materials of a kind used primarily for plaiting This class excludes: - growing of flowers, production of cut flower buds and growing of flower seeds, see 01.19 - gathering of tree sap or rubber-like gums in the wild, see 02.30 @en
scope note: Esta clase comprende: - el cultivo de árboles caucheros para la recolección de látex - el cultivo de árboles de navidad - el cultivo de árboles para la extracción de savia - el cultivo de materiales vegetales del tipo usado en cestería y espartería Esta clase no comprende: - el cultivo de flores, la producción de capullos de flores cortados y el cultivo de semillas de flores (véase 01.19) - la recolección de savia o gomas similares al caucho en estado silvestre (véase 02.30) @es
scope note: Cette classe comprend: - la culture d’hévéas pour la récolte de latex - la culture d’arbres de Noël - la culture d’arbres pour l’extraction de sève - la culture de matières végétales des espèces principalement utilisées en vannerie ou en sparterie Cette classe ne comprend pas: - la culture de fleurs, la production de fleurs coupées et de boutons de fleurs, voir 01.19 - la récolte de sève d’arbres ou de gommes semblables au caoutchouc en milieu naturel, voir 02.30 @fr
scope note: Ovaj razred uključuje: - uzgoj kaučukovca za dobivanje lateksa - uzgoj božićnih drvaca - uzgoj drvenastih biljaka namijenjenih za vađenje biljnog soka - uzgoj biljaka namijenjenih za izradu pletarskih proizvoda Ovaj razred isključuje: - uzgoj cvijeća, proizvodnju rezanog cvijeća i cvjetnih pupova te uzgoj sjemenja cvijeća, vidi 01.19 - skupljanje biljnog soka ili gume u šumama, vidi 02.30
scope note: Į šią klasę įeina: - kaučiukmedžio latekso gavybai auginimas - kalėdinių eglučių auginimas - medžių sulos gavybai auginimas - visų pirma skirtų pinti augalinių medžiagų auginimas Į šią klasę neįeina: - gėlių auginimas, nuskintų gėlių pumpurų gavyba ir sėklinių gėlių auginimas, žr. 01.19 - sulos arba kaučiukinių dervų rinkimas natūralioje gamtoje, žr. 02.30 @lt
scope note: Bu sınıf aşağıdakileri kapsamaktadır; - lateks elde etmek için kauçuk ağacı yetiştirilmesi, - yılbaşı ağacı yetiştirilmesi, - bitki özsuyu elde etmek amacıyla ağaç yetiştirilmesi, - örgüde kullanılan bitkisel ürünlerin yetiştiriciliği. Kapsam dışı olanlar; - çiçeklerin toplanması, kesme çiçek goncası (tomurcuğu) üretimi ve çiçek tohumu yetiştiriciliği, bkz. 01.19, - yabani ortamdaki ağaçlardan bitki özsuyu veya kauçuk benzeri sakızların (reçine) toplanması, bkz. 02.30. @tr
preferred label: Отглеждане на други многогодишни насаждения @bg
preferred label: Pěstování ostatních trvalých plodin @cs
preferred label: Dyrkning af andre flerårige afgrøder @da
preferred label: Anbau sonstiger mehrjähriger Pflanzen @de
preferred label: Άλλες πολυετείς καλλιέργειες @el
preferred label: Otros cultivos perennes @es
preferred label: Muude mitmeaastaste taimede kasvatus @et
preferred label: Muu monivuotisten kasvien viljely @fi
preferred label: Autres cultures permanentes @fr
preferred label: Egyéb évelő növény termesztése
preferred label: Coltivazione di altre colture permanenti @it
preferred label: Kitų daugiamečių augalų auginimas @lt
preferred label: Citu daudzgadīgo kultūru audzēšana @lv
preferred label: Tkabbir ta' għelejjel perenni oħra @mt
preferred label: Teelt van andere meerjarige gewassen @nl
preferred label: Dyrking av flerårige vekster ellers @no
preferred label: Uprawa pozostałych roślin wieloletnich @pl
preferred label: Outras culturas permanentes @pt
preferred label: Cultivarea altor plante permanente @ro
preferred label: Выращивание прочих многолетних культур @ru
preferred label: Pestovanie ostatných trvácnych plodín @sk
preferred label: Gojenje drugih trajnih nasadov @sl
preferred label: Odling av andra fleråriga växter @sv
preferred label: Diğer çok yıllık (uzun ömürlü) bitkisel ürünlerin yetiştirilmesi @tr
broader: Growing of perennial crops

Plant propagation
type: Concept
notation: 01.3
status: valid
status modified: 2013-10-18
accepted date: 2013-10-18
in scheme: Statistical Classification of Economic Activities in the European Community, Rev. 2 (2008)
scope note: Этот подкласс включает разведение рассады, включая подготовку побегов и семян для разведения растений или прививания деревьев и для насаждения побегов. Этот класс включает: - выращивание растений для высаживания на плантации - выращивание растений для украшения ландшафта или облагораживания территорий, включая выстилание дерном и пикирование - выращивание многолетних растений для получения луковиц, клубней и корней; отростков и побегов; грибниц - уход и обработку деревьев, за исключением ухода за лесными насаждениями Этот класс исключает: - выращивание растений для получения семян, см. 01.1, 01.2 - уход за лесными насаждениями, см. 02.10 @ru
preferred label: Дейности на разсадници, без горските @bg
preferred label: Množení rostlin @cs
preferred label: Planteformering @da
preferred label: Betrieb von Baumschulen, sowie Anbau von Pflanzen zu Vermehrungszwecken @de
preferred label: Πολλαπλασιασμός των φυτών @el
preferred label: Propagación de plantas @es
preferred label: Taimede paljundamine @et
preferred label: Taimien kasvatus ja muu kasvien lisääminen @fi
preferred label: Reproduction de plantes @fr
preferred label: Növényi szaporítóanyag termesztése
preferred label: Riproduzione delle piante @it
preferred label: Augalų dauginimas @lt
preferred label: Augu pavairošana @lv
preferred label: Propagazzjoni ta' pjanti @mt
preferred label: Plantenvermeerdering @nl
preferred label: Rozmnażanie roślin @pl
preferred label: Propagação de plantas @pt
preferred label: Cultivarea plantelor pentru înmulţire @ro
preferred label: Производство продукции питомников @ru
preferred label: Rozmnožovanie rastlín @sk
preferred label: Razmnoževanje rastlin @sl
preferred label: Odling av plantskoleväxter @sv
preferred label: Dikim için bitki yetiştirilmesi @tr
broader: Crop and animal production, hunting and related service activities
narrower: Plant propagation

Plant propagation
type: Concept
notation: 01.30
status: valid
status modified: 2013-10-18
accepted date: 2013-10-18
in scheme: Statistical Classification of Economic Activities in the European Community, Rev. 2 (2008)
scope note: Този клас включва производство на посадъчен материал от растителен произход, вкл. резници, издънки и разсади за непосредствено разпространение или за създаване на растение, присадена подложка, в която подбран филиз е присаден, за окончателно посаждане за получаване на добив (годишна продукция). - отглеждане на растения за засаждане - отглеждане на посадъчен материал за декоративни цели, вкл. чимове за разсаждане - отглеждане на живи растения за луковици, грудки и корени; резници и калеми; гъбен мицел - експлоатация на разсадници, без горските - отглеждане на растения за производство на семена - 01.1, 02.1 - експлоатация на горски разсадници - 02.10 @bg
scope note: Tato třída zahrnuje výrobu veškerého rostlinného sadbového materiálu, vč. bylinných a kořenových řízků a sazenic, a to buď pro přímé množení rostlin nebo pro získávání podnoží, na které se štěpují vybrané rouby za účelem pozdější výsadby a pěstování jako užitkových rostlin. Z: - pěstování rostlinné sadby - pěstování okrasných rostlin vč. travních koberců - pěstování živých rostlin pro cibule, hlízy a oddenky; získávání řízků a roubů; pěstování podhoubí - provoz stromových školek, kromě lesních školek N: - pěstování rostlin za účelem získávání osiva (01.1, 01.2) - provoz lesních školek (02.10) @cs
scope note: Diese Klasse umfasst die Erzeugung sämtlichen vegetativen Pflanzmaterials einschließlich Stecklinge, Wurzeltriebe und Setzlinge, entweder zur direkten Pflanzenvermehrung oder zur Erzeugung von Unterlagen zum Veredeln, auf die zum Zwecke des Nutzpflanzenbaus ausgewählte Pfropfreiser gesetzt werden. Diese Klasse umfasst: - Erzeugung von Setz- und Stecklingen - Erzeugung von Zierpflanzen einschließlich Rollrasen - Erzeugung von lebenden Pflanzen, Bulben, Zwiebeln, Knollen, Wurzelknollen und –stöcken; Erzeugung von Stecklingen und Pfropfreisern; Erzeugung von Pilzmycel - Betrieb von Baumschulen, außer von Forstbaumschulen Diese Klasse umfasst nicht: - Anbau von Pflanzen zum Zwecke der Erzeugung von Saatgut (s. 01.1, 01.2) - Betrieb von Forstbaumschulen (s. 02.10) @de
scope note: This class includes the production of all vegetative planting materials including cuttings, suckers and seedlings for direct plant propagation or to create plant grafting stock into which selected scion is grafted for eventual planting to produce crops. This class includes: - growing of plants for planting - growing of plants for ornamental purposes, including turf for transplanting - growing of live plants for bulbs, tubers and roots; cuttings and slips; mushroom spawn - operation of tree nurseries, except forest tree nurseries This class excludes: - growing of plants for the purpose of seed production, see 01.1, 01.2 - operation of forest tree nurseries, see 02.10 @en
scope note: Esta clase comprende la producción de todos los productos vegetales para plantación, incluidos esquejes, serpollos y semilleros, para la reproducción directa de plantas o para producción de injertos mediante la selección de vástagos. Esta clase comprende: - el cultivo de plantas para plantación - el cultivo de plantas ornamentales, incluida la turba para trasplantes - el cultivo de plantas vivas para bulbos, raíces y tubérculos; esquejes y mugrones; esporas de setas - la explotación de viveros, salvo los viveros forestales Esta clase no comprende: - el cultivo de plantas para la producción de semillas (véase 01.1 y 01.2) - la explotación de viveros forestales (véase 02.10) @es
scope note: Cette classe comprend la production de tout type de matériel de propagation des végétaux, y compris boutures, drageons et semis, en vue de la propagation directe des plantes ou de la création d’un porte-greffe dans lequel sera greffé un scion qui sera planté en vue de la production de plantes. Cette classe comprend: - la culture de plantes destinées à la plantation - la culture de plantes destinées à l’ornementation, y compris le gazon en rouleaux - la culture de plantes vivantes pour la production de bulbes, tubercules ou racines, de boutures et greffons, de blanc de champignon - l’exploitation de pépinières, à l’exception des pépinières forestières Cette classe ne comprend pas: - la culture de plantes aux fins de la production de semences, voir 01.1 et 01.2 - l’exploitation de pépinières forestières, voir 02.10 @fr
scope note: Ovaj razred uključuje proizvodnju svih vrsta vegetativnih biljnih materijala kao što su reznice, izdanci i sadnice za neposredno razmnožavanje ili za proizvodnju podloga na koje će se cijepiti odabrane mladice. Ovaj razred uključuje: - uzgoj biljaka za sadnju - uzgoj ukrasnog bilja, uključujući tratinu za presađivanje - uzgoj lukovica, gomolja i korijenja, reznica i cjepova; micelija gljiva - djelatnosti rasadnika drveća, osim za šumsko drveće Ovaj razred isključuje: - uzgoj biljaka za potrebe sjemenske proizvodnje, vidi 01.1, 01.2 - djelatnosti rasadnika šumskog drveća, vidi 02.10
scope note: Į šį skyrių įeina augalų vegetatyvinio dauginimo medžiagų, tame tarpe auginių, gyvašakių, atžalų, daigų, sėjinukų, sodinių ir sodinukų gavyba, tiesioginiam augalų dauginimui arba augalų skiepijimo ištekliams, į kuriuos atrinkti skiepūgiai įskiepijami siekiant pasodinti sodinukus, sukurti. Į šią klasę įeina: - sodinukų auginimas - dekoratyvinių augalų, įskaitant persodinimui skirtą velėną, auginimas - augalų auginimas svogūnėlių, gumbavaisių ir šakniavaisių gavybai; gyvašakių ir auginių gavyba; grybienos auginimas - medelynų, išskyrus miško medžių medelynus, veikla Į šią klasę neįeina: - sėklų gavybai skirtų augalų auginimas, žr. 01.1, 01.2 - miško medžių medelynų veikla, žr. 02.10 @lt
scope note: Данная группа включает выращивание (сельскохозяйственное) и разведение всех видов животных, за исключением водных животных. Этот класс исключает: - содержание и уход за сельскохозяйственными животными, см. 01.62 - обработку шкур и кож в местах забоя скота, см. 10.11 @ru
scope note: Bu sınıf, doğrudan bitki çoğaltılması amacıyla kullanılan çelikler, kök sürgünleri ve fideler de dahil tüm bitkisel dikim materyalinin üretiminin yanı sıra aşı kalemlerinin üzerlerine aşılanacağı anaçların (gövde ve dal) üretilmesini de kapsar. Bu sınıf aşağıdakileri kapsamaktadır; - dikim için bitki yetiştirilmesi, - başka bir yere sermek için olan çimenler de dahil, dekoratif amaçlarla bitki yetiştirilmesi, - çiçek soğanı, yumru kök ve kökler, çelikler, aşı kalemleri ve mantar tohumu için canlı bitki yetiştirilmesi, - orman ağacı fidanlıkları hariç ağaç fidanlıklarının işletilmesi. Kapsam dışı olanlar; - tohum üretimi amacıyla bitki yetiştiriciliği, bkz. 01.1, 01.2, - orman ağacı fidanlıklarının işletilmesi, bkz. 02.10. @tr
preferred label: Дейности на разсадници, без горските @bg
preferred label: Množení rostlin @cs
preferred label: Planteformering @da
preferred label: Betrieb von Baumschulen, sowie Anbau von Pflanzen zu Vermehrungszwecken @de
preferred label: Πολλαπλασιασμός των φυτών @el
preferred label: Propagación de plantas @es
preferred label: Taimede paljundamine @et
preferred label: Taimien kasvatus ja muu kasvien lisääminen @fi
preferred label: Reproduction de plantes @fr
preferred label: Növényi szaporítóanyag termesztése
preferred label: Riproduzione delle piante @it
preferred label: Augalų dauginimas @lt
preferred label: Augu pavairošana @lv
preferred label: Propagazzjoni ta' pjanti @mt
preferred label: Plantenvermeerdering @nl
preferred label: Rozmnażanie roślin @pl
preferred label: Propagação de plantas @pt
preferred label: Cultivarea plantelor pentru înmulţire @ro
preferred label: Производство продукции питомников @ru
preferred label: Rozmnožovanie rastlín @sk
preferred label: Razmnoževanje rastlin @sl
preferred label: Odling av plantskoleväxter @sv
preferred label: Dikim için bitki yetiştirilmesi @tr
broader: Plant propagation

Animal production
type: Concept
notation: 01.4
status: valid
status modified: 2013-10-18
accepted date: 2013-10-18
in scheme: Statistical Classification of Economic Activities in the European Community, Rev. 2 (2008)
scope note: Тази група включва отглеждане и развъждане на всякакви видове животни, без водните животни. - подслоняване и изхранване на животни в стопанства - 01.62 - добиване на сурови кожи от кланици - 10.11 @bg
scope note: Tato skupina zahrnuje chov veškerých zvířat, s výjimkou chovu vodních zvířat. N: - ustájení hospodářských zvířat a péči o ně (01.62) - produkci kůží a kožek na jatkách (10.11) @cs
scope note: Diese Gruppe umfasst die Haltung und die Zucht sämtlicher Tiere, mit Ausnahme der Zucht und der Haltung von Wassertieren. Diese Gruppe umfasst nicht: - Aufnahme von Pensionsvieh; Pflege von Nutztieren (s. 01.62) - Gewinnung von Fellen und Häuten in Schlachthäusern (s. 10.11) @de
scope note: This group includes raising (farming) and breeding of all animals, except aquatic animals. This group excludes: - farm animal boarding and care, see 01.62 - production of hides and skins from slaughterhouses, see 10.11 @en
scope note: Este grupo comprende la cría (ganadería) y reproducción de todos los animales, excepto los acuáticos Este grupo no comprende: - la estabulación de animales de granja y su cuidado (véase 01.62) - la producción de pieles y cueros procedentes de mataderos (véase 10.11) @es
scope note: Ce groupe comprend l’élevage de tous les animaux, à l’exception des animaux aquatiques Ce groupe ne comprend pas: - l’hébergement et l’entretien d’animaux de ferme, voir 01.62 - la production de cuirs et de peaux provenant d’abattoirs, voir 10.11 @fr
scope note: Ova skupina uključuje uzgoj i razmnožavanje svih vrsta životinja, osim vodenih životinja Ova skupina isključuje: - hranidbu i brigu o domaćim životinjama, vidi 01.62 - proizvodnju kože i krzna u klaonicama, vidi 10.11
scope note: Į šią grupę įeina visų rūšių gyvūnų, išskyrus vandens gyvūnus, auginimas ir veisimas. Į šią grupę neįeina: - ūkio gyvulių šėrimas ir priežiūra, žr. 01.62 - kailių ir odų gavyba skerdyklose, žr.10.11 @lt
scope note: Этот класс включает: - выращивание и разведение молочных пород скота - получение сырого молока от коров и буйволов Этот класс исключает: - переработку молока, см. 10.51 @ru
scope note: Bu grup, suda yaşayan hayvanlar hariç bütün hayvanların yetiştirilmesini (çiftçiliği) ve üretilmesini içermektedir. Kapsam dışı olanlar; - çiftlik hayvanlarına barınak sağlanarak bakımı ve beslenmesi, bkz. 01.62, - kesimevlerinden kürk ve deri üretilmesi, bkz. 10.11. @tr
preferred label: Животновъдство @bg
preferred label: Živočišná výroba @cs
preferred label: Husdyravl @da
preferred label: Tierhaltung @de
preferred label: Ζωική παραγωγή @el
preferred label: Producción ganadera @es
preferred label: Loomakasvatus @et
preferred label: Kotieläintalous @fi
preferred label: Production animale @fr
preferred label: Állattenyésztés
preferred label: Allevamento di animali @it
preferred label: Gyvulininkystė @lt
preferred label: Lopkopība @lv
preferred label: Produzzjoni ta' annimali @mt
preferred label: Veeteelt @nl
preferred label: Husdyrhold @no
preferred label: Chów i hodowla zwierząt @pl
preferred label: Produção animal @pt
preferred label: Creşterea animalelor @ro
preferred label: Животноводство @ru
preferred label: Chov zvierat @sk
preferred label: Živinoreja @sl
preferred label: Husdjursskötsel @sv
preferred label: Hayvansal üretim @tr
broader: Crop and animal production, hunting and related service activities
narrower: Raising of dairy cattle
narrower: Raising of other cattle and buffaloes
narrower: Raising of horses and other equines
narrower: Raising of camels and camelids
narrower: Raising of sheep and goats
narrower: Raising of swine/pigs
narrower: Raising of poultry
narrower: Raising of other animals

Raising of dairy cattle
type: Concept
notation: 01.41
status: valid
status modified: 2013-10-18
accepted date: 2013-10-18
in scheme: Statistical Classification of Economic Activities in the European Community, Rev. 2 (2008)
scope note: - отглеждане и развъждане на едър рогат добитък, с млечно направление - производство на сурово краве и биволско мляко - преработка на мляко - 10.51 @bg
scope note: Z: - chov mléčného skotu - produkci syrového kravského a buvolího mléka N: - zpracování mléka (10.51) @cs
scope note: Diese Klasse umfasst: - Zucht und Haltung von Milchkühen - Erzeugung von roher Kuh- und Büffelmilch Diese Klasse umfasst nicht: - Milchverarbeitung (s. 10.51) @de
scope note: This class includes: - raising and breeding of dairy cattle - production of raw milk from cows or buffaloes This class excludes: - processing of milk, see 10.51 @en
scope note: Esta clase comprende: - la cría y reproducción de ganado bovino lechero - la producción de leche cruda de vaca o búfalo Esta clase no comprende: - el procesado de la leche (véase 10.51) @es
scope note: Cette classe comprend: - l’élevage de vaches laitières - la production de lait cru de vache ou de bufflonne Cette classe ne comprend pas: - la transformation du lait, voir 10.51 @fr
scope note: Ovaj razred uključuje: - uzgoj i razmnožavanje muznih krava - proizvodnju sirovoga kravljeg ili bivoljeg mlijeka Ovaj razred isključuje: - preradu mlijeka, vidi 10.51
scope note: Į šią klasę įeina: - pieninių galvijų auginimas ir veisimas - žalio karvės ar buivolo pieno gavyba Į šią klasę neįeina: - pieno perdirbimas, žr. 10.51 @lt
scope note: Этот класс включает: - выращивание и разведение крупного рогатого скота и буйволов для получения мяса - получение спермы быков для осеменения @ru
scope note: Bu sınıf aşağıdakileri kapsamaktadır; - sütü sağılan büyük baş hayvan yetiştiriciliği ve üretimi, - ineklerden veya mandalardan işlenmemiş süt üretilmesi. Kapsam dışı olanlar; - sütün işlenmesi, bkz. 10.51. @tr
preferred label: Отглеждане на едър рогат добитък, с млечно направление @bg
preferred label: Chov mléčného skotu @cs
preferred label: Avl af malkekvæg @da
preferred label: Haltung von Milchkühen @de
preferred label: Εκτροφή βοοειδών γαλακτοπαραγωγής @el
preferred label: Explotación de ganado bovino para la producción de leche @es
preferred label: Piimakarjakasvatus @et
preferred label: Lypsykarjan kasvatus @fi
preferred label: Élevage de vaches laitières @fr
preferred label: Tejhasznú szarvasmarha tenyésztése
preferred label: Allevamento di bovini da latte @it
preferred label: Pieninių galvijų auginimas @lt
preferred label: Piena lopkopība @lv
preferred label: Trobbija ta' frat tal-ħalib @mt
preferred label: Fokken van melkvee @nl
preferred label: Melkeproduksjon på storfe @no
preferred label: Chów i hodowla bydła mlecznego @pl
preferred label: Criação de bovinos para produção de leite @pt
preferred label: Creşterea bovinelor de lapte @ro
preferred label: Разведение молочных пород скота @ru
preferred label: Chov dojníc @sk
preferred label: Prireja mleka @sl
preferred label: Mjölkproduktion och uppfödning av nötkreatur av mjölkras @sv
preferred label: Sütü sağılan büyük baş hayvan yetiştiriciliği @tr
broader: Animal production

Raising of other cattle and buffaloes
type: Concept
notation: 01.42
status: valid
status modified: 2013-10-18
accepted date: 2013-10-18
in scheme: Statistical Classification of Economic Activities in the European Community, Rev. 2 (2008)
scope note: - отглеждане и развъждане на едър рогат добитък, с друго направление - производство на друга продукция от едър рогат добитък (получаване на сперма от едър рогат добитък) @bg
scope note: Z: - chov jatečného skotu a buvolů - získávání spermatu skotu a buvolů @cs
scope note: Diese Klasse umfasst: - Zucht und Haltung von Schlachtrindern und -büffeln - Erzeugung von Rindersperma @de
scope note: This class includes: - raising and breeding of cattle and buffaloes for meat - production of bovine semen @en
scope note: Esta clase comprende: - la cría y reproducción de ganado bovino y búfalos para carne - la producción de esperma de bovino @es
scope note: Cette classe comprend: - l’élevage de bovins et de buffles pour leur viande - la production de sperme d’animaux de l’espèce bovine @fr
scope note: Ovaj razred uključuje: - uzgoj i razmnožavanje goveda i bivola radi mesa - proizvodnju goveđeg sjemena
scope note: Į šią klasę įeina: - mėsinių galvijų ir buivolų auginimas ir veisimas - galvijų spermos gavyba @lt
scope note: Этот класс включает: - разведение и выращивание лошадей, ослов, мулов или лошаков Этот класс исключает: - деятельность конюшен для лошадей, участвующих в скачках и лошадей для верховой езды, см. 93.19 @ru
scope note: Bu sınıf aşağıdakileri kapsamaktadır; - et için sığır ve manda yetiştiriciliği ve üretilmesi, - büyükbaş hayvanlardan sperm elde edilmesi. @tr
preferred label: Отглеждане на едър рогат добитък, с друго направление @bg
preferred label: Chov jiného skotu a buvolů @cs
preferred label: Avl af andet kvæg og bøfler @da
preferred label: Haltung von anderen Rindern @de
preferred label: Εκτροφή άλλων βοοειδών και βουβαλιών @el
preferred label: Explotación de otro ganado bovino y búfalos @es
preferred label: Muu veislaste ja pühvlikasvatus @et
preferred label: Muun nautakarjan ja puhvelien kasvatus @fi
preferred label: Élevage d'autres bovins et de buffles @fr
preferred label: Egyéb szarvasmarha tenyésztése
preferred label: Allevamento di altri bovini e di bufalini @it
preferred label: Kitų galvijų ir buivolų auginimas @lt
preferred label: Citu liellopu audzēšana @lv
preferred label: Trobbija ta' frat oħra u bufli @mt
preferred label: Fokken van andere runderen en buffels @nl
preferred label: Oppdrett av annet storfe @no
preferred label: Chów i hodowla pozostałego bydła i bawołów @pl
preferred label: Criação de outros bovinos (excepto para a produção de leite) e búfalos @pt
preferred label: Creşterea altor bovine @ro
preferred label: Разведение прочих пород крупного рогатого скота и буйволов @ru
preferred label: Chov ostatného dobytka a byvolov @sk
preferred label: Druga govedoreja @sl
preferred label: Uppfödning av andra nötkreatur och bufflar @sv
preferred label: Diğer sığır ve manda yetiştiriciliği @tr
broader: Animal production

Raising of horses and other equines
type: Concept
notation: 01.43
status: valid
status modified: 2013-10-18
accepted date: 2013-10-18
in scheme: Statistical Classification of Economic Activities in the European Community, Rev. 2 (2008)
scope note: - отглеждане и развъждане на коне, магарета, мулета и катъри - експлоатация на конни бази и спортни школи за езда - 93.19 @bg
scope note: Z: - chov koní, oslů, mul a mezků N: - provoz dostihových a jezdeckých stájí (93.19) @cs
scope note: Diese Klasse umfasst: - Zucht und Haltung von Pferden, Eseln, Maultieren und Mauleseln Diese Klasse umfasst nicht: - Betrieb von Renn- und Reitställen (s. 93.19) @de
scope note: This class includes: - raising and breeding of horses, asses, mules or hinnies This class excludes: - operation of racing and riding stables, see 93.19 @en
scope note: Esta clase comprende: - la cría y reproducción de caballos, burros, mulas o burdéganos Esta clase no comprende: - el mantenimiento de cuadras de caballos de carreras y de escuelas de equitación (véase 93.19) @es
scope note: Cette classe comprend: - l’élevage de chevaux, d’ânes, de mulets ou de bardots Cette classe ne comprend pas: - l’exploitation d’écuries de course et d’écoles d’équitation, voir 93.19 @fr
scope note: Ovaj razred uključuje: - uzgoj i razmnožavanje konja, magaraca, mula i mazgi Ovaj razred isključuje: - rad staja za trkaće i jahaće konje, vidi 93.19
scope note: Į šią klasę įeina: - arklių, asilų, mulų ar arklėnų auginimas ir veisimas Į šią klasę neįeina: - lenktyninių ir jojamųjų žirgų žirgynų veikla, žr. 93.19 @lt
scope note: Этот класс включает: - выращивание и разведение верблюдов (одногорбых верблюдов) и верблюдовых @ru
scope note: Bu sınıf aşağıdakileri kapsamaktadır; - at, eşek, katır veya bardo yetiştiriciliği ve besiciliği Kapsam dışı olanlar; - yarış ve binicilik at ahırlarının işletimi, bkz. 93.19. @tr
preferred label: Отглеждане на коне, магарета, мулета и катъри @bg
preferred label: Chov koní a jiných koňovitých @cs
preferred label: Avl af heste og dyr af hestefamilien @da
preferred label: Haltung von Pferden und Eseln @de
preferred label: Εκτροφή αλόγων και άλλων ιπποειδών @el
preferred label: Explotación de caballos y otros equinos @es
preferred label: Hobuse- ja muude hobuslaste kasvatus @et
preferred label: Hevosten ja muiden hevoseläinten kasvatus @fi
preferred label: Élevage de chevaux et d'autres équidés @fr
preferred label: Ló, lóféle tenyésztése
preferred label: Allevamento di cavalli e altri equini @it
preferred label: Arklių ir kitų kanopinių gyvūnų auginimas @lt
preferred label: Zirgu un zirgu dzimtas dzīvnieku audzēšana @lv
preferred label: Trobbija ta' żwiemel u ekwini oħra @mt
preferred label: Fokken van paarden en andere paardachtigen @nl
preferred label: Oppdrett av hester og andre dyr av hestefamilien @no
preferred label: Chów i hodowla koni i pozostałych zwierząt koniowatych @pl
preferred label: Criação de equinos, asininos e muares @pt
preferred label: Creşterea cailor şi a altor cabaline @ro
preferred label: Разведение лошадей и прочих копытных пород @ru
preferred label: Chov koní a ostatných koňovitých zvierat @sk
preferred label: Konjereja @sl
preferred label: Uppfödning av hästar och andra hästdjur @sv
preferred label: At ve at benzeri diğer hayvan yetiştiriciliği @tr
broader: Animal production

Raising of camels and camelids
type: Concept
notation: 01.44
status: valid
status modified: 2013-10-18
accepted date: 2013-10-18
in scheme: Statistical Classification of Economic Activities in the European Community, Rev. 2 (2008)
scope note: - отглеждане и развъждане на камили (едногърби), лами и подобни животни @bg
scope note: Z: - chov velbloudů a jiných velbloudovitých (lam atd.) @cs
scope note: Diese Klasse umfasst: - Zucht und Haltung von Dromedaren und Trampeltieren @de
scope note: This class includes: - raising and breeding of camels (dromedary) and camelids @en
scope note: Esta clase comprende: - la cría y reproducción de camellos (dromedarios) y camélidos @es
scope note: Cette classe comprend: - l’élevage de chameaux (dromadaires) et de camélidés @fr
scope note: Ovaj razred uključuje: - uzgoj i razmnožavanje deva i ljama
scope note: Į šią klasę įeina: - kupranugarių (vienakuprių) ir Camelidae šeimos gyvūnų auginimas ir veisimas @lt
scope note: Этот класс включает: - выращивание и разведение овец и коз - производство сырого молока овец и коз - заготовку шерсти Этот класс исключает: - стрижку овец на контрактной основе, см. 01.62 - производство щипаной шерсти, см. 10.11 - переработку молока, см. 10.51 @ru
scope note: Bu sınıf aşağıdakileri kapsamaktadır; - deve ve devegillerin yetiştiriciliği ve üretilmesi. @tr
preferred label: Отглеждане на камили, лами и подобни животни @bg
preferred label: Chov velbloudů a velbloudovitých @cs
preferred label: Avl af kameler og dyr af kamelfamilien @da
preferred label: Haltung von Kamelen @de
preferred label: Εκτροφή καμήλων και καμηλίδων @el
preferred label: Explotación de camellos y otros camélidos @es
preferred label: Kaamelikasvatus @et
preferred label: Kamelien ja kamelieläinten kasvatus @fi
preferred label: Élevage de chameaux et d'autres camélidés @fr
preferred label: Teve, teveféle tenyésztése
preferred label: Allevamento di cammelli e camelidi @it
preferred label: Kupranugarių ir Camelidae šeimos gyvūnų auginimas @lt
preferred label: Kamieļu un kamieļu dzimtas dzīvnieku audzēšana @lv
preferred label: Trobbija ta' iġmla u kamelidi oħra @mt
preferred label: Fokken van kamelen en andere kameelachtigen @nl
preferred label: Oppdrett av kameler og andre kameldyr @no
preferred label: Chów i hodowla wielbłądów i zwierząt wielbłądowatych @pl
preferred label: Criação de camelos e outros camelídeos @pt
preferred label: Creşterea cămilelor şi a camelidelor @ro
preferred label: Разведение верблюдов и верблюдовых @ru
preferred label: Chov tiav a ťavovitých zvierat @sk
preferred label: Reja kamel @sl
preferred label: Uppfödning av kameler och kameldjur @sv
preferred label: Deve ve devegillerin yetiştiriciliği @tr
broader: Animal production

Raising of sheep and goats
type: Concept
notation: 01.45
status: valid
status modified: 2013-10-18
accepted date: 2013-10-18
in scheme: Statistical Classification of Economic Activities in the European Community, Rev. 2 (2008)
scope note: - отглеждане и развъждане на овце и кози - производство на сурово овче и козе мляко - производство на непрана стригана вълна - стрижене на овце срещу заплащане (по договор или еднократно) - 01.62 - производство на вълна от обезкосмяване на одрани кожи - 10.11 - преработка на мляко извън мястото, където се добива млякото - 10.51 @bg
scope note: Z: - chov ovcí a koz - produkci syrového ovčího a kozího mléka - produkci surové vlny N: - stříhání ovcí na základě smlouvy nebo dohody (01.62) - produkci jateční (jirchářské) vlny (10.11) - zpracování mléka (10.51) @cs
scope note: Diese Klasse umfasst: - Zucht und Haltung von Schafen und Ziegen - Erzeugung von roher Schaf- und Ziegenmilch - Erzeugung von Rohwolle Diese Klasse umfasst nicht: - Schafschur im Lohnauftrag (s. 01.62) - Erzeugung von Hautwolle (s. 10.11) - Milchverarbeitung (s. 10.51) @de
scope note: This class includes: - raising and breeding of sheep and goats - production of raw sheep or goat milk - production of raw wool This class excludes: - sheep shearing on a fee or contract basis, see 01.62 - production of pulled wool, see 10.11 - processing of milk, see 10.51 @en
scope note: Esta clase comprende: - la cría y reproducción de ganado ovino y caprino - la producción de leche cruda de ganado ovino y caprino - la producción de lana en bruto Esta clase no comprende: - el esquileo de animales por cuenta de terceros (véase 01.62) - la producción de hilachas de lana (véase 10.11) - el procesado de la leche (véase 10.51) @es
scope note: Cette classe comprend: - l’élevage d’ovins et de caprins - la production de lait cru de brebis ou de chèvre - la production de laine brute Cette classe ne comprend pas: - la tonte d’ovins pour le compte de tiers, voir 01.62 - la production de laine de peaux, voir 10.11 - la transformation du lait, voir 10.51 @fr
scope note: Ovaj razred uključuje: - uzgoj i razmnožavanje ovaca i koza - proizvodnju sirovog ovčjeg ili kozjeg mlijeka - proizvodnju sirove vune Ovaj razred isključuje: - šišanje ovaca, uz naplatu ili na osnovi ugovora, vidi 01.62 - proizvodnju čupane vune, vidi 10.11 - preradu mlijeka, vidi 10.51
scope note: Į šią klasę įeina: - avių ir ožkų auginimas ir veisimas - žalio avių ar ožkų pieno gavyba - žaliavinės vilnos gavyba Į šią klasę neįeina: - avių kirpimas už atlygį ar pagal sutartį, žr. 01.62 - peštos vilnos gavyba, žr. 10.11 - pieno perdirbimas, žr. 10.51 @lt
scope note: Bu sınıf aşağıdakileri kapsamaktadır; - koyun ve keçi yetiştiriciliği ve üretimi, - işlenmemiş koyun ve keçi sütü üretimi, - işlenmemiş yün üretimi (yapağı). Kapsam dışı olanlar; - ücret veya sözleşme temeline dayalı olarak koyunların kırkılması, bkz. 01.62, - posttan elde edilen yün üretimi, bkz. 10.11, - sütün işlenmesi, bkz. 10.51. @tr
preferred label: Отглеждане на дребен рогат добитък @bg
preferred label: Chov ovcí a koz @cs
preferred label: Avl af får og geder @da
preferred label: Haltung von Schafen und Ziegen @de
preferred label: Εκτροφή αιγοπροβάτων @el
preferred label: Explotación de ganado ovino y caprino @es
preferred label: Lamba- ja kitsekasvatus @et
preferred label: Lampaiden ja vuohien kasvatus @fi
preferred label: Élevage d'ovins et de caprins @fr
preferred label: Juh, kecske tenyésztése
preferred label: Allevamento di ovini e caprini @it
preferred label: Avių ir ožkų auginimas @lt
preferred label: Aitu un kazu audzēšana @lv
preferred label: Trobbija ta' nagħaġ u mogħoż @mt
preferred label: Fokken van schapen en geiten @nl
preferred label: Saue- og geitehold @no
preferred label: Chów i hodowla owiec i kóz @pl
preferred label: Criação de ovinos e caprinos @pt
preferred label: Creşterea ovinelor şi caprinelor @ro
preferred label: Разведение овец и коз @ru
preferred label: Chov oviec a kôz @sk
preferred label: Reja drobnice @sl
preferred label: Uppfödning av får och getter @sv
preferred label: Koyun ve keçi yetiştiriciliği @tr
broader: Animal production

Raising of swine/pigs
type: Concept
notation: 01.46
status: valid
status modified: 2013-10-18
accepted date: 2013-10-18
in scheme: Statistical Classification of Economic Activities in the European Community, Rev. 2 (2008)
scope note: Этот класс включает: - разведение и размножение домашней птицы: • кур, индюков, уток, гусей и т.д. - получение яиц от домашней птицы - управление инкубаторными станциями для выращивания домашней птицы Этот класс исключает: - получение рубленого пера и пуха от домашней птицы, см. 10.12 @ru
preferred label: Отглеждане на свине @bg
preferred label: Chov prasat @cs
preferred label: Svineavl @da
preferred label: Haltung von Schweinen @de
preferred label: Εκτροφή χοίρων @el
preferred label: Explotación de ganado porcino @es
preferred label: Seakasvatus @et
preferred label: Sikojen kasvatus @fi
preferred label: Élevage de porcins @fr
preferred label: Sertéstenyésztés
preferred label: Allevamento di suini @it
preferred label: Kiaulių auginimas @lt
preferred label: Cūkkopība @lv
preferred label: Trobbija ta' majjali/annimali ta' l-istess speċi @mt
preferred label: Fokken van varkens @nl
preferred label: Svinehold @no
preferred label: Chów i hodowla świń @pl
preferred label: Suinicultura @pt
preferred label: Creşterea porcinelor @ro
preferred label: Разведение свиней и поросят @ru
preferred label: Chov ošípaných @sk
preferred label: Prašičereja @sl
preferred label: Uppfödning av svin @sv
preferred label: Domuz yetiştiriciliği @tr
broader: Animal production

Raising of poultry
type: Concept
notation: 01.47
status: valid
status modified: 2013-10-18
accepted date: 2013-10-18
in scheme: Statistical Classification of Economic Activities in the European Community, Rev. 2 (2008)
scope note: - люпене и отглеждане на домашни птици: • пилета от кокошия вид, патици, гъски, пуйки и други - производство на яйца от домашни птици - дейности в люпилни - производство на перушина и пух - 10.12 @bg
scope note: Z: - chov drůbeže: • slepic, krůt, kachen, hus a perliček - produkci drůbežích vajec - provoz líhní N: - získávání per a prachového peří (10.12) @cs
scope note: Diese Klasse umfasst: - Zucht und Haltung von Geflügel: • Hühner, Puten, Enten, Gänse und Perlhühner - Erzeugung von Geflügeleiern - Betrieb von Geflügelbrütereien Diese Klasse umfasst nicht: - Gewinnung von Federn und Daunen (s. 10.12) @de
scope note: This class includes: - raising and breeding of poultry: • chickens, turkeys, ducks, geese and guinea fowls - production of eggs from poultry - operation of poultry hatcheries This class excludes: - production of feathers or down, see 10.12 @en
scope note: Esta clase comprende: - la cría y reproducción de aves de corral • pollos, pavos, patos, ocas y pintadas - la producción de huevos de aves de corral - la explotación de incubadoras de aves de corral Esta clase no comprende: - la producción de plumas y plumón (véase 10.12) @es
scope note: Cette classe comprend: - l’élevage de volailles: • coqs, poules, dindes, dindons, canards, oies et pintades - la production d’œufs de volailles - l’exploitation de couvoirs pour volailles Cette classe ne comprend pas: - la production de plumes ou de duvets, voir 10.12 @fr
scope note: Ovaj razred uključuje: - uzgoj i razmnožavanje peradi: • kokoši, purana, pataka, gusaka, biserki - proizvodnju jaja - rad peradarnika Ovaj razred isključuje: - proizvodnju perja i paperja, vidi 10.12
scope note: Į šią klasę įeina: - naminių paukščių auginimas ir veisimas: • viščiukų, kalakutų, ančių, žąsų ir patarškų - naminių paukščių kiaušinių gavyba - naminių paukščių inkubatorių veikla Į šią klasę neįeina: - plunksnų ar pūkų gavyba, žr. 10.12 @lt
scope note: Этот класс включает: - выращивание и разведение полуодомашненных или прочих животных: • страусов и страусов эму • прочих видов птицы (за исключением домашней птицы) • насекомых • кроликов и прочих пушных зверей/животных с ценным мехом - производство меховых шкурок, кожи пресмыкающихся и птиц в результате разведения животных на фермах - деятельность ферм по разведению червей, улиток, моллюсков и т.п. - разведение шелковичных червей, получение коконов шелковичных червей - пчеловодство и производство меда и пчелиного воска - разведение и размножение домашних животных (за исключением рыбок): • кошек и собак • птиц, таких как длиннохвостые попугаи и т.д. • хомяков и т.д. - разведение прочих видов животных Этот класс исключает: - получение шкур и кож животных путем отлова и охоты, см. 01.70 - работу ферм по разведению лягушек, крокодилов, морских улиток, см. 03.21, 03.22 - работу ферм по разведению рыбы, см. 03.21, 03.22 - содержание и обучение домашних животных, см. 96.09 - разведение и выращивание домашней птицы, см. 01.47 @ru
scope note: Bu sınıf aşağıdakileri kapsamaktadır; - Kümes hayvanlarının yetiştirilmesi ve üretilmesi; • tavuklar, hindiler, ördekler, kazlar ve beç tavuğu, - kümes hayvanlarından yumurta üretilmesi, - kümes hayvanları civciv üretme çiftliklerinin işletilmesi. Kapsam dışı olanlar; - kuş tüyü veya ince kuş tüyü üretimi, bkz. 10.12. @tr
preferred label: Отглеждане на домашни птици @bg
preferred label: Chov drůbeže @cs
preferred label: Fjerkræavl @da
preferred label: Haltung von Geflügel @de
preferred label: Εκτροφή πουλερικών @el
preferred label: Avicultura @es
preferred label: Kodulinnukasvatus @et
preferred label: Siipikarjan kasvatus @fi
preferred label: Élevage de volailles @fr
preferred label: Baromfitenyésztés
preferred label: Allevamento di pollame @it
preferred label: Naminių paukščių auginimas @lt
preferred label: Putnkopība @lv
preferred label: Trobbija ta' tjur @mt
preferred label: Fokken van pluimvee @nl
preferred label: Fjørfehold @no
preferred label: Chów i hodowla drobiu @pl
preferred label: Creşterea păsărilor @ro
preferred label: Птицеводство @ru
preferred label: Chov hydiny @sk
preferred label: Reja perutnine @sl
preferred label: Äggproduktion och uppfödning av fjäderfä @sv
preferred label: Kümes hayvanları yetiştiriciliği @tr
broader: Animal production

Raising of other animals
type: Concept
notation: 01.49
status: valid
status modified: 2013-10-18
accepted date: 2013-10-18
in scheme: Statistical Classification of Economic Activities in the European Community, Rev. 2 (2008)
scope note: - отглеждане и развъждане на полуопитомени или други живи животни: • щрауси и ему • други птици(без домашни птици) • насекоми • зайци и други животни с козина - добиване на сурови кожухарски кожи,кожи от влечуги или птици при отглеждането им в стопанства и ферми - експлоатация на стопанства и ферми за червеи, сухоземни мекотели - охлюви и подобни - отглеждане на копринени буби и производство на копринени пашкули - отглеждане на пчелни семейства и производство на пчелен мед, восък и други пчелни продукти - отглеждане и развъждане на домашни любимци(без рибите): • котки и кучета • птици като папагали и подобни • хамстери и подобни - отглеждане на други животни и птици,некласифицирани другаде - люпене и отглеждане на домашни птици - 01.47 - добиване на дивечови кожи от лов - 01.70 - експлоатация на стопанства за жаби, крокодили, морски червеи - 03.21, 03.22 - експлоатация на рибни развъдници - 03.21, 03.22 - пансион и обучение на домашни любимци - 96.09 @bg
scope note: Z: - chov zpola domestikovaných a ostatních živých zvířat: • pštrosů a emu • ostatních ptáků (kromě drůbeže) • hmyzu • králíků a ostatních kožešinových zvířat - produkci surových kožešin, kůží z plazů a ptáků na zvířecích farmách - provoz farem pro chov červů, plžů atd. - chov bource morušového a produkci kokonů bource morušového - chov včel a produkci včelího medu a vosku - zvířat v zájmovém chovu (kromě ryb): • koček a psů • ptáků (např. papoušků) • křečků atd. - chov různých zvířat N: - chov drůbeže (01.47) - produkci kůží a kožek v rámci lovu a odchytu divokých zvířat (01.70) - provoz žabích farem, krokodýlích farem, farem pro chov mořských červů (03.21, 03.22) - provoz rybích farem (03.21, 03.22) - ubytování a výcvik domácích zvířecích mazlíčků (96.09) @cs
scope note: Diese Klasse umfasst: - Zucht und Haltung von halb domestizierten und sonstigen lebenden Tieren: • Strauße und Emus • sonstige Vögel (ohne Geflügel) • Insekten • Kaninchen und sonstige Pelztiere - Gewinnung von Pelzfellen, Reptilienhäuten und Vogelbälgen in Tierfarmen - Betrieb von Wurmfarmen, Landmolluskenzuchten, Schneckenzuchten usw. - Zucht und Haltung von Seidenraupen; Erzeugung von Seidenraupenkokons - Imkerei - Zucht und Haltung von Haustieren (ohne Fische): • Katzen und Hunde • Vögel, z. B. Sittiche usw. • Hamster usw. - Zucht und Haltung sonstiger Tiere Diese Klasse umfasst nicht: - Gewinnung von Häuten und Fellen im Rahmen der Jagd und Fallenstellerei (s. 01.70) - Betrieb von Froschfarmen, Krokodilfarmen, Meereswürmerfarmen (s. 03.21, 03.22) - Betrieb von Fischfarmen (s. 03.21, 03.22) - Aufnahme und Dressur von Haustieren (s. 96.09) - Zucht und Haltung von Geflügel (s. 01.47) @de
scope note: This class includes: - raising and breeding of semi-domesticated or other live animals: • ostriches and emus • other birds (except poultry) • insects • rabbits and other fur animals - production of fur skins, reptile or bird skins from ranching operation - operation of worm farms, land mollusc farms, snail farms etc. - raising of silk worms, production of silk worm cocoons - bee-keeping and production of honey and beeswax - raising and breeding of pet animals (except fish): • cats and dogs • birds, such as parakeets etc. • hamsters etc. - raising of diverse animals This class excludes: - production of hides and skins originating from hunting and trapping, see 01.70 - operation of frog farms, crocodile farms, marine worm farms, see 03.21, 03.22 - operation of fish farms, see 03.21, 03.22 - boarding and training of pet animals, see 96.09 - raising and breeding of poultry, see 01.47 @en
scope note: Esta clase comprende: - la cría y reproducción de animales semidomesticados u otros animales vivos: • avestruces y emús • otras aves (excepto aves de corral) • insectos • conejos y otros animales de peletería - la producción de pieles para peletería, pieles de reptiles y aves procedentes de granjas - la explotación de criaderos de gusanos, moluscos terrestres, caracoles, etc. - la cría de gusanos de seda y la sericultura - la apicultura y la producción de miel y cera de abeja - la cría y reproducción de animales de compañía (excepto peces): • gatos y perros • pájaros, como periquitos, etc. • hámsters, etc. - la cría de animales diversos Esta clase no comprende: - la producción de cueros y pieles procedentes de la caza y captura de animales (véase 01.70) - la explotación de criaderos de ranas, cocodrilos, gusanos marinos (véase 03.21, 03.22) - la acuicultura (véase 03.21, 03.22) - el adiestramiento de animales domésticos (véase 96.09) - la cría y reproducción de aves de corral (véase 01.47) @es
scope note: Cette classe comprend: - l’élevage d’animaux semi-domestiqués ou d’autres animaux vivants: • autruches et émeus • autres oiseaux (à l’exception des volailles) • insectes • lapins et autres animaux à fourrure - la production de pelleteries, de peaux de reptiles ou d’oiseaux provenant de l’exploitation de fermes d’élevage - l’exploitation de fermes de lombriculture, de production de crustacés terrestres, d’héliciculture, etc. - la sériciculture et la production de cocons de vers à soie - l’apiculture et la production de miel et de cire d’abeille - l’élevage d’animaux de compagnie (à l’exception des poissons) • chats et chiens • oiseaux, tels que des perruches, etc. • hamsters, etc. - l’élevage d’animaux divers Cette classe ne comprend pas: - la production de cuirs et peaux provenant de la chasse ou du piégeage, voir 01.70 - l’exploitation de fermes d’élevage de grenouilles, de crocodiles, de vers marins, voir 03.21 et 03.22 - les exploitations piscicoles, voir 03.21 et 03.22 - l’hébergement et le dressage d’animaux de compagnie, voir 96.09 - l’élevage de volailles, voir 01.47 @fr
scope note: Ovaj razred uključuje: - uzgoj i razmnožavanje pripitomljenih ili ostalih živih životinja: • nojeva i emua • ostalih ptica (osim peradi) • kukaca • kunića i drugih krznaša - proizvodnju krzna i kože od uzgajanih krznaša, gmazova i ptica - uzgoj crva, glista, ostalih zemljanih mekušaca, puževa itd. - uzgoj dudova svilca, proizvodnju čahura - uzgoj pčela, proizvodnju meda i pčelinjeg voska - uzgoj i razmnožavanje kućnih ljubimaca (osim riba): • mačaka i pasa • ptica kao što su papige tigrice itd. • hrčaka itd. - uzgoj raznih vrsta životinja Ovaj razred isključuje: - proizvodnju sirovih koža i krzna koji potječu od lova i stupičarenja, vidi 01.70 - uzgoj žaba, krokodila, morskih crva, vidi 03.21, 03.22 - djelatnosti ribnjaka, vidi 03.21, 03.22 - hranidbu i dresuru kućnih ljubimaca, vidi 96.09 - uzgoj i razmnožavanje peradi, vidi 01.47
scope note: Į šią klasę įeina: - puslaukinių ir kitų gyvūnų auginimas ir veisimas: • stručių ir emų • kitų paukščių (išskyrus naminius paukščius) • vabzdžių • triušių ir kitų švelniakailių žvėrelių auginimas - ūkiuose auginamų gyvūnų kailiukų, roplių arba paukščių odų gavyba - sliekų ir kitų kirminų, sausumos moliuskų, sraigių ūkių veikla - šilkverpių auginimas, šilkverpių kokonų gavyba - bitininkystė, bičių medaus ir vaško gavyba - naminių gyvūnėlių (išskyrus žuvis): • kačių ir šunų • paukščių, tokių kaip ilgauodegės papūgos ir kt. • žiurkėnų ir kt., auginimas ir veisimas - įvairių gyvūnų auginimas Į šią klasę neįeina: - sumedžiotų ar spąstais sugautų žvėrių kailių ir odų gavyba, žr. 01.70 - varlių ūkių, krokodilų ūkių, daugiašerių žieduotųjų kirmėlių ūkių veikla, žr. 03.21, 03.22 - žuvų ūkių veikla, žr. 03.21, 03.22 - naminių gyvūnėlių priežiūra ir dresavimas, žr. 96.09 - naminių paukščių auginimas ir veisimas, žr. 01.47 @lt
scope note: Bu sınıf aşağıdakileri kapsamaktadır; - yarı evcilleştirilmiş veya diğer canlı hayvanların yetiştirilmesi ve üretilmesi; • deve kuşları ve emular (Avustralya`ya özgü deve kuşları), • diğer kuşlar (kümes hayvanları hariç), • böcek, • tavşanlar ve diğer kürk hayvanları, - çiftçilik yoluyla elde edilen kürklü derilerin, sürüngen veya kuş derilerinin üretimi, - solucan çiftliklerinin, yer yumuşakçaları çiftliklerinin, yılan çiftliklerinin v.b. işletilmesi, - ipek böceği yetiştirilmesi, ipek böceği kozası üretilmesi, - arıcılık, bal ve balmumu üretilmesi, - evcil hayvanların yetiştirilmesi ve üretilmesi (balık hariç); • kediler ve köpekler, • kuşlar, örneğin papağan v.b., • hamsterlar vb., - çeşitli hayvanların yetiştirilmesi. Kapsam dışı olanlar; - avcılık yoluyla ve tuzak kurma ile post ve deri üretilmesi bkz. 01.70, - kurbağa çiftliklerinin, timsah çiftliklerinin, deniz solucanı çiftliklerinin işletilmesi, bkz. 03.21 ve 03.22, - balık çiftliklerinin işletilmesi, bkz. 03.21 ve 03.22, - evcil hayvanların eğitilmesi ve barınak sağlanması, bkz. 96.09, - kümes hayvanlarının yetiştirilmesi ve beslenmesi, bkz. 01.47, @tr
preferred label: Отглеждане на други животни @bg
preferred label: Chov ostatních zvířat @cs
preferred label: Avl af andre dyr @da
preferred label: Sonstige Tierhaltung @de
preferred label: Εκτροφή άλλων ζώων @el
preferred label: Otras explotaciones de ganado @es
preferred label: Muu loomakasvatus @et
preferred label: Muiden eläinten kasvatus @fi
preferred label: Élevage d'autres animaux @fr
preferred label: Egyéb állat tenyésztése
preferred label: Allevamento di altri animali @it
preferred label: Kitų gyvūnų auginimas @lt
preferred label: Citu dzīvnieku audzēšana @lv
preferred label: Trobbija ta' annimali oħra @mt
preferred label: Fokken van andere dieren @nl
preferred label: Husdyrhold ellers @no
preferred label: Chów i hodowla pozostałych zwierząt @pl
preferred label: Outra produção animal @pt
preferred label: Creşterea altor animale @ro
preferred label: Разведение прочих видов животных @ru
preferred label: Chov iných zvierat @sk
preferred label: Reja drugih živali @sl
preferred label: Uppfödning av andra djur @sv
preferred label: Diğer hayvan yetiştiriciliği @tr
broader: Animal production

Mixed farming
type: Concept
notation: 01.5
status: valid
status modified: 2013-10-18
accepted date: 2013-10-18
in scheme: Statistical Classification of Economic Activities in the European Community, Rev. 2 (2008)
scope note: Этот класс включает смешанное растениеводческое и животноводческое производство без определенной специализации. Объем всех видов работ на фермах не является четко определенным. Этот подкласс включает выращивание культур в сочетании с животноводством в хозяйствах, в которых коэффициент специализации в одной области не превышает 66 процентов валовой продукции. Смешанные растениеводческие или смешанные животноводческие хозяйства не включены в данный подкласс, классифицируются по их основному виду деятельности. Этот класс исключает: - смешанное растениеводческое производство, см. 01.1 и 01.2 - смешанное животноводческое производство, см. 01.4 @ru
preferred label: Комбинирано растениевъдно-животновъдно стопанствово @bg
preferred label: Smíšené hospodářství @cs
preferred label: Blandet drift @da
preferred label: Gemischte Landwirtschaft @de
preferred label: Μικτές γεωργοκτηνοτροφικές δραστηριότητες @el
preferred label: Producción agrícola combinada con la producción ganadera @es
preferred label: Segapõllumajandus @et
preferred label: Yhdistetty kasvinviljely ja kotieläintalous (sekatilat) @fi
preferred label: Culture et élevage associés @fr
preferred label: Vegyes gazdálkodás
preferred label: Coltivazioni agricole associate all'allevamento di animali: attività mista @it
preferred label: Mišrusis žemės ūkis @lt
preferred label: Jauktā lauksaimniecība (augkopība un lopkopība) @lv
preferred label: Biedja mħallta @mt
preferred label: Gemengd bedrijf @nl
preferred label: Kombinert husdyrhold og planteproduksjon @no
preferred label: Uprawy rolne połączone z chowem i hodowlą zwierząt (działalność mieszana) @pl
preferred label: Produção agrícola e animal combinadas @pt
preferred label: Activităţi în ferme mixte (cultura vegetală combinată cu creşterea animalelor) @ro
preferred label: Смешанное сельское хозяйство @ru
preferred label: Zmiešané hospodárstvo @sk
preferred label: Mešano kmetijstvo @sl
preferred label: Blandat jordbruk @sv
preferred label: Karma çiftçilik @tr
broader: Crop and animal production, hunting and related service activities
narrower: Mixed farming

Mixed farming
type: Concept
notation: 01.50
status: valid
status modified: 2013-10-18
accepted date: 2013-10-18
in scheme: Statistical Classification of Economic Activities in the European Community, Rev. 2 (2008)
scope note: Този клас включва комбинирано производство на растителна и животинска продукция, без специализираната продукция от растения или животни. Обемът на общото стопанско производство не е определящ фактор. Ако продукцията от растениевъдството или животновъдството в дадена селскостопанска единица е 66% или повече от стандартната брутна разлика, смесените дейности няма да се включват тук, а ще се разпределят в растениевъдното или животновъдното стопанство. - смесено (комбинирано) растениевъдно стопанство - 01.1 и 01.2 - смесено (комбинирано) животновъдно стопанство - 01.4 @bg
scope note: Tato třída zahrnuje kombinaci rostlinné a živočišné výroby bez výrazné převahy jedné z těchto oblastí. Celkový rozsah zemědělské činnosti není rozhodující. Dosahuje-li výroba rostlinných nebo živočišných produktů v jednom zemědělském podniku více než 66 % standardního příspěvku na úhradu, nezařazuje se celková činnost do této třídy, ale buď do výroby rostlinných nebo do výroby živočišných produktů. N: - smíšenou rostlinnou výrobu (01.1, 01.2) - smíšenou živočišnou výrobu (01.4) @cs
scope note: Diese Klasse umfasst die Kombination von Pflanzenbau und Tierhaltung ohne ausgeprägten Schwerpunkt. Der Gesamtumfang der landwirtschaftlichen Tätigkeit ist nicht entscheidend. Macht der Pflanzenbau oder die Tierhaltung in einem landwirtschaftlichen Betrieb mehr als 66 % des Standarddeckungsbeitrags aus, so ist die Gesamttätigkeit nicht dieser Klasse zuzurechnen, sondern entweder dem Pflanzenbau oder der Tierhaltung. Diese Klasse umfasst nicht: - gemischte pflanzliche Erzeugung (s. Gruppen 01.1 und 01.2) - gemischte tierische Erzeugung (s. Gruppe 01.4) @de
scope note: This class includes the combined production of crops and animals without a specialised production of crops or animals. The size of the overall farming operation is not a determining factor. If either production of crops or animals in a given unit is 66% or more of standard gross margins, the combined activity should not be included here, but allocated to crop or animal farming. This class excludes: - mixed crop farming, see groups 01.1 and 01.2 - mixed animal farming, see group 01.4 @en
scope note: Esta clase comprende la producción mixta agrícola y ganadera sin especialización en ninguna de ellas. El tamaño de la explotación general no es un factor determinante. Si la producción agrícola o la producción ganadera en una unidad determinada representa el 66 % o más de los márgenes brutos normales, la actividad conjunta no debería incluirse en este apartado, sino asignarse a producción agrícola o a producción ganadera. Esta clase no comprende: - la producción combinada de varios productos agrícolas (véanse grupos 01.1 y 01.2) - la producción ganadera combinada de distintas especies (véase el grupo 01.4) @es
scope note: Cette classe couvre la production combinée de produits végétaux et de produits animaux sans spécialisation de la production dans les produits végétaux ou dans les animaux. La dimension de l’exploitation agricole globale n’est pas un facteur déterminant. Si dans une unité donnée, la production de produits végétaux ou d’animaux est égale ou supérieure à 66 % des marges brutes standard, l’activité ne doit pas être rangée dans cette classe, mais dans la culture ou dans l’élevage. Cette classe ne comprend pas: - la culture associée à l’élevage, voir groupes 01.1 et 01.2 - l’élevage associé à la culture, voir groupe 01.4 @fr
scope note: Ovaj razred uključuje kombiniranu proizvodnju usjeva i životinja, bez specijalizirane proizvodnje, bilo usjeva, bilo životinja. Veličina sveukupne proizvodnje nije odlučujući faktor. Ako u danoj jedinici proizvodnja usjeva ili uzgoj životinja prelazi 66% ili više od standardne bruto vrijednosti, ne bi trebala biti uključena ovdje, nego razvrstana, bilo u proizvodnju usjeva, bilo u uzgoj životinja. Ovaj razred isključuje: - mješoviti uzgoj usjeva, vidi skupinu 01.1 i 01.2 - mješoviti uzgoj životinja, vidi skupinu 01.4
scope note: Į šią klasę įeina mišrus augalų ir gyvulių auginimas, nesispecializuojant nei į augalų, nei į gyvulių auginimą. Bendrosios ūkininkavimo veiklos apimtis nėra lemiantis veiksnys. Jeigu augalų ar gyvulių auginimas siekia 66 ir daugiau procentų bendrosios ūkio gamybos, tokia kombinuota veikla turėtų būti klasifikuojama augalų arba gyvulių auginimo klasėse. Į šią klasę neįeina: - įvairių augalų auginimas, žr. 01.1 ir 01.2 grupes - įvairių gyvulių ir gyvūnų auginimas, žr. 01.4 grupę @lt
scope note: Данная группа включает дополнительные виды сельскохозяйственной деятельности, а также деятельность, схожую с сельскохозяйственной, но не направленную на производство продукции (сбор сельскохозяйственной продукции) за вознаграждение или на контрактной основе. В данную группу также включена деятельность, осуществляемая после сбора урожая и направленная на подготовку сельскохозяйственной продукции для первичного рынка. @ru
scope note: Bu sınıf, bitkisel ürünler veya hayvansal üretim konusunda bir uzmanlaşma olmaksızın bu ürünlerin bir arada üretiminin yapıldığı durumları kapsamaktadır. Toplamdaki çiftçilik işinin boyutu belirleyici bir etken değildir. Eğer, bir birimde bitkisel ürün veya hayvan üretiminin herhangi biri standart brüt karın yüzde 66`sına eşit veya fazlaysa birleşik faaliyet buraya dahil edilmemeli, tarımsal ürün yetiştiriciliğine ya da hayvan çiftçiliğine dağıtılmalıdır. Kapsam dışı olanlar; - karma bitkisel ürün çiftçiliği, bkz. gruplar 01.1 ve 01.2, - karma hayvan çiftçiliği, bkz. grup 01.4. @tr
preferred label: Комбинирано растениевъдно-животновъдно стопанство @bg
preferred label: Smíšené hospodářství @cs
preferred label: Blandet drift @da
preferred label: Gemischte Landwirtschaft @de
preferred label: Μικτές γεωργοκτηνοτροφικές δραστηριότητες @el
preferred label: Producción agrícola combinada con la producción ganadera @es
preferred label: Segapõllumajandus @et
preferred label: Yhdistetty kasvinviljely ja kotieläintalous (sekatilat) @fi
preferred label: Culture et élevage associés @fr
preferred label: Vegyes gazdálkodás
preferred label: Coltivazioni agricole associate all'allevamento di animali: attività mista @it
preferred label: Mišrusis žemės ūkis @lt
preferred label: Jauktā lauksaimniecība (augkopība un lopkopība) @lv
preferred label: Biedja mħallta @mt
preferred label: Gemengd bedrijf @nl
preferred label: Kombinert husdyrhold og planteproduksjon @no
preferred label: Uprawy rolne połączone z chowem i hodowlą zwierząt (działalność mieszana) @pl
preferred label: Produção agrícola e animal combinadas @pt
preferred label: Activităţi în ferme mixte (cultura vegetală combinată cu creşterea animalelor) @ro
preferred label: Смешанное сельское хозяйство @ru
preferred label: Zmiešané hospodárstvo @sk
preferred label: Mešano kmetijstvo @sl
preferred label: Blandat jordbruk @sv
preferred label: Karma çiftçilik @tr
broader: Mixed farming

Support activities to agriculture and post-harvest crop activities
type: Concept
notation: 01.6
status: valid
status modified: 2013-10-18
accepted date: 2013-10-18
in scheme: Statistical Classification of Economic Activities in the European Community, Rev. 2 (2008)
scope note: Тази група включва дейности, съпътстващи селскостопанското производство и подобни дейности, несвързани с производствените цели (в смисъл на прибиране на реколтата от селскостопанските продукти), извършени срещу заплащане (по договор или еднократно). Включват се също дейности след прибиране на реколтата, имащи за цел подготовка на селскостопанската продукция за първичния пазар. @bg
scope note: Tato skupina zahrnuje činnosti spojené se zemědělskou výrobou a činnosti podobné zemědělství, které nejsou vykonávané pro výrobní účely (ve smyslu získávání zemědělských produktů), vykonávané na základě smlouvy nebo dohody Skupina zahrnuje také posklizňové činnosti v rostlinné výrobě, které slouží přípravě zemědělských produktů pro primární trhy. @cs
scope note: Diese Gruppe umfasst Tätigkeiten, die mit der landwirtschaftlichen Produktion verbunden sind, sowie der Landwirtschaft ähnelnde Tätigkeiten, die nicht zu Produktionszwecken (im Sinne der Gewinnung landwirtschaftlicher Erzeugnisse) unternommen werden, im Lohnauftrag. Eingeschlossen sind auch nach der Ernte anfallende Tätigkeiten in der pflanzlichen Erzeugung, die der Aufbereitung landwirtschaftlicher Erzeugnisse für den Rohstoffmarkt dienen. @de
scope note: This group includes activities incidental to agricultural production and activities similar to agriculture not undertaken for production purposes (in the sense of harvesting agricultural products), done on a fee or contract basis. Also included are post-harvest crop activities, aimed at preparing agricultural products for the primary market. @en
scope note: Este grupo comprende las actividades relacionadas con la producción agrícola y otras similares a la agricultura que no tienen fines de producción (en el sentido de cosecha de productos agrarios), y realizadas por cuenta de terceros. Se incluyen también las actividades posteriores a la cosecha destinadas a preparar los productos agrarios para el mercado primario. @es
scope note: Ce groupe comprend les activités annexes à la production agricole et les activités analogues à l’agriculture qui ne sont pas effectuées à des fins de production (dans le sens de récolter des produits agricoles) et qui sont exercées pour le compte de tiers. Le traitement primaire des récoltes en vue de la préparation des produits agricoles pour le marché primaire est également compris. @fr
scope note: Ova skupina uključuje djelatnosti vezane za poljoprivrednu proizvodnju i djelatnosti koje su bliske poljoprivredi, ali se ne poduzimaju radi proizvodnje (npr. žetva/berba poljoprivrednih proizvoda), učinjene uz naplatu ili na osnovi ugovora. Uključene su i djelatnosti koje se obavljaju nakon žetve s ciljem pripremanja poljoprivrednih proizvoda za primarno tržište.
scope note: Į šią grupę įeina žemės ūkiui būdinga veikla ir ūkininkavimui artima veikla, tačiau nesusijusi su žemės ūkio produktų auginimu (šia prasme derliaus nuėmimas), ir atliekama už atlygį ar pagal sutartį. Taip pat įeina derliaus apdorojimo veikla, susijusi su žemės ūkio produktų paruošimu realizuoti pirminėje rinkoje. @lt
scope note: Этот класс включает: - виды сельскохозяйственной деятельности за вознаграждение или на контрактной основе: • подготовку полей • внедрение сельскохозяйственных культур • обработку культур • опрыскивание, включая обработку с воздуха • обрезку плодовых деревьев и виноградников • посадку риса, прополку свеклы • сбор урожая • борьбу с вредителями (включая кроликов) сельского хозяйства - принятие мер по поддержанию ландшафта и ландшафтные работы для защиты окружающей среды - работу сельскохозяйственного поливного оборудования Этот класс также включает: - предоставление сельскохозяйственной техники с операторами и техническим персоналом Этот класс исключает: - виды сельскохозяйственной деятельности после сбора урожая, см. 01.63 - осушение посевных земель, см. 43.12 - ландшафтную архитектуру, см. 71.11 - консультационные услуги в области агрономии и экономики сельского хозяйства, см. 74.90 - ландшафтное планирование и высаживание культур, см. 81.30 - организацию ярмарок и выставок сельскохозяйственной продукции, см. 82.30 @ru
scope note: Bu grup, tarımsal üretim ile ilgili faaliyetleri ve tarıma benzer olan ancak üretim amacıyla (tarımsal ürünlerin hasat edilmesi mantığıyla) gerçekleştirilmeyen, bir ücret veya sözleşme temelli olarak gerçekleştirilen faaliyetleri içermektedir. Ayrıca, birincil piyasalar için tarımsal ürünlerin hazırlanmasını amaçlayan hasat sonrası bitkisel ürün faaliyetlerini de içine almaktadır. @tr
preferred label: Спомагателни дейности в селското стопанство @bg
preferred label: Podpůrné činnosti pro zemědělství a posklizňové činnosti @cs
preferred label: Serviceydelser til landbrug og forarbejdning af afgrøder efter høst @da
preferred label: Erbringung von landwirtschaftlichen Dienstleistungen @de
preferred label: Υποστηρικτικές προς τη γεωργία δραστηριότητες και δραστηριότητες μετά τη συγκομιδή @el
preferred label: Actividades de apoyo a la agricultura, a la ganadería y de preparación posterior a la cosecha @es
preferred label: Põllumajandust abistavad tegevusalad ja saagikoristusjärgsed tegevused @et
preferred label: Maataloutta palveleva toiminta @fi
preferred label: Activités de soutien à l'agriculture et traitement primaire des récoltes @fr
preferred label: Mezőgazdasági-, betakarítást követő szolgáltatás
preferred label: Attività di supporto all'agricoltura e attività successive alla raccolta @it
preferred label: Žemės ūkiui būdingų paslaugų ir derliaus apdorojimo veikla @lt
preferred label: Lauksaimniecības papilddarbības un palīgdarbības pēc ražas novākšanas @lv
preferred label: Attivitajiet ta' sostenn għall-agrikoltura u attivitajiet ta' wara l-ħsad @mt
preferred label: Ondersteunende activiteiten in verband met de landbouw; activiteiten met betrekking tot gewassen na de oogst @nl
preferred label: Tjenester tilknyttet jordbruk og etterbehandling av vekster etter innhøsting @no
preferred label: Działalność usługowa wspomagająca rolnictwo i następująca po zbiorach @pl
preferred label: Actividades dos serviços relacionados com agricultura e produção animal @pt
preferred label: Activităţi auxiliare agriculturii şi activităţi după recoltare @ro
preferred label: Вспомогательные виды деятельности в области выращивания сельскохозяйственных культур @ru
preferred label: Služby poskytované v poľnohospodárstve a služby súvisiace so zberom úrody @sk
preferred label: Storitve za kmetijsko proizvodnjo, priprava pridelkov @sl
preferred label: Service till jordbruk och bearbetning av skördade växter @sv
preferred label: Tarımı destekleyici faaliyetler ve hasat sonrası bitkisel ürünler ile ilgili faaliyetler @tr
broader: Crop and animal production, hunting and related service activities
narrower: Support activities for crop production
narrower: Support activities for animal production
narrower: Post-harvest crop activities
narrower: Seed processing for propagation

Support activities for crop production
type: Concept
notation: 01.61
status: valid
status modified: 2013-10-18
accepted date: 2013-10-18
in scheme: Statistical Classification of Economic Activities in the European Community, Rev. 2 (2008)
scope note: - селскостопански дейности срещу заплащане (по договор или еднократно): • подготовка на полетата и почвата • засяване и засаждане на растенията • обработване на растенията • наторяване и пръскане, вкл. от въздуха • резитба на овощни дървета и лози • пресаждане на ориз, прореждане на цвекло и други подобни дейности • прибиране на реколтата • борба с вредителите по растенията (вкл. с дивите зайци) - поддържане на земеделските земи в добро агроекологично състояние - експлоатация на машини и оборудване за селскостопанско напояване - осигуряване на селскостопански машини и инвентар с оператор и обслужващ персонал - дейности след прибиране на реколтата - 01.63 - дренажни работи (пресушаване, отводняване) на земеделски земи - 43.12 - паркова архитектура - 71.11 - управленски и бизнес консултации, оказвани от агрономи, аграрикономисти и други селскостопански специалисти - 74.90 - оформяне и поддържане на озеленени площи - 81.30 - организиране на селскостопански изложения и панаири - 82.30 @bg
scope note: Z: - poskytování zemědělských služeb pro rostlinnou výrobu na základě smlouvy nebo dohody: • příprava polí • zakládání kultur • ošetřování kultur • postřik kultur, vč. leteckého • ořezávání ovocných stromů a vinné révy • přesazování rýže; jednocení řepy • sklizeň • ochrana proti škůdcům (vč. králíků) v zemědělství - udržování zemědělských ploch v dobrém zemědělském a ekologickém stavu - provozování zemědělských zavlažovacích systémů ZT: - půjčování zemědělských strojů s obsluhou N: - posklizňové činnosti v rostlinné výrobě (01.63) - odvodňování zemědělských ploch (43.12) - krajinnou architekturu (71.11) - činnosti agronomů a zemědělských ekonomů (74.90) - činnosti související s úpravou krajiny (81.30) - pořádání zemědělských výstav a veletrhů (82.30) @cs
scope note: Diese Klasse umfasst: - Erbringung von landwirtschaftlichen Dienstleistungen für den Pflanzenbau im Lohnauftrag: • Vorbereitung von Feldern • Anlage von Kulturen • Behandlung von Kulturen • Besprühen von Kulturen, auch aus der Luft • Beschneiden von Obstbäumen und Reben • Umpflanzen von Reis; Vereinzeln von Rüben • Ernten • Schädlingsbekämpfung (einschließlich Kaninchenbekämpfung) in der Landwirtschaft - Erhaltung landwirtschaftlicher Flächen in gutem landwirtschaftlichen und ökologischen Zustand - Betrieb von landwirtschaftlichen Bewässerungsanlagen Diese Klasse umfasst ferner: - Bereitstellung von landwirtschaftlichen Maschinen mit Bedienungspersonal Diese Klasse umfasst nicht: - Nach der Ernte anfallende Tätigkeiten in der pflanzlichen Erzeugung (s. 01.63) - Entwässerung von landwirtschaftlichen Flächen (s. 43.12) - Landschaftsgestaltung (s. 71.11) - Agrarwissenschaftliche und agrarwirtschaftliche Tätigkeiten (s. 74.90) - Landschaftsgärtnerei (s. 81.30) - Durchführung von Landwirtschaftsschauen und Messen (s. 82.30) @de
scope note: This class includes: - agricultural activities on a fee or contract basis: • preparation of fields • establishing a crop • treatment of crops • crop spraying, including by air • trimming of fruit trees and vines • transplanting of rice, thinning of beets • harvesting • pest control (including rabbits) in connection with agriculture - maintenance of agricultural land in good agricultural and environmental condition - operation of agricultural irrigation equipment This class also includes: - provision of agricultural machinery with operators and crew This class excludes: - post-harvest crop activities, see 01.63 - drainage of agricultural land, see 43.12 - landscape architecture, see 71.11 - activities of agronomists and agricultural economists, see 74.90 - landscape gardening, planting, see 81.30 - organisation of agricultural shows and fairs, see 82.30 @en
scope note: Esta clase comprende: - las actividades agrícolas por cuenta de terceros: • la preparación de terrenos de cultivo • la siembra de cultivos • el tratamiento de los cultivos • la fumigación de los cultivos, incluida la fumigación aérea • la poda de los árboles frutales y las vides • el trasplante de los tallos de arroz y el raleo de las remolachas • la cosecha • el control de las plagas (incluida la de conejos) en relación con la agricultura - el mantenimiento del terreno agrícola en buenas condiciones agrícolas y medioambientales - la explotación de equipos agrícolas de riego Esta clase comprende también: - la provisión de maquinaria agraria con operarios Esta clase no comprende: - las actividades posteriores a la cosecha (véase 01.63) - el drenaje de tierras agrícolas (véase 43.12) - la planificación paisajística (véase 71.11) - las actividades de agrónomos y economistas agrarios (véase 74.90) - el mantenimiento de jardines (véase 81.30) - la organización de ferias y muestras agrícolas (véase 82.30) @es
scope note: Cette classe comprend: - les activités agricoles exercées pour le compte de tiers: • préparation des terres • création de cultures • traitement des récoltes • pulvérisation des récoltes, y compris par des véhicules aériens • taille des arbres fruitiers et des vignes • transplantation du riz et démariage des betteraves • récolte • lutte contre les animaux nuisibles (y compris les lapins) en relation avec l’agriculture - le maintien des terres agricoles en bon état sur les plans agricole et environnemental - l’exploitation de systèmes d’irrigation pour l’agriculture Cette classe comprend également: - la mise à disposition de machines agricoles avec conducteur et personnel Cette classe ne comprend pas: - le traitement primaire des récoltes, voir 01.63 - le drainage des terrains agricoles, voir 43.12 - l’architecture paysagère, voir 71.11 - les activités des agronomes et des spécialistes de l’économie agricole, voir 74.90 - l’aménagement des paysages, la plantation, voir 81.30 - l’organisation d’expositions et de foires agricoles, voir 82.30 @fr
scope note: Ovaj razred uključuje: - poljoprivredne djelatnosti, uz naplatu ili na osnovi ugovora: • pripremu zemljišta • sjetvu/sadnju usjeva • njegu usjeva • zaprašivanje usjeva, uključujući iz zraka • orezivanje voćaka i vinove loze • presađivanje riže, prorjeđivanje repe • žetvu/berbu • zaštitu od štetočina (uključujući zečeve) u vezi s poljoprivredom - održavanje poljoprivrednog zemljišta u dobrom poljoprivrednom i ekološkom stanju - rukovanje poljoprivrednom opremom za navodnjavanje Ovaj razred također uključuje: - unajmljivanje poljoprivrednih strojeva s rukovateljem i poljoprivrednicima Ovaj razred isključuje: - djelatnosti koje se obavljaju nakon žetve usjeva, vidi 01.63 - drenažne radove na poljoprivrednom zemljištu, vidi 43.12 - projektiranje krajolika, vidi 71.11 - djelatnosti agronoma i agroekonomista, vidi 74.90 - sadnju i uređivanje krajolika (vrtova, parkova, zelenih površina), vidi 81.30 - organiziranje poljoprivrednih smotri i sajmova, vidi 82.30
scope note: Į šią klasę įeina: - žemės ūkio veikla už atlygį arba pagal sutartį: • dirvos paruošimas • laukų apsėjimas • pasėlių priežiūra • pasėlių purškimas, įskaitant purškimą iš lėktuvų • vaismedžių ir vynuogienojų genėjimas • ryžių persodinimas, runkelių retinimas • derliaus nuėmimas • kova su žemės ūkio kenkėjais (įskaitant triušius) - žemės ūkio paskirties žemės priežiūra, siekiant išlaikyti ją geros agronominės ir ekologinės būklės - sausinimo ir drėkinimo sistemų eksploatavimas Į šią klasę taip pat įeina: - žemės ūkio mašinų (su operatoriaus ar brigados samdymu) nuoma Į šią klasę neįeina: - derliaus apdorojimo veikla, žr. 01.63 - žemės ūkio paskirties žemės sausinimas, žr. 43.12 - kraštovaizdžio architektūra, žr. 71.11 - agronomų ir žemės ūkio ekonomistų veikla, žr.74.90 - dekoratyvinė sodininkystė, sodinimas, žr. 81.30 - žemės ūkio parodų ir mugių organizavimas, žr. 82.30 @lt
scope note: Этот класс включает: - виды сельскохозяйственной деятельности за вознаграждение или на контрактной основе: • услуги по стимулированию разведение, роста и продуктивности животных • обследование состояния стада, перегонку скота, выпас скота, выхолащивание домашней птицы, чистку клеток и т.д. • деятельность, связанную с искусственным осеменением • коневодство • стрижку овец • уход и содержание сельскохозяйственных животных Этот класс также включает: - подковывание лошадей Этот класс исключает: - предоставление помещений только для содержания животных, см. 68.20 - ветеринарные услуги, см. 75.00 - вакцинацию животных, см. 75.00 - аренду животных (например, домашних), см. 77.39 - уход/содержание домашних животных, см. 96.09 @ru
scope note: Bu sınıf aşağıdakileri kapsamaktadır;- ücret veya sözleşme temeline dayalı olarak gerçekleştirilen tarım faaliyetleri; • tarlaların hazırlanması, • bitkisel ürünlerin ekilmesi, • bitkisel ürünlerin iyileştirilmesi, • havadan olanlar dahil olmak üzere bitkisel ürünlere ilaç, gübre, vb. sıkılması, • meyve ağaçlarının ve üzüm asmalarının budanması, • pirincin fidelenmesi, pancarın seyreltilmesi, • hasat, • tarımla ilgili olan zararlıların (tavşan dahil) kontrol edilmesi, - tarımsal arazinin tarımsal ve çevresel açıdan iyi durumda korunması, - tarımsal sulama ekipmanlarının işletilmesi, Ayrıca bu sınıf aşağıdakileri de kapsamaktadır; - tarımsal makinelerin operatörleri ve ekibi ile birlikte sağlanması. Kapsam dışı olanlar; - hasat sonrası bitkisel ürünler ile ilgili faaliyetler, bkz. 01.63, - tarımsal alanlar için akaçlama (drenaj), bkz. 43.12, - peyzaj mimarisi, bkz. 71.11, - tarım uzmanlarının ve tarım ekonomistlerinin faaliyetleri, bkz. 74.90, - peyzaj bahçeciliği, bitki dikim işleri, bkz. 81.30, - tarımsal gösteriler, fuar organizasyonu, bkz. 82.30, @tr
preferred label: Спомагателни дейности в растениевъдството @bg
preferred label: Podpůrné činnosti pro rostlinnou výrobu @cs
preferred label: Serviceydelser i forbindelse med planteavl @da
preferred label: Erbringung von landwirtschaftlichen Dienstleistungen für den Pflanzenbau @de
preferred label: Υποστηρικτικές δραστηριότητες για τη φυτική παραγωγή @el
preferred label: Actividades de apoyo a la agricultura @es
preferred label: Taimekasvatuse abitegevused @et
preferred label: Kasvinviljelyä palveleva toiminta @fi
preferred label: Activités de soutien aux cultures @fr
preferred label: Növénytermesztési szolgáltatás
preferred label: Attività di supporto alla produzione vegetale @it
preferred label: Augalininkystei būdingų paslaugų veikla @lt
preferred label: Augkopības papilddarbības @lv
preferred label: Attivitajiet ta' sostenn għall-produzzjoni ta' għelejjel @mt
preferred label: Ondersteunende activiteiten in verband met de teelt van gewassen @nl
preferred label: Tjenester tilknyttet planteproduksjon @no
preferred label: Działalność usługowa wspomagająca produkcję roślinną @pl
preferred label: Actividades dos serviços relacionados com a agricultura @pt
preferred label: Activităţi auxiliare pentru producţia vegetală @ro
preferred label: Вспомогательные виды деятельности в области выращивания сельскохозяйственных культур @ru
preferred label: Služby súvisiace s pestovaním plodín @sk
preferred label: Storitve za rastlinsko pridelavo @sl
preferred label: Service till växtodling @sv
preferred label: Bitkisel üretimi destekleyici faaliyetler @tr
broader: Support activities to agriculture and post-harvest crop activities

Support activities for animal production
type: Concept
notation: 01.62
status: valid
status modified: 2013-10-18
accepted date: 2013-10-18
in scheme: Statistical Classification of Economic Activities in the European Community, Rev. 2 (2008)
scope note: - дейности в животновъдството срещу заплащане (по договор или еднократно): • дейности, подпомагащи развъждането - аклиматизиране, прираст и продуктивност на животните • тестване и изследване на състоянието на стадата, услуги по съпровождане и паша на стадата, кастриране на домашни животни, почистване на кафези и птичарници • изкуствено осеменяване на животни • услуги в конюшни (отглеждане, грижи за расови коне за разплод) • стригане на овце • подслоняване и изхранване на селскостопански животни в стопанства - подковаване на коне - осигуряване на места за пансиони за домашни любимци - 68.20 - дейности оказвани от ветеринарни лекари - 75.00 - ваксиниране на животни - 75.00 - вземане/даване под наем на животни, вкл. стада - 77.39 - пансион за домашни любимци - 96.09 @bg
scope note: Z: - poskytování zemědělských služeb pro živočišnou výrobu na základě smlouvy nebo dohody: • činnosti podporující rozmnožování, růst a výkony zvířat • kontrola stád, vyhánění dobytka, příprava pastvin, kastrace drůbeže, čištění chovatelských prostor atd. • činnosti spojené s umělou inseminací • plemenářské služby • stříhání ovcí • ustájení hospodářských zvířat a péče o ně ZT: - činnosti podkovářů N: - poskytování prostor výlučně za účelem ustájení dobytka (68.20) - činnosti veterinářů (75.00) - očkování zvířat (75.00) - pronájem zvířat (např. stád) (77.39) - ubytování domácích zvířecích mazlíčků (96.09) @cs
scope note: Diese Klasse umfasst: - Erbringung von landwirtschaftlichen Dienstleistungen für die Tierhaltung im Lohnauftrag: • Tätigkeiten zur Förderung von Vermehrung, Wachstum und Leistung von Tieren • Herdenprüfung, Viehtreiben, Bereitstellung von Weiden, Kapaunisieren, Stallreinigung usw. • mit künstlicher Besamung verbundene Tätigkeiten • Deckdienste • Schafschur • Aufnahme von Pensionsvieh; Pflege von Nutztieren Diese Klasse umfasst ferner: - Tätigkeiten von Hufschmiedetätigkeiten Diese Klasse umfasst nicht: - Bereitstellung von Flächen und Gebäuden ausschließlich für die Aufnahme von Vieh (s. 68.20) - Veterinärwesen (s. 75.00) - Impfen von Tieren (s. 75.00) - Vermietung von Tieren (z. B. Herden) (s. 77.39) - Aufnahme von Haustieren in Tierpensionen (s. 96.09) @de
scope note: This class includes: - agricultural activities on a fee or contract basis: • activities to promote propagation, growth and output of animals • herd testing services, droving services, agistment services, poultry caponising, coop cleaning etc. • activities related to artificial insemination • stud services • sheep shearing • farm animal boarding and care This class also includes: - activities of farriers This class excludes: - provision of space for animal boarding only, see 68.20 - veterinary activities, see 75.00 - vaccination of animals, see 75.00 - renting of animals (e.g. herds), see 77.39 - pet boarding, see 96.09 @en
scope note: Esta clase comprende: - las actividades ganaderas por cuenta de terceros: • las actividades destinadas al fomento, desarrollo y producción de ganado • los servicios de control del ganado, de su conducción, de pasturaje, de castración de aves de corral, de limpieza de corrales, etc. • las actividades relacionadas con la inseminación artificial • los servicios de oferta de sementales • el esquileo de ovejas • la estabulación de animales de granja y su cuidado Esta clase comprende también: - las actividades de herraje Esta clase no comprende: - la provisión de espacio sólo para alojamiento de animales (véase 68.20) - los servicios veterinarios (véase 75.00) - la vacunación de animales (véase 75.00) - el alquiler de animales (por ejemplo, rebaños) (véase 77.39) - el alojamiento de animales de compañía (véase 96.09) @es
scope note: Cette classe comprend: - les activités agricoles exercées pour le compte de tiers: • activités visant à promouvoir le repeuplement, la croissance et le rendement d’animaux • services de comparaison du rendement des troupeaux, de conduite de troupeaux, de paissance, de castration de volailles, de nettoyage de poulaillers, etc. • activités en rapport avec l’insémination artificielle • services de haras • tonte d’ovins • hébergement et entretien d’animaux de ferme Cette classe comprend également: - les activités des maréchaux-ferrants Cette classe ne comprend pas: - la fourniture d’espace pour les activités de prise en pension d’animaux uniquement, voir 68.20 - les activités vétérinaires, voir 75.00 - la vaccination d’animaux, voir 75.00 - la location d’animaux (par exemple: troupeaux), voir 77.39 - les activités de prise en pension d’animaux de compagnie, voir 96.09 @fr
scope note: Ovaj razred uključuje: - poljoprivredne djelatnosti uz naplatu ili na osnovi ugovora: • djelatnosti usmjerene na rasplođivanje te rast i obujam stočarske proizvodnje • usluge testiranja stada, vođenja stada, usluge iznajmljivanja polja za ispašu, kastriranje peradi, čišćenje peradarnika itd. • djelatnosti umjetnog osjemenjivanja • djelatnosti vezane za brigu o ergeli konja • šišanje ovaca • hranidbu i brigu o domaćim životinjama Ovaj razred također uključuje: - djelatnosti potkivanja Ovaj razred isključuje: - davanje u najam prostora za hranidbu životinja, vidi 68.20 - veterinarske djelatnosti, vidi 75.00 - cijepljenje životinja, vidi 75.00 - iznajmljivanje životinja (npr. stada), vidi 77.39 - hranidbu kućnih ljubimaca, vidi 96.09
scope note: Į šią klasę įeina: - žemės ūkio veikla už atlygį arba pagal sutartį: • gyvulių veisimą, auginimą ir produktyvumą skatinanti veikla • bandos patikrinimo, pervarymo, ganymo paslaugos, vienadienių gaidžiukų kastravimas, vištidžių valymas ir kt. • veikla, susijusi su dirbtiniu apsėklinimu • veislinių žirgų paslaugų teikimas • avių kirpimas • ūkio gyvulių šėrimas ir priežiūra Į šią klasę taip pat įeina: - kalvių (arklių kaustytojų) veikla Į šią klasę neįeina: - vietos gyvuliams šerti suteikimas, žr. 68.20 - veterinarinė veikla, žr. 75.00 - gyvulių skiepijimo veikla, žr. 75.00 - gyvulių (pvz., bandos) nuoma, žr. 77.39 - naminių gyvūnėlių šėrimas, žr. 96.09 @lt
scope note: Этот класс включает: подготовку сельскохозяйственных культур для первичного рынка, то есть, очистку, подрезку, сортировку, обработку - очистку хлопка от семян - подготовку табачных листьев, например, сушку - подготовку какао-бобов, например, очищение - обработку поверхности фруктов Этот класс исключает: - подготовку сельскохозяйственной продукции производителем, см. соответствующий класс групп 01.1, 01.2 или 01.3 - сельскохозяйственную деятельность после сбора урожая, необходимую для улучшения качества семян, см. 01.64 - отделение черенков и повторную сушку табака, см. 12.00 - сбыт продукции заказчикам и кооперативным ассоциациям, см. 46 - оптовую торговлю сельскохозяйственной сырьевой продукцией, см. 46.2 @ru
scope note: Bu sınıf aşağıdakileri kapsamaktadır; - bir ücret karşılığında ya da sözleşmeye dayalı olarak gerçekleştirilen tarımsal faaliyetler: • hayvanların çoğalmalarını, büyütülmelerini ve üretimlerini arttırmak için yapılan faaliyetler • sürü test etme (süt vb. testi) hizmetleri, sürülerin güdülmesi hizmetleri, başkalarına ait hayvanların beslenmesi hizmetleri, kümes hayvanlarının semizleşmesi için kısırlaştırılması, kümeslerin temizlenmesi vb. • yapay dölleme ile ilgili faaliyetler • damızlık hizmetleri • koyunların kırkılması • çiftlik hayvanlarına barınak sağlanarak bakımı ve beslenmesi Ayrıca bu sınıf aşağıdakileri de kapsamaktadır; - nalbant faaliyetleri Kapsam dışı olanlar; - sadece hayvanların bakılması için yer sağlanması, bkz. 68.20, - veterinerlik faaliyetleri, bkz. 75.00, - hayvanların aşılanması, bkz. 75.00, - hayvanların kiralanması (örn. sürüler), bkz.77.39, - evde beslenen hayvanların bakımı, bkz. 96.09, @tr
preferred label: Спомагателни дейности в животновъдството @bg
preferred label: Podpůrné činnosti pro živočišnou výrobu @cs
preferred label: Serviceydelser i forbindelse med husdyravl @da
preferred label: Erbringung von landwirtschaftlichen Dienstleistungen für die Tierhaltung @de
preferred label: Υποστηρικτικές δραστηριότητες για τη ζωική παραγωγή @el
preferred label: Actividades de apoyo a la ganadería @es
preferred label: Loomakasvatuse abitegevused @et
preferred label: Kotieläintaloutta palveleva toiminta @fi
preferred label: Activités de soutien à la production animale @fr
preferred label: Állattenyésztési szolgáltatás
preferred label: Attività di supporto alla produzione animale @it
preferred label: Gyvulininkystei būdingų paslaugų veikla @lt
preferred label: Lopkopības papilddarbības @lv
preferred label: Attivitajiet ta' sostenn għall-produzzjoni ta' annimali @mt
preferred label: Ondersteunende activiteiten in verband met de veeteelt @nl
preferred label: Tjenester tilknyttet husdyrhold @no
preferred label: Działalność usługowa wspomagająca chów i hodowlę zwierząt @pl
preferred label: Actividades dos serviços relacionados com a produção animal @pt
preferred label: Activităţi auxiliare pentru creşterea animalelor @ro
preferred label: Вспомогательные виды деятельности по разведению животных @ru
preferred label: Služby súvisiace s chovom zvierat @sk
preferred label: Storitve za živinorejo, razen veterinarskih @sl
preferred label: Service till husdjursskötsel @sv
preferred label: Hayvan üretimini destekleyici faaliyetler @tr
broader: Support activities to agriculture and post-harvest crop activities

Post-harvest crop activities
type: Concept
notation: 01.63
status: valid
status modified: 2013-10-18
accepted date: 2013-10-18
in scheme: Statistical Classification of Economic Activities in the European Community, Rev. 2 (2008)
scope note: - първична обработка на продуктите за пазара - почистване, сортиране, дезинфекциране - отделяне на семената от памука - първична обработка на тютюневите листа, например сушене - първична обработка на какаови зърна, например обелване и изваждане на какаовите семена - покриване на плодове с восък - първична подготовка на селскостопанската продукция при производителя, виж кореспондиращия клас в групи 01.1, 01.2 или 01.3 - дейности след прибиране на реколтата, целящи подобряване на качеството на семената - 01.64 - обезжилване и повторно сушене на тютюна - 12.00 - дейности, свързани с посредничество на търговци на едро и кооперативни сдружения - раздел 46 - продажба на едро на селскостопански продукти - 46.2 @bg
scope note: Z: - přípravu rostlinných produktů pro primární trhy, např. čištění, ořezávání, třídění, dezinfekci - vyzrňování bavlny - přípravu tabákových listů, např. sušení - přípravu kakaových bobů, např. vyloupávání z lusků - voskování ovoce N: - přípravu zemědělských produktů výrobcem (odpovídající třída ve skupinách 01.1, 01.2 a 01.3) - posklizňové činnosti pro účely zlepšování kvality osiva (01.64) - odstopkovávání a přesušování tabákových listů (12.00) - činnosti obchodních zástupců a družstev zabývajících se prodejem zemědělských produktů (oddíl 46) - velkoobchod se zemědělskými základními surovinami (46.2) @cs
scope note: Diese Klasse umfasst: - Aufbereitung pflanzlicher Erzeugnisse für die Rohstoffmärkte, z. B. Reinigen, Beschneiden, Sortieren, Desinfizieren - Baumwollentkörnung - Aufbereitung von Tabakblättern, z. B. Trocknen - Aufbereitung von Kakaobohnen, z. B. Schälen - Wachsen von Obst Diese Klasse umfasst nicht: - Aufbereitung landwirtschaftlicher Erzeugnisse durch den Erzeuger (s. entsprechende Klasse in den Gruppen 01.1, 01.2 und 01.3) - nach der Ernte anfallende Tätigkeiten zur Saatgutverbesserung (s. 01.64) - Entrippen und Redrying von Tabak (s. 12.00) - Vermarktungstätigkeiten von Handelsagenten und Genossenschaften (s. Abteilung 46) - Großhandel mit landwirtschaftlichen Grundstoffen (s. 46.2) @de
scope note: This class includes: - preparation of crops for primary markets, i.e. cleaning, trimming, grading, disinfecting - cotton ginning - preparation of tobacco leaves, e.g. drying - preparation of cocoa beans, e.g. peeling - waxing of fruit This class excludes: - preparation of agricultural products by the producer, see corresponding class in groups 01.1, 01.2 or 01.3 - post-harvest activities aimed at improving the propagation quality of seed, see 01.64 - stemming and redrying of tobacco, see 12.00 - marketing activities of commission merchants and cooperative associations, see division 46 - wholesale of agricultural raw materials, see 46.2 @en
scope note: Esta clase comprende: - la preparación de cultivos para los mercados primarios (limpieza, recorte de hojas y pedúnculos, clasificación, desinfección) - el desmotado de algodón - la preparación de hojas de tabaco (por ejemplo, secado) - la preparación de granos de cacao (por ejemplo, pelado) - el encerado de la fruta Esta clase no comprende: - la preparación de productos agrarios por el productor (véase la clase correspondiente en los grupos 01.1, 01.2 ó 01.3) - las actividades posteriores a la cosecha orientadas a la mejora de la calidad reproductiva de las semillas (véase 01.64) - desvenado y resecado del tabaco (véase 12.00) - las actividades de marketing efectuadas por intermediarios a comisión y por asociaciones cooperativas (véase la división 46) - el comercio al por mayor de materias primas agrarias (véase 46.2) @es
scope note: Cette classe comprend: - la préparation des cultures en vue de leur commercialisation primaire: nettoyage, taille, triage, désinfection - l’égrenage du coton - la préparation des feuilles de tabac, par exemple: séchage - la préparation des fèves de cacao, par exemple: écabossage - le paraffinage de fruits Cette classe ne comprend pas: - la préparation des produits agricoles par le producteur, voir classe correspondante dans les groupes 01.1, 01.2 ou 01.3. - les activités de traitement primaire des récoltes visant à améliorer la qualité des semences, voir 01.64 - l’écôtage et le resséchage des feuilles de tabac, voir 12.00 - les activités marchandes des intermédiaires du commerce et des associations coopératives, voir division 46 - le commerce de gros de produits agricoles bruts, voir 46.2 @fr
scope note: Ovaj razred uključuje: - pripremanje usjeva za primarno tržište, tj. čišćenje, orezivanje, sortiranje, dezinficiranje - čišćenje pamuka od sjemenja - pripremanje duhanskih listova, npr. sušenje - pripremu zrna kakaovca, npr. ljuštenje - premazivanje voćaka smolom Ovaj razred isključuje: - pripremu poljoprivrednih proizvoda od strane proizvođača, vidi pripadajući razred u skupini 01.1, 01.2 i 01.3 - djelatnosti koje se obavljaju nakon žetve usjeva s ciljem poboljšanja kvalitete sjemenja, vidi 01.64 - ižiljavanje i ponovno sušenje duhana, vidi 12.00 - marketinške djelatnosti trgovačkih posrednika i zadružnih organizacija, vidi odjeljak 46 - trgovinu na veliko poljoprivrednim sirovinama, vidi 46.2
scope note: Į šią klasę įeina: - nuimto derliaus paruošimas realizuoti pirminėje rinkoje, t.y. išvalymas, išvėtymas, rūšiavimas, dezinfekavimas - medvilnės džinavimas - tabako lapų paruošimas, pvz., džiovinimas - kakavos pupelių paruošimas, pvz., lukštenimas - vaisių vaškavimas Į šią klasę neįeina: - savo išaugintų žemės ūkio produktų paruošimas, žr. atitinkamas 01.1, 01.2 ir 01.3 grupių klases - derliaus apdorojimo veikla, skirta pagerinti sėklų derlingumą, žr. 01.64 - tabako kotelių nuskabymas ir pakartotinis džiovinimas, žr. 12.00 - komisinės prekybos atstovų ir kooperatinių asociacijų prekybinė veikla, žr. 46 skyrių - žemės ūkio žaliavų didmeninė prekyba, žr. 46.2 @lt
scope note: Этот класс включает все виды сельскохозяйственной деятельности после сбора урожая, необходимые для улучшения качества семян, очищение семян от инородного материала путем пропускания семян через сито механическим способом или удаление семян, испорченных насекомыми и недозревших семян, так же как и удаление сырых семян, не пригодных для хранения. Данная деятельность включает сушку, очистку, сортировку и обработку семян и приведение их в надлежащее состояние. Обработка генетически модифицированных семян также включена в данный класс. Этот класс исключает: - выращивание семян, см. 01.1 и 01.2 - обработку семян в целях производства и получения масла, см. 10.41 - исследования с целью получения или модификации новых форм семян, см. 72.11 @ru
scope note: Bu sınıf aşağıdakileri kapsamaktadır; - birincil piyasalar için bitkisel ürünlerin hazırlanması, örneğin; temizleme, süsleme, derecelendirme, dezenfekte etme, - pamuğun çırçırlanması, - tütün yapraklarının hazırlanması, - kakao çekirdeklerinin hazırlanması, - meyvelerin parafinlenmesi. Kapsam dışı olanlar; - tarım ürünlerinin üreticiler tarafından hazırlanması, 01.1, 01.2 veya 01.3 gruplarına tekabül eden sınıfa bakınız, - tohum üretim kalitesinin geliştirilmesini amaçlayan yeni hasat faaliyetleri, bkz.01.64, - tütünün saplarının ayrılması ve tekrar kurutulması, bkz. 12.00, - komisyoncu tüccarlarca (özellikle tarım ürünlerinin üreticiden toplanıp merkezi pazarda satışıyla ilgilenen, komisyon karşılığı çalışan bağımsız toptancı) veya kooperatif birliklerince yerine getirilen pazarlama faaliyetleri, bkz. bölüm 46, - tarımsal hammaddelerin toptan satışı, bkz. 46.2, @tr
preferred label: Дейности след прибиране на реколтата @bg
preferred label: Posklizňové činnosti @cs
preferred label: Forarbejdning af afgrøder efter høst @da
preferred label: Nach der Ernte anfallende Tätigkeiten in der pflanzlichen Erzeugung @de
preferred label: Δραστηριότητες μετά τη συγκομιδή @el
preferred label: Actividades de preparación posterior a la cosecha @es
preferred label: Saagikoristusjärgsed tegevused @et
preferred label: Sadon jatkokäsittely @fi
preferred label: Traitement primaire des récoltes @fr
preferred label: Betakarítást követő szolgáltatás
preferred label: Attività successive alla raccolta @it
preferred label: Derliaus apdorojimo veikla @lt
preferred label: Palīgdarbības pēc ražas novākšanas @lv
preferred label: Attivitajiet ta' wara l-ħsad @mt
preferred label: Activiteiten met betrekking tot gewassen na de oogst @nl
preferred label: Etterbehandling av vekster etter innhøsting @no
preferred label: Działalność usługowa następująca po zbiorach @pl
preferred label: Actividades pós-colheita @pt
preferred label: Activităţi după recoltare @ro
preferred label: Виды сельскохозяйственной деятельности после сбора урожая @ru
preferred label: Služby súvisiace so zberom úrody @sk
preferred label: Priprava pridelkov @sl
preferred label: Bearbetning av skördade växter @sv
preferred label: Hasat sonrası bitkisel ürünler ile ilgili faaliyetler @tr
broader: Support activities to agriculture and post-harvest crop activities

Seed processing for propagation
type: Concept
notation: 01.64
status: valid
status modified: 2013-10-18
accepted date: 2013-10-18
in scheme: Statistical Classification of Economic Activities in the European Community, Rev. 2 (2008)
scope note: Този клас включва всички дейности след прибиране на реколтата, насочени към подобряване на качеството на семената за размножаване чрез отстраняване на негодните недоразвити, механически повредени или наядени от насекоми (инсектициди) и недозрели семена, както и отстраняване на влагата от семената до безопасно ниво за складирането (съхранението) им. Това включва сушене, почистване, сортиране и третиране на семената, докато те се продадат. Тук е включено и третирането на генномодифицираните семена. - отглеждане на семена - 01.1 и 01.2 - преработване на семена за добиване на масла - 10.41 - научноизследователски дейности за създаване на нови форми семена, усъвършенстване или модифициране на вече създадени семена - 72.11 @bg
scope note: Tato třída zahrnuje všechny posklizňové činnosti prováděné za účelem zlepšování kvality osiva jako odstranění cizích látek, příliš malých, mechanicky nebo hmyzem poškozených nebo nezralých semen a snižování vlhkosti osiva na úroveň vhodnou pro skladování. Tato činnost zahrnuje sušení, čištění, třídění a zacházení s osivem až po prodej. Je zde zahrnuto také nakládání s geneticky modifikovanými osivy. N: - pěstování osiva (01.1, 01.2) - zpracování semen za účelem získávání oleje (10.41) - výzkumné činnosti pro účely vývoje nových forem osiva (72.11) @cs
scope note: Diese Klasse umfasst alle nach der Ernte anfallenden Tätigkeiten zur Saatgutverbesserung durch Entfernen von Fremdstoffen, zu kleiner, mechanisch oder von Insekten beschädigter oder unreifer Samen sowie durch Trocknung des Saatgutes bis auf ein für die Lagerung unschädliches Niveau. Diese Tätigkeit umfasst das Trocknen, Reinigen, Sortieren und Behandeln von Saatgut bis zur Vermarktung. Eingeschlossen ist die Behandlung von gentechnisch verändertem Saatgut. Diese Klasse umfasst nicht: - Anbau von Saatgut (s. Gruppen 01.1 und 01.2) - Verarbeitung von Saatgut zur Gewinnung von Öl (s. 10.41) - Forschungstätigkeiten zur Entwicklung neuer Formen von Saatgut (s. 72.11) @de
scope note: This class includes all post-harvest activities aimed at improving the propagation quality of seed through the removal of non-seed materials, undersized, mechanically or insect-damaged and immature seeds as well as removing the seed moisture to a safe level for seed storage. This activity includes the drying, cleaning, grading and treating of seeds until they are marketed. The treatment of genetically modified seeds is included here. This class excludes: - growing of seeds, see groups 01.1 and 01.2 - processing of seeds to obtain oil, see 10.41 - research to develop or modify new forms of seeds, see 72.11 @en
scope note: Esta clase comprende todas las actividades posteriores a la cosecha destinadas a mejora la calidad de reproducción de la semilla mediante la eliminación de materiales ajenos a la semilla, los demasiado pequeños, los que tienen daños mecánicos o causados por insectos, las semillas no maduras, así como la eliminación de la humedad de la semilla hasta un nivel seguro para el almacenamiento de ésta. Esta actividad incluye el secado, la limpieza, la clasificación y el tratamiento de las semillas hasta su comercialización. Se incluye en este apartado el tratamiento de semillas genéticamente modificadas. Esta clase no comprende: - el cultivo de semillas (véanse grupos 01.1 y 01.2) - el tratamiento de semillas para extracción de aceite (véase 10.41) - la investigación para desarrollar o modificar nuevas formas de semillas (véase 72.11) @es
scope note: Cette classe comprend l’ensemble des activités de traitement primaire des récoltes visant à améliorer la qualité des semences en les débarrassant des impuretés, des semences de trop petite taille ou rongées par la machine ou par des insectes et des semences immatures ou encore en enlevant la moisissure afin de garantir des bonnes conditions d’entreposage. Cette activité comprend le séchage, le nettoyage, le triage et le traitement des semences jusqu’à leur commercialisation. Le traitement de céréales génétiquement modifiées est compris. Cette classe ne comprend pas: - la production de semences, voir groupes 01.1 et 01.2 - le traitement des graines en vue d’obtenir de l’huile, voir 10.41 - les activités de recherche pour développer de nouvelles formes de graines ou les modifier, voir 72.11 @fr
scope note: Ovaj razred uključuje sve djelatnosti koje se obavljaju nakon žetve s ciljem poboljšanja kvalitete sjemenskog materijala kao što su odvajanje primjesa, odvajanje sjemenja koje ne zadovoljava veličinom, oštećenoga (mehanički ili od kukaca), nedozreloga, te snižavanje vlažnosti sjemenja na razinu sigurnu za skladištenje. Ova djelatnost uključuje sušenje, čišćenje, sortiranje i obradu sjemenja do prodaje. Ovdje je uključena i obrada genetički modificiranog sjemenja. Ovaj razred isključuje: - uzgoj sjemenja, vidi skupinu 01.1 i 01.2 - preradu sjemenja za dobivanje ulja, vidi 10.41 - istraživanje u svrhu razvoja novih ili izmjenjenih vrsta sjemenja, vidi 72.11
scope note: Į šią klasę įeina visos derliaus dorojimo veiklos rūšys, susijusios su sėklos veislingumo kokybės gerinimu, išvalant iš jų nesėklines medžiagas, mažų matmenų, mechaniškai ar kenkėjų pažeistas ir nesubrendusias sėklas, taip pat sumažinant jos drėgmės kiekį iki sandėliavimui tinkamo saugaus lygio. Ši veikla apima sėklos džiovinimą, valymą, rūšiavimą ir apdorojimą iki ji paženklinama. Genetiškai modifikuotos sėklos apdorojimas įeina į šią klasę. Į šią klasę neįeina: - sėklų auginimas, žr. 01.1 ir 01.2 grupes - sėklų perdirbimas aliejui gauti, žr. 10.41 - moksliniai tyrinėjimai siekiant išvesti ar modifikuoti naujas sėklų formas, žr. 72.11 @lt
scope note: Bu sınıf, tohumun depolanması için tohumdaki rutubetin güvenli bir seviyeye çekilmesi de dahil, tohum olmayan maddelerin, normalden daha küçük olan, mekanik olarak veya haşaratlar yüzünden hasarlı olan, olgunlaşmamış olan tohumların ayıklanması yoluyla tohumların üretim kalitesini geliştirmeyi amaçlayan hasat sonrası faaliyetlerin tamamını kapsamaktadır. Bu faaliyet, tohumlar pazarlanana kadar tohumların kurutulmasını, temizlenmesini, derecelenmesi ve tahlil edilmesini de kapsamaktadır. Genetik olarak geliştirilmiş tohumların işlenmesi de burada kapsanmaktadır. Kapsam dışı olanlar; - tohumların yetiştirilmesi, bkz. grup 01.1 ve 01.2, - yağ elde etmek üzere tohumların işlenmesi, bkz. 10.41, - yeni tohum çeşitleri geliştirmek ya da belirlemek için araştırma yapılması, bkz. 72.11. @tr
preferred label: Обработка на семена за посев @bg
preferred label: Zpracování osiva pro účely množení @cs
preferred label: Forarbejdning af frø/sædekorn til udsæd @da
preferred label: Saatgutaufbereitung @de
preferred label: Επεξεργασία σπόρων πολλαπλασιασμού @el
preferred label: Tratamiento de semillas para reproducción @es
preferred label: Seemnete töötlemine paljundamiseks @et
preferred label: Siementen käsittely kasvinviljelyä varten @fi
preferred label: Traitement des semences @fr
preferred label: Vetési célú mag-feldolgozás
preferred label: Lavorazione delle sementi per la semina @it
preferred label: Sėklininkystė @lt
preferred label: Sēklu apstrāde sējai @lv
preferred label: Ipproċessar taż-żerriegħa għall-propagazzjoni @mt
preferred label: Zaadbewerking met het oog op vermeerdering @nl
preferred label: Behandling av såfrø @no
preferred label: Obróbka nasion dla celów rozmnażania @pl
preferred label: Tratamento de sementes para propagação @pt
preferred label: Pregătirea seminţelor @ro
preferred label: Обработка и подготовка семян для размножения @ru
preferred label: Spracovanie semien na sadenie @sk
preferred label: Obdelava semen @sl
preferred label: Bearbetning av utsäde @sv
preferred label: Bitkisel üretim için tohumun işlenmesi @tr
broader: Support activities to agriculture and post-harvest crop activities

Hunting, trapping and related service activities
type: Concept
notation: 01.7
status: valid
status modified: 2013-10-18
accepted date: 2013-10-18
in scheme: Statistical Classification of Economic Activities in the European Community, Rev. 2 (2008)
scope note: Этот класс включает: - охоту и отлов в коммерческих целях - охоту, включая ловлю животных, для употребления в пищу, получения меха, кожи или для использования в исследовательских целях, для помещения в зоопарки или для выращивания в домашних условиях - производство пушнины, кожи пресмыкающихся и птиц в результате охоты или ловли Этот класс также включает: - наземную добычу морских млекопитающих, таких как моржи и тюлени Этот класс исключает: - производство меховых шкурок, кожи пресмыкающихся и птиц в результате разведения животных на фермах, см. 01.49 - разведение дичи на фермах, см. 01.4 - отлов китов, см. 03.11 - производство кож и шкур на скотобойне, см. 10.11 - виды деятельности, связанные со спортивной охотой и отдыхом, см. 93.19 - деятельность, направленную на развитие и продвижение охоты и отлова, см. 94.99 @ru
preferred label: Лов и спомагателни дейности @bg
preferred label: Lov a odchyt divokých zvířat a související činnosti @cs
preferred label: Jagt, fældefangst og serviceydelser i forbindelse hermed @da
preferred label: Jagd, Fallenstellerei und damit verbundene Tätigkeiten @de
preferred label: Θήρα, τοποθέτηση παγίδων και συναφείς δραστηριότητες @el
preferred label: Caza, captura de animales y servicios relacionados con las mismas @es
preferred label: Jahindus ja seda teenindavad tegevusalad @et
preferred label: Metsästys ja sitä palveleva toiminta @fi
preferred label: Chasse, piégeage et services annexes @fr
preferred label: Vadgazdálkodás, vadgazdálkodási szolgáltatás
preferred label: Caccia, cattura di animali e servizi connessi @it
preferred label: Medžioklė, gaudymas spąstais ir susijusių paslaugų veikla @lt
preferred label: Medniecība un ar to saistītās palīgdarbības @lv
preferred label: Kaċċa, insib u attivitajiet ta' servizz relatati @mt
preferred label: Jacht, zetten van vallen en diensten in verband met deze activiteiten @nl
preferred label: Jakt, viltstell og tjenester tilknyttet jakt og viltstell @no
preferred label: Łowiectwo i pozyskiwanie zwierząt łownych, włączając działalność usługową @pl
preferred label: Caça, repovoamento cinegético e actividades dos serviços relacionados @pt
preferred label: Vânătoare, capturarea cu capcane a vânatului şi activităţi de servicii anexe vânătorii @ro
preferred label: Охота и отлов, включая предоставление услуг в этих областях @ru
preferred label: Lov, odchyt a súvisiace služby @sk
preferred label: Lovstvo @sl
preferred label: Jakt och service i anslutning härtill @sv
preferred label: Avcılık, tuzakla avlanma ve ilgili hizmet faaliyetleri @tr
broader: Crop and animal production, hunting and related service activities
narrower: Hunting, trapping and related service activities

Hunting, trapping and related service activities
type: Concept
notation: 01.70
status: valid
status modified: 2013-10-18
accepted date: 2013-10-18
in scheme: Statistical Classification of Economic Activities in the European Community, Rev. 2 (2008)
scope note: - лов с търговска цел - лов чрез убиване или улавяне на жив дивеч - за месо, кожи и ловни трофеи, за изследователски цели, зоологически градини или за домашни любимци - добиване на сурови кожи от дивеч, влечуги или диви птици, от лов - улов на морски бозайници, например моржове и тюлени, без улова на китове - добиване на сурови кожи от дивеч, влечуги или диви птици, отглеждани принудително в стопанства и ферми - 01.49 - отглеждане на диви животни и птици в стопанства и ферми - 01.4 - улов на китове - 03.11 - добиване на сурови кожи от кланици - 10.11 - спортен или развлекателен лов и спомагателни дейности - 93.19 - дейности на ловно-рибарски сдружения, подпомагащи лова - 94.99 @bg
scope note: Z: - lov a odchyt divokých zvířat na komerční bázi - chytání a/nebo zabíjení zvířat za účelem získávání masa, kůží a kožek, pro účely výzkumu, pro zoologické zahrady nebo pro zájmový chov - získávání surových kožešin, kůží z plazů a ptáků v rámci lovu a odchytu divokých zvířat ZT: - lov mořských savců jako mrožů a tuleňů na pevnině N: - produkci surových kožešin, kůží z plazů a ptáků na zvířecích farmách (01.49) - chov divokých zvířat na zvířecích farmách (01.4) - lov velryb (03.11) - produkci kůží a kožek na jatkách (10.11) - sportovní a rekreační lov a činnosti s tím spojené (93.19) - podpůrné činnosti pro lov a odchyt divoké zvěře (94.99) @cs
scope note: Diese Klasse umfasst: - kommerzielle Jagd und Fallenstellerei - Fangen und/oder Erlegen von Tieren zur Gewinnung von Fleisch, Häuten und Fellen, zu Forschungszwecken, als Haustiere oder für Zoos - Gewinnung von Pelzfellen, Reptilienhäuten und Vogelbälgen im Rahmen der Jagd und Fallenstellerei Diese Klasse umfasst ferner: - Fang von Meeressäugetieren wie Walrosse und Robben an Land Diese Klasse umfasst nicht: - Gewinnung von Pelzfellen, Reptilienhäuten und Vogelbälgen in Tierfarmen (s. 01.49) - Haltung von Wildtieren in Tierfarmen (s. 01.4) - Walfang (s. 03.11) - Gewinnung von Fellen und Häuten in Schlachthäusern (s. 10.11) - Jagd zu Sport- oder Erholungszwecken und damit verbundene Dienstleistungen (s. 93.19) - Dienstleistungen zur Förderung der Jagd und Fallenstellerei (s. 94.99) @de
scope note: This class includes: - hunting and trapping on a commercial basis - taking of animals (dead or alive) for food, fur, skin, or for use in research, in zoos or as pets - production of fur skins, reptile or bird skins from hunting or trapping activities This class also includes: - land-based catching of sea mammals such as walrus and seal This class excludes: - production of fur skins, reptile or bird skins from ranching operations, see group 01.49 - raising of game animals on ranching operations, see 01.4 - catching of whales, see 03.11 - production of hides and skins originating from slaughterhouses, see 10.11 - hunting for sport or recreation and related service activities, see 93.19 - service activities to promote hunting and trapping, see 94.99 @en
scope note: Esta clase comprende: - la caza y captura de animales con fines comerciales - el aprovechamiento de los animales (vivos o muertos) para carne, pieles, cueros o para utilizarlos en la investigación, en zoológicos o como animales de compañía - la producción de pieles para peletería, de pieles de reptiles y aves procedentes de la caza Esta clase comprende también: - la captura, en instalaciones en tierra, de mamíferos marinos como focas y morsas Esta clase no comprende: - la producción de pieles para peletería, de pieles de reptiles y aves procedentes de granjas (véase 01.49) - la cría de animales para repoblación cinegética en granjas (véase 01.49) - la captura de ballenas (véase 03.11) - la producción de pieles y cueros procedentes de mataderos (véase 10.11) - la caza deportiva o recreativa y las actividades de los servicios relacionados con estas actividades (véase 93.19) - las actividades de los servicios destinados a fomentar la caza y captura de animales (véase 94.99) @es
scope note: Cette classe comprend: - la chasse et le piégeage à des fins commerciales - le prélèvement d’animaux (vivants ou morts) pour l’alimentation, leur fourrure, leur peau, ou pour les destiner à la recherche, à des parcs zoologiques ou les utiliser comme animaux de compagnie - la production de pelleteries, de peaux de reptiles ou d’oiseaux provenant d’activités de chasse ou de piégeage Cette classe comprend également: - la capture sur le rivage de mammifères marins, par exemple: les morses et les phoques Cette classe ne comprend pas: - la production de pelleteries, de peaux de reptiles ou d’oiseaux provenant de l’exploitation de fermes d’élevage, voir 01.49 - l’élevage de gibier dans des fermes d’élevage, voir 01.4 - la pêche à la baleine, voir 03.11 - la production de cuirs et de peaux provenant d’abattoirs, voir 10.11 - la chasse exercée comme activité sportive ou récréative et les services annexes, voir 93.19 - les services visant à promouvoir la chasse et le piégeage, voir 94.99 @fr
scope note: Ovaj razred uključuje: - lov i stupičarenje na komercijalnoj osnovi - hvatanje životinja zbog prehrane, krzna, kože, znanstvenog istraživanja, za zoološke vrtove ili kućne ljubimce - proizvodnju krzna, koža od gmazova i ptičjih koža od odstrijeljenih ili uhvaćenih životinja Ovaj razred također uključuje: - ulov morskih sisavaca na obali, npr. morževa i tuljana Ovaj razred isključuje: - proizvodnju krzna, koža gmazova i ptičjih koža od uzgajanih životinja, vidi skupinu 01.4 - uzgoj divljih životinja na farmama, vidi 01.49 - ulov kitova, vidi 03.11 - proizvodnju koža i krzna u klaonicama, vidi 10.11 - sportsko-rekreativni lov i uslužne djelatnosti povezane s njim, vidi 93.19 - uslužne djelatnosti vezane za promociju lova i stupičarenja, vidi 94.99
scope note: Į šią klasę įeina: - komercinis gyvūnų medžiojimas ir gaudymas spąstais - gyvūnų gaudymas maistui, gyvų gyvūnų gaudymas ar negyvų rinkimas kailiams, odai arba tyrinėjimo tikslams, zoologijos sodams ar laikymui namuose - sumedžiotų arba spąstais sugautų žvėrių kailiukų, roplių arba paukščių odų gavyba Į šią klasę taip pat įeina: - jūrų žinduolių, tokių kaip jūrų vėpliai ir ruoniai, gaudymas sausumoje Į šią klasę neįeina: - ūkiuose auginamų gyvūnų kailiukų, roplių arba paukščių odų gavyba, žr. 01.4 grupę - medžiojamųjų paukščių ir žvėrių auginimas ūkiuose, žr. 01.49 - banginių gaudymas, žr. 03.11 - kailių ir odų gavyba skerdyklose, žr. 10.11 - sportinė ar pramoginė medžioklė ir susijusių paslaugų veikla, žr. 93.19 - gyvūnų medžiojimą ir gaudymą spąstais skatinanti veikla, žr. 94.99 @lt
scope note: Данный раздел включает производство круглого лесоматериала, а также добычу и сбор дикорастущих лесных материалов. Кроме производства лесоматериалов лесоводство дает продукты, которые подвергаются незначительной обработке, такие как дрова, древесный уголь и круглый лесоматериал, используемый в необработанном виде (например, балки, балансовая древесина и т.д.). Данные виды деятельности могут осуществляться прямо в местах естественных лесов или лесонасаждений. Исключается их дальнейшая обработка при помощи пилящих и колющих инструментов, см. раздел 16. @ru
scope note: Bu sınıf aşağıdakileri kapsamaktadır; - ticari amaçla avcılık yapılması ve kapan (tuzak) kurulması - yemek için, kürkleri, derileri için veya araştırmalarda, hayvanat bahçelerinde ya da evcil hayvan olarak kullanmak üzere hayvan yakalanması - avcılık veya tuzak faaliyetlerinden kürklü deri, sürüngen veya kuş derisi üretilmesi Ayrıca bu sınıf aşağıdakileri de kapsamaktadır; - mors ve fok balığı gibi deniz memelilerinin karada yakalanması Kapsam dışı olanlar; - hayvan çiftçiliği faaliyetlerinden kürklü deri, sürüngen veya kuş derisi üretilmesi, bkz. grup 01.4, - hayvan çiftçiliği faaliyetleri ile av hayvanları yetiştirilmesi, bkz. 01.49, - balina yakalanması, bkz. 03.11, - kesimevi, mezbaha kaynaklı hayvan derisi, postu üretimi, bkz. 10.11, - spor amaçlı veya eğlence amaçlı yapılan avcılık ve ilgili diğer hizmet faaliyetleri, bkz. 93.19, - avlanmayı ve tuzak kurmayı teşvik edici hizmet faaliyetleri, bkz. 94.99. @tr
preferred label: Лов и спомагателни дейности @bg
preferred label: Lov a odchyt divokých zvířat a související činnosti @cs
preferred label: Jagt, fældefangst og serviceydelser i forbindelse hermed @da
preferred label: Jagd, Fallenstellerei und damit verbundene Tätigkeiten @de
preferred label: Θήρα, τοποθέτηση παγίδων και συναφείς δραστηριότητες @el
preferred label: Caza, captura de animales y servicios relacionados con las mismas @es
preferred label: Jahindus ja seda teenindavad tegevusalad @et
preferred label: Metsästys ja sitä palveleva toiminta @fi
preferred label: Chasse, piégeage et services annexes @fr
preferred label: Vadgazdálkodás, vadgazdálkodási szolgáltatás
preferred label: Caccia, cattura di animali e servizi connessi @it
preferred label: Medžioklė, gaudymas spąstais ir susijusių paslaugų veikla @lt
preferred label: Medniecība un ar to saistītās palīgdarbības @lv
preferred label: Kaċċa, insib u attivitajiet ta' servizz relatati @mt
preferred label: Jacht, zetten van vallen en diensten in verband met deze activiteiten @nl
preferred label: Jakt, viltstell og tjenester tilknyttet jakt og viltstell @no
preferred label: Łowiectwo i pozyskiwanie zwierząt łownych, włączając działalność usługową @pl
preferred label: Caça, repovoamento cinegético e actividades dos serviços relacionados @pt
preferred label: Vânătoare, capturarea cu capcane a vânatului şi activităţi de servicii anexe vânătorii @ro
preferred label: Охота и отлов, включая предоставление услуг в этих областях @ru
preferred label: Lov, odchyt a súvisiace služby @sk
preferred label: Lovstvo @sl
preferred label: Jakt och service i anslutning härtill @sv
preferred label: Avcılık, tuzakla avlanma ve ilgili hizmet faaliyetleri @tr
broader: Hunting, trapping and related service activities

Forestry and logging
type: Concept
notation: 02
status: valid
status modified: 2013-10-18
accepted date: 2013-10-18
in scheme: Statistical Classification of Economic Activities in the European Community, Rev. 2 (2008)
scope note: Този раздел включва дейности по отглеждане на горскодървесна растителност и събиране на диворастящи горски материали и продукти. Освен добива на трупи в горското стопанство се добиват и някои частично преработени продукти - дърва за горене, дървени въглища, получени по традиционен начин или за промишлени цели (минни подпори, за производство на химична дървесна маса и други). Тези дейности могат да се извършват в естествени или изкуствени гори. Този раздел не включва последващата преработка на дървения материал, която започва с неговото разкрояване и рендосване и основно се извършва далеч от зоната на дърводобива - раздел 16. @bg
scope note: Tento oddíl zahrnuje produkci kulatiny a sběr a získávání volně rostoucích lesních plodů a materiálů jiných než dřeva. Vedle toho sem patří i lesnické činnosti vedoucí k produktům vyžadujícím pouze drobné opracování, jako je palivové dřevo, dřevěné uhlí nebo dřevo k průmyslovému použití (např. důlní výdřeva, dřevní hmota atd.). Tyto činnosti lze provádět jak v přírodních tak v uměle vysazených lesích. Tento oddíl nezahrnuje další zpracování dřeva, které začíná řezáním dřeva na pile a jeho hoblováním (oddíl 16). @cs
scope note: Diese Abteilung umfasst die Erzeugung von Stammholz sowie die Gewinnung und Sammlung von wild wachsenden Erzeugnissen des Waldes. Hinzu kommen geringfügig bearbeitete Erzeugnisse wie Brennholz, Holzkohle oder Industrieholz (z. B. Grubenholz, Papierholz usw.). Diese Tätigkeiten können sowohl in natürlichen als auch in angepflanzten Wäldern ausgeführt werden. Ausgeschlossen ist die Weiterverarbeitung von Holz, angefangen bei Säge- und Hobelwerken (s. Abteilung 16). @de
scope note: This division includes the production of roundwood as well as the extraction and gathering of wild growing non-wood forest products. Besides the production of timber, forestry activities result in products that undergo little processing, such as firewood, charcoal and roundwood used in an unprocessed form (e.g. pit-props, pulpwood etc.). These activities can be carried out in natural or planted forests. Excluded is further processing of wood beginning with sawmilling and planning of wood, see division 16. @en
scope note: Esta división comprende la producción de madera en rollo, así como la extracción y recolección de productos forestales silvestres no madereros. Además de la producción de madera, la silvicultura da lugar a productos que sufren escasa elaboración, como la leña, el carbón y la madera en rollo utilizada sin tratar (por ejemplo, puntales para minas, madera para pasta, etc.). Estas actividades pueden realizarse en bosques naturales o plantados. Se excluye la elaboración posterior de la madera, a partir del aserrado y cepillado de la madera (véase la división 16). @es
scope note: Cette division comprend la production de bois rond, ainsi que l’extraction et la cueillette de produits forestiers autres que du bois et poussant à l’état sauvage. Outre la production de grumes, l’exploitation forestière débouche sur des produits peu transformés comme le bois de chauffage, le charbon de bois ou le bois rond utilisé sous une forme brute (bois de mine, bois de trituration, etc.). Ces activités peuvent être effectuées dans des forêts naturelles ou dans des plantations. Cette division ne comprend pas la transformation ultérieure du bois, qui commence par le sciage et le déroulage du bois, voir division 16. @fr
scope note: Ovaj odjeljak uključuje proizvodnju trupaca te vađenje i skupljanje šumskog materijala koji je izrastao u divljini. Uz proizvodnju šumskog drveća, šumarstvo uključuje i proizvode koji uključuju neznatnu preradu drva za ogrjev, drva za drveni ugljen i trupaca koji se koriste za industrijsku uporabu (npr. jamska građa, drvo za celulozu itd.). Te djelatnosti mogu se obavljati u prirodnim ili zasađenim šumama. Isključena je daljnja prerada drva, piljenje ili blanjanje drva, vidi odjeljak 16.
scope note: Į šį skyrių įeina apvaliosios medienos gamyba taip pat laukinių miško nemedieninių produktų gavyba ir surinkimas. Be medienos gamybos, miškininkystės veikla apima ir didelio apdirbimo nereikalaujančios produkcijos, tokios kaip malkos, medžio anglys ir neapdirbta apvalioji mediena (pvz., sparmedžių, popiermedžių ir kt.), paruošimą. Ši veikla gali būti atliekama tiek natūraliai augančiuose, tiek sodintuose miškuose. Į šį skyrių neįeina tolesnis medienos apdirbimas, pradedant medienos pjaustymu lentpjūvėse ir obliavimu, žr. 16 skyrių. @lt
scope note: Bu bölüm, yabani olarak yetişen ağaç dışındaki orman ürünlerinin çıkarılmasını ve toplanmasını içerdiği gibi tomruk üretimini de içermektedir. Ormancılık faaliyetleri ile kereste üretiminin yanı sıra, yakacak odun, odun kömürü, odun yongası ve işlenmemiş şekilde kullanılan tomruk (örn. Ahşap maden direği, kağıt hamuru vb.) gibi çok az işlemden geçen ürünler de elde edilmektedir. Bu faaliyetler doğal ya da dikili ormanlarda gerçekleştirilebilir. Ağacın hızarlaşması ve planyalanmasıyla başlayan ağaçların daha ileriki işlemleri kapsam dışıdır, bkz. bölüm 16. @tr
preferred label: Горско стопанство @bg
preferred label: Lesnictví a těžba dřeva @cs
preferred label: Skovbrug og skovning @da
preferred label: Forstwirtschaft und Holzeinschlag @de
preferred label: Δασοκομία και υλοτομία @el
preferred label: Silvicultura y explotación forestal @es
preferred label: Metsamajandus ja metsavarumine @et
preferred label: Metsätalous ja puunkorjuu @fi
preferred label: Sylviculture et exploitation forestière @fr
preferred label: Erdőgazdálkodás
preferred label: Silvicoltura e utilizzo di aree forestali @it
preferred label: Miškininkystė ir medienos ruoša @lt
preferred label: Mežsaimniecība un mežizstrāde @lv
preferred label: Forestrija u qtugħ u trasport ta' siġar għall-injam @mt
preferred label: Bosbouw en de exploitatie van bossen @nl
preferred label: Skogbruk og tjenester tilknyttet skogbruk @no
preferred label: Leśnictwo i pozyskiwanie drewna @pl
preferred label: Silvicultura e exploração florestal @pt
preferred label: Silvicultură şi exploatare forestieră @ro
preferred label: Лесоводство и лесозаготовки @ru
preferred label: Lesníctvo a ťažba dreva @sk
preferred label: Gozdarstvo @sl
preferred label: Skogsbruk @sv
preferred label: Ormancılık ve tomrukçuluk @tr
broader: AGRICULTURE, FORESTRY AND FISHING
narrower: Silviculture and other forestry activities
narrower: Logging
narrower: Gathering of wild growing non-wood products
narrower: Support services to forestry

Silviculture and other forestry activities
type: Concept
notation: 02.1
status: valid
status modified: 2013-10-18
accepted date: 2013-10-18
in scheme: Statistical Classification of Economic Activities in the European Community, Rev. 2 (2008)
scope note: Этот класс включает: - выращивание строевого леса: посадку, пересадку, высадку саженцев, прореживание и охрану лесов и лесосек - выращивание подлеска, балансовой древесины и дров - функционирование лесопитомника Данные виды деятельности могут осуществляться прямо в местах естественных лесов или лесонасаждений. Этот класс исключает: - выращивание новогодних/рождественских елок, см. 01.29 - уход за посадками, за исключением лесных деревьев, см. 01.30 - сбор грибов и прочих дикорастущих не древесных продуктов, см. 02.30 - производство мелких дров и щепы, см. 16.10 @ru
preferred label: Възпроизводство на гори @bg
preferred label: Lesní hospodářství a jiné činnosti v oblasti lesnictví @cs
preferred label: Dyrkning af træer og andre skovbrugsaktiviteter @da
preferred label: Forstwirtschaft @de
preferred label: Δασοκομία και άλλες δασοκομικές δραστηριότητες @el
preferred label: Silvicultura y otras actividades forestales @es
preferred label: Metsakasvatus ja muud metsamajanduse tegevusalad @et
preferred label: Metsänhoito @fi
preferred label: Sylviculture et autres activités forestières @fr
preferred label: Erdészeti, egyéb erdőgazdálkodási tevékenység
preferred label: Silvicoltura e altre attività forestali @it
preferred label: Miško medžių auginimas ir kita miškininkystės veikla @lt
preferred label: Mežkopība un citas mežsaimniecības darbības @lv
preferred label: Silvikultura u attivitajiet oħra tal-forestrija @mt
preferred label: Bosbouw @nl
preferred label: Skogskjøtsel og andre skogbruksaktiviteter @no
preferred label: Gospodarka leśna i pozostała działalność leśna, z wyłączeniem pozyskiwania produktów leśnych @pl
preferred label: Silvicultura e outras actividades florestais @pt
preferred label: Silvicultură şi alte activităţi forestiere @ro
preferred label: Лесоводство и прочая лесохозяйственная деятельность @ru
preferred label: Lesné hospodárstvo a ostatné služby v lesníctve @sk
preferred label: Gojenje gozdov in druge gozdarske dejavnosti @sl
preferred label: Skogshushållning och skogsskötsel @sv
preferred label: Orman yetiştirme (Silvikültür) ve diğer ormancılık faaliyetleri @tr
broader: Forestry and logging
narrower: Silviculture and other forestry activities

Silviculture and other forestry activities
type: Concept
notation: 02.10
status: valid
status modified: 2013-10-18
accepted date: 2013-10-18
in scheme: Statistical Classification of Economic Activities in the European Community, Rev. 2 (2008)
scope note: - отглеждане на дървостой: залесяване, попълване, пресаждане, прореждане, запазване на горите и горските пространства - отглеждане на храсти и нискостъблени гори за периодична сеч, за дървесна маса и дърва за горене - експлоатация на горски разсадници Тези дейности се извършват в естествени или изкуствено създадени гори. - отглеждане на коледни елхи - 01.29 - експлоатация на разсадници без горските - 01.30 - събиране на диворастящи гъби, трюфели и други недървесни продукти - 02.30 - производство на дървесен талаш, дървесно брашно, частици - 16.10 @bg
scope note: Z: - pěstování dříví na stojato: výsadbu, přesazování, probírku stromů a péči o les - pěstování podrostu, vlákninového dříví a dříví na otop - provoz lesních školek Tyto činnosti lze provádět jak v přírodních tak v uměle vysazených lesích. N: - pěstování vánočních stromků (01.29) - provoz stromových školek, kromě lesních školek (01.30) - sběr hub a jiných divoce rostoucích lesních materiálů (02.30) - výrobu štěpek a třísek ze dřeva (16.10) @cs
scope note: Diese Klasse umfasst: - Erzeugung von Stammholz: Erstaufforstung, Wiederaufforstung, Durchforstung und Waldpflege - Forstung von Niederwald, Papierholz und Feuerholz - Betrieb von Forstbaumschulen Diese Tätigkeiten können sowohl in natürlichen als auch in angepflanzten Wäldern ausgeführt werden. Diese Klasse umfasst nicht: - Forstung von Weihnachtsbäumen (s. 01.29) - Betrieb von Baumschulen, außer von Forstbaumschulen (s. 01.30) - Sammeln von Pilzen und anderem wild wachsenden Waldmaterial (s. 02.30) - Herstellung von Holzschnitzeln und -plättchen (s. 16.10) @de
scope note: This class includes: - growing of standing timber: planting, replanting, transplanting, thinning and conserving of forests and timber tracts - growing of coppice, pulpwood and fire wood - operation of forest tree nurseries These activities can be carried out in natural or planted forests. This class excludes: - growing of Christmas trees, see 01.29 - operation of tree nurseries, except for forest trees, see 01.30 - gathering of mushrooms and other wild growing non-wood forest products, see 02.30 - production of wood chips and particles, see 16.10 @en
scope note: Esta clase comprende: - el cultivo de madera en pie: la plantación, la repoblación, el trasplante, el raleo y la conservación de bosques y zonas forestales - el cultivo de sotos, madera para pasta y madera para combustible - la explotación de viveros forestales Estas actividades pueden realizarse en bosques naturales o plantados. Esta clase no comprende: - el cultivo de árboles de navidad (véase 01.29) - la explotación de viveros, excepto para árboles forestales (véase 01.30) - la recolección de setas y otros productos forestales silvestres no madereros (véase 02.30) - la producción de astillas y partículas de madera (véase 16.10) @es
scope note: Cette classe comprend: - la production de bois sur pied: boisement, reboisement, transplantation, éclaircie et conservation des forêts et des coupes - la culture de taillis, de bois de trituration et de bois de chauffage - l’exploitation de pépinières forestières Ces activités peuvent être effectuées dans des forêts naturelles ou dans des plantations. Cette classe ne comprend pas: - la culture d’arbres de Noël, voir 01.29 - l’exploitation de pépinières, à l’exception des pépinières forestières, voir 01.30 - la récolte des champignons et d’autres produits forestiers autres que du bois et poussant à l’état sauvage, voir 02.30 - la production de copeaux de bois et de bois en particules, voir 16.10 @fr
scope note: Ovaj razred uključuje: - uzgoj drveća: sadnju, rasađivanje, presađivanje, prorjeđivanje te zaštitu šuma i šumskih površina - uzgoj niskog raslinja, proizvodnju drva za celulozu i drva za ogrjev - djelatnosti rasadnika šumskog drveća Te djelatnosti mogu se obavljati u prirodnim ili zasađenim šumama. Ovaj razred isključuje: - uzgoj božićnih drvaca, vidi 01.29 - djelatnosti rasadnika drveća, osim za šumsko drveće, vidi 01.30 - skupljanje gljiva i ostalih šumskih proizvoda koji nisu uzgojeni, vidi 02.30 - proizvodnju iverja i drvne sječke, vidi 16.10
scope note: Į šią klasę įeina: - miško medžių auginimas: sodinimas, atsodinimas, persodinimas, retinimas ir miško bei miškingų plotų išsaugojimas - jaunuolynų, popiermedžių ir makinės medienos auginimas - miško medelynų veikla Ši veikla gali būti atliekama tiek natūraliai augančiuose, tiek sodintuose miškuose. Į šią klasę neįeina: - kalėdinių eglučių auginimas, žr. 01.29 - medelynų, išskyrus miško medelynus, veikla, žr. 01.30 - grybų ir kitų laukinių miško nemedieninių produktų rinkimas, žr. 02.30 - medienos drožlių ir smulkinių gamyba, žr. 16.10 @lt
scope note: Bu sınıf aşağıdakileri kapsamaktadır; - daimi kerestelik ağaçların yetiştirilmesi: ağaçların dikilmesi, tekrar dikilmesi, fidanın bir yerden çıkartılıp başka bir yere dikilmesi, aralama (ağaçların seyreltilmesi) ve ormanların ve kerestelik ormanların korunması, - küçük koru, kağıt hamuru ve yakacak odun olarak kullanılacak ağaçların yetiştirilmesi, - orman ağacı fidanlıklarının işletilmesi.Bu faaliyetler doğal ya da dikili ormanlarda yapılabilir. Kapsam dışı olanlar; - yılbaşı ağacı yetiştirilmesi, bkz. 01.29, - ağaç fidanlıklarının işletilmesi, orman ağaçları için olanlar hariç, bkz. 01.30, - mantarların ve yabani olarak yetişmiş kereste hariç orman ürünlerinin toplanması, bkz. 02.30, - odun yongası ve parçalarının üretilmesi, bkz.16.10. @tr
preferred label: Възпроизводство на гори @bg
preferred label: Lesní hospodářství a jiné činnosti v oblasti lesnictví @cs
preferred label: Dyrkning af træer og andre skovbrugsaktiviteter @da
preferred label: Forstwirtschaft @de
preferred label: Δασοκομία και άλλες δασοκομικές δραστηριότητες @el
preferred label: Silvicultura y otras actividades forestales @es
preferred label: Metsakasvatus ja muud metsamajanduse tegevusalad @et
preferred label: Metsänhoito @fi
preferred label: Sylviculture et autres activités forestières @fr
preferred label: Erdészeti, egyéb erdőgazdálkodási tevékenység
preferred label: Silvicoltura e altre attività forestali @it
preferred label: Miško medžių auginimas ir kita miškininkystės veikla @lt
preferred label: Mežkopība un citas mežsaimniecības darbības @lv
preferred label: Silvikultura u attivitajiet oħra tal-forestrija @mt
preferred label: Bosbouw @nl
preferred label: Skogskjøtsel og andre skogbruksaktiviteter @no
preferred label: Gospodarka leśna i pozostała działalność leśna, z wyłączeniem pozyskiwania produktów leśnych @pl
preferred label: Silvicultura e outras actividades florestais @pt
preferred label: Silvicultură şi alte activităţi forestiere @ro
preferred label: Лесоводство и прочая лесохозяйственная деятельность @ru
preferred label: Lesné hospodárstvo a ostatné služby v lesníctve @sk
preferred label: Gojenje gozdov in druge gozdarske dejavnosti @sl
preferred label: Skogshushållning och skogsskötsel @sv
preferred label: Orman yetiştirme (Silvikültür) ve diğer ormancılık faaliyetleri @tr
broader: Silviculture and other forestry activities

Logging
type: Concept
notation: 02.2
status: valid
status modified: 2013-10-18
accepted date: 2013-10-18
in scheme: Statistical Classification of Economic Activities in the European Community, Rev. 2 (2008)
scope note: Этот класс включает: - производство круглого лесоматериала для индустрии, основанной на производстве лесоматериалов - производство круглого лесоматериала, используемого в необработанной форме, такого как рейки, изгороди, шесты и жерди - сбор и производство древесины для топки - сбор и переработку остатков древесины для топки после заготовок лесоматериалов - производство древесного угля в лесу (традиционным методом) Данный вид деятельности подразумевает выпуск бревен или дров. Этот класс исключает: - выращивание новогодних/рождественских елок, см. 01.29 - выращивание строевого леса: посадку, пересадку, высадку саженцев, прореживание и охрану лесов и лесосек, см. 02.10 - сбор дикорастущих не древесных продуктов, см. 02.30 - производство мелких дров и щепы, см. 16.10 - производство древесного угля посредством дистилляции древесины, см. 20.14 @ru
preferred label: Дърводобив @bg
preferred label: Těžba dřeva @cs
preferred label: Skovning @da
preferred label: Holzeinschlag @de
preferred label: Υλοτομία @el
preferred label: Explotación de la madera @es
preferred label: Metsavarumine @et
preferred label: Puunkorjuu @fi
preferred label: Exploitation forestière @fr
preferred label: Fakitermelés
preferred label: Utilizzo di aree forestali @it
preferred label: Medienos ruoša @lt
preferred label: Mežizstrāde @lv
preferred label: Qtugħ u trasport ta' siġar għall-injam @mt
preferred label: Exploitatie van bossen @nl
preferred label: Avvirkning @no
preferred label: Pozyskiwanie drewna @pl
preferred label: Exploração florestal @pt
preferred label: Exploatarea forestieră @ro
preferred label: Лесозаготовки @ru
preferred label: Ťažba dreva @sk
preferred label: Sečnja @sl
preferred label: Drivning @sv
preferred label: Tomrukçuluk @tr
broader: Forestry and logging
narrower: Logging

Logging
type: Concept
notation: 02.20
status: valid
status modified: 2013-10-18
accepted date: 2013-10-18
in scheme: Statistical Classification of Economic Activities in the European Community, Rev. 2 (2008)
scope note: - добиване на трупи за дървопреработващите предприятия - добиване на трупи, употребени необработени, нецепени, незаострени като: подпори, стълбове за огради, колове (пръти) - събиране и добиване на дърва за горене - събиране и добиване на остатъци (дънери, клони, вейки и други) за горене, получени при дърводобива и прибиране на реколтата от гората - добиване на дървени въглища в гората (по традиционни методи) Продукцията от тези дейности може да се получи под формата на трупи или дърва за горене. - отглеждане на коледни елхи - 01.29 - отглеждане на дървостой: залесяване, попълване, пресаждане, прореждане, запазване на горите и горските пространства - 02.10 - събиране на диворастящи и недървесни продукти - 02.30 - производство на дървесен талаш, дървесно брашно, частици - 16.10 - производство на дървени въглища чрез суха дестилация на дърва - 20.14 @bg
scope note: Z: - produkci kulatiny pro dřevozpracující průmysl - produkci kulatiny používané v neopracované formě, např. důlního dřeva, plotových kůlů a telegrafních sloupů - sběr a produkci dřeva pro účely výroby energií - sběr zbytků vzniklých při těžbě dřeva pro účely výroby energií - produkci dřevěného uhlí v lese (tradičními metodami) Produktem této činnosti jsou klády, odřezky nebo palivové dříví. N: - pěstování vánočních stromků (01.29) - pěstování dříví na stojato: výsadbu, přesazování, probírku stromů a péči o les (02.10) - sběr jiných divoce rostoucích lesních materiálů (02.30) - výrobu štěpek a třísek ze dřeva (16.10) - produkci dřevěného uhlí na základě destilace (20.14) @cs
scope note: Diese Klasse umfasst: - Erzeugung von Stammholz für die Holzverarbeitung - Erzeugung von Rohholz, z. B. Grubenholz, Zaunpfählen und Leitungsmasten - Sammeln und Erzeugung von Holz für die Energieerzeugung - Sammeln von Rückständen (z. B. Reisig, Schnitzeln u. ä. Brennholz), die beim Holzanschlag anfallenden, für die Energieerzeugung - Erzeugung von Holzkohle im Wald (anhand traditioneller Verfahren) Produktionsergebnis dieser Tätigkeit sind Stämme oder Brennholz. Diese Klasse umfasst nicht: - Forstung von Weihnachtsbäumen (s. 01.29) - Erzeugung von Stammholz: Erstaufforstung, Wiederaufforstung, Durchforstung und Waldpflege (s. 02.10) - Sammeln von anderem wild wachsenden Waldmaterial (s. 02.30) - Herstellung von Holzschnitzeln und -plättchen (s. 16.10) - Erzeugung von Holzkohle durch Holzdestillation (s. 20.14) @de
scope note: This class includes: - production of roundwood for forest-based manufacturing industries - production of roundwood used in an unprocessed form such as pit-props, fence posts and utility poles - gathering and production of wood for energy - gathering and production of forest harvesting residues for energy - production of charcoal in the forest (using traditional methods) The output of this activity can take the form of logs or fire wood. This class excludes: - growing of Christmas trees, see 01.29 - growing of standing timber: planting, replanting, transplanting, thinning and conserving of forests and timber tracts, see 02.10 - gathering of wild growing non-wood forest products, see 02.30 - production of wood chips and particles, see 16.10 - production of charcoal through distillation of wood, see 20.14 @en
scope note: Esta clase comprende: - la producción de madera en rollo para las industrias manufactureras - la producción de madera en rollo utilizada sin tratar para usos como los puntales para minas, estacas para vallas y postes para tendidos eléctricos y de comunicaciones - recolección y producción de madera como recurso energético - recolección y producción de residuos de la explotación forestal como recurso energético - producción de carbón en el bosque (utilizando métodos tradicionales) Los productos resultantes de esta actividad pueden ser en forma de troncos o madera para combustible. Esta clase no comprende: - el cultivo de árboles de navidad (véase 01.29) - el cultivo de madera en pie: la plantación, la repoblación, el trasplante, el raleo y la conservación de bosques y zonas forestales (véase 02.10) - la recolección de productos forestales silvestres no madereros (véase 02.30) - la producción de astillas y partículas de madera (véase 16.10) - la producción de carbón por medio de la destilación de madera (véase 20.14) @es
scope note: Cette classe comprend: - la production de bois rond pour les industries forestières de transformation - la production de bois rond utilisé sous une forme brute, comme le bois de mine, les pieux de clôtures et les poteaux électriques - la production de bois à des fins énergétiques - la production de résidus de l’exploitation forestière à des fins énergétiques - la fabrication de charbon de bois en forêt (en utilisant des méthodes traditionnelles) Le résultat de cette activité peut prendre la forme de grumes ou de bois de chauffage. Cette classe ne comprend pas: - la culture d’arbres de Noël, voir 01.29 - la production de bois sur pied: boisement, reboisement, transplantation, éclaircie et conservation des forêts et des coupes, voir 02.10 - la récolte des produits forestiers autres que du bois et poussant à l’état sauvage, voir 02.30 - la production de copeaux de bois et de bois en particules, voir 16.10 - la production de charbon de bois par distillation du bois, voir 20.14 @fr
scope note: Ovaj razred uključuje: - proizvodnju trupaca za potrebe industrije koja se temelji na šumarstvu - proizvodnju trupaca koja se koriste u neobrađenom obliku kao što su: jamska drva, TT stupovi, motke i kolje - skupljanje i proizvodnju drva za potrebe proizvodnje energije - skupljanje i proizvodnju šumskih otpadaka od rušenja drva za potrebe proizvodnje energije - proizvodnju drvenog ugljena u šumi (na tradicionalan način) Rezultat ove djelatnosti može biti u obliku cjepanica ili drva za ogrjev. Ovaj razred isključuje: - uzgoj božićnih drvaca, vidi 01.29 - uzgoj drveća: sadnju, rasađivanje, presađivanje, prorjeđivanje i zaštitu šuma i šumskih površina, vidi 02.10 - skupljanje šumskih proizvoda koji nisu uzgojeni, vidi 02.30 - proizvodnju iverja i drvne sječke, vidi 16.10 - proizvodnju drvenog ugljena postupkom destilacije drva, vidi 20.14
scope note: Į šią klasę įeina: - apvaliosios medienos gamyba medžio apdirbamajai pramonei - neapdirbtos apvaliosios medienos, tokios kaip spyriai, aptvarų statramsčiai, bendrosios paskirties atramos, gamyba - medienos rinkimas ir ruoša energijai gauti - miško kirtimo atliekų rinkimas ir ruoša energijai gauti - medžio anglių gamyba miške (naudojant tradicinius metodus) Šios veiklos rezultatas gali būti rąstai ar malkos. Į šią klasę neįeina: - kalėdinių eglučių auginimas, žr. 01.29 - stačio miško auginimas: sodinimas, atsodinimas, persodinimas, retinimas ir miško bei miškingų plotų išsaugojimas, žr. 02.10 - laukinių miško ne medžio produktų rinkimas, žr. 02.30 - medienos drožlių ir smulkinių gamyba, žr. 16.10 - medžio anglių gamyba sausai distiliuojant medieną, žr. 20.14 @lt
scope note: Bu sınıf aşağıdakileri kapsamaktadır; - ormana dayalı imalat sanayii için yuvarlak yapı odunları üretimi, - ahşap maden direği, çıta kazıkları ve elektrik direği gibi işlenmemiş bir şekilde kullanılan tomrukların üretimi, - ağaçların enerji için toplanması ve üretilmesi, - orman hasat artıklarının enerji için toplanması ve üretilmesi, - ormanda odun kömürü üretilmesi (geleneksel yöntemler kullanılarak). Bu faaliyetin çıktıları tomruk, yonga veya yakacak odun biçimlerini alabilmektedir. Kapsam dışı olanlar; - yılbaşı ağacı yetiştirilmesi, bkz. 01.29, - daimi kerestelik ağaçların yetiştirilmesi: ağaçların dikilmesi, tekrar dikilmesi, fidanın bir yerden çıkartılıp başka bir yere dikilmesi, aralama (ağaçların seyreltilmesi) ve ormanların ve kerestelik ormanların korunması, bkz. 02.10, - yabani olarak yetişmiş ağaç dışındaki orman ürünlerinin toplanması, bkz. 02.30, - ağaç yongaları ve parçacıklarının üretilmesi, bkz. 16.10, - ağacın damıtılması yoluyla odun kömürü üretilmesi, bkz. 20.14. @tr
preferred label: Дърводобив @bg
preferred label: Těžba dřeva @cs
preferred label: Skovning @da
preferred label: Holzeinschlag @de
preferred label: Υλοτομία @el
preferred label: Explotación de la madera @es
preferred label: Metsavarumine @et
preferred label: Puunkorjuu @fi
preferred label: Exploitation forestière @fr
preferred label: Fakitermelés
preferred label: Utilizzo di aree forestali @it
preferred label: Medienos ruoša @lt
preferred label: Mežizstrāde @lv
preferred label: Qtugħ u trasport ta' siġar għall-injam @mt
preferred label: Exploitatie van bossen @nl
preferred label: Avvirkning @no
preferred label: Pozyskiwanie drewna @pl
preferred label: Exploração florestal @pt
preferred label: Exploatarea forestieră @ro
preferred label: Лесозаготовки @ru
preferred label: Ťažba dreva @sk
preferred label: Sečnja @sl
preferred label: Drivning @sv
preferred label: Tomrukçuluk @tr
broader: Logging

Gathering of wild growing non-wood products
type: Concept
notation: 02.3
status: valid
status modified: 2013-10-18
accepted date: 2013-10-18
in scheme: Statistical Classification of Economic Activities in the European Community, Rev. 2 (2008)
scope note: Этот класс включает: - сбор дикорастущих не древесных материалов: • грибов и трюфелей • ягод • орехов • бататов и прочих каучукообразных смол • коры пробкового дерева • природного лака и смол • бальзамов • растительного ворса • искусственного ворса • желудей, конского каштана • мхов и лишайников Этот класс исключает: - производство любых из данных продуктов (за исключением выращивания пробковых деревьев), см. раздел 01 - выращивание грибов или трюфелей, см. 01.13 - выращивание ягод или орехов, см. 01.25 - сбор дров, см. 02.20 - производство щепы, см. 16.10 @ru
preferred label: Събиране на диворастящи и недървесни продукти @bg
preferred label: Sběr a získávání volně rostoucích lesních plodů a materiálů, kromě dřeva @cs
preferred label: Indsamling af vildtvoksende forstmateriale undtagen træer @da
preferred label: Sammeln von wildwachsenden Produkten (ohne Holz) @de
preferred label: Συλλογή προϊόντων αυτοφυών φυτών μη ξυλώδους μορφής @el
preferred label: Recolección de productos silvestres, excepto madera @es
preferred label: Looduslike materjalide kogumine, v.a puit @et
preferred label: Luonnon tuotteiden keruu (pl. polttopuu) @fi
preferred label: Récolte de produits forestiers non ligneux poussant à l'état sauvage @fr
preferred label: Vadon termő egyéb erdei termék gyűjtése
preferred label: Raccolta di prodotti non legnosi selvatici @it
preferred label: Laukinių ne medžių produktų rinkimas @lt
preferred label: Meža produktu vākšana @lv
preferred label: Ġbir ta' prodotti mhux ta' l-injam li jikbru fis-salvaġġ @mt
preferred label: Verzamelen van in het wild groeiende producten met uitzondering van hout @nl
preferred label: Innsamling av viltvoksende produkter av annet enn tre @no
preferred label: Pozyskiwanie dziko rosnących produktów leśnych, z wyłączeniem drewna @pl
preferred label: Extracção de cortiça, resina e apanha de outros produtos florestais, excepto madeira @pt
preferred label: Colectarea produselor forestiere nelemnoase din flora spontană @ro
preferred label: Сбор не древесной продукции лесного хозяйства @ru
preferred label: Zber divorastúceho materiálu (okrem dreva) @sk
preferred label: Nabiranje gozdnih dobrin, razen lesa @sl
preferred label: Insamling av annat vilt växande skogsmaterial än trä @sv
preferred label: Ağaç dışındaki yabani olarak yetişen ürünlerin toplanması @tr
broader: Forestry and logging
narrower: Gathering of wild growing non-wood products

Gathering of wild growing non-wood products
type: Concept
notation: 02.30
status: valid
status modified: 2013-10-18
accepted date: 2013-10-18
in scheme: Statistical Classification of Economic Activities in the European Community, Rev. 2 (2008)
scope note: - събиране на диворастящи и недървесни продукти: • гъби и трюфели • ягодоплодни • орехоплодни • естествен каучук, балата, гутаперча и други каучукоподобни смоли • естествен корк • естествени лакове и клейове (смоли) • балсами • растителен пух • морска трева: „Валиснерия“ • жълъди, диви кестени • мъхове и лишеи - отглеждане на някои от тези продукти (с изключение на отглеждане на корков дъб) - раздел 01 - отглеждане на гъби или трюфели - 01.13 - отглеждане на ягодоплодни или черупкови плодове - 01.25 - събиране на дърва за горене - 02.20 - производство на дървесен талаш, дървесно брашно, частици - 16.10 @bg
scope note: Z: - sběr divoce rostoucích produktů: • hub, lanýžů • bobulovin • ořechů • balaty a jiných druhů přírodní gumy podobné kaučuku • korku • šelaku a pryskyřice • balzámů • rostlinného chmýří • vochy • žaludů, kaštanů • mechů a lišejníků N: - pěstování těchto produktů (kromě pěstování korkového dubu) (oddíl 01) - pěstování hub a lanýžů (01.13) - pěstování bobulovin a ořechů (01.25) - sběr palivového dříví (02.20) - výrobu štěpek ze dřeva (16.10) @cs
scope note: Diese Klasse umfasst: - Sammeln von wild wachsenden Erzeugnissen: • Pilze, Trüffeln • Beeren • Nüsse • Balata und andere kautschukähnliche Gummiarten • Kork • Schellack und Harze • Balsame • Pflanzenhaar • Seegras • Eicheln, Rosskastanien • Moose und Flechten Diese Klasse umfasst nicht: - Anbau dieser Erzeugnisse (außer Forstung von Korkbäumen) (s. Abteilung 01) - Anbau von Pilzen und Trüffeln (s. 01.13) - Anbau von Beeren und Nüssen (s. 01.25) - Sammeln von Brennholz (s. 02.20) - Herstellung von Holzschnitzeln (s. 16.10) @de
scope note: This class includes: - gathering of wild growing materials: • mushrooms, truffles • berries • nuts • balata and other rubber-like gums • cork • lac and resins • balsams • vegetable hair • eelgrass • acorns, horse chestnuts • mosses and lichens This class excludes: - managed production of any of these products (except growing of cork trees), see division 01 - growing of mushrooms or truffles, see 01.13 - growing of berries or nuts, see 01.25 - gathering of fire wood, see 02.20 - production of wood chips, see 16.10 @en
scope note: Esta clase comprende: - la recolección de productos forestales silvestres: • setas, trufas • bayas silvestres • frutos secos • balata y otras gomas similares al caucho • corcho • laca y resinas • bálsamos naturales • crin vegetal • crin marina • bellotas y castañas de indias • musgos y líquenes Esta clase no comprende: - la producción gestionada de cualquiera de estos productos (excepto el cultivo de alcornoques) (véase la división 01) - el cultivo de setas o trufas (véase 01.13) - el cultivo de bayas silvestres o frutos secos (véase 01.25) - la recolección de madera para su uso como combustible (véase 02.20) - la producción de astillas de madera (véase 16.10) @es
scope note: Cette classe comprend: - la récolte de produits poussant à l’état sauvage: • champignons et truffes • baies • fruits à coque • balata et autres gommes caoutchouteuses • liège • laque et résines • sucs et extraits végétaux • crin végétal • crin marin • glands et marrons d’Inde • mousses et lichens Cette classe ne comprend pas: - la production dirigée de ces produits (à l’exception de la production de chênes-lièges), voir division 01 - la culture de champignons ou de truffes, voir 01.13 - la culture de baies ou de fruits à coque, voir 01.25 - la récolte de bois de chauffage, voir 02.20 - la production de copeaux de bois, voir 16.10 @fr
scope note: Ovaj razred uključuje: - skupljanje šumskih plodova i proizvoda koji nisu uzgojeni: • gljiva, tartufa • bobičastog voća • orašastog voća • balate ili drugih guma • pluta • šelaka i smole • balzama • raznovrsne trave • morske trave • žireva, kestena • mahovine i lišaja Ovaj razred isključuje: - uzgoj bilo kojeg spomenutog proizvoda (osim uzgoja hrasta plutnjaka), vidi odjeljak 01 - uzgoj gljiva ili tartufa, vidi 01.13 - uzgoj bobičastog ili orašastog voća, vidi 01.25 - skupljanje drva za ogrjev, vidi 02.20 - proizvodnju iverja, vidi 16.10
scope note: Į šią klasę įeina: - laukinių produktų rinkimas: • grybų, valgomųjų trumų • uogų • riešutų • balatos ir kitų kaučiukinių dervų • kamštienos • šelako ir sakų • balzamo (aromatinės dervos) • augalinių plaukų • jūrinio andro • gilių, paprastojo kaštono vaisių • samanų ir kerpių Į šią klasę neįeina: - reguliuojamoji šių produktų, išskyrus kamščiamedžių auginimą, gavyba, žr. 01 skyrių - grybų arba valgomųjų trumų auginimas, žr. 01.13 - uogų ar riešutų auginimas, žr. 01.25 - malkų ruošimas, žr. 02.20, - medienos drožlių gamyba, žr. 16.10 @lt
scope note: Bu sınıf aşağıdakileri kapsamaktadır; - yabani olarak büyüyen ürünlerin toplanması; • yabani mantarlar, yabani yer mantarları (domalan), • ağaç çilekleri, • kabuklu meyveler (fındık, ceviz, vb), • balata ve diğer kauçuk tarzı sakızlar, • şişe mantarı, • lak ve reçine, • balsam, • sebze püskülleri, • zostera çayırı, • meşe palamudu, at kestanesi, • yosunlar ve likenler (mantar ile yosunun ortak yaşamı ile ortaya çıkan bitki). Kapsam dışı olanlar; - bu ürünlerin herhangi birinin planlı olarak üretilmesi (mantar ağaçlarının yetiştirilmesi hariç), bkz. bölüm 01. - mantarların veya yer mantarlarının (domalan) yetiştirilmesi, bkz. 01.13, - ağaç çileklerinin veya kabuklu meyvelerin yetiştirilmesi, bkz. 01.25, - yakacak odun toplanması, bkz. 02.20, - ağaç yongası üretimi, bkz. 16.10. @tr
preferred label: Събиране на диворастящи и недървесни продукти @bg
preferred label: Sběr a získávání volně rostoucích lesních plodů a materiálů, kromě dřeva @cs
preferred label: Indsamling af vildtvoksende forstmateriale undtagen træer @da
preferred label: Sammeln von wildwachsenden Produkten (ohne Holz) @de
preferred label: Συλλογή προϊόντων αυτοφυών φυτών μη ξυλώδους μορφής @el
preferred label: Recolección de productos silvestres, excepto madera @es
preferred label: Looduslike materjalide kogumine, v.a puit @et
preferred label: Luonnon tuotteiden keruu (pl. polttopuu) @fi
preferred label: Récolte de produits forestiers non ligneux poussant à l'état sauvage @fr
preferred label: Vadon termő egyéb erdei termék gyűjtése
preferred label: Raccolta di prodotti non legnosi selvatici @it
preferred label: Laukinių ne medžių produktų rinkimas @lt
preferred label: Meža produktu vākšana @lv
preferred label: Ġbir ta' prodotti mhux ta' l-injam li jikbru fis-salvaġġ @mt
preferred label: Verzamelen van in het wild groeiende producten met uitzondering van hout @nl
preferred label: Innsamling av viltvoksende produkter av annet enn tre @no
preferred label: Pozyskiwanie dziko rosnących produktów leśnych, z wyłączeniem drewna @pl
preferred label: Extracção de cortiça, resina e apanha de outros produtos florestais, excepto madeira @pt
preferred label: Colectarea produselor forestiere nelemnoase din flora spontană @ro
preferred label: Сбор не древесной продукции лесного хозяйства @ru
preferred label: Zber divorastúceho materiálu (okrem dreva) @sk
preferred label: Nabiranje gozdnih dobrin, razen lesa @sl
preferred label: Insamling av annat vilt växande skogsmaterial än trä @sv
preferred label: Ağaç dışındaki yabani olarak yetişen ürünlerin toplanması @tr
broader: Gathering of wild growing non-wood products

Support services to forestry
type: Concept
notation: 02.4
status: valid
status modified: 2013-10-18
accepted date: 2013-10-18
in scheme: Statistical Classification of Economic Activities in the European Community, Rev. 2 (2008)
scope note: Этот класс включает выполнение лесных работ на контрактной основе. Этот класс включает: - предоставление услуг лесному хозяйству: • таксация леса • консультации в области ведения лесного хозяйства • определение стоимости строевого леса • борьба с пожарами и противопожарная защита лесов • борьба с вредителями леса - лесозаготовительные услуги: • транспортировку бревен внутри леса Этот класс исключает: - уход за лесными насаждениями, см. 02.10 - осушение лесных земель, см. 43.12 - подготовку строительных площадок, см. 43.12 @ru
preferred label: Спомагателни дейности в горското стопанство @bg
preferred label: Podpůrné činnosti pro lesnictví @cs
preferred label: Serviceydelser til skovbrug @da
preferred label: Erbringung von Dienstleistungen für Forstwirtschaft und Holzeinschlag @de
preferred label: Υποστηρικτικές προς τη δασοκομία υπηρεσίες @el
preferred label: Servicios de apoyo a la silvicultura @es
preferred label: Metsamajandust abistavad tegevused @et
preferred label: Metsätaloutta palveleva toiminta @fi
preferred label: Services de soutien à l'exploitation forestière @fr
preferred label: Erdészeti szolgáltatás
preferred label: Servizi di supporto per la silvicoltura @it
preferred label: Miškininkystei būdingų paslaugų veikla @lt
preferred label: Mežsaimniecības palīgdarbības @lv
preferred label: Servizzi ta' sostenn għall-forestrija @mt
preferred label: Ondersteunende diensten in verband met de bosbouw @nl
preferred label: Tjenester tilknyttet skogbruk @no
preferred label: Działalność usługowa związana z leśnictwem @pl
preferred label: Serviços de apoio à silvicultura e à exploração florestal @pt
preferred label: Activităţi de servicii anexe silviculturii @ro
preferred label: Технические услуги в области лесоводства @ru
preferred label: Služby poskytované v lesníctve @sk
preferred label: Storitve za gozdarstvo @sl
preferred label: Service till skogsbruk @sv
preferred label: Ormancılık için destekleyici faaliyetler @tr
broader: Forestry and logging
narrower: Support services to forestry

Support services to forestry
type: Concept
notation: 02.40
status: valid
status modified: 2013-10-18
accepted date: 2013-10-18
in scheme: Statistical Classification of Economic Activities in the European Community, Rev. 2 (2008)
scope note: Този клас включва извършване на лесовъдни дейности срещу заплащане (по договор или еднократно). - лесовъдни дейности в следните области: • залесяване • пресаждане и прореждане • инвентаризация на горите • консултантски дейности по управление на горите (изготвяне на устройствени проекти, програми и планове, експертизи) • оценка на дървостоя • опазване и контрол, вкл. охрана на горите от пожар • борба с вредителите в горите - спомагателни дейности в дърводобива • отсичане на дървета и добиване на необработен дървен материал • транспортиране на добития дървен материал на територията на горското стопанство (временни складове, товарачни площадки) - поддържане на съществуващи временни горски пътища - експлоатация на горски разсадници - 02.10 - отводняване (дрениране) на горски земи - 43.12 - разчистване на строителни площадки - 43.12 @bg
scope note: Tato třída zahrnuje části lesnických činností vykonávané na základě smlouvy nebo dohody. Z: - poskytování služeb pro lesnictví: • evidence dřevin • poradenství v oboru lesnictví • hodnocení dřeva • protipožární ochrana • kontrola a regulace škůdců v lesnictví - poskytování služeb pro těžbu dřeva: • doprava klád v lese N: - provoz lesních školek (02.10) - odvodňování lesních ploch (43.12) - vyklízení stavenišť (43.12) @cs
scope note: Diese Klasse umfasst auch die Ausübung eines Teils der fortwirtschaftlichen Tätigkeit im Lohnauftrag. Diese Klasse umfasst: - Erbringung von Dienstleistungen für die Forstwirtschaft: • Waldbestandsaufnahme • forstwirtschaftliche Beratungsleistungen • Holztaxierung • Waldbrandbekämpfung und -schutz • Schädlingsbekämpfung in der Forstwirtschaft - Erbringung von Dienstleistungen für die Holzgewinnung: • Transport von Stämmen im Wald Diese Klasse umfasst nicht: - Betrieb von Forstbaumschulen (s. 02.10) - Entwässerung von forstwirtschaftlichen Flächen (s. 43.12) - Abräumen von Baustellen (s. 43.12) @de
scope note: This class includes carrying out part of the forestry operation on a fee or contract basis. This class includes: - forestry service activities: • forestry inventories • forest management consulting services • timber evaluation • forest fire fighting and protection • forest pest control - logging service activities: • transport of logs within the forest This class excludes: - operation of forest tree nurseries, see 02.10 - draining of forestry land, see 43.12 - clearing of building sites, see 43.12 @en
scope note: Esta clase comprende la ejecución de parte de la explotación forestal, realizada por cuenta de terceros. Esta clase comprende: - las actividades de los servicios forestales: • la evaluación de masas en pie • los servicios de asesoramiento en gestión forestal • la estimación del valor de la madera • la prevención y extinción de incendios forestales • la lucha contra las plagas forestales - los servicios relacionados con la explotación forestal: • el transporte de madera en el interior del bosque Esta clase no comprende: - la explotación de viveros forestales (véase 02.10) - el drenaje de terrenos forestales (véase 43.12) - la limpieza de escombros (véase 43.12) @es
scope note: Cette classe comprend la réalisation d’une partie de l’exploitation forestière pour le compte de tiers. Cette classe comprend: - les services annexes à la sylviculture: • inventaire des forêts • conseil en gestion et administration de la forêt • évaluation du bois • protection et lutte contre les feux de forêt • lutte contre les parasites forestiers - services annexes à l’exploitation forestière: • transport de grumes dans les forêts Cette classe ne comprend pas: - l’exploitation de pépinières forestières, voir 02.10 - le drainage des terrains sylvicoles, voir 43.12 - le déblayage des chantiers de construction, voir 43.12 @fr
scope note: Ovaj razred uključuje obavljanje pomoćnih usluga u šumarstvu uz naplatu ili na osnovi ugovora. Ovaj razred uključuje: - uslužne djelatnosti u šumarstvu: • premjer šuma • savjetodavne usluge vezane za gospodarenje šumom • procjenu drvne mase • borbu i zaštitu od požara • zaštitu šuma od nametnika - usluge vezane za eksploataciju šuma: • prijevoz trupaca unutar šume Ovaj razred isključuje: - djelatnosti rasadnika šumskog drveća, vidi 02.10 - drenažu šumskog zemljišta, vidi 43.12 - raščišćavanje gradilišta, vidi 43.12
scope note: Į šią klasę įeina dalis miškininkystės veiklos rūšių, atliekamų už atlygį arba pagal sutartį. Į šią klasę įeina: - miškininkystės paslaugų veikla: • miško inventorizacija • konsultacinių paslaugų veikla miškininkavimo klausimais • medienos vertinimas • miško gaisrų gesinimas ir apsauga • apsauga nuo miško kenkėjų - medienos ruošos paslaugų veikla: • rąstų vežimas miške Į šią klasę neįeina: - miško medelynų veikla, žr. 02.10 - miško žemės sausinimas, žr. 43.12 - statybviečių valymas, žr. 43.12 @lt
scope note: Данный раздел включает отлов рыбы и представителей аквакультуры, включающий в себя использование ресурсов прибрежных зон, соленых и пресных вод с целью отлова или сбора рыбы, ракообразных, моллюсков и прочих морских организмов (например, водорастущих культур, жемчуга, губок и т.д.). Также сюда включены те виды, которые нормально интегрируют в собственной среде (например, осеменение устриц для производства жемчуга). Все виды деятельности, сопутствующие морскому или пресноводному рыболовству или отлову и сбору морских культур также включены в данный раздел. Данный раздел не включает строительство и ремонт кораблей и лодок (30.1, 33.15), а также всего, что, так или иначе, относится к спортивной рыбалке или водным развлечениям (93.19). Переработка рыбы, ракообразных, моллюсков или почвенных растений исключены из данного раздела, также как и переработка отловленной продукции на плавучих рыбозаводах (10.20). @ru
scope note: Bu sınıf, belli bir ücret veya sözleşmeye dayalı olarak ormancılık faaliyetlerinin yürütülmesini içermektedir. Bu sınıf aşağıdakileri kapsamaktadır; - ormancılık hizmet faaliyetleri; • ormancılık envanterleri, • orman idaresi danışmanlık hizmetleri, • kerestelerin değer biçilmesi, • orman yangınları ile mücadele ve koruma, • ormanlardaki zararlı böceklerin kontrol edilmesi, - tomruklama hizmeti faaliyetleri; • ormanın içinde kütüklerin taşınması. Kapsam dışı olanlar; - orman ağaçlarının fidanlıklarının işletilmesi, bkz. 02.10, - orman arazisinin drenajı, bkz 43.12, - inşaat alanlarının temizlenmesi, bkz 43.12. @tr
preferred label: Спомагателни дейности в горското стопанство @bg
preferred label: Podpůrné činnosti pro lesnictví @cs
preferred label: Serviceydelser til skovbrug @da
preferred label: Erbringung von Dienstleistungen für Forstwirtschaft und Holzeinschlag @de
preferred label: Υποστηρικτικές προς τη δασοκομία υπηρεσίες @el
preferred label: Servicios de apoyo a la silvicultura @es
preferred label: Metsamajandust abistavad tegevused @et
preferred label: Metsätaloutta palveleva toiminta @fi
preferred label: Services de soutien à l'exploitation forestière @fr
preferred label: Erdészeti szolgáltatás
preferred label: Servizi di supporto per la silvicoltura @it
preferred label: Miškininkystei būdingų paslaugų veikla @lt
preferred label: Mežsaimniecības palīgdarbības @lv
preferred label: Servizzi ta' sostenn għall-forestrija @mt
preferred label: Ondersteunende diensten in verband met de bosbouw @nl
preferred label: Tjenester tilknyttet skogbruk @no
preferred label: Działalność usługowa związana z leśnictwem @pl
preferred label: Serviços de apoio à silvicultura e à exploração florestal @pt
preferred label: Activităţi de servicii anexe silviculturii @ro
preferred label: Технические услуги в области лесоводства @ru
preferred label: Služby poskytované v lesníctve @sk
preferred label: Storitve za gozdarstvo @sl
preferred label: Service till skogsbruk @sv
preferred label: Ormancılık için destekleyici faaliyetler @tr
broader: Support services to forestry

Fishing and aquaculture
type: Concept
notation: 03
status: valid
status modified: 2013-10-18
accepted date: 2013-10-18
in scheme: Statistical Classification of Economic Activities in the European Community, Rev. 2 (2008)
scope note: Този раздел включва улова и събирането на риби, ракообразни, мекотели, морски продукти и материали (водорасли, перли, сюнгери и други) в морски или сладководни басейни. Този раздел включва още дейности, които обикновено са интегрирани в процеса на производство за собствена сметка (например отглеждане на миди за производство на перли). Обслужващите дейности, свързани с морския и сладководния риболов или развъждането на во Този разделът не включва преработка и консервиране на риба, ракообразни или мекотели на борда на кораби заводи или заводи на сушата - 10.20, строителство и ремонт на плавателни съдове - 30.1, 33.15, както и спортен или развлекателен риболов - 93.19. @bg
scope note: Tento oddíl zahrnuje rybolov a akvakulturu, tzn. využívání rybářských zdrojů mořského, brakického nebo sladkovodního prostředí pro účely lovu nebo sběru ryb, korýšů, měkkýšů a jiných mořských organismů a produktů (např. vodních rostlin, perel, mořských hub atd.). Tento oddíl dále zahrnuje činnosti, které jsou běžně součástí výroby na vlastní účet (např. pěstování ústřic pro výrobu perel). Poskytování služeb spojených s rybolovem a akvakulturou v sladkých a mořských vodách je zařazeno do příslušných činností rybolovu a akvakultury. Tento oddíl nezahrnuje stavbu a opravy lodí a člunů (30.1, 33.15) a sportovní a rekreační rybolov (93.19). Vyloučeno je také zpracování ryb, korýšů a měkkýšů na lodích, není-li spojeno s rybolovem, a rovněž jejich zpracování v zařízeních na pevnině (10.20). @cs
scope note: Diese Abteilung umfasst den Fischfang und die Aquakultur, d. h. die Nutzung der Fischereiressourcen aus dem Meer-, Brack- oder Süßwasser zum Zwecke des Fischfangs und des Sammelns von Krusten- und Weichtieren und anderen Meeresprodukten (z. B. Wasserpflanzen, Perlen, Schwämme usw.). Ferner umfasst diese Abteilung Tätigkeiten, die gewöhnlich in die Produktion auf eigene Rechnung integriert sind (z. B. Austernzucht zur Produktion von Perlen). Die Erbringung von Dienstleistungen, die mit der Fischerei und Aquakultur im Süß- und Meereswasser verbunden sind, sind den entsprechenden Fischerei- und Aquakulturtätigkeiten zuzuordnen. Nicht zu dieser Abteilung zählen der Bau und die Reparatur von Schiffen und Booten (s. 30.1 und 33.15) sowie die Sport- und Freizeitfischerei (s. 93.19). Ausgenommen ist auch die Verarbeitung von Fisch, Krusten- und Weichtieren, unabhängig davon, ob sie in Anlagen an Land oder auf Fabrikschiffen erfolgt (s. 10.20). @de
scope note: This division includes capture fishery and aquaculture, covering the use of fishery resources from marine, brackish or freshwater environments, with the goal of capturing or gathering fish, crustaceans, molluscs and other marine organisms and products (e.g. aquatic plants, pearls, sponges etc). Also included are activities that are normally integrated in the process of production for own account (e.g. seeding oysters for pearl production). Service activities incidental to marine or freshwater fishery or aquaculture are included in the related fishing or aquaculture activities. This division does not include building and repairing of ships and boats (30.1, 33.15) and sport or recreational fishing activities (93.19). Processing of fish, crustaceans or molluscs is excluded, whether at land-based plants or on factory ships (10.20). @en
scope note: Esta división comprende la pesca y la acuicultura, y cubre la utilización de los recursos pesqueros de los medios marinos, de aguas salobres o agua dulce, con el fin de capturar o recolectar peces, crustáceos, moluscos y otros organismos y productos del mar (por ejemplo, plantas acuáticas, perlas, esponjas, etc.). Incluye también las actividades que están integradas normalmente en el proceso de producción por cuenta propia (por ejemplo, el injerto de ostras para la producción de perlas). En las actividades relacionadas con la pesca o la acuicultura se incluyen los servicios relacionados con la pesca marina, de agua dulce o la acuicultura. Esta división no incluye la construcción y reparación de barcos (30.1, 33.15), ni la pesca deportiva o recreativa (93.19). Se excluye la elaboración de pescados, crustáceos y moluscos, tanto en instalaciones en tierra como en buques factoría (10.20). @es
scope note: Cette division comprend la pêche de capture et l’aquaculture et couvre l’exploitation des ressources halieutiques en milieu marin ou en eau douce, en vue de la capture ou de la récolte de poissons, crustacés, coquillages et autres produits marins (plantes aquatiques, perles, éponges, etc.). Elle comprend également des activités qui sont normalement intégrées au processus de production pour compte propre (par exemple: le greffage des huîtres perlières). Les services annexes à la pêche ou à l’aquaculture en milieu marin ou en eau douce sont compris dans les activités de pêche ou d’aquaculture concernées. Cette division ne comprend pas la construction ou la réparation de bateaux et de navires (30.1 et 33.15), ni la pêche sportive ou récréative (93.19). La transformation du poisson, des crustacés ou des mollusques est exclue, qu’elle ait lieu dans des installations à terre ou sur des bateaux usines (10.20). @fr
scope note: Ovaj odjeljak uključuje ribolov i akvakulturu, korištenje ribljih resursa iz morskih, boćatih i slatkovodnih voda, radi ulova ili skupljanja riba, rakova, školjaka te drugih morskih organizama i proizvoda (npr. vodenog bilja, bisera, spužvi itd.). Tu su uključene i djelatnosti koje su obično integrirane u proces proizvodnje za vlastiti račun (npr. razmnožavanje oštriga za proizvodnju bisera). Uslužne djelatnosti koje se odnose na morsko ili slatkovodno ribarstvo ili akvakulturu uključene su u spomenute djelatnosti. Ovaj odjeljak ne uključuje gradnju i popravak brodova i čamaca (30.1, 33.15) djelatnosti sportskog i rekreativnog ribolova (93.19). Prerada riba, rakova ili školjaka isključena je bez obzira na to obavlja li se u pogonima na kopnu ili na brodovima tvornicama (10.20).
scope note: Į šį skyrių įeina jūros gėrybių gaudymas ir akvakultūra, apimantys jūros, sūriųjų ir gėlųjų vandenų žuvies išteklių naudojimą, t.y. žuvų, vėžiagyvių, moliuskų ir kitų jūros organizmų ir produktų (pvz., vandens augalų, perlų, pinčių ir kt.) gaudymą ar rinkimą. Į ją taip pat įeina veiklos rūšys, kurios paprastai yra įtrauktos į gamybos procesą savoms reikmėms (pvz., austrių veisimas perlų gamybai). Jūros ar gėlųjų vandenų žuvininkystei ar akvakultūrai būdingos veiklos rūšys įeina į veiklos rūšis, susijusias su žvejyba ar akvakultūros veikla. Į šį skyrių neįeina laivų ir valčių statyba ir remontas (30.1, 33.15) bei sportinė ir mėgėjų žvejyba (93.19). Į šį skyrių taip pat neįeina žuvų, vėžiagyvių ar moliuskų apdorojimas ir perdirbimas įmonėse sausumoje ar žuvų apdorojimo laivuose (10.20). @lt
scope note: Данная группа включает «отлов», то есть охоту и сбор, а также виды деятельности, направленные на отлов или сбор живущих в воде организмов (преимущественно рыб, моллюсков и ракообразных), включая океанические растения, из прибрежных или внутренних вод для употребления в пищу людьми и прочих целей ручным способом или при помощи принадлежностей для рыбной ловли, таких как сети, удочки и ловушки. Подобные виды деятельности могут осуществлять как на побережье/берегу (например, сбор моллюсков, таких как мидии и устрицы), сетью, с лодок или шлюпок недалеко от берега, в прибрежных водах или в открытом море. А также в данную группу включена рыбная ловля в водохранилищах. @ru
scope note: Bu bölüm, balık, kabuklu su ürünleri, yumuşakçalar ve diğer deniz canlıları ile bunların ürünlerinin (su bitkileri, süngerler ve inci vb.) yakalanması veya toplanması amacıyla deniz, acı veya tatlı su kaynaklarında gerçekleştirilen balıkçılık faaliyetleri ile su ürünleri yetiştiriciliği faaliyetlerini kapsar. Ayrıca, işletmelerin kendi üretim faaliyetleri için gerekli olan diğer çalışmaları da (inci üretimi için istiridye yavrulatma gibi) kapsamaktadır. Denizlerde ve içsularda yapılan balıkçılık faaliyetleri ile su ürünleri yetiştiriciliğine ilişkin hizmet faaliyetlerini de içine alır. Bu bölüm gemi ve kayıkların yapımı ve onarımını (30.1, 33.15) ile spor ve eğlence amaçlı balıkçılık faaliyetlerini kapsamaz (93.19). Ayrıca, balık, kabuklu deniz hayvanları veya yumuşakçaların işlenmesi, karadaki tesislerde veya fabrika gemilerinde yapılıyorsa (10.20) bu bölüme dahil edilmez. @tr
preferred label: Рибно стопанство @bg
preferred label: Rybolov a akvakultura @cs
preferred label: Fiskeri og akvakultur @da
preferred label: Fischerei und Aquakultur @de
preferred label: Αλιεία και υδατοκαλλιέργεια @el
preferred label: Pesca y acuicultura @es
preferred label: Kalapüük ja vesiviljelus @et
preferred label: Kalastus ja vesiviljely @fi
preferred label: Pêche et aquaculture @fr
preferred label: Halászat, halgazdálkodás
preferred label: Pesca e acquicoltura @it
preferred label: Žvejyba ir akvakultūra @lt
preferred label: Zivsaimniecība @lv
preferred label: Sajd u akwakultura @mt
preferred label: Visserij en aquacultuur @nl
preferred label: Fiske, fangst og fiskeoppdrett @no
preferred label: Rybactwo @pl
preferred label: Pesca e aquacultura @pt
preferred label: Pescuitul şi acvacultura @ro
preferred label: Рыболовство и аквакультура @ru
preferred label: Rybolov a akvakultúra @sk
preferred label: Ribištvo in gojenje vodnih organizmov @sl
preferred label: Fiske och vattenbruk @sv
preferred label: Balıkçılık ve su ürünleri yetiştiriciliği @tr
broader: AGRICULTURE, FORESTRY AND FISHING
narrower: Fishing
narrower: Aquaculture

Fishing
type: Concept
notation: 03.1
status: valid
status modified: 2013-10-18
accepted date: 2013-10-18
in scheme: Statistical Classification of Economic Activities in the European Community, Rev. 2 (2008)
scope note: Тази група включва „риболов чрез улавяне“, т.е. организиране на лов, събиране и прибиране при свободно придвижване или събиране на живи водни организми (предимно риби, ракообразни и мекотели), вкл. растения от океански, крайбрежни или вътрешни води, за храна на човека и други нужди. Това става ръчно или в повечето случаи при използването на различни видове риболовни принадлежности като мрежи, подвижни и неподвижни капани. Тези дейности могат да се извършват между приливите и отливите по бреговата линия (например събиране на мекотели като миди и стриди) или залагане на мрежи от лодки (ръчно изработени или закупени) на брега или до брега в териториални или международни води. Тук се включва също риболов в зарибени водоеми. @bg
scope note: Tato skupina zahrnuje rybolov, tj. lov, sběr a získávání divoce žijících vodních organismů (především ryb, korýšů a měkkýšů, ale též rostlin) z oceánů, pobřežních nebo vnitrozemských vod pro lidskou konzumaci a k jiným účelům, ručně nebo častěji pomocí různých rybářských nástrojů, např. sítí, udic nebo pastí. Tyto činnosti mohou být prováděny na hranici přílivu a odlivu (např. sběr měkkýšů jako mušlí a ústřic), z pobřeží anebo z člunů a lodí (ať již vyrobených vlastními silami nebo, častěji, vyrobených průmyslově) formou rybolovu při pobřeží nebo na volném moři. Tyto činnosti zahrnují také lov ryb ve vodách s uměle nasazenými rybami. @cs
scope note: Diese Gruppe umfasst den "Fischfang", d. h. die Jagd nach und das Sammeln zum Zwecke der Entnahme von wild lebenden Wassertieren (vor allem Fischen, Krusten- und Weichtieren) einschließlich Pflanzen aus den Meeres-, Küsten- oder Binnengewässern zum Verzehr durch den Menschen und zu anderen Zwecken, mit der Hand oder häufiger mit verschiedenen Fischfanggeräten, z. B. Netzen, Angeln oder Fallen, in stehendem Gewässer. Derartige Tätigkeiten können in der Gezeitenlinie ausgeübt werden (z. B. Sammeln von Weichtieren wie Muscheln und Austern), von der Küste aus, von selbst gebauten Unterständen aus, oder aber, was gewöhnlich der Fall ist, durch den Einsatz kommerzieller Schiffe und Boote als Küsten- oder Hochseefischerei. Solche Tätigkeiten umfassen auch das Fischen in Gewässern mit künstlichem Fischbesatz. @de
scope note: This group includes "capture fishery", i.e. the hunting, collecting and gathering activities directed at removing or collecting live wild aquatic organisms (predominantly fish, molluscs and crustaceans) including plants from the oceanic, coastal or inland waters for human consumption and other purposes by hand or more usually by various types of fishing gear such as nets, lines and stationary traps. Such activities can be conducted on the intertidal shoreline (e.g. collection of molluscs such as mussels and oysters) or shore based netting, or from home-made dugouts or more commonly using commercially made boats in inshore, coastal waters or offshore waters. Such activities also include fishing in restocked water bodies. @en
scope note: Este grupo comprende la pesca, es decir, las actividades de captura y recolección de organismos acuáticos vivos (en especial, pescado, moluscos y crustáceos), incluidas las plantas de las aguas oceánicas, costeras o continentales para consumo humano y otros fines, a mano o por medio de cualquier arte de pesca como redes, palangres o trampas fijas. Tales actividades pueden realizarse en la línea de costa intermareal (por ejemplo, la captura de moluscos como los mejillones y las ostras) o instalando redes en la costa, o bien con pequeñas embarcaciones o utilizando grandes buques pesqueros, tanto en aguas de bajura o costeras como de altura. Tales actividades incluyen también la pesca en masas de agua repobladas. @es
scope note: Ce groupe comprend la "pêche de capture", c’est-à-dire les activités de capture et de destinées visant à prélever ou à recueillir des organismes vivant à l’état sauvage dans le milieu aquatique (essentiellement poissons, coquillages et crustacés), ainsi que des plantes se développant dans les eaux océaniques, côtières ou intérieures pour la consommation humaine ou à d’autres fins, manuellement ou, le plus souvent, à l’aide de filets, de lignes et de pièges fixes. Ces activités peuvent être réalisées dans la zone intertidale (comme dans le cas de la récolte de mollusques tels que les moules ou les huîtres) ou à l’aide de filets depuis le rivage, ou à bord de pirogues fabriquées artisanalement ou le plus souvent, à bord de bateaux fabriqués industriellement, dans les eaux côtières ou en haute mer. Ces activités comprennent également la pêche dans des milieux empoissonnés. @fr
scope note: Ova skupina uključuje ribolov tj. djelatnosti ulova i skupljanja, usmjerenih na vađenje ili skupljanje živih vodenih organizama (ponajprije riba, školjaka i rakova), kao i oceanskog bilja, bilja obalnih i unutarnjih voda za ljudsku prehranu ili u druge svrhe, a mogu se skupljati ručno ili pomoću ribarske opreme kao što su mreže, parangal i vrše. Takve djelatnosti mogu se temeljiti na obalnom skupljanju školjaka kao što su dagnje i kamenice u razdoblju između plime i oseke ili na obalnom ulovu mrežom ili pomoću čamaca domaće izrade ili što je mnogo češće, pomoću komercijalnih brodova u obalnim, priobalnim ili u otvorenim vodama. Spomenute djelatnosti također uključuju ribolov u poribljenim vodenim površinama.
scope note: Į šią grupę įeina „renkamosios žuvininkystės“, t.y. ieškojimo, kaupimo ir surinkimo veikla, atliekama paimant ar kaupiant gyvus laukinius vandens organizmus (daugiausia žuvis, moliuskus ir vėžiagyvius), taip pat vandenynų, jūrų ir vidaus vandenų augalus, tinkamus vartoti žmogui ar kitiems tikslams, rankomis ar dažniau, kaip įprasta, įvairiais žvejybos reikmenimis, tokiais kaip tinklai, meškerės ir stacionariosios gaudyklės. Kai kurios veiklos rūšys gali būti atliekamos jūros pakrančių potvynių ir atoslūgių juostoje (pvz., moliuskų, tokių kaip midijos ir austrės, rinkimas), pakrančių vandenyse ir atviroje jūroje pakrančių tinklais ar pačių padarytais luotais, ar dažniausiai naudojant pramoniniu būdu padarytas valtis. Į tokią veiklą taip pat įeina žvejyba dideliuose pripildomo vandens telkiniuose. @lt
scope note: Этот класс включает: - рыбную ловлю на коммерческой основе в океане и прибрежных водах - отлов морских ракообразных и моллюсков - отлов китов - отлов морских видов животных: морских черепах, медуз, осьминогов, морских ежей и т.д. Этот класс также включает: - морскую рыбную ловлю с судна, переработку, заготовку и консервирование рыбы - сбор прочих морских организмов и материалов: натурального морского жемчуга, губок, кораллов и водорослей Этот класс исключает: - отлов морских млекопитающих, за исключением китов, например моржей и тюленей, см. 01.70 - переработку китов на плавучих рыбозаводах, см. 10.11 - переработку рыбы, ракообразных и моллюсков на плавучих рыбозаводах или прибрежных рыбозаводах, см. 10.20 - аренду прогулочных лодок с командой для морских и прибрежных перевозок (например, рыбной ловли), см. 50.10 - инспекцию рыбной ловли, защиту и надзор, см. 84.24 - спортивную рыбную ловлю, отдых и сопутствующие виды услуг, см. 93.19 - деятельность по организации спортивной рыбной ловли, см. 93.19 @ru
scope note: Bu grup, el veya daha yaygın olarak ağ, olta ipi ve sabit tuzaklar gibi çeşitli tiplerdeki balıkçılık aletleri yardımıyla, bireysel tüketim ve diğer amaçlar için okyanuslar, kıyılar veya iç denizlerden, bitkiler de dahil vahşi deniz organizmalarının (ağırlıklı olarak balık, yumuşakça ve kabuklu deniz ürünleri) canlı canlı toplanması veya çıkarılmasına yönelik avcılık, yakalama, toplama vb. balık yakalama faaliyetlerini kapsamaktadır. Bu tür faaliyetler, deniz seviyesinin en düşük olduğu kıyı çizgisinin yukarısında kalan kıyı şeridi (midye ve istiridye gibi yumuşakçaların toplanması gibi) veya kıyıda yapılan ağcılık ile ev yapımı siper ağcılık ya da daha yaygın olarak kıyıya yakın yerler, sahil veya açık denizlerde kayıkla yapılan ticari amaçlı ağcılık ile gerçekleştirilebilir. Bu tür faaliyetlere sonradan oluşturulmuş göller gibi sulardaki balıkçılık faaliyetleri de dahildir. @tr
preferred label: Риболов @bg
preferred label: Rybolov @cs
preferred label: Fiskeri @da
preferred label: Fischerei @de
preferred label: Αλιεία @el
preferred label: Pesca @es
preferred label: Kalapüük @et
preferred label: Kalastus @fi
preferred label: Pêche @fr
preferred label: Halászat
preferred label: Žvejyba @lt
preferred label: Zvejniecība @lv
preferred label: Sajd @mt
preferred label: Visserij @nl
preferred label: Fiske og fangst @no
preferred label: Rybołówstwo @pl
preferred label: Pescuitul @ro
preferred label: Рыболовство @ru
preferred label: Ribištvo @sl
preferred label: Fiske @sv
preferred label: Balıkçılık @tr
broader: Fishing and aquaculture
narrower: Marine fishing
narrower: Freshwater fishing

Marine fishing
type: Concept
notation: 03.11
status: valid
status modified: 2013-10-18
accepted date: 2013-10-18
in scheme: Statistical Classification of Economic Activities in the European Community, Rev. 2 (2008)
scope note: - океански и морски стопански риболов - улов на ракообразни и мекотели в морски басейни - улов на китове - улов на други водни животни в морски басейни: костенурки, иглокожи и други - дейности на кораби заводи, извършващи океански или морски риболов, преработка и консервиране на риба, ракообразни и мекотели - събиране на морски продукти и материали: естествени перли, сюнгери, корали и водорасли - улов на морски бозайници като моржове, тюлени и други, без улова на китове - 01.70 - преработка на китове в кораби заводи - 10.11 - дейности на кораби заводи или заводи на сушата, специализирани само в преработка и консервиране на риба, ракообразни и мекотели - 10.20 - даване под наем на плавателни съдове за развлечение с екипаж за морски и крайбрежен транспорт (например пътувания с цел риболов) - 50.10 - наблюдение, контрол и опазване на рибните ресурси - 84.24 - спортен и развлекателен риболов и свързаните с него дейности - 93.19 - експлоатация на обекти за спортен и развлекателен риболов - 93.19 @bg
scope note: Z: - komerční lov ryb v oceánech a pobřežních vodách - sběr mořských korýšů a měkkýšů - lov velryb - lov mořských živočichů: želv, sumek a jiných pláštěnců, ježovek atd. ZT: - činnosti prováděné na lodích, na nichž probíhá nejen samotný rybolov, ale současně i zpracování a konzervování ryb - lov a sběr ostatních mořských organismů a materiálů: přírodních perel, mořských hub, korálů a řas N: - lov mořských savců jako mrožů a tuleňů, s výjimkou velryb (01.70) - zpracování velryb na plavidlech k tomu určených (10.11) - zpracování ryb, korýšů a měkkýšů na plavidlech k tomu určených nebo v závodech na pevnině (10.20) - pronájem výletních lodí s posádkou pro námořní a pobřežní plavbu (např. plavba s rybařením) (50.10) - činnosti rybářské inspekce a ochrany mořských rybolovných zdrojů a činnosti rybářské stráže (84.24) - sportovní a rekreační rybolov a činnosti s tím spojené (93.19) - provoz rybářských revírů pro sportovní rybolov (93.19) @cs
scope note: Diese Klasse umfasst: - kommerzielle Hochsee- und Küstenfischerei - Fang von Meereskrusten- und -weichtieren - Walfang - Fang von Meerestieren: Schildkröten, Seescheiden und andere Manteltiere, Seeigel usw. Diese Klasse umfasst ferner: - Tätigkeiten von Spezialschiffen für Fischfang und Fischverarbeitung/-konservierung - Sammeln sonstiger Meerestiere und –materialien: Naturperlen, Schwämme, Korallen und Algen Diese Klasse umfasst nicht: - Fang von Meeressäugetieren, mit Ausnahme von Walen, z. B. Walrosse und Robben (s. 01.70) - Verarbeitung von Walen auf Fabrikschiffen (s. 10.11) - Verarbeitung von Fischen, Krusten- und Weichtieren auf Fabrikschiffen oder in Fabriken an Land (s. 10.20) - Vermietung von Vergnügungsschiffen mit Besatzung für den Hochsee- und Küstenverkehr (z. B. für Fischfangfahrten) (s. 50.10) - Tätigkeiten der Fischereiinspektion und des Fischereischutzes sowie Patrouillendienste (s. 84.24) - Sport- und Freizeitfischerei und damit verbundene Dienstleistungen (s. 93.19) - Betrieb von Fischteichen für Sportfischerei (s. 93.19) @de
scope note: This class includes: - fishing on a commercial basis in ocean and coastal waters - taking of marine crustaceans and molluscs - whale catching - taking of marine aquatic animals: turtles, sea squirts, tunicates, sea urchins etc. This class also includes: - activities of vessels engaged both in marine fishing and in processing and preserving of fish - gathering of other marine organisms and materials: natural pearls, sponges, coral and algae This class excludes: - capturing of marine mammals, except whales, e.g. walruses, seals, see 01.70 - processing of whales on factory ships, see 10.11 - processing of fish, crustaceans and molluscs on factory ships or in factories ashore, see 10.20 - renting of pleasure boats with crew for sea and coastal water transport (e.g. for fishing cruises), see 50.10 - fishing inspection, protection and patrol services, see 84.24 - fishing practiced for sport or recreation and related services, see 93.19 - operation of sport fishing preserves, see 93.19 @en
scope note: Esta clase comprende: - la pesca marítima (incluida la costera) con fines comerciales - la captura de moluscos y crustáceos marinos - la captura de ballenas - la captura de animales acuáticos marinos: tortugas, ascidias y otros tunicados, erizos de mar, etc. Esta clase comprende también: - las actividades de las embarcaciones dedicadas tanto a la pesca marina como a la preparación y conservación del pescado - la captura de otros organismos y materiales marinos: perlas naturales, esponjas, coral y algas Esta clase no comprende: - la captura de mamíferos marinos, excepto ballenas, por ejemplo: morsas y focas (véase 01.70) - el procesado de ballenas a bordo de buques factoría (véase 10.11) - la elaboración de pescado, crustáceos y moluscos en buques factoría o en factorías en tierra (véase 10.20) - el alquiler de embarcaciones de recreo con tripulación para transporte marítimo (incluido el costero) (por ejemplo, para cruceros de pesca) (véase 50.10) - los servicios de inspección, de protección y de patrulla pesqueros (véase 84.24) - la pesca deportiva o de recreo y servicios afines (véase 93.19) - la explotación de cotos de pesca deportiva (véase 93.19) @es
scope note: Cette classe comprend: - la pêche à des fins commerciales dans les eaux océaniques et côtières - la capture de crustacés et de mollusques marins - la pêche à la baleine - la capture d’animaux aquatiques marins: tortues, holothuries, tuniciers, oursins, etc. Cette classe comprend également: - les activités des navires se livrant tant à la pêche en mer qu’à la transformation et à la conservation du poisson - la récolte d’autres produits marins: perles naturelles, éponges, coraux et algues Cette classe ne comprend pas: - la capture de mammifères marins, à l’exception des baleines, par exemple: les morses et les phoques, voir 01.70 - la transformation des baleines sur des bateaux usines, voir 10.11 - la transformation des poissons, des crustacés et des mollusques sur des bateaux usines, ou dans des usines à terre, voir 10.20 - la location de bateaux de plaisance avec équipage pour le transport maritime et côtier (par exemple: pour des croisières de pêche), voir 50.10 - les services d’inspection, de protection et de surveillance de la pêche, voir 84.24 - la pêche pratiquée en tant qu’activité sportive ou récréative et les services annexes, voir 93.19 - l’exploitation de réserves pour la pêche sportive, voir 93.19 @fr
scope note: Ovaj razred uključuje: - ribolov na komercijalnoj osnovi u oceanima i obalnim vodama - ulov morskih rakova i školjaka - ulov kitova - ulov morskih vodenih životinja: morskih kornjača, mješičnica, mahovnjaka, morskih ježinaca, itd. Ovaj razred također uključuje: - djelatnosti brodova koji se bave morskim ribolovom i preradom te konzerviranjem morske ribe - vađenje ostalih morskih organizama: prirodnih bisera, spužvi, koralja i algi Ovaj razred isključuje: - ulov morskih sisavaca, osim kitova, npr. morževa, tuljana, vidi 01.70 - preradu kitova na brodovima tvornicama, vidi 10.11 - preradu ribe, rakova i školjaka na brodovima koji se bave preradom i konzerviranjem ribe ili u tvornicama na kopnu, vidi 10.20 - iznajmljivanje čamaca za razonodu s posadom za prijevoz morem i priobaljem (npr. za ribolov), vidi 50.10 - usluge nadzora, zaštite i ophodnje u vezi s ribolovom, vidi 84.24 - sportsko-rekreativni ribolov i usluge povezane s njim, vidi 93.19 - rad rezervata za sportski ribolov, vidi 93.19
scope note: Į šią klasę įeina: - komercinė žvejyba vandenynuose ar pakrančių vandenyse - jūrų vėžiagyvių ir moliuskų gaudymas - banginių gaudymas - jūros gyvūnų gaudymas: vėžlių, ascidijų, kitų gaubtagyvių, jūrų ežių ir kt. Į šią klasę taip pat įeina: - žvejybinių laivų, užsiimančių ir jūros žvejyba, ir žuvies apdorojimu bei konservavimu žvejybos metu, veikla - jūrų organizmų ir produktų rinkimas: natūraliųjų perlų, pinčių, koralų ir jūrų dumblių Į šią klasę neįeina: - jūros žinduolių, pvz., jūrų vėplių, ruonių, išskyrus banginius, gaudymas, žr. 01.70 - banginių apdorojimas žuvų apdorojimo laivuose, žr. 10.11 - žuvų, vėžiagyvių ir moliuskų apdorojimas žuvų apdorojimo laivuose ar įmonėse sausumoje, žr. 10.20 - pramoginių laivų, su aptarnavimo komandos samdymu, nuoma vežimui jūrų ir pakrančių vandenimis (pvz., žvejybiniams kruizams), žr. 50.10 - žvejybos inspekcijos, saugos ir policijos paslaugų veikla, žr. 84.24 - sportinės arba pramoginės žūklės organizavimas bei susijusių paslaugų teikimas, žr. 93.19 - sportinės žūklės draustinių veikla, žr. 93.19 @lt
scope note: Этот класс включает: - рыбную ловлю на коммерческой основе во внутренних водах - отлов пресноводных ракообразных и моллюсков - отлов пресноводных видов животных Этот класс также включает: - сбор пресноводных материалов Этот класс исключает: - переработку рыбы, ракообразных и моллюсков, см. 10.20 - инспекцию рыбной ловли, защиту и надзор, см. 84.24 - спортивную рыбную ловлю, отдых и сопутствующие виды услуг, см. 93.19 - деятельность по организации спортивной рыбной ловли, см. 93.19 @ru
scope note: Bu sınıf aşağıdakileri kapsamaktadır; - okyanus ve kıyı sularında ticarete dayalı yapılan balıkçılık, - deniz kabukluları ile yumuşakçaların yakalanması, - balina avcılığı, - suda yaşayan hayvanların avlanması: kaplumbağa, deniz fıskiyesi (sea squirt), gömlekliler (tunicates), deniz kestanesi vb. Ayrıca bu sınıf aşağıdakileri de kapsamaktadır; - hem deniz balıkçılığı, hem de balıkların işlenmesi ve saklanması ile ilgilenen teknelerin faaliyetleri, - diğer deniz organizmaları ile ürünlerinin toplanması: doğal inci, sünger, mercan ve deniz yosunu. Kapsam dışı olanlar; - balina hariç deniz memelilerinin yakalanması, örn. deniz aygırı (mors), fok (ayı balığı), bkz. 01.70, - balinaların, fabrika gemilerinde işlenmesi, bkz. 10.11, - balık, kabuklu ve yumuşakçaların bir fabrika gemisi ya da kıyıdaki fabrikalarda işlenmesi, bkz.10.20, - deniz veya kıyı suyu ulaşımı için mürettebatı ile birlikte gezi gemisi kiralanması (örn. balık tutma amaçlı deniz gezintisi için), bkz. 50.10, - balıkçılıkla ilgili, denetleme, koruma (emniyet) ve devriye faaliyetleri, bkz. 84.24, - spor veya eğlence amaçlı yapılan balıkçılık ve ilgili hizmetler, bkz. 93.19, - spor balıkçılığı için ayrılmış alanların işletimi, bkz. 93.19. @tr
preferred label: Океански и морски риболов @bg
preferred label: Mořský rybolov @cs
preferred label: Havfiskeri @da
preferred label: Meeresfischerei @de
preferred label: Θαλάσσια αλιεία @el
preferred label: Pesca marina @es
preferred label: Merekalapüük @et
preferred label: Merikalastus @fi
preferred label: Pêche en mer @fr
preferred label: Tengeri halászat
preferred label: Jūrinė žvejyba @lt
preferred label: Jūras zvejniecība @lv
preferred label: Sajd fil-baħar @mt
preferred label: Zeevisserij @nl
preferred label: Hav- og kystfiske og fangst @no
preferred label: Rybołówstwo w wodach morskich @pl
preferred label: Pesca marítima @pt
preferred label: Pescuitul maritim @ro
preferred label: Морское рыболовство @ru
preferred label: Morský rybolov @sk
preferred label: Morsko ribištvo @sl
preferred label: Saltvattensfiske @sv
preferred label: Deniz balıkçılığı @tr
broader: Fishing

Freshwater fishing
type: Concept
notation: 03.12
status: valid
status modified: 2013-10-18
accepted date: 2013-10-18
in scheme: Statistical Classification of Economic Activities in the European Community, Rev. 2 (2008)
scope note: - стопански риболов в сладководни басейни - улов на ракообразни и мекотели в сладководни басейни - улов на водни животни в сладководни басейни - събиране на продукти и материали от сладководни басейни - дейности на кораби заводи или заводи на сушата, специализирани само в преработката и консервирането на риба, ракообразни и мекотели - 10.20 - наблюдение, контрол и опазване на рибните ресурси - 84.24 - спортен и развлекателен риболов и свързаните с него дейности - 93.19 - експлоатация на обекти за спортен и развлекателен риболов - 93.19 @bg
scope note: Z: - komerční lov ryb ve vnitrozemských vodách - sběr sladkovodních korýšů a měkkýšů - lov sladkovodních živočichů ZT: - sběr sladkovodních materiálů N: - zpracování ryb, korýšů a měkkýšů (10.20) - činnosti rybářské inspekce a ochrany mořských rybolovných zdrojů a činnosti rybářské stráže (84.24) - sportovní a rekreační rybolov a činnosti s tím spojené (93.19) - provoz rybářských revírů pro sportovní rybolov (93.19) @cs
scope note: Diese Klasse umfasst: - kommerzielle Binnenfischerei - Fang von Süßwassermollusken und –weichtieren - Fang von Binnenwassertieren Diese Klasse umfasst ferner: - Sammeln von Süßwassererzeugnissen Diese Klasse umfasst nicht: - Fischverarbeitung (s. 10.20) - Tätigkeiten der Fischereiinspektion und des Fischereischutzes sowie Patrouillendienste (s. 84.24) - Sport- und Freizeitfischerei und damit verbundene Dienstleistungen (s. 93.19) - Betrieb von Fischteichen für Sportfischerei (s. 93.19) @de
scope note: This class includes: - fishing on a commercial basis in inland waters - taking of freshwater crustaceans and molluscs - taking of freshwater aquatic animals This class also includes: - gathering of freshwater materials This class excludes: - processing of fish, crustaceans and molluscs, see 10.20 - fishing inspection, protection and patrol services, see 84.24 - fishing practiced for sport or recreation and related services, see 93.19 - operation of sport fishing preserves, see 93.19 @en
scope note: Esta clase comprende: - la pesca comercial en aguas continentales - la captura de moluscos y crustáceos de agua dulce - la captura de animales acuáticos de agua dulce Esta clase comprende también: - la recolección de materiales de agua dulce Esta clase no comprende: - la elaboración de pescado, crustáceos y moluscos (véase 10.20) - los servicios de inspección, de protección y de patrulla pesqueros (véase 84.24) - la pesca deportiva o de recreo y servicios afines (véase 93.19) - la explotación de cotos de pesca deportiva (véase 93.19) @es
scope note: Cette classe comprend: - la pêche à des fins commerciales en eaux intérieures - la capture de crustacés et de mollusques d’eau douce - la capture d’animaux aquatiques d’eau douce Cette classe comprend également: - la récolte de produits d’eau douce Cette classe ne comprend pas: - la transformation des poissons, des crustacés et des mollusques, voir 10.20 - les services d’inspection, de protection et de surveillance de la pêche, voir 84.24 - la pêche pratiquée en tant qu’activité sportive ou récréative et les services annexes, voir 93.19 - l’exploitation de réserves pour la pêche sportive, voir 93.19 @fr
scope note: Ovaj razred uključuje: - ribolov na komercijalnoj osnovi u unutrašnjim vodama - ulov slatkovodnih rakova i školjaka - ulov slatkovodnih vodenih životinja Ovaj razred također uključuje: - skupljanje slatkovodnoga vodenog bilja i ostalih organizama Ovaj razred isključuje: - preradu riba, rakova i školjaka, vidi 10.20 - usluge nadzora, zaštite i ophodnje u vezi s ribolovom, vidi 84.24 - sportsko-rekreativni ribolov i usluge povezane s njim, vidi 93.19 - rad rezervata za sportski ribolov, vidi 93.19
scope note: Į šią klasę įeina: - komercinė žvejyba vidaus vandenyse - gėlųjų vandenų vėžiagyvių ir moliuskų gaudymas - gėlųjų vandenų gyvūnų gaudymas Į šią klasę taip pat įeina: - gėlųjų vandenų augalų rinkimas Į šią klasę neįeina: - žuvies, vėžiagyvių ir moliuskų perdirbimas, žr. 10.20 - žvejybos inspekcijos, saugos ir policijos paslaugų veikla, žr. 84.24 - sportinės arba pramoginės žūklės organizavimas bei susijusių paslaugų teikimas, žr. 93.19 - sportinės žūklės draustinių veikla, žr. 93.19 @lt
scope note: Данная группа включает «аквакультуру» (или водное фермерство), то есть производственный процесс, включающий в себя разведение или фермерство (включая сбор урожая) морских организмов и культур (рыб, моллюсков, ракообразных, растений, крокодилов, аллигаторов и амфибий), с применением технологий, разработанных для расширения производства по размножению данных организмов в вопросах увеличения естественного прироста в окружающей среде (например, регулярная передача в накопитель, откорм и защита от хищников). Фермерская работа, направленная на увеличение молодняка и/или взрослых особей в условиях отлова вышеописанных организмов. Вдобавок, «аквакультура» также включает индивидуальное, кооперативное или государственное владение отдельными особями с целью увеличения их численности, включая их потомство. @ru
scope note: Bu sınıf aşağıdakileri kapsamaktadır; - iç sularda yapılan ticari balıkçılık, - tatlı sularda yetişen kabuklu ve yumuşakçaların toplanması, - tatlı sularda yaşayan hayvanlarının toplanması. Ayrıca bu sınıf aşağıdakileri de kapsamaktadır; - tatlı su ürünlerinin toplanması. Kapsam dışı olanlar; - balık, kabuklu ve yumuşakçaların işlenmesi, bkz. 10.20, - balıkçılıkla ilgili, denetleme, koruma (emniyet) ve devriye faaliyetleri, bkz. 84.24, - spor veya eğlence amaçlı yapılan balıkçılık ve ilgili hizmetler, bkz. 93.19, - spor balıkçılığı için ayrılmış alanların işletimi, bkz. 93.19. @tr
preferred label: Сладководен риболов @bg
preferred label: Sladkovodní rybolov @cs
preferred label: Ferskvandsfiskeri @da
preferred label: Süßwasserfischerei @de
preferred label: Αλιεία γλυκών υδάτων @el
preferred label: Pesca en agua dulce @es
preferred label: Mageveekalapüük @et
preferred label: Sisävesikalastus @fi
preferred label: Pêche en eau douce @fr
preferred label: Édesvízi halászat
preferred label: Pesca in acque dolci @it
preferred label: Gėlųjų vandenų žvejyba @lt
preferred label: Saldūdens zvejniecība @lv
preferred label: Sajd fl-ilma ħelu @mt
preferred label: Binnenvisserij @nl
preferred label: Ferskvannsfiske @no
preferred label: Rybołówstwo w wodach śródlądowych @pl
preferred label: Pesca em água doce @pt
preferred label: Pescuitul în ape dulci @ro
preferred label: Пресноводное рыболовство @ru
preferred label: Riečny rybolov @sk
preferred label: Sladkovodno ribištvo @sl
preferred label: Sötvattensfiske @sv
preferred label: Tatlısu balıkçılığı @tr
broader: Fishing

Aquaculture
type: Concept
notation: 03.2
status: valid
status modified: 2013-10-18
accepted date: 2013-10-18
in scheme: Statistical Classification of Economic Activities in the European Community, Rev. 2 (2008)
scope note: Тази група включва развъждане и отглеждане на водни организми, т.е. процеси, свързани с развъждането или отглеждането (вкл. прибиране на отгледаното) на водни организми (риби, мекотели, ракообразни, водорасли, крокодили, алигатори и земноводни) при използване на техники/умения, предназначени за увеличаване на организмите извън естествената способност на околната среда (например - редовното поддържане на рибните ресурси, тяхното изхранване и опазване от хищници). Развъждане/отглеждане в рибарници на млади и/или възрастни (достигнали зряла възраст) водни организми от посочените по-горе. Освен това включва отглеждане и развъждане на водни организми - притежание на отделно лице, предприемач или държава на отделни организми - по време на различните фази от развитието им, вкл. и до крайната фаза - събиране на отгледаното. @bg
scope note: Tato skupina zahrnuje „akvakulturu“ (vodní farmaření), tzn. výrobní proces zahrnující chov (vč. odlovu) nebo pěstování (vč. sklizně) vodních organismů (ryb, korýšů a měkkýšů, rostlin, krokodýlů, aligátorů a obojživelníků) při využití postupů zvyšujících produkci těchto organismů nad úroveň běžnou pro jejich přirozené životní prostředí (např. pravidelné násady, krmení a ochrana před dravci). Chov nebo pěstování znamená péči o v zajetí rostoucí organismy až do okamžiku jejich vypuštění do volné přírody či jejich průmyslového zpracování. Akvakultura se dále vyznačuje vlastnictvím jednotlivých organismů jednotlivými osobami, podniky nebo státem během celého období chovu nebo pěstování těchto organismů až do momentu jejich odlovu nebo sklizně včetně. @cs
scope note: Diese Gruppe umfasst die Aquakultur, d. h. den Produktionsprozess der Zucht bzw. des Anbaus und des Fangs bzw. der Ernte von Meeresorganismen (Fischen, Krusten- und Weichtieren, Pflanzen, Krokodilen, Alligatoren und Amphibien) unter Einsatz von Techniken, die die Produktion der betreffenden Organismen über die natürliche Kapazität des Lebensraums hinaus steigern (z. B. regelmäßiger Besatz, Füttern und Schutz vor Räubern). Anbau/Zucht umfasst die Aufzucht der genannten Organismen in Gefangenschaft bis zum Jungtieralter oder bis sie ausgewachsen sind. Ferner umfasst Aquakultur auch das Eigentum von Einzelpersonen, Unternehmen oder des Staates an einzelnen Organismen während der Aufzucht- oder Anbauphase bis hin zur und einschließlich der Ernte. @de
scope note: This group includes "aquaculture" (or aquafarming), i.e. the production process involving the culturing or farming (including harvesting) of aquatic organisms (fish, molluscs, crustaceans, plants, crocodiles, alligators and amphibians) using techniques designed to increase the production of the organisms in question beyond the natural capacity of the environment (for example regular stocking, feeding and protection from predators). Culturing/farming refers to the rearing up to their juvenile and/or adult phase under captive conditions of the above organisms. In addition, "aquaculture" also encompasses individual, corporate or state ownership of the individual organisms throughout the rearing or culture stage, up to and including harvesting. @en
scope note: Este grupo comprende la acuicultura (o piscicultura), es decir, el proceso de producción que incluye el cultivo o la cría (incluida la recogida) de organismos acuáticos (peces, moluscos, crustáceos, plantas, cocodrilos, caimanes y anfibios) con técnicas encaminadas a aumentar, por encima de las capacidades naturales del medio, la producción de los organismos en cuestión; (por ejemplo, manteniendo unas condiciones idóneas estables, suministrando una alimentación adecuada o proporcionando protección contra los predadores). El cultivo/la cría se refieren al cultivo hasta la fase juvenil y/o adulta en cautividad de los organismos citados. Además, “acuicultura” comprende también la propiedad privada o pública de los organismos individuales a lo largo de toda la fase de cultivo o cría y el momento de su recogida. @es
scope note: Ce groupe comprend "l'aquaculture" (ou élevage aquicole), c’est-à-dire le processus de production par lequel des organismes aquatiques (poissons, mollusques, crustacés, plantes aquatiques, crocodiles, alligators et amphibiens) sont cultivés ou élevés (et récoltés) en utilisant des techniques visant à augmenter la production de ces organismes au-delà d’un niveau considéré comme durable dans des conditions naturelles (par exemple: mise en charge régulière, alimentation, protection contre les prédateurs). Les termes de culture ou d’élevage font ici référence à l’élevage en captivité de sujets jeunes ou adultes. La notion "d'aquaculture" comprend également la notion de propriété individuelle, collective ou nationale des organismes en élevage, jusqu’à leur récolte. @fr
scope note: Ova skupina uključuje akvakulturu (ili vodeni uzgoj), tj. proces proizvodnje koji uključuje kultiviranje ili uzgoj, (uključujući izlov) vodenih organizama (riba, školjaka, rakova, biljaka, krokodila, aligatora i vodozemaca).Taj proces koristi se metodama kojima je svrha postići veću proizvodnju organizama iznad prirodnih kapaciteta okoliša (npr. dovoljnim zalihama hrane, hranjenjem i zaštitom od grabežljivaca). Uzgoj se odnosi na uzgoj do stadija mlađi, i/ili do njihove odrasle faze, do uvjeta u kojima je dopušten izlov tih organizama. Osim toga akvakultura (ili vodeni uzgoj) se može odvijati u privatnom, korporativnom ili državnom vlasništvu kroz faze uzgoja ili razmnožavanja pa sve do ubiranja pojedinih organizama.
scope note: Į šią grupę įeina „akvakultūra“ (ar vandens ūkis), t.y. gamybos procesas, aprėpiantis vandens organizmų (žuvų, moliuskų, vėžiagyvių, augalų, krokodilų, aligatorių ir amfibijų) auginimą ar ūkininkavimą (įskaitant ir derliaus nuėmimą) naudojant specialias technologijas, leidžiančias didinti organizmų gamybą, nepažeidžiant aplinkos natūralių išgalių (pvz., nuolatinis papildymas, maitinimas ir apsauga nuo grobuonių). Auginimas / ūkininkavimas remiasi aukščiau minėtų organizmų jauniklių veisimu ir (arba) užauginimu iki subrendusių gyvūnų fazės nelaisvėje. Be to, "akvakultūra" taip pat apima asmeninę, bendrąją ar valstybinę atskirų organizmų nuosavybę per visą veisimo ar auginimo laikotarpį ir vėliau, įskaitant ir derliaus nuėmimą. @lt
scope note: Этот класс включает: - разведение рыбы в морской воде, включая разведение аквариумных рыб - производство икры моллюсков (устриц, мидий и т.д.), омаров, креветок, мальков рыб и их ручную обработку - выращивание красных водорослей и прочих съедобных водорослей - разведение ракообразных, двустворчатых моллюсков, прочих моллюсков и других водных видов животных в морской воде Этот класс также включает: - аквакультуру в морской воде - аквакультуру в соленой воде в резервуарах - инкубаторные станции по разведению морских видов рыбы - фермы по разведению морских червей Этот класс исключает: - разведение лягушек, см. 03.22 - деятельность по организации спортивной рыбной ловли, см. 93.19 @ru
scope note: Bu grup, su ürünlerinin (balık, yumuşakçalar, kabuklu ve eklembacaklı su ürünleri, su bitkileri, timsahlar ve hem karada hem de suda yaşayabilen hayvanlar) üretimini veya yetiştiriciliğini de kapsayan ve çevredeki doğal kapasitesini aşacak şekilde üretimini artırıcı teknikler (yoğun stoklama, besleme ve yırtıcı hayvanlardan koruma vb.) kullanılarak gerçekleştirilen üretim faaliyetlerini kapsayan su ürünleri yetiştiricilik faaliyetlerini kapsar. Su ürünleri yetiştiriciliği; yukarıda belirtilen organizmaların sabit koşullar altında yavru üretimini ve/veya farklı büyüklüklüklere kadar olan beslenmesini ifade eder. Buna ek olarak, su ürünleri yetiştiriciliği; hasat da dahil olmak üzere su ürünlerinin üretim ve yetiştiriciliği alanında faaliyet gösteren gerçek ve tüzel kişiler ile devlet tüzel kişiliğine ait işletmeleri kapsamaktadır. @tr
preferred label: Развъждане и отглеждане на риба и други водни организми @bg
preferred label: Akvakultura @cs
preferred label: Akvakultur @da
preferred label: Aquakultur @de
preferred label: Υδατοκαλλιέργεια @el
preferred label: Acuicultura @es
preferred label: Vesiviljelus @et
preferred label: Vesiviljely @fi
preferred label: Halgazdálkodás
preferred label: Acquicoltura @it
preferred label: Akvakultūra @lt
preferred label: Akwakultura @mt
preferred label: Aquacultuur @nl
preferred label: Fiskeoppdrett og klekkerier @no
preferred label: Chów i hodowla ryb oraz pozostałych organizmów wodnych @pl
preferred label: Aquacultura @pt
preferred label: Acvacultura @ro
preferred label: Аквакультура @ru
preferred label: Akvakultúra @sk
preferred label: Gojenje vodnih organizmov @sl
preferred label: Vattenbruk @sv
preferred label: Su ürünleri yetiştiriciliği @tr
broader: Fishing and aquaculture
narrower: Marine aquaculture
narrower: Freshwater aquaculture

Marine aquaculture
type: Concept
notation: 03.21
status: valid
status modified: 2013-10-18
accepted date: 2013-10-18
in scheme: Statistical Classification of Economic Activities in the European Community, Rev. 2 (2008)
scope note: - отглеждане на риба в морски води, вкл. отглеждане на декоративни рибки - производство на зарибителен материал и материал за възпроизводство на миди, стриди, скариди и други - отглеждане на морска трева и други водорасли, годни за консумация от човека - отглеждане на ракообразни, двучерупкови (миди, стриди и подобни), други мекотели и други водни животни в морски води - развъждане и отглеждане на водни организми в слабосолени басейни - развъждане и отглеждане на водни организми в солени басейни (изкуствени) - експлоатация на рибарници за морска риба - експлоатация на развъдници за морски червеи - отглеждане на жаби в стопанства - 03.22 - експлоатация на обекти за спортен и развлекателен риболов - 93.19 @bg
scope note: Z: - chov mořských ryb, vč. akvarijních - produkci potěru mlžů (ústřic, mušlí atd.), mladých humrů, mladých krevet, rybích jiker a násad - pěstování jedlých mořských řas - chov korýšů, mlžů a jiných měkkýšů jakož i ostatních vodních živočichů v mořských vodách ZT: - akvakulturu v brakických vodách - akvakulturu v nádržích nebo sádkách naplněných slanou vodou - provoz chovných stanic pro mořské ryby - provoz farem pro chov mořských červů N: - chov žab (03.22) - provoz rybářských revírů pro sportovní rybolov (93.19) @cs
scope note: Diese Klasse umfasst: - Zucht von Meeresfischen einschließlich Meerwasser-Zierfischen - Erzeugung von Laich von zweischaligen Weichtieren (Austern, Muscheln usw.), Junghummern, Junggarnelen, Fischrogen und Setzlingen - Anbau von Algen und anderen essbaren Meerespflanzen - Haltung von Krustentieren, zweischaligen und anderen Weichtieren sowie sonstigen Wassertieren im Meereswasser Diese Klasse umfasst ferner: - Aquakultur in Brackwasser - Aquakultur in salzwassergefüllten Tanks und Behältern - Betrieb von Seefisch-Zuchtbetrieben - Betrieb von Meereswürmerfarmen Diese Klasse umfasst nicht: - Froschzucht (s. 03.22) - Betrieb von Fischteichen für Sportfischerei (s. 93.19) @de
scope note: This class includes: - fish farming in sea water including farming of marine ornamental fish - production of bivalve spat (oyster mussel etc.), lobsterlings, shrimp post-larvae, fish fry and fingerlings - growing of laver and other edible seaweeds - culture of crustaceans, bivalves, other molluscs and other aquatic animals in sea water This class also includes: - aquaculture activities in brackish waters - aquaculture activities in salt water filled tanks and reservoirs - operation of fish hatcheries (marine) - operation of marine worm farms This class excludes: - frog farming, see 03.22 - operation of sport fishing preserves, see 93.19 @en
scope note: Esta clase comprende: - la cría de peces en agua marina, incluida la cría de peces marinos ornamentales - la producción de larvas de bivalvos (ostras, mejillones, etc.), y larvas de otros moluscos, bogavantes jóvenes, camarones poslarvarios, alevines y jaramugos - el cultivo de algas comestibles - el cultivo de crustáceos, bivalvos, otros moluscos y otros animales de agua marina. Esta clase comprende también: - las actividades de acuicultura en aguas salobres - las actividades de acuicultura en depósitos o embalses con agua salada - la explotación de piscifactorías (marinas) - la explotación de criaderos de gusanos marinos Esta clase no comprende: - la cría de ranas (véase 03.22) - la explotación de cotos de pesca deportiva (véase 93.19) @es
scope note: Cette classe comprend: - l’aquaculture en eau de mer, y compris l’élevage de poissons ornementaux marins - la production de naissains de bivalves (huîtres, moules, etc.), de jeunes langoustes, de larves de crevettes, d’alevins et de saumoneaux - la culture d’algues et d’autres plantes aquatiques comestibles - la culture de crustacés, de bivalves, d’autres mollusques et d’autres animaux aquatiques d’eau de mer. Cette classe comprend également: - l’aquaculture dans les eaux saumâtres - l’aquaculture dans des citernes et des réservoirs remplis d’eau salée - la pisciculture marine - l’exploitation de fermes d’élevage de vers marins Cette classe ne comprend pas: - l’élevage de grenouilles, voir 03.22 - l’exploitation de réserves pour la pêche sportive, voir 93.19 @fr
scope note: Ovaj razred uključuje: - uzgoj riba u morskoj vodi,m uključujući uzgoj morskih ukrasnih ribica - proizvodnju mrijesti školjkaša (kamenice, dagnje itd.), mladih jastoga i škampa (nakon stadija larve) i riblje mlađi - uzgoj morskih algi i ostaloga jestivoga morskog raslinja - uzgoj rakova, školjaka, mekušaca i ostalih morskih životinja Ovaj razred također uključuje: - djelatnosti akvakulture u boćatim vodama - djelatnosti akvakulture u bazenima ili rezervoarima sa slanom vodom - usluge u vezi s upravljanjem morskim mrjestilištima - usluge u vezi s upravljanjem farmama morskih crva Ovaj razred isključuje: - uzgoj žaba, vidi 03.22 - rad rezervata za sportski ribolov, vidi 93.19
scope note: Į šią klasę įeina: - žuvų, įskaitant jūrines dekoratyvines žuvis, auginimas jūros vandenyse - dvigeldžių ikrų (austrių, moliuskų ir kt.) gavyba, omarų, krevečių lervų, žuvų ir vėžiagyvių mailiaus auginimas - jūrų dumblių ir kitų valgomųjų jūrų augalų auginimas - vėžiagyvių, dvigeldžių, kitokių moliuskų ir kitų vandens gyvūnų auginimas jūros vandenyse Į šią klasę taip pat įeina: - akvakultūros veikla sūriuosiuose vandenyse - akvakultūros veikla sūriojo vandens pripildytuose rezervuaruose ir baseinuose - žuvų veisyklų (jūros) veikla - daugiašerių žieduotųjų kirmėlių ūkių veikla Į šią klasę neįeina: - varlių auginimas, žr. 03.22 - sportinės žūklės draustinių veikla, žr. 93.19 @lt
scope note: Этот класс включает: - разведение рыбы в пресной воде, включая разведение аквариумных рыб - разведение пресноводных ракообразных, двустворчатых моллюсков, прочих моллюсков и других видов водных животных - инкубаторные станции по разведению пресноводных видов рыбы - разведение лягушек Этот класс исключает: - аквакультуру в соленой воде в резервуарах, см. 03.21 - деятельность по организации спортивной рыбной ловли, см. 93.19 @ru
scope note: Bu sınıf aşağıdakileri kapsamaktadır; - denizlerde süs balıkları da dahil olmak üzere deniz suyunda gerçekleştirilen su ürünleri yetiştiriciliği, - çift kabuklu su ürünleri üretimi (istiridye, midye vb.), ıstakoz, karides gibi eklembacaklı su ürünleri ile yavru balık üretimi, - su bitkileri yetiştiriciliği (yenilebilen bir çeşit mor renkli deniz bitkisi (laver) ve diğer yenebilen deniz yosunlarının yetiştiriciliği vb.), - denizlerde kabuklu, çift kabuklu, yumuşakçalar ve diğer deniz hayvanları yetiştiriciliği. Ayrıca bu sınıf aşağıdakileri de kapsamaktadır; - acı sularda su ürünleri yetiştiricilik (akuakültür) faaliyetleri, - lagünler ile karada deniz suyu ile yapılan yetiştiricilik faaliyetleri, - balık üretme ve yetiştirme çiftliği faaliyetleri (deniz), - deniz solucanı yetiştiricilik faaliyetleri. Kapsam dışı olanlar; - kurbağa yetiştiriciliği, bkz. 03.22, - spor balıkçılığı için ayrılmış alanların işletimi, bkz. 93.19. @tr
preferred label: Развъждане и отглеждане на риба и други водни организми в солени басейни @bg
preferred label: Mořská akvakultura @cs
preferred label: Havbrug @da
preferred label: Meeresaquakultur @de
preferred label: Θαλάσσια υδατοκαλλιέργεια @el
preferred label: Acuicultura marina @es
preferred label: Merevesiviljelus @et
preferred label: Kalanviljely meressä @fi
preferred label: Aquaculture en mer @fr
preferred label: Tengeri halgazdálkodás
preferred label: Acquicoltura marina @it
preferred label: Jūrinė akvakultūra @lt
preferred label: Jūras akvakultūra @lv
preferred label: Akwakultura tal-baħar @mt
preferred label: Mariene aquacultuur @nl
preferred label: Hav- og kystbasert fiskeoppdrett @no
preferred label: Chów i hodowla ryb oraz pozostałych organizmów wodnych w wodach morskich @pl
preferred label: Aquacultura em águas salgadas e salobras @pt
preferred label: Acvacultura maritimă @ro
preferred label: Морская аквакультура @ru
preferred label: Morská akvakultúra @sk
preferred label: Gojenje morskih organizmov @sl
preferred label: Fiskodling i saltvatten @sv
preferred label: Deniz ürünleri yetiştiriciliği @tr
broader: Aquaculture

Freshwater aquaculture
type: Concept
notation: 03.22
status: valid
status modified: 2013-10-18
accepted date: 2013-10-18
in scheme: Statistical Classification of Economic Activities in the European Community, Rev. 2 (2008)
scope note: - отглеждане на риба в сладководни басейни, вкл. отглеждане на декоративни рибки - отглеждане на ракообразни, миди, стриди, други мекотели и други водни животни в сладководни басейни - експлоатация на рибарници за сладководна риба - отглеждане на жаби в стопанства - развъждане и отглеждане на водни организми в солени басейни - 03.21 - експлоатация на обекти за спортен и развлекателен риболов - 93.19 @bg
scope note: Z: - chov sladkovodních ryb, vč. akvarijních - chov korýšů, mlžů a jiných měkkýšů jakož i ostatních vodních živočichů ve sladkých vodách - provoz chovných stanic pro sladkovodní ryby - chov žab N: - akvakulturu v nádržích nebo sádkách naplněných slanou vodou (03.21) - provoz rybářských revírů pro sportovní rybolov (93.19) @cs
scope note: Diese Klasse umfasst: - Zucht von Süßwasserfischen einschließlich Süßwasser-Zierfischen - Haltung von Krustentieren, zweischaligen und anderen Weichtieren sowie sonstigen Wassertieren im Süßwasser - Betrieb von Süßwasser-Fischzuchtbetrieben - Froschzucht Diese Klasse umfasst nicht: - Aquakultur in salzwassergefüllten Tanks und Behältern (s. 03.21) - Betrieb von Fischteichen für Sportfischerei (s. 93.19) @de
scope note: This class includes: - fish farming in freshwater including farming of freshwater ornamental fish - culture of freshwater crustaceans, bivalves, other molluscs and other aquatic animals - operation of fish hatcheries (freshwater) - farming of frogs This class excludes: - aquaculture activities in salt water filled tanks and reservoirs, see 03.21 - operation of sport fishing preserves, see 93.19 @en
scope note: Esta clase comprende: - la cría de peces en agua dulce, incluida la cría de peces ornamentales de agua dulce - el cultivo de crustáceos, bivalvos, otros moluscos y otros animales de agua dulce - la explotación de piscifactorías (de agua dulce) - la cría de ranas Esta clase no comprende: - las actividades de acuicultura en depósitos o embalses con agua salada (véase 03.21) - la explotación de cotos de pesca deportiva (véase 93.19) @es
scope note: Cette classe comprend: - l’aquaculture en eau douce, y compris l’élevage de poissons ornementaux d’eau douce - la culture de crustacés, de bivalves, d’autres mollusques et d’autres animaux aquatiques d’eau douce - la pisciculture en eau douce - l’élevage de grenouilles Cette classe ne comprend pas: - l’aquaculture dans des citernes et des réservoirs remplis d’eau salée, voir 03.21 - l’exploitation de réserves pour la pêche sportive, voir 93.19 @fr
scope note: Ovaj razred uključuje: - uzgoj slatkovodnih riba, uključujući uzgoj slatkovodnih ukrasnih ribica - uzgoj slatkovodnih rakova, školjaka, mekušaca i ostalih vodenih životinja - usluge u vezi s upravljanjem slatkovodnim mrjestilištima - uzgoj žaba Ovaj razred isključuje: - djelatnosti akvakulture u bazenima ili rezervoarima sa slanom vodom, vidi 03.21 - rad rezervata za sportski ribolov, vidi 93.19
scope note: Į šią klasę įeina: - žuvų, įskaitant gėlavandenes dekoratyvines žuvytes, auginimas gėluosiuose vandenyse - gėlavandenių vėžiagyvių, dvigeldžių ir kitokių moliuskų ir kitų vandens gyvūnų auginimas - žuvų veisyklų (gėlavandenių) veikla - varlių auginimas Į šią klasę neįeina: - akvakultūros veikla sūriojo vandens pripildytuose rezervuaruose ir baseinuose, žr. 03.21 - sportinės žūklės draustinių veikla, žr. 93.19 @lt
scope note: Этот раздел включает подземную добычу твердых горючих материалов и добычу открытым способом и включает работы (например, сортировку, уборку породы из забоя, прессование и прочие мероприятия, необходимые для транспортировки и т.д.) для получения продукции, пригодной для сбыта. Этот раздел исключает коксование (см. 19.10), услуги, сопутствующие добыче угля или бурого угля (см. 09.90.0) или формовке брикетов (см. 19.20). @ru
scope note: Bu sınıf aşağıdakileri kapsamaktadır; - tatlı sularda süs balıkları da dahil olmak üzere yapılan su ürünleri yetiştiriciliği, - tatlı sulardaki kabuklu, çift kabuklu ve diğer yumuşakçalar ile diğer su hayvanların yetiştiriciliği (kültürcülüğü) (sülük, solucan vb.), - balık üretme ve yetiştirme çiftçiliği faaliyetleri (tatlı su), - kurbağa yetiştiriciliği. Kapsam dışı olanlar; - lagünler ile karada deniz suyu ile yapılan yetiştiricilik faaliyetleri, bkz. 03.21, - sportif balıkçılık için ayrılmış alanların işletimi, bkz. 93.19. @tr
preferred label: Развъждане и отглеждане на риба и други водни организми в сладководни басейни @bg
preferred label: Sladkovodní akvakultura @cs
preferred label: Ferskvandsbrug @da
preferred label: Süßwasseraquakultur @de
preferred label: Υδατοκαλλιέργεια γλυκών υδάτων @el
preferred label: Acuicultura en agua dulce @es
preferred label: Mageveevesiviljelus @et
preferred label: Kalanviljely sisävesissä @fi
preferred label: Aquaculture en eau douce @fr
preferred label: Édesvizi halgazdálkodás
preferred label: Acquicoltura in acque dolci @it
preferred label: Gėlųjų vandenų akvakultūra @lt
preferred label: Saldūdens akvakultūra @lv
preferred label: Akwakultura ta' l-ilma ħelu @mt
preferred label: Aquacultuur in zoet water @nl
preferred label: Ferskvannsbasert fiskeoppdrett @no
preferred label: Chów i hodowla ryb oraz pozostałych organizmów wodnych w wodach śródlądowych @pl
preferred label: Aquacultura em água doce @pt
preferred label: Acvacultura în ape dulci @ro
preferred label: Пресноводная аквакультура @ru
preferred label: Riečna akvakultúra @sk
preferred label: Gojenje sladkovodnih organizmov @sl
preferred label: Fiskodling i sötvatten @sv
preferred label: Tatlısu ürünleri yetiştiriciliği @tr
broader: Aquaculture

Mining of coal and lignite
type: Concept
notation: 05
status: valid
status modified: 2013-10-18
accepted date: 2013-10-18
in scheme: Statistical Classification of Economic Activities in the European Community, Rev. 2 (2008)
scope note: подземен или открит добив на твърди горива и дейности, имащи за цел да подготвят суровините за пазара, като подобрят качеството и улеснят транспортирането им - пречистване, сортиране, уплътняване и други. - спомагателни дейности в добива на въглища - 09.90 - коксуване на въглища - 19.10 - производство на брикети от въглища - 19.20 @bg
scope note: Tento oddíl zahrnuje dobývání pevných nerostných surovin v podzemních nebo povrchových dolech a činnosti (např. třídění, čištění, lisování a jiné kroky nutné pro transport) vedoucí k snadno prodejnému výrobku. Nezahrnuje výrobu koksu (19.10), služby související s těžbu uhlí nebo lignitu (09.90) nebo výrobu briket (19.20). @cs
scope note: Diese Abteilung umfasst die Gewinnung fester mineralischer Rohstoffe im Untertagebau und im Tagebau sowie Tätigkeiten (z. B. Sortieren, Waschen, Brikettieren usw.), die zu marktfähigen Produkten führen. Diese Abteilung umfasst nicht die Kokereien (s. 19.10), Dienstleistungen für den Braunkohlenbergbau (s. 09.90) oder die Herstellung von Briketts (s. 19.20) @de
scope note: This division includes the extraction of solid mineral fuels through underground or open-cast mining and includes operations (e.g. grading, cleaning, compressing and other steps necessary for transportation etc.) leading to a marketable product. This division does not include coking (see 19.10), services incidental to coal or lignite mining (see 09.90) or the manufacture of briquettes (see 19.20). @en
scope note: Esta división comprende la extracción de combustibles minerales sólidos procedentes tanto de explotaciones mineras subterráneas como a cielo abierto, y comprende operaciones (como la clasificación, la limpieza, la compresión y otros pasos necesarios para el transporte, etc.) que dan como resultado un producto comercializable. Esta división no comprende la coquización (véase 19.10), ni los servicios relacionados con la extracción de antracita, hulla y lignito (véase 09.90), ni la fabricación de briquetas (véase 19.20). @es
scope note: Cette division comprend l’extraction de combustibles minéraux solides, s’entend en souterrain ou à ciel ouvert et couvre les opérations (par exemple: tri, lavage, compression et autres opérations préalables au transport) conduisant aux produits marchands. Cette division exclut la cokéfaction (voir 19.10), les services de soutien à l’extraction de houille et de lignite (voir 09.90) ou la production de briquettes (voir 19.20). @fr
scope note: Ovaj odjeljak uključuje vađenje krutih mineralnih goriva kroz podzemne ili površinske kopove te postupcima (npr. razvrstavanje, čišćenje, prešanje i ostali postupci nužni za transport) koji stvaraju tržišni proizvod. Ovaj odjeljak ne uključuje koksiranje (vidi 19.10), djelatnosti povezane s vađenjem ugljena ili lignita (vidi 09.90) ili proizvodnju briketa (vidi 19.20).
scope note: Į šį skyrių įeina požeminė ir atviroji kietajam kurui naudojamų naudingųjų iškasenų gavyba bei paruošiamieji darbai (pvz., rūšiavimas, valymas, presavimas ir kitas paruošimas būtinas transportavimui ir kt.), susiję su pardavimu. Į šį skyrių neįeina koksavimas (žr. 19.10), anglių ar rusvųjų anglių kasybai būdingų paslaugų veikla (žr. 09.90) ir briketų gamyba (žr. 19.20). @lt
scope note: Этот класс включает: - добычу каменного угля: добычу подземным или открытым способом, включая добычу путем плавления - промывку, дегидратацию, сортировку, дробление, прессование и т.д. угля для улучшения качества, облегчения транспортировки или хранения Этот класс также включает: - извлечение антрацита из забоя Этот класс исключает: - добычу лигнита, см. 05.20 - разработку месторождений торфа, см. 08.92 - содействие в добыче антрацита, см. 09.90 - пробное бурение при добыче угля, см. 09.90 - коксовые печи для производства твердых горючих материалов, см. 19.10 - формование брикетов с антрацитом, см. 19.20 - работу, направленную на разработку, улучшение условий и подготовку к добыче угля, см. 43.12 @ru
scope note: Bu bölüm, yer altı veya yer üstü madenciliği yoluyla katı mineral yakıtların çıkarımını ve pazarlanabilir ürün haline getirilmesi işlemlerini (yani, ayıklama, yıkama, sıkıştırma ve taşınması için gerekli diğer işlemler vb.) kapsar. Kok kömürü imalatı (bkz. 19.10), kömür veya linyit madenciliği ile ilgili hizmetler veya (bkz. 09.90) kömür tozlarının sıkıştırılması ile elde edilen kömür briketlerinin imalatı (bkz. 19.20) bu bölümde kapsanmaz. @tr
preferred label: Добив на въглища @bg
preferred label: Těžba černého a hnědého uhlí @cs
preferred label: Indvinding af kul og brunkul @da
preferred label: Kohlenbergbau @de
preferred label: Εξόρυξη άνθρακα και λιγνίτη @el
preferred label: Extracción de antracita, hulla y lignito @es
preferred label: Kivi- ja pruunsöe kaevandamine @et
preferred label: Kivihiilen ja ruskohiilen kaivu @fi
preferred label: Extraction de houille et de lignite @fr
preferred label: Szénbányászat
preferred label: Estrazione di carbone e lignite @it
preferred label: Akmens anglių ir rusvųjų anglių kasyba @lt
preferred label: Ogļu un brūnogļu (lignīta) ieguve @lv
preferred label: Qtugħ ta' faħam u faħam kannella mill-minjieri @mt
preferred label: Winning van steenkool en bruinkool @nl
preferred label: Bryting av steinkull og brunkull @no
preferred label: Wydobywanie węgla kamiennego i węgla brunatnego (lignitu) @pl
preferred label: Extracção de carvão e lenhito @pt
preferred label: Extracţia cărbunelui superior şi inferior @ro
preferred label: Добыча угля и лигнита @ru
preferred label: Ťažba uhlia a lignitu @sk
preferred label: Pridobivanje premoga @sl
preferred label: Kolutvinning @sv
preferred label: Kömür ve linyit çıkartılması @tr
broader: MINING AND QUARRYING
narrower: Mining of hard coal
narrower: Mining of lignite

Mining of hard coal
type: Concept
notation: 05.1
status: valid
status modified: 2013-10-18
accepted date: 2013-10-18
in scheme: Statistical Classification of Economic Activities in the European Community, Rev. 2 (2008)
preferred label: Добив на антрацитни и черни въглища @bg
preferred label: Těžba černého uhlí @cs
preferred label: Indvinding af stenkul @da
preferred label: Steinkohlenbergbau @de
preferred label: Εξόρυξη λιθάνθρακα @el
preferred label: Extracción de antracita y hulla @es
preferred label: Kivisöe kaevandamine @et
preferred label: Kivihiilen kaivu @fi
preferred label: Extraction de houille @fr
preferred label: Feketeszén-bányászat
preferred label: Estrazione di antracite @it
preferred label: Juodųjų akmens anglių (antracito) kasyba @lt
preferred label: Akmeņogļu ieguve @lv
preferred label: Qtugħ ta' faħam iebes mill-minjieri @mt
preferred label: Winning van steenkool @nl
preferred label: Bryting av steinkull @no
preferred label: Wydobywanie węgla kamiennego @pl
preferred label: Extracção de hulha @pt
preferred label: Extracţia cărbunelui superior (PCS=>23865 kJ/kg) @ro
preferred label: Добыча каменного угля @ru
preferred label: Ťažba čierneho uhlia @sk
preferred label: Pridobivanje črnega premoga @sl
preferred label: Stenkolsutvinning @sv
preferred label: Taş kömürü madenciliği @tr
broader: Mining of coal and lignite
narrower: Mining of hard coal

Mining of hard coal
type: Concept
notation: 05.10
status: valid
status modified: 2013-10-18
accepted date: 2013-10-18
in scheme: Statistical Classification of Economic Activities in the European Community, Rev. 2 (2008)
scope note: - подземен или открит добив на антрацитни и черни въглища, вкл. добив посредством методи на втечняване - пречистване, сортиране, раздробяване, уплътняване и други операции с цел подобряване на качеството или улеснение при транспортиране или съхранение - извличане на въглища от насипи ситни въглища - добив на кафяви и лигнитни въглища - 05.20 - добив на торф - 08.92 - спомагателни дейности в добива на антрацитни и черни въглища - 09.90 - опитно сондиране за въглища - 09.90 - производство на кокс - 19.10 - производство на брикети от антрацитни или черни въглища - 19.20 - работи, свързани с разработване или подготовка на находища на въглища - 43.12 @bg
scope note: Z: - těžbu černého uhlí: těžbu podzemní a povrchovou, včetně těžby prostřednictvím zkapalnění - čištění, třídění, drcení, lisování, zhutňování atd. černého uhlí k roztřídění, zlepšování kvality nebo usnadnění dopravy nebo skladování ZT: - zpětné získávání černého uhlí ze skrývky N: - těžbu hnědého uhlí (05.20) - těžbu rašeliny (08.92) - podpůrné služby při těžbě černého uhlí (09.90) - zkušební vrty pro těžbu černého uhlí (09.90) - výrobu pevných paliv v koksárenských pecích (19.10) - výrobu briket z černého uhlí (19.20) - práce za účelem přípravy pozemků pro těžbu uhlí (43.12) @cs
scope note: Diese Klasse umfasst: - Steinkohlenbergbau: Förderung im Untertage- und Tagebau, einschließlich der Förderung mittels Verflüssigung - Waschen, Klassieren, Sortieren, Mahlen, Verdichten usw. von Steinkohle zum Klassieren, zur Qualitätsverbesserung oder zur Erleichterung der Beförderung und Lagerung Diese Klasse umfasst ferner: - Rückgewinnung von Steinkohle aus Abraum Diese Klasse umfasst nicht: - Braunkohlebergbau (s. 05.20) - Torfgewinnung (s. 08.92) - Dienstleistungen für den Steinkohlenbergbau (s. 09.90) - Probebohrungen für den Steinkohlenbergbau (s. 09.90) - Herstellung von festen Brennstoffen in Koksöfen (s. 19.10) - Herstellung von Steinkohlenbriketts (s. 19.20) - Arbeiten zur Erschließung oder Vorbereitung von Grundstücken für den Bergbau auf Kohle (s. 43.12) @de
scope note: This class includes: - mining of hard coal: underground or surface mining, including mining through liquefaction methods - cleaning, sizing, grading, pulverising, compressing etc. of coal to classify, improve quality or facilitate transport or storage This class also includes: - recovery of hard coal from culm banks This class excludes: - lignite mining, see 05.20 - peat digging, see 08.92 - support activities for hard coal mining, see 09.90 - test drilling for coal mining, see 09.90 - coke ovens producing solid fuels, see 19.10 - manufacture of hard coal briquettes, see 19.20 - work performed to develop or prepare properties for coal mining, see 43.12 @en
scope note: Esta clase comprende: - la extracción de hulla: la explotación de minas subterráneas o a cielo abierto, incluida la que se realiza mediante métodos de licuefacción; - el lavado, el cribado, la clasificación, la pulverización, la compresión, etc. de hulla con el fin de clasificar, mejorar la calidad o facilitar el transporte o el almacenamiento. Esta clase comprende también: - la recuperación de hulla a partir de polvo de antracita. Esta clase no comprende: - la extracción y aglomeración de lignito (véase 05.20); - la extracción de turba (véase 08.92); - las actividades complementarias para la extracción de hulla (véase 09.90); - las perforaciones y sondeos para la extracción de hulla (véase 09.90); - los hornos de coque para la producción de combustibles sólidos (véase 19.10); - la fabricación de briquetas de hulla (véase 19.20); - los trabajos realizados para desarrollar o preparar propiedades para la extracción de hulla (véase 43.12). @es
scope note: Cette classe comprend: - l’extraction de la houille: extraction souterraine ou à ciel ouvert, ainsi que l’extraction minière en ayant recours à des procédés de liquéfaction - le lavage, le triage, le calibrage, la pulvérisation, la compression ou d’autres opérations destinées à classer, à accroître la qualité ou à faciliter le transport ou le stockage. Cette classe comprend également: - l’opération destinée à récupérer l’anthracite des poussiers Cette classe ne comprend pas: - l’extraction de lignite, voir 05.20 - l’extraction de la tourbe, voir 08.92 - les activités de soutien à l’extraction de la houille, voir 09.90 - les forages d’essai pour l’extraction de la houille, voir 09.90 - les fours à coke produisant des combustibles solides, voir 19.10 - la fabrication de briquettes de houille, voir 19.20 - les travaux effectués pour la recherche et la préparation des terrains pour l’extraction de houille, voir 43.12 @fr
scope note: Ovaj razred uključuje: - vađenje kamenog ugljena podzemnim ili površinskim kopom te metodom ukapljivanja - čišćenje, mjerenje, razvrstavanje, usitnjavanje, prešanje itd. ugljena radi potrebe sortiranja, poboljšanja kvalitete, transporta ili skladištenja Ovaj razred također uključuje: - obnavljanje kamenog ugljena iz sitneži Ovaj razred isključuje: - vađenje lignita, vidi 05.20 - vađenje treseta, vidi 08.92 - pomoćne djelatnosti povezane s vađenjem kamenog ugljena, vidi 09.90 - pokusno bušenje za vađenje ugljena, vidi 09.90 - proizvodnju krutih goriva u koksnim pećima, vidi 19.10 - proizvodnja briketiranoga kamenog ugljena, vidi 19.20 - izvođenje radova na pripremi nalazišta za vađenje ugljena, vidi 43.12
scope note: Į šią klasę įeina: - juodųjų akmens anglių (antracito) požeminė ar atviroji kasyba, įskaitant suskystinimo metodais grįstą kasybą - akmens anglių valymas, kalibravimas, rūšiavimas, smulkinimas, presavimas ir kt., siekiant suklasifikuoti, pagerinti kokybę ar palengvinti jų transportavimą ar saugojimą Į šią klasę taip pat įeina: - juodųjų akmens anglių (antracito) atgavimas iš anglių smulkio sąvartų Į šią klasę neįeina: - rusvųjų anglių kasyba, žr. 05.20 - durpių kasimas, žr. 08.92 - juodųjų akmens anglių (antracito) kasybai būdingų paslaugų veikla, žr. 09.90 - akmens anglių kasybos bandomasis gręžimas, žr. 09.90 - kietojo kuro gamyba koksavimo krosnyse, žr. 19.10 - juodųjų akmens anglių briketų gamyba, žr. 19.20 - akmens anglių kasybos aikštelės plėtojimo arba parengimo darbai žr. 43.12 @lt
scope note: Этот класс включает: - добычу лигнита (бурого угля): добычу подземным или открытым способом, включая добычу путем плавления - промывку, дегидратацию, дробление, прессование и т.д. лигнита для улучшения качества, облегчения транспортировки или хранения Этот класс исключает: - добычу антрацита, см. 05.10 - разработку месторождений торфа, см. 08.92 - содействие в добыче лигнита, см. 09.90 - пробное бурение при добыче угля, см. 09.90 - формование брикетов с лигнитом, см. 19.20 - работу, направленную на разработку, улучшение условий и подготовку к добыче угля, см. 43.12 @ru
scope note: Bu sınıf aşağıdakileri kapsamaktadır; - taş kömürü madenciliği: sıvılaştırma yöntemleriyle gerçekleştirilen madencilik de dahil, yeraltı ve yer üstü madenciliği, - kömürün sınıflandırılması, kalitesinin arttırılması veya taşımacılığının ya da depolanmasını kolaylaştırılması amacıyla ayıklanması ve yıkanması, büyüklüklerine göre ayrılması, sınıflandırılması, öğütülmesi, sıkıştırılması vb.. Ayrıca bu sınıf aşağıdakileri de kapsamaktadır; - kömür tozu yığınlarından yeniden taş kömürünün elde edilmesi. Kapsam dışı olanlar; - linyit madenciliği, bkz. 05.20, - turba (az çok kömürleşmiş bitkilerden oluşan yakıt, yer kömürü) çıkarımı, bkz. 08.92, - taş kömürü madenciliğini destekleyici faaliyetler, bkz. 09.90, - kömür çıkartılması amacıyla deneme sondajları yapılması, bkz. 09.90, - katı yakıt üreten kok fırınları, bkz. 19.10, - taş kömürü briketlerinin imalatı, bkz. 19.20, - kömür çıkartmak amacıyla arazilerin hazırlanması ve geliştirilmesi için gerçekleştirilen çalışmalar, bkz. 43.12. @tr
preferred label: Добив на антрацитни и черни въглища @bg
preferred label: Těžba černého uhlí @cs
preferred label: Indvinding af stenkul @da
preferred label: Steinkohlenbergbau @de
preferred label: Εξόρυξη λιθάνθρακα @el
preferred label: Extracción de antracita y hulla @es
preferred label: Kivisöe kaevandamine @et
preferred label: Kivihiilen kaivu @fi
preferred label: Extraction de houille @fr
preferred label: Feketeszén-bányászat
preferred label: Estrazione di antracite @it
preferred label: Juodųjų akmens anglių (antracito) kasyba @lt
preferred label: Akmeņogļu ieguve @lv
preferred label: Qtugħ ta' faħam iebes mill-minjieri @mt
preferred label: Winning van steenkool @nl
preferred label: Bryting av steinkull @no
preferred label: Wydobywanie węgla kamiennego @pl
preferred label: Extracção de hulha @pt
preferred label: Extracţia cărbunelui superior (PCS=>23865 kJ/kg) @ro
preferred label: Добыча каменного угля @ru
preferred label: Ťažba čierneho uhlia @sk
preferred label: Pridobivanje črnega premoga @sl
preferred label: Stenkolsutvinning @sv
preferred label: Taş kömürü madenciliği @tr
broader: Mining of hard coal

Mining of lignite
type: Concept
notation: 05.2
status: valid
status modified: 2013-10-18
accepted date: 2013-10-18
in scheme: Statistical Classification of Economic Activities in the European Community, Rev. 2 (2008)
scope note: Этот раздел включает производство сырой нефти, добычу нефти из нефтяного (горючего) сланца и нефтеносного (смолистого) песка, производство природного газа и добычу жидкого углеводорода. Данный раздел включает виды деятельности по эксплуатации существующих и/или освоению участков месторождений нефти и газа. Подобные виды деятельности могут включать бурение, комплектование и оборудование скважин; обеспечение работы сепараторов, удаление эмульсий, оборудования для удаления ила и сбора сырой нефти; а также все прочие виды деятельности, необходимые в подготовке нефти и газа для доставки к месту отгрузки с мест добычи. Этот раздел исключает: - услуги по добыче нефти и газа за вознаграждение или на контрактной основе, см. 09.10 - детальную разведку нефти и газа с помощью разведочных скважин, см. 09.10 - пробное бурение, см. 09.10 - производство светлых нефтепродуктов, см. 19.20 - геофизические, геологические и сейсмические исследования, см. 71.12 @ru
preferred label: Добив на кафяви и лигнитни въглища @bg
preferred label: Těžba hnědého uhlí @cs
preferred label: Indvinding af brunkul @da
preferred label: Braunkohlenbergbau @de
preferred label: Εξόρυξη λιγνίτη @el
preferred label: Extracción de lignito @es
preferred label: Pruunsöe kaevandamine @et
preferred label: Ruskohiilen kaivu @fi
preferred label: Extraction de lignite @fr
preferred label: Barnaszén-, lignitbányászat
preferred label: Estrazione di lignite @it
preferred label: Rusvųjų anglių kasyba @lt
preferred label: Brūnogļu (lignīta) ieguve @lv
preferred label: Qtugħ ta' faħam u faħam kannella mill-minjieri @mt
preferred label: Winning van bruinkool @nl
preferred label: Bryting av brunkull @no
preferred label: Wydobywanie węgla brunatnego (lignitu) @pl
preferred label: Extracção de lenhito @pt
preferred label: Extracţia cărbunelui inferior (PCS<23865 kJ/kg) @ro
preferred label: Добыча лигнита @ru
preferred label: Ťažba lignitu @sk
preferred label: Pridobivanje rjavega premoga in lignita @sl
preferred label: Brunkolsutvinning @sv
preferred label: Linyit madenciliği @tr
broader: Mining of coal and lignite
narrower: Mining of lignite

Mining of lignite
type: Concept
notation: 05.20
status: valid
status modified: 2013-10-18
accepted date: 2013-10-18
in scheme: Statistical Classification of Economic Activities in the European Community, Rev. 2 (2008)
scope note: - подземен или открит добив на кафяви и лигнитни въглища, вкл. добив посредством методи на втечняване - промиване, дехидратиране, раздробяване, уплътняване и други операции с цел подобряване на качеството или улеснение при транспортиране или съхранение - добив на антрацитни и черни въглища - 05.10 - добив на торф - 08.92 - спомагателни дейности в добива на кафяви и лигнитни въглища - 09.90 - опитно сондиране за въглища - 09.90 - производство на брикети от кафяви или лигнитни въглища - 19.20 - производство на дървени въглища -20.14 - работи, свързани с разработване или подготовка на находища на въглища - 43.12 @bg
scope note: Z: - těžbu hnědého uhlí: těžbu podzemní nebo povrchovou, těžbu prostřednictvím zkapalnění - čištění, odvodnění, drcení, zhutňování atd. hnědého uhlí ke zlepšování kvality nebo usnadnění dopravy nebo skladování N: - těžbu černého uhlí (05.10) - těžbu rašeliny (08.92) - podpůrné služby při těžbě hnědého uhlí (09.90) - zkušební vrty pro těžbu uhlí (09.90) - výrobu briket z hnědého uhlí (19.20) - práce za účelem přípravy pozemků pro těžbu uhlí (43.12) @cs
scope note: Diese Klasse umfasst: - Braunkohlenbergbau: Förderung im Untertage- und Tagebau, einschließlich der Förderung mittels Verflüssigung - Waschen, Entwässern, Mahlen, Verdichten usw. von Braunkohle zur Qualitätsverbesserung oder zur Erleichterung der Beförderung oder Lagerung Diese Klasse umfasst nicht: - Steinkohlenbergbau (s. 05.10) - Torfgewinnung (s. 08.92) - Dienstleistungen für den Braunkohlenbergbau (s. 09.90) - Probebohrungen für den Kohlenbergbau (s. 09.90) - Herstellung von Braunkohlenbriketts (s. 19.20) - Arbeiten zur Erschließung oder Vorbereitung von Grundstücken für den Bergbau auf Kohle (s. 43.12) @de
scope note: This class includes: - mining of lignite (brown coal): underground or surface mining, including mining through liquefaction methods - washing, dehydrating, pulverising, compressing of lignite to improve quality or facilitate transport or storage This class excludes: - hard coal mining, see 05.10 - peat digging, see 08.92 - support activities for lignite mining, see 09.90 - test drilling for coal mining, see 09.90 - manufacture of lignite fuel briquettes, see 19.20 - work performed to develop or prepare properties for coal mining, see 43.12 @en
scope note: Esta clase comprende: - la extracción de lignito (carbón fósil): la explotación de minas subterráneas o a cielo abierto, incluida la que se realiza mediante métodos de licuefacción; - el lavado, la deshidratación, la pulverización y la compresión del lignito para mejorar la calidad o facilitar el transporte o el almacenamiento. Esta clase no comprende: - la extracción de hulla (véase 05.10); - la extracción de turba (véase 08.92); - las actividades complementarias para la extracción de lignito (véase 09.90); - las perforaciones y sondeos para la extracción de hulla (véase 09.90); - la fabricación de briquetas de combustible de lignito (véase 19.20); - los trabajos realizados para desarrollar o preparar propiedades para la extracción de hulla (véase 43.12). @es
scope note: Cette classe comprend: - l’extraction du lignite: extraction souterraine ou à ciel ouvert, ainsi que l’extraction minière en ayant recours à des procédés de liquéfaction - le lavage, la déshydratation, la pulvérisation, la compression du lignite ou les autres opérations destinées à accroître la qualité, à faciliter le transport ou le stockage. Cette classe ne comprend pas: - l’extraction de la houille, voir 05.10 - l’extraction de la tourbe, voir 08.92 - les activités de soutien à l’extraction du lignite, voir 09.90 - les forages d’essai pour l’extraction de la houille, voir 09.90 - la fabrication de briquettes de lignite, voir 19.20 - les travaux effectués pour la recherche et la préparation des terrains pour l’extraction de houille, voir 43.12 @fr
scope note: Ovaj razred uključuje: - vađenje lignita (mrkog ugljena) podzemnim ili površinskim kopom te metodom ukapljivanja - pranje, sušenje, usitnjavanje i prešanje lignita radi poboljšanja kvalitete, lakšeg transporta ili skladištenja Ovaj razred isključuje: - vađenje kamenog ugljena, vidi 05.10 - vađenje treseta, vidi 08.92 - pomoćne djelatnosti povezane s vađenjem lignita, vidi 09.90 - pokusno bušenje povezano s vađenjem ugljena, vidi 09.90 - proizvodnju briketiranog lignita, vidi 19.20 - izvođenje radova na pripremi nalazišta za vađenje ugljena, vidi 43.12
scope note: Į šią klasę įeina - rusvųjų anglių požeminė ar atviroji kasyba, įskaitant suskystinimo metodais grįstą kasybą - rusvųjų anglių plovimas, vandens šalinimas, smulkinimas, presavimas ir kt., siekiant pagerinti kokybę ar palengvinti jų transportavimą ar saugojimą Į šią klasę neįeina: - juodųjų akmens anglių kasyba, žr. 05.10 - durpių kasimas, žr. 08.92 - rusvųjų akmens anglių kasybai būdingų paslaugų veikla, žr. 09.90 - akmens anglių kasybos bandomasis gręžimas, žr. 09.90 - rusvųjų akmens anglių kuro briketų gamyba, žr. 19.20 - akmens anglių kasybos aikštelės plėtojimo arba parengimo darbai žr. 43.12 @lt
scope note: Bu sınıf aşağıdakileri kapsamaktadır; - linyit madenciliği : sıvılaştırma yöntemleriyle gerçekleştirilen madencilik de dahil, yeraltı ve yer üstü madenciliği, - linyitin, kalitesini arttırmak, veya taşımacılığını ya da depolanmasını gerçekleştirmek üzere, yıkanması, kurutulması, öğütülmesi ve sıkıştırılması. Kapsam dışı olanlar; - taş kömürü madenciliği, bkz. 05.10, - turba çıkarımı, bkz. 08.92, - linyit madenciliğini destekleyici faaliyetler, bkz. 09.90, - kömür çıkartılması amacıyla deneme sondajları yapılması, bkz. 09.90, - linyit yakıt kömürü imalatı, bkz. 19.20, - kömür çıkartmak amacıyla arazilerin hazırlanması ve geliştirilmesi için gerçekleştirilen çalışmalar, bkz. 43.12. @tr
preferred label: Добив на кафяви и лигнитни въглища @bg
preferred label: Těžba hnědého uhlí @cs
preferred label: Indvinding af brunkul @da
preferred label: Braunkohlenbergbau @de
preferred label: Εξόρυξη λιγνίτη @el
preferred label: Extracción de lignito @es
preferred label: Pruunsöe kaevandamine @et
preferred label: Ruskohiilen kaivu @fi
preferred label: Extraction de lignite @fr
preferred label: Barnaszén-, lignitbányászat
preferred label: Estrazione di lignite @it
preferred label: Rusvųjų anglių kasyba @lt
preferred label: Brūnogļu (lignīta) ieguve @lv
preferred label: Qtugħ ta' faħam u faħam kannella mill-minjieri @mt
preferred label: Winning van bruinkool @nl
preferred label: Bryting av brunkull @no
preferred label: Wydobywanie węgla brunatnego (lignitu) @pl
preferred label: Extracção de lenhito @pt
preferred label: Extracţia cărbunelui inferior (PCS<23865 kJ/kg) @ro
preferred label: Добыча лигнита @ru
preferred label: Ťažba lignitu @sk
preferred label: Pridobivanje rjavega premoga in lignita @sl
preferred label: Brunkolsutvinning @sv
preferred label: Linyit madenciliği @tr
broader: Mining of lignite

Extraction of crude petroleum and natural gas
type: Concept
notation: 06
status: valid
status modified: 2013-10-18
accepted date: 2013-10-18
in scheme: Statistical Classification of Economic Activities in the European Community, Rev. 2 (2008)
scope note: добив на нефт, извличането му от битуминозни шисти и битуминозен пясък; добив на природен газ и извличане на други течни въглеводороди. Дейности по експлоатация и/или разработване на находища на нефт и газ - сондиране, разслояване, утаяване и събиране на суровия нефт, техническо окомплектоване и екипиране на кладенците и всички други дейности, свързани с добива на нефт и газ до момента на извеждането им от района на добива. - услуги, свързани с добива на нефт и газ, извършвани срещу заплащане (по договор или еднократно) - 09.10 - проучване и подготовка на нефтените и газовите кладенци - 09.10 - опитно сондиране за нефт и природен газ - 09.10 - рафиниране на нефтопродукти - 19.20 - геоложки, геофизични и сеизмографски изследвания - 71.12 @bg
scope note: Tento oddíl zahrnuje produkci surové ropy, těžbu a dobývání ropy z naftonosných (živičných) břidlic a ropných písků a těžbu zemního plynu a obnovu (regeneraci) kapalných uhlovodíků. Zahrnuje aktivity týkající se obsluhy anebo rozvoje majetku (nemovitosti) s ropnými a plynovými poli. Patří sem také činnosti jako kompletace a vybavování vrtů, provoz separátorů, demulgátorů, usazovacích zařízení, vedení pro vytěžování ropných polí a všechny ostatní činnosti při přípravě ropy a zemního plynu z místa těžby až do místa dodávky. N - služby prováděné v souvislosti s ropnými a plynovými poli na základě smlouvy nebo dohody (09.10) - geologický průzkum ropných a plynových pramenů (vrtů) (09.10) - zkušební a průzkumné vrty (09.10) - rafinaci produktů z ropných (minerálních) olejů (19.20) - geofyzikální, geologický a seismický průzkum (71.12) @cs
scope note: Neben Förderung von Erdöl umfasst diese Abteilung auch Gewinnung von Erdöl aus Ölschiefer und Ölsand, Gewinnung von Erdgas sowie Rückgewinnung von flüssigen Kohlenwasserstoffen. Diese Abteilung umfasst den Betrieb und/oder die Erschließung von Erdöl- und Erdgasfeldern. Dazu gehören auch Tätigkeiten wie Komplettierung und Ausrüstung von Bohrlöchern, Betrieb von Separatoren, Demulgatoren, Entsandern, Feldsammelleitungen für Rohöl sowie alle übrigen Tätigkeiten bei der Aufbereitung von Erdöl und Erdgas bis zum Ort des Abtransports von der Förderstelle. Diese Abteilung umfasst nicht: - im Lohnauftrag ausgeführte Dienstleistungen im Zusammenhang mit Erdöl- und Erdgasfeldern (s. 09.10) - Prospektion auf Erdöl und Erdgas (s. 09.10) - Test- und Suchbohrungen (s. 09.10) - Raffination von Mineralölerzeugnissen (s. 19.20) - geophysikalische, geologische und seismische Prospektion (s. 71.12) @de
scope note: This division includes the production of crude petroleum, the mining and extraction of oil from oil shale and oil sands and the production of natural gas and recovery of hydrocarbon liquids. This division includes the activities of operating and/or developing oil and gas field properties. Such activities may include drilling, completing and equipping wells; operating separators, emulsion breakers, desalting equipment and field gathering lines for crude petroleum; and all other activities in the preparation of oil and gas up to the point of shipment from the producing property. This division excludes: - oil and gas field services, performed on a fee or contract basis, see 09.10 - oil and gas well exploration, see 09.10 - test drilling and boring, see 09.10 - refining of petroleum products, see 19.20 - geophysical, geologic and seismic surveying, see 71.12 @en
scope note: Esta división comprende la producción de crudo de petróleo, la extracción de petróleo a partir de esquisto bituminoso y arenas bituminosas y la producción de gas natural y recuperación de hidrocarburos líquidos. Esta división comprende las actividades de funcionamiento o desarrollo de explotaciones de yacimientos de petróleo y gas. Entre dichas actividades pueden incluirse la perforación, la terminación y el equipamiento de pozos; el funcionamiento de los separadores, equipos de desenlodamiento y tuberías colectoras de yacimiento para crudo de petróleo, así como todas las demás actividades de preparación del petróleo y gas hasta el punto de transporte desde el lugar de producción. Esta división no comprende: - los servicios en yacimientos de petróleo y gas, prestados por cuenta de terceros (véase 09.10); - la prospección de pozos de petróleo y gas (véase 09.10); - las perforaciones y sondeos prospectivos (véase 09.10); - el refino de petróleo (véase 19.20); - los estudios geofísicos, geológicos y sísmicos (véase 71.12). @es
scope note: Cette division comprend la production de pétrole brut, l’extraction de pétrole de gisements de schiste et de sables bitumeux de même que la production de gaz et d’hydrocarbures liquides. Elle comprend les activités d’exploitation et/ou de développement de champs de pétrole et de gaz. Ces activités peuvent inclure le forage, l’achèvement et l’équipement des puits, la mise en service des séparateurs, des agents de rupture d’émulsion, du matériel de dégravement et du réseau de collecte du pétrole brut et toutes les autres activités de préparation du pétrole ou du gaz jusqu’au moment de son expédition du gisement exploité. Cette division ne comprend pas: - les activités annexes à l’extraction du pétrole et du gaz, exécutées pour le compte de tiers, voir 09.10 - la prospection de pétrole et de gaz, voir 09.10 - les sondages et les forages d’essai, voir 09.10 - le raffinage de produits pétroliers, voir 19.20 - les études géophysiques, géologiques et sismiques, voir 71.12 @fr
scope note: Ovaj odjeljak uključuje proizvodnju sirove nafte, vađenje nafte iz naftnih škriljevaca i bitumenskog pijeska te proizvodnju prirodnog plina i obnavljanje tekućih ugljikovodika. Ovaj odjeljak uključuje djelatnosti povezane s upravljanjem i/ili razvojem naftnih i plinskih polja u vlasništvu. Te djelatnosti mogu uključivati bušenje, dovršavanje i opremanje bušotina, osposobljavanje za rad separatora, razbijača emulzije, opreme za odsoljavanje, mreže cjevovoda za skupljanje sirove nafte na polju i sve ostale djelatnosti u pripremi nafte i plina do točke otpreme s proizvodnog dobra. Ovaj odjeljak isključuje: - usluge na naftnim i plinskim poljima, uz naplatu ili na osnovi ugovora, vidi 09.10 - pronalaženje naftnih i plinskih izvora, vidi 09.10 - pokusno bušenje i sondiranje terena, vidi 09.10 - rafiniranje naftnih proizvoda, vidi 19.20 - geofizička, geološka i seizmička istraživanja, vidi 71.12
scope note: Į šį skyrių įeina žalios naftos gavyba, naftingųjų skalūnų ir naftingojo smėlio kasyba bei naftos išgavimas iš jų, gamtinių dujų gavyba ir skystųjų angliavandenilių atgavimas. Į šį skyrių įeina veikla, susijusi su nuosavų naftos ir dujų telkinių eksploatavimu ir (arba) plėtojimu. Tokiai veiklai galima priskirti gręžinių gręžimą, komplektavimą ir įrengimą; separatorių, deemulgavimo įrenginių, smėlio nusodintuvų ir žalios naftos surinkimo tinklų eksploatavimą; visos kitos veiklos rūšys, susijusios su išgautos naftos ir gamtinių dujų paruošimu išvežti iš gavybos vietų. Į šį skyrių neįeina: - naftos ir gamtinių dujų telkinių eksploatavimo paslaugų teikimas už atlygį arba pagal sutartį, žr. 09.10 - naftos ir dujų gręžinių tyrimas, žr. 09.10 - žvalgomasis gręžimas, žr. 09.10 - naftos produktų perdirbimas, žr. 19.20 - geofizinių, geologinių ir seisminių tyrimų veikla, žr. 71.12 @lt
scope note: Этот класс включает: - добычу сырой нефти Этот класс также включает: - добычу битуминозного или нефтяного сланца и битуминозного песка - производство сырой нефти из битуминозного нефтяного сланца и песка - процессы получения сырой нефти: декантацию, опреснение, дегидрацию, стабилизацию и т.д. Этот класс исключает: - услуги, связанные с добычей нефти и природного газа, см. 09.10 - разведку нефти и газа, см. 09.10 - производство рафинированных (светлых) нефтепродуктов, см. 19.20 - высвобождение газов из жидкой нефти в процессе перегонки нефти, см. 19.20 - обеспечение работы трубопроводов, см. 49.50 @ru
scope note: Bu bölüm, ham petrol üretilmesini, yağlı şistler ve yağlı kumlardan petrol madenciliği yapılmasını ve petrol çıkarımını ve doğal gaz üretimi ile hidrokarbon sıvılarının geri kazanımını içermektedir. Bu bölüm, petrol ve gaz sahalarının işletim ve/veya geliştirme faaliyetlerini kapsar. Bu tür faaliyetler; sondaj yapmayı, kuyuların tamamlanmasını ve donatılmasını; ayırıcıların, emülsiyon azaltıcıların, tuz giderme ekipmanının ve ham petrol için alanda toplama hatlarının işletilmesini; üretim alanından nakil edilmesine kadar olan petrol ve gazın hazırlanmasındaki diğer faaliyetleri de içerir. Kapsam dışı olanlar; - bir ücret ya da sözleşmeye dayalı olarak gerçekleştirilen petrol ve gaz sahası hizmetleri, bkz. 09.10, - petrol ve gaz kuyuları arama faaliyetleri, bkz. 09.10, - test amaçlı sondaj ve delme, bkz. 09.10, - petrol ürünlerinin rafine edilmesi, bkz. 19.20, - jeofizik, jeolojik ve sismik araştırmalar, bkz. 71.12. @tr
preferred label: Добив на нефт и природен газ @bg
preferred label: Těžba ropy a zemního plynu @cs
preferred label: Indvinding af råolie og naturgas @da
preferred label: Gewinnung von Erdöl und Erdgas @de
preferred label: Άντληση αργού πετρελαίου και φυσικού αερίου @el
preferred label: Extracción de crudo de petróleo y gas natural @es
preferred label: Toornafta ja maagaasi tootmine @et
preferred label: Raakaöljyn ja maakaasun tuotanto @fi
preferred label: Extraction d'hydrocarbures @fr
preferred label: Kőolaj-, földgázkitermelés
preferred label: Estrazione di petrolio greggio e di gas naturale @it
preferred label: Žalios naftos ir gamtinių dujų gavyba @lt
preferred label: Jēlnaftas un dabasgāzes ieguve @lv
preferred label: Estrazzjoni ta' żejt mhux irraffinat u gass naturali @mt
preferred label: Winning van aardolie en aardgas @nl
preferred label: Utvinning av råolje og naturgass @no
preferred label: Górnictwo ropy naftowej i gazu ziemnego @pl
preferred label: Extracção de petróleo bruto e de gás natural @pt
preferred label: Extracţia petrolului brut şi a gazelor naturale @ro
preferred label: Добыча сырой нефти и природного газа @ru
preferred label: Ťažba ropy a zemného plynu @sk
preferred label: Pridobivanje surove nafte in zemeljskega plina @sl
preferred label: Utvinning av råpetroleum och naturgas @sv
preferred label: Ham petrol ve doğal gaz çıkarımı @tr
broader: MINING AND QUARRYING
narrower: Extraction of crude petroleum
narrower: Extraction of natural gas

Extraction of crude petroleum
type: Concept
notation: 06.1
status: valid
status modified: 2013-10-18
accepted date: 2013-10-18
in scheme: Statistical Classification of Economic Activities in the European Community, Rev. 2 (2008)
preferred label: Добив на нефт @bg
preferred label: Těžba ropy @cs
preferred label: Indvinding af råolie @da
preferred label: Gewinnung von Erdöl @de
preferred label: Άντληση αργού πετρελαίου @el
preferred label: Extracción de crudo de petróleo @es
preferred label: Toornafta tootmine @et
preferred label: Raakaöljyn tuotanto @fi
preferred label: Extraction de pétrole brut @fr
preferred label: Kőolaj-kitermelés
preferred label: Estrazione di petrolio greggio @it
preferred label: Žalios naftos gavyba @lt
preferred label: Jēlnaftas ieguve @lv
preferred label: Estrazzjoni ta' żejt mhux irraffinat @mt
preferred label: Winning van aardolie @nl
preferred label: Utvinning av råolje @no
preferred label: Górnictwo ropy naftowej @pl
preferred label: Extracção de petróleo bruto @pt
preferred label: Extracţia petrolului brut @ro
preferred label: Добыча сырой нефти @ru
preferred label: Ťažba ropy @sk
preferred label: Pridobivanje surove nafte @sl
preferred label: Utvinning av råpetroleum @sv
preferred label: Ham petrol çıkarımı @tr
broader: Extraction of crude petroleum and natural gas
narrower: Extraction of crude petroleum

Extraction of crude petroleum
type: Concept
notation: 06.10
status: valid
status modified: 2013-10-18
accepted date: 2013-10-18
in scheme: Statistical Classification of Economic Activities in the European Community, Rev. 2 (2008)
scope note: - добив на нефт - добив на битуминозни шисти и битуминозен пясък - производство на нефт от битуминозни шисти и битуминозен пясък - избистряне, обезсоляване, дехидратиране, стабилизиране и други дейности, свързани с добива на нефт - спомагателни дейности в добива на нефт и природен газ - 09.10 - проучване и подготовка на нефтените и газовите кладенци - 09.10 - производство на рафинирани нефтопродукти - 19.20 - извличане на втечнени нефтени газове при рафинирането на нефта - 19.20 - експлоатация на нефто- и газопроводи - 49.50 @bg
scope note: Z: - těžbu surové ropy ZT: - těžbu živičných nebo naftonosných břidlic a písků - získávání surové ropy z živičných břidlic (živičného lupku) a písků - postupy k dosažení surové ropy: dekantaci, odsolování, dehydrataci, stabilizaci atd. N: - podpůrné služby při těžbě ropy a zemního plynu (09.10) - průzkum ropy a plynu (09.10) - výroba rafinovaných ropných produktů (19.20) - získávání zkapalněného topného plynu z rafinace ropy (19.20) - provoz ropovodů (49.50) @cs
scope note: Diese Klasse umfasst: - Förderung von Erdöl Diese Klasse umfasst ferner: - Förderung von bituminösen oder ölhaltigen Schiefern und Sanden - Gewinnung von Erdöl aus bituminösen Schiefern und Sanden - Verfahren zur Gewinnung von Rohöl: Dekantieren, Entsalzen, Entwässern, Stabilisieren usw. Diese Klasse umfasst nicht: - Unterstützung bei der Förderung von Erdöl und Erdgas (s. 09.10) - Prospektion auf Erdöl und Erdgas (s. 09.10) - Mineralölverarbeitung (s. 19.20) - Gewinnung von Flüssiggas aus der Erdölraffination (s. 19.20) - Betrieb von Ölfernleitungen (s. 49.50) @de
scope note: This class includes: - extraction of crude petroleum oils This class also includes: - extraction of bituminous or oil shale and tar sand - production of crude petroleum from bituminous shale and sand - processes to obtain crude oils: decantation, desalting, dehydration, stabilisation etc. This class excludes: - support activities for oil and natural gas extraction, see 09.10 - oil and gas exploration, see 09.10 - manufacture of refined petroleum products, see 19.20 - recovery of liquefied petroleum gases in the refining of petroleum, see 19.20 - operation of pipelines, see 49.50 @en
scope note: Esta clase comprende: - la extracción de crudos de petróleo. Esta clase comprende también: - la extracción de esquisto bituminoso y arenas bituminosas; - la producción de crudos de petróleo a partir de arenas y esquistos bituminosos; - los procesos para obtener crudos de petróleo; - la decantación, la desalinización, la deshidratación, la estabilización, etc. Esta clase no comprende: - las actividades complementarias para la extracción de petróleo y gas natural (véase 09.10); - la prospección de petróleo y gas (véase 09.10); - la fabricación de productos de refino del petróleo (véase 19.20); - la recuperación de los gases licuados de petróleo procedentes del proceso de refinado (véase 19.20); - la explotación de gasoductos y oleoductos (véase 49.50). @es
scope note: Cette classe comprend: - l’extraction d’huiles brutes de pétrole Cette classe comprend également: - l’extraction de schistes et de sables bitumineux - la production de pétrole brut à partir de schistes et de sables bitumineux - les processus employés pour obtenir des huiles brutes: décantation, dessalement, déshydratation, stabilisation, etc. Cette classe ne comprend pas: - les activités de soutien à l’extraction d’hydrocarbures, voir 09.10 - la prospection de pétrole et de gaz, voir 09.10 - la fabrication de produits pétroliers raffinés, voir 19.20 - la récupération du gaz de pétrole liquéfié provenant du raffinage du pétrole, voir 19.20 - l’exploitation d’oléoducs ou de gazoducs, voir 49.50 @fr
scope note: Ovaj razred uključuje: - vađenje sirove nafte Ovaj razred također uključuje: - vađenje bitumeniziranih škriljevaca i pijeska - proizvodnju sirove nafte iz bitumeniziranih škriljevaca i pijeska - postupke za dobivanje sirove nafte: prelijevanje, desalinizaciju, dehidraciju, stabilizaciju itd. Ovaj razred isključuje: - pomoćne djelatnosti povezane s vađenjem nafte i prirodnog plina, vidi 09.10 - pronalaženje nafte i plina, vidi 09.10 - proizvodnju naftnih derivata, vidi 19.20 - dobivanje ukapljenih plinova pri proizvodnji naftnih derivata, vidi 19.20 - cjevovodni transport, vidi 49.50
scope note: Į šią klasę įeina: - žalios naftos gavyba Į šią klasę taip pat įeina: - bituminio ar naftingojo skalūno ir bitumingojo smėlio gavyba - žalios naftos gamyba iš bituminio skalūno ir bitumingojo smėlio - žalios naftos išgavimo procesai: dekantavimas, druskos šalinimas, vandens šalinimas, stabilizavimas ir kt. Į šią klasę neįeina: - naftos ir dujų gavybai būdingų paslaugų veikla, žr. 09.10 - naftos ir dujų telkinių žvalgymas, žr. 09.10 - rafinuotų naftos produktų gamyba, žr. 19.20 - suskystintųjų naftos dujų atgavimas perdirbant naftą, žr. 19.20 - vamzdynų eksploatavimas, žr. 49.50 @lt
scope note: Этот класс включает: - производство сырого газообразного углеводорода (природного газа) - добычу конденсатов - дренаж и разделение фракций жидкого углеводорода - десульфоризацию газа Этот класс также включает: - добычу жидкого углеводорода путем сжижения или пиролиза Этот класс исключает: - услуги, связанные с добычей нефти и природного газа, см. 09.10 - разведку нефти и газа, см. 09.10 - высвобождение газов из жидкой нефти в процессе перегонки нефти, см. 19.20 - производство промышленных газов, см. 20.11 - обеспечение работы трубопроводов, см. 49.50 @ru
scope note: Bu sınıf aşağıdakileri kapsamaktadır; - ham petrol yağlarının çıkarımı. Ayrıca bu sınıf aşağıdakileri de kapsamaktadır; - bitümlü (ziftli) veya petrol yağlı şist ve katranlı kum çıkarımı, - bitümlü (ziftli) şist ve kumdan ham petrol üretimi, - ham petrol elde edilmesi için yapılan işlemler: tortusunu, tuzunu, suyunu süzme, stabilize etme vs., Kapsam dışı olanlar; - petrol ve doğal gaz çıkarımını destekleyici faaliyetler, bkz. 09.10, - petrol ve gaz arama faaliyetleri, bkz. 09.10, - rafine edilmiş petrol ürünleri imalatı, bkz. 19.20, - petrol rafine sürecinde sıvılaştırılmış petrol gazlarının geri kazanımı, bkz. 19.20, - boru hattının işletilmesi, bkz. 49.50. @tr
preferred label: Добив на нефт @bg
preferred label: Těžba ropy @cs
preferred label: Indvinding af råolie @da
preferred label: Gewinnung von Erdöl @de
preferred label: Άντληση αργού πετρελαίου @el
preferred label: Extracción de crudo de petróleo @es
preferred label: Toornafta tootmine @et
preferred label: Raakaöljyn tuotanto @fi
preferred label: Extraction de pétrole brut @fr
preferred label: Kőolaj-kitermelés
preferred label: Estrazione di petrolio greggio @it
preferred label: Žalios naftos gavyba @lt
preferred label: Jēlnaftas ieguve @lv
preferred label: Estrazzjoni ta' żejt mhux irraffinat @mt
preferred label: Winning van aardolie @nl
preferred label: Utvinning av råolje @no
preferred label: Górnictwo ropy naftowej @pl
preferred label: Extracção de petróleo bruto @pt
preferred label: Extracţia petrolului brut @ro
preferred label: Добыча сырой нефти @ru
preferred label: Ťažba ropy @sk
preferred label: Pridobivanje surove nafte @sl
preferred label: Utvinning av råpetroleum @sv
preferred label: Ham petrol çıkarımı @tr
broader: Extraction of crude petroleum

Extraction of natural gas
type: Concept
notation: 06.2
status: valid
status modified: 2013-10-18
accepted date: 2013-10-18
in scheme: Statistical Classification of Economic Activities in the European Community, Rev. 2 (2008)
scope note: Этот раздел включает добычу металлосодержащих минералов (руды), добывающихся подземным или открытым способом, добычу с морского дна и т.д. Также включает обогащение руды, модификацию, дробление, измельчение, рафинирование, сушку, агломерацию, кальцинирование или выщелачивание руды и работы по разделению или флотации. Этот раздел исключает: - обжиг железного колчедана, см. 20.13 - производство оксида алюминия, см. 24.42 - работу доменных печей, см. раздел 24 @ru
preferred label: Добив на природен газ @bg
preferred label: Těžba zemního plynu @cs
preferred label: Indvinding af naturgas @da
preferred label: Gewinnung von Erdgas @de
preferred label: Άντληση φυσικού αερίου @el
preferred label: Extracción de gas natural @es
preferred label: Maagaasi tootmine @et
preferred label: Maakaasun tuotanto @fi
preferred label: Extraction de gaz naturel @fr
preferred label: Földgázkitermelés
preferred label: Estrazione di gas naturale @it
preferred label: Gamtinių dujų gavyba @lt
preferred label: Dabasgāzes ieguve @lv
preferred label: Estrazzjoni ta' gass naturali @mt
preferred label: Winning van aardgas @nl
preferred label: Utvinning av naturgass @no
preferred label: Górnictwo gazu ziemnego @pl
preferred label: Extracção de gás natural @pt
preferred label: Extracţia gazelor naturale @ro
preferred label: Добыча природного газа @ru
preferred label: Ťažba zemného plynu @sk
preferred label: Pridobivanje zemeljskega plina @sl
preferred label: Utvinning av naturgas @sv
preferred label: Doğal gaz çıkarımı @tr
broader: Extraction of crude petroleum and natural gas
narrower: Extraction of natural gas

Extraction of natural gas
type: Concept
notation: 06.20
status: valid
status modified: 2013-10-18
accepted date: 2013-10-18
in scheme: Statistical Classification of Economic Activities in the European Community, Rev. 2 (2008)
scope note: - добив на природни газообразни въглеводороди (природен газ) - извличане на кондензати от природен газ - пречистване и отделяне на леките фракции - десулфориране на природния газ - добив на течни въглеводороди, получени посредством метода на втечняване или чрез пиролиза - спомагателни дейности в добива на нефт и природен газ - 09.10 - проучване и подготовка на нефтените и газовите кладенци - 09.10 - извличане на втечнени нефтени газове при рафинирането на нефта - 19.20 - производство на промишлени газове - 20.11 - експлоатация на нефто- и газопроводи - 49.50 @bg
scope note: Z: - výrobu surových plynných uhlovodíků (zemního plynu) - získávání kondenzátu - dehydrataci (vyčerpání) a separování kapalných frakcí uhlovodíku - odsířování plynu ZT: - získávání uhlovodíků zkapalňováním nebo pyrolýzou N: - podpůrné služby při těžbě ropy a zemního plynu (09.10) - průzkum ropy a plynu (09.10) - získávání zkapalněného topného plynu z rafinace ropy (19.20) - výrobu průmyslových plynů (20.11) - provoz ropovodů (49.50) @cs
scope note: Diese Klasse umfasst: - Förderung von gasförmigen Kohlenwasserstoffen (Erdgas) - Gewinnung von Kondensat - Entwässerung und Abscheidung flüssiger Kohlenwasserstoff-Fraktionen - Gasentschwefelung Diese Klasse umfasst ferner: - Gewinnung von flüssigen Kohlenwasserstoffen durch Verflüssigung oder Pyrolyse Diese Klasse umfasst nicht: - Unterstützung bei der Förderung von Erdöl und Erdgas (s. 09.10) - Prospektion auf Erdöl und Erdgas (s. 09.10) - Gewinnung von Flüssiggas aus der Erdölraffination (s. 19.20) - Herstellung von Industriegasen (s. 20.11) - Betrieb von Ölfernleitungen (s. 49.50) @de
scope note: This class includes: - production of crude gaseous hydrocarbon (natural gas) - extraction of condensates - draining and separation of liquid hydrocarbon fractions - gas desulphurisation This class also includes: - mining of hydrocarbon liquids, obtained through liquefaction or pyrolysis This class excludes: - support activities for oil and natural gas extraction, see 09.10 - oil and gas exploration, see 09.10 - recovery of liquefied petroleum gases in the refining of petroleum, see 19.20 - manufacture of industrial gases, see 20.11 - operation of pipelines, see 49.50 @en
scope note: Esta clase comprende: - la producción de hidrocarburos gaseosos crudos (gas natural); - la extracción de condensados; - el drenaje y la separación de fracciones de hidrocarburos líquidos; - la desulfurización de gas. Esta clase comprende también: - la obtención de hidrocarburos líquidos mediante licuefacción o pirólisis. Esta clase no comprende: - las actividades complementarias para la extracción de petróleo y gas natural (véase 09.10); - la prospección de petróleo y gas (véase 09.10); - la recuperación de los gases licuados de petróleo procedentes del proceso de refinado (véase 19.20); - la producción de gases industriales (véase 20.11); - la explotación de gasoductos y oleoductos (véase 49.50). @es
scope note: Cette classe comprend: - la production d’hydrocarbures gazeux bruts (gaz naturel) - l’extraction de condensats - la décantation et la séparation de fractions d’hydrocarbures liquides - la désulfuration du gaz Cette classe comprend également: - l’extraction d’hydrocarbures liquides par les procédés de liquéfaction ou de pyrolyse Cette classe ne comprend pas: - les activités de soutien à l’extraction d’hydrocarbures, voir 09.10 - la prospection de pétrole et de gaz, voir 09.10 - la récupération du gaz de pétrole liquéfié provenant du raffinage du pétrole, voir 19.20 - la fabrication de gaz industriels, voir 20.11 - l’exploitation d’oléoducs ou de gazoducs, voir 49.50 @fr
scope note: Ovaj razred uključuje: - proizvodnju sirovoga plinovitog ugljikovodika (prirodnog plina) - vađenje kondenzata - odvajanje tekućih ugljikovodičnih frakcija - odsumporavanje plinova Ovaj razred također uključuje: - vađenje tekućih ugljikovodika metodom ukapljivanja ili pirolizom Ovaj razred isključuje: - pomoćne djelatnosti povezane s vađenjem nafte i prirodnog plina, vidi 09.10 - pronalaženje nafte i plina, vidi 09.10 - dobivanje ukapljenih plinova pri proizvodnji naftnih derivata, vidi 19.20 - proizvodnju industrijskih plinova , vidi 20.11 - cjevovodni transport, vidi 49.50
scope note: Į šią klasę įeina: - nevalyto dujinio angliavandenilio (gamtinių dujų) gamyba - kondensato ištraukimas - skysto angliavandenilio filtravimas ir frakcijų atskyrimas - sieros iš dujų šalinimas (desulfuracija) Į šią klasę taip pat įeina: - skysto angliavandenilio gavyba skystinimo arba pirolizės būdu Į šią klasę neįeina: - naftos ir dujų gavybai būdinga veikla, žr. 09.10 - naftos ir dujų telkinių žvalgymas, žr. 09.10 - suskystintųjų naftos dujų atgavimas perdirbant naftą, žr. 19.20 - pramoninių dujų gamyba, žr. 20.11 - vamzdynų eksploatavimas, 49.50 @lt
scope note: Bu sınıf aşağıdakileri kapsamaktadır; - ham hidrokarbon gazı (doğal gaz) çıkarımı, - doğal gazla birlikte çıkarılan hafif petrol (kondansate) çıkarımı, - sıvı hidrokarbonun suyunun alınması ve ayrıştırılması, - gazın kükürtten arındırılması. Ayrıca bu sınıf aşağıdakileri de kapsamaktadır; - sıvılaştırma veya ısıtarak eritme (piroliz) yöntemleriyle elde edilen hidrokarbon sıvılarının çıkarımı. Kapsam dışı olanlar; - petrol ve doğal gaz çıkarımını destekleyici faaliyetler, bkz. 09.10, - petrol ve gaz çıkarımı ile ilgili araştırma faaliyetleri, bkz. 09.10, - petrol rafine sürecinde sıvılaştırılmış petrol gazlarının geri kazanımı, bkz. 19.20, - sanayi gazı imalatı, bkz. 20.11, - boru hattının işletilmesi, bkz. 49.50. @tr
preferred label: Добив на природен газ @bg
preferred label: Těžba zemního plynu @cs
preferred label: Indvinding af naturgas @da
preferred label: Gewinnung von Erdgas @de
preferred label: Άντληση φυσικού αερίου @el
preferred label: Extracción de gas natural @es
preferred label: Maagaasi tootmine @et
preferred label: Maakaasun tuotanto @fi
preferred label: Extraction de gaz naturel @fr
preferred label: Földgázkitermelés
preferred label: Estrazione di gas naturale @it
preferred label: Gamtinių dujų gavyba @lt
preferred label: Dabasgāzes ieguve @lv
preferred label: Estrazzjoni ta' gass naturali @mt
preferred label: Winning van aardgas @nl
preferred label: Utvinning av naturgass @no
preferred label: Górnictwo gazu ziemnego @pl
preferred label: Extracção de gás natural @pt
preferred label: Extracţia gazelor naturale @ro
preferred label: Добыча природного газа @ru
preferred label: Ťažba zemného plynu @sk
preferred label: Pridobivanje zemeljskega plina @sl
preferred label: Utvinning av naturgas @sv
preferred label: Doğal gaz çıkarımı @tr
broader: Extraction of natural gas

Mining of metal ores
type: Concept
notation: 07
status: valid
status modified: 2013-10-18
accepted date: 2013-10-18
in scheme: Statistical Classification of Economic Activities in the European Community, Rev. 2 (2008)
scope note: подземен или открит добив на метални руди. Включва също операции по сортиране и обогатяване на рудата като раздробяване, смилане, промиване, изсушаване, синтероване, калциниране или извличане на концентрат, гравитационна сепарация или флотация. - пържене на железни пирити - 20.13 - експлоатация на доменни пещи - раздел 24 - производство на алуминиев оксид - 24.42 @bg
scope note: Tento oddíl zahrnuje podzemní nebo povrchovou těžbu nerostů (rud), těžbu z mořského dna atd. Zahrnuje také mechanické úpravy a obohacení rud jako drcení, broušení, mletí, propírání, sušení, spékání, pražení nebo vyluhování rud, gravimetrickou separaci nebo flotaci. N: - pražení pyritů (20.13) - výrobu oxidu hlinitého (24.42) - provoz vysokých pecí (oddíl 24) @cs
scope note: Diese Abteilung umfasst den Bergbau auf metallische Mineralien (Erze) im Untertage- oder Tagebau, im Meeresbodenbergbau usw. Diese Abteilung umfasst ferner: - Tätigkeiten der Aufbereitung und Anreicherung von Erz, wie das Brechen, Mahlen, Waschen, Trocknen, Sintern, Brennen oder Auslaugen von Erz, der Schweretrennung oder der Flotation Diese Abteilung umfasst nicht: - Rösten von Eisenkies (s. 20.13) - Herstellung von Aluminiumoxid (s. 24.42) - Betrieb von Hochöfen (s. Abteilung 24) @de
scope note: This division includes mining for metallic minerals (ores), performed through underground or open-cast extraction, seabed mining etc. This division also includes: - ore dressing and beneficiating operations, such as crushing, grinding, washing, drying, sintering, calcining or leaching ore, gravity separation or flotation operations This division excludes: - roasting of iron pyrites, see 20.13 - production of aluminium oxide, see 24.42 - operation of blast furnaces, see division 24 @en
scope note: Esta división comprende la extracción de minerales metálicos realizada en explotaciones mineras subterráneas, a cielo abierto, o de fondos marinos, etc. Se incluyen asimismo las operaciones de preparación de minerales, como el triturado, la pulverización, el lavado, el secado, la sinterización, la calcinación y la lixiviación y la separación por gravedad o flotación. Esta división no comprende: - el tostado de las piritas de hierro (véase 20.13); - la producción de óxido de aluminio (véase 24.42); - la explotación de altos hornos (véase la división 24). @es
scope note: Cette division comprend l’extraction, souterraine, à ciel ouvert ou par l’exploitation minière des fonds marins, de minerais métalliques. Cette division comprend également: - les opérations de traitement et d’enrichissement du minerai: concassage, broyage, lavage, séchage, agglomération, calcination ou lixiviation du minerai, ou qui effectuent les opérations de séparation gravitaire ou de flottation Cette division ne comprend pas: - le grillage de la pyrite de fer, voir 20.13 - la production d’oxyde d’aluminium, voir 24.42 - l’exploitation de hauts fourneaux, voir division 24 @fr
scope note: Ovaj odjeljak uključuje vađenje metalnih minerala (ruda) podzemnim, površinskim ili podmorskim kopom. Također uključuje djelatnosti pripremanja i obogaćivanja ruda kao što su lomljenje, drobljenje, pranje, sušenje, sinteriranje, kalcinacija ili ispiranje ruda, gravitacijska separacija ili flotacija. Ovaj odjeljak isključuje: - prženje željeznog pirita, vidi 20.13 - proizvodnju aluminijeva oksida (glinice), vidi 24.42 - djelatnosti visokih peći, vidi odjeljak 24
scope note: Į šį skyrių įeina metalo mineralų (rūdų) požeminė ir atviroji gavyba ir kasyba iš jūros dugno. Taip pat įeina rūdų apdorojimo ir sodrinimo operacijos, tokios kaip rūdų trupinimas, smulkinimas, plovimas, džiovinimas, sukepinimas, išdegimas ar druskų išplovimas, gravitacinis atskyrimas ar flotacija. Į šį skyrių neįeina: - geležies piritų iškaitinimas, žr. 20.13 - aliuminio oksido gamyba, žr. 24.42 - aukštakrosnių eksploatavimas, žr. 24 skyrių @lt
scope note: Этот класс включает: - добычу руды, содержащей железо - обогащение и агломерацию железной руды Этот класс исключает: - добычу и подготовку колчеданов (за исключением обжига), см. 08.91 @ru
scope note: Bu bölüm, yer altı veya yer üstü madenciliği, deniz yatağı madenciliği vb. yoluyla yapılan metalik minerallerin (cevherlerin) madenciliğini kapsamaktadır. Ayrıca, cevherin ezilme, öğütülme, yıkanma, kurutulma, sinter, kalsine veya filtreden geçirilmesi gibi cevherin ambalajlanması ve iyileştirilmesine yönelik faaliyetler ile özgül ağırlık farkı ile zenginleştirme veya flotasyon faaliyetlerini de kapsar. Kapsam dışı olanlar; - demir piritlerinin kavrulması, bkz. 20.13, - alüminyum oksit üretimi, bkz. 24.42, - maden eritme ocaklarının (yüksek fırınların) işletilmesi, bkz. bölüm 24. @tr
preferred label: Добив на метални руди @bg
preferred label: Těžba rud @cs
preferred label: Brydning af metalmalme @da
preferred label: Erzbergbau @de
preferred label: Εξόρυξη μεταλλευμάτων @el
preferred label: Extracción de minerales metálicos @es
preferred label: Metallimaakide kaevandamine @et
preferred label: Metallimalmien louhinta @fi
preferred label: Extraction de minerais métalliques @fr
preferred label: Fémtartalmú érc bányászata
preferred label: Estrazione di minerali metalliferi @it
preferred label: Metalų rūdų kasyba @lt
preferred label: Metāla rūdu ieguve @lv
preferred label: Qtugħ ta' metall mill-minjieri @mt
preferred label: Winning van metaalertsen @nl
preferred label: Bryting av metallholdig malm @no
preferred label: Górnictwo rud metali @pl
preferred label: Extracção e preparação de minérios metálicos @pt
preferred label: Extracţia minereurilor metalifere @ro
preferred label: Добыча металлических руд @ru
preferred label: Dobývanie kovových rúd @sk
preferred label: Pridobivanje rud @sl
preferred label: Utvinning av metallmalmer @sv
preferred label: Metal cevheri madenciliği @tr
broader: MINING AND QUARRYING
narrower: Mining of iron ores
narrower: Mining of non-ferrous metal ores

Mining of iron ores
type: Concept
notation: 07.1
status: valid
status modified: 2013-10-18
accepted date: 2013-10-18
in scheme: Statistical Classification of Economic Activities in the European Community, Rev. 2 (2008)
scope note: Эта группа включает добычу металлической руды, не содержащей железа. @ru
preferred label: Добив на железни руди @bg
preferred label: Těžba železných rud @cs
preferred label: Brydning af jernmalm @da
preferred label: Eisenerzbergbau @de
preferred label: Εξόρυξη σιδηρομεταλλεύματος @el
preferred label: Extracción de minerales de hierro @es
preferred label: Rauamaagi kaevandamine @et
preferred label: Rautamalmien louhinta @fi
preferred label: Extraction de minerais de fer @fr
preferred label: Vasércbányászat
preferred label: Estrazione di minerali metalliferi ferrosi @it
preferred label: Geležies rūdų kasyba @lt
preferred label: Dzelzsrūdu ieguve @lv
preferred label: Qtugħ ta' ħadid mill-minjieri @mt
preferred label: Winning van ijzererts @nl
preferred label: Bryting av jernmalm @no
preferred label: Górnictwo rud żelaza @pl
preferred label: Extracção e preparação de minérios de ferro @pt
preferred label: Extracţia minereurilor feroase @ro
preferred label: Добыча железной руды @ru
preferred label: Dobývanie železných rúd @sk
preferred label: Pridobivanje železove rude @sl
preferred label: Järnmalmsutvinning @sv
preferred label: Demir cevheri madenciliği @tr
broader: Mining of metal ores
narrower: Mining of iron ores

Mining of iron ores
type: Concept
notation: 07.10
status: valid
status modified: 2013-10-18
accepted date: 2013-10-18
in scheme: Statistical Classification of Economic Activities in the European Community, Rev. 2 (2008)
scope note: - добив на руди, съдържащи предимно желязо - обогатяване и агломериране на железни руди - добив и обогатяване на железни пирити и пиротити (без пържените) - 08.91 @bg
scope note: Z: - těžbu rud vysoce hodnocenou zejména pro obsah železa - mechanickou úpravu a aglomeraci železných rud N: - těžbu a úpravu pyritů a pyrhotinu (kromě pražení) (08.91) @cs
scope note: Diese Klasse umfasst: - Gewinnung und Aufbereitung von Eisenerzen - Anreicherung und Pelletierung von Eisenerzen Diese Klasse umfasst nicht: - Gewinnung und Aufbereitung von Pyriten und Magnetkies (außer Rösten) (s. 08.91) @de
scope note: This class includes: - mining of ores valued chiefly for iron content - beneficiation and agglomeration of iron ores This class excludes: - extraction and preparation of pyrites and pyrrhotite (except roasting), see 08.91 @en
scope note: Esta clase comprende: - la extracción de minerales cuya explotación se debe fundamentalmente a su contenido en hierro; - el aprovechamiento y la aglomeración de minerales de hierro. Esta clase no comprende: - la extracción y preparación de piritas y pirrotita (excepto el tostado) (véase 08.91). @es
scope note: Cette classe comprend: - l’extraction de minerais exploités principalement en raison de leur teneur en fer - l’enrichissement et l’agglomération des minerais de fer Cette classe ne comprend pas: - l’extraction et la préparation de la pyrite et de la pyrrhotite (à l’exception du grillage), voir 08.91 @fr
scope note: Ovaj razred uključuje: - vađenje ruda vrednovanih poglavito zbog sadržaja željeza - obogaćivanje i aglomeraciju željeznih ruda Ovaj razred isključuje: - vađenje i pripremu pirita i pirotita (osim prženja), vidi 08.91
scope note: Į šią klasę įeina: - rūdų, vertinamų dėl jose esančios geležies, kasyba - geležies rūdų sodrinimas ir aglomeracija Į šią klasę neįeina: - piritų ir pirotinų gavyba ir paruošimas lydymui (išskyrus iškaitinimą), žr. 08.91 @lt
scope note: Этот класс включает: - добычу урановой и ториевой руды: уранита и т.д. - концентрацию таких руд - производство желтого кека Этот класс исключает: - обогащение урановой и ториевой руды, см. 20.13 - производство урана из уранинита или прочих видов руды, см. 24.46 - плавку и очищение урана от примесей, см. 24.46 @ru
scope note: Bu sınıf aşağıdakileri kapsamaktadır; - yüksek oranda demir içeren cevherlerin madenciliği, - demir cevherlerinin zenginleştirilmesi ve topak haline getirilmesi. Kapsam dışı olanlar; - pirit ve pirotit (bronz renginde parlak bir maden) (kavurma hariç) çıkarımı ve işlenmesi, bkz. 08.91. @tr
preferred label: Добив на железни руди @bg
preferred label: Těžba železných rud @cs
preferred label: Brydning af jernmalm @da
preferred label: Eisenerzbergbau @de
preferred label: Εξόρυξη σιδηρομεταλλεύματος @el
preferred label: Extracción de minerales de hierro @es
preferred label: Rauamaagi kaevandamine @et
preferred label: Rautamalmien louhinta @fi
preferred label: Extraction de minerais de fer @fr
preferred label: Vasércbányászat
preferred label: Estrazione di minerali metalliferi ferrosi @it
preferred label: Geležies rūdų kasyba @lt
preferred label: Dzelzsrūdu ieguve @lv
preferred label: Qtugħ ta' ħadid mill-minjieri @mt
preferred label: Winning van ijzererts @nl
preferred label: Bryting av jernmalm @no
preferred label: Górnictwo rud żelaza @pl
preferred label: Extracção e preparação de minérios de ferro @pt
preferred label: Extracţia minereurilor feroase @ro
preferred label: Добыча железной руды @ru
preferred label: Dobývanie železných rúd @sk
preferred label: Pridobivanje železove rude @sl
preferred label: Järnmalmsutvinning @sv
preferred label: Demir cevheri madenciliği @tr
broader: Mining of iron ores

Mining of non-ferrous metal ores
type: Concept
notation: 07.2
status: valid
status modified: 2013-10-18
accepted date: 2013-10-18
in scheme: Statistical Classification of Economic Activities in the European Community, Rev. 2 (2008)
scope note: Tato skupina zahrnuje těžbu neželezných kovových rud. @cs
scope note: Diese Gruppe umfasst den Bergbau auf nichteisenhaltige Metallerze. @de
scope note: This group includes the mining of non-ferrous metal ores. @en
scope note: Ce groupe comprend l’extraction de minerais de métaux non ferreux. @fr
scope note: Ova skupina uključuje vađenje ruda obojenih metala.
scope note: Į šį skyrių įeina spalvotųjų metalų rūdų kasyba. @lt
scope note: Этот класс включает: - добычу и подготовку руды, не содержащей железа: • алюминия (алюминиевой руды), меди, свинца, цинка, олова, марганца, хрома, никеля, кобальта, молибдена, тантала, ванадия и т.д. • драгоценных металлов: золота, серебра, платины Этот класс исключает: - добычу и подготовку урановой и ториевой руды, см. 07.21 - производство оксида алюминия, см. 24.42 - производство медных или никелевых пластин, см. 24.44, 24.45 @ru
scope note: Bu grup, demir dışı metal cevherlerin madenciliğini kapsamaktadır. @tr
preferred label: Добив на уранови, ториеви и руди на цветни метали @bg
preferred label: Těžba neželezných rud @cs
preferred label: Brydning af ikke-jernholdige metalmalme @da
preferred label: NE-Metallerzbergbau @de
preferred label: Εξόρυξη μη σιδηρούχων μεταλλευμάτων @el
preferred label: Extracción de minerales metálicos no férreos @es
preferred label: Mitteraudmetallide maakide kaevandamine @et
preferred label: Värimetallimalmien louhinta @fi
preferred label: Extraction de minerais de métaux non ferreux @fr
preferred label: Egyéb fém érc bányászata
preferred label: Estrazione di minerali metalliferi non ferrosi @it
preferred label: Spalvotųjų metalų rūdų kasyba @lt
preferred label: Krāsaino metālu rūdu ieguve @lv
preferred label: Qtugħ ta' metall mhux ferruż mill-minjieri @mt
preferred label: Winning van non-ferrometaalertsen @nl
preferred label: Bryting av ikke-jernholdig malm @no
preferred label: Górnictwo rud metali nieżelaznych @pl
preferred label: Extracção e preparação de minérios metálicos não-ferrosos @pt
preferred label: Extracţia minereurilor metalifere neferoase @ro
preferred label: Добыча руд цветных металлов @ru
preferred label: Dobývanie neželezných rúd @sk
preferred label: Pridobivanje rud neželeznih kovin @sl
preferred label: Utvinning av andra metallmalmer än järnmalm @sv
preferred label: Demir dışı metal cevherlerin madenciliği @tr
broader: Mining of metal ores
narrower: Mining of uranium and thorium ores
narrower: Mining of other non-ferrous metal ores

Mining of uranium and thorium ores
type: Concept
notation: 07.21
status: valid
status modified: 2013-10-18
accepted date: 2013-10-18
in scheme: Statistical Classification of Economic Activities in the European Community, Rev. 2 (2008)
scope note: - добив на руди, съдържащи предимно ураний или торий: уранинит и други - извличане на концентрат от тези руди - производство на уранови концентрати (yellowcake) - обогатяване на уран и торий - 20.13 - производство на уран от уранинит или от други руди - 24.46 - топене и рафиниране на уран - 24.46 @bg
scope note: Z: - těžbu rud zejména vysoce hodnocených pro obsah uranu a thoria: smolince atd. - koncentrace těchto rud - výrobu (zpracování) nečistého uranového koncentrátu N: - obohacení uranových a thoriových rud (20.13) - výrobu uranu ze smolince nebo jiných rud (24.46) - tavení a rafinaci uranu (24.46) @cs
scope note: Diese Klasse umfasst: - Gewinnung von Uran- und Thoriumerzen: Pechblende usw. - Konzentration dieser Erze - Herstellung von Uranoxidkonzentrat Diese Klasse umfasst nicht: - Anreicherung von Uran- und Thoriumerzen (s. 20.13) - Herstellung von metallischem Uran aus Pechblende oder anderen Erzen (s. 24.46) - Schmelzen und Raffinieren von Uran (s. 24.46) @de
scope note: This class includes: - mining of ores chiefly valued for uranium and thorium content: pitchblende etc. - concentration of such ores - manufacture of yellowcake This class excludes: - enrichment of uranium and thorium ores, see 20.13 - production of uranium metal from pitchblende or other ores, see 24.46 - smelting and refining of uranium, see 24.46 @en
scope note: Esta clase comprende: - la extraccción de minerales cuya explotación se debe fundamentalmente a su contenido en uranio y torio: pechblenda, etc.; - la concentración de estos minerales; - la fabricación de concentrado de uranio (yellowcake). Esta clase no comprende: - el enriquecimiento de minerales de uranio y de torio (véase 20.13); - la fabricación de metal de uranio a partir de pechblenda u otros minerales (véase 24.46); - la fundición y el refinado de uranio (véase 24.46). @es
scope note: Cette classe comprend: - l’extraction de minerais renfermant de l’uranium ou du thorium: pechblende, etc. - la concentration de ces minerais - la fabrication de concentré d’uranium ("yellow cake") Cette classe ne comprend pas: - l’enrichissement de minerais d’uranium et de thorium, voir 20.13 - la production d’uranium métal à partir de la pechblende ou d’autres minerais, voir 24.46 - la fonte et le raffinage de l’uranium, voir 24.46 @fr
scope note: Ovaj razred uključuje: - vađenje ruda vrednovanih uglavnom zbog sadržaja urana i torija: uranova oksida itd. - koncentriranje takvih ruda - proizvodnju ''žutoga kolača'' (uranov oksid) Ovaj razred isključuje: - obogaćivanje uranovih i torijevih ruda, vidi 20.13 - proizvodnju metala urana iz uranova smolinca i drugih ruda, vidi 24.46 - taljenje i rafiniranje urana, vidi 24.46
scope note: Į šį skyrių įeina: - rūdų (uranito ir kt.), ypač vertinamų dėl jose esančio urano ir torio, kasyba - tokių rūdų koncentravimas - urano oksido gamyba Į šią klasę neįeina: - urano ir torio rūdų sodrinimas, žr. 20.13 - metalinio urano gamyba iš uranito ar kitų rūdų, žr. 24.46 - urano lydymas ir rafinavimas, žr. 24.46 @lt
scope note: Этот раздел включает как разработку каменных карьеров, так и добычу аллювия, размельчение горных пород, разработку соляных месторождений. Добытые горные породы и минералы применяются в строительстве (песок, камень и т.п.), при производстве строительных материалов (глина, гипс, кальций и т.п.), химических продуктов. Раздел исключает процессы, связанные с первичной обработкой добытых минералов (кроме дробления, размельчения, чистки, сушки, сортировки, образования смесей). @ru
scope note: Bu sınıf aşağıdakileri kapsamaktadır; - yüksek oranda uranyum ve toryum içeren cevherlerin madenciliği: uranyum oksit vb., - bu cevherlerin konsantrasyonu, - sarı pasta (uranyum oksit (U3O8)) imalatı. Kapsam dışı olanlar; - uranyum ve toryum cevherlerinin zenginleştirilmesi, bkz. 20.13, - uranyum oksit veya diğer cevherlerden uranyum metali üretilmesi, bkz. 24.46, - uranyumun eritilmesi ve rafine edilmesi (izabesi), bkz. 24.46. @tr
preferred label: Добив на уранови и ториеви руди @bg
preferred label: Těžba uranových a thoriových rud @cs
preferred label: Brydning af uran- og thoriummalme @da
preferred label: Bergbau auf Uran- und Thoriumerze @de
preferred label: Εξόρυξη μεταλλευμάτων ουρανίου και θορίου @el
preferred label: Extracción de minerales de uranio y torio @es
preferred label: Uraani- ja tooriumimaagi kaevandamine @et
preferred label: Uraani- ja toriummalmien louhinta @fi
preferred label: Extraction de minerais d'uranium et de thorium @fr
preferred label: Urán-, tóriumérc-bányászat
preferred label: Estrazione di minerali di uranio e di torio @it
preferred label: Urano ir torio rūdų kasyba @lt
preferred label: Urāna un torija rūdu ieguve @lv
preferred label: Qtugħ ta' uranju u torju mill-minjieri @mt
preferred label: Winning van uranium- en thoriumerts @nl
preferred label: Bryting av uran- og thoriummalm @no
preferred label: Górnictwo rud uranu i toru @pl
preferred label: Extracção de minérios de urânio e de tório @pt
preferred label: Extracţia minereurilor de uraniu şi toriu @ro
preferred label: Добыча урановой и ториевой руды @ru
preferred label: Dobývanie uránových a tóriových rúd @sk
preferred label: Pridobivanje uranove in torijeve rude @sl
preferred label: Utvinning av uran- och toriummalm @sv
preferred label: Uranyum ve toryum cevherlerinin madenciliği @tr
broader: Mining of non-ferrous metal ores

Mining of other non-ferrous metal ores
type: Concept
notation: 07.29
status: valid
status modified: 2013-10-18
accepted date: 2013-10-18
in scheme: Statistical Classification of Economic Activities in the European Community, Rev. 2 (2008)
scope note: - добив и обогатяване на руди, съдържащи предимно цветни метали: • манган, мед, олово, цинк, алуминий (боксит), хром, никел, калай, кобалт, молибден, тантал, ванадий и други • благородни метали: злато, сребро, платина - добив на уранови и ториеви руди - 07.21 - производство на алуминиев оксид - 24.42 - производство на меден или никелов камък - 24.44 и 24.45 @bg
scope note: Z: - těžbu a úpravu rud zejména vysoce hodnocených pro obsah neželezných kovů: rud hliníku (bauxit), mědi, olova, zinku, cínu, manganu, chromu, niklu, kobaltu, molybdenu, tantalu, vanadia atd. • drahých kovů: zlata, stříbra, platiny N: - těžbu a úpravu uranových a thoriových rud (07.21) - výrobu oxidu hlinitého (24.42) - výrobu měděných nebo niklových slitků (mattes) (24.44, 24.45) @cs
scope note: Diese Klasse umfasst: - Gewinnung und Aufbereitung von NE-Metallerzen: • Aluminiumerze (Bauxit), Kupfer-, Blei-, Zink-, Zinn-, Mangan-, Chrom-, Nickel-, Kobalt-, Molybdän-, Tantal-, Vanadium- und andere Erze • Edelmetallerze: Gold-, Silber- und Platinerze Diese Klasse umfasst nicht: - Gewinnung und Aufbereitung von Uran- und Thoriumerzen (s. 07.21) - Herstellung von Aluminiumoxid (s. 24.42) - Herstellung von Kupfer- oder Nickelmatte (s. 24.44, 24.45) @de
scope note: This class includes: - mining and preparation of ores chiefly valued for non-ferrous metal content: • aluminium (bauxite), copper, lead, zinc, tin, manganese, chrome, nickel, cobalt, molybdenum, tantalum, vanadium etc. • precious metals: gold, silver, platinum This class excludes: - mining and preparation of uranium and thorium ores, see 07.21 - production of aluminium oxide, see 24.42 - production of mattes of copper or of nickel, see 24.44, 24.45 @en
scope note: Esta clase comprende: - la extracción y preparación de minerales cuya explotación se debe fundamentalmente a su contenido en metales no férreos: • minerales de aluminio (bauxita), cobre, plomo, cinc, estaño, manganeso, cromo, níquel, cobalto, molibdeno, tantalio, vanadio, etc.; • minerales de metales preciosos: oro, plata y platino. Esta clase no comprende: - la extracción y preparación de minerales de uranio y torio (véase 07.21); - la producción de óxido de aluminio (véase 24.42); - la producción de matas de cobre o niquel (véanse 24.44 y 24.45). @es
scope note: Cette classe comprend: - l’extraction et la préparation de minerais exploités principalement en raison de leur teneur en métaux non ferreux: • aluminium (bauxite), cuivre, plomb, zinc, étain, manganèse, chrome, nickel, cobalt, molybdène, tantale, vanadium, etc. • métaux précieux: or, argent, platine Cette classe ne comprend pas: - l’extraction et la préparation de minerais d’uranium et de thorium, voir 07.21 - la production d’oxyde d’aluminium, voir 24.42 - la production de mattes de cuivre ou de nickel, voir 24.44 et 24.45 @fr
scope note: Ovaj razred uključuje: - vađenje i pripremu ruda vrednovanih uglavnom zbog sadržaja obojenih metala: • aluminija (boksita), bakra, olova, cinka, kositra, mangana, kroma, nikla, kobalta, molibdena, tantala, vanadija itd. • plemenitih metala: zlata, srebra, platine Ovaj razred isključuje: - vađenje i pripremu uranovih i torijevih ruda, vidi 07.21 - proizvodnju aluminijeva oksida (glinice), vidi 24.42 - proizvodnju bakrenca ili niklova kamenca, vidi 24.44, 24.45
scope note: Į šią klasę įeina: - rūdų, ypač vertinamų dėl jose esančių spalvotųjų metalų, kasyba ir paruošimas lydymui: • aliuminio (boksito), vario, švino, cinko, alavo, mangano, chromo, nikelio, kobalto, molibdeno, tantalo, vanadžio ir kt. - tauriųjų metalų, pvz., aukso, sidabro, platinos, kasyba ir paruošimas lydymui Į šią klasę neįeina: - urano ir torio rūdų kasyba ir paruošimas lydymui, žr. 07.21 - aliuminio oksido gamyba, žr. 24.42 - nikelio arba vario šteinų gamyba, žr. 24.44, 24.45 @lt
scope note: Bu sınıf aşağıdakileri kapsamaktadır; - yüksek oranda demir içermeyen cevherlerin madenciliği ve hazırlanması; • alüminyum (boksit), bakır, kurşun, çinko, kalay, manganez, krom, nikel, kobalt, molibden, tantal, vanadyum vb., • değerli metaller: altın, gümüş, platin. Kapsam dışı olanlar; - uranyum ve toryum cevheri madenciliği ve hazırlanması, bkz. 07.21, - alüminyum oksit üretimi, bkz. 24.42, - bakır veya nikel cevheri imalatı, bkz. 24.44, 24.45. @tr
preferred label: Добив на руди на цветни метали @bg
preferred label: Těžba ostatních neželezných rud @cs
preferred label: Brydning af andre ikke-jernholdige metalmalme @da
preferred label: Sonstiger NE-Metallerzbergbau @de
preferred label: Εξόρυξη λοιπών μη σιδηρούχων μεταλλευμάτων @el
preferred label: Extracción de otros minerales metálicos no férreos @es
preferred label: Muude mitteraudmetallide maakide kaevandamine @et
preferred label: Muiden värimetallimalmien louhinta @fi
preferred label: Extraction d'autres minerais de métaux non ferreux @fr
preferred label: Színesfém érc bányászata
preferred label: Estrazione di altri minerali metalliferi non ferrosi @it
preferred label: Kitų spalvotųjų metalų rūdų kasyba @lt
preferred label: Citu krāsaino metālu rūdu ieguve @lv
preferred label: Qtugħ ta' metall ieħor mhux ferruż mill-minjieri @mt
preferred label: Winning van andere non-ferrometaalertsen @nl
preferred label: Bryting av ikke-jernholdig malm ellers @no
preferred label: Górnictwo pozostałych rud metali nieżelaznych @pl
preferred label: Extracção e preparação de outros minérios metálicos não-ferrosos @pt
preferred label: Extracţia altor minereuri metalifere neferoase @ro
preferred label: Добыча руд других цветных металлов @ru
preferred label: Dobývanie ostatných neželezných kovových rúd @sk
preferred label: Pridobivanje rud drugih neželeznih kovin @sl
preferred label: Utvinning av annan malm @sv
preferred label: Diğer demir dışı metal cevherlerin madenciliği @tr
broader: Mining of non-ferrous metal ores

Other mining and quarrying
type: Concept
notation: 08
status: valid
status modified: 2013-10-18
accepted date: 2013-10-18
in scheme: Statistical Classification of Economic Activities in the European Community, Rev. 2 (2008)
scope note: подземен или открит добив, както и добив чрез драгиране на наносни залежи, натрошаване на скални материали и добив на сол чрез изпаряване. Добитите суровини се използват в строителството (пясък, скални материали и други), за производство на глина, гипс и други материали или за химическото производство. - преработка на добитите неметални материали и суровини (с изключение на раздробяване, смилане, очистване, изсушаване, сортиране и смесване) @bg
scope note: Tento oddíl zahrnuje vedle těžby v dolech a lomech také bagrování nánosů, drcení kamene a využití solných bažin. Produkty jsou využívány zejména ve stavebnictví (např. písek, kameny), při výrobě stavebních hmot (např. jíl, sádrovec, vápenec), při výrobě chemikálií atd. Tento oddíl nezahrnuje zpracování získaných nerostů (kromě drcení, mletí, řezání, čištění, sušení, třídění a mísení). @cs
scope note: Diese Abteilung umfasst neben dem Betrieb von Bergwerken und Steinbrüchen auch Baggern von Schwemmland, Zerkleinern von Steinen und Ausbeutung von Salzgärten. Die Erzeugnisse werden insbesondere verwendet beim Bau (z. B. Sand, Steine usw.), zur Herstellung von Baumaterial (z. B. Ton, Gips, Kalk usw.), Chemikalien usw. Ausgeschlossen ist die Verarbeitung (außer Brechen, Mahlen, Schneiden, Waschen, Trocknen, Sortieren und Mischen) der gewonnenen Minerale. @de
scope note: This division includes extraction from a mine or quarry, but also dredging of alluvial deposits, rock crushing and the use of salt marshes. The products are used most notably in construction (e.g. sands, stones etc.), manufacture of materials (e.g. clay, gypsum, calcium etc.), manufacture of chemicals etc. This division does not include processing (except crushing, grinding, cutting, cleaning, drying, sorting and mixing) of the minerals extracted. @en
scope note: Esta división abarca la extracción en minas o canteras, así como el dragado de depósitos aluviales, la trituración de rocas y la utilización de salinas. Los productos se utilizan principalmente en la construcción (por ejemplo, arenas, piedras, etc.), la fabricación de materiales (por ejemplo, arcilla, yeso, calcio, etc.) y de productos químicos, etc. Esta división no comprende la elaboración (excepto la trituración, pulverización, corte, limpieza, secado, clasificación y mezcla) de los minerales extraídos. @es
scope note: Cette division couvre l’extraction en carrière mais aussi le dragage d’alluvions, le broyage de roches ou l’exploitation de marais salants. Les produits sont utilisés notamment dans la construction (sables, pierres, etc.), les fabrications de matériaux (argiles, gypse, calcium, etc.), la fabrication de produits chimiques, etc. Cette division ne comprend pas la transformation (sauf concassage, broyage, taille, nettoyage, séchage, triage et mélange) des produits minéraux extraits. @fr
scope note: Ovaj odjeljak uključuje ne samo vađenje u kamenolomu, nego i jaružanje nataloženog nanosa, lomljenje kamena i upotrebu isušivača pri dobivanju soli. Proizvodi se uglavnom upotrebljavaju u građevinarstvu (npr. pijesak, kamen itd.), u proizvodnji materijala (npr. gline, gipsa (sadre), kalcija itd.), pri proizvodnji kemijskih proizvoda itd. Ovaj odjeljak ne uključuje obradu izvađenih minerala (osim lomljenja, drobljenja, rezanja, čišćenja, sušenja, razvrstavanja i miješanja).
scope note: Į šį skyrių įeina ne tik gavyba šachtose ir karjeruose, bet ir sąnašinių nuosėdų valymas, uolienų trupinimas ir druskos džiovyklų naudojimas. Gauti produktai dažniausiai naudojami statyboje (pvz., smėlis, akmenys ir kt.) įvairioms medžiagoms (pvz., molis, gipsas, kalcis ir kt.), chemikalams gaminti ir kt. Į šį skyrių neįeina išgautų naudingųjų iškasenų apdorojimas, išskyrus trupinimą, smulkinimą, pjaustymą, valymą, džiovinimą, rūšiavimą ir maišymą. @lt
scope note: Этот класс включает: - подземную разработку, суммарную отрезку и распил строительного камня и материала для изготовления памятников, мемориалов и т.д., таких как мрамор, гранит, песчаник и т.д. - распил и дробление декоративного и строительного камня - подземную разработку, дробление и распил известняка - добычу гипса и ангидрита - добычу мела и не кальцинированного доломита Этот класс исключает: - добычу химических минералов и сырья для производства удобрений, см. 08.91 - производство кальцинированного доломита, см. 23.52 - резку, формовку и обработку камня за пределами карьера, см. 23.70 @ru
scope note: Bu bölüm sadece taş ocaklarındaki üretimi kapsamaz, ayrıca alüvyon çökeltilerinin taranmasını, kayaların kırılmasını, tuzları da kapsar. Bu ürünlerin önemli bir miktarı inşaat sektöründe (örn. kumlar, taşlar vb.), malzeme imalatında (örn. kil, alçıtaşı, kalsiyum gibi) ve kimyasalların vb. imalatında kullanılır. Bu bölüm, çıkarılan madenlerin işlenmesini (ezme, öğütme, kesme, ayıklama ve yıkama, kurutma, sınıflandırma ve karıştırma hariç) kapsamaz. @tr
preferred label: Добив на неметални материали и суровини @bg
preferred label: Ostatní těžba a dobývání @cs
preferred label: Anden råstofindvinding @da
preferred label: Gewinnung von Steinen und Erden, sonstiger Bergbau @de
preferred label: Λοιπά ορυχεία και λατομεία @el
preferred label: Otras industrias extractivas @es
preferred label: Muu kaevandamine @et
preferred label: Muu kaivostoiminta ja louhinta @fi
preferred label: Autres industries extractives @fr
preferred label: Egyéb bányászat
preferred label: Altre attività estrattive @it
preferred label: Kita kasyba ir karjerų eksploatavimas @lt
preferred label: Pārējā ieguves rūpniecība un karjeru izstrāde @lv
preferred label: Minjieri u barrieri oħra @mt
preferred label: Overige winning van delfstoffen @nl
preferred label: Bryting og bergverksdrift ellers @no
preferred label: Górnictwo i wydobywanie pozostałe @pl
preferred label: Outras indústrias extractivas @pt
preferred label: Alte activităţi extractive @ro
preferred label: Прочие отрасли горнодобывающей промышленности @ru
preferred label: Iná ťažba a dobývanie @sk
preferred label: Pridobivanje rudnin in kamnin @sl
preferred label: Annan utvinning av mineral @sv
preferred label: Diğer madencilik ve taş ocakçılığı @tr
broader: MINING AND QUARRYING
narrower: Quarrying of stone, sand and clay
narrower: Mining and quarrying n.e.c.

Quarrying of stone, sand and clay
type: Concept
notation: 08.1
status: valid
status modified: 2013-10-18
accepted date: 2013-10-18
in scheme: Statistical Classification of Economic Activities in the European Community, Rev. 2 (2008)
scope note: Этот класс включает: - добычу и драгирование промышленного песка, а также песка и гравия для строительных целей - дробление гравия - подземную разработку песка - добычу глины, огнеупорной глины и каолина Этот класс исключает: - добычу битуминозного песка, см. 06.10 @ru
preferred label: Добив на скални материали, пясък и глина @bg
preferred label: Dobývání kamene, písků a jílů @cs
preferred label: Brydning af sten og indvinding af sand og ler @da
preferred label: Gewinnung von Natursteinen, Kies, Sand, Ton und Kaolin @de
preferred label: Εξόρυξη λίθων, άμμου και αργίλου @el
preferred label: Extracción de piedra, arena y arcilla @es
preferred label: Kivi, liiva ja savi kaevandamine @et
preferred label: Kiven louhinta, hiekan ja saven otto @fi
preferred label: Extraction de pierres, de sables et d'argiles @fr
preferred label: Kőfejtés, homok-, agyagbányászat
preferred label: Estrazione di pietra, sabbia e argilla @it
preferred label: Akmens, smėlio ir molio karjerų eksploatavimas @lt
preferred label: Akmeņu, smilšu un māla ieguve @lv
preferred label: Qtugħ ta' ġebel, ramel u tafal mill-barrieri @mt
preferred label: Winning van steen, zand en klei @nl
preferred label: Bryting av stein, utvinning av sand og leire @no
preferred label: Wydobywanie kamienia, piasku i gliny @pl
preferred label: Extracção de pedra, areia e argila @pt
preferred label: Extracţia pietrei, nisipului şi argilei @ro
preferred label: Разработка каменных, глиняных и песчаных карьеров @ru
preferred label: Dobývanie kameňa, piesku a ílu @sk
preferred label: Pridobivanje kamna, peska in gline @sl
preferred label: Utvinning av sand, grus, sten och lera @sv
preferred label: Kum, kil ve taş ocakçılığı @tr
broader: Other mining and quarrying
narrower: Quarrying of ornamental and building stone, limestone, gypsum, chalk and slate
narrower: Operation of gravel and sand pits; mining of clays and kaolin

Quarrying of ornamental and building stone, limestone, gypsum, chalk and slate
type: Concept
notation: 08.11
status: valid
status modified: 2013-10-18
accepted date: 2013-10-18
in scheme: Statistical Classification of Economic Activities in the European Community, Rev. 2 (2008)
scope note: - добив, грубо обработване и нарязване на строителни и декоративни скални материали като мрамор, гранит, пясъчник и други - натрошаване и раздробяване на строителни и декоративни скални материали - добив, натрошаване и раздробяване на варовик - добив на суров гипс и анхидрит - добив на креда и некалциниран доломит - добив на шисти, грубо дялани или нарязани на блокове или на плочи с квадратна или правоъгълна форма - добив на минерални суровини за химическото производство и на естествени торове - 08.91 - производство на калциниран доломит - 23.52 - рязане, профилиране и обработване на строителни и декоративни скални материали извън кариерите - 23.70 @bg
scope note: Z: - těžbu kamene, hrubé otesání a řezání bloků stavebního kamene jako mramoru, žuly, pískovce atd. - drcení a mletí přírodních bloků a stavebního kamene - těžba a úpravu vápence - dobývání sádrovce a anhydritu - dobývání křídy a surového dolomitu N: - těžbu surovin pro chemický průmysl a výrobu průmyslových hnojiv (08.91) - výrobu páleného dolomitu (23.52) - opracování a formování kamene mimo lomy (23.70) @cs
scope note: Diese Klasse umfasst: - Gewinnung, Rohbehauen und Sägen von Werk- und Bausteinen wie Marmor, Granit, Sandstein usw. - Brechen und Mahlen von Naturwerksteinen und Natursteinen - Gewinnung und Aufbereitung von Kalkstein und Dolomitstein - Gewinnung von Gipsstein und Anhydrit - Gewinnung von Kreide und Rohdolomit Diese Klasse umfasst nicht: - Bergbau auf chemische und Düngemittelminerale (s. 08.91) - Herstellung von gebranntem Dolomit (s. 23.52) - Be- und Verarbeitung von Steinen außerhalb von Steinbrüchen (s. 23.70) @de
scope note: This class includes: - quarrying, rough trimming and sawing of monumental and building stone such as marble, granite, sandstone etc. - breaking and crushing of ornamental and building stone - quarrying, crushing and breaking of limestone - mining of gypsum and anhydrite - mining of chalk and uncalcined dolomite This class excludes: - mining of chemical and fertiliser minerals, see 08.91 - production of calcined dolomite, see 23.52 - cutting, shaping and finishing of stone outside quarries, see 23.70 @en
scope note: Esta clase comprende: - la extracción, desbastado y troceado por aserrado de las piedras de talla y de construcción como mármol, granito, areniscas, etc.; - la trituración y molido de piedra ornamental y de construcción; - la extracción, pulverización y trituración de piedra caliza; - la extracción de yeso y anhidrita; - la extracción de creta y dolomita no calcinada. Esta clase no comprende: - la extracción de minerales para la industria química y fertilizantes (véase 08.91); - la producción de dolomita calcinada (véase 23.52); - la talla, el labrado y el acabado de piedra fuera de las canteras (véase 23.70). @es
scope note: Cette classe comprend: - l’extraction, la taille grossière et le sciage de pierres de taille et de construction, par exemple: le marbre, le granit, le grès, etc. - le concassage et le broyage de pierres ornementales et de construction - l’extraction, le broyage et le concassage des pierres calcaires - l’extraction du gypse et de l’anhydrite - l’extraction de la craie et de la dolomite non calcinée Cette classe ne comprend pas: - l’extraction de minéraux pour l’industrie chimique et d’engrais mineéraux, voir 08.91 - la production de dolomite calcinée, voir 23.52 - la taille, le façonnage et le finissage de la pierre en dehors des carrières, voir 23.70 @fr
scope note: Ovaj razred uključuje: - vađenje, grubu obradu i piljenje ukrasnog i građevinskoga kamena poput mramora, granita, pješčenjaka itd. - drobljenje i lomljenje ukrasnog i građevinskoga kamena - vađenje, lomljenje i drobljenje vapnenca - vađenje gipsa (sadre) i anhidrida - vađenje krede i nevapneniziranog dolomita Ovaj razred isključuje: - vađenje minerala za kemikalije i gnojiva, vidi 08.91 - proizvodnju pečenog dolomita, vidi 23.52 - rezanje, oblikovanje i obradu kamena izvan kamenoloma, vidi 23.70
scope note: Į šią klasę įeina: - paminklinio ir statybinio akmens, tokio kaip marmuras, granitas, smiltainis ir kt., kasyba, rupus apdirbimas, pjaustymas - dekoratyvinio ir statybinio akmens skaldymas ir trupinimas - klinčių kasyba, trupinimas ir skaldymas - gipso ir anhidrito gavyba - kreidos ir nedegto dolomito kasyba Į šią klasę neįeina: - mineralinių iškasenų chemijos pramonei ir trąšoms gaminti kasyba, žr. 08.91 - degtojo dolomito gamyba, žr. 23.52 - akmens pjaustymas, tašymas ir apdaila ne karjeruose, žr. 23.70 @lt
scope note: Bu sınıf aşağıdakileri kapsamaktadır; - mermer, granit, kumtaşı gibi anıt ve inşaat taşlarının çıkarımı, kabaca kırpılması ve kesilmesi, - süsleme ve yapı taşlarının kırılması ve kesilmesi, - kireç taşının çıkarılması, parçalanması ve kırılması, - alçı taşı ve anhidrit madenciliği, - tebeşir ve yanmamış dolomit madenciliği. Kapsam dışı olanlar; - kimyasal ve gübreleme amaçlı mineral madenciliği, bkz. 08.91, - yanmış dolomit üretimi, bkz. 23.52, - taşın taş ocağı dışında kesilmesi, şekil verilmesi ve kullanılabilir hale getirilmesi , bkz. 23.70. @tr
preferred label: Добив на строителни и декоративни скални материали, варовик, суров гипс, креда, доломит и шисти @bg
preferred label: Dobývání kamene pro výtvarné nebo stavební účely, vápence, sádrovce, křídy a břidlice @cs
preferred label: Brydning af pynte- og bygningssten, kalksten, gips, kridt og skifer @da
preferred label: Gewinnung von Naturwerksteinen und Natursteinen, Kalk- und Gipsstein, Kreide und Schiefer @de
preferred label: Εξόρυξη διακοσμητικών και οικοδομικών λίθων, ασβεστόλιθου, γύψου, κιμωλίας και σχιστόλιθου @el
preferred label: Extracción de piedra ornamental y para la construcción, piedra caliza, yeso, creta y pizarra @es
preferred label: Dekoratiiv- ja ehituskivi, lubjakivi, kipsi, kriidi ja kiltkivi kaevandamine @et
preferred label: Koriste- ja rakennuskiven, kalkkikiven, kipsin, liidun ja liuskekiven louhinta @fi
preferred label: Extraction de pierres ornementales et de construction, de calcaire industriel, de gypse, de craie et d'ardoise @fr
preferred label: Kőfejtés, gipsz, kréta bányászata
preferred label: Estrazione di pietre ornamentali e da costruzione, calcare, pietra di gesso, creta e ardesia @it
preferred label: Dekoratyvinio ir statybinio akmens, klinčių, gipso, kreidos ir skalūno karjerų eksploatavimas @lt
preferred label: Būvakmeņu un dekoratīvo akmeņu ieguve, kaļķakmens, ģipša, krīta un slānekļa ieguve @lv
preferred label: Qtugħ ta' ġebel ornamentali u ġebel tal-bini, ġebel tal-franka, gypsum, ġibs, u lavanja @mt
preferred label: Winning van bouw- en siersteen, kalksteen, gips, krijt en leisteen @nl
preferred label: Bryting av stein til bygge- og anleggsvirksomhet, kalkstein, gips, kritt og skifer @no
preferred label: Wydobywanie kamieni ozdobnych oraz kamienia dla potrzeb budownictwa, skał wapiennych, gipsu, kredy i łupków @pl
preferred label: Extracção de rochas ornamentais e de outras pedras de construção, calcário, gesso, cré e ardósia @pt
preferred label: Extracţia pietrei ornamentale şi a pietrei pentru construcţii, extracţia pietrei calcaroase, ghipsului, cretei şi a ardeziei @ro
preferred label: Добыча декоративного и строительного камня, известняка, гипса, мела и сланцев @ru
preferred label: Dobývanie dekoračného a stavebného kameňa, vápenca, sadrovca, kriedy a bridlice @sk
preferred label: Pridobivanje kamna @sl
preferred label: Brytning av natursten, kalk- och gipssten, krita och skiffer @sv
preferred label: Süsleme ve yapı taşlarının, kireç taşı, alçı taşı, tebeşir ve kayağan taşı (bileği taşı) ocakçılığı @tr
broader: Quarrying of stone, sand and clay

Operation of gravel and sand pits; mining of clays and kaolin
type: Concept
notation: 08.12
status: valid
status modified: 2013-10-18
accepted date: 2013-10-18
in scheme: Statistical Classification of Economic Activities in the European Community, Rev. 2 (2008)
scope note: - извличане и драгиране на пясък за промишлени цели, пясък за строителството и чакъл - натрошаване и раздробяване на камък и чакъл - добив на пясък - добив на глина, огнеупорна глина и каолин - добив на битуминозен пясък - 06.10 @bg
scope note: Z: - těžbu a bagrování průmyslových písků, stavebních písků a štěrkopísků - dělení a drcení štěrkopísků - dobývání písků - těžbu jílů, ohnivzdorné hlíny a kaolinu N: - těžbu živičných písků (06.10) @cs
scope note: Diese Klasse umfasst: - Gewinnung und Ausbaggern von Sanden und Kiesen aller Art - Brechen und Mahlen von Kies - Gewinnung von Sand - Gewinnung von keramischem und feuerfestem Ton sowie Kaolin Diese Klasse umfasst nicht: - Gewinnung von bituminösen Sanden (s. 06.10) @de
scope note: This class includes: - extraction and dredging of industrial sand, sand for construction and gravel - breaking and crushing of gravel - quarrying of sand - mining of clays, refractory clays and kaolin This class excludes: - mining of bituminous sand, see 06.10 @en
scope note: Esta clase comprende: - la extracción y el dragado de arena industrial, arena para la construcción y grava; - la trituración y molido de grava; - la extracción de arena; - la extracción de arcilla, tierras refractarias y caolín. Esta clase no comprende: - la extracción de arena bituminosa (véase 06.10). @es
scope note: Cette classe comprend: - l’extraction et le dragage de sables industriels, de sables pour la construction et de graviers - le concassage et le broyage de graviers - l’extraction de sables - l’extraction d’argiles, de terres réfractaires et de kaolin Cette classe ne comprend pas: - l’extraction de sables bitumineux, voir 06.10 @fr
scope note: Ovaj razred uključuje: - vađenje i jaružanje industrijskog pijeska, pijeska za građevinarstvo i šljunka - lomljenje i drobljenje šljunka - vađenje pijeska - vađenje gline, vatrostalne gline i kaolina Ovaj razred isključuje: - vađenje bitumeniziranog pijeska, vidi 06.10
scope note: Į šią klasę įeina: - pramoninio ir statybinio smėlio bei žvyro gavyba ir kasyba - žvyro smulkinimas ir trupinimas - smėlio kasyba - molio, ugniai atsparaus molio ir kaolino kasyba Į šią klasę neįeina: - bitumingojo smėlio kasyba, žr. 06.10 @lt
scope note: Этот класс включает: - добычу природных фосфатов и природных калийных солей - добычу натуральной серы - добычу и подготовку колчеданов, за исключением обжига - добычу природной углекислой соли сульфата бария (баритов и т.п.), природного барита, природного сульфата магния (кизерита) - добычу природных пигментов, флюорита и прочих минералов как ценных источников химических веществ Этот класс также включает: - добычу гуано Этот класс исключает: - добычу соли, см. 08.93 - обжиг железного колчедана, см. 20.13 - производство химических удобрений и азотных соединений, см. 20.15 @ru
scope note: Bu sınıf aşağıdakileri kapsamaktadır; - endüstriyel kumların çıkarımı ve taranması, inşaat için kum ve çakıl, - çakıl taşının kırılması ve parçalanması, - kum ocakçılığı, - kil, refraktör killer ve kaolin (arı kil) madenciliği. Kapsam dışı olanlar; - bitümlü (katranlı) kumların madenciliği, bkz. 06.10. @tr
preferred label: Добив на трошен камък, чакъл и пясък; добив на глина и каолин @bg
preferred label: Provoz pískoven a štěrkopískoven; těžba jílů a kaolinu @cs
preferred label: Grus- og sandgravning; indvinding af ler og kaolin @da
preferred label: Gewinnung von Kies, Sand, Ton und Kaolin @de
preferred label: Λειτουργία φρεάτων παραγωγής αμμοχάλικου και άμμου· εξόρυξη αργίλου και καολίνης @el
preferred label: Extracción de gravas y arenas; extracción de arcilla y caolín @es
preferred label: Kruusa- ja liivakarjääride tegevus; savi ja kaoliini kaevandamine @et
preferred label: Soran, hiekan, saven ja kaoliinin otto @fi
preferred label: Exploitation de gravières et sablières, extraction d'argiles et de kaolin @fr
preferred label: Kavics-, homok-, agyagbányászat
preferred label: Estrazione di ghiaia e sabbia; estrazione di argille e caolino @it
preferred label: Smėlio ir žvyro karjerų eksploatavimas; molio ir kaolino kasyba @lt
preferred label: Grants un smilts karjeru izstrāde; māla un kaolīna ieguve @lv
preferred label: Operazzjoni ta' fosos taż-żrar u r-ramel; qtugħ ta' tafal u kawlina mill-minjieri @mt
preferred label: Winning van grind, zand, klei en kaolien @nl
preferred label: Utvinning fra grus- og sandtak, og utvinning av leire og kaolin @no
preferred label: Wydobywanie żwiru i piasku; wydobywanie gliny i kaolinu @pl
preferred label: Extracção de saibro, areia e pedra britada; extracção de argilas e caulino @pt
preferred label: Extracţia pietrişului şi nisipului; extracţia argilei şi caolinului @ro
preferred label: Разработка гравийных и песчаных карьеров, добыча глины и каолина @ru
preferred label: Prevádzka štrkovísk a pieskovísk; ťažba ílu a kaolínu @sk
preferred label: Pridobivanje gramoza, peska, gline @sl
preferred label: Utvinning av sand, grus och berg; utvinning av lera och kaolin @sv
preferred label: Çakıl ve kum ocaklarının faaliyetleri; kil ve kaolin (arı kil) çıkarımı @tr
broader: Quarrying of stone, sand and clay

Mining and quarrying n.e.c.
type: Concept
notation: 08.9
status: valid
status modified: 2013-10-18
accepted date: 2013-10-18
in scheme: Statistical Classification of Economic Activities in the European Community, Rev. 2 (2008)
scope note: Этот класс включает: - разработку месторождений торфа - подготовку торфа для улучшения качества, удобства транспортировки или хранения Этот класс исключает: - виды деятельности, сопутствующие добыче торфа, см. 09.90 - производство торфяных брикетов, см. 19.20 - производство брикетов торфа, смешанного с почвой, природным грунтом, песком, глиной, минеральными удобрениями и т.д., см. 20.15 - производство торфяных изделий, см. 23.99 @ru
preferred label: Добив на други неметални материали и суровини @bg
preferred label: Těžba a dobývání j. n. @cs
preferred label: Råstofindvinding i.a.n. @da
preferred label: Sonstiger Bergbau; Gewinnung von Steinen und Erden a. n. g. @de
preferred label: Ορυχεία και λατομεία π.δ.κ.α. @el
preferred label: Industrias extractivas n.c.o.p. @es
preferred label: Mujal liigitamata kaevandamine @et
preferred label: Muu mineraalien kaivu @fi
preferred label: Activités extractives n.c.a. @fr
preferred label: M.n.s. bányászat
preferred label: Estrazione di minerali e prodotti di cava n.c.a. @it
preferred label: Niekur kitur nepriskirta kasyba ir karjerų eksploatavimas @lt
preferred label: Citur neklasificēta ieguves rūpniecība un karjeru izstrāde @lv
preferred label: Minjieri u barrieri n.e.c. @mt
preferred label: Winning van delfstoffen, n.e.g. @nl
preferred label: Annen bryting og utvinning @no
preferred label: Górnictwo i wydobywanie gdzie indziej niesklasyfikowane @pl
preferred label: Indústrias extractivas, n.e. @pt
preferred label: Alte activităţi extractive n.c.a. @ro
preferred label: Отрасли горнодобывающей промышленности и разработка карьеров, не включенные в другие группировки @ru
preferred label: Ťažba a dobývanie i. n. @sk
preferred label: Pridobivanje drugih rudnin in kamnin @sl
preferred label: Övrig utvinning av mineral @sv
preferred label: Başka yerde sınıflandırılmamış madencilik ve taş ocakçılığı @tr
broader: Other mining and quarrying
narrower: Mining of chemical and fertiliser minerals
narrower: Extraction of peat
narrower: Extraction of salt
narrower: Other mining and quarrying n.e.c.

Mining of chemical and fertiliser minerals
type: Concept
notation: 08.91
status: valid
status modified: 2013-10-18
accepted date: 2013-10-18
in scheme: Statistical Classification of Economic Activities in the European Community, Rev. 2 (2008)
scope note: - добив на естествени фосфати и естествени калиеви соли - добив на сяра, необработена и непречистена - добив и обогатяване на железни пирити и пиротити, без пържените - добив на естествен бариев сулфат и карбонат (баритин и витерит), естествени магнезиеви сулфати (кизерит), естествени борати - добив на минерални оцветители, флусшпат и други минерални суровини, използвани предимно като суровини в химическото производство - добив на тор от птици (гуано) - добив на сол - 08.93 - пържене на железни пирити - 20.13 - производство на азотни съединения и изкуствени торове - 20.15 @bg
scope note: Z: - těžbu přírodních fosfátů a přírodních draselných solí - těžbu přírodní síry - těžbu a úpravu pyritu a pyrhotinu, kromě pražení - těžbu přírodního síranu a uhličitanu barnatého (barytu a witheritu), přírodního boratanu, přírodního síranu hořečnatého (kieseritu) - těžbu zemních hlinek a kazivce a jiných nerostných výchozích surovin pro výrobu chemikálií ZT: - těžbu guána N: - těžbu soli (08.93) - pražení pyritů (20.13) - výrobu umělých hnojiv a sloučenin dusíku (20.15) @cs
scope note: Diese Klasse umfasst: - Gewinnung von natürlichen Phosphaten und natürlichen Kalisalzen - Gewinnung von natürlichem Schwefel - Gewinnung und Aufbereitung von Schwefel- und Magnetkies, ohne Rösten - Gewinnung von natürlichem Bariumsulfat und -karbonat (Schwerspat und Witherit), natürlichem Borat, natürlichem Magnesiumsulfat (Kieserit) - Gewinnung von Farberden und Flussspat und anderen mineralischen Ausgangsstoffen für Chemikalien Diese Klasse umfasst ferner: - Gewinnung von Guano Diese Klasse umfasst nicht: - Gewinnung von Salz (s. 08.93) - Rösten von Eisenkies (s. 20.13) - Herstellung von Kunstdünger und Stickstoffverbindungen (s. 20.15) @de
scope note: This class includes: - mining of natural phosphates and natural potassium salts - mining of native sulphur - extraction and preparation of pyrites and pyrrhotite, except roasting - mining of natural barium sulphate and carbonate (barytes and witherite), natural borates, natural magnesium sulphates (kieserite) - mining of earth colours, fluorspar and other minerals valued chiefly as a source of chemicals This class also includes: - guano mining This class excludes: - extraction of salt, see 08.93 - roasting of iron pyrites, see 20.13 - manufacture of synthetic fertilisers and nitrogen compounds, see 20.15 @en
scope note: Esta clase comprende: - la extracción de fosfatos naturales y sales de potasio naturales; - la extracción de azufre; - la extracción y preparación de piritas y pirrotita, excepto el tostado; - la extracción de sulfatos y de carbonatos de bario naturales (baritina y witherita), de boratos naturales, de sulfatos de magnesio naturales (kieserita); - la extracción de tierras colorantes, espato fluor y otros minerales valorados fundamentalmente como fuente de productos químicos. Esta clase comprende también: - la extracción de guano. Esta clase no comprende: - la extracción de sal (véase 08.93); - el tostado de piritas de hierro (véase 20.13); - la fabricación de fertilizantes sintéticos y de compuestos nitrogenados (véase 20.15). @es
scope note: Cette classe comprend: - l’extraction de phosphates naturels et de sels potassiques naturels - l’extraction du soufre natif - l’extraction et la préparation de la pyrite et de la pyrrhotite, à l’exception du grillage - l’extraction de sulfates et de carbonates naturels de baryum (barytine et withérite), de borates naturels, de sulfates naturels de magnésium (kiesérite) - l’extraction de terres colorantes, de "spath fluor" et d’autres minéraux exploités principalement parce qu’ils constituent une source de produits chimiques Cette classe comprend également: - le ramassage du guano Cette classe ne comprend pas: - l’extraction de sel, voir 08.93 - le grillage de la pyrite de fer, voir 20.13 - la fabrication d’engrais chimiques et de composés azotés, voir 20.15 @fr
scope note: Ovaj razred uključuje: - vađenje prirodnih fosfata i prirodnih kalijevih soli - vađenje prirodnih sumpora - vađenje i pripremu pirita i pirotita, osim prženja - vađenje prirodnog barijeva sulfata i karbonata (barita i viterita), prirodnog barita, prirodnog magnezijeva sulfata (kiserita) - vađenje zemljanih boja, fluorita i drugih minerala vrednovanih uglavnom zbog sadržaja kemikalija Ovaj razred također uključuje: - kopanje guana Ovaj razred isključuje: - vađenje soli, vidi 08.93 - prženje željeznoga pirita, vidi 20.13 - proizvodnju umjetnih gnojiva i dušičnih spojeva, vidi 20.15
scope note: Į šią klasę įeina: - gamtinių fosfatų ir kalio druskų kasyba - gamtinės sieros kasyba - piritų ir pirotinų gavyba ir paruošimas lydymui, išskyrus iškaitinimą - gamtinių bario sulfato (baritas) ir karbonato (viteritas ir baritas), gamtinių boratų, gamtinių magnio sulfatų (kizerito) kasyba - gamtinių pigmentų, fluorito ir kitų iškasenų, vertinamų dėl jose esančių chemikalų, kasyba Į šią klasę taip pat įeina: - guano (išdžiūvusio laukinių paukščių mėšlo) kasyba Į šią klasę neįeina: - druskos gavyba, žr. 08.93 - geležies piritų iškaitinimas, žr. 20.13 - cheminių trąšų ir azoto junginių gamyba, žr. 20.15 @lt
scope note: Этот класс включает: - подземную добычу соли, включая растворение, подачу насосом - производство соли посредством выпаривания морской воды или прочих видов соленой воды - дробление, очищение и рафинирование соли производителем Этот класс исключает: - переработку соли для приема в пищу, например йодированная соль, см. 10.84 - производство питьевой воды путем выпаривания соленой воды, см. 36.00 @ru
scope note: Bu sınıf aşağıdakileri kapsamaktadır; - doğal potasyum tuzları ve doğal fosfor madenciliği, - saf kükürt madenciliği, - pirit ve pirotit madenciliği ve işlenmesi (kavrulması hariç), - doğal baryum sülfat ve karbonat (barit ve baryum karbonat), doğal borlar, doğal magnezyum sülfat (kieserit) madenciliği, - esas olarak bir çeşit kimyasal kaynak olarak değerlendirilen toprak boyalar ve fluorit madenciliği. Ayrıca bu sınıf aşağıdakileri de kapsamaktadır; - guano madenciliği (kuş gübresi). Kapsam dışı olanlar; - tuz çıkarımı, bkz. 08.93, - demirli pirit kavrulması, bkz. 20.13, - suni gübre ve azotlu bileşiklerin imalatı, bkz. 20.15. @tr
preferred label: Добив на минерални суровини за химическото производство и на естествени торове @bg
preferred label: Těžba chemických minerálů a minerálů pro výrobu hnojiv @cs
preferred label: Indvinding af mineraler til fremstilling af kemiske produkter og gødningsstoffer @da
preferred label: Bergbau auf chemische und Düngemittelminerale @de
preferred label: Εξόρυξη ορυκτών για τη χημική βιομηχανία και τη βιομηχανία λιπασμάτων @el
preferred label: Extracción de minerales para productos químicos y fertilizantes @es
preferred label: Kemikaalide ja mineraalväetiste toorme kaevandamine @et
preferred label: Kemiallisten ja lannoitemineraalien louhinta @fi
preferred label: Extraction des minéraux chimiques et d'engrais minéraux @fr
preferred label: Vegyi ásvány bányászata
preferred label: Estrazione di minerali per l'industria chimica e per la produzione di fertilizzanti @it
preferred label: Mineralinių iškasenų chemijos pramonei ir trąšoms gaminti kasyba @lt
preferred label: Ķimikāliju un minerālmēslu ražošanā izmantojamo minerālu ieguve @lv
preferred label: Qtugħ ta' minerali kimiċi u fertilizzanti mill-minjieri @mt
preferred label: Winning van mineralen voor de chemische en de kunstmestindustrie @nl
preferred label: Bryting og utvinning av kjemiske mineraler og gjødselsmineraler @no
preferred label: Wydobywanie minerałów dla przemysłu chemicznego oraz do produkcji nawozów @pl
preferred label: Extracção de minerais para a indústria química e para a fabricação de adubos @pt
preferred label: Extracţia mineralelor pentru industria chimică şi a îngrăşămintelor naturale @ro
preferred label: Добыча минерального сырья для химической промышленности и производства удобрений @ru
preferred label: Ťažba chemických a hnojivových minerálov @sk
preferred label: Pridobivanje mineralov za kemikalije in gnojila @sl
preferred label: Brytning av kemiska mineral @sv
preferred label: Kimyasal ve gübreleme amaçlı mineral madenciliği @tr
broader: Mining and quarrying n.e.c.

Extraction of peat
type: Concept
notation: 08.92
status: valid
status modified: 2013-10-18
accepted date: 2013-10-18
in scheme: Statistical Classification of Economic Activities in the European Community, Rev. 2 (2008)
scope note: - добив на торф - предварително обработване на торфа с цел подобряване на качеството или улеснение при транспортиране или съхранение - спомагателни дейности в добива на торф - 09.90 - производство на брикети от торф - 19.20 - производство на саксийна пръст, смес от торф, естествена пръст, пясък, глина и минерали - 20.15 - производство на изделия от торф - 23.99 @bg
scope note: Z: - těžbu rašeliny - úpravu rašeliny za účelem zlepšení kvality nebo zjednodušení dopravy nebo skladování N: - vedlejší (podpůrné) služby při těžbě rašeliny (09.90) - výrobu briket z rašeliny (19.20) - výrobu zahradních směsí z rašeliny, zeminy, humusu, písků, jílů, minerálních hnojiv atd. (20.15) - výrobu předmětů z rašeliny (23.99) @cs
scope note: Diese Klasse umfasst: - Torfgewinnung - Aufbereitung von Torf zur Qualitätsverbesserung oder zur Vereinfachung der Beförderung oder Lagerung Diese Klasse umfasst nicht: - Erbringung von Dienstleistungen bei der Torfgewinnung (s. 09.90) - Herstellung von Torfbriketts (s. 19.20) - Herstellung von Topferdemischungen aus Torf, Humus, Sand, Ton, mineralischen Düngemitteln usw. (s. 20.15) - Herstellung von Torfwaren (s. 23.99) @de
scope note: This class includes: - peat digging - preparation of peat to improve quality or facilitate transport or storage This class excludes: - service activities incidental to peat mining, see 09.90 - manufacturing of peat briquettes, see 19.20 - manufacture of potting soil mixtures of peat, natural soil, sands, clays, fertiliser minerals etc., see 20.15 - manufacture of articles of peat, see 23.99 @en
scope note: Esta clase comprende: - la extracción de turba; - la preparación de la turba para mejorar su calidad o facilitar su transporte o almacenamiento Esta clase no comprende: - los servicios relacionados con la extracción de turba (véase 09.90); - la fabricación de briquetas de turba (véase 19.20) - la fabricación de sustrato de turba, tierra natural, arenas, arcillas, minerales fertilizantes, etc. (véase 20.15) - la fabricación de artículos de turba (véase 23.99). @es
scope note: Cette classe comprend: - l’extraction de la tourbe - la préparation de la tourbe afin d’accroître la qualité et de faciliter le transport ou le stockage. Cette classe ne comprend pas: - les services de soutien à l’extraction de la tourbe, voir 09.90 - la fabrication de briquettes de tourbe, voir 19.20 - la fabrication de mélanges pour plantes en pots à base de tourbe, de terre naturelle, de sables, d’argiles, d’engrais, etc., voir 20.15 - la fabrication d’ouvrages en tourbe, voir 23.99 @fr
scope note: Ovaj razred uključuje: - vađenje treseta - pripremu treseta radi poboljšanja kvalitete, lakšeg transporta ili skladištenja Ovaj razred isključuje: - uslužne djelatnosti povezane s vađenjem treseta, vidi 09.90 - proizvodnju briketiranog treseta, vidi 19.20 - proizvodnju zemlje za cvijeće (mješavine treseta, prirodne zemlje, pijeska, ilovače, mineralnih gnojiva itd.), vidi 20.15 - proizvodnju predmeta od treseta, vidi 23.99
scope note: Į šią klasę įeina: - durpių kasimas - durpių paruošimas, siekiant pagerinti kokybę ar palengvinti jų transportavimą ar saugojimą Į šią klasę neįeina: - durpių kasybai būdingų paslaugų veikla, žr. 09.90 - durpių briketų gamyba, žr. 19.20 - vazoniniams augalams skirtų žemės mišinių iš durpių, natūralaus dirvožemio, smėlio, molio, trąšomis prisotintų mineralų ir kt., gamyba, žr. 20.15 - durpių gaminių gamyba, žr. 23.99 @lt
scope note: Этот класс включает: - добычу и подземную разработку различных минералов и материалов: • абразивных материалов, асбеста, кремниевых инфузорных пород, натурального графита, мыльного камня (талька), полевого шпата и т.д. • природного асфальта, асфальтовых и битумных пород; природного твердого битума • драгоценных камней, кварца, слюды и т.д. @ru
scope note: Bu sınıf aşağıdakileri kapsamaktadır; - turba çıkarımı, - taşımacılığını ya da depolanmasını gerçekleştirmek veya kalitesini arttırmak amacıyla turbanın hazırlanması. Kapsam dışı olanlar; - turba madenciliği ile ilgili hizmet faaliyetleri, bkz. 09.90, - turba briketlerinin imalatı, bkz. 19.20, - turba, doğal toprak, kum, kil, gübre mineralleri vb.den saksı toprağı karışımlarının imalatı, bkz. 20.15, - turba ürünlerinin imalatı, bkz. 23.99. @tr
preferred label: Добив на торф @bg
preferred label: Těžba rašeliny @cs
preferred label: Indvinding af tørv @da
preferred label: Torfgewinnung @de
preferred label: Εξόρυξη τύρφης @el
preferred label: Extracción de turba @es
preferred label: Turba tootmine @et
preferred label: Turpeen nosto @fi
preferred label: Extraction de tourbe @fr
preferred label: Tőzegkitermelés
preferred label: Estrazione di torba @it
preferred label: Durpių gavyba @lt
preferred label: Kūdras ieguve @lv
preferred label: Estrazzjoni ta' pit @mt
preferred label: Winning van turf @nl
preferred label: Stikking av torv @no
preferred label: Wydobywanie torfu @pl
preferred label: Extracção de turfa @pt
preferred label: Extracţia turbei @ro
preferred label: Добыча торфа @ru
preferred label: Ťažba rašeliny @sk
preferred label: Pridobivanje šote @sl
preferred label: Torvutvinning @sv
preferred label: Turba (az çok kömürleşmiş bitkilerden oluşan yakıt, çürümüş bitkilerden oluşan yer kömürü) çıkarımı @tr
broader: Mining and quarrying n.e.c.

Extraction of salt
type: Concept
notation: 08.93
status: valid
status modified: 2013-10-18
accepted date: 2013-10-18
in scheme: Statistical Classification of Economic Activities in the European Community, Rev. 2 (2008)
scope note: - добив на каменна сол, миннодобита или чрез разтваряне и изпомпване - производство на сол чрез изпаряване на морска вода или други солени водоизточници - натрошаване, пречистване и рафиниране на сол на мястото на добива - преработка на сол за хранителни цели, вкл. йодиране на сол - 10.84 - производство на питейна вода чрез изпаряване на солена вода - 36.00 @bg
scope note: Z: - hlubinnou těžbu soli, také těžbu rozpouštěním a čerpáním - výrobu soli z mořské nebo jiné solné vody odpařováním - drcení, čištění a rafinaci surové soli u výrobce N: - zpracování soli na jedlou sůl, např. jodizovanou sůl (10.84) - výrobu pitné vody odpařováním ze slané vody (36.00) @cs
scope note: Diese Klasse umfasst: - Salzbergbau, auch durch Aussolung und Pumpen - Salzgewinnung durch Verdunstung von Meerwasser oder Sole - Zerkleinern, Reinigen und Raffinieren von Rohsalz durch den Erzeuger Diese Klasse umfasst nicht: - Verarbeitung von Salz zu Speisesalz, z. B. iodiertem Salz (s. 10.84) - Trinkwassergewinnung durch Verdunstung von Salzwasser (s. 36.00) @de
scope note: This class includes: - extraction of salt from underground including by dissolving and pumping - salt production by evaporation of sea water or other saline waters - crushing, purification and refining of salt by the producer This class excludes: - processing of salt into food-grade salt, e.g. iodised salt, see 10.84 - potable water production by evaporation of saline water, see 36.00 @en
scope note: Esta clase comprende: - la extracción de sal de yacimientos subterráneos, incluidos la disolución y el bombeo; - la producción de sal por evaporación del agua de mar y de otras aguas salinas; - el molido, la purificación y el refinado de sal por el productor. Esta clase no comprende: - la preparación de la sal para su consumo, por ejemplo, sal yodada (véase 10.84); - la producción de agua potable por evaporación de aguas salinas (véase 36.00). @es
scope note: Cette classe comprend: - l’extraction souterraine du sel, y compris par dissolution et pompage - la production de sel par évaporation de l’eau de mer ou d’autres eaux salées - le broyage, la purification et le raffinage du sel par le producteur Cette classe ne comprend pas: - le traitement du sel pour le rendre propre à la consommation humaine, par exemple: du sel iodé, voir 10.84 - la production d’eau potable par évaporation d’eaux salées, voir 36.00 @fr
scope note: Ovaj razred uključuje: - vađenje soli podzemnim kopom, uključujući otapanje i crpljenje - proizvodnju soli isparavanjem morske vode i drugih slanih voda - drobljenje, čišćenje i rafiniranje soli od strane proizvođača Ovaj razred isključuje: - preradu soli u sol koja se upotrebljava u prehrani, npr. jodiranu sol, vidi 10.84 - proizvodnju pitke vode isparavanjem slane vode, vidi 36.00
scope note: Į šią klasę įeina: - požeminė druskos gavyba, įskaitant ištirpinimą ir išsiurbimą - druskos gamyba, išgarinant jūros arba kitus sūrius vandenis - druskos smulkinimas, gryninimas ir valymas, kurį atlieka gamintojas Į šią klasę neįeina: - druskos perdirbimas į valgomąją druską, pvz., joduotąją druską, žr. 10.84 - geriamojo vandens gamyba, garinant sūrų jūros vandenį, žr. 36.00 @lt
scope note: Данный раздел включает специализированную помощь, сопутствующую горнодобывающей промышленности, предоставляемую за вознаграждение или на договорной основе. Он включает поисково-разведочные работы с использованием традиционных методов разведки, таких как, добыча образцов руды и проведение геологических исследований, а также разработка скважин и бурение, пробное бурение или повторное бурение нефтяных скважин, добыча металлических и неметаллических минералов, прочие услуги по бурению нефтяных и газовых скважин и построению их основания, цементирование нефтегазовых скважин, извлечение породы, выкачивание воды из скважин и их свабирование, дренаж и откачивание воды насосами, услуги по удалению вскрыши и т.д. @ru
scope note: Bu sınıf aşağıdakileri kapsamaktadır; - eritilerek ve pompalanarak yer altından tuz çıkarımı, - deniz suyu veya diğer tuzlu suların buharlaştırılması yoluyla tuz üretimi, - üretici tarafından tuzun ezilmesi , saflaştırılması ve rafine edilmesi. Kapsam dışı olanlar; - tuzun yemeklik tuza dönüştürülmesi, örn. iyotlu tuz, bkz. 10.84, - tuzlu suların buharlaştırılması yolluyla içilebilir su üretimi, bkz. 36.00. @tr
preferred label: Добив на сол @bg
preferred label: Těžba soli @cs
preferred label: Saltindvinding @da
preferred label: Gewinnung von Salz @de
preferred label: Εξόρυξη αλατιού @el
preferred label: Extracción de sal @es
preferred label: Soola kaevandamine @et
preferred label: Suolan tuotanto @fi
preferred label: Production de sel @fr
preferred label: Sókitermelés
preferred label: Estrazione di sale @it
preferred label: Druskos gavyba @lt
preferred label: Sāls ieguve @lv
preferred label: Estrazzjoni ta' melħ @mt
preferred label: Zoutwinning @nl
preferred label: Utvinning av salt @no
preferred label: Wydobywanie soli @pl
preferred label: Extracção de sal @pt
preferred label: Extracţia sării @ro
preferred label: Добыча соли @ru
preferred label: Ťažba soli @sk
preferred label: Pridobivanje soli @sl
preferred label: Saltutvinning @sv
preferred label: Tuz çıkarımı @tr
broader: Mining and quarrying n.e.c.

Other mining and quarrying n.e.c.
type: Concept
notation: 08.99
status: valid
status modified: 2013-10-18
accepted date: 2013-10-18
in scheme: Statistical Classification of Economic Activities in the European Community, Rev. 2 (2008)
scope note: - подземен и открит добив на минерали и други природни материали: • абразивни материали, азбест, талк, силициеви флюси, природен графит, фелдшпат и други подобни материали • природен асфалт, асфалтити и асфалтени скали, природен битум • скъпоценни камъни, кварц, слюда @bg
scope note: Z: - těžbu a dobývání různých minerálů a surovin: • brusných materiálů, azbestu, křemelinu, přírodních grafitů, mastku (talku), živce atd. • přírodního asfaltu; asfaltitu a asfaltového kamene; přírodní pevné živice (bitumen) • drahokamů i polodrahokamů, křemene, slídy atd. @cs
scope note: Diese Klasse umfasst: - Gewinnung von verschiedenen Mineralen und Rohstoffen: • Schleifstoffe, Asbest, Kieselgur, natürlicher Grafit, Steatit (Talk), Feldspat usw. Naturasphalt; Asphaltite und Asphaltgestein; natürliches festes Bitumen • Edelsteine, Quarz, Glimmer usw. @de
scope note: This class includes: - mining and quarrying of various minerals and materials: • abrasive materials, asbestos, siliceous fossil meals, natural graphite, steatite (talc), feldspar etc. • natural asphalt, asphaltites and asphaltic rock; natural solid bitumen • gemstones, quartz, mica etc. @en
scope note: Esta clase comprende: - la extracción de minerales y materiales diversos: • materias abrasivas, amianto, harinas fósiles de silicio, grafito natural, esteatita (talco), feldespato, etc. • asfalto natural, asfaltita y rocas asfálticas; betún sólido natural • piedras preciosas, cuarzo, mica, etc. @es
scope note: Cette classe comprend: - l’extraction de minéraux et de matériaux divers: • matières abrasives, amiante, farines siliceuses fossiles, graphite naturel, stéatite (talc), feldspath, etc. • asphaltes naturels, asphaltites et roches asphaltiques, bitumes solides naturels • pierres gemmes, quartz, mica, etc. @fr
scope note: Ovaj razred uključuje: - rudarstvo i vađenje različitih minerala i materijala: • abrazivnih materijala, azbesta, silicijskih fosila, prirodnoga grafita, talka, feldspata itd. • prirodnog asfalta, asfaltnog kamena i prirodnog čvrstog bitumena • dragoga kamenja, kremena, liskuna itd.
scope note: Į šią klasę įeina: - įvairių mineralinių iškasenų ir medžiagų kasyba ir gavyba: • abrazyvinių medžiagų, asbesto, silicinio diatomito, gamtinio grafito, steatito (talko), putnago ir kt. • gamtinio asfalto, asfaltito ir asfaltinio akmens; kietojo gamtinio bitumo • brangakmenių, kvarco, žėručio ir kt. @lt
scope note: Bu sınıf aşağıdakileri kapsamaktadır; - çeşitli mineral ve materyallerin madenciliği ve taş ocakçılığı; • aşındırıcı (törpüleyici) materyaller (zımpara), amyant, silisli fosil artıklar, doğal grafit, sabuntaşı (talk), feldispat vb., • doğal asfalt, asfaltit ve asfaltlı taş; doğal katı zift, • kıymetli taşlar, kuvars, mika vb. @tr
preferred label: Добив на други неметални материали и суровини, некласифицирани другаде @bg
preferred label: Ostatní těžba a dobývání j. n. @cs
preferred label: Anden råstofindvinding i.a.n. @da
preferred label: Gewinnung von Steinen und Erden a. n. g. @de
preferred label: Άλλες εξορυκτικές και λατομικές δραστηριότητες π.δ.κ.α. @el
preferred label: Otras industrias extractivas n.c.o.p. @es
preferred label: Muu mujal liigitamata kaevandamine @et
preferred label: Muualla luokittelematon kaivostoiminta ja louhinta @fi
preferred label: Autres activités extractives n.c.a. @fr
preferred label: Egyéb m.n.s. bányászat
preferred label: Altre attività estrattive n.c.a. @it
preferred label: Kita, niekur kitur nepriskirta, kasyba ir karjerų eksploatavimas @lt
preferred label: Citur neklasificēta pārējā ieguves rūpniecība @lv
preferred label: Minjieri u barrieri oħra n.e.c. @mt
preferred label: Overige winning van delfstoffen, n.e.g. @nl
preferred label: Annen bryting og utvinning ikke nevnt annet sted @no
preferred label: Górnictwo i wydobywanie pozostałe, gdzie indziej niesklasyfikowane @pl
preferred label: Outras indústrias extractivas, n.e. @pt
preferred label: Alte activităţi extractive n.c.a. @ro
preferred label: Прочие отрасли горнодобывающей промышленности, не включенные в другие категории @ru
preferred label: Iná ťažba a dobývanie i. n. @sk
preferred label: Drugo pridobivanje rudnin in kamnin @sl
preferred label: Diverse övrig utvinning av mineral @sv
preferred label: Başka yerde sınıflandırılmamış diğer madencilik ve taş ocakçılığı @tr
broader: Mining and quarrying n.e.c.

Mining support service activities
type: Concept
notation: 09
status: valid
status modified: 2013-10-18
accepted date: 2013-10-18
in scheme: Statistical Classification of Economic Activities in the European Community, Rev. 2 (2008)
scope note: спомагателни дейности в добива, извършвани срещу заплащане (по договор или еднократно). Тук са включени услугите по проучване на нефтените кладенци, рудните или минералните залежи посредством традиционните изследователски методи, като вземане на проба от ядката и извършване на геоложки проучвания чрез сондиране. услуги по изграждане, циментиране, почистване, изпомпване и събиране на водата в нефтените и газовите кладенци, както и отводняване (дрениране) и изпомпване на водата в мините. Тук се отнасят и услугите, свързани с изнасяне и преместване на мините. @bg
scope note: Tento oddíl zahrnuje specializované podpůrné služby, týkající se těžby, pokud jsou na základě smlouvy nebo dohody. Zahrnuje průzkumné práce prováděné formou obvyklých průzkumných metod, jako vrtání vrtných jader a geologické monitorování a vrty všeho druhu za účelem těžby ropy a kovových a nekovových nerostů. Dalšími typickými službami jsou budování základů ropných a plynových vrtů, cementování ochranných trubek pro ropné a plynové vrty, čištění ropných a plynových vrtů, drenážování (odvodňování) a odčerpávání dolů, odstraňování skrývek pro doly atd. @cs
scope note: Diese Abteilung umfasst im Lohnauftrag erbrachte spezialisierte Dienstleistungen zur Unterstützung des Bergbaus und der Gewinnung von Steinen und Erden. Hierzu zählen Erkundungsleistungen im Form herkömmlicher Prospektierungsmethoden, etwa das Erbohren von Bohrkernen und geologische Beobachtungen sowie Bohrungen jeder Art zur Gewinnung von Öl sowie von metallischen und nichtmetallischen Mineralen. Weitere typische Dienstleistungen sind der Bau von Fundamenten von Öl- und Gasbohrungen, das Zementieren von Mantelrohren für Öl- und Gasbohrungen, Spülen und Molchen von Öl- und Gasbohrungen, Entwässern und Auspumpen von Bergwerken, Abraumbeseitigung für Bergwerke usw. @de
scope note: This division includes specialised support services incidental to mining provided on a fee or contract basis. It includes exploration services through traditional prospecting methods such as taking core samples and making geological observations as well as drilling, test-drilling or redrilling for oil wells, metallic and non-metallic minerals. Other typical services cover building oil and gas well foundations, cementing oil and gas well casings, cleaning, bailing and swabbing oil and gas wells, draining and pumping mines, overburden removal services at mines, etc. @en
scope note: Esta división comprende servicios complementarios especializados relacionados con las actividades de extracción y prestados por cuenta de terceros. Comprende los servicios de prospección basados en métodos tradicionales como el sondeo de muestras y las observaciones geológicas, así como la perforación, el sondeo y la perforación repetida de pozos de petróleo y en yacimientos de minerales metálicos y no metálicos. Otros servicios habituales son las obras de cimentación de pozos de petróleo y gas, la cementación de tuberías de revestimiento de pozos de petróleo y gas, la limpieza, achique y pistoneo de pozos de petróleo y gas, el drenaje y bombeo de minas, la retirada de sobrecargas en minas, etc. @es
scope note: Cette division comprend les services spécialisés de soutien à l’extraction exécutés pour le compte de tiers. Elle comprend les services d’exploration par les méthodes classiques de prospection, comme le prélèvement d’échantillons et les observations géologiques, ainsi que les forages, les forages d’essai ou les reforages des puits de pétrole ou pour les minerais métalliques et non métalliques. D’autres services couvrent la construction des fondations de puits de pétrole ou de gaz, la cimentation des revêtements (tubages) de puits de pétrole ou de gaz, le nettoyage, le vidage, le pompage à vide des puits de pétrole et de gaz, le drainage ou le pompage des mines, les services d’enlèvement des déblais dans les mines, etc. @fr
scope note: Ovaj odjeljak uključuje specijalizirane pomoćne uslužne djelatnosti koje se odnose na vađenje uz naplatu ili na osnovi ugovora. Uključene su i usluge pronalaženja, tradicionalnim metodama istraživanja rudnih ležišta, uzimanjem uzoraka stijena i geološkom analizom, kao i bušenjem, pokusnim bušenjem ili ponovnim bušenjem/dobušivanjem za potrebe pronalaženja izvora nafte te metalnih i nemetalnih minerala. Ostale specifične usluge uključuju montažu naftnih postrojenja, ugradnju i cementiranje zaštitnih cijevi, čišćenje i crpljenje naftnih te plinskih izvora, drenažu i crpljenje vode iz rudnika, usluge uklanjanja nanosa iz rudnika itd.
scope note: Į šį skyrių įeina specializuota kasybai būdingų pagalbinių paslaugų veikla, teikiama už atlygį arba pagal sutartį. Į šį skyrių įeina metalo ir ne metalo mineralų žvalgymo paslaugų teikimas naudojant tradicinius žvalgymo būdus, tokius kaip kernų paėmimas ir geologiniai stebėjimai, taip pat naftos gręžinių gręžimas, žvalgomasis ar pakartotinas jų gręžimas. Kitą būdingų paslaugų dalį sudaro naftos ir dujų gręžinių pagrindų statyba, naftos ir dujų gręžinių apsauginių vamzdžių cementacija, valymas, naftos ir dujų gręžinių valymas ir stūmoklinis siurbimas, kasyklų sausinimas ir vandens šalinimas, nuodangų kasyklose, pašalinimo paslaugos ir kt. @lt
scope note: Этот класс включает: - услуги по добыче нефти и газа за вознаграждение или на контрактной основе: • проведение поисково-разведочных работ перед осуществлением добычи нефти или газа, например традиционные методы разработки, такие как геологические исследования грунта в местах будущих разработок • целенаправленное бурение и повторное бурение; «начало бурения скважины»; установка буровой вышки в местах естественного залегания, ремонт и демонтаж оборудования; цементирование нефтегазовых скважин; откачивание воды насосами; подготовка выработанной шахты к закрытию и закрытие шахты и т.д. • сжижение и регазификацию природного газа в целях транспортировки, осуществляемые на разрабатываемой площадке • дренаж и откачивание воды насосами за вознаграждение или на контрактной основе • пробное бурение перед добычей нефти и газа Этот класс также включает: - пожаротушение и тушение воспламенившейся нефти или газа Этот класс исключает: - деятельность операторов в местах добычи нефти и газа, см. 06.10, 06.20 - специализированный ремонт горнодобывающей техники, см. 33.12 - сжижение и регазификацию природного газа в целях транспортировки, осуществляемые вне мест разработки, см. 52.21 - геофизические, геологические и сейсмические исследования, см. 71.12 @ru
scope note: Bu bölüm, bir ücret veya sözleşmeye dayanılarak gerçekleştirilen madenciliğe ek olarak gerçekleştirilen uzmanlaştırılmış destek hizmetlerini kapsamaktadır. Numune almak ve jeolojik gözlemler yapmak gibi geleneksel maden arama yöntemleri yoluyla olduğu kadar petrol kuyuları, metal olan veya metal olmayan mineraller için sondajlar, sondaj denemeleri veya tekrarları yapılması yoluyla tetkik, araştırma hizmetleri gerçekleştirilmesini kapsamaktadır. Diğer benzeri hizmetler ise petrol ve gaz kuyuları tesislerinin inşa edilmesini, petrol ve gaz kuyularının kaplamalarının betonlanmasını, petrol ve gaz kuyularının temizlenmesi, balyalanması ve silinmesini, madenlerin boşaltılması ve pompalanmasını, madenlerdeki fazla yük yüklemeden kaynaklanan yer değiştirme hizmetlerini vb. içermektedir. @tr
preferred label: Спомагателни дейности в добива @bg
preferred label: Podpůrné činnosti při těžbě @cs
preferred label: Serviceydelser i forbindelse med råstofindvinding @da
preferred label: Erbringung von Dienstleistungen für den Bergbau und für die Gewinnung von Steinen und Erden @de
preferred label: Υποστηρικτικές δραστηριότητες εξόρυξης @el
preferred label: Actividades de apoyo a las industrias extractivas @es
preferred label: Kaevandamist abistavad tegevusalad @et
preferred label: Kaivostoimintaa palveleva toiminta @fi
preferred label: Services de soutien aux industries extractives @fr
preferred label: Bányászati szolgáltatás
preferred label: Attività dei servizi di supporto all''estrazione @it
preferred label: Kasybai būdingų paslaugų veikla @lt
preferred label: Ar ieguves rūpniecību saistītās palīgdarbības @lv
preferred label: Attiivitajiet ta' sostenn għall-minjieri @mt
preferred label: Ondersteunende activiteiten in verband met de mijnbouw @nl
preferred label: Tjenester tilknyttet bergverksdrift @no
preferred label: Działalność usługowa wspomagająca górnictwo i wydobywanie @pl
preferred label: Actividades de serviços de apoio às indústrias extractivas @pt
preferred label: Activităţi de servicii anexe extracţiei @ro
preferred label: Технические услуги в области горнодобывающей промышленности @ru
preferred label: Pomocné činnosti pri ťažbe @sk
preferred label: Storitve za rudarstvo @sl
preferred label: Service till utvinning @sv
preferred label: Madenciliği destekleyici hizmet faaliyetleri @tr
broader: MINING AND QUARRYING
narrower: Support activities for petroleum and natural gas extraction
narrower: Support activities for other mining and quarrying

Support activities for petroleum and natural gas extraction
type: Concept
notation: 09.1
status: valid
status modified: 2013-10-18
accepted date: 2013-10-18
in scheme: Statistical Classification of Economic Activities in the European Community, Rev. 2 (2008)
preferred label: Спомагателни дейности в добива на нефт и природен газ @bg
preferred label: Podpůrné činnosti při těžbě ropy a zemního plynu @cs
preferred label: Serviceydelser i forbindelse med indvinding af råolie og naturgas @da
preferred label: Erbringung von Dienstleistungen für die Gewinnung von Erdöl und Erdgas @de
preferred label: Υποστηρικτικές δραστηριότητες για την άντληση πετρελαίου και φυσικού αερίου @el
preferred label: Actividades de apoyo a la extracción de petróleo y gas natural @es
preferred label: Nafta ja maagaasi tootmist abistavad tegevusalad @et
preferred label: Raakaöljyn ja maakaasun tuotantoa palveleva toiminta @fi
preferred label: Activités de soutien à l'extraction d'hydrocarbures @fr
preferred label: Kőolaj-, földgáz-kitermelési szolgáltatás
preferred label: Attività di supporto all'estrazione di petrolio e di gas naturale @it
preferred label: Naftos ir gamtinių dujų gavybai būdingų paslaugų veikla @lt
preferred label: Ar naftas un dabas gāzes ieguvi saistītās palīgdarbības @lv
preferred label: Attivitajiet ta' sostenn għall-estrazzjoni taż-żejt u l-gass naturali @mt
preferred label: Ondersteunende activiteiten in verband met de aardolie- en aardgaswinning @nl
preferred label: Tjenester tilknyttet utvinning av råolje og naturgass @no
preferred label: Działalność usługowa wspomagająca eksploatację złóż ropy naftowej i gazu ziemnego @pl
preferred label: Actividades de apoio à extracção de petróleo e de gás natural @pt
preferred label: Activităţi de servicii anexe extracţiei petrolului brut şi gazelor naturale @ro
preferred label: Технические услуги в области добычи нефти и природного газа @ru
preferred label: Pomocné činnosti pri ťažbe ropy a zemného plynu @sk
preferred label: Storitve za pridobivanje nafte in zemeljskega plina @sl
preferred label: Stödtjänster till råpetroleum- och naturgasutvinning @sv
preferred label: Petrol ve doğal gaz çıkarımını destekleyici faaliyetler @tr
broader: Mining support service activities
narrower: Support activities for petroleum and natural gas extraction

Support activities for petroleum and natural gas extraction
type: Concept
notation: 09.10
status: valid
status modified: 2013-10-18
accepted date: 2013-10-18
in scheme: Statistical Classification of Economic Activities in the European Community, Rev. 2 (2008)
scope note: - спомагателни дейности в добива на нефт и природен газ, извършвани срещу заплащане (по договор или еднократно): • услуги по геоложки проучвания на участъци, свързани с добива на нефт и газ • различни видове сондажни дейности, монтаж, ремонт и демонтаж на сондажните кули, циментиране на нефтените и газовите кладенци, изпомпване на кладенци, консервиране чрез запушване и други • втечняване и повторно превръщане в газ на природния газ с цел транспортиране, извършвани на мястото на добива • услуги по отводняване (дрениране) и изпомпване на кладенци • вземане на сондажни проби, свързани с добива на нефт и газ - услуги по предотвратяване и гасене на пожари в нефтените кладенци - обслужващи дейности, изпълнявани от операторите на нефтените или газовите кладенци - 06.10 и 06.20 - ремонт на машини за добива - 33.12 - втечняване и повторно превръщане в газ на природния газ с цел транспортиране, извършвани извън мястото на добива - 52.21 - геоложки, геофизични и сеизмографски изследвания - 71.12 @bg
scope note: Z: - služby poskytované na ropných a plynových polích na základě smlouvy nebo dohody: • průzkumné práce v souvislosti s těžbou ropy nebo zemního plynu, prováděné, např. formou obvyklých průzkumných metod, jako geologické monitorování v oblasti slibující výtěžnost • zkušební, rozšiřující, výrobní a pomocné vrty; zakládání vrtů, montáže, opravy a demontáže vrtných zařízení; cementování a plnění vrtných jam pro ropné a plynové vrty; odčerpání vrtných jam; uzavření vrtných jam a jejich opuštění atd. • zkapalňování a opětné zplyňování zemního plynu v místě těžby pro dopravní účely • odvodňování a čerpání na základě smlouvy nebo dohody • zkušební vrty při těžbě ropy nebo zemního plynu ZT: - práce protipožární ochrany na ropných a plynových polích N: - služby prováděné přímo provozovateli ropných a plynových polí (06.10, 06.20) - odborné opravy těžebních strojů (33.12) - zkapalňování a opětné zplyňování zemního plynu pro dopravní účely, neprováděné v místě těžby (52.21) - geofyzikální, geologický a seismický průzkum (71.12) @cs
scope note: Diese Klasse umfasst: - Dienstleistungen, die gegen Entgelt oder auf sonstiger vertraglicher Grundlage auf den Erdöl- und Erdgasfeldern erbracht werden: • Erkundungsdienstleistungen im Zusammenhang mit der Öl- oder Gasförderung, z. B. in Form herkömmlicher Prospektionsmethoden, etwa durch geologische Beobachtungen auf höffigem Gebiet • Test-, Erweiterungs-, Produktions- und Hilfsbohrungen; Ansetzen von Bohrungen, Montage, Reparatur und Abbau von Bohranlagen; Zementieren und Verfüllen von Bohrlöchern für Öl- und Gasbohrungen; Auspumpen von Bohrlöchern; Verschließen und Stilllegen von Bohrlöchern usw. • Verflüssigung und Wiederverdampfung von Erdgas an der Förderstätte zwecks Beförderung • Entwässern und Auspumpen im Lohnauftrag • Testbohrungen bei der Öl- oder Gasförderung Diese Klasse umfasst ferner: - Brandbekämpfungsleistungen auf Öl- und Gasfeldern Diese Klasse umfasst nicht: - von den Betreibern von Öl- oder Gasfeldern selbst erbrachte Dienstleistungen (s. 06.10, 06.20) - spezialisierte Reparatur von Bergwerksmaschinen (s. 33.12) - Verflüssigung und Wiederverdampfung von Erdgas, nicht an der Förderstätte, zu Transportzwecken (s. 52.21) - geophysikalische, geologische und seismische Prospektion (s. 71.12) @de
scope note: This class includes: - oil and gas extraction service activities provided on a fee or contract basis: • exploration services in connection with petroleum or gas extraction, e.g. traditional prospecting methods, such as making geological observations at prospective sites • directional drilling and redrilling; "spudding in"; derrick erection in situ, repairing and dismantling; cementing oil and gas well casings; pumping of wells; plugging and abandoning wells etc. • liquefaction and regasification of natural gas for purpose of transport, done at the mine site • draining and pumping services, on a fee or contract basis • test drilling in connection with petroleum or gas extraction This class also includes: - oil and gas field fire fighting services This class excludes: - service activities performed by operators of oil or gas fields, see 06.10, 06.20 - specialised repair of mining machinery, see 33.12 - liquefaction and regasification of natural gas for purpose of transport, done off the mine site, see 52.21 - geophysical, geologic and seismic surveying, see 71.12 @en
scope note: Esta clase comprende: - las actividades de los servicios de los yacimientos de petróleo y gas natural prestados por cuenta de terceros: • servicios de prospección relacionados con la extracción de petróleo o gas, por ejemplo, métodos de prospección tradicionales como las observaciones geológicas en posibles emplazamientos; • la perforación dirigida, la perforación repetida; el inicio de la perforación (por vibración del cable); la construcción in situ, la reparación y el desmantelamiento de torres de perforación; el bombeo de los pozos; el taponamiento y abandono de los pozos, etc. • la licuefacción y regasificación de gas natural para su transporte, realizadas en la explotación minera; • servicios de drenaje y bombeo, por cuenta de terceros; • perforaciones y sondeos en relación con la extracción de petróleo o gas. Esta clase comprende también: - los servicios de extinción de incendios en yacimientos de petróleo y gas. Esta clase no comprende: - las actividades de servicio realizadas por trabajadores de yacimientos de petróleo o gas (véanse 06.10 y 06.20); - la reparación especializada de maquinaria minera (véase 33.12); - la licuefacción y regasificación de gas natural para su transporte, realizadas fuera de la explotación minera (véase 52.21); - los estudios geofísicos, geológicos o sísmicos (véase 71.12). @es
scope note: Cette classe comprend: - les services liés à l’extraction de pétrole et de gaz, exécutés pour le compte de tiers: • les services d’exploration liés à l’extraction du pétrole et du gaz, par exemple: par les méthodes classiques de prospection, comme les observations géologiques sur les sites de prospection • forage et reforage dirigés; démarrage du forage; montage in situ, réparation et démontage de tours de forage; cimentation des revêtements (tubages) de puits de pétrole ou de gaz; pompage de puits; comblement et abandon de puits, etc. • la liquéfaction et la regazéification du gaz naturel en vue de son transport, effectuées sur le site minier • le drainage ou le pompage des mines pour le compte de tiers • les sondages d’essai liés à l’extraction du pétrole et du gaz Cette classe comprend également: - la protection et la lutte contre les incendies sur les champs de pétrole et de gaz Cette classe ne comprend pas: - les activités de services réalisées par des opérateurs de champs de gaz et de pétrole, voir 06.10 et 06.20 - les services spécialisés de réparation des machines pour l’extraction, voir 33.12 - la liquéfaction et la regazéification du gaz naturel en vue de son transport, effectuées ailleurs que sur le site minier, voir 52.21 - les études géophysiques, géologiques et sismiques, voir 71.12 @fr
scope note: Ovaj razred uključuje: - uslužne djelatnosti vađenja nafte i plina uz naplatu ili na osnovi ugovora: • usluge pronalaženja (ispitivanja) povezane s vađenjem nafte i plina, npr. metode tradicionalnog istraživanja rudnih ležišta kao što su geološka ispitivanja na budućim terenima • usmjereno bušenje i ponovno bušenje/dobušivanje; montažu/demontažu postrojenja za bušenje na nalazištu, popravljanje i rasklapanje; ugradnju i cementiranje zaštitnih cijevi; crpljenje bušotina; postavljanje čepova i napuštanje - likvidaciju bušotina itd. • ukapljivanje i otplinjavanje prirodnoga plina za potrebe transporta, na lokaciji nalazišta • usluge drenaže i crpljenja, uz naplatu ili na osnovi ugovora • pokusno bušenje u vezi s vađenjem nafte ili plina Ovaj razred također uključuje: - usluge zaštite od požara na naftnim poljima Ovaj razred isključuje: - uslužne djelatnosti koje obavljaju sami pogoni za vađenje nafte i prirodnog plina, vidi 06.10, 06.20 - specijalizirane popravke strojeva za rudarstvo, vidi 33.12 - ukapljivanje i otplinjavanje prirodnog plina za potrebe transporta, izvan lokacije nalazišta, vidi 52.21 - geofizička, geološka i seizmološka istraživanja, vidi 71.12
scope note: Į šią klasę įeina: - naftos ir dujų gavybos paslaugų veikla už atlygį ar pagal sutartį: • žvalgymo paslaugos, susijusios su naftos ar dujų gavyba, t.y. tradiciniai žvalgymo būdai, tokie kaip būsimų kasybos vietų geologiniai stebėjimai • kryptinis ir pakartotinis gręžimas; kalamasis gręžimas; gręžimo bokštų montavimas, remontas ir išardymas; naftos ir dujų gręžinių apsauginių vamzdžių cementacija; vandens šalinimas iš gręžinių; gręžinių užkimšimas ir likvidavimas ir t.t. • gamtinių dujų paruošimas transportuoti: suskystinimas ir pavertimas dujomis gavybos vietose • sausinimo ir vandens šalinimo paslaugos, teikiamos už atlygį arba pagal sutartį • bandomasis gręžimas, susijęs su naftos ir dujų gavyba Į šią klasę taip pat įeina: - naftos ir dujų telkinių gaisrų gesinimo paslaugų veikla Į šią klasę neįeina: - naftos ir dujų telkinių operatorių paslaugų veikla, žr. 06.10, 06.20 - specializuotasis kasybos technikos remontas, žr. 33.12 - gamtinių dujų paruošimas transportuoti: suskystinimas ir pavertimas dujomis ne dujų gavybos vietose, žr. 52.21 - geofizinių, geologinių ir seisminių tyrimų veikla, žr. 71.12 @lt
scope note: Этот класс включает: - техническую помощь, осуществляемую за вознаграждение или на договорной основе, необходимую при разработках, см. разделы 05, 07 и 08 • проведение исследований, например, традиционные методы разработки, такие как, получение образцов грунта и проведение геологических исследований в местах будущих разработок • дренаж и откачивание воды насосами за вознаграждение или на контрактной основе • пробное бурение Этот класс исключает: - управление рудником или местами подземных разработок на контрактной основе или за вознаграждение, см. разделы 05, 07 или 08 - специализированный ремонт горнодобывающей техники, см. 33.12 - услуги по геофизическому исследованию на контрактной основе или за вознаграждение, см. 71.12 @ru
scope note: Bu sınıf aşağıdakileri kapsamaktadır; - bir ücret veya sözleşme esasına dayalı olarak petrol ve gaz çıkarımı hizmet faaliyetleri; • petrol ve gaz çıkartılması ile bağlantılı olarak gerçekleştirilen tetkik (araştırma) hizmetleri, örn. maden çıkarılması için elverişli yerlerde jeolojik gözlemler yapmak gibi geleneksel maden arama yöntemleri, • sondaj; boruların yerleştirilmesi, sondaj kulesinin inşası, tamiri ve sökülmesi; petrol ve gaz kuyusu borularının çimentolanması; kuyuların pompalanması; kuyuların çalıştırılması ve kapatılması vb., • doğal gazın nakil amacıyla sıvılaştırılması ve yeniden gaz haline dönüştürülmesi, maden ocağı civarında yapılanlar, • bir ücret veya sözleşme esasına dayalı olarak gerçekleştirilen boşaltma ve pompalama hizmetleri, • petrol ve gaz çıkarımı ile bağlantılı olarak gerçekleştirilen sondaj denemeleri. Ayrıca bu sınıf aşağıdakileri de kapsamaktadır; - petrol ve gaz sahalarında yangınla mücadele faaliyetleri. Kapsam dışı olanlar; - petrol ve gaz sahalarında işletmeciler tarafından gerçekleştirilen hizmet faaliyetleri, bkz. 06.10, 06.20, - madencilik makinelerinin uzmanlaşmış tamiri, bkz. 33.12, - doğal gazın nakil amacıyla sıvılaştırılması ve yeniden gaz haline dönüştürülmesi, maden ocağı civarı dışında yapılanlar, bkz. 52.21, -jeofizik, jeolojik ve sismik araştırmalar, bkz. 71.12. @tr
preferred label: Спомагателни дейности в добива на нефт и природен газ @bg
preferred label: Podpůrné činnosti při těžbě ropy a zemního plynu @cs
preferred label: Serviceydelser i forbindelse med indvinding af råolie og naturgas @da
preferred label: Erbringung von Dienstleistungen für die Gewinnung von Erdöl und Erdgas @de
preferred label: Υποστηρικτικές δραστηριότητες για την άντληση πετρελαίου και φυσικού αερίου @el
preferred label: Actividades de apoyo a la extracción de petróleo y gas natural @es
preferred label: Nafta ja maagaasi tootmist abistavad tegevusalad @et
preferred label: Raakaöljyn ja maakaasun tuotantoa palveleva toiminta @fi
preferred label: Activités de soutien à l'extraction d'hydrocarbures @fr
preferred label: Kőolaj-, földgáz-kitermelési szolgáltatás
preferred label: Attività di supporto all'estrazione di petrolio e di gas naturale @it
preferred label: Naftos ir gamtinių dujų gavybai būdingų paslaugų veikla @lt
preferred label: Ar naftas un dabas gāzes ieguvi saistītās palīgdarbības @lv
preferred label: Attivitajiet ta' sostenn għall-estrazzjoni għaż-żejt u l-gass naturali @mt
preferred label: Ondersteunende activiteiten in verband met de aardolie- en aardgaswinning @nl
preferred label: Tjenester tilknyttet utvinning av råolje og naturgass @no
preferred label: Działalność usługowa wspomagająca eksploatację złóż ropy naftowej i gazu ziemnego @pl
preferred label: Actividades de apoio à extracção de petróleo e de gás natural @pt
preferred label: Activităţi de servicii anexe extracţiei petrolului brut şi gazelor naturale @ro
preferred label: Технические услуги в области добычи нефти и природного газа @ru
preferred label: Pomocné činnosti pri ťažbe ropy a zemného plynu @sk
preferred label: Storitve za pridobivanje nafte in zemeljskega plina @sl
preferred label: Stödtjänster till råpetroleum- och naturgasutvinning @sv
preferred label: Petrol ve doğal gaz çıkarımını destekleyici faaliyetler @tr
broader: Support activities for petroleum and natural gas extraction

Support activities for other mining and quarrying
type: Concept
notation: 09.9
status: valid
status modified: 2013-10-18
accepted date: 2013-10-18
in scheme: Statistical Classification of Economic Activities in the European Community, Rev. 2 (2008)
scope note: Данный раздел включает переработку сельскохозяйственной продукции, лесопродукции и продукции рыболовного хозяйства для производства продуктов питания, готовых кормов для животных, а также включает производство непищевых полуфабрикатов. Данная деятельность зачастую в той или иной степени связана с производством побочной продукции большего или меньшего объема (например, шкур и кож, получаемых в процессе забоя скота или жмыха от производства масла). Данный раздел разбит на более мелкие группировки по виду произведенной продукции: переработка и производство мяса, рыбы, овощей и фруктов, масел и жиров, продуктов мукомольно-крупяной промышленности, кормов для животных, напитков, табачных изделий и прочих пищевых продуктов. Производство может осуществляться для удовлетворения собственных нужд, а также для третьих сторон, например, в случае скотобойни. Некоторые из видов деятельности включают прямое производство (например, пекарни, кондитерские, разделка мяса в магазинах и т.д., места, где продаются собственные изделия), даже если это розничная торговля продукцией в магазинах производителя. Однако те виды производства, где переработка имеет минимальный объем и не ведет к действительной трансформации, объединены в раздел «Оптовая и розничная торговля» (секция G). Подготовка продуктов питания для немедленного потребления в местах производства содержится в разделе 56 (услуги по предоставлению продуктов питания и напитков). Производство готовых кормов для животных, получаемых из отходов при забое скота или побочных продуктов классифицировано в группу 10.9. Переработка отходов от производства продуктов питания и напитков во вторичное сырье классифицирована в группе 38.3 и устранение отходов от продуктов питания и напитков – в классе 38.21. Данный раздел исключает готовку пищи для непосредственного употребления, например, в ресторанах. @ru
preferred label: Спомагателни дейности в добива, без добива на нефт и природен газ @bg
preferred label: Podpůrné činnosti při ostatní těžbě a dobývání @cs
preferred label: Serviceydelser i forbindelse med anden råstofindvinding @da
preferred label: Erbringung von Dienstleistungen für den sonstigen Bergbau und die Gewinnung von Steinen und Erden @de
preferred label: Υποστηρικτικές δραστηριότητες για άλλες εξορυκτικές και λατομικές δραστηριότητες @el
preferred label: Actividades de apoyo a otras industrias extractivas @es
preferred label: Muud kaevandamist abistavad tegevusalad @et
preferred label: Muuta kaivostoimintaa ja louhintaa palveleva toiminta @fi
preferred label: Activités de soutien aux autres industries extractives @fr
preferred label: Egyéb bányászati szolgáltatás
preferred label: Attività di supporto ad altre attività estrattive @it
preferred label: Kitai kasybai ir karjerų eksploatavimui būdingų paslaugų veikla @lt
preferred label: Ar pārējo ieguves rūpniecību saistītās palīgdarbības @lv
preferred label: Attivitajiet ta' sostenn għal minjieri u barrieri oħra @mt
preferred label: Ondersteunende activiteiten in verband met de overige winning van delfstoffen @nl
preferred label: Tjenester tilknyttet annen bergverksdrift @no
preferred label: Działalność usługowa wspomagająca pozostałe górnictwo i wydobywanie @pl
preferred label: Actividades de apoio a outras indústrias extractivas @pt
preferred label: Activităţi de servicii anexe pentru extracţia mineralelor @ro
preferred label: Техническая поддержка для прочих областей горнодобывающей промышленности и подземной разработки @ru
preferred label: Pomocné činnosti pri iných ťažbách a dobývaní @sk
preferred label: Storitve za drugo rudarjenje @sl
preferred label: Stödtjänster till annan utvinning @sv
preferred label: Madencilik ve taş ocakçılığını destekleyici diğer faaliyetler @tr
broader: Mining support service activities
narrower: Support activities for other mining and quarrying

Support activities for other mining and quarrying
type: Concept
notation: 09.90
status: valid
status modified: 2013-10-18
accepted date: 2013-10-18
in scheme: Statistical Classification of Economic Activities in the European Community, Rev. 2 (2008)
scope note: - спомагателни дейности в добива на руди и минерали (раздели 05, 07, 08), извършвани срещу заплащане (по договор или еднократно): • услуги по вземане на проба от ядката и геоложки проучвания на участъци • услуги по отводняване (дрениране) и изпомпване на мини и кариери • пробиване на сондажни отвори и вземане на проби - експлоатация на мини или кариери, срещу заплащане (по договор или еднократно) - 05, 07 или 08 - ремонт на машини за добива - 33.12 - геоложки, геофизични и сеизмографски изследвания - 71.12 @bg
scope note: Z: - služby prováděné na základě smlouvy nebo dohody, které slouží podpoře těžebních činností uvedených v oddílech 05, 07 a 08 • průzkumné práce, např. obvyklé průzkumné metody, jako vrtání vrtných jader a geologické monitorování v oblasti slibující výtěžnost • odvodňování a čerpání prováděné na základě smlouvy nebo dohody • provádění zkušebních a průzkumných vrtů N: - provozování dolů a lomů prováděné na základě smlouvy nebo dohody (oddíly 05, 07 nebo 08) - odborné opravy těžebních strojů (33.12) - služby geofyzikálního průzkumu, nebo na základě smlouvy nebo dohody (71.12) @cs
scope note: Diese Klasse umfasst: - im Lohnauftrag erbrachte Dienstleistungen, die für Bergbautätigkeiten der Abteilungen 05, 07 und 08 benötigt werden • Erkundungsdienstleistungen; z. B. herkömmliche Prospektierungsmethoden, etwa das Erbohren von Bohrkernen und geologische Beobachtungen auf höffigem Gebiet • Entwässern und Auspumpen im Lohnauftrag • Ausführen von Test- und Suchbohrungen Diese Klasse umfasst nicht: - Betrieb von Bergwerken oder Steinbrüchen im Lohnauftrag (s. Abteilung 05, 07 oder 08) - Spezialisierte Reparatur von Bergwerksmaschinen (s. 33.12) - Dienstleistungen der geophysikalischen Prospektierung (s. 71.12) @de
scope note: This class includes: - support services on a fee or contract basis, required for mining activities of divisions 05, 07 and 08 • exploration services, e.g. traditional prospecting methods, such as taking core samples and making geological observations at prospective sites • draining and pumping services, on a fee or contract basis • test drilling and test hole boring This class excludes: - operating mines or quarries on a contract or fee basis, see division 05, 07 or 08 - specialised repair of mining machinery, see 33.12 - geophysical surveying services, on a contract or fee basis, see 71.12 @en
scope note: Esta clase comprende: - los servicios complementarios prestados por cuenta de terceros y requeridos para las actividades de extracción comprendidas en las divisiones 05, 07 y 08; • los servicios de prospección, por ejemplo, los métodos de prospección tradicionales como el sondeo de muestras y las observaciones geológicas en posibles emplazamientos; • servicios de drenaje y bombeo, por cuenta de terceros; • las perforaciones y sondeos. Esta clase no comprende: - la explotación de minas o canteras por cuenta de terceros (véanse las divisiones 05, 07 y 08); - la reparación especializada de maquinaria minera (véase 33.12); - los servicios de estudios geofísicos, por cuenta de terceros (véase 71.12). @es
scope note: Cette classe comprend: - les services de soutien exécutés pour le compte de tiers liés aux activités minières des divisions 05, 07 et 08 • les services d’exploration par les méthodes classiques de prospection, comme le prélèvement d’échantillons et les observations géologiques sur les sites de prospection • le drainage ou le pompage des mines pour le compte de tiers • les sondages et forages d’essai Cette classe ne comprend pas: - l’exploitation de mines ou de carrières pour le compte de tiers, voir divisions 05, 07 ou 08 - les services spécialisés de réparation des machines pour l’extraction, voir 33.12 - les services de relevés géophysiques pour le compte de tiers, voir 71.12 @fr
scope note: Ovaj razred uključuje: - pomoćne usluge uz naplatu ili na osnovi ugovora, za potrebe rudarskih djelatnosti odjeljaka 05, 07 ili 08 • usluge ispitivanja (pronalaženja), npr. metodom tradicionalnog istraživanja rudnih ležišta kao što su uzimanje uzoraka stijena i geološkim analizama na budućim nalazištima • usluge drenaže i crpljenja, uz naplatu ili na osnovi ugovora • pokusno bušenje i sondiranje Ovaj razred isključuje: - upravljanje rudnicima ili kamenolomima uz naplatu ili na osnovi ugovora, vidi odjeljke 05, 07 ili 08 - specijalizirane popravke strojeva za rudarstvo, vidi 33.12 - usluge geofizičkih istraživanja, uz naplatu ili na osnovi ugovora, vidi 71.12
scope note: Į šią klasę įeina: - 05, 07 ir 08 skyrių kasybos veiklos rūšims būdingų paslaugų veikla už atlygį ar pagal sutartį: - žvalgymo paslaugos, t.y. tradiciniai žvalgymo būdai, tokie kaip kernų paėmimas ir būsimų kasybos vietų geologiniai stebėjimai - sausinimo ir vandens šalinimo paslaugos, teikiamos už atlygį ar pagal sutartį - bandomasis gręžimas ir bandomųjų gręžinių gręžimas Į šią klasę neįeina: - kasyklų ir karjerų eksploatavimas už užmokestį ar pagal sutartį, žr. 05, 07, 08 skyrius - specializuotasis kasybos technikos remontas, žr. 33.12 - geofizinių tyrimų veikla už atlygį ar pagal sutartį, žr. 71.12 @lt
scope note: Bu sınıf aşağıdakileri kapsamaktadır; -05, 07 ve 08 numaralı bölümlerdeki madencilik faaliyetleri için gerekli olup bir ücret veya sözleşme esasına dayalı olarak gerçekleştirilen destekleme hizmetleri, • tetkik (araştırma) hizmetleri, örn. numune alınması ve maden çıkarılması için elverişli yerlerde jeolojik gözlemler yapılması gibi, geleneksel maden arama yöntemleri, • bir ücret veya sözleşme esasına dayalı olarak gerçekleştirilen boşaltma ve pompalama hizmetleri, • test amaçlı sondaj ve delik açma. Kapsam dışı olanlar; - madenlerin ve taş ocaklarının bir ücret veya sözleşme esasına dayalı olarak işletilmesi, 05, 07 veya 08. numaralı bölümlere bakınız, - madencilik makinelerinin uzmanlaşmış tamiri, bkz. 33.12, - bir ücret veya sözleşme esasına dayalı olarak gerçekleştirilen jeofizik araştırma hizmetleri, bkz. 71.12. @tr
preferred label: Спомагателни дейности в добива, без добива на нефт и природен газ @bg
preferred label: Podpůrné činnosti při ostatní těžbě a dobývání @cs
preferred label: Serviceydelser i forbindelse med anden råstofindvinding @da
preferred label: Erbringung von Dienstleistungen für den sonstigen Bergbau und die Gewinnung von Steinen und Erden @de
preferred label: Υποστηρικτικές δραστηριότητες για άλλες εξορυκτικές και λατομικές δραστηριότητες @el
preferred label: Actividades de apoyo a otras industrias extractivas @es
preferred label: Muud kaevandamist abistavad tegevusalad @et
preferred label: Muuta kaivostoimintaa ja louhintaa palveleva toiminta @fi
preferred label: Activités de soutien aux autres industries extractives @fr
preferred label: Egyéb bányászati szolgáltatás
preferred label: Attività di supporto ad altre attività estrattive @it
preferred label: Kitai kasybai ir karjerų eksploatavimui būdingų paslaugų veikla @lt
preferred label: Ar pārējo ieguves rūpniecību saistītās palīgdarbības @lv
preferred label: Attivitajiet ta' sostenn għal minjieri u barrieri oħra @mt
preferred label: Ondersteunende activiteiten in verband met de overige winning van delfstoffen @nl
preferred label: Tjenester tilknyttet annen bergverksdrift @no
preferred label: Działalność usługowa wspomagająca pozostałe górnictwo i wydobywanie @pl
preferred label: Actividades de apoio a outras indústrias extractivas @pt
preferred label: Activităţi de servicii anexe pentru extracţia mineralelor @ro
preferred label: Техническая поддержка для прочих областей горнодобывающей промышленности и подземной разработки @ru
preferred label: Pomocné činnosti pri iných ťažbách a dobývaní @sk
preferred label: Storitve za drugo rudarjenje @sl
preferred label: Stödtjänster till annan utvinning @sv
preferred label: Madencilik ve taş ocakçılığını destekleyici diğer faaliyetler @tr
broader: Support activities for other mining and quarrying

Manufacture of food products
type: Concept
notation: 10
status: valid
status modified: 2013-10-18
accepted date: 2013-10-18
in scheme: Statistical Classification of Economic Activities in the European Community, Rev. 2 (2008)
scope note: преработване на продукти от селското и рибното стопанство в храни за човека или животните, вкл. производство на разнообразни полуфабрикати, които не са годни за пряка консумация. При производството на хранителни продукти често се създават странични продукти с по-голяма или по-малка стойност (например кожи от кланици или кюспе от производството на растително масло). Този раздел се подразделя на производство на различни видове продукти: месо, риба, плодове и зеленчуци, масла и мазнини, млечни и мелничарски продукти, хлебни и тестени изделия, други хранителни продукти и храни за животни. Производството може да бъде за собствена сметка или за сметка на трети лица (например умъртвяване и клане на животни). Този раздел не включва приготвяне на готови ястия за непосредствена консумация, например в ресторанти. Някои дейности се считат за производство (например дейността на фурни, сладкарници, колбасарници и други)дори когато продават на дребно продукцията си в собствени магазини. Когато обработката е минимална и не води до създаване на нов продукт (например месарски или рибарски магазини), единиците се класифицират в сектор G "Търговия; ремонт на автомобили и мотоциклети". Приготвянето на храни и напитки за непосредствена консумация се класифицира в раздел 56 „Ресторантьорство”. Производството на храни за животни от кланични отпадъци се класифицира в 10.9, докато преработването на отпадъци от храни и напитки в суровини за повторна употреба се класифицира в 38.3, а обработването на тези отпадъци е в 38.21. @bg
scope note: Tento oddíl zahrnuje zpracování produktů zemědělství, lesnictví a rybářství na potraviny pro lidi a krmiva pro zvířata a výrobu různých meziproduktů, které nejsou přímo potravinami. Při výrobě potravin a krmiv často vznikají také vedlejší produkty větší či menší užitkové hodnoty (např. kůže na jatkách nebo pokrutiny při výrobě oleje). Oddíl je členěn podle činností týkajících se rozdílných druhů produktů: masa, ryb, ovoce a zeleniny, olejů a tuků, mléčných výrobků, mlýnských a škrobárenských výrobků, pekařských a jiných moučných výrobků, ostatních potravin a krmiv. Výroba může být prováděna jak na vlastní účet, tak pro třetí stranu (např. porážka zvířat na zakázku). Některé činnosti jsou zařazeny do zpracovatelského průmyslu (např. ty, které jsou prováděné v pekárnách, cukrárnách a řeznictvích prodávajících svoji vlastní produkci), i když by tyto činnosti mohly být považovány za maloobchodní činnost ve vlastních prodejnách výrobce. Pokud však dochází pouze k minimálnímu zpracování, které nepředstavuje skutečnou přeměnu, je jednotka zařazena do obchodu (sekce G). Úprava potravin pro okamžitou spotřebu na místě je zařazena do oddílu 56 (Stravování a pohostinství). Zpracování jatečního odpadu a vedlejších produktů k výrobě krmiva pro zvířata je zařazeno v 10.9, zpracování odpadu z potravin a nápojů na druhotné suroviny je naopak zařazeno do 38.3 a likvidace odpadu z potravin a nápojů do 38.21. Tento oddíl nezahrnuje úpravu pokrmů pro okamžitou spotřebu, jako např. v restauracích. @cs
scope note: Diese Abteilung umfasst die Verarbeitung von Erzeugnissen der Landwirtschaft, Forstwirtschaft und Fischerei zu Nahrungs- und Futtermitteln, sowie die Herstellung verschiedener Halbwaren, die noch keine Nahrungs- und Futtermittel darstellen. Häufig entstehen auch Nebenerzeugnisse von mehr oder weniger hohem Wert (z. B. Häute aus der Schlachtung oder Ölkuchen aus der Ölerzeugung). Die einzelnen Unterteilungen stellen auf die verschiedenen hergestellten Erzeugnisse ab: Fleisch, Fisch, Obst und Gemüse, Öle und Fette, Milcherzeugnisse, Mühlenerzeugnisse, Futtermittel und sonstige Nahrungsmittel. Die Produktion kann auf eigene Rechnung oder im Auftrag Dritter (z. B. Lohnschlachtung) erfolgen. Einige Tätigkeiten werden zur Herstellung von Waren gezählt, selbst wenn man diese auch als Einzelhandelstätigkeit im eigenen Ladengeschäft des Herstellers auffassen könnte (z. B. Bäckereien, Konditoreien und Fleischverarbeitung). Sofern jedoch nur eine geringfügige Verarbeitung erfolgt, die keine wirkliche Umwandlung darstellt wird die Einheit dem Handel in Abschnitt G zugeordnet. Die Zubereitung von Nahrungsmitteln zum sofortigen Verzehr an Ort und Stelle ist in Abteilung 56 (Gastronomie) eingeordnet. Die Verarbeitung von Schlachtabfällen und –nebenerzeugnissen zu Futtermitteln wird in 10.9 eingeordnet, die Verarbeitung von Nahrungsmittel- und Getränkeabfällen zu Sekundärrohstoffen hingegen in 38.3 und die Entsorgung solcher Abfälle in 38.21. Diese Abteilung umfasst nicht die Zubereitung von Speisen zum sofortigen Verzehr, etwa in Speisegaststätten. @de
scope note: This division includes the processing of the products of agriculture, forestry and fishing into food for humans or animals, and includes the production of various intermediate products that are not directly food products. The activity often generates associated products of greater or lesser value (for example, hides from slaughtering, or oilcake from oil production). This division is organised by activities dealing with different kinds of products: meat, fish, fruit and vegetables, fats and oils, milk products, grain mill products, animal feeds and other food products. Production can be carried out for own account, as well as for third parties, as in custom slaughtering. Some activities are considered manufacturing (for example, those performed in bakeries, pastry shops, and prepared meat shops etc. which sell their own production) even though there is retail sale of the products in the producers' own shop. However, where the processing is minimal and does not lead to a real transformation, the unit is classified to wholesale and retail trade (section G). Preparation of food for immediate consumption on the premises is classified to division 56 (Food and beverage service activities). Production of animal feeds from slaughter waste or by-products is classified in 10.9, while processing food and beverage waste into secondary raw material is classified to 38.3, and disposal of food and beverage waste in 38.21. This division does not include the preparation of meals for immediate consumption, such as in restaurants. @en
scope note: Esta división comprende la transformación de los productos de la agricultura, la silvicultura y la pesca en alimentos para las personas y animales, así como la producción de diversos productos intermedios que no constituyen exactamente productos alimenticios. La actividad con frecuencia genera productos asociados de mayor o menor valor (como pieles procedentes de mataderos, o tortas de aceite, de la producción de aceite). La presente división se organiza por actividades relacionadas con distintos tipos de productos: carne, pescado, frutas y hortalizas, grasas y aceites, productos lácteos, productos de molinería, , otros productos alimenticios y productos para la alimentación animal. La producción puede realizarse por cuenta propia o por cuenta de terceros, como la matanza por encargo. Esta división no comprende la preparación de comidas aptas para su consumo inmediato, como la que se realiza en restaurantes. Determinadas actividades se consideran pertenecientes a la industria manufacturera (por ejemplo, las efectuadas en panaderías, pastelerías y establecimientos de productos cárnicos etc., que venden su propia producción), aunque se realice venta al por menor de los productos en el establecimiento de los productores. Sin embargo, cuando la elaboración es mínima y no da como resultado una verdadera transformación, la unidad se clasifica como comercio al por mayor o comercio al por menor en la sección G. La preparación de alimentos para el consumo inmediato en el establecimiento, se clasifica en la división 56 (Servicios de comidas y bebidas). La producción de productos para la alimentación de animales a partir de residuos o subproductos de los mataderos se clasifica en 10.9, mientras que la transformación de residuos de productos alimenticios y bebidas en materia prima secundaria se clasifica en 38.3, y la eliminación de residuos de productos alimenticios y bebidas, en 38.21. @es
scope note: Cette division comprend la transformation des produits de la culture, de la sylviculture et de la pêche en aliments pour l’homme ou l’animal et comprend également la production de divers produits intermédiaires non directement alimentaires. Cette activité génère fréquemment des produits associés de valeur supérieure ou moindre (par exemple: peaux pour l’activité d’abattage ou tourteaux pour la production d’huile). La division est organisée en sous-filières: viandes, poissons, fruits et légumes, corps gras, produits laitiers, meunerie et travail du grain, aliments pour animaux et autres filières alimentaires. La production peut être effectuée pour compte propre ainsi que pour le compte de tiers, notamment l’abattage particulier. Certaines activités sont considérées comme manufacturières (par exemple: les boulangers, pâtissiers, charcutiers, etc. qui vendent leur propre production), même s’il s’agit d’une vente au détail dans leur propre magasin. Cependant, lorsque le traitement est minimal et n’aboutit pas à une réelle transformation, l’unité est classée dans Commerce; réparation automobile (section G). Les activités de préparation de produits alimentaires destinés à la consommation sur place sont classées dans la division 56 (Restauration). La production d’aliments pour animaux à partir de déchets ou de sous-produits d’abattoir est classée en 10.9, tandis que la transformation des déchets d’aliments et de boissons en matières brutes secondaires est classée en 38.3 et l’élimination de déchets d’aliments et de boissons en 38.21. Cette division ne comprend pas la préparation de plats pour consommation immédiate, comme dans les restaurants. @fr
scope note: Ovaj odjeljak uključuje preradu proizvoda poljoprivrede, šumarstva i ribarstva u hranu i piće za ljude i životinje, uključujući proizvodnju raznovrsnih intermedijarnih proizvoda, koji nisu neposredno proizvodi hrane. Djelatnost često generira pridružene proizvode veće ili manje vrijednosti (npr. kože od klanja ili uljanu pogaču iz proizvodnje ulja). Ovaj odjeljak organiziran je prema djelatnostima koje se bave različitom vrstom proizvoda: mesom, ribom, voćem i povrćem, mastima i uljima, mliječnim proizvodima, proizvodima mljevenih žitarica, te proizvodima za hranjenje životinja i ostalim prehrambenim proizvodima. Proizvodnja se može obavljati za vlastiti račun ili za treća lica, primjerice klanje po narudžbi. Ovaj odjeljak ne uključuje pripremu obroka za neposrednu potrošnju, kao u restoranima. Neke djelatnosti smatraju se prerađivačkima (npr. pekarnice, slastičarnice i prodavaonice za pripremu mesa itd. koje prodaju svoje vlastite proizvode), čak i kad imaju vlastitu trgovinu na malo svojih proizvoda. Međutim kada je prerada manjih razmjera i ne vodi k stvarnoj transformaciji proizvoda, jedinice se razvrstavaju u trgovinu na veliko i na malo područje G Trgovina na veliko i na malo; popravak motornih vozila i motocikala. Priprema hrane za neposrednu potrošnju na licu mjesta razvrstana je u odjeljak 56 Djelatnosti pripreme i usluživanja hrane i pića. Obrada ostataka i otpadaka klaonica za proizvodnju stočne i druge životinjske hrane razvrstana je u skupinu 10.9, dok je prerada ostataka i otpadaka hrane i pića u sekundarne sirovine razvrstana u 38.3, a zbrinjavanje otpada hrane i pića u 38.21.
scope note: Į šį skyrių įeina žemės ūkio, miškininkystės ir žuvininkystės produktų perdirbimas į žmonėms ar gyvūnams vartoti tinkamus maisto produktus. Be to, gaminami įvairūs tarpiniai produktai arba pusgaminiai, kurie tiesiogiai nėra maisto produktai. Dažnai yra gaminami didesnės ar mažesnės vertės, vienas su kitu susiję produktai (pvz., kailiai iš skerdyklų ar išspaudos iš aliejaus produktų). Kiekvienas skyrius yra sudarytas pagal veiklos rūšis, susijusias su skirtingomis produktų rūšimis: mėsa, žuvimi, vaisiais, uogomis ir daržovėmis, riebalais ir aliejumi, pieno produktais, grūdų malimo produktais, gyvūnų ėdalu ir kitais maisto produktais. Gamyba gali būti atliekama arba savo lėšomis, arba trečiųjų šalių užsakymu, pvz., skerdimas pagal užsakymą. Į šį skyrių neįeina skirto nedelsiant suvartoti maisto paruošimas, koks yra restoranuose. Tuo atveju, kai parduodama savos gamybos produkcija, net jeigu mažmeninė prekyba atliekama savo parduotuvėje, dalis veiklos rūšių, pvz., kepyklų, konditerijos parduotuvių, paruoštos mėsos parduotuvių veikla ir kt., yra prilyginamos produktų gamybai. Tačiau verslo vienetai, kurie atlieka tik minimalų apdirbimą ir iš esmės neperdirba produktų, yra priskiriami didmeninei ar mažmeninei prekybai (G sekcija). Maisto paruošimas vartoti nedelsiant gamybos vietoje yra klasifikuojamas 56 skyriuje (Maitinimo ir gėrimų teikimo veikla). Gyvūnų ėdalo gamyba iš skerdyklų atliekų ar tarpinių produktų klasifikuojamas 10.9 grupėje, maisto ir gėrimų atliekų perdirbimas į antrines žaliavas yra klasifikuojamas 38.3, o maisto ir gėrimų atliekų šalinimas – 38.21 skyriuje. @lt
scope note: Этот класс включает: - забой на скотобойне, обработку или расфасовку мяса домашней птицы - производство свежего, охлажденного или замороженного мяса, поделенного на части - вытапливание жира домашней птицы Этот класс также включает: - получение рубленого пера и пуха от домашней птицы Этот класс исключает: - упаковку мяса, см. 82.92 @ru
scope note: Bu bölüm, tarım, ormancılık ve balıkçılık faaliyetleri ile elde edilen ürünlerin işlenerek insanlar ve hayvanlar için yiyecek ve içecek haline getirilmelerini ve doğrudan yiyecek mamulü olmayan birçok değişik ara ürünün üretilmesini kapsamaktadır. Bu faaliyet genellikle daha fazla veya az değerli olan karma ürünlerin husule getirilmesidir. (örneğin, kesimden elde edilen deriler, veya yağ üretiminden elde edilen yağ sabunu). Bu bölüm farklı türde ürünlerle ilgilenen faaliyetlerden oluşmaktadır: et, balık, meyve ve sebze, katı yağlar ve sıvı yağlar, süt ürünleri, tahıl (hububat) imalatı ürünleri, unlu ve nişastalı mamuller, diğer gıda ürünleri ve hayvan yemleri. Üretim kendi adına gerçekleştirilebileceği gibi, geleneksel kesimde olduğu gibi, üçüncü kişiler adına da gerçekleştirilebilir. Bu bölüm, restoranlarda olduğu gibi, yemeklerin hızlı tüketim amacıyla hazırlanmasını kapsamaz. Bazı faaliyetler, (örneğin, kendilerine ait ürünleri satan fırınlarda, pastanelerde ve hazır et satan dükkanlarda ve benzeri yerlerde gerçekleştirilenler), ürünlerin, üreticinin kendi dükkanından perakende ticareti yapıldığı halde, imalat olarak değerlendirilirler. Ancak, işlemenin minimal olduğu ve gerçek bir dönüştürmeye yol açmadığı durumlarda, birim toptancı veya perakendeci ticarette sınıflandırılır. (Kısım G). Yemeklerin tesislerde hızlı tüketim amacıyla hazırlanması, bölüm 56`da sınıflandırılmıştır (Restoranlar ve mobil (seyyar) yemek hizmeti faaliyetleri).Hayvan kesimi artıklarından veya yan ürünlerinden hayvan yemi üretilmesi 10.9`da sınıflandırılmış, yiyecek ve içecek atıklarının ikincil ham maddeye dönüştürülmesi ise 38.3`de, ve yiyecek ve içecek atıklarının kullanılması 38.21`de sınıflandırılmaktadır. @tr
preferred label: Производство на хранителни продукти @bg
preferred label: Výroba potravinářských výrobků @cs
preferred label: Fremstilling af fødevarer @da
preferred label: Herstellung von Nahrungs- und Futtermitteln @de
preferred label: Βιομηχανία τροφίμων @el
preferred label: Industria de la alimentación @es
preferred label: Toiduainete tootmine @et
preferred label: Elintarvikkeiden valmistus @fi
preferred label: Industries alimentaires @fr
preferred label: Élelmiszergyártás
preferred label: Industrie alimentari @it
preferred label: Maisto produktų gamyba @lt
preferred label: Pārtikas produktu ražošana @lv
preferred label: Manifattura ta' prodotti ta' l-ikel @mt
preferred label: Vervaardiging van voedingsmiddelen @nl
preferred label: Produksjon av nærings- og nytelsesmidler @no
preferred label: Produkcja artykułów spożywczych @pl
preferred label: Indústrias alimentares @pt
preferred label: Industria alimentară @ro
preferred label: Производство продуктов питания @ru
preferred label: Výroba potravín @sk
preferred label: Proizvodnja živil @sl
preferred label: Livsmedelsframställning @sv
preferred label: Gıda ürünlerinin imalatı @tr
broader: MANUFACTURING
narrower: Processing and preserving of meat and production of meat products
narrower: Processing and preserving of fish, crustaceans and molluscs
narrower: Processing and preserving of fruit and vegetables
narrower: Manufacture of vegetable and animal oils and fats
narrower: Manufacture of dairy products
narrower: Manufacture of grain mill products, starches and starch products
narrower: Manufacture of bakery and farinaceous products
narrower: Manufacture of other food products
narrower: Manufacture of prepared animal feeds

Processing and preserving of meat and production of meat products
type: Concept
notation: 10.1
status: valid
status modified: 2013-10-18
accepted date: 2013-10-18
in scheme: Statistical Classification of Economic Activities in the European Community, Rev. 2 (2008)
scope note: Этот класс включает: - производство сушеного, засоленного или копченого мяса - производство мясопродуктов: • колбас, салями, кровяной колбасы, выдержанной сухой колбасы, сервелата, болонской копченой колбасы, паштетов, рулетов, вареной ветчины Этот класс исключает: - производство готовых замороженных мясных блюд и блюд из домашней птицы, см. 10.85 - производство супов, содержащих мясо, см. 10.89 - оптовую торговлю мясом, см. 46.32 - упаковку мяса, см. 82.92 @ru
preferred label: Производство и преработка на месо; производство на месни продукти, без готови ястия @bg
preferred label: Zpracování a konzervování masa a výroba masných výrobků @cs
preferred label: Forarbejdning og konservering af kød og produktion af kødprodukter @da
preferred label: Schlachten und Fleischverarbeitung @de
preferred label: Επεξεργασία και συντήρηση κρέατος και παραγωγή προϊόντων κρέατος @el
preferred label: Procesado y conservación de carne y elaboración de productos cárnicos @es
preferred label: Liha töötlemine ja säilitamine ning lihatoodete tootmine @et
preferred label: Teurastus, lihan säilyvyyskäsittely ja lihatuotteiden valmistus @fi
preferred label: Transformation et conservation de la viande et préparation de produits à base de viande @fr
preferred label: Húsfeldolgozás, -tartósítás, húskészítmény gyártása
preferred label: Lavorazione e conservazione di carne e produzione di prodotti a base di carne @it
preferred label: Mėsos perdirbimas ir konservavimas ir mėsos produktų gamyba @lt
preferred label: Gaļas un gaļas produktu ražošana, pārstrāde un konservēšana @lv
preferred label: Ipproċessar u priservar ta' laħam u produzzjoni ta' prodotti tal-laħam @mt
preferred label: Verwerking en conservering van vlees en vervaardiging van vleesproducten @nl
preferred label: Produksjon, bearbeiding og konservering av kjøtt og kjøttvarer @no
preferred label: Przetwarzanie i konserwowanie mięsa oraz produkcja wyrobów z mięsa @pl
preferred label: Abate de animais, preparação e conservação de carne e de produtos à base de carne @pt
preferred label: Producţia, prelucrarea şi conservarea cărnii şi a produselor din carne @ro
preferred label: Переработка и консервирование мяса и производство мясных изделий @ru
preferred label: Spracovanie a konzervovanie mäsa a mäsových produktov @sk
preferred label: Proizvodnja mesa in mesnih izdelkov @sl
preferred label: Beredning och hållbarhetsbehandling av kött och köttvaror @sv
preferred label: Etin işlenmesi ve saklanması ile et ürünlerinin imalatı @tr
broader: Manufacture of food products
narrower: Processing and preserving of meat
narrower: Processing and preserving of poultry meat
narrower: Production of meat and poultry meat products

Processing and preserving of meat
type: Concept
notation: 10.11
status: valid
status modified: 2013-10-18
accepted date: 2013-10-18
in scheme: Statistical Classification of Economic Activities in the European Community, Rev. 2 (2008)
scope note: - дейности на кланици по умъртвяване и клане, разфасоване или пакетиране на месо от едър или дребен рогат добитък, свине, зайци, камили и други - производство на прясно, охладено или замразено месо, неразфасовано - производство на прясно, охладено или замразено месо, разфасовано - разфасоване и преработка на китове на суша или в специализирани кораби - добиване на сурови кожи от кланици, вкл. обезкосмяване - извличане на годни за консумация от човека животински мазнини и свинска мас - производство на пресни, охладени или замра - извличане на годни за консумация от човека мазнини от птици - 10.12 - пакетиране на месо - 82.92 @bg
scope note: Z: - provoz jatek, v nichž se provádí porážka, zpracování a balení masa jiného než drůbežího(tj. hovězího, vepřového, skopového, králičího, velbloudího atd.) - výrobu čerstvého a mrazeného masa, v celku - výrobu čerstvého a mrazeného masa, výsekového ZT: - porážku a zpracování velryb na pevnině nebo na plavidlech k tomu určených - produkci kůží a kožek, vč. žíní a srsti, na jatkách - tavení vepřového sádla a jiných jedlých tuků živočišného původu - zpracování jatečního odpadu - produkci jateční (jirchářské) vlny N: - tavení jedlých drůbežích tuků (10.12) - balení masa (82.92) @cs
scope note: Diese Klasse umfasst: - Betrieb von Schlachthäusern, in denen geschlachtet sowie Fleisch zugerichtet und verpackt wird: Rinder, Schweine, Lämmer, Hammel, Kamele usw. - Herstellung von Frisch- und Gefrierfleisch, in Schlachtkörpern - Herstellung von Frisch- und Gefrierfleisch, in Stücken Diese Klasse umfasst ferner: - Schlachtung und Verarbeitung von Walen an Land oder auf dazu bestimmten Fischereifahrzeugen - Gewinnung von Fellen und Häuten, einschließlich Borsten und Haaren, in Schlachthäusern - Auslassen von Speck und anderen essbaren tierischen Fetten - Verarbeitung von Schlachtabfällen - Erzeugung von Hautwolle Diese Klasse umfasst nicht: - Auslassen von Geflügelfetten (s. 10.12) - Verpacken von Fleisch (s. 82.92) @de
scope note: This class includes: - operation of slaughterhouses engaged in killing, dressing or packing meat: beef, pork, lamb, rabbit, mutton, camel, etc. - production of fresh, chilled or frozen meat, in carcasses - production of fresh, chilled or frozen meat, in cuts This class also includes: - slaughtering and processing of whales on land or on specialised vessels - production of hides and skins originating from slaughterhouses, including fellmongery - rendering of lard and other edible fats of animal origin - processing of animal offal - production of pulled wool This class excludes: - rendering of edible poultry fats, see 10.12 - packaging of meat, see 82.92 @en
scope note: Esta clase comprende: - la explotación de mataderos dedicados al sacrificio, la preparación o el empaquetado de carne: de vaca, cerdo, cordero, conejo, camello, etc.; - la producción de carne fresca, refrigerada o congelada, en canal; - la producción de carne fresca, refrigerada o congelada, en piezas. Esta clase comprende también: - el sacrificio y el tratamiento de ballenas en tierra o en embarcaciones especializadas; - la producción de pieles procedentes de mataderos; - la obtención de manteca de cerdo y otras grasas comestibles de origen animal; - el tratamiento de despojos de animales; - la producción de lana apelambrada. Esta clase no comprende: - la extracción de grasas comestibles de aves (véase 10.12); - el empaquetado de carne (véase 82.92). @es
scope note: Cette classe comprend: - l’exploitation d’abattoirs se livrant à l’abattage, à la préparation et à l’emballage de la viande: bœuf, porc, agneau, lapin, mouton, chameau, etc. - la production de viandes de boucherie, fraîches, congelées ou surgelées, en carcasses - la production de viandes de boucherie, fraîches, congelées ou surgelées, en morceaux Cette classe comprend également: - l’abattage et la transformation des baleines à terre ou à bord de bateaux spécialement équipés - la production de cuirs et de peaux bruts provenant de l’activité des abattoirs, y compris le délainage - la production de saindoux et d’autres graisses animales comestibles - la transformation des abats - la production de laine de délainage Cette classe ne comprend pas: - l’extraction de graisses de volailles comestibles, voir 10.12 - le conditionnement de viandes, voir 82.92 @fr
scope note: Ovaj razred uključuje: - djelatnosti klaonica koje se bave klanjem, pripremom i pakiranjem mesa: govedine, svinjetine, janjetine, mesa od kunića, ovčetine, mesa deve itd. - proizvodnju svježeg, hlađenog ili zamrznutog mesa, u cijelim komadima - proizvodnja svježeg, hlađenog ili zamrznutog mesa, sječenoga u komade Ovaj razred također uključuje: - klanje i preradu kitova na kopnu ili na specijaliziranim brodovima - proizvodnju koža i krzna u klaonicama, uključujući kože s dlakom - proizvodnju svinjske masti i ostalih jestivih masti životinjskog podrijetla - preradu životinjskih iznutrica - proizvodnju čupane vune Ovaj razred isključuje: - proizvodnju jestivih masti od peradi, vidi 10.12 - pakiranje mesa, vidi 82.92
scope note: Į šią klasę įeina: - skerdyklų, užsiimančių gyvūnų skerdimu, išdarinėjimu ir mėsos (pvz., jautienos, kiaulienos, ėrienos, triušienos, avienos, kupranugarienos ir kt.) pakavimu, veikla - šviežios, atšaldytos ar sušaldytos skerdenos gamyba - šviežios, atšaldytos ar sušaldytos kapotos mėsos gamyba Į šią klasę taip pat įeina: - banginių skerdimas ir apdorojimas sausumoje ar specializuotuose laivuose - kailių ir odų gavyba skerdyklose, įskaitant vilnos šalinimą nuo paskerstų gyvulių odų - gyvūninės kilmės taukų ir kitų maistinių riebalų lydymas - gyvūninių subproduktų perdirbimas - peštos vilnos gavyba Į šią klasę neįeina: - valgomųjų paukštienos taukų lydymas, žr. 10.12 - mėsos pakavimas, žr. 82.92 @lt
scope note: Bu sınıf aşağıdakileri kapsamaktadır; - kesim hanelerde gerçekleştirilen hayvan kesimleri etin ambalajlanması veya paketlenmesi faaliyetleri: sığır, domuz, kuzu, tavşan, koyun eti, deve, vb., - taze, soğutulmuş veya dondurulmuş et imalatı, karkas olarak, - taze, soğutulmuş veya dondurulmuş et imalatı, parçalanmış. Ayrıca bu sınıf aşağıdakileri de kapsamaktadır; - balinaların karada ya da özel aletlerde kesilmesi ve işlenmesi, - mezbaha kaynaklı deri ve post imalatı, post yünü dahil, - domuz yağı ve diğer yenilebilir hayvansal yağların eritilmesi, - hayvan sakatatının işlenmesi, - posttan elde edilen yün üretimi. Kapsam dışı olanlar; - kümes hayvanlarının yağlarını sofra yağına çevirme, bkz. 10.12, - etlerin paketlenmesi, bkz. 82.92. @tr
preferred label: Производство и преработка на месо, без месо от домашни птици @bg
preferred label: Zpracování a konzervování masa @cs
preferred label: Forarbejdning og konservering af kød @da
preferred label: Schlachten (ohne Schlachten von Geflügel) @de
preferred label: Επεξεργασία και συντήρηση κρέατος @el
preferred label: Procesado y conservación de carne @es
preferred label: Liha töötlemine ja säilitamine @et
preferred label: Teurastus ja lihan säilyvyyskäsittely (pl. siipikarja) @fi
preferred label: Transformation et conservation de la viande de boucherie @fr
preferred label: Húsfeldolgozás, -tartósítás
preferred label: Lavorazione e conservazione di carne @it
preferred label: Mėsos perdirbimas ir konservavimas @lt
preferred label: Gaļas pārstrāde un konservēšana @lv
preferred label: Ipproċessar u priservar ta' laħam @mt
preferred label: Verwerking en conservering van vlees @nl
preferred label: Bearbeiding og konservering av kjøtt @no
preferred label: Przetwarzanie i konserwowanie mięsa, z wyłączeniem mięsa z drobiu @pl
preferred label: Abate de gado (produção de carne) @pt
preferred label: Prelucrarea şi conservarea cărnii @ro
preferred label: Переработка и консервирование мяса @ru
preferred label: Spracovanie a konzervovanie mäsa @sk
preferred label: Proizvodnja mesa, razen perutninskega @sl
preferred label: Beredning och hållbarhetsbehandling av kreaturskött @sv
preferred label: Etin işlenmesi ve saklanması @tr
broader: Processing and preserving of meat and production of meat products

Processing and preserving of poultry meat
type: Concept
notation: 10.12
status: valid
status modified: 2013-10-18
accepted date: 2013-10-18
in scheme: Statistical Classification of Economic Activities in the European Community, Rev. 2 (2008)
scope note: - дейности на кланици по умъртвяване и клане, разфасоване или пакетиране на месо от домашни птици - производство на прясно, охладено или замразено месо от домашни птици, разфасовано - извличане на годни за консумация от човека мазнини от птици - производство на перушина и пух - производство на пресни, охладени или замразени субпродукти от домашни птици - пакетиране на месо - 82.92 @bg
scope note: Z: - provoz jatek, v nichž se provádí porážka, zpracování a balení drůbežího masa - výrobu čerstvého nebo mrazeného drůbežího masa v jednotlivých porcích - tavení jedlých drůbežích tuků ZT: - získávání per a prachového peří N: - balení masa (82.92) @cs
scope note: Diese Klasse umfasst: - Betrieb von Schlachthäusern, in denen Geflügel geschlachtet, zugerichtet und verpackt wird - Herstellung von frischem oder gefrorenem Geflügelfleisch in Einzelportionen - Auslassen von Geflügelfetten Diese Klasse umfasst ferner: - Gewinnung von Federn und Daunen Diese Klasse umfasst nicht: - Verpacken von Fleisch (s. 82.92) @de
scope note: This class includes: - operation of slaughterhouses engaged in killing, dressing or packing poultry - production of fresh, chilled or frozen meat in individual portions - rendering of edible poultry fats This class also includes: - production of feathers and down This class excludes: - packaging of meat, see 82.92 @en
scope note: Esta clase comprende: - la explotación de mataderos dedicados al sacrificio, la preparación o el empaquetado de aves; - la producción de carne fresca, refrigerada o congelada, en porciones individuales; - la extracción de grasas comestibles de aves. Esta clase comprende también: - la producción de plumas y plumón. Esta clase no comprende: - el empaquetado de carne (véase 82.92). @es
scope note: Cette classe comprend: - l’exploitation d’abattoirs se livrant à l’abattage, à la préparation et à l’emballage de volailles - la production de viandes de volailles en portions individuelles, fraîches, congelées ou surgelées - l’extraction de graisses de volailles comestibles Cette classe comprend également: - la production de plumes et de duvets Cette classe ne comprend pas: - le conditionnement de viandes, voir 82.92 @fr
scope note: Ovaj razred uključuje: - djelatnosti klaonica koje se bave klanjem peradi, pripremom ili pakiranjem mesa od peradi - proizvodnju svježeg, hlađenog ili zamrznutog mesa, pripremljenog u obliku individualnih porcija - proizvodnju jestivih masti od peradi Ovaj razred također uključuje: - proizvodnju perja i paperja Ovaj razred isključuje: - pakiranje mesa, vidi 82.92
scope note: Į šią klasę įeina: - skerdyklų, užsiimančių naminių paukščių skerdimu, išdarinėjimu ir paukštienos pakavimu, veikla - šviežios, atšaldytos ar sušaldytos naminių paukščių mėsos gamyba porcijomis - valgomųjų paukštienos taukų lydymas Į šią klasę taip pat įeina: - plunksnų ir pūkų gavyba Į šią klasę neįeina: - mėsos pakavimas, žr. 82.92 @lt
scope note: Этот класс включает: - переработку и консервирование рыбы, ракообразных и моллюсков: заморозка, глубокая заморозка, сушка, обработка, копчение, засол, консервирование и т.д. - производство продуктов из рыбы, ракообразных и моллюсков: филе рыбы, икры, искусственной икры и т.д. - производство рыбных продуктов для употребления в пищу людьми или для кормления животных - производство муки и растворимых веществ из рыбы и прочих водных видов животных, непригодных для употребления в пищу людьми Этот класс также включает: - деятельность судов, направленную только на переработку и консервирование рыбы - переработку морских водорослей Этот класс исключает: - переработку и хранение рыбы на судах, предназначенных для отлова рыбы, см. 03.11 - переработку китового мяса на суше или на специализированных судах, см. 10.11 - производство масел и жиров из морепродуктов, см. 10.41 - производство готовых замороженных блюд из рыбы, см. 10.85 - производство рыбных супов, см. 10.89 @ru
scope note: Bu sınıf aşağıdakileri kapsamaktadır; - kümes hayvanlarının kesilmesi, temizlenmesi veya paketlenmesi işi ile uğraşan mezbahaların faaliyetleri, - ayrı parçalarda taze veya dondurulmuş kümes hayvanları etlerinin imalatı, - kümes hayvanlarının yağlarını sofra yağına çevirme. Ayrıca bu sınıf şunları da kapsamaktadır; - kuş tüyü veya ince kuş tüyü üretimi. Kapsam dışı olanlar; - kümes hayvanı etlerinin paketlenmesi, bkz. 82.92. @tr
preferred label: Производство и преработка на месо от домашни птици @bg
preferred label: Zpracování a konzervování drůbežího masa @cs
preferred label: Forarbejdning og konservering af fjerkrækød @da
preferred label: Schlachten von Geflügel @de
preferred label: Επεξεργασία και συντήρηση κρέατος πουλερικών @el
preferred label: Procesado y conservación de volatería @es
preferred label: Linnuliha töötlemine ja säilitamine @et
preferred label: Siipikarjan teurastus ja lihan säilyvyyskäsittely @fi
preferred label: Transformation et conservation de la viande de volaille @fr
preferred label: Baromfihús feldolgozása, tartósítása
preferred label: Lavorazione e conservazione di carne di volatili @it
preferred label: Paukštienos perdirbimas ir konservavimas @lt
preferred label: Mājputnu gaļas pārstrāde un konservēšana @lv
preferred label: Ipproċessar u priservar ta' laħam tat-tjur @mt
preferred label: Verwerking en conservering van gevogelte @nl
preferred label: Bearbeiding og konservering av fjørfekjøtt @no
preferred label: Przetwarzanie i konserwowanie mięsa z drobiu @pl
preferred label: Abate de aves (produção de carne) @pt
preferred label: Prelucrarea şi conservarea cărnii de pasăre @ro
preferred label: Переработка и консервирование мяса домашней птицы @ru
preferred label: Spracovanie a konzervovanie hydinového mäsa @sk
preferred label: Proizvodnja perutninskega mesa @sl
preferred label: Beredning och hållbarhetsbehandling av fjäderfäkött @sv
preferred label: Kümes hayvanları etlerinin işlenmesi ve saklanması @tr
broader: Processing and preserving of meat and production of meat products

Production of meat and poultry meat products
type: Concept
notation: 10.13
status: valid
status modified: 2013-10-18
accepted date: 2013-10-18
in scheme: Statistical Classification of Economic Activities in the European Community, Rev. 2 (2008)
scope note: - производство на сушени, осолени и пушени меса - производство на месни продукти: • колбаси, наденици, суджуци, луканки, салами, шунка, пастети - производство на замразени готови месни ястия - 10.85 - производство на супи, съдържащи месо - 10.89 - търговия на едро с месо и месни продукти - 46.32 - пакетиране на месо - 82.92 @bg
scope note: Z: - výrobu sušeného, soleného nebo uzeného masa - výrobu masných výrobků jako: • párků, vuřtů, salámů, jitrnic, jelit, tlačenky, cerbulátu, paštik, ragú, vařené šunky N: - výrobu mrazených hotových pokrmů z masa, vč. drůbežího (10.85) - výrobu polévek s obsahem masa (10.89) - velkoobchod s masem a masnými výrobky (46.32) - balení masa (82.92) @cs
scope note: Diese Klasse umfasst: - Herstellung von getrocknetem, gesalzenem oder geräuchertem Fleisch - Herstellung von Fleischerzeugnissen wie: • Salami, "Andouillettes", Zervelatwurst, Bologneser Wurst und anderen Würsten, Pasteten, Fleisch in Aspik, Schmalzfleisch und anderen Fleischkonserven, Kochschinken Diese Klasse umfasst nicht: - Herstellung von gefrorenen zubereiteten Fleisch- und Geflügelgerichten (s. 10.85) - Herstellung von Fleischsuppen und -Brühen (s. 10.89) - Großhandel mit Fleisch und Fleischwaren (s. 46.32) - Verpacken von Fleisch (s. 82.92) @de
scope note: This class includes: - production of dried, salted or smoked meat - production of meat products: • sausages, salami, puddings, "andouillettes", saveloys, bolognas, pâtés, rillettes, boiled ham This class excludes: - manufacture of prepared frozen meat and poultry dishes, see 10.85 - manufacture of soup containing meat, see 10.89 - wholesale trade of meat, see 46.32 - packaging of meat, see 82.92 @en
scope note: Esta clase comprende: - la producción de carne seca, salada o ahumada; - la fabricación de productos cárnicos: • embutidos, salami, morcillas, salchichas, patés, chicharrones y jamones cocidos. Esta clase no comprende: - la producción de platos precocinados congelados a base de carne (véase 10.85); - la fabricación de sopas con carne (véase 10.89); - el comercio al por mayor de carne (véase 46.32); - el empaquetado de carne (véase 82.92). @es
scope note: Cette classe comprend: - la production de viandes séchées, salées ou fumées - la production de produits de charcuterie: • saucisses, salamis, boudins, andouillettes, cervelas, mortadelles, pâtés, rillettes, jambons cuits Cette classe ne comprend pas: - la production de plats préparés surgelés à base de viande et à base de volaille, voir 10.85 - la préparation de potages contenant de la viande, voir 10.89 - le commerce de gros de viandes, voir 46.32 - le conditionnement de viandes, voir 82.92 @fr
scope note: Ovaj razred uključuje: - proizvodnju sušenog, soljenog ili dimljenog mesa - proizvodnju mesnih prerađevina: • kobasica svih vrsta, salama, pašteta, hladetine, kuhane šunke Ovaj razred isključuje: - proizvodnju pripremljenih smrznutih jela od mesa i piletine, vidi 10.85 - proizvodnju gotovih juha koje sadrže meso, vidi 10.89 - trgovinu na veliko mesom, vidi 46.32 - pakiranje mesa, vidi 82.92
scope note: Į šią klasę įeina: - džiovintos, sūdytos arba rūkytos mėsos gamyba - mėsos produktų gamyba • dešrelių, saliamio, kraujinės dešros, servelato, rūkytų dešrų, pašteto, galantino, šaltienos, rūkyto (virto) kumpio Į šią klasę neįeina - paruoštų sušaldytos mėsos ir vištienos patiekalų gamyba, žr. 10.85 - sriubų su mėsa gamyba, žr. 10.89 - mėsos didmeninė prekyba, žr. 46.32 - mėsos pakavimas, žr. 82.92 @lt
scope note: Bu sınıf aşağıdakileri kapsamaktadır; - kurutulmuş, tuzlanmış veya tütsülenmiş et imalatı, - et ürünleri imalatı; • sosis, salam, dizi sosis, çok baharatlı kurutulmuş domuz sosisi, sucuk, ezilmiş ya da kesilmiş çeşitli hamura sarılmış et ürünleri, jelatinli et, rillette, haşlanmış jambon (pastırma dahil). Kapsam dışı olanlar; - hazır donmuş et ve kümes hayvanları eti yemekleri imalatı, bkz. 10.85, - et ihtiva eden çorba imalatı, bkz. 10.89, - etin toptan ticaretinin yapılması, bkz. 46.32, - etin paketlenmesi, bkz. 82.92. @tr
preferred label: Производство на месни продукти, без готови ястия @bg
preferred label: Výroba masných výrobků a výrobků z drůbežího masa @cs
preferred label: Produktion af kød- og fjerkrækødprodukter @da
preferred label: Fleischverarbeitung @de
preferred label: Παραγωγή προϊόντων κρέατος και κρέατος πουλερικών @el
preferred label: Elaboración de productos cárnicos y de volatería @es
preferred label: Liha- ja linnulihatoodete tootmine @et
preferred label: Liha- ja siipikarjatuotteiden valmistus @fi
preferred label: Préparation de produits à base de viande @fr
preferred label: Hús-, baromfihús-készítmény gyártása
preferred label: Produzione di prodotti a base di carne (compresa la carne di volatili) @it
preferred label: Mėsos ir paukštienos produktų gamyba @lt
preferred label: Gaļas un mājputnu gaļas produktu ražošana @lv
preferred label: Produzzjoni ta' laħam u prodotti ta' laħam tat-tjur @mt
preferred label: Vervaardiging van producten van vlees of van gevogelte @nl
preferred label: Produksjon av kjøtt- og fjørfevarer @no
preferred label: Produkcja wyrobów z mięsa, włączając wyroby z mięsa z drobiu @pl
preferred label: Fabricação de produtos à base de carne @pt
preferred label: Fabricarea produselor din carne (inclusiv din carne de pasăre) @ro
preferred label: Производство продуктов из мяса и мяса домашней птицы @ru
preferred label: Spracovanie mäsových a hydinových mäsových výrobkov @sk
preferred label: Proizvodnja mesnih izdelkov @sl
preferred label: Charkuteri- och annan köttvarutillverkning @sv
preferred label: Et ve kümes hayvanları etlerinden üretilen ürünlerin imalatı @tr
broader: Processing and preserving of meat and production of meat products

Processing and preserving of fish, crustaceans and molluscs
type: Concept
notation: 10.2
status: valid
status modified: 2013-10-18
accepted date: 2013-10-18
in scheme: Statistical Classification of Economic Activities in the European Community, Rev. 2 (2008)
scope note: Этот класс включает: - переработка и консервирование картофеля: • производство обработанного замороженного картофеля • производство сухого картофельного пюре • производство закусок из картофеля • производство картофельных чипсов • производство картофельной муки и мучки Этот класс также включает: - промышленную очистку картофеля @ru
preferred label: Преработка и консервиране на риба и други водни животни, без готови ястия @bg
preferred label: Zpracování a konzervování ryb, korýšů a měkkýšů @cs
preferred label: Forarbejdning og konservering af fisk, krebsdyr og bløddyr @da
preferred label: Fischverarbeitung @de
preferred label: Επεξεργασία και συντήρηση ψαριών, καρκινοειδών και μαλακίων @el
preferred label: Procesado y conservación de pescados, crustáceos y moluscos @es
preferred label: Kala, vähilaadsete ja limuste töötlemine ja säilitamine @et
preferred label: Kalan, äyriäisten ja nilviäisten jalostus ja säilöntä @fi
preferred label: Transformation et conservation de poisson, de crustacés et de mollusques @fr
preferred label: Halfeldolgozás, -tartósítás
preferred label: Lavorazione e conservazione di pesce, crostacei e molluschi @it
preferred label: Žuvų, vėžiagyvių ir moliuskų perdirbimas ir konservavimas @lt
preferred label: Zivju, vēžveidīgo un mīkstmiešu pārstrāde un konservēšana @lv
preferred label: Ipproċessar u priservar ta' ħut, krustaċji u molluski @mt
preferred label: Verwerking en conservering van vis en van schaal- en weekdieren @nl
preferred label: Bearbeiding og konservering av fisk, skalldyr og bløtdyr @no
preferred label: Przetwarzanie i konserwowanie ryb, skorupiaków i mięczaków @pl
preferred label: Preparação e conservação de peixes, crustáceos e moluscos @pt
preferred label: Prelucrarea şi conservarea peştelui, crustaceelor şi moluştelor @ro
preferred label: Переработка и консервирование рыбы, ракообразных и моллюсков @ru
preferred label: Spracovanie a konzervovanie rýb, kôrovcov a mäkkýšov @sk
preferred label: Predelava in konzerviranje rib, rakov in mehkužcev @sl
preferred label: Beredning och hållbarhetsbehandling av fisk samt skal- och blötdjur @sv
preferred label: Balık, kabuklu deniz hayvanları ve yumuşakçaların işlenmesi ve saklanması @tr
broader: Manufacture of food products
narrower: Processing and preserving of fish, crustaceans and molluscs

Processing and preserving of fish, crustaceans and molluscs
type: Concept
notation: 10.20
status: valid
status modified: 2013-10-18
accepted date: 2013-10-18
in scheme: Statistical Classification of Economic Activities in the European Community, Rev. 2 (2008)
scope note: - преработка и консервиране на риба, ракообразни и мекотели: охлаждане, замразяване, изсушаване, опушване, осоляване, поставяне в саламура и други - производство на продукти от риба, ракообразни и мекотели: филета, хайвер, черен дроб и други - производство на брашно от риба за консумация от човека или за храна за животни - производство на брашно, прахове и агломерати под формата на гранули от риба и други водни животни, негодни за консумация от човека - дейност на кораби заводи, специализирани само в преработка и консервиране на риба - преработка на морска трева и други водорасли - преработка и консервиране на риба на кораби, извършващи океански и морски риболов - 03.11 - преработка на китове на суша или в специализирани кораби - 10.11 - производство на масла и мазнини от риба и морски бозайници -10.41 - производство на замразени готови рибни ястия - 10.85 - производство на супи, съдържащи риба - 10.89 @bg
scope note: Z: - zpracování a konzervování ryb, korýšů a měkkýšů: zmrazování (též hluboké), sušení, vaření, uzení, prosolování, nakládání do láků, výrobu konzerv atd. - výrobu produktů z ryb, korýšů a měkkýšů:rybího filé, jiker, kaviáru, kaviárových náhražek atd. - výrobu rybí moučky pro lidskou výživu nebo jako krmiva pro zvířata - výrobu mouček a vylisovaných šťáv z ryb a jiných vodních živočichů, nevhodných pro lidskou výživu ZT: - zpracování a konzervování ryb, korýšů a měkkýšů na plavidlech k tomu určených - zpracování mořských řas N: - zpracování a konzervování ryb na rybářských plavidlech (03.11) - zpracování velryb na pevnině nebo na plavidlech k tomu určených (10.11) - výrobu olejů a tuků z mořských živočichů (10.41) - výrobu mrazených hotových pokrmů z ryb (10.85) - výrobu rybích polévek (10.89) @cs
scope note: Diese Klasse umfasst: - Konservierung von Fisch, Krebstieren und Weichtieren: Gefrieren, Tiefkühlen, Trocknen, Kochen, Räuchern, Salzen, Einlegen in Lake, Verarbeitung zu Konserven usw. - Herstellung von Erzeugnissen aus Fisch, Krebstieren und Weichtieren: Kochfisch, Fischfilets, Fischrogen, Kaviar, Kaviarersatz usw. - Herstellung von Fischmehl als Nahrungsmittel für Menschen oder als Futtermittel - Herstellung von nichtgenießbaren Mehlen und Extrakten von Fischen und anderen Wassertieren Diese Klasse umfasst ferner: - Tätigkeiten von Spezialschiffen für die Fischverarbeitung und -konservierung - Verarbeitung von Seealgen Diese Klasse umfasst nicht: - Verarbeitung und Haltbarmachung von Fisch auf Fischereifahrzeugen (s. 03.11) - Verarbeitung von Walen an Land oder auf dazu bestimmten Fischereifahrzeugen (s. 10.11) - Herstellung von Ölen und Fetten aus Meerestieren (s. 10.41) - Herstellung von gefrorenen zubereiteten Fischgerichten (s. 10.85) - Herstellung von Fischsuppen (s. 10.89) @de
scope note: This class includes: - preparation and preservation of fish, crustaceans and molluscs: freezing, deep-freezing, drying, cooking, smoking, salting, immersing in brine, canning etc. - production of fish, crustacean and mollusc products: fish fillets, roes, caviar, caviar substitutes etc. - production of fishmeal for human consumption or animal feed - production of meals and solubles from fish and other aquatic animals unfit for human consumption This class also includes: - activities of vessels engaged only in the processing and preserving of fish - processing of seaweed This class excludes: - processing and preserving of fish on vessels engaged in fishing, see 03.11 - processing of whales on land or specialised vessels, see 10.11 - production of oils and fats from marine material, see 10.41 - manufacture of prepared frozen fish dishes, see 10.85 - manufacture of fish soups, see 10.89 @en
scope note: Esta clase comprende: - la preparación y conservación de pescados, crustáceos y moluscos: congelación, ultracongelación, secado, cocción, ahumado, salazón, conservación en salmuera, enlatado, etc.; - la producción de productos de pescado, crustáceos y moluscos; filetes de pescado, huevas, caviar, sucedáneos de caviar, etc.; - la fabricación de productos a base de pescado para el consumo humano o la alimentación animal; - la producción de comidas y productos solubles a partir de pescado y otros animales acuáticos no aptos para el consumo humano. Esta clase comprende también: - las actividades de barcos factoría dedicados exclusivamente a la elaboración y conservación de pescado; - el procesado de algas marinas. Esta clase no comprende: - el procesado y la conservación de pescado en embarcaciones dedicadas a la pesca (véase 03.11); - el procesado de ballenas en tierra o en embarcaciones especializadas (véase 10.11); - la producción de aceites y grasas a partir de productos marinos (véase 10.41); - la producción de platos precocinados congelados a base de pescado (véase 10.85); - la elaboración de sopas de pescado (véase 10.89). @es
scope note: Cette classe comprend: - la préparation et la conservation de poissons, de crustacés et de mollusques: congélation, surgélation, séchage, cuisson, fumage, salage, saumurage, mise en conserve, etc. - la préparation de produits à base de poissons, de crustacés et de mollusques: filets de poisson, laitances, caviar et ses succédanés, etc. - la production de farines de poissons destinées à l’alimentation humaine ou animale - la production de farines et de solubles à partir de poissons et d’autres animaux aquatiques impropres à la consommation humaine Cette classe comprend également: - les activités des navires se livrant uniquement à la transformation et à la conservation du poisson - la transformation d’algues marines Cette classe ne comprend pas: - la transformation et la conservation du poisson sur des navires se livrant à la pêche en mer, voir 03.11 - la transformation des baleines à terre ou à bord de bateaux spécialement équipés, voir 10.11 - la production d’huiles et de matières grasses à partir de substances marines, voir 10.41 - la production de plats préparés surgelés à base de poissons, voir 10.85 - la fabrication de potages à base de poissons, voir 10.89 @fr
scope note: Ovaj razred uključuje: - obradu i konzerviranje riba, rakova i školjaka: zamrzavanje, duboko zamrzavanje, sušenje, dimljenje, soljenje, potapanje u salamuru, stavljanje u limenke itd. - proizvodnju proizvoda od ribe, rakova i školjaka: ribljih fileta, riblje ikre, kavijara, nadomjestaka kavijara itd. - proizvodnju ribljih jela za ljudsku uporabu ili kao hrane za životinje - proizvodnju nejestivog brašna i iscijeđenog soka od riba te ostalih vodenih životinja Ovaj razred također uključuje: - djelatnosti na brodovima koji se bave isključivo preradom i konzerviranjem ribe - preradu morskog raslinja Ovaj razred isključuje: - obradu i konzerviranje ribe na brodovima koji se bave ribolovom, vidi 03.11 - preradu kitova na kopnu ili na specijaliziranim brodovima, vidi 10.11 - proizvodnju ulja i masti od morskih životinja, vidi 10.41 - proizvodnju pripremljenih zamrznutih ribljih jela, vidi 10.85 - proizvodnju riblje juhe, vidi 10.89
scope note: Į šią klasę įeina: - žuvų, vėžiagyvių ir moliuskų paruošimas ir konservavimas: šaldymas, užšaldymas, džiovinimas, kepimas, rūkymas, sūdymas, mirkymas sūryme, konservavimas sandarioje taroje ir kt. - žuvų, vėžiagyvių ir moliuskų produktų, pvz., žuvies filė, ikrų, sūdytų ikrų, ikrų pakaitalų ir kt., gamyba - žuvų miltų maistui ar gyvūnų pašarams gamyba - rupių miltų ir tirpiųjų medžiagų gamyba iš žuvų ir kitų vandens gyvūnų Į šią klasę taip pat įeina: - laivų, užsiimančių tik žuvų paruošimu, perdirbimu ir konservavimu, veikla - jūros dumblių perdirbimas Į šią klasę neįeina: - žuvų perdirbimas ir konservavimas žvejybiniuose laivuose, žr. 03.11 - banginių perdirbimas sausumoje ar specializuotuose laivuose, žr. 10.11 - aliejaus ir taukų gamyba iš jūros produktų, žr. 10.41 - paruoštų sušaldytų žuvies patiekalų gamyba, žr. 10.85 - žuvienių gamyba, žr. 10.89 @lt
scope note: Этот класс включает: - производство фруктовых или овощных соков Этот класс также включает: - производство концентратов из свежих фруктов и овощей @ru
scope note: Bu sınıf aşağıdakileri kapsamaktadır; - balıkların, kabuklu deniz hayvanlarının ve omurgasız yumuşakçaların hazırlanması ve işlenmesi: dondurulması, derin dondurulması, kurutulması, tütsülenmesi, tuzlanması, salamura edilmesi, konservelenmesi vb., - balık, kabuklu deniz hayvanı ve yumuşakçaların işlenmesi: pişmiş balık, balık filetosu, balık yumurtası, havyar, havyar yerine kullanılan ürünler vb., - insan tüketimi veya hayvan yemi amacıyla balık kaba unlarının üretilmesi, - balıklardan ve suda yetişen diğer hayvanlardan insan tüketimi için uygun olmayan kaba unlarının ve özlerinin üretilmesi. Ayrıca bu sınıf şunları da kapsamaktadır; - sadece balığın işlenmesi ve saklanmasıyla ilgili faaliyet gösteren tekne ve gemi balıkçılığı, - deniz yosununun işlenmesi. Kapsam dışı olanlar; - hem balığın tutulması hem de işlenmesi ve saklanmasıyla ilgili faaliyet gösteren tekne ve gemi balıkçılığı, bkz. 03.11, - balinaların karada veya özel teknelerde işlenmesi, bkz. 10.11, - deniz ürünlerinden sıvı ve katı yağ imalatı, bkz. 10.41, - dondurulmuş hazır balık yemeklerinin imalatı, bkz. 10.85, - balık çorbaları imalatı, bkz. 10.89, @tr
preferred label: Преработка и консервиране на риба и други водни животни, без готови ястия @bg
preferred label: Zpracování a konzervování ryb, korýšů a měkkýšů @cs
preferred label: Forarbejdning og konservering af fisk, krebsdyr og bløddyr @da
preferred label: Fischverarbeitung @de
preferred label: Επεξεργασία και συντήρηση ψαριών, καρκινοειδών και μαλακίων @el
preferred label: Procesado y conservación de pescados, crustáceos y moluscos @es
preferred label: Kala, vähilaadsete ja limuste töötlemine ja säilitamine @et
preferred label: Kalan, äyriäisten ja nilviäisten jalostus ja säilöntä @fi
preferred label: Transformation et conservation de poisson, de crustacés et de mollusques @fr
preferred label: Halfeldolgozás, -tartósítás
preferred label: Lavorazione e conservazione di pesce, crostacei e molluschi @it
preferred label: Žuvų, vėžiagyvių ir moliuskų perdirbimas ir konservavimas @lt
preferred label: Zivju, vēžveidīgo un mīkstmiešu pārstrāde un konservēšana @lv
preferred label: Ipproċessar u priservar ta' ħut, krustaċji u molluski @mt
preferred label: Verwerking en conservering van vis en van schaal- en weekdieren @nl
preferred label: Bearbeiding og konservering av fisk, skalldyr og bløtdyr @no
preferred label: Przetwarzanie i konserwowanie ryb, skorupiaków i mięczaków @pl
preferred label: Preparação e conservação de peixes, crustáceos e moluscos @pt
preferred label: Prelucrarea şi conservarea peştelui, crustaceelor şi moluştelor @ro
preferred label: Переработка и консервирование рыбы, ракообразных и моллюсков @ru
preferred label: Spracovanie a konzervovanie rýb, kôrovcov a mäkkýšov @sk
preferred label: Predelava in konzerviranje rib, rakov in mehkužcev @sl
preferred label: Beredning och hållbarhetsbehandling av fisk samt skal- och blötdjur @sv
preferred label: Balık, kabuklu deniz hayvanları ve yumuşakçaların işlenmesi ve saklanması @tr
broader: Processing and preserving of fish, crustaceans and molluscs

Processing and preserving of fruit and vegetables
type: Concept
notation: 10.3
status: valid
status modified: 2013-10-18
accepted date: 2013-10-18
in scheme: Statistical Classification of Economic Activities in the European Community, Rev. 2 (2008)
scope note: Этот класс включает: - производство продуктов питания, состоящих в основном из фруктов или овощей, за исключением готовых блюд в замороженном или консервированном виде - консервирование фруктов, орехов или овощей: заморозка, сушка, пропитывание в масле или уксусе, консервирование и т.д. - производство продуктов питания из фруктов или овощей - производство джемов, мармеладов и столового желе - обжаривание орехов - производство пасты и прочих продуктов питания из орехов Этот класс также включает: - производство скоропортящихся готовых продуктов питания из фруктов и овощей, таких как: • салаты; смешанные салаты в упаковке; • очищенные или нарезанные овощи • тофу (соевый творог) Этот класс исключает: - производство фруктовых или овощных соков, см. 10.32 - производство муки или мучки из сушеных бобовых культур, см. 10.61 - консервирование фруктов и орехов в сахаре, см. 10.82 - производство готовых блюд из овощей, см. 10.85 - производство искусственных концентратов, см. 10.89 @ru
preferred label: Преработка и консервиране на плодове и зеленчуци, без готови ястия @bg
preferred label: Zpracování a konzervování ovoce a zeleniny @cs
preferred label: Forarbejdning og konservering af frugt og grøntsager @da
preferred label: Obst- und Gemüseverarbeitung @de
preferred label: Επεξεργασία και συντήρηση φρούτων και λαχανικών @el
preferred label: Procesado y conservación de frutas y hortalizas @es
preferred label: Puu- ja köögivilja töötlemine ja säilitamine @et
preferred label: Hedelmien ja kasvisten jalostus ja säilöntä @fi
preferred label: Transformation et conservation de fruits et légumes @fr
preferred label: Gyümölcs-, zöldségfeldolgozás, -tartósítás
preferred label: Lavorazione e conservazione di frutta e ortaggi @it
preferred label: Vaisių ir daržovių perdirbimas ir konservavimas @lt
preferred label: Augļu un dārzeņu pārstrāde un konservēšana @lv
preferred label: Ipproċessar u priservar ta' frott u ħxejjex @mt
preferred label: Verwerking en conservering van groenten en fruit @nl
preferred label: Bearbeiding og konservering av frukt og grønnsaker @no
preferred label: Przetwarzanie i konserwowanie owoców i warzyw @pl
preferred label: Preparação e conservação de frutos e de produtos hortícolas @pt
preferred label: Prelucrarea şi conservarea fructelor şi legumelor @ro
preferred label: Переработка и консервирование фруктов и овощей @ru
preferred label: Spracovanie a konzervovanie ovocia a zeleniny @sk
preferred label: Predelava in konzerviranje sadja in zelenjave @sl
preferred label: Beredning och hållbarhetsbehandling av frukt, bär och grönsaker @sv
preferred label: Sebze ve meyvelerin işlenmesi ve saklanması @tr
broader: Manufacture of food products
narrower: Processing and preserving of potatoes
narrower: Manufacture of fruit and vegetable juice
narrower: Other processing and preserving of fruit and vegetables

Processing and preserving of potatoes
type: Concept
notation: 10.31
status: valid
status modified: 2013-10-18
accepted date: 2013-10-18
in scheme: Statistical Classification of Economic Activities in the European Community, Rev. 2 (2008)
scope note: - преработка и консервиране на картофи: • производство на замразени картофи • производство на сухи картофени пюрета • производство на картофени закуски (снакс) • производство на чипс • производство на картофено брашно и грис - промишлено белене на картофи @bg
scope note: Z: - zpracování a konzervování brambor: • výroba mrazených bramborových polotovarů • výroba dehydratované bramborové kaše • výroba bramborových krekrů • výroba bramborových lupínků • výroba bramborových vloček a mouky ZT: - průmyslové loupání a škrábání brambor @cs
scope note: Diese Klasse umfasst: - Kartoffelverarbeitung und -haltbarmachung • Herstellung von gefrorenen zubereiteten Kartoffeln • Herstellung von dehydriertem Kartoffelpüree • Herstellung von Kartoffelsnacks • Herstellung von Kartoffelchips • Herstellung von Kartoffelflocken und Kartoffelmehl Diese Klasse umfasst ferner: - industrielles Schälen von Kartoffeln @de
scope note: This class includes: - processing and preserving of potatoes: • manufacture of prepared frozen potatoes • manufacture of dehydrated mashed potatoes • manufacture of potato snacks • manufacture of potato crisps • manufacture of potato flour and meal This class also includes: - industrial peeling of potatoes @en
scope note: Esta clase comprende: - la preparación y conservación de patatas: • la fabricación de patatas congeladas precocinadas; • la fabricación de puré de patatas deshidratadas; • la fabricación de aperitivos a base de patata; • la elaboración de harinas y sémola de patatas. Esta clase comprende también: - el pelado industrial de patatas @es
scope note: Cette classe comprend: - la transformation et la conservation de pommes de terre: • la production de pommes de terre précuites surgelées • la production de purée de pommes de terre déshydratées • la production de produits apéritifs à base de pommes de terre • la production de pommes chips à base de pommes de terre • la fabrication de farines et de fécules de pommes de terre Cette classe comprend également: - l’épluchage industriel de pommes de terre @fr
scope note: Ovaj razred uključuje: - preradu i konzerviranje krumpira: • proizvodnju polugotovoga zamrznutog krumpira • proizvodnju sušenog pirea od krumpira • proizvodnju pomfrita • proizvodnju čipsa (hrskavoga krumpira) • proizvodnju krumpirova brašna i prekrupe Ovaj razred također uključuje: - industrijsko ljuštenje krumpira
scope note: Į šią klasę įeina: - bulvių perdirbimas ir konservavimas: • paruoštų sušaldytų bulvių gamyba • dehidruotos bulvių tyrės gamyba • lengvų bulvių užkandžių gamyba • bulvių traškučių gamyba • bulvių miltų ir rupinių gamyba Į šią klasę taip pat įeina: - pramoninis bulvių skutimas @lt
scope note: Данная группа включает производство неочищенных и очищенных растительных и животных масел и жиров, за исключением вытапливания или перегонки внутреннего свиного сала и прочих видов съедобных жиров животного происхождения. @ru
scope note: Bu sınıf aşağıdakileri kapsamaktadır; - patates işlenmesini ve saklanmasını; • hazır dondurulmuş patates imalatı, • kurutulmuş, suyu çıkartılmış ezilmiş patates imalatı, • patates çerezi imalatı, • patates cipsi imalatı, • patates unu ve kaba unlarının imalatı. Ayrıca bu sınıf aşağıdakileri de kapsamaktadır; - sanayi amaçlı patatesin soyulması. @tr
preferred label: Преработка и консервиране на картофи @bg
preferred label: Zpracování a konzervování brambor @cs
preferred label: Forarbejdning og konservering af kartofler @da
preferred label: Kartoffelverarbeitung @de
preferred label: Επεξεργασία και συντήρηση πατατών @el
preferred label: Procesado y conservación de patatas @es
preferred label: Kartuli töötlemine ja säilitamine @et
preferred label: Perunoiden jalostus ja säilöntä @fi
preferred label: Transformation et conservation de pommes de terre @fr
preferred label: Burgonyafeldolgozás, -tartósítás
preferred label: Lavorazione e conservazione delle patate @it
preferred label: Bulvių perdirbimas ir konservavimas @lt
preferred label: Kartupeļu pārstrāde @lv
preferred label: Ipproċessar u priservar ta' patata @mt
preferred label: Verwerking en conservering van aardappelen @nl
preferred label: Bearbeiding og konservering av poteter @no
preferred label: Przetwarzanie i konserwowanie ziemniaków @pl
preferred label: Preparação e conservação de batatas @pt
preferred label: Prelucrarea şi conservarea cartofilor @ro
preferred label: Переработка и консервирование картофеля @ru
preferred label: Spracovanie a konzervovanie zemiakov @sk
preferred label: Predelava in konzerviranje krompirja @sl
preferred label: Beredning och hållbarhetsbehandling av potatis @sv
preferred label: Patatesin işlenmesi ve saklanması @tr
broader: Processing and preserving of fruit and vegetables

Manufacture of fruit and vegetable juice
type: Concept
notation: 10.32
status: valid
status modified: 2013-10-18
accepted date: 2013-10-18
in scheme: Statistical Classification of Economic Activities in the European Community, Rev. 2 (2008)
scope note: - производство на натурални плодови и зеленчукови сокове - производство на концентрирани плодови и зеленчукови сокове @bg
scope note: Z: - výrobu ovocných a zeleninových šťáv ZT: - výrobu koncentrátů z čerstvého ovoce a zeleniny @cs
scope note: Diese Klasse umfasst: - Herstellung von Obst- und Gemüsesäften Diese Klasse umfasst ferner: - Herstellung von Konzentraten aus frischem Obst und Gemüse @de
scope note: This class includes: - manufacture of fruit or vegetable juices This class also includes: - production of concentrates from fresh fruits and vegetables @en
scope note: Esta clase comprende: - la fabricación de jugos de frutas y hortalizas. Esta clase comprende también: - la producción de concentrados de frutas y hortalizas frescas. @es
scope note: Cette classe comprend: - la préparation de jus de fruits et légumes Cette classe comprend également: - la production de concentrés à partir de fruits et légumes frais @fr
scope note: Ovaj razred uključuje: - proizvodnju soka od voća i povrća Ovaj razred također uključuje: - proizvodnju koncentrata svježeg voća i povrća
scope note: Į šią klasę įeina: - vaisių, uogų ir daržovių sulčių gamyba Į šią klasę taip pat įeina: - šviežių vaisių, uogų ir daržovių koncentratų gamyba @lt
scope note: Этот класс включает: - производство неочищенных растительных масел: оливкового, соевого, пальмового, подсолнечного, хлопкового, рапсового, горчичного, льняного и т.д. - производство необезжиренной муки или мучки из семян масличных культур, орехов или зерен и ядрышек - производство рафинированных растительных масел: оливкового, соевого и т.д. - переработку растительного масла: перегонку, кипячение, дегидрацию, гидрогенизацию и т.д. Этот класс также включает: - производство несъедобных животных масел и жиров - добычу жиров рыбы и морских млекопитающих - производство отходов хлопка, жмыха и прочих отходов при производстве масел Этот класс исключает: - вытапливание и очистку свиного сала и прочих съедобных жиров животного происхождения, см. 10.11 - производство маргарина, см. 10.42 - измельчение сырой кукурузы, см. 10.62 - производство кукурузного масла, см. 10.62 - производство эфирных масел, см. 20.53 - очистку масел и жиров химическим способом, см. 20.59 @ru
scope note: Bu sınıf aşağıdakileri kapsamaktadır; -sebze ve meyve suyu imalatı. Ayrıca bu sınıf aşağıdakileri de kapsamaktadır; - taze meyve ve sebzeden konsantrelerin imalatı. @tr
preferred label: Производство на плодови и зеленчукови сокове @bg
preferred label: Výroba ovocných a zeleninových šťáv @cs
preferred label: Fremstilling af frugt- og grøntsagssaft @da
preferred label: Herstellung von Frucht- und Gemüsesäften @de
preferred label: Παραγωγή χυμών φρούτων και λαχανικών @el
preferred label: Elaboración de zumos de frutas y hortalizas @es
preferred label: Puu- ja köögiviljamahla tootmine @et
preferred label: Hedelmä-, marja- ja kasvismehujen valmistus @fi
preferred label: Préparation de jus de fruits et légumes @fr
preferred label: Gyümölcs-, zöldséglé gyártása
preferred label: Produzione di succhi di frutta e di ortaggi @it
preferred label: Vaisių, uogų ir daržovių sulčių gamyba @lt
preferred label: Augļu un dārzeņu sulas ražošana @lv
preferred label: Manifattura ta' meraq tal-frott u tal-ħxejjex @mt
preferred label: Vervaardiging van groente- en fruitsappen @nl
preferred label: Produksjon av juice av frukt og grønnsaker @no
preferred label: Produkcja soków z owoców i warzyw @pl
preferred label: Fabricação de sumos de frutos e de produtos hortícolas @pt
preferred label: Fabricarea sucurilor de fructe şi legume @ro
preferred label: Производство фруктовых и овощных соков @ru
preferred label: Výroba ovocnej a zeleninovej šťavy @sk
preferred label: Proizvodnja sadnih in zelenjavnih sokov @sl
preferred label: Juice- och safttillverkning @sv
preferred label: Sebze ve meyve suyu imalatı @tr
broader: Processing and preserving of fruit and vegetables

Other processing and preserving of fruit and vegetables
type: Concept
notation: 10.39
status: valid
status modified: 2013-10-18
accepted date: 2013-10-18
in scheme: Statistical Classification of Economic Activities in the European Community, Rev. 2 (2008)
scope note: - производство на храни, състоящи се предимно от плодове или зеленчуци, без замразените или консервираните готови ястия - преработка и консервиране на плодове, ядки или зеленчуци: замразяване, изсушаване, консервиране с мазнини или оцет и други - производство на хранителни продукти от плодове или зеленчуци - производство на конфитюри, желета, мармалади, пюрета и каши от плодове - печене на ядки - производство на пасти и хранителни продукти от ядки - производство на бързоразвалящи се готови храни от плодове и зеленчуци: • салати, салати миксове, пакетирани • белени или нарязани зеленчуци • соево сирене (тофу) - производство на плодови и зеленчукови сокове - 10.32 - производство на брашно или грис, от зърна от сухи бобови растения - 10.61 - консервиране на плодове и ядки в захар - 10.82 - производство на замразени готови зеленчукови ястия - 10.85 - производство на изкуствени концентрати - 10.89 @bg
scope note: Z: - výrobu potravin obsahujících převážně ovoce nebo zeleninu, kromě hotových pokrmů mrazených nebo v konzervách - konzervování ovoce, ořechů nebo zeleniny: zmrazování, sušení, nakládání do oleje nebo octa, zpracování do konzerv atd. - výrobu produktů z ovoce nebo zeleniny - výrobu marmelád, džemů, ovocných rosolů - pražení ořechů - výrobu ořechových potravin a ořechových pomazánek ZT: - výrobu rychle se kazících potravin z ovoce a zeleniny, např.: • salátů; salátových směsí, balených • loupané nebo krájené zeleniny • tofu (sojového tvarohu) N: - výrobu ovocných a zeleninových šťáv (10.32) - výrobu mouky ze sušených luštěnin (10.61) - konzervaci ovoce a ořechů v cukru (10.82) - výrobu hotových zeleninových pokrmů (10.85) - výrobu umělých koncentrátů (10.89) @cs
scope note: Diese Klasse umfasst: - Herstellung von hauptsächlich aus Obst oder Gemüse bestehenden Nahrungsmitteln, außer gefrorenen Fertiggerichten und solchen in Konservendosen - Konservierung von Obst, Nüssen und Gemüse: Gefrieren, Trocknen, Einlegen in Öl oder Essig, Verarbeitung zu Konserven usw. - Herstellung von Nahrungsmitteln aus Obst und Gemüse - Herstellung von Marmeladen, Gelees, Konfitüren, Obstaufstrichen und Obstzubereitungen - Rösten von Nüssen - Herstellung von Pasten aus Nüssen Diese Klasse umfasst ferner: - Herstellung verderblicher zubereiteter Nahrungsmittel aus Obst und Gemüse, z. B.: • Salate; Salatmischungen, verpackt • geschältes oder geschnittenes Gemüse • Tofu (Bohnenquark) Diese Klasse umfasst nicht: - Herstellung von Obst- und Gemüsesäften (s. 10.32) - Herstellung von Mehl aus getrockneten Hülsenfrüchten (s. 10.61) - Konservierung von Obst und Nüssen in Zucker (s. 10.82) - Herstellung von zubereiteten Gemüsegerichten (s. 10.85) - Herstellung von künstlichen Konzentraten (s. 10.89) @de
scope note: This class includes: - manufacture of food consisting chiefly of fruit or vegetables, except ready-made dishes in frozen or canned form - preserving of fruit, nuts or vegetables: freezing, drying, immersing in oil or in vinegar, canning etc. - manufacture of fruit or vegetable food products - manufacture of jams, marmalades and table jellies - roasting of nuts - manufacture of nut foods and pastes This class also includes: - manufacture of perishable prepared foods of fruit and vegetables, such as: • salads; mixed salads, packaged • peeled or cut vegetables • tofu (bean curd) This class excludes: - manufacture of fruit or vegetable juices, see 10.32 - manufacture of flour or meal of dried leguminous vegetables, see 10.61 - preservation of fruit and nuts in sugar, see 10.82 - manufacture of prepared vegetable dishes, see 10.85 - manufacture of artificial concentrates, see 10.89 @en
scope note: Esta clase comprende: - la fabricación de productos alimenticios a base fundamentalmente de frutas o verduras, excepto platos preparados congelados o enlatados; - la conservación de frutas, frutos secos, legumbres y hortalizas: congelación, secado, conservación en aceite o en vinagre, enlatado, etc.; - la fabricación de productos alimenticios a base de frutas, legumbres y hortalizas; - la fabricación de confituras, mermeladas y jaleas; - el tostado de frutos secos; - la fabricación de productos alimenticios y pastas a base de frutos secos. Esta clase comprende también: - la fabricación de productos alimenticios preparados perecederos a base de frutas, legumbres y hortalizas, como: • ensaladas empaquetadas; • hortalizas peladas o troceadas; • tofu (requesón de soja). Esta clase no comprende: - la fabricación de zumos de frutas y hortalizas (véase 10.32) - la fabricación de harinas y sémolas de legumbres secas (véase 10.61); - la conservación de frutas y frutos secos en azúcar (véase 10.82); - la elaboración de platos precocinados a base de legumbres y hortalizas (véase 10.85); - la fabricación de concentrados artificiales (véase 10.89). @es
scope note: Cette classe comprend: - la production de produits alimentaires principalement à base de fruits ou de légumes, à l’exception des plats préparés surgelés ou en conserve - la conservation des fruits (y compris à coque) ou des légumes: congélation, séchage, immersion dans l’huile ou le vinaigre, mise en conserve, etc. - la production de préparations alimentaires à base de fruits ou de légumes - la fabrication de confitures, de marmelades et de gelées - le grillage des fruits à coque - la fabrication d’aliments et de pâtes à base de fruits à coque Cette classe comprend également: - la préparation d’aliments préparés périssables à base de fruits ou de légumes, tels que: • salades et salades mélangées, emballées • légumes pelés et coupés • tofu (caillé de soja) Cette classe ne comprend pas: - la préparation de jus de fruits et légumes, voir 10.32 - la fabrication de farines ou de semoules de légumes à cosse secs, voir 10.61 - la conservation dans le sucre de fruits (y compris à coque), voir 10.82 - la production de plats préparés à base de légumes, voir 10.85 - la production de concentrés artificiels, voir 10.89 @fr
scope note: Ovaj razred uključuje: - proizvodnju hrane koja se uglavnom sastoji od voća ili povrća, osim gotovih smrznutih jela ili jela u limenkama - konzerviranje voća, orašastog voća ili povrća: zamrzavanje, sušenje, stavljanje u ulje ili ocat, stavljanje u limenke itd. - proizvodnju prehrambenih proizvoda od voća ili povrća - proizvodnju džema, marmelada i stolnog želea - prženoga orašastog voća - proizvodnju hrane i smjesa od orašastog voća Ovaj razred također uključuje: - proizvodnju lako pokvarljive hrane od voća ili povrća kao što su: • salate; miješane salate, zapakirane • oguljeno, oljušteno ili rezano povrće • tofu (sojin sir) Ovaj razred isključuje: - proizvodnju sokova od voća i povrća, vidi 10.32 - proizvodnju brašna ili prekrupe od suhoga mahunastog povrća, vidi 10.61 - konzerviranje voća i orašastog voća u šećeru, vidi 10.82 - proizvodnju jela pripremljenih od povrća, vidi 10.85 - proizvodnju umjetnih koncentrata, vidi 10.89
scope note: Į šią klasę įeina: - maisto produktų, daugiausiai susidedančių iš vaisių, uogų ir daržovių, išskyrus sušaldytus ar konservuotus gatavus patiekalus, gamyba - vaisių, uogų, riešutų ar daržovių apdorojimas: šaldymas, džiovinimas, mirkymas aliejuje ar acte, konservavimas sandarioje taroje ir kt. - maisto produktų iš vaisių, uogų ir daržovių gamyba - džemų, marmeladų ir drebučių gamyba - riešutų kepinimas - valgių ir pastų iš riešutų gamyba Į šią klasę taip pat įeina: - greitai gendančio, paruošto iš vaisių, uogų ir daržovių maisto, tokio kaip • supakuotos salotos, mišrainės • nuvalytos ar supjaustytos daržovės • tofu (sojos varškė) gamyba Į šią klasę neįeina: - sulčių gamyba iš vaisių ar daržovių žr. 10.32 - miltų ar rupinių gamyba iš džiovintų ankštinių daržovių, žr. 10.61 - vaisių, uogų ir riešutų konservavimas cukruje, žr. 10.82 - paruoštų daržovių patiekalų gamyba, žr. 10.85 - dirbtinių koncentratų gamyba, žr. 10.89 @lt
scope note: Этот класс включает: - производство маргарина - производство смесей и т.д. - производство комбинированных жиров для приготовления пищи @ru
scope note: Bu sınıf aşağıdakileri kapsamaktadır; - temel olarak sebze veya meyve içeren gıdaların imalatı, dondurulmuş veya konservelenmiş şekilde olan hazır yemekler hariç, - meyvelerin, yemişlerin veya sebzelerin saklanması: dondurma, kurutma, yağın veya sirkenin içine batırma, konserveleme vb., - meyve veya sebze gıda ürünlerinin imalatı, - reçel, marmelat ve jöle imalatı (pekmez imalatı dahil), - yemişlerin kavrulması, - sert kabuklu yemişlerin, yiyecek ve ezmelerinin imalatı. Ayrıca bu sınıf şunları da kapsamaktadır; - meyve ve sebzelerden çabuk bozulabilir hazır yemeklerin imalatı, örneğin; • paketlenmiş salatalar, • soyulmuş veya kesilmiş sebzeler, • tofu (soya peyniri). Kapsam dışı olanlar; - sebze ve meyve suyu imalatı, bkz. 10.32, - kurutulmuş baklagillerden yemek veya un imalatı, bkz. 10.61, - meyvelerin ve yemişlerin şeker içinde muhafaza edilmesi, bkz. 10.82, - hazır sebze yemekleri imalatı, bkz. 10.85, - yapay konsantreler imalatı, bkz. 10.89, @tr
preferred label: Преработка и консервиране на други плодове и зеленчуци, без готови ястия @bg
preferred label: Ostatní zpracování a konzervování ovoce a zeleniny @cs
preferred label: Anden forarbejdning og konservering af frugt og grøntsager @da
preferred label: Sonstige Verarbeitung von Obst und Gemüse @de
preferred label: Άλλη επεξεργασία και συντήρηση φρούτων και λαχανικών @el
preferred label: Otro procesado y conservación de frutas y hortalizas @es
preferred label: Muu puu- ja köögivilja töötlemine ja säilitamine @et
preferred label: Muu hedelmien, marjojen ja kasvisten jalostus ja säilöntä @fi
preferred label: Autre transformation et conservation de fruits et légumes @fr
preferred label: Egyéb gyümölcs-, zöldségfeldolgozás, -tartósítás
preferred label: Altra lavorazione e conservazione di frutta e ortaggi @it
preferred label: Kitas vaisių ir daržovių perdirbimas ir konservavimas @lt
preferred label: Cita veida augļu un dārzeņu pārstrāde un konservēšana @lv
preferred label: Ipproċessar u ppreservar ieħor ta' frott u ħxejjex @mt
preferred label: Overige verwerking en conservering van groenten en fruit @nl
preferred label: Bearbeiding og konservering av frukt og grønnsaker ellers @no
preferred label: Pozostałe przetwarzanie i konserwowanie owoców i warzyw, @pl
preferred label: Outra preparação e conservação de frutos e de produtos hortícolas @pt
preferred label: Prelucrarea şi conservarea fructelor şi legumelor n.c.a. @ro
preferred label: Прочие виды переработки и консервирования фруктов и овощей @ru
preferred label: Iné spracovanie a konzervovanie ovocia a zeleniny @sk
preferred label: Druga predelava in konzerviranje sadja in zelenjave @sl
preferred label: Annan beredning och hållbarhetsbehandling av frukt, bär och grönsaker @sv
preferred label: Başka yerde sınıflandırılmamış meyve ve sebzelerin işlenmesi ve saklanması @tr
broader: Processing and preserving of fruit and vegetables

Manufacture of vegetable and animal oils and fats
type: Concept
notation: 10.4
status: valid
status modified: 2013-10-18
accepted date: 2013-10-18
in scheme: Statistical Classification of Economic Activities in the European Community, Rev. 2 (2008)
scope note: Тази група включва производство на сурови и рафинирани растителни или животински масла и мазнини, с изключение на топене и рафиниране на свинска мас и други годни за консумация от човека животински мазнини. @bg
scope note: Tato skupina zahrnuje výrobu surových a rafinovaných olejů a tuků ze surovin rostlinného nebo živočišného původu, nikoliv však tavení a rafinaci vepřového sádla a jiných jedlých živočišných tuků. @cs
scope note: Diese Gruppe umfasst die Herstellung von rohen und raffinierten Ölen und Fetten aus Stoffen pflanzlichen oder tierischen Ursprungs, jedoch nicht das Auslassen und Raffinieren von Speck und anderen essbaren tierischen Fetten. @de
scope note: This group includes the manufacture of crude and refined oils and fats from vegetable or animal materials, except rendering or refining of lard and other edible animal fats. @en
scope note: Este grupo comprende la producción de aceites y grasas refinados y sin refinar de origen vegetal o animal, excepto la obtención o el refinado de manteca de cerdo y otras grasas animales comestibles. @es
scope note: Ce groupe comprend la fabrication d’huiles et de graisses brutes et raffinées d’origine végétale ou animale, à l’exception de la production et du raffinage du saindoux et d’autres graisses animales comestibles. @fr
scope note: Ova skupina uključuje proizvodnju sirovih i rafiniranih ulja i masti biljnog ili životinjskog podrijetla, osim topljene ili rafinirane svinjske masti i ostalih jestivih životinjskih masti.
scope note: Į šią grupę įeina neapdoroto ir rafinuoto aliejaus, ir riebalų gamyba iš augalinių ar gyvūninių medžiagų, išskyrus taukų ir kitų maistinių gyvūninių riebalų lydymą ar valymą. @lt
scope note: Bu grup, domuz yağının ve yenebilen diğer hayvansal yağların etlerden ayrıştırılması veya rafine edilmesi hariç, bitkisel veya hayvansal ürünlerden ham veya rafine edilmiş sıvı ve katı yağ imalatını kapsamaktadır. @tr
preferred label: Производство на растителни и животински масла и мазнини @bg
preferred label: Výroba rostlinných a živočišných olejů a tuků @cs
preferred label: Fremstilling af vegetabilske og animalske olier og fedtstoffer @da
preferred label: Herstellung von pflanzlichen und tierischen Ölen und Fetten @de
preferred label: Παραγωγή φυτικών και ζωικών ελαίων και λιπών @el
preferred label: Fabricación de aceites y grasas vegetales y animales @es
preferred label: Taimse ja loomse õli ja rasva tootmine @et
preferred label: Kasvi- ja eläinöljyjen ja -rasvojen valmistus @fi
preferred label: Fabrication d’huiles et graisses végétales et animales @fr
preferred label: Növényi, állati olaj gyártása
preferred label: Produzione di oli e grassi vegetali e animali @it
preferred label: Gyvūninių ir augalinių riebalų bei aliejaus gamyba @lt
preferred label: Augu un dzīvnieku eļļu un tauku ražošana @lv
preferred label: Manifattura ta' żjut u xaħmijiet veġetali u mill-annimali @mt
preferred label: Vervaardiging van plantaardige en dierlijke oliën en vetten @nl
preferred label: Produksjon av vegetabilske og animalske oljer og fettstoffer @no
preferred label: Produkcja olejów i tłuszczów pochodzenia roślinnego i zwierzęcego @pl
preferred label: Produção de óleos e gorduras animais e vegetais @pt
preferred label: Fabricarea uleiurilor şi a grăsimilor vegetale şi animale @ro
preferred label: Производство растительных и животных масел и жиров @ru
preferred label: Výroba rastlinných a živočíšnych olejov a tukov @sk
preferred label: Proizvodnja rastlinskih in živalskih olj in maščob @sl
preferred label: Framställning av vegetabiliska och animaliska oljor och fetter @sv
preferred label: Bitkisel ve hayvansal sıvı ve katı yağların imalatı @tr
broader: Manufacture of food products
narrower: Manufacture of oils and fats
narrower: Manufacture of margarine and similar edible fats

Manufacture of oils and fats
type: Concept
notation: 10.41
status: valid
status modified: 2013-10-18
accepted date: 2013-10-18
in scheme: Statistical Classification of Economic Activities in the European Community, Rev. 2 (2008)
scope note: - производство на сурови растителни масла: маслиново, соево, палмово, слънчогледово, памучно, рапично, репично, синапено, ленено и други, както и техните фракции, но не химически модифицирани - производство на необезмаслени брашна или грис от маслодайни семена, плодове или ядки - производство на рафинирани растителни масла: маслиново, соево, палмово, слънчогледово, памучно, рапично, репично, синапено, ленено и други - преработка на растителни масла: продухване, варене, окисляване, полимеризиране, дехидратиране, хидрогениране и други - производство на негодни за консумация от човека животински масла и мазнини - извличане на масла и мазнини от риби и морски бозайници - производство на памучен линтер, кюспета и други твърди остатъци от производството на масла и мазнини - производство - топене и рафиниране на свинска мас и други, годни за консумация от човека животински мазнини - 10.11 - производство на маргарин - 10.42 - мелене на зърно по мокър способ - 10.62 - производство на царевично масло - 10.62 - производство на етерични масла - 20.53 - химическо модифициране на масла и мазнини - 20.59 @bg
scope note: Z: - výrobu surových rostlinných olejů z oliv, sojových bobů, palmových jader, slunečnicových semen, bavlněných semen, řepky, hořčičných semen, lněných semen atd. - výrobu mouky z neodtučněných olejnatých semen, plodů nebo jader - výrobu rafinovaných rostlinných olejů: olivového oleje, sojového oleje atd. - zpracování rostlinných olejů: odkalování, převařování, dehydrataci, hydrogenaci atd. ZT: - výrobu nejedlých živočišných olejů a tuků - výrobu olejů z ryb a mořských savců - výrobu bavlněné cupaniny, pokrutin a jiných vedlejších produktů výroby olejů N: - tavení a rafinaci vepřového sádla a jiných jedlých živočišných tuků (10.11) - výrobu margarínu (10.42) - mletí kukuřice za mokra (10.62) - výrobu kukuřičného oleje (10.62) - výrobu esenciálních olejů (20.53) - zpracování olejů a tuků chemickými postupy (20.59) @cs
scope note: Diese Klasse umfasst: - Herstellung von pflanzlichen Rohölen aus Oliven, Sojabohnen, Palmkernen, Sonnenblumenkernen, Baumwollsaat, Raps und Rüben, Senfsaaten, Leinsamen usw. - Herstellung von nichtentfettetem Mehl aus Ölsaaten, ölhaltigen Früchten und Kernen - Herstellung von raffinierten Pflanzenölen: Olivenöl, Sojabohnenöl usw. - Verarbeitung von Pflanzenölen: Blasen, Kochen, Dehydratisieren, Hydrieren usw. Diese Klasse umfasst ferner: - Herstellung von nichtessbaren tierischen Ölen und Fetten - Herstellung von Ölen aus Fisch und Meeressäugetieren - Gewinnung von Baumwolllinters, Ölkuchen und andere Rückstände aus der Gewinnung von Ölen Diese Klasse umfasst nicht: - Auslassen und Raffinieren von Speck und anderen essbaren tierischen Fetten (s. 10.11) - Herstellung von Margarine (s. 10.42) - Mahlen von nassen Getreidekörnern (s. 10.62) - Herstellung von Maisöl (s. 19.62) - Herstellung von etherischen Ölen (s. 20.53) - Behandlung von Ölen und Fetten mit chemischen Verfahren (s. 20.59) @de
scope note: This class includes: - manufacture of crude vegetable oils: olive oil, soya-bean oil, palm oil, sunflower-seed oil, cotton-seed oil, rape, colza or mustard oil, linseed oil etc. - manufacture of non-defatted flour or meal of oilseeds, oil nuts or oil kernels - manufacture of refined vegetable oils: olive oil, soya-bean oil etc. - processing of vegetable oils: blowing, boiling, dehydration, hydrogenation etc. This class also includes: - manufacture of non-edible animal oils and fats - extraction of fish and marine mammal oils - production of cotton linters, oilcakes and other residual products of oil production This class excludes: - rendering and refining of lard and other edible animal fats, see 10.11 - manufacture of margarine, see 10.42 - wet corn milling, see 10.62 - manufacture of corn oil, see 10.62 - production of essential oils, see 20.53 - treatment of oil and fats by chemical processes, see 20.59 @en
scope note: Esta clase comprende: - la fabricación de aceites vegetales sin refinar: aceite de oliva, soja, palma, girasol, semillas de algodón, colza, nabina, mostaza, linaza, etc.; - la fabricación de harinas o sémolas no desgrasadas a partir de semillas, frutos secos o pepitas oleaginosas; - la fabricación de aceites vegetales refinados: aceite de oliva, soja, etc.; - el procesado de aceites vegetales: soplado, cocido, deshidratación, hidrogenación, etc. Esta clase comprende también: - la fabricación de aceites y grasas animales no comestibles; - la obtención de aceites de pescado y de mamíferos marinos; - la producción de borras de algodón, tortas de aceite y demás residuos de la obtención de aceite. Esta clase no comprende: - la obtención y refinado de manteca de cerdo y otras grasas animales comestibles (véase 10.11); - la fabricación de margarina (véase 10.42); - el triturado de maíz húmedo (véase 10.62); - la elaboración de aceite de maíz (véase 10.62); - la fabricación de aceites esenciales (véase 20.53); - el tratamiento de aceites y grasas mediante procesos químicos (véase 20.59). @es
scope note: Cette classe comprend: - la production d’huiles végétales brutes: huiles d’olive, de soja, de palme, de tournesol, de coton, de navette, de colza, de moutarde, de lin, etc. - la production de farines de graines, de noix ou d’amandes oléagineuses, non déshuilées - la production d’huiles végétales raffinées: huiles d’olive, de soja, etc. - le traitement des huiles végétales: soufflage, cuisson, déshydratation, hydrogénation, etc. Cette classe comprend également: - la production d’huiles et de graisses animales non comestibles - l’extraction d’huiles de poissons ou de mammifères marins - la production de linters de coton, de tourteaux et d’autres résidus de la production d’huile Cette classe ne comprend pas: - la production et le raffinage du saindoux et d’autres graisses animales comestibles, voir 10.11 - la production de margarine, voir 10.42 - la mouture du maïs par voie humide, voir 10.62 - la fabrication d’huile de maïs, voir 10.62 - la fabrication d’huiles essentielles, voir 20.53 - le traitement d’huiles et de graisses par des procédés chimiques, voir 20.59 @fr
scope note: Ovaj razred uključuje: - proizvodnju sirovih biljnih ulja: maslinova, sojinoga, palmina, suncokretova, pamukova, repičina, gorušičina, lanenoga itd. - proizvodnju brašna i prekrupe mljevenjem uljanog sjemenja, oraha ili koštica - proizvodnju rafiniranoga biljnog ulja: maslinova, sojina itd. - obradu biljnog ulja: puhanje, kuhanje, dehidraciju, hidrogenizaciju itd. Ovaj razred također uključuje: - proizvodnju nejestivih životinjskih ulja i masti - proizvodnju ribljeg ulja i ulja morskih sisavaca - proizvodnju pamučnog lintera, pogača od uljanih sjemenki i drugih ostataka iz proizvodnje ulja Ovaj razred isključuje: - topljenje i rafiniranje svinjske masti i ostalih jestivih životinjskih masti, vidi 10.11 - proizvodnju margarina, vidi 10.42 - mljevenje vlažnih žitarica, vidi 10.62 - proizvodnju ulja od kukuruznih klica, vidi 10.62 - proizvodnju eteričnih ulja, vidi 20.53 - kemijsku obradu ulja i masti, vidi 20.59
scope note: Į šią klasę įeina: - neapdoroto augalinio aliejaus gamyba: alyvuogių aliejaus, sojų aliejaus, palmių aliejaus, saulėgrąžų aliejaus, medvilnės aliejaus, rapsų, rapsukų ar garstyčių aliejaus, sėmenų aliejaus ir kt. - riebalinių miltų ar rupinių gamyba iš aliejinių sėklų, riešutų ar branduolių - rafinuoto augalinio aliejaus gamyba: alyvuogių aliejaus, sojų aliejaus ir kt. - augalinio aliejaus perdirbimas: garinimas, virinimas, vandens šalinimas, hidrinimas ir kt. Į šią klasę taip pat įeina: - nemaistinių gyvūninių riebalų ir aliejaus gamyba - žuvų ir jūros žinduolių aliejaus gamyba - medvilninės pūkų, aliejaus išspaudų ir kitų likutinių aliejaus produktų gamyba Į šią klasę neįeina: - taukų ir kitų maistinių gyvūninių riebalų lydymas ir valymas, žr. 10.11 - margarino gamyba, žr. 10.42 - šlapiasis kukurūzų malimas, žr. 10.62 - kukurūzų aliejaus gamyba, žr. 10.62 - eterinio aliejaus gamyba, žr. 20.53 - cheminis aliejaus ir riebalų apdorojimas, žr. 20.59 @lt
scope note: Этот класс включает: - производство свежего натурального молока, пастеризованного, стерилизованного, гомогенизированного и/или ультра очищенного молока - производство напитков на молочной основе - производство сливок из свежего цельного, пастеризованного, стерилизованного и гомогенизированного молока - производство сухого молока или сгущенного молока с сахаром или без - производство молока или сливок в твердой форме - производство сливочного масла - производство йогурта - производство сыра и творога - производство сыворотки - производство казеина или лактозы Этот класс исключает: - производство сырого/цельного коровьего молока, см. 01.41 - производство сырого/цельного молока (от овец, коз, кобыл, ослиц, верблюдиц и т.д.), см. 01.43, 01.44, 01.45 - производство заменителей молока и сыра не животного происхождения, см. 10.89 @ru
scope note: Bu sınıf aşağıdakileri kapsamaktadır; - bitkisel ham yağ imalatı: zeytin yağı, soya fasulyesi yağı, palmiye yağı, ay çiçek yağı, pamuk yağı, fındık yağı, kolza veya hardal yağı, beziryağı vb., - tohum, sert kabuklu yemiş ve çekirdek yağlarından elde edilen yağı alınmış küspe ve tozlar, - rafine edilmiş sebze yağları imalatı: zeytin yağı, soya fasulyesi yağı vb., - sebze yağlarının işlenmesi: püskürtme, kaynatma, sulama, hidrojenleştirme vb.. Ayrıca bu sınıf şunları da kapsamaktadır; - yenmeyen hayvansal katı veya sıvı yağ imalatı, - balık ve deniz memelilerinden yağ çıkarma, - pamuk lifleri, yağı alınmış tohum kalıbı ve yağ üretiminin artık ürünlerinin üretilmesi. Kapsam dışı olanlar; - domuz yağı ve diğer yenilebilen hayvansal yağların sağlanması ve rafine edilmesi, bkz. 10.11, - margarin imalatı, bkz. 10.42, - öğütülmüş yaş mısır, bkz. 10.62, - uçucu yağların imalatı, bkz. 20.53, - kimyasal süreçler vasıtasıyla katı ve sıvı yağların arıtılması, bkz. 20.59. @tr
preferred label: Производство на растителни и животински масла и мазнини, без маргарин @bg
preferred label: Výroba olejů a tuků @cs
preferred label: Fremstilling af olier og fedtstoffer @da
preferred label: Herstellung von Ölen und Fetten (ohne Margarine u. ä. Nahrungsfette) @de
preferred label: Παραγωγή ελαίων και λιπών @el
preferred label: Fabricación de aceites y grasas @es
preferred label: Õli ja rasva tootmine @et
preferred label: Kasvi- ja eläinperäisten öljyjen ja -rasvojen valmistus (pl. ravintorasvat) @fi
preferred label: Fabrication d'huiles et graisses @fr
preferred label: Olaj gyártása
preferred label: Produzione di oli e grassi @it
preferred label: Aliejaus ir riebalų gamyba @lt
preferred label: Eļļu un tauku ražošana @lv
preferred label: Manifattura ta' żjut u xaħmijiet @mt
preferred label: Vervaardiging van oliën en vetten @nl
preferred label: Produksjon av oljer og fettstoffer @no
preferred label: Produkcja olejów i pozostałych tłuszczów płynnych @pl
preferred label: Produção de óleos e gorduras @pt
preferred label: Fabricarea uleiurilor şi grăsimilor @ro
preferred label: Производство масел и жиров @ru
preferred label: Výroba olejov a tukov @sk
preferred label: Proizvodnja olja in maščob @sl
preferred label: Utvinning av vegetabiliska och animaliska oljor och fetter @sv
preferred label: Sıvı ve katı yağ imalatı @tr
broader: Manufacture of vegetable and animal oils and fats

Manufacture of margarine and similar edible fats
type: Concept
notation: 10.42
status: valid
status modified: 2013-10-18
accepted date: 2013-10-18
in scheme: Statistical Classification of Economic Activities in the European Community, Rev. 2 (2008)
scope note: - производство на маргарин и други подобни хранителни мазнини - производство на смеси от растителни и животински мазнини за мазане - производство на смеси от растителни и животински мазнини за готвене @bg
scope note: Z: - výrobu margarínu - výrobu ostatních pomazánek nahrazujících máslo - výrobu složených pokrmových tuků @cs
scope note: Diese Klasse umfasst: - Herstellung von Margarine - Herstellung von sonstigen Nahrungsfetten als Butterersatz - Herstellung von gemischten Kochfetten @de
scope note: This class includes: - manufacture of margarine - manufacture of melanges and similar spreads - manufacture of compound cooking fats @en
scope note: Esta clase comprende: - la fabricación de margarina; - la elaboración de otros sucedáneos de la mantequilla; - la obtención de grasas compuestas para cocinar. @es
scope note: Cette classe comprend: - la fabrication de margarines - la fabrication de mélanges et d’autres pâtes à tartiner similaires - la fabrication de graisses composées pour la cuisson des aliments @fr
scope note: Ovaj razred uključuje: - proizvodnju margarina - proizvodnju mješavina i sličnih namaza - proizvodnju miješanih masnoća za kuhanje
scope note: Į šią klasę įeina: - margarino gamyba - riebalų mišinių ir panašių tepiųjų riebalų mišinių gamyba - sudėtinių kepimo riebalų gamyba @lt
scope note: Этот класс включает: - производство мороженого и т.п., например, шербета Этот класс исключает: - деятельность кафе-мороженых, см. 56.10 @ru
scope note: Bu sınıf aşağıdakileri kapsamaktadır; - margarin imalatı, - karışık yağlar ve benzeri yağ imalatı, - karışık yemeklik katı yağ imalatı. @tr
preferred label: Производство на маргарин и подобни хранителни мазнини @bg
preferred label: Výroba margarínu a podobných jedlých tuků @cs
preferred label: Fremstilling af margarine o.l. spiselige fedtstoffer @da
preferred label: Herstellung von Margarine u. ä. Nahrungsfetten @de
preferred label: Παραγωγή μαργαρίνης και παρόμοιων βρώσιμων λιπών @el
preferred label: Fabricación de margarina y grasas comestibles similares @es
preferred label: Margariini jms toidurasva tootmine @et
preferred label: Margariinin ja sen kaltaisten ravintorasvojen valmistus @fi
preferred label: Fabrication de margarine et graisses comestibles similaires @fr
preferred label: Margarin gyártása
preferred label: Produzione di margarina e di grassi commestibili simili @it
preferred label: Margarino ir panašių valgomųjų riebalų gamyba @lt
preferred label: Margarīna un līdzīgu pārtikas tauku ražošana @lv
preferred label: Manifattura ta' marġerina u xaħmijiet simili li jittieklu @mt
preferred label: Vervaardiging van margarine en andere spijsvetten @nl
preferred label: Produksjon av margarin og lignende spiselige fettstoffer @no
preferred label: Produkcja margaryny i podobnych tłuszczów jadalnych @pl
preferred label: Fabricação de margarinas e de gorduras alimentares similares @pt
preferred label: Fabricarea margarinei şi a altor produse comestibile similare @ro
preferred label: Производство маргарина и подобных животных жиров @ru
preferred label: Výroba margarínu a podobných jedlých tukov @sk
preferred label: Proizvodnja margarine in podobnih jedilnih maščob @sl
preferred label: Matfettstillverkning @sv
preferred label: Margarin ve benzeri yenebilir yağların imalatı @tr
broader: Manufacture of vegetable and animal oils and fats

Manufacture of dairy products
type: Concept
notation: 10.5
status: valid
status modified: 2013-10-18
accepted date: 2013-10-18
in scheme: Statistical Classification of Economic Activities in the European Community, Rev. 2 (2008)
scope note: Данная группа включает получение муки или мучки из зерен или плодов, измельчение, очистку и полирование риса, а также производство мучных смесей или теста из данных продуктов. Данная группа также включает получение сырой кукурузной крупки и овощной массы и производство крахмала и крахмальных продуктов. @ru
preferred label: Производство на мляко и млечни продукти @bg
preferred label: Výroba mléčných výrobků @cs
preferred label: Fremstilling af mejeriprodukter @da
preferred label: Milchverarbeitung @de
preferred label: Παραγωγή γαλακτοκομικών προϊόντων @el
preferred label: Fabricación de productos lácteos @es
preferred label: Piimatoodete tootmine @et
preferred label: Maitotaloustuotteiden valmistus @fi
preferred label: Fabrication de produits laitiers @fr
preferred label: Tejfeldolgozás
preferred label: Produzione di latte e latticini @it
preferred label: Pieno produktų gamyba @lt
preferred label: Piena produktu ražošana @lv
preferred label: Manifattura ta' prodotti tal-ħalib @mt
preferred label: Vervaardiging van zuivelproducten @nl
preferred label: Produksjon av meierivarer og iskrem @no
preferred label: Wytwarzanie wyrobów mleczarskich @pl
preferred label: Indústria de lacticínios @pt
preferred label: Fabricarea produselor lactate @ro
preferred label: Производство молочных продуктов @ru
preferred label: Výroba mliečnych výrobkov @sk
preferred label: Predelava mleka @sl
preferred label: Mejerivaru- och glasstillverkning @sv
preferred label: Süt ürünleri imalatı @tr
broader: Manufacture of food products
narrower: Operation of dairies and cheese making
narrower: Manufacture of ice cream

Operation of dairies and cheese making
type: Concept
notation: 10.51
status: valid
status modified: 2013-10-18
accepted date: 2013-10-18
in scheme: Statistical Classification of Economic Activities in the European Community, Rev. 2 (2008)
scope note: - производство на прясно мляко - пастьоризирано, стерилизирано и/или обработено по UHT технология (асептичен метод за обработка на мляко при ултрависока температура) - производство на напитки на млечна основа - производство на сметана от прясно мляко - пастьоризирана, стерилизирана, хомогенизирана - производство на кондензирано мляко, подсладено или неподсладено - производство на сухо мляко и сметана на прах - производство на млечно масло и други млечни мазнини - производство на кисело мляко - производство на сирене, кашкавал и извара - производство на суроватка - производство на казеин или лактоза - производство на сурово мляко от едър рогат добитък - 01.41 - производство на сурово мляко от овце, кози, коне, магарета, камили и други - 01.43, 01.44, 01.45 - производство на заместители на млечни продукти и сирена - 10.89 @bg
scope note: Z: - výrobu pasterizovaného, sterilizovaného, homogenizovaného anebo vysokou teplotou upraveného čerstvého tekutého mléka - výrobu mléčných nápojů - výrobu smetany z pasterizovaného, sterilizovaného nebo homogenizovaného čerstvého tekutého mléka - výrobu sušeného nebo zahuštěného mléka, též slazeného - výrobu mléka nebo smetany v tuhém stavu - výrobu másla - výrobu jogurtů - výrobu sýrů a tvarohu - výrobu syrovátky - výrobu kaseinu nebo laktózy N: - výrobu syrového mléka kravského (01.41) - výrobu syrového mléka ovčího, kozího, kobylího, oslího, velbloudího apod. (01.43, 01.44, 01.45) - výrobu náhražek mléka a sýrů ne na bázi sekretů vylučovaných mléčnou žlázou (10.89) @cs
scope note: Diese Klasse umfasst: - Herstellung von flüssiger pasteurisierter, sterilisierter, homogenisierter bzw. ultrahocherhitzter Frischmilch - Herstellung von Erfrischungsgetränken aus Milch - Herstellung von Rahm aus flüssiger, pasteurisierter, sterilisierter oder homogenisierter Frischmilch - Herstellung von Milchpulver und konzentrierter Milch, auch gesüßt - Herstellung von Milch- oder Rahmpulver - Herstellung von Butter - Herstellung von Joghurt - Herstellung von Käse und Quark/Topfen - Herstellung von Molke - Herstellung von Kasein und Milchzucker Diese Klasse umfasst nicht: - Erzeugung von roher Kuhmilch (s. 01.41) - Erzeugung von roher Milch von Schafen, Ziegen, Stuten, Eseln, Kamelen usw. (s. 01.43, 01.44, 01.45) - Herstellung von nicht auf Milchbasis hergestelltem Milch- und Käseersatz (s. 10.89) @de
scope note: This class includes: - manufacture of fresh liquid milk, pasteurised, sterilised, homogenised and/or ultra heat treated - manufacture of milk-based drinks - manufacture of cream from fresh liquid milk, pasteurised, sterilised, homogenised - manufacture of dried or concentrated milk whether or not sweetened - manufacture of milk or cream in solid form - manufacture of butter - manufacture of yoghurt - manufacture of cheese and curd - manufacture of whey - manufacture of casein or lactose This class excludes: - production of raw milk (cattle), see 01.41 - production of raw milk (sheep, goats, horses, asses, camels, etc.), see 01.43, 01.44, 01.45 - manufacture of non-dairy milk and cheese substitutes, see 10.89 @en
scope note: Esta clase comprende: - la producción de leche líquida fresca, pasteurizada, esterilizada, homogeneizada o tratada a altas temperaturas; - la producción de bebidas a base de leche; - la producción de nata a partir de leche líquida fresca, pasteurizada, esterilizada, homogeneizada; - la elaboración de leche en polvo o concentrada, azucarada o sin azucarar; - la producción de leche o nata en forma sólida; - la producción de mantequilla; - la producción de yogur; - la producción de queso y cuajada; - la producción de suero de leche; - la producción de caseína y lactosa. Esta clase no comprende: - la producción de leche cruda de vaca (véase 01.41); - la producción de leche cruda de oveja, cabra, yegua, burra, camella, etc. (véanse 01.43, 01.44, 01.45); - la producción de sucedáneos no lácteos de la leche y el queso (véase 10.89). @es
scope note: Cette classe comprend: - la production de laits liquides frais, pasteurisés, stérilisés, homogénéisés et/ou ayant subi un chauffage ultracourt - la production de boissons à base de lait - la production de crèmes de laits liquides frais, pasteurisées, stérilisées, homogénéisées - la fabrication de laits en poudre ou de laits concentrés, édulcorés ou non - la production de lait ou de crème sous forme solide - la production de beurre - la production de yoghourt - la production de fromages ou de caillebotte - la production de lactosérum - la production de caséine ou de lactose Cette classe ne comprend pas: - la production de lait de vache cru, voir 01.41 - la production de lait cru (de brebis, de chèvre, de jument, d’ânesse, de chamelle, etc.), voir 01.43, 01.44 et 01.45 - la fabrication de succédanés du lait ou du fromage, voir 10.89 @fr
scope note: Ovaj razred uključuje: - proizvodnju svježega tekućeg mlijeka, pasteriziranoga, steriliziranoga, homogeniziranoga i/ili obrađena na vrlo visokim temperaturama - proizvodnju na mlijeku baziranih napitaka - proizvodnju vrhnja od svježeg mlijeka, pasteriziranoga, steriliziranoga, homogeniziranoga - proizvodnju mlijeka u prahu i kondenziranog mlijeka, zaslađenoga ili nezaslađenoga - proizvodnju mlijeka i vrhnja u krutom stanju - proizvodnju maslaca - proizvodnju jogurta - proizvodnju sira i skute - proizvodnju sirutke - proizvodnju kazeina i laktoze Ovaj razred isključuje: - proizvodnju sirovoga kravljeg mlijeka, vidi 01.41 - proizvodnju sirovog mlijeka (ovčjega, kozjega, konjskoga, magarećega, devinoga itd.), vidi 01.43, 01.44 i 01.45 - proizvodnju nadomjestaka mlijeka i sira, vidi 10.89
scope note: Į šią klasę įeina: - šviežio skysto, pasterizuoto, sterilizuoto, homogenizuoto ir (arba) apdoroto ultraaukštoje temperatūroje pieno gamyba - pieno gėrimų gamyba - grietinėlės, iš šviežio skysto, pasterizuoto, sterilizuoto, homogenizuoto pieno, gamyba - sausojo ar koncentruoto saldinto ar nesaldinto pieno gamyba - sausojo pieno arba grietinėlės gamyba - sviesto gamyba - jogurto gamyba - sūrio ir varškės gamyba - išrūgų gamyba - kazeino ar laktozės gamyba Į šią klasę neįeina: - žalio pieno gavyba (galvijų), žr. 01.41 - žalio pieno gavyba (avių, ožkų, arklių, asilų, kupranugarių ir kt.), žr. 01.43, 01.44, 01.45 - negyvūninės kilmės pieno ir sūrio gamyba, žr. 10.89 @lt
scope note: Этот класс включает: - перемол зерна: производство муки, отрубей, мучки или гранул пшеницы, ржи, овса, кукурузы или других зерновых - перемол риса: производство очищенного, молотого, полированного, шлифованного, обработанного паром риса; производство рисовой муки - перемол овощей: производство муки или мучки из сушеных бобовых культур, из корнеплодов или клубневых или из съедобных орехов - производство сухих завтраков - производство готовых мучных смесей и теста для хлеба, тортов, пирожных, пирогов и бисквитов, печенья или блинов Этот класс исключает: - производство картофельной муки и мучки, см. 10.31 - измельчение сырой кукурузы, см. 10.62 @ru
scope note: Bu sınıf aşağıdakileri kapsamaktadır; - taze sıvı süt imalatı, pastörize edilmiş, sterilize edilmiş, homojenize edilmiş ve/veya yüksek ısıdan geçirilmiş, - süt temelli içeceklerin imalatı, - taze sıvı sütten kaymak üretimi, pastörize edilmiş, sterilize edilmiş, homojenize edilmiş, - kurutulmuş veya konsantre edilmiş süt, tatlandırılmış veya tatlandırılmamış, - kefir ve salep (içecek) imalatı, - katı halde süt (süt tozu) veya krema imalatı, - tereyağı imalatı, - yoğurt imalatı, - peynir ve çökelek imalatı, - peynir suyu imalatı, - peynir özü (kazein) ve süt şekeri (laktoz) imalatı. Kapsam dışı olanlar; - ham süt üretilmesi (sığır), bkz. 01.41, - ham süt üretilmesi (koyun, keçi, at, eşek, deve, vb.), bkz. 01.43, 01.44, 01.45, - mandıralarda üretilmeyen süt ve peynir yerine kullanılan ürünlerin imalatı, bkz. 10.89. @tr
preferred label: Производство на мляко и млечни продукти, без сладолед @bg
preferred label: Zpracování mléka, výroba mléčných výrobků a sýrů @cs
preferred label: Mejerier samt ostefremstilling @da
preferred label: Milchverarbeitung (ohne Herstellung von Speiseeis) @de
preferred label: Λειτουργία γαλακτοκομείων και τυροκομία @el
preferred label: Preparación de leche y fabricación de sus derivados @es
preferred label: Piima-, piimatoodete ja juustutootmine @et
preferred label: Maitotaloustuotteiden ja juuston valmistus @fi
preferred label: Exploitation de laiteries et fabrication de fromage @fr
preferred label: Tejtermék gyártása
preferred label: Lavorazione del latte e produzione di latticini @it
preferred label: Pieninių veikla ir sūrių gamyba @lt
preferred label: Piena pārstrāde un siera ražošana @lv
preferred label: Operazzjoni ta' mħaleb u manifattura ta' ġobon @mt
preferred label: Zuivelfabrieken en kaasmakerijen @nl
preferred label: Produksjon av meierivarer @no
preferred label: Przetwórstwo mleka i wyrób serów @pl
preferred label: Indústrias do leite e derivados @pt
preferred label: Fabricarea produselor lactate şi a brânzeturilor @ro
preferred label: Переработка молока и производство сыра @ru
preferred label: Prevádzka mliekarní a výroba syrov @sk
preferred label: Mlekarstvo in sirarstvo @sl
preferred label: Mejerivarutillverkning @sv
preferred label: Süthane işletmeciliği ve peynir imalatı @tr
broader: Manufacture of dairy products

Manufacture of ice cream
type: Concept
notation: 10.52
status: valid
status modified: 2013-10-18
accepted date: 2013-10-18
in scheme: Statistical Classification of Economic Activities in the European Community, Rev. 2 (2008)
scope note: - производство на сладолед и подсладени ледени блокчета - дейност на заведения, предлагащи сладолед - 56.10 @bg
scope note: Z: - výrobu zmrzliny, sorbetů apod. N: - provozování zmrzlinových barů a cukráren (56.10) @cs
scope note: Diese Klasse umfasst: - Herstellung von Speiseeis, Sorbets u. Ä. Diese Klasse umfasst nicht: - Betrieb von Eissalons (s. 56.10) @de
scope note: This class includes: - manufacture of ice cream and other edible ice such as sorbet This class excludes: - activities of ice cream parlours, see 56.10 @en
scope note: Esta clase comprende: - la fabricación de helados y productos similares como sorbetes. Esta clase no comprende: - las actividades de las heladerías (véase 56.10). @es
scope note: Cette classe comprend: - la production de crème glacée et d’autres glaces de consommation telles que les sorbets Cette classe ne comprend pas: - les activités des salons de consommation de crème glacée, voir 56.10 @fr
scope note: Ovaj razred uključuje: - proizvodnju sladoleda i drugih zamrznutih jestivih smjesa, poput šerbeta Ovaj razred isključuje: - djelatnosti sladoledarskih radnji (lokala), vidi 56.10
scope note: Į šią klasę įeina: - grietininių ir kitų valgomųjų ledų, tokių kaip šerbetas ar vaisiniai ledai, gamyba Į šią klasę neįeina: - ledainių veikla, žr. 56.10 @lt
scope note: Этот класс включает: - производство крахмала из риса, картофеля, кукурузы и т.д. - измельчение сырой кукурузы - производство глюкозы, сахарного сиропа, мальтозы, инулина и т.д. - производство клейковины - производство тапиоки и заменителей тапиоки из крахмала - производство кукурузного масла Этот класс исключает: - производство лактозы (молочного сахара), см. 10.51 - производство сахара из сахарной свеклы и тростника, см. 10.81 @ru
scope note: Bu sınıf aşağıdakileri kapsamaktadır; - dondurma ve şerbetli diğer yenebilen buzlu gıdaların imalatı. Kapsam dışı olanlar; - dondurma salonu faaliyetleri, bkz. 56.10. @tr
preferred label: Производство на сладолед @bg
preferred label: Výroba zmrzliny @cs
preferred label: Fremstilling af konsumis @da
preferred label: Herstellung von Speiseeis @de
preferred label: Παραγωγή παγωτών @el
preferred label: Elaboración de helados @es
preferred label: Jäätisetootmine @et
preferred label: Jäätelön valmistus @fi
preferred label: Fabrication de glaces et sorbets @fr
preferred label: Jégkrém gyártása
preferred label: Produzione di gelati @it
preferred label: Valgomųjų ledų gamyba @lt
preferred label: Saldējuma ražošana @lv
preferred label: Manifattura ta' ġelat @mt
preferred label: Vervaardiging van consumptie-ijs @nl
preferred label: Produksjon av iskrem @no
preferred label: Produkcja lodów @pl
preferred label: Fabricação de gelados e sorvetes @pt
preferred label: Fabricarea îngheţatei @ro
preferred label: Производство мороженого @ru
preferred label: Proizvodnja sladoleda @sl
preferred label: Glasstillverkning @sv
preferred label: Dondurma imalatı @tr
broader: Manufacture of dairy products

Manufacture of grain mill products, starches and starch products
type: Concept
notation: 10.6
status: valid
status modified: 2013-10-18
accepted date: 2013-10-18
in scheme: Statistical Classification of Economic Activities in the European Community, Rev. 2 (2008)
scope note: производство на брашно от зърнени култури или зеленчуци, олющване и полиране на ориз и производство на готови смеси от тези продукти. Включва още мелене на зърно по мокър способ и производство на нишесте и нишестени продукти. @bg
scope note: Tato skupina zahrnuje mletí obilí nebo zeleniny na mouku, mletí, čištění a leštění rýže a výrobu moučných směsí nebo těst z těchto produktů. Tato skupina zahrnuje také mletí kukuřice a zeleniny za mokra a výrobu škrobu a výrobků na bázi škrobu. @cs
scope note: Diese Gruppe umfasst das Mahlen von Getreide oder Gemüse zu Mehl, das Mahlen, Reinigen und Polieren von Reis sowie die Herstellung von Mehlmischungen oder Teigen aus diesen Erzeugnissen. Diese Gruppe umfasst ferner das Nassmahlen von Mais und Gemüse sowie die Herstellung von Stärke und von Erzeugnissen daraus. @de
scope note: This group includes the milling of flour or meal from grains or vegetables, the milling, cleaning and polishing of rice, as well as the manufacture of flour mixes or doughs from these products. Also included in this group are the wet milling of corn and vegetables and the manufacture of starch and starch products. @en
scope note: Este grupo comprende la molienda de harina o sémola a partir de cereales o productos de origen vegetal; la molienda, limpieza y pulido del arroz; y la fabricación de mezclas de harinas o masas de estos productos. Se incluye asimismo el triturado húmedo de maíz y hortalizas, y la fabricación de almidones y productos amiláceos. @es
scope note: Ce groupe comprend la mouture de farines ou de semoules à partir de céréales ou de légumes, la mouture, le nettoyage et le polissage du riz, ainsi que la fabrication de mélanges de farines ou de pâtes préparés à partir de ces produits. Ce groupe comprend également la mouture du maïs et des légumes par voie humide et la fabrication d’amidon et de produits amylacés. @fr
scope note: Ova skupina uključuje mljevenje brašna ili prekrupe od žitarica ili povrća, mljevenje, čišćenje i poliranje riže te proizvodnju mješavina brašna ili tijesta od tih proizvoda. U ovu skupinu također je uključeno mljevenje vlažnih žitarica i povrća te proizvodnja škroba i škrobnih proizvoda.
scope note: Į šią grupę įeina grūdų ir daržovių malimas į miltus ar rupinius, ryžių malimas, valymas ir poliravimas, taip pat miltų mišinių ir tešlos iš jų gamyba. Taip pat į šią grupę įeina šlapiasis kukurūzų ir daržovių malimas bei krakmolo ir krakmolo produktų gamyba. @lt
scope note: Данная группа включает производство хлебопекарных продуктов, макарон, лапши и подобных продуктов. @ru
scope note: Bu grup, hububatlardan ve sebzelerden un veya topak imalatını, pirinç elde edilmesi gibi bu ürünlerden un karışımları veya hamur imal edilmesini de içerir. Ayrıca, mısır ve sebzelerin yaş iken öğütülmesi, nişasta ve nişastalı ürünlerin imalatı da bu gruba dahildir. @tr
preferred label: Производство на мелничарски продукти, нишесте и нишестени продукти @bg
preferred label: Výroba mlýnských a škrobárenských výrobků @cs
preferred label: Fremstilling af mølleriprodukter, stivelse og stivelsesprodukter @da
preferred label: Mahl- und Schälmühlen, Herstellung von Stärke und Stärkeerzeugnissen @de
preferred label: Παραγωγή προϊόντων αλευρόμυλων· παραγωγή αμύλων και προϊόντων αμύλου @el
preferred label: Fabricación de productos de molinería, almidones y productos amiláceos @es
preferred label: Jahu ja tangainete, tärklise ja tärklisetoodete tootmine @et
preferred label: Mylly- ja tärkkelystuotteiden valmistus @fi
preferred label: Travail des grains; fabrication de produits amylacés @fr
preferred label: Malomipari termék, keményítő gyártása
preferred label: Lavorazione delle granaglie, produzione di amidi e di prodotti amidacei @it
preferred label: Grūdų malimo produktų, krakmolo ir krakmolo produktų gamyba @lt
preferred label: Graudu malšanas produktu, cietes un cietes produktu ražošana @lv
preferred label: Manifattura ta' prodotti ta' l-imtieħen tal-qmuħ, lamti u prodotti oħra tal-lamtu @mt
preferred label: Vervaardiging van maalderijproducten, zetmeel en zetmeelproducten @nl
preferred label: Produksjon av kornvarer, stivelse og stivelsesprodukter @no
preferred label: Wytwarzanie produktów przemiału zbóż, skrobi i wyrobów skrobiowych @pl
preferred label: Transformação de cereais e leguminosas; fabricação de amidos, féculas e produtos afins @pt
preferred label: Fabricarea produselor de morărit, a amidonului şi produselor din amidon @ro
preferred label: Производство продуктов мукомольной промышленности, крахмалов и крахмальных продуктов @ru
preferred label: Výroba mlynských výrobkov, škrobu a škrobových výrobkov @sk
preferred label: Mlinarstvo, proizvodnja škroba in škrobnih izdelkov @sl
preferred label: Tillverkning av kvarnprodukter och stärkelse @sv
preferred label: Öğütülmüş tahıl ürünleri, nişasta ve nişastalı ürünlerin imalatı @tr
broader: Manufacture of food products
narrower: Manufacture of grain mill products
narrower: Manufacture of starches and starch products

Manufacture of grain mill products
type: Concept
notation: 10.61
status: valid
status modified: 2013-10-18
accepted date: 2013-10-18
in scheme: Statistical Classification of Economic Activities in the European Community, Rev. 2 (2008)
scope note: - производство на брашно, едрозърнест и дребнозърнест грис или агломерати под формата на гранули от жито, ръж, овес, царевица или други зърнени растения - преработване на ориз: олющване, полиране, гланциране, бланширане или натрошаване на ориз; производство на оризово брашно - производство на брашно или грис - от сухи бобови растения, корени, грудки или годни за консумация ядки - производство на храни от вида „Musli“ - производство на готови смеси и тесто за хляб, сладкиши, бисквити или палачинки - производство на картофено брашно и грис - 10.31 - мелене на зърно по мокър способ - 10.62 @bg
scope note: Z: - loupání a mletí obilí: výrobu mouky, krup, šrotu a pelet - loupání a mletí rýže: výrobu loupané, mleté, leštěné, hlazené, předvařené nebo upravené rýže a výrobu rýžové mouky - loupání a mletí zeleniny: výrobu mouky ze sušených luštěnin, kořenů nebo hlíz nebo z jedlých ořechů - výrobu obilných vloček, lupínků a jiných „snídaňových“ pokrmů - výrobu moučných směsí a těst na pečení chleba a jiných pekařských výrobků, cukrářských výrobků (vč. sušenek nebo palačinek) N: - výrobu bramborových vloček a mouky (10.31) - mletí kukuřice za mokra (10.62) @cs
scope note: Diese Klasse umfasst: - Mahlen und Schälen von Getreide: Herstellung von Mehl, Grütze, Grieß, Schrot und Dunst - Mahlen und Schälen von Reis: Herstellung von geschältem, gemahlenem, poliertem, glasiertem, "parboiled" und verarbeitetem Reis; Herstellung von Reismehl - Mahlen und Schälen von Hülsenfrüchten und Nüssen: Herstellung von Mehl aus getrockneten Hülsenfrüchten, Wurzeln und Knollen sowie aus essbaren Nüssen - Herstellung von Frühstücksnahrung aus Getreide - Herstellung von zubereitetem gemischtem Mehl und Teig für Brot, Kuchen, Kekse und Pfannkuchen/Palatschinken Diese Klasse umfasst nicht: - Herstellung von Kartoffelmehl (s. 10.31) - Nassmahlen von Mais (s. 10.62) @de
scope note: This class includes: - grain milling: production of flour, groats, meal or pellets of wheat, rye, oats, maize (corn) or other cereal grains - rice milling: production of husked, milled, polished, glazed, parboiled or converted rice; production of rice flour - vegetable milling: production of flour or meal of dried leguminous vegetables, of roots or tubers, or of edible nuts - manufacture of cereal breakfast foods - manufacture of flour mixes and prepared blended flour and dough for bread, cakes, biscuits or pancakes This class excludes: - manufacture of potato flour and meal, see 10.31 - wet corn milling, see 10.62 @en
scope note: Esta clase comprende: - la molienda de cereales: producción de harinas, grañones, sémolas o aglomerados (pellets) de trigo, centeno, avena, maíz y otros granos de cereales; - la molienda de arroz: producción de arroz descascarillado, blanqueado, pulido, glaseado, escaldado o convertido. La elaboración de harina de arroz; - la molienda de productos de origen vegetal: producción de harinas o sémolas de leguminosa de grano seco, de raíces o tubérculos, o de frutos secos comestibles; - la fabricación de productos para el desayuno a base de cereales; - la fabricación de mezclas de harinas y masas preparadas para pan, pasteles, galletas o tortitas. Esta clase no comprende: - la fabricación de harina o sémola de patata (véase 10.31); - el triturado de maíz húmedo (véase 10.62). @es
scope note: Cette classe comprend: - la mouture des grains: production de farines, de gruaux, de semoules ou d’agglomérés sous forme de pellets, de blé, de seigle, d’avoine, de maïs ou d’autres grains de céréales - la préparation du riz: la production de riz décortiqué, blanchi, poli, glacé, étuvé ou converti, la production de farine de riz - la préparation des légumes: la production de farines ou de semoules de légumes à cosse secs, de racines ou de tubercules, ou de fruits à coque comestibles - la fabrication d’aliments pour le petit-déjeuner à base de céréales - la fabrication de mélanges de farines et de farines mélangées préparées pour la fabrication de pains, de gâteaux, de biscuits ou de crêpes Cette classe ne comprend pas: - la fabrication de farines et de fécules de pommes de terre, voir 10.31 - la mouture du maïs par voie humide, voir 10.62 @fr
scope note: Ovaj razred uključuje: - mljevenje žitarica: proizvodnju brašna, drobina, prekrupe ili kuglica od pšenice, raži, zobi, kukuruza (zrna) ili drugih žitarica - obradu riže: proizvodnju oljuštene, mljevene, polirane, glazirane, blanširane ili konvertirane riže; proizvodnju rižina brašna - mljevenje povrća: proizvodnju brašna ili prekrupe od sušenoga mahunastog povrća, korijenja, gomolja ili jestivoga orašastog voća - proizvodnju žitarica za doručak - proizvodnju pripremljene mješavine brašna za kruh, kolače, sitno suho pecivo ili palačinke Ovaj razred isključuje: - proizvodnju brašna i prekrupe od krumpira, vidi 10.31 - mljevenje vlažnih žitarica, vidi 10.62
scope note: Į šią klasę įeina: - grūdų malimas: kviečių, rugių, avižų, kukurūzų ar kitokių grūdų miltų, kruopų, rupinių ar granulių gamyba - ryžių malimas: lukštentų, maltų, poliruotų, šlifuotų, truputį apvirtų ar perdirbtų ryžių gamyba; ryžių miltų gamyba - daržovių malimas: džiovintų ankštinių daržovių, šakniavaisių ar gumbavaisių bei valgomųjų riešutų miltų ar rupinių gamyba - pusryčiams skirtų maisto produktų iš grūdų gamyba - skirtingų miltų mišinių, paruoštų miltų mišinių ir tešlos duonai, pyragėliams, sausainiams ar blynams gamyba Į šią klasę neįeina: - bulvių miltų ir rupinių gamyba, žr. 10.31 - šlapiasis kukurūzų malimas, žr. 10.62 @lt
scope note: Этот класс включает: - производство хлебопекарных продуктов: • хлеба и булочек • мучных кондитерских изделий, тортов, пирожных, пирогов и бисквитов, фруктовых пирожных, блинов, вафель и т.д. Этот класс исключает: - производство сухих хлебопекарных продуктов, см. 10.72 - производство макарон, см. 10.73 - выпечку хлебопекарных изделий для немедленного употребления в пищу людьми, см. раздел 56 @ru
scope note: Bu sınıf aşağıdakileri kapsamaktadır; - tahılın öğütülmesi: un, dövülmüş tahıl, kaba un, buğday topakları, çavdar, yulaf, mısır ve diğer tahıl tohumlarının üretilmesi, - pirinci öğütülmesi: kavuzundan çıkarılmış, değirmenden geçirilmiş, perdahlanmış, parlatılmış, yarım kaynatılmış ve kırık halde pirinç üretimi; pirinç unu imalatı, - öğütülmüş sebze: köklerden, yumrulardan, yenilebilen kabuklardan, ya da kurutulmuş baklagillerden, un ve yemek imalatı, - kahvaltılık tahıl gıdaları imalatı, - ekmek, kek, bisküvi ya da pankek için hazırlanmış un karışımları ve hazır karıştırılmış unlar ile hamur imalatı. Kapsam dışı olanlar; - patates unu ve tozunun imalatı, bkz. 10.31, - yaş mısırın öğütülmesi, bkz. 10.62. @tr
preferred label: Производство на мелничарски продукти @bg
preferred label: Výroba mlýnských výrobků @cs
preferred label: Fremstilling af mølleriprodukter @da
preferred label: Mahl- und Schälmühlen @de
preferred label: Παραγωγή προϊόντων αλευρόμυλων @el
preferred label: Fabricación de productos de molinería @es
preferred label: Jahu ja tangainete tootmine @et
preferred label: Myllytuotteiden valmistus @fi
preferred label: Travail des grains @fr
preferred label: Malomipari termék gyártása
preferred label: Lavorazione delle granaglie @it
preferred label: Grūdų malimo produktų gamyba @lt
preferred label: Graudu malšanas produktu ražošana @lv
preferred label: Manifattura ta' prodotti ta' l-imtieħen tal-qmuħ @mt
preferred label: Vervaardiging van maalderijproducten @nl
preferred label: Produksjon av kornvarer @no
preferred label: Wytwarzanie produktów przemiału zbóż @pl
preferred label: Transformação de cereais e leguminosas @pt
preferred label: Fabricarea produselor de morărit @ro
preferred label: Производство продуктов мукомольно-крупяной промышленности @ru
preferred label: Výroba mlynských výrobkov @sk
preferred label: Mlinarstvo @sl
preferred label: Tillverkning av kvarnprodukter @sv
preferred label: Öğütülmüş hububat ve sebze ürünleri imalatı @tr
broader: Manufacture of grain mill products, starches and starch products

Manufacture of starches and starch products
type: Concept
notation: 10.62
status: valid
status modified: 2013-10-18
accepted date: 2013-10-18
in scheme: Statistical Classification of Economic Activities in the European Community, Rev. 2 (2008)
scope note: - производство на нишесте от пшеница, царевица, картофи, ориз и други - мелене на зърно по мокър способ - производство на глюкоза, сироп от глюкоза, малтоза, инулин и други - производство на глутен - производство на тапиока и нейни заместители, приготвени от нишесте - производство на царевично масло - производство на лактоза (млечна захар) - 10.51 - производство на захар от цвекло или тръстика - 10.81 @bg
scope note: Z: - výrobu škrobu z rýže, brambor, kukuřice atd. - mletí kukuřice za mokra - výrobu glukózy, glukózového sirupu, maltózy, inulinu atd. - výrobu lepku - výrobu tapioky a jejích náhražek z jiných škrobů - výrobu kukuřičného oleje N: - výrobu laktózy (mléčného cukru) (10.51) - výrobu třtinového a řepného cukru (10.81) @cs
scope note: Diese Klasse umfasst: - Herstellung von Stärke aus Reis, Kartoffeln, Mais usw. - Nassmahlen von Mais - Herstellung von Glucose, Glucosesirup, Maltose, Inulin usw. - Herstellung von Kleber - Herstellung von Tapiokasago und Sago aus anderen Stärken - Herstellung von Maisöl Diese Klasse umfasst nicht: - Herstellung von Milchzucker (Laktose) (s. 10.51) - Herstellung von Rohr- und Rübenzucker (s. 10.81) @de
scope note: This class includes: - manufacture of starches from rice, potatoes, maize etc. - wet corn milling - manufacture of glucose, glucose syrup, maltose, inulin etc. - manufacture of gluten - manufacture of tapioca and tapioca substitutes prepared from starch - manufacture of corn oil This class excludes: - manufacture of lactose (milk sugar), see 10.51 - production of cane or beet sugar, see 10.81 @en
scope note: Esta clase comprende: - la elaboración de almidones y féculas de arroz, patata, maíz, etc.; - el triturado de maíz húmedo; - la elaboración de glucosa, jarabe de glucosa, maltosa, inulina, etc.; - la elaboración de gluten; - la elaboración de tapioca y sucedáneos de tapioca preparados a base de almidones; - la elaboración de aceite de maíz. Esta clase no comprende: - la producción de lactosa (azúcar lácteo) (véase 10.51); - la producción de azúcar de caña o remolacha azucarera (véase 10.81). @es
scope note: Cette classe comprend: - la fabrication de produits amylacés à partir de riz, de pommes de terre, de maïs, etc. - la mouture du maïs par voie humide - la fabrication de glucose, de sirop de glucose, de maltose, d’inuline, etc. - la fabrication de gluten - la fabrication de tapioca et de succédanés du tapioca à partir d’amidon - la fabrication d’huile de maïs Cette classe ne comprend pas: - la fabrication de lactose, voir 10.51 - la production de sucre de canne ou de betteraves, voir 10.81 @fr
scope note: Ovaj razred uključuje: - proizvodnju škroba od riže, krumpira, kukuruza itd. - mljevenje vlažnih žitarica - proizvodnju glukoze, glukoznog sirupa, maltoze, inulina itd. - proizvodnju glutena - proizvodnju tapioke i njezinih nadomjestaka proizvedenih od škroba - proizvodnju ulja od kukuruznih klica Ovaj razred isključuje: - proizvodnju laktoze (mliječnog šećera), vidi 10.51 - proizvodnju šećera od šećerne trske i repe, vidi 10.81
scope note: Į šią klasę įeina: - ryžių, bulvių, kukurūzų ir kt. krakmolo gamyba - šlapiasis kukurūzų malimas - gliukozės, gliukozės sirupo, maltozės (salyklo cukraus), inulino ir kt. gamyba - glitimo gamyba - tapijokos ir tapijokos pakaitalų iš krakmolo gamyba - kukurūzų aliejaus gamyba Į šią klasę neįeina: - laktozės (pieno cukraus) gamyba, žr. 10.51 - cukranendrių ar cukrinių runkelių cukraus gamyba, žr. 10.81 @lt
scope note: Этот класс включает: - производство сухарей, печенья и прочих сухих хлебопекарных продуктов - производство мучных кондитерских изделий и тортов, пирожных, пирогов и бисквитов, предназначенных для длительного хранения - производство таких изделий как печенье, крекеры, крендели и т.д., соленых и сладких Этот класс исключает: - производство закусок из картофеля, см. 10.31 @ru
scope note: Bu sınıf aşağıdakileri kapsamaktadır; - pirinç, patates, mısır vb. ürünlerden nişasta imalatı, - yaş mısırın öğütülmesi, - glikoz, glikoz şurubu, maltoz, inulin vb. imalatı, - glüten imalatı, - tapyoka ve tapyoka ürünleri imalatı, - mısır yağı imalatı. Kapsam dışı olanlar; - laktoz imalatı, bkz. 10.51, - şekerkamışı veya şekerpancarı şekeri imalatı, bkz. 10.81. @tr
preferred label: Производство на нишесте и нишестени продукти @bg
preferred label: Výroba škrobárenských výrobků @cs
preferred label: Fremstilling af stivelse og stivelsesprodukter @da
preferred label: Herstellung von Stärke und Stärkeerzeugnissen @de
preferred label: Παραγωγή αμύλων και προϊόντων αμύλου @el
preferred label: Fabricación de almidones y productos amiláceos @es
preferred label: Tärklise ja tärklisetoodete tootmine @et
preferred label: Tärkkelyksen ja tärkkelystuotteiden valmistus @fi
preferred label: Fabrication de produits amylacés @fr
preferred label: Keményítő, keményítőtermék gyártása
preferred label: Produzione di amidi e di prodotti amidacei @it
preferred label: Krakmolo ir krakmolo produktų gamyba @lt
preferred label: Cietes un cietes produktu ražošana @lv
preferred label: Manifattura ta' lamti u prodotti oħra tal-lamtu @mt
preferred label: Vervaardiging van zetmeel en zetmeelproducten @nl
preferred label: Produksjon av stivelse og stivelsesprodukter @no
preferred label: Wytwarzanie skrobi i wyrobów skrobiowych @pl
preferred label: Fabricação de amidos, féculas e produtos afins @pt
preferred label: Fabricarea amidonului şi a produselor din amidon @ro
preferred label: Производство крахмала и продукции из крахмала @ru
preferred label: Výroba škrobu a škrobových výrobkov @sk
preferred label: Proizvodnja škroba in škrobnih izdelkov @sl
preferred label: Stärkelsetillverkning @sv
preferred label: Nişasta ve nişastalı ürünlerin imalatı @tr
broader: Manufacture of grain mill products, starches and starch products

Manufacture of bakery and farinaceous products
type: Concept
notation: 10.7
status: valid
status modified: 2013-10-18
accepted date: 2013-10-18
in scheme: Statistical Classification of Economic Activities in the European Community, Rev. 2 (2008)
scope note: Тази група включва производство на хлебни, макаронени и подобни изделия. @bg
scope note: Tato skupina zahrnuje výrobu pečiva, makaronů, nudlí a podobných výrobků. @cs
scope note: Diese Gruppe umfasst die Herstellung von Backwaren und Teigwaren @de
scope note: This group includes the production of bakery products, macaroni, noodles and similar products. @en
scope note: Este grupo comprende la producción de productos de panadería, pastas alimenticias y productos similares. @es
scope note: Ce groupe comprend la production de produits de boulangerie, de pâtes alimentaires et d’autres produits similaires. @fr
scope note: Ova skupina uključuje proizvodnju pekarskih proizvoda, makarona, tjestenine i sličnih proizvoda.
scope note: Į šią grupę įeina kepyklos gaminių, makaronų, lakštinių, vermišelių ir panašių produktų gamyba. @lt
scope note: Этот класс включает: - производство макарон, блюд из макарон и лапши, готовых к употреблению или с начинкой или нет - производство кускуса - производство консервированных или замороженных макаронных изделий Этот класс исключает: - производство готовых блюд из кускуса, см. 10.85 - производство супов, содержащих макароны, см. 10.89 @ru
scope note: Bu grup, fırın ürünleri ile makarna, şehriye ve benzer ürünlerin üretilmesini kapsamaktadır. @tr
preferred label: Производство на хлебни и тестени изделия @bg
preferred label: Výroba pekařských, cukrářských a jiných moučných výrobků @cs
preferred label: Fremstilling af bageri- og dejprodukter @da
preferred label: Herstellung von Back- und Teigwaren @de
preferred label: Παραγωγή ειδών αρτοποιίας και αλευρωδών προϊόντων @el
preferred label: Fabricación de productos de panadería y pastas alimenticias @es
preferred label: Pagari- ja makarontoodete tootmine @et
preferred label: Leipomotuotteiden, makaronien yms. valmistus @fi
preferred label: Fabrication de produits de boulangerie pâtisserie et de pâtes alimentaires @fr
preferred label: Pékáru, tésztafélék gyártása
preferred label: Fabbricazione di prodotti da forno e farinacei @it
preferred label: Kepyklos ir miltinių produktų gamyba @lt
preferred label: Konditorejas un miltu izstrādājumu ražošana @lv
preferred label: Manifattura ta' prodotti tal-furnara u magħmula bid-dqiq @mt
preferred label: Vervaardiging van bakkerijproducten en deegwaren @nl
preferred label: Produksjon av bakeri- og pastavarer @no
preferred label: Produkcja wyrobów piekarskich i mącznych @pl
preferred label: Fabricação de produtos de padaria e outros produtos à base de farinha @pt
preferred label: Fabricarea produselor de brutărie şi a produselor făinoase @ro
preferred label: Производство хлебобулочных и мучных изделий @ru
preferred label: Výroba pečiva a múčnych výrobkov @sk
preferred label: Proizvodnja pekarskih izdelkov in testenin @sl
preferred label: Tillverkning av bageri- och mjölprodukter @sv
preferred label: Fırın ve unlu mamuller imalatı @tr
broader: Manufacture of food products
narrower: Manufacture of bread; manufacture of fresh pastry goods and cakes
narrower: Manufacture of rusks and biscuits; manufacture of preserved pastry goods and cakes
narrower: Manufacture of macaroni, noodles, couscous and similar farinaceous products

Manufacture of bread; manufacture of fresh pastry goods and cakes
type: Concept
notation: 10.71
status: valid
status modified: 2013-10-18
accepted date: 2013-10-18
in scheme: Statistical Classification of Economic Activities in the European Community, Rev. 2 (2008)
scope note: - производство на хлебни изделия: • хляб • пресни хлебни и сладкарски изделия - производство на "сухи" хлебни изделия - 10.72 - производство на макаронени изделия - 10.73 - затопляне на хлебни изделия за непосредствена консумация - раздел 56 @bg
scope note: Z: - výrobu pekařských a cukrářských výrobků: • chleba, rohlíků a jiného pečiva • čerstvých cukrářských výrobků jako koláčů, dortů, vdolků, vaflí atd. N: - výrobu trvanlivého pečiva (10.72) - výrobu těstovin (10.73) - ohřívání pekařských a cukrářských výrobků pro okamžitou spotřebu (oddíl 56) @cs
scope note: Diese Klasse umfasst: - Herstellung von Backwaren: • Brot und Brötchen/Gebäck • feinen Backwaren wie Kuchen, Torten, Pfannkuchen/Palatschinken, Waffeln usw. Diese Klasse umfasst nicht: - Herstellung von Dauerbackwaren (s. 10.72) - Herstellung von Nudeln (s. 10.73) - Erwärmen von Backwaren für den sofortigen Verzehr (s. Abteilung 56) @de
scope note: This class includes: - manufacture of bakery products: • bread and rolls • pastry, cakes, pies, tarts, pancakes, waffles, rolls etc. This class excludes: - manufacture of dry bakery products, see 10.72 - manufacture of pastas, see 10.73 - heating up of bakery items for immediate consumption, see division 56 @en
scope note: Esta clase comprende: - la fabricación de productos de panadería: • panes y panecillos; • pastas, tortas, tartas, pasteles, tortitas, gofres, bollos, etc.; Esta clase no comprende: - la fabricación de productos secos de panadería (véase 10.72); - la fabricación de pastas alimenticias (véase 10.73); - el horneado de productos de panadería para su consumo inmediato (véase la división 56). @es
scope note: Cette classe comprend: - la fabrication de produits de boulangerie: • pains et petits pains • pâtisserie, gâteaux, tourtes, tartes, crêpes, gaufres, etc. Cette classe ne comprend pas: - la fabrication de produits de boulangerie secs, voir 10.72 - la fabrication de pâtes alimentaires, voir 10.73 - le réchauffage de produits de boulangerie pour consommation immédiate, voir division 56 @fr
scope note: Ovaj razred uključuje: - proizvodnju svježih pekarskih proizvoda • kruha i peciva • svježih slastica, kolača, pita, voćnih pita, palačinki, vafli, rolada itd. Ovaj razred isključuje: - proizvodnju suhih pekarskih proizvoda, vidi 10.72 - proizvodnju tjestenine, vidi 10.73 - podgrijavanje pekarskih proizvoda za trenutačnu konzumaciju, vidi odjeljak 56
scope note: Į šią klasę įeina: - kepyklos produktų gamyba: • duonos ir bandelių • tešlainių, pyragų, keksų, tortų, blynų, vaflių, vyniotinių ir t.t. Į šią klasę neįeina: - sausų kepyklos produktų gamyba, žr. 10.72 - kietos tešlos produktų (makaronų, vermišelių ir kt.) gamyba, žr. 10.73 - kepyklos produktų, skirtų vartoti nedelsiant, pašildymas, žr. 56 skyrių @lt
scope note: Данная группа включает производство сахара и конфет, готовых блюд, кофе, чай и специи, а также скоропортящихся и специфических продуктов питания. @ru
scope note: Bu sınıf aşağıdakileri kapsamaktadır; - fırın ürünlerinin imalatı; • her çeşit ekmek imalatı, • simit imalatı, - pasta, kek, börek, pay, turta, waffles,vb. imalatı. Kapsam dışı olanlar; - kuru fırın ürünleri imalatı, bkz. 10.72, - nişastalı ve irmikli (makarna) ürünlerin imalatı, bkz. 10.73, - hazır tüketim için fırın ürünlerinin ısıtılması, bkz. bölüm 56. @tr
preferred label: Производство на хляб, хлебни и пресни сладкарски изделия @bg
preferred label: Výroba pekařských a cukrářských výrobků, kromě trvanlivých @cs
preferred label: Fremstilling af brød, fremstilling af friske kager, tærter mv. @da
preferred label: Herstellung von Backwaren (ohne Dauerbackwaren) @de
preferred label: Αρτοποιία· παραγωγή νωπών ειδών ζαχαροπλαστικής @el
preferred label: Fabricación de pan y de productos frescos de panadería y pastelería @es
preferred label: Leivatootmine; säilitusaineteta pagaritoodete tootmine @et
preferred label: Leivän valmistus; tuoreiden leivonnaisten ja kakkujen valmistus @fi
preferred label: Fabrication de pain et de pâtisserie fraîche @fr
preferred label: Kenyér; friss pékáru gyártása
preferred label: Produzione di pane; prodotti di pasticceria freschi @it
preferred label: Duonos gamyba; šviežių konditerijos kepinių ir pyragaičių gamyba @lt
preferred label: Maizes ražošana; svaigi ceptu mīklas izstrādājumu un kūku ražošana @lv
preferred label: Manifattura ta' ħobż; manifattura ta' oġġetti ta' l-għaġina u pasti friski @mt
preferred label: Vervaardiging van brood en van vers banketbakkerswerk @nl
preferred label: Produksjon av brød og ferske konditorvarer @no
preferred label: Produkcja pieczywa; produkcja świeżych wyrobów ciastkarskich i ciastek @pl
preferred label: Panificação e pastelaria fresca @pt
preferred label: Fabricarea pâinii; fabricarea prăjiturilor şi a produselor proaspete de patiserie @ro
preferred label: Производство хлеба; производство свежих мучных кондитерских изделий, тортов и пирожных @ru
preferred label: Výroba chleba; výroba čerstvého pečiva a koláčov @sk
preferred label: Proizvodnja kruha, svežega peciva in slaščic @sl
preferred label: Tillverkning av mjukt matbröd och färska bakverk @sv
preferred label: Ekmek, taze pastane ürünleri ve taze kek imalatı @tr
broader: Manufacture of bakery and farinaceous products

Manufacture of rusks and biscuits; manufacture of preserved pastry goods and cakes
type: Concept
notation: 10.72
status: valid
status modified: 2013-10-18
accepted date: 2013-10-18
in scheme: Statistical Classification of Economic Activities in the European Community, Rev. 2 (2008)
scope note: - производство на сухари, бисквити и „сухи“ хлебни изделия - производство на трайни сладкарски изделия - производство на сухи закуски, солени или сладки - производство на картофени закуски (снакс) - 10.31 @bg
scope note: Z: - výrobu sucharů, sušenek a podobného trvanlivého pečiva - výrobu trvanlivých cukrářských výrobků - výrobu trvanlivých sladkých nebo slaných výrobků jako čajového pečiva, krekrů, preclíků apod. N: - výrobu bramborových lupínků (10.31) @cs
scope note: Diese Klasse umfasst: - Herstellung von Keksen und anderen trockenen Backwaren - Herstellung von Dauerbackwaren - Herstellung von süßen oder salzigen Snacks (Spritzgebäck, Kräcker, Bretzel usw.), süß oder salzig Diese Klasse umfasst nicht: - Herstellung von Kartoffelsnacks (s. 10.31) @de
scope note: This class includes: - manufacture of rusks, biscuits and other dry bakery products - manufacture of preserved pastry goods and cakes - manufacture of snack products (cookies, crackers, pretzels etc.), whether sweet or salted This class excludes: - manufacture of potato snacks, see 10.31 @en
scope note: Esta clase comprende: - la fabricación de galletas y biscotes y de otros productos secos de panadería; - la fabricación de productos de repostería con conservante; - la producción de aperitivos (galletas dulces o saladas, pretzels, etc.) dulces o salados. Esta clase no comprende: - la fabricación de aperitivos a base de patata (véase 10.31). @es
scope note: Cette classe comprend: - la fabrication de biscottes, de biscuits et autres produits de boulangerie secs - la fabrication de pâtisseries et de gâteaux de conservation - la fabrication de produits apéritifs et d’autres produits similaires (petits biscuits, bretzels, etc.), sucrés ou salés Cette classe ne comprend pas: - la production de produits apéritifs à base de pommes de terre, voir 10.31 @fr
scope note: Ovaj razred uključuje: - proizvodnju hrskavih prizvoda, dvopeka, keksa i ostalih suhih pekarskih proizvoda - proizvodnju trajnih slastica i kolača - proizvodnju grickalica (štapića, krekera, pereca itd.), slatkih ili slanih Ovaj razred isključuje: - proizvodnju čipsa, vidi 10.31
scope note: Į šią klasę įeina: - džiūvėsių, sausainių ir kitų sausų kepyklos produktų gamyba - ilgai išsilaikančių tešlos gaminių ir pyragaičių gamyba - lengvų saldžių ar sūrių užkandžių (saldžių bandelių, krekerių, sūrių riestainiukų ir kt.) gamyba Į šią klasę neįeina: - lengvų bulvių užkandžių gamyba, žr. 10.31 @lt
scope note: Этот класс включает: - производство или очищение сахара (сахарозы) и сахаросодержащих веществ из сока тростника, свеклы, клена и пальмы - производство сахарного сиропа - производство черной патоки - производство кленового сиропа и сахара Этот класс исключает: - производство глюкозы, сиропа из глюкозы, мальтозы, см. 10.62 @ru
scope note: Bu sınıf aşağıdakileri kapsamaktadır; - peksimet ve bisküvi ve kuru fırın ürünleri imalatı, - dayanıklı pastane ürünleri ve kek imalatı, - tatlı veya tuzlu hafif ürünler imalatı (kurabiyeler, krakerler, gevrek halkalar vb.). Kapsam dışı olanlar; - patates çerezi imalatı, bkz. 10.31. @tr
preferred label: Производство на сухари, бисквити и сухи сладкарски изделия @bg
preferred label: Výroba sucharů a sušenek; výroba trvanlivých cukrářských výrobků @cs
preferred label: Fremstilling af tvebakker og kiks; fremstilling af konserverede kager, tærter mv. @da
preferred label: Herstellung von Dauerbackwaren @de
preferred label: Παραγωγή παξιμαδιών και μπισκότων· παραγωγή διατηρούμενων ειδών ζαχαροπλαστικής @el
preferred label: Fabricación de galletas y productos de panadería y pastelería de larga duración @es
preferred label: Kuiviku- ja küpsisetootmine; säilitusainetega pagaritoodete tootmine @et
preferred label: Näkkileivän ja keksien valmistus; säilyvien leivonnaisten ja kakkujen valmistus @fi
preferred label: Fabrication de biscuits, biscottes et pâtisseries de conservation @fr
preferred label: Tartósított lisztes áru gyártása
preferred label: Produzione di fette biscottate e di biscotti; fabbricazione di prodotti di pasticceria conservati @it
preferred label: Džiūvėsių ir sausainių gamyba; ilgai išsilaikančių konditerijos kepinių ir pyragaičių gamyba @lt
preferred label: Sausiņu un cepumu ražošana; ilgi uzglabājamo konditorejas izstrādājumu un kūku ražošana @lv
preferred label: Manifattura ta' biskuttelli u gallettini; manifattura ta' oġġetti ta' l-għaġina u pasti ppriservati @mt
preferred label: Vervaardiging van beschuit en biscuit en van ander houdbaar banketbakkerswerk @nl
preferred label: Produksjon av kavringer, kjeks og konserverte konditorvarer @no
preferred label: Produkcja sucharów i herbatników; produkcja konserwowanych wyrobów ciastkarskich i ciastek @pl
preferred label: Fabricação de bolachas, biscoitos, tostas e pastelaria de conservação @pt
preferred label: Fabricarea biscuiţilor şi pişcoturilor; fabricarea prăjiturilor şi a produselor conservate de patiserie @ro
preferred label: Производство сухарей и печенья; производство мучных кондитерских изделий, тортов, пирожных, пирогов и бисквитов, предназначенных для длительного хранения @ru
preferred label: Výroba suchárov a keksov; výroba trvanlivého pečiva a koláčov @sk
preferred label: Proizvodnja prepečenca in piškotov; proizvodnja trajnega peciva in slaščic @sl
preferred label: Tillverkning av knäckebröd, kex och konserverade bakverk @sv
preferred label: Peksimet ve bisküvi imalatı; dayanıklı pastane ürünleri ve dayanıklı kek imalatı @tr
broader: Manufacture of bakery and farinaceous products

Manufacture of macaroni, noodles, couscous and similar farinaceous products
type: Concept
notation: 10.73
status: valid
status modified: 2013-10-18
accepted date: 2013-10-18
in scheme: Statistical Classification of Economic Activities in the European Community, Rev. 2 (2008)
scope note: - производство на макарони, юфка и подобни макаронени изделия, дори пълнени, варени или обработени по друг начин, без готовите ястия, съдържащи макаронени изделия - производство на кус-кус - производство на консервирани или замразени макаронени изделия - производство на замразени готови ястия, съдържащи макаронени изделия - 10.85 - производство на супи, съдържащи макаронени изделия - 10.89 @bg
scope note: Z: - výrobu těstovin jako makaronů a nudlí, též vařených nebo plněných - výrobu kuskusu - výrobu mrazených těstovin nebo těstovinových konzerv N: - výrobu hotových kuskusových pokrmů (10.85) - výrobu polévek obsahujících těstoviny (10.89 @cs
scope note: Diese Klasse umfasst: - Herstellung von Teigwaren wie Makkaroni und Nudeln, auch gekocht oder gefüllt - Herstellung von Couscous - Herstellung von gefrorenen Teigwaren oder Teigwarenkonserven Diese Klasse umfasst nicht: - Herstellung zubereiteter Couscous-Gerichte (s. 10.85) - Herstellung von Teigwaren enthaltenden Suppen (s. 10.89) @de
scope note: This class includes: - manufacture of pastas such as macaroni and noodles, whether or not cooked or stuffed - manufacture of couscous - manufacture of canned or frozen pasta products This class excludes: - manufacture of prepared couscous dishes, see 10.85 - manufacture of soup containing pasta, see 10.89 @en
scope note: Esta clase comprende: - la fabricación de pastas alimenticias: cocidas y sin cocer, rellenas o sin rellenar; - la fabricación de cuscús; - la fabricación de pastas alimenticias enlatadas o congeladas. Esta clase no comprende: - la fabricación de platos de cuscús preparados (véase 10.85); - la fabricación de sopas que contienen pasta (véase 10.89). @es
scope note: Cette classe comprend: - la fabrication de pâtes alimentaires, même cuites ou farcies, telles que les macaronis et les nouilles - la fabrication de couscous - la fabrication de produits en conserve ou surgelés à base de pâtes Cette classe ne comprend pas: - la production de plats préparés à base couscous, voir 10.85 - la préparation de potages à base de pâtes, voir 10.89 @fr
scope note: Ovaj razred uključuje: - proizvodnju tjestenina kao što su makaroni i njoki bez obzira na to jesu li kuhani i nadjeveni ili nisu - proizvodnju kuskusa - proizvodnju konzerviranih ili smrznutih proizvoda od tijesta Ovaj razred isključuje: - proizvodnju jela od kuskusa, vidi 10.85 - proizvodnju juha koje sadrže tjesteninu, vidi 10.89
scope note: Į šią klasę įeina: - miltinių produktų, tokių kaip makaronai ir vermišeliai (virti ar nevirti, su įdaru ar be įdaro), gamyba - kuskuso gamyba - konservuotų arba sušaldytų makaronų produktų gamyba Į šią klasę neįeina: - paruoštų kuskuso patiekalų gamyba, žr. 10.85 - makaronų sriubos gamyba, žr. 10.89 @lt
scope note: Этот класс включает: - производство какао: какао-массы, какао-жиров, какао-масла - производство шоколада и шоколадных конфет - производство сахарных конфет: карамели, какао, нуги, помадки, белого шоколада - производство жевательной резинки - производство засахаренных фруктов, орехов, цукатов из кожуры и прочих частей растений - производство конфет, подушечек и пастилок Этот класс исключает: - производство сахарозы, см. 10.81 @ru
scope note: Bu sınıf aşağıdakileri kapsamaktadır; - makarna ve şehriye imalatı; pişirilmiş veya içi doldurulmuş olsun veya olmasın, - kuskus imalatı, - konservelenmiş veya içi dondurulmuş makarna ürünlerin imalatı. Kapsam dışı olanlar; - hazır kuskus imalatı, bkz. 10.85, - makarna ihtiva eden çorba imalatı, bkz. 10.89. @tr
preferred label: Производство на макарони, юфка, кус-кус и подобни макаронени изделия @bg
preferred label: Výroba makaronů, nudlí, kuskusu a podobných moučných výrobků @cs
preferred label: Fremstilling af makaroni, nudler, couscous og lignende dejvarer @da
preferred label: Herstellung von Teigwaren @de
preferred label: Παραγωγή μακαρονιών, λαζανιών, κουσκούς και παρόμοιων αλευρωδών προϊόντων @el
preferred label: Fabricación de pastas alimenticias, cuscús y productos similares @es
preferred label: Makaronide, nuudlite, kuskussi jms makarontoodete tootmine @et
preferred label: Makaronin, nuudelien, kuskusin ja vastaavien jauhotuotteiden valmistus @fi
preferred label: Fabrication de pâtes alimentaires @fr
preferred label: Tésztafélék gyártása
preferred label: Produzione di paste alimentari, di cuscus e di prodotti farinacei simili @it
preferred label: Makaronų, vermišelių, kuskuso ir panašių miltinių produktų gamyba @lt
preferred label: Makaronu, nūdeļu, kuskusa un līdzīgu miltu izstrādājumu ražošana @lv
preferred label: Manifattura ta' mqarrun, taljarini, kuskus u prodotti oħra simili ta' l-għaġina @mt
preferred label: Vervaardiging van macaroni, noedels, koeskoes en dergelijke deegwaren @nl
preferred label: Produksjon av makaroni, nudler, couscous og lignende pastavarer @no
preferred label: Produkcja makaronów, klusek, kuskusu i podobnych wyrobów mącznych @pl
preferred label: Fabricação de massas alimentícias, cuscuz e similares @pt
preferred label: Fabricarea macaroanelor, tăiţeilor, cuş-cuş-ului şi a altor produse făinoase similare @ro
preferred label: Производство макаронных изделий, кускуса и похожих мучных продуктов @ru
preferred label: Výroba rezancov, cestovín, kuskusu a podobných múčnych výrobkov @sk
preferred label: Proizvodnja testenin @sl
preferred label: Tillverkning av pastaprodukter @sv
preferred label: Makarna, şehriye, kuskus ve benzeri unlu mamullerin imalatı @tr
broader: Manufacture of bakery and farinaceous products

Manufacture of other food products
type: Concept
notation: 10.8
status: valid
status modified: 2013-10-18
accepted date: 2013-10-18
in scheme: Statistical Classification of Economic Activities in the European Community, Rev. 2 (2008)
scope note: Тази група включва производство на захар, захарни и шоколадови изделия; готови ястия; бързоразвалящи се храни и специални хранителни продукти; преработка на кафе, чай и подправки. @bg
scope note: Tato skupina zahrnuje výrobu cukru a cukrovinek, hotových pokrmů, kávy, čaje a koření, jakož i rychle se kazících potravin a speciálních potravinových výrobků. @cs
scope note: Diese Gruppe umfasst die Herstellung von Zucker und Süßwaren, Fertiggerichten, Kaffee, Tee und Gewürzen sowie von begrenzt haltbaren Lebensmitteln und Spezialitäten @de
scope note: This group includes the production of sugar and confectionery, prepared meals and dishes, coffee, tea and spices, as well as perishable and specialty food products. @en
scope note: Este grupo comprende la producción de azúcar y productos de confitería, comidas y platos preparados, café, té y especias, así como de productos alimenticios perecederos y especiales. @es
scope note: Ce groupe comprend la production de sucre et de confiseries, de plats préparés, de café, thé, cacao et épices, ainsi que d’aliments préparés et de spécialités périssables. @fr
scope note: Ova skupina uključuje proizvodnju šećera i slastica, gotovih jela i obroka, kave, čaja i začina kao i lakopokvarljivih prehrambenih proizvoda te specijaliteta.
scope note: Į šią grupę įeina cukraus ir saldumynų, gatavo maisto ir patiekalų, kavos, arbatos ir prieskonių, taip pat greitai gendančių ir specializuotų maisto produktų gamyba. @lt
scope note: Этот класс включает: - извлечение кофеина и обжаривание кофейных зерен - производство кофепродуктов: • молотого кофе • растворимого кофе • экстрактов и концентратов кофе - производство кофезаменителей - смешивание чая и мате - производство и приготовление экстрактов на чайной основе или мате - упаковка чая, в том числе в чайных пакетиках Этот класс также включает: - производство травяных настоев (мяты, вербены, ромашки и т.д.) Этот класс исключает: - производство инулина, см. 10.62 - производство спирта, пива, вина и безалкогольных напитков, см. раздел 11 - подготовку растений для использования в фармакологии, см. 21.20 @ru
scope note: Bu grup, kolay bozulabilir ve özel gıda maddeleri ile şekerlerin ve şekerlemelerin, hazır yemeklerin ve yiyeceklerin, kahve, çay ve baharatların imal edilmesini kapsamaktadır. @tr
preferred label: Производство на други хранителни продукти @bg
preferred label: Výroba ostatních potravinářských výrobků @cs
preferred label: Fremstilling af andre fødevarer @da
preferred label: Herstellung von sonstigen Nahrungsmitteln @de
preferred label: Παραγωγή άλλων ειδών διατροφής @el
preferred label: Fabricación de otros productos alimenticios @es
preferred label: Muude toiduainete tootmine @et
preferred label: Muiden elintarvikkeiden valmistus @fi
preferred label: Fabrication d'autres produits alimentaires @fr
preferred label: Egyéb élelmiszer gyártása
preferred label: Produzione di altri prodotti alimentari @it
preferred label: Kitų maisto produktų gamyba @lt
preferred label: Citu pārtikas produktu ražošana @lv
preferred label: Manifattura ta' prodotti oħra ta' l-ikel @mt
preferred label: Vervaardiging van andere voedingsmiddelen @nl
preferred label: Produksjon av andre næringsmidler @no
preferred label: Produkcja pozostałych artykułów spożywczych @pl
preferred label: Fabricação de outros produtos alimentares @pt
preferred label: Fabricarea altor produse alimentare @ro
preferred label: Производство прочих продуктов питания @ru
preferred label: Výroba ostatných potravinárskych výrobkov @sk
preferred label: Proizvodnja drugih prehrambenih izdelkov @sl
preferred label: Annan livsmedelsframställning @sv
preferred label: Diğer gıda maddelerinin imalatı @tr
broader: Manufacture of food products
narrower: Manufacture of sugar
narrower: Manufacture of cocoa, chocolate and sugar confectionery
narrower: Processing of tea and coffee
narrower: Manufacture of condiments and seasonings
narrower: Manufacture of prepared meals and dishes
narrower: Manufacture of homogenised food preparations and dietetic food
narrower: Manufacture of other food products n.e.c.

Manufacture of sugar
type: Concept
notation: 10.81
status: valid
status modified: 2013-10-18
accepted date: 2013-10-18
in scheme: Statistical Classification of Economic Activities in the European Community, Rev. 2 (2008)
scope note: - производство или рафиниране на захар от захарна тръстика, захарно цвекло, клен и палми - производство на захарни сиропи - производство на меласи - производство на сироп от клен - производство на глюкоза, сироп от глюкоза, малтоза -10.62 @bg
scope note: Z: - výrobu nebo rafinaci cukru (sacharózy) a jeho náhražek ze šťáv z cukrové třtiny, cukrové řepy, javoru a palem - výrobu cukerných sirupů - výrobu melasy - výrobu javorového sirupu a javorového cukru N: - výrobu glukózy, glukózového sirupu, maltózy (10.62) @cs
scope note: Diese Klasse umfasst: - Herstellung und Raffination von Zucker (Saccharose) und hieraus erzeugten Zuckerarten auf der Basis von Zuckerrohr-, Zuckerrüben-, Ahorn- und Palmsäften - Herstellung von Zuckersirup - Herstellung von Melasse - Herstellung von Ahornsirup und Ahornzucker Diese Klasse umfasst nicht: - Herstellung von Glucose, Glucosesirup, Maltose (s. 10.62) @de
scope note: This class includes: - manufacture or refining of sugar (sucrose) and sugar substitutes from the juice of cane, beet, maple and palm - manufacture of sugar syrups - manufacture of molasses - production of maple syrup and sugar This class excludes: - manufacture of glucose, glucose syrup, maltose, see 10.62 @en
scope note: Esta clase comprende: - la producción y refinado de azúcar (sacarosa) y sucedáneos del azúcar obtenidos a partir del jarabe de caña, remolacha, arce, palma; - la elaboración de jarabes de azúcar; - la fabricación de melaza; - la producción de azúcar y jarabe de arce. Esta clase no comprende: - la elaboración de glucosa, jarabe de glucosa, maltosa (véase 10.62). @es
scope note: Cette classe comprend: - la fabrication ou le raffinage du sucre (saccharose) et des succédanés du sucre obtenus à partir de jus de canne, de betterave, d’érable et de palme - la fabrication de sirops de sucre - la fabrication de mélasse - la production de sirop et de sucre d’érable Cette classe ne comprend pas: - la fabrication de glucose, de sirop de glucose, de maltose, voir 10.62 @fr
scope note: Ovaj razred uključuje: - proizvodnju ili rafiniranje šećera (saharoze) i šećernih nadomjestaka koji se dobivaju od sirupa šećerne trske, repe, javora i palme - proizvodnju šećernog sirupa - proizvodnju melase - proizvodnju sirupa i šećera od javora Ovaj razred isključuje: - proizvodnju glukoze, sirupa od glukoze, maltoze, vidi 10.62
scope note: Į šią klasę įeina: - cukraus (sacharozės) ir cukraus pakaitalų gamyba arba rafinavimas iš cukranendrių, cukrinių runkelių, klevų, palmių sulčių - cukraus sirupo gamyba - melasos gamyba - klevo sirupo ir cukraus gamyba Į šią klasę neįeina: - gliukozės, gliukozės sirupo, maltozės gamyba, žr. 10.62 @lt
scope note: Этот класс включает: - производство специй, соусов и приправ: • майонеза • горчичной муки и мучки • горчицы и т.д. - производство уксуса Этот класс также включает: - переработку соли для приема в пищу, например йодированная соль Этот класс исключает: - выращивание специй, см. 01.28 @ru
scope note: Bu sınıf aşağıdakileri kapsamaktadır; - kamış suyundan, pancardan, palmiyeden, akça ağaçtan şeker (sakaroz) ve şeker ürünleri imalatı veya rafine edilmesi, - şeker şurubu imalatı, - melas imalatı, - akça ağacın özünden melas ve şeker üretilmesi. Kapsam dışı olanlar; - glikoz, glikoz şurubu, maltoz imalatı, bkz. 10.62. @tr
preferred label: Производство на захар @bg
preferred label: Výroba cukru @cs
preferred label: Fremstilling af sukker @da
preferred label: Herstellung von Zucker @de
preferred label: Παραγωγή ζάχαρης @el
preferred label: Fabricación de azúcar @es
preferred label: Suhkrutootmine @et
preferred label: Sokerin valmistus @fi
preferred label: Fabrication de sucre @fr
preferred label: Cukorgyártás
preferred label: Produzione di zucchero @it
preferred label: Cukraus gamyba @lt
preferred label: Cukura ražošana @lv
preferred label: Manifattura ta' zokkor @mt
preferred label: Vervaardiging van suiker @nl
preferred label: Produksjon av sukker @no
preferred label: Produkcja cukru @pl
preferred label: Indústria do açúcar @pt
preferred label: Fabricarea zahărului @ro
preferred label: Производство сахара @ru
preferred label: Proizvodnja sladkorja @sl
preferred label: Sockertillverkning @sv
preferred label: Şeker imalatı @tr
broader: Manufacture of other food products

Manufacture of cocoa, chocolate and sugar confectionery
type: Concept
notation: 10.82
status: valid
status modified: 2013-10-18
accepted date: 2013-10-18
in scheme: Statistical Classification of Economic Activities in the European Community, Rev. 2 (2008)
scope note: - производство на какао и какаово масло - производство на шоколад и шоколадови изделия - производство на захарни изделия: карамели, нуга, фондан, дражета, бонбони, бял шоколад - производство на дъвка - консервиране в захар на плодове, ядки, плодови кори и други части от растения - производство на пастили за гърло и бонбони против кашлица - производство на захароза - 10.81 @bg
scope note: Z: - výrobu kakaa, kakaového másla, kakaovéhu tuku, kakaového oleje - výrobu čokolády a čokoládových výrobků - výrobu cukrovinek: karamelek, ústních pastilek, nugátu, fondánu, bílé čokolády - výrobu žvýkaček - konzervaci ovoce, ořechů, ovocné kůry a dalších rostlinných částí v cukru - výrobu bonbónů N: - výrobu stolního cukru (10.81) @cs
scope note: Diese Klasse umfasst: - Herstellung von Kakao, Kakaobutter, Kakaofett, Kakaoöl - Herstellung von Schokolade und Schokoladenwaren - Herstellung von Zuckerwaren: Karamellen, Cachous, Nugats, Fondants, weiße Schokolade - Herstellung von Kaugummi - Konservierung von Obst, Nüssen, Fruchtschalen und anderen Pflanzenteilen in Zucker - Herstellung von Pfefferminz- und anderen süßen Pastillen Diese Klasse umfasst nicht: - Herstellung von Rohr- bzw. Rübenzucker (s. 10.81) @de
scope note: This class includes: - manufacture of cocoa, cocoa butter, cocoa fat, cocoa oil - manufacture of chocolate and chocolate confectionery - manufacture of sugar confectionery: caramels, cachous, nougats, fondant, white chocolate - manufacture of chewing gum - preserving in sugar of fruit, nuts, fruit peels and other parts of plants - manufacture of confectionery lozenges and pastilles This class excludes: - manufacture of sucrose sugar, see 10.81 @en
scope note: Esta clase comprende: - la elaboración de cacao, manteca de cacao, grasa de cacao, aceite de cacao; - la elaboración de chocolate y productos de chocolate; - la elaboración de productos de confitería: caramelos, pastillas de regaliz, turrones, glaseados, chocolate blanco; - la fabricación de chicle; - la conservación en azúcar de frutas, frutos secos, cortezas de frutas y otras partes de plantas; - la elaboración de pastillas de confitería. Esta clase no comprende: - la fabricación de sacarosa (véase 10.81). @es
scope note: Cette classe comprend: - la fabrication de cacao, de beurre de cacao, de graisse de cacao et d’huile de cacao - la fabrication du chocolat et de confiseries au chocolat - la fabrication de confiseries: caramels, cachous, nougats, fondants, chocolat blanc - la fabrication de gommes à mâcher (chewing-gums) - la conservation dans le sucre de fruits (y compris à coque), d’écorces de fruits et d’autres parties de plantes - la fabrication de dragées et pastilles Cette classe ne comprend pas: - la production de saccharose, voir 10.81 @fr
scope note: Ovaj razred uključuje: - proizvodnju kakaa, kakao-maslaca, kakao-masti i kakao-ulja - proizvodnju čokolade i čokoladnih bombona - proizvodnju bombona na bazi šećera: karamela, kašua, nugata, fondana, bijele čokolade - proizvodnju guma za žvakanje - proizvodnju ušećerenog voća, oraha i sličnoga orašastog voća, kora od voća i drugih dijelova biljaka - proizvodnju dražeja i pastila protiv kašlja Ovaj razred isključuje: - proizvodnju saharoze, vidi 10.81
scope note: Į šią klasę įeina: - kakavos ir kakavos sviesto, riebalų ir aliejaus gamyba - šokolado ir šokolado konditerijos gaminių gamyba - cukraus saldumynų gamyba: karamelės, kvėpavimą lengvinančių saldainių, nugos, lengvai tirpstančių saldainių, baltojo šokolado - kramtomosios gumos gamyba - vaisių, uogų, riešutų, vaisių žievelių ir kitų augalų dalių konservavimas cukruje - konditerinių tablečių ir pastilių gamyba Į šią klasę neįeina: - sacharozės gamyba, žr. 10.81 @lt
scope note: Этот класс включает производство готовых продуктов и полуфабрикатов (то есть готовых к употреблению). Данные продукты приготовлены для длительного хранения, в замороженном или консервированном состоянии, они обычно упакованы и на них имеются этикетки, то есть данный подкласс не включает подготовку продукта для немедленного употребления в пищу людьми, как в ресторанах. Как готовые продукты, данные продукты питания содержат хотя бы два компонента (за исключением специй и т.д.). Этот класс включает: - производство мясных блюд или блюд из домашней птицы - производство рыбных блюд, включая жареную рыбу с картофелем - производство блюд из овощей - производство замороженной пиццы или пиццы, подготовленной для хранения иными способами Этот класс также включает: - производство блюд местной и национальной кухни Этот класс исключает: - производство свежих продуктов питания или продуктов питания менее чем с двумя компонентами, см. соответствующий класс в разделе 10 - производство скоропортящихся готовых продуктов питания, см. 10.89 - розничную торговлю готовой пищей и блюдами в магазинах, см. 47.11, 47.29 - оптовую торговлю готовой пищей и блюдами, см. 46.38 - деятельность по распространению продуктов питания на контрактной основе, см. 56.29 @ru
scope note: Bu sınıf aşağıdakileri kapsamaktadır; - kakao, kakao yağı, kakao katı ve sıvı yağı imalatı, - çikolata ve çikolatalı şekerlemelerin imalatı, - şekerleme, lokum, pişmaniye ve tahin helvası imalatı: karameller, pastiller, koz helvalar, fondanlar, beyaz çikolatalar, - çiklet imalatı, - sert kabuklu yemişler, meyve kabuğu ve diğer bitki parçalarının şekerlemeleri, - şekerlemelerin ve şeker pastillerinin imalatı. Kapsam dışı olanlar; - sakaroz şekeri imalatı, bkz. 10.81. @tr
preferred label: Производство на какао, шоколадови и захарни изделия @bg
preferred label: Výroba kakaa, čokolády a cukrovinek @cs
preferred label: Fremstilling af kakao, chokolade og sukkervarer @da
preferred label: Herstellung von Süßwaren (ohne Dauerbackwaren) @de
preferred label: Παραγωγή κακάου, σοκολάτας και ζαχαρωτών @el
preferred label: Fabricación de cacao, chocolate y productos de confitería @es
preferred label: Kakao, šokolaadi ja suhkrukondiitritoodete tootmine @et
preferred label: Kaakaon, suklaan ja makeisten valmistus @fi
preferred label: Fabrication de cacao, chocolat et de produits de confiserie @fr
preferred label: Édesség gyártása
preferred label: Produzione di cacao, cioccolato, caramelle e confetterie @it
preferred label: Kakavos, šokolado ir cukraus saldumynų gamyba @lt
preferred label: Kakao, šokolādes, konfekšu un citu cukuroto konditorejas izstrādājumu ražošana @lv
preferred label: Manifattura ta' ħelu tal-kawkaw, ċikkulata u zokkor @mt
preferred label: Vervaardiging van cacao, chocolade en suikerwerk @nl
preferred label: Produksjon av kakao, sjokolade og sukkervarer @no
preferred label: Produkcja kakao, czekolady i wyrobów cukierniczych @pl
preferred label: Indústria do cacau, do chocolate e dos produtos de confeitaria @pt
preferred label: Fabricarea produselor din cacao, a ciocolatei şi a produselor zaharoase @ro
preferred label: Производство какао, шоколада и сахаристых кондитерских изделий @ru
preferred label: Výroba kakaa, čokolády a cukroviniek @sk
preferred label: Proizvodnja kakava, čokolade in sladkornih izdelkov @sl
preferred label: Tillverkning av choklad, choklad- och sockerkonfektyrer @sv
preferred label: Kakao, çikolata ve şekerleme imalatı @tr
broader: Manufacture of other food products

Processing of tea and coffee
type: Concept
notation: 10.83
status: valid
status modified: 2013-10-18
accepted date: 2013-10-18
in scheme: Statistical Classification of Economic Activities in the European Community, Rev. 2 (2008)
scope note: - извличане на кофеин и изпичане на кафе - производство на продукти от кафе: • смляно кафе • разтворимо кафе • екстракти и концентрати от кафе - производство на заместители на кафе - смесване на чай и мате - производство на екстракти от чай или мате и продукти, приготвени на базата на тези екстракти - производство на билков чай (мента, върбинка, лайка и други) - производство на инулин - 10.62 - производство на спиртни напитки, пиво, вина и безалкохолни напитки - раздел 11 - подготовка на растителни продукти за използване във фармацията - 21.10 @bg
scope note: Z: - dekofeinizaci a pražení kávy - výrobu kávových produktů: • mleté kávy • rozpustné kávy • kávových extraktů a koncentrátů - výrobu kávových náhražek - výrobu směsí čaje a maté - výrobu výtažků a přípravků z čaje a maté - balení čaje, včetně balení do čajových sáčků ZT: - výrobu bylinných čajů (z máty peprné, sporýše lékařského, heřmánku atd.) N: - výrobu inulinu (10.62) - výrobu destilátů, piva, vína a nealkoholických nápojů (oddíl 11) - úpravu rostlinných produktů pro farmaceutické využití (21.20) @cs
scope note: Diese Klasse umfasst: - Entkoffeinieren und Rösten von Kaffee - Herstellung von Kaffeeprodukten: • gemahlener Kaffee • löslicher Kaffee • Kaffee-Extrakt und -Konzentrat - Herstellung von Kaffee-Ersatz - Herstellung von Tee und Mate - Herstellung von Auszügen und Zubereitungen aus Tee oder Mate - Verpackung von Tee, auch in Teebeuteln Diese Klasse umfasst ferner: - Herstellung von Kräutertee (Pfefferminze, Eisenkraut, Kamille usw.) Diese Klasse umfasst nicht: - Herstellung von Inulin (s. 10.62) - Herstellung von Branntwein, Bier, Wein und nichtalkoholischen Getränken (s. Abteilung 11) - Aufbereitung von botanischen Erzeugnissen für die pharmazeutische Nutzung (s. 21.20) @de
scope note: This class includes: - decaffeinating and roasting of coffee - production of coffee products: • ground coffee • soluble coffee • extracts and concentrates of coffee - manufacture of coffee substitutes - blending of tea and maté - manufacture of extracts and preparations based on tea or maté - packing of tea including packing in tea-bags This class also includes: - manufacture of herb infusions (mint, vervain, chamomile etc.) This class excludes: - manufacture of inulin, see 10.62 - manufacture of spirits, beer, wine and soft drinks, see division 11 - preparation of botanical products for pharmaceutical use, see 21.20 @en
scope note: Esta clase comprende: - el descafeinado y el tostado de café; - la producción de productos de café: • café molido; • café soluble; • extractos y concentrados de café; - la elaboración de sucedáneos de café; - la mezcla de té y de hierba mate; - la fabricación de extractos y preparados a base de té o hierba mate. Esta clase comprende también: - la elaboración de infusiones (menta, verbena, manzanilla, etc.). Esta clase no comprende: - la elaboración de inulina (véase 10.62); - la fabricación de licores, cerveza, vino y bebidas no alcohólicas (véase la división 11); - la preparación de productos botánicos para uso farmacéutico (véase 21.20). @es
scope note: Cette classe comprend: - la décaféination et la torréfaction du café - la fabrication de produits à base de café: • café moulu • café soluble • extraits et concentrés de café - la fabrication de succédanés du café - le mélange du thé et du maté - la fabrication d’extraits et de préparations à base de thé ou de maté - le conditionnement du thé, y compris en sachets Cette classe comprend également: - la fabrication de tisanes à base de plantes (menthe, verveine, camomille, etc.) Cette classe ne comprend pas: - la production d’inuline, voir 10.62 - la production de spiritueux, de bières, de vins et de boissons rafraîchissantes, voir division 11 - la préparation de produits botaniques à usage pharmaceutique, voir 21.20 @fr
scope note: Ovaj razred uključuje: - dekofeiniranje i prženje kave - proizvodnju proizvoda od kave: • mljevene kave • topive kave • ekstrakata i koncentrata kave - proizvodnju nadomjestaka kave - proizvodnju mješavina čaja i matea - proizvodnju ekstrakata i preparata na bazi čaja ili matea Ovaj razred također uključuje: - proizvodnju biljnih otopina (metvice, sporiša, kamilice itd.) Ovaj razred isključuje: - proizvodnju inulina, vidi 10.62 - proizvodnju alkoholnih pića, piva, vina i osvježavajućih napitaka, vidi odjeljak 11 - pripremu biljnih proizvoda za farmaceutske preparate, vidi 21.20
scope note: Į šią klasę įeina: - kofeino pašalinimas ir kavos skrudinimas - kavos produktų gamyba: • maltos kavos • tirpiosios kavos • kavos ekstraktų ir koncentratų - kavos pakaitalų gamyba - arbatos ir matės mišinių gamyba - arbatos ir matės ekstraktų ir preparatų gamyba Į šią klasę taip pat įeina: - žolių (mėtų, verbenų, ramunėlių ir kt.) užpilų gamyba Į šią klasę neįeina: - inulino gamyba, žr. 10.62 - spirito, alaus, vyno ir nealkoholinių gėrimų gamyba, žr. 11 skyrių - farmacijos tikslams naudojamų botanikos produktų paruošimas, žr. 21.20 @lt
scope note: Этот класс включает: - производство продуктов питания, используемых для специальных диет: • детских смесей • дополнительных молочных и прочих продуктов питания • продуктов питания для детей младшего возраста • низкокалорийных продуктов и продуктов с пониженной калорийностью, предназначенных для контроля веса • диетических продуктов питания специального медицинского назначения • продуктов питания с пониженным содержанием натрия или без натриевой соли, включая диетические соли • продуктов питания без глютена • продуктов питания для лиц, выполняющих тяжелую физическую работу, особенно для спортсменов • продуктов питания для людей, страдающих обмена веществ (диабетом) @ru
scope note: Bu sınıf aşağıdakileri kapsamaktadır; - kafeinsiz ve kavrulmuş kahve-kahve ürünleri imalatı, - kahve ürünleri imalatı; • çekilmiş kahve, • eritilebilir kahve, • kahve konsantresi ve esansı, - kahve yerine geçen ürünlerin imalatı, - çay ve Paraguay çayının karıştırılması, - çay ve Paraguay çayına dayanan özlerin ve ilaçların imalatı. Ayrıca bu sınıf aşağıdakileri de kapsamaktadır; - diğer bitkisel çayların imalatı (nane, yaban otu, papatya vb.). Kapsam dışı olanlar; - inülin imalatı, bkz. 10.62, - alkollü içki, bira, şarap ve alkolsüz meşrubat imalatı, bkz. bölüm 11, - (eczacılıkla ilgili) kullanım için bitkilerden sağlanan ürünlerin hazırlanması, bkz. 21.20. @tr
preferred label: Преработка на кафе и чай @bg
preferred label: Zpracování čaje a kávy @cs
preferred label: Forarbejdning af te og kaffe @da
preferred label: Verarbeitung von Kaffee und Tee, Herstellung von Kaffee-Ersatz @de
preferred label: Επεξεργασία τσαγιού και καφέ @el
preferred label: Elaboración de café, té e infusiones @es
preferred label: Tee ja kohvi töötlemine @et
preferred label: Teen ja kahvin valmistus @fi
preferred label: Transformation du thé et du café @fr
preferred label: Tea, kávé feldolgozása
preferred label: Lavorazione del tè e del caffè @it
preferred label: Arbatos ir kavos apdorojimas ir perdirbimas @lt
preferred label: Tējas un kafijas pārstrāde @lv
preferred label: Ipproċessar ta' te u kafè @mt
preferred label: Verwerking van thee en koffie @nl
preferred label: Bearbeiding av te og kaffe @no
preferred label: Przetwórstwo herbaty i kawy @pl
preferred label: Indústria do café e do chá @pt
preferred label: Prelucrarea ceaiului şi cafelei @ro
preferred label: Переработка чая и кофе @ru
preferred label: Spracovanie čaju a kávy @sk
preferred label: Predelava čaja in kave @sl
preferred label: Framställning av te och kaffe @sv
preferred label: Kahve ve çayın işlenmesi @tr
broader: Manufacture of other food products

Manufacture of condiments and seasonings
type: Concept
notation: 10.84
status: valid
status modified: 2013-10-18
accepted date: 2013-10-18
in scheme: Statistical Classification of Economic Activities in the European Community, Rev. 2 (2008)
scope note: - производство на подправки, сосове и овкусители: • майонеза • синапено брашно • горчица, други готови сосове и препарати за тях, комбинирани подправки - производство на оцет - преработка на сол за хранителни цели, например йодиране на сол - отглеждане на растения за подправки - 01.28 @bg
scope note: Z: - výrobu koření, omáček, přísad do pokrmů: • majonézy • hořčičné moučky • hořčice atd. - výrobu octa ZT: - zpracování soli na jedlou sůl, např. jodizovanou sůl N: - pěstování rostlin pro výrobu koření (01.28) @cs
scope note: Diese Klasse umfasst: - Herstellung von Gewürzen, Saucen und Würzmitteln: • Mayonnaise • Senfmehl • Fertigsenf usw. - Herstellung von Essig Diese Klasse umfasst ferner: - Verarbeitung von Salz zu Speisesalz, z. B. iodiertem Salz Diese Klasse umfasst nicht: - Anbau von Gewürzpflanzen (s. 01.28) @de
scope note: This class includes: - manufacture of spices, sauces and condiments: • mayonnaise • mustard flour and meal • prepared mustard etc. - manufacture of vinegar This class also includes: - processing of salt into food-grade salt, e.g. iodised salt This class excludes: - growing of spice crops, see 01.28 @en
scope note: Esta clase comprende: - la elaboración de especias, salsas y condimentos: • mayonesa; • harina de mostaza; • mostaza preparada, etc.; - la fabricación de vinagre. Esta clase comprende también: - la preparación de la sal para su consumo, por ejemplo, sal yodada. Esta clase no comprende: - el cultivo de especias (véase 01.28). @es
scope note: Cette classe comprend: - la fabrication d’épices, de sauces et de condiments: • mayonnaise • farine de moutarde • moutarde préparée, etc. - la fabrication du vinaigre Cette classe comprend également: - la transformation du sel pour le rendre propre à la consommation humaine, par exemple: en sel iodé Cette classe ne comprend pas: - la culture des épices, voir 01.28 @fr
scope note: Ovaj razred uključuje: - proizvodnju začina, umaka i dodataka jelima: • majoneze • gorušice (brašna i prekrupe) • gorušice (pripremljene) itd. - proizvodnju octa Ovaj razred također uključuje: - preradu soli u sol koja se upotrebljava u prehrani, npr. jodiranu sol Ovaj razred isključuje: - uzgoj začinskih usjeva, vidi 01.28
scope note: Į šią klasę įeina: - prieskonių, padažų ir užgardų gamyba: • majonezo • garstyčių miltų ir rupinių • paruoštų garstyčių ir kt. - acto gamyba Į šią klasę taip pat įeina: - druskos perdirbimas į valgomąją druską, pvz., joduotąją druską Į šią klasę neįeina: - prieskoninių augalų auginimas, žr. 01.28 @lt
scope note: Этот класс включает: - производство супов и бульонов - производство искусственного меда и карамели - производство скоропортящихся готовых продуктов питания, таких как: • сандвичи • свежая пицца (полуфабрикат) - производство активных биологических добавок и прочих продуктов питания, не включенных в другие категории Этот класс также включает: - производство дрожжей - производство экстрактов из мяса, рыбы, ракообразных или моллюсков - производство заменителей молока и сыра не животного происхождения - производство яичных продуктов, яичного альбумина - производство искусственных концентратов Этот класс исключает: - производство скоропортящихся готовых продуктов питания из фруктов и овощей, см. 10.39 - производство замороженной пиццы, см. 10.85 - производство спирта, пива, вина и безалкогольных напитков, см. раздел 11 @ru
scope note: Bu sınıf aşağıdakileri kapsamaktadır; - baharat, sos ve çeşni imalatı; • mayonez, • hardal unu ve tozu, • hazır hardal vb., - sirke imalatı. Ayrıca bu sınıf şunları da kapsamaktadır; - yemek seviyesindeki tuz için tuz işlenmesi, örn. iyotlu tuz. Kapsam dışı olanlar; - baharat ürünlerinin yetiştirilmesi, bkz. 01.28. @tr
preferred label: Производство на хранителни подправки и овкусители @bg
preferred label: Výroba koření a aromatických výtažků @cs
preferred label: Fremstilling af smagspræparater og krydderier @da
preferred label: Herstellung von Würzmitteln und Soßen @de
preferred label: Παραγωγή αρτυμάτων και καρυκευμάτων @el
preferred label: Elaboración de especias, salsas y condimentos @es
preferred label: Maitseainete ja -kastmete tootmine @et
preferred label: Mausteiden ja maustekastikkeiden valmistus @fi
preferred label: Fabrication de condiments et assaisonnements @fr
preferred label: Fűszer, ételízesítő gyártása
preferred label: Produzione di condimenti e spezie @it
preferred label: Užgardų ir pagardų gamyba @lt
preferred label: Garšvielu un piedevu ražošana @lv
preferred label: Manifattura ta' kondimenti u ħwawar @mt
preferred label: Vervaardiging van specerijen, sauzen en kruiderijen @nl
preferred label: Produksjon av smakstilsettingsstoffer og krydderier @no
preferred label: Produkcja przypraw @pl
preferred label: Fabricação de condimentos e temperos @pt
preferred label: Fabricarea condimentelor şi ingredientelor @ro
preferred label: Производство пряностей и приправ @ru
preferred label: Výroba korenín a chuťových prísad @sk
preferred label: Proizvodnja začimb, dišav in drugih dodatkov @sl
preferred label: Tillverkning av senap, ketchup, kryddor och andra smaksättningsmedel @sv
preferred label: Baharat, sos, sirke ve diğer çeşni maddelerinin imalatı @tr
broader: Manufacture of other food products

Manufacture of prepared meals and dishes
type: Concept
notation: 10.85
status: valid
status modified: 2013-10-18
accepted date: 2013-10-18
in scheme: Statistical Classification of Economic Activities in the European Community, Rev. 2 (2008)
scope note: Производството на готови ястия, съдържащи най-малко две отделни съставни части (с изключение на подправки/сосове) е включено в този клас. Те са сготвени, замразени, консервирани или обработени с цел тяхното дълготрайно съхранение, като обикновено са пакетирани и етикетирани за продажба. В този клас не се включва приготвянето на готови ястия за непосредствена консумация, например в ресторанти. - производство на готови месни ястия - производство на готови рибни ястия, вкл. риба с пържени картофи - производство на готови зеленчукови ястия - производство на замразени или по друг начин консервирани пици - производство на местни и национални специалитети, съставени най-малко от два продукта - производството на пресни храни или храни с по-малко от две съставки - съответния клас от раздел 10 - производство на бързоразвалящи се готови храни - 10.89 - търговия на дребно в магазини с готови ястия - 47.11, 47.29 - търговия на едро с готови ястия - 46.38 - дейности по приготвяне и доставяне на храна по договор - 56.29 @bg
scope note: Tato třída zahrnuje výrobu hotových (tzn. připravených, ochucených a uvařených) pokrmů. Tyto pokrmy zpracovány tak, aby byla zajištěna jejich trvanlivost, (např. zmrazením nebo sterilizací) a jsou zabaleny a označeny pro další prodej. Tato třída nezahrnuje úpravu pokrmů pro okamžitou spotřebu. Za pokrm se zde považuje výrobek, který obsahuje nejméně dvě odlišné přísady (kromě koření apod.). Z: - výrobu pokrmů z masa (vč. drůbežího) - výrobu pokrmů z ryb, vč. ryb se smaženými hranolky - výrobu zeleninových pokrmů - výrobu zmrazené nebo jiným způsobem uchované trvanlivé pizzy ZT: - výrobu pokrmů regionální nebo národní kuchyně N: - výrobu čerstvých potravin nebo potravin obsahujících méně než dvě přísady (příslušná třída v oddílu 10) - výrobu rychle se kazících hotových potravin (10.89) - maloobchod s hotovými pokrmy v prodejnách (47.11, 47.29) - velkoobchod s hotovými pokrmy (46.38) - poskytování stravování v závodních jídelnách, kantýnách apod. (56.29) @cs
scope note: Diese Klasse umfasst die Herstellung von fertigen (d. h. zubereiteten, gewürzten und gegarten) Gerichten. Diese Gerichte werden durch die Verarbeitung haltbar gemacht, etwa durch Tiefkühlen oder Verpacken in Konservendosen. Diese Gerichte sind für den Wiederverkauf verpackt und gekennzeichnet, d. h., dass diese Klasse die Zubereitung von Gerichten zum sofortigen Verzehr nicht umfasst. Um als Gericht zu gelten, müssen diese Zubereitungen aus mindestens zwei Zutaten (außer Gewürzen usw.) bestehen. Diese Klasse umfasst: - Herstellung von Fleischfertiggerichten (einschließlich Geflügel) - Herstellung von Fischfertiggerichten, einschließlich Fisch mit Pommes frites - Herstellung von Gemüsefertiggerichten - Herstellung von gefrorener oder auf andere Weise haltbar gemachter Pizza Diese Klasse umfasst ferner: - Herstellung von Gerichten einer regionalen oder nationalen Küche Diese Klasse umfasst nicht: - Herstellung von frischen Nahrungsmitteln oder solchen mit weniger als zwei Zutaten: siehe die entsprechende Klasse in Abteilung 10 - Herstellung von nicht haltbaren zubereiteten Nahrungsmitteln (s. 10.89) - Einzelhandel mit Fertiggerichten in Verkaufsräumen (s. 47.11, 47.29) - Großhandel mit Fertiggerichten (s. 46.38) - Tätigkeiten von Caterern und Kantinen (s. 56.29) @de
scope note: This class includes the manufacture of ready-made (i.e. prepared, seasoned and cooked) meals and dishes. These dishes are processed to preserve them, such as in frozen or canned form, and are usually packaged and labelled for re-sale, i.e. this class does not include the preparation of meals for immediate consumption, such as in restaurants. To be considered a dish, these foods have to contain at least two distinct ingredients (except seasonings etc.). This class includes: - manufacture of meat or poultry dishes - manufacture of fish dishes, including fish and chips - manufacture of vegetable dishes - manufacture of frozen or otherwise preserved pizza This class also includes: - manufacture of local and national dishes This class excludes: - manufacture of fresh foods or foods with less than two ingredients, see corresponding class in division 10 - manufacture of perishable prepared foods, see 10.89 - retail sale of prepared meals and dishes in stores, see 47.11, 47.29 - wholesale of prepared meals and dishes, see 46.38 - activities of food service contractors, see 56.29 @en
scope note: Esta clase comprende la fabricación de comidas y platos listos para su consumo (es decir, preparados, condimentados y cocinados). Estos platos están procesados para su conservación, por ejemplo congelados o enlatados, y suelen envasarse y etiquetarse para su reventa, es decir, esta clase no comprende la preparación de comidas para su consumo inmediato, por ejemplo en restaurantes. Para ser considerado un plato estas comidas deben contener al menos dos ingredientes (aparte de los condimentos, etc.). Esta clase comprende: - la elaboración de platos de carne; - la elaboración de platos a base de pescado; - la elaboración de platos a base de hortalizas; - la elaboración de pizzas congeladas o conservadas por cualquier otro método Esta clase comprende también: - la elaboración de platos y comidas locales y nacionales Esta clase no comprende: - la elaboración de alimentos frescos o comidas con menos de dos ingredientes (véase la clase correspondiente de la división 10) - la elaboración de comidas preparadas perecederas (véase 10.89) - la venta al por menor de comidas y platos preparados en establecimientos (véanse 47.11, 47.29); - la venta al por mayor de comidas y platos preparados (véase 46.38); - las actividades de catering (véase 56.29). @es
scope note: Cette classe comprend la production de repas et de plats préparés (c’est-à-dire préparés, assaisonnés et cuits). Ces plats sont élaborés dans un but de conservation, par congélation ou mise en conserve, et sont habituellement emballés et étiquetés pour la revente. Cette classe ne comprend donc pas la préparation de plats pour consommation immédiate, comme dans les restaurants. Ces plats sont élaborés à partir d’au moins deux produits distincts (à l’exception de l’assaisonnement, etc.). Cette classe comprend: - la fabrication de plats préparés à base de viande ou de volaille - la fabrication de plats à base de poisson, y compris les plats de poissons et frites - la production de plats à base de légumes - la fabrication de pizzas surgelées ou conservées d’une autre manière Cette classe comprend également: - la fabrication de plats locaux et nationaux Cette classe ne comprend pas: - la production d’aliments frais ou composés de moins de deux ingrédients, voir la classe correspondante dans la division 10 - la préparation d’aliments préparés périssables, voir 10.89 - le commerce de détail de plats et repas préparés dans des magasins, voir 47.11 et 47.29 - le commerce de gros de plats et de repas préparés, voir 46.38 - les activités des entreprises fournissant des repas, voir 56.29 @fr
scope note: Ovaj razred uključuje proizvodnju gotove (tj. pripremljene, začinjene i kuhane) hrane i jela. Ta su jela obrađena kako bi se očuvala, odnosno u zamrznutom ili konzerviranom obliku, a obično su pakirana i pripremljena za daljnju prodaju. Ovaj razred ne uključuje pripremu jela za neposrednu potrošnju na licu mjesta, kao što je u restoranima. Da bi se hrana smatrala jelom mora sadržavati najmanje dva različita sastojka (osim sezonskih proizvoda itd.). Ovaj razred uključuje: - proizvodnju mesnih jela ili jela od peradi - proizvodnju jela od ribe, uključujući "fish and chips" - proizvodnju jela od povrća - proizvodnju zamrznutih ili na drugi način konzerviranih pizza Ovaj razred također uključuje: - proizvodnju domaćih i nacionalnih jela Ovaj razred isključuje: - proizvodnju svježe hrane ili jela s manje od dva sastojka, vidi odgovarajući razred u odjeljku 10 - proizvodnju lako pokvarljivih gotovih jela, vidi 10.89 - trgovinu na veliko gotovim jelima, vidi 46.38 - trgovinu na malo gotovim jelima u dućanima, vidi 47.11, 47.29 - ugovarače usluga hrane za prijevozna poduzeća, vidi 56.29
scope note: Į šią klasę įeina gatavų (t.y. paruoštų, pagardintų ir termiškai apdorotų) maisto ir patiekalų gamyba. Šie patiekalai, siekiant juos išsaugoti, yra apdoroti, pvz., sušaldyti, konservuoti, ir, kaip įprasta, paruošti parduoti juos įpakuojant ir paženklinant, t.y. į šią klasę neįeina skirto nedelsiant suvartoti maisto paruošimas, koks yra restorane. Patiekalu laikomas toks maistas, kuris pagamintas mažiausiai iš dviejų skirtingų produktų (išskyrus prieskonius ir kt.). Į šią klasę įeina: - mėsos ir paukštienos patiekalų gamyba - žuvies patiekalų, įskaitant žuvį ir keptas bulves, gamyba - daržovių patiekalų gamyba - sušaldytų ar kitaip konservuotų picų gamyba Į šią klasę taip pat įeina: - vietinių arba nacionalinių patiekalų gamyba Į šią klasę neįeina: - šviežio maisto ar maisto susidedančio iš mažiau nei dviejų produktų gamyba, žr. 10 skyriaus atitinkamą klasę - gatavo greitai gendančio maisto gamyba, žr. 10.89 - gatavo maisto ir patiekalų mažmeninė prekyba parduotuvėse, žr. 47.11, 47.29 - gatavo maisto ir patiekalų didmeninė prekyba, žr. 46.38 - maitinimo paslaugų tiekėjų veikla, žr. 56.29 @lt
scope note: Bu grup, hazır yapım (yani hazır, baharatlı ve pişirilmiş) yemeklerin ve yiyeceklerin imalatını kapsamaktadır. Bu yiyecekler, bozulmadan korunmaları için dondurma ya da konserveleme benzeri işlemlere tabi tutulur ve yeniden satış için genellikle paketlenir ve damgalanırlar, yani, bu sınıf restoranlardaki gibi, yiyeceklerin anında tüketim amacıyla hazırlanmasını kapsamaz. Yemek olarak adlandırılmaları için bu gıdaların en az iki farklı yiyecek malzemesinden oluşmaları gerekir (baharatlar vb. hariç). Bu sınıf aşağıdakileri kapsamaktadır; - et veya kümes hayvanları etinden yemek imalatı, - balık yemekleri imalatı, balık ve patates cipsi dahil, - sebze yemekleri imalatı, - dondurulmuş veya başka türlü korunmuş pizza imalatı. Ayrıca bu sınıf aşağıdakileri de kapsamaktadır; - yerel ve ulusal hazır yemeklerin imalatı. Kapsam dışı olanlar; - taze gıdalar veya ikiden daha az malzemeden oluşan gıdalar, bkz. bölüm 10`daki ilgili sınıf - kolay bozulabilen hazır gıdaların imalatı, bkz. 10.89, - hazır yemeklerin ve yiyeceklerin dükkanlarda perakende satışı, bkz. 47.11`e ve 47.29, - hazır yemeklerin ve yiyeceklerin toptan ticareti, bkz. 46.38, - yiyecek hizmet yüklenicilerinin faaliyetleri, bkz. 56.29. @tr
preferred label: Производство на готови ястия @bg
preferred label: Výroba hotových pokrmů @cs
preferred label: Fremstilling af færdigretter @da
preferred label: Herstellung von Fertiggerichten @de
preferred label: Παραγωγή έτοιμων γευμάτων και φαγητών @el
preferred label: Elaboración de platos y comidas preparados @es
preferred label: Valmistoitude tootmine @et
preferred label: Einesten ja valmisruokien valmistus @fi
preferred label: Fabrication de plats préparés @fr
preferred label: Készétel gyártása
preferred label: Produzione di pasti e piatti preparati @it
preferred label: Paruoštų rupinių ir valgių gamyba @lt
preferred label: Gatavu ēdienu ražošana @lv
preferred label: Manifattura ta' ikliet u platti lesti @mt
preferred label: Vervaardiging van bereide maaltijden en schotels @nl
preferred label: Produksjon av ferdigmat @no
preferred label: Wytwarzanie gotowych posiłków i dań @pl
preferred label: Fabricação de refeições e pratos pré-cozinhados @pt
preferred label: Fabricarea de mâncărururi preparate @ro
preferred label: Производство готовых пищевых продуктов @ru
preferred label: Výroba pripravených pokrmov a jedla @sk
preferred label: Proizvodnja pripravljenih jedi in obrokov @sl
preferred label: Tillverkning av lagad mat och färdigrätter @sv
preferred label: Hazır yemeklerin ve yiyeceklerin imalatı @tr
broader: Manufacture of other food products

Manufacture of homogenised food preparations and dietetic food
type: Concept
notation: 10.86
status: valid
status modified: 2013-10-18
accepted date: 2013-10-18
in scheme: Statistical Classification of Economic Activities in the European Community, Rev. 2 (2008)
scope note: - производство на храни със специално предназначение: • храни за кърмачета • детски хомогенизирани храни на млечна, месна и друга основа • бебешки храни • храни, предназначени за нискоенергийни диети за намаляване на телесното тегло • диетични храни за специални медицински цели • храни с намалено съдържание на натрий, вкл. диетична сол с намалено съдържание или несъдържаща натрий • безглутенови храни • храни, предназначени за употреба при интензивно мускулно натоварване, особено при спортисти • храни за диабетици @bg
scope note: Z: - výrobu potravin pro speciální výživu: • kojeneckých a dětských výživ (vč. mléčných) • ostatních potravin pro kojence a malé děti • potravin s nízkým nebo sníženým obsahem energie určených ke snižování tělesné hmotnosti • dietních potravin pro speciální léčebné účely (bilancovaných diet) • potravin s nízkým obsahem sodíku, vč. dietních solí s nízkým nebo žádným obsahem sodíku • bezlepkových potravin • potravin určených k posílení organismu při zvýšené svalové námaze, zejména pro sportovce • potravin pro osoby s poruchami metabolismu sacharidů (diabetiky) @cs
scope note: Diese Klasse umfasst: - Herstellung von für eine besondere Ernährung bestimmten Lebensmitteln: • Säuglingsanfangsnahrung • Folgenahrung und sonstige Lebensmittel für Säuglinge und Kleinkinder • Lebensmittel mit niedrigem oder vermindertem Brennwert, zur Gewichtskontrolle • diätetische Lebensmittel für besondere medizinische Zwecke (bilanzierte Diäten) • natriumarme Lebensmittel einschließlich natriumarmer oder natriumfreier Diätsalze • glutenfreie Lebensmittel • Lebensmittel für intensive Muskelanstrengungen, vor allem für Sportler • Lebensmittel für Personen, die unter einer Störung des Glucosestoffwechsels leiden @de
scope note: This class includes: - manufacture of foods for particular nutritional uses: • infant formulae • follow-up milk and other follow-up foods • baby foods • low-energy and energy-reduced foods intended for weight control • dietary foods for special medical purposes • low-sodium foods, including low-sodium or sodium-free dietary salts • gluten-free foods • foods intended to meet the expenditure of intense muscular effort, especially for sportsmen • foods for persons suffering from carbohydrate metabolism disorders (diabetes) @en
scope note: Esta clase comprende: - la elaboración de alimentos de nutrición especial: • los alimentos preparados infantiles; • la leche y otros alimentos de crecimiento; • los productos de alimentación infantil; • los alimentos de régimen, de poco o reducido valor energético; • los alimentos dietéticos para fines médicos especiales; • los alimentos pobres en sodio, incluidas las sales dietéticas con bajo o nulo contenido de sodio; • los alimentos sin gluten; • los alimentos destinados a combatir el desgaste causado por el esfuerzo muscular intenso, especialmente indicados para deportistas; • los alimentos para personas que padecen desórdenes metabólicos en la asimilación de los hidratos de carbono (diabetes). @es
scope note: Cette classe comprend: - la fabrication de denrées alimentaires destinées à une alimentation particulière: • préparations pour nourrissons • laits de suite et autres aliments du deuxième âge • aliments pour bébés • denrées alimentaires à valeur énergétique faible ou réduite destinées à un contrôle du poids • aliments diététiques destinés à des fins médicales spéciales • aliments pauvres en sodium, y compris les sels diététiques hyposodiques ou asodiques • aliments sans gluten • aliments adaptés à une dépense musculaire intense, surtout pour les sportifs • aliments destinés à des personnes affectées d’un métabolisme glucidique perturbé (diabétiques) @fr
scope note: Ovaj razred uključuje: - proizvodnju hrane za posebnu nutricionističku upotrebu: • pripravaka za dojenčad • dopunskog mlijeka i dopunske hrane • hrane za malu djecu • niskokalorične i ograničeno kalorične hrane za održavanje težine • dijetne hrane za posebne medicinske svrhe • hrane s malim sadržajem natrija, uključujući dijetne soli s malim sadržajem natrija ili bez njega • hrane bez glutena • hrane namijenjene velikoj potrošnji energije, posebno za sportaše • hrane za dijabetičare
scope note: Į šią klasę įeina: - specialios paskirties maisto produktų gamyba: • naujagimių pieno mišinių • pagerinto pieno ir kitų maisto produktų, • vaikų maisto produktų • mažo ir sumažinto kaloringumo maisto produktų kūno svoriui reguliuoti • išskirtiniam gydymui skirtų dietinių maisto produktų • maisto produktų su mažesniu natrio kiekiu, įskaitant sumažinto natrio kiekio arba benatres dietines druskas • maisto produktai be glitimo • maisto, skirto asmenims, dirbantiems fizinį darbą, ypač sportininkams, gamyba • maisto, skirto sergantiems cukralige (diabetikams), gamyba @lt
scope note: Этот класс включает: - производство готовых кормов для животных, содержащихся на фермах, включая концентрированные корма для животных и кормовые добавки - подготовка не смешанных (однокомпонентных) кормов для животных на фермах Этот класс также включает: - переработку отходов со скотобойни для производства кормов для животных Этот класс исключает: - производство рыбной муки для кормления животных, см. 10.20 - производство жмыха из масличных семян, см. 10.41 - получение побочной продукции, пригодной для использования на корм для животных без специальной обработки, например, семена масличных культур (см. 10.41), измельченные остатки зерна (см. 10.61) и т.д. @ru
scope note: Bu sınıf aşağıdakileri kapsamaktadır; - özellikle beslenme amaçlı gıda imalatı; • anne sütü yerine geçen gıdalar, • yardımcı sütlü ve diğer karışımlı gıdalar, • bebek gıdaları, • kilo kontrolü için tasarlanmış düşük-enerjili ve enerjisiz gıdalar, • özel tıbbi amaçlı diyet gıdalar, • düşük sodyum içeren yiyecekler, düşük-sodyum içeren veya hiç sodyum içermeyen diyet tuzlar, • glüten içermeyen gıda maddeleri, • özellikle sporcular için yoğun adale gücü harcanmasını karşılanması planlanan yemekler, • karbonhidrat metabolizma rahatsızlığından şikayetçi (diyabeti olan) kişiler için yemekler. @tr
preferred label: Производство на детски, диетични и други хомогенизирани храни @bg
preferred label: Výroba homogenizovaných potravinářských přípravků a dietních potravin @cs
preferred label: Fremstilling af homogeniserede produkter og diætmad @da
preferred label: Herstellung von homogenisierten und diätetischen Nahrungsmitteln @de
preferred label: Παραγωγή ομογενοποιημένων παρασκευασμάτων διατροφής και διαιτητικών τροφών @el
preferred label: Elaboración de preparados alimenticios homogeneizados y alimentos dietéticos @es
preferred label: Homogeenitud toiduainete ja dieettoitude tootmine @et
preferred label: Homogenoitujen ravintovalmisteiden ja dieettiruokien valmistus @fi
preferred label: Fabrication d'aliments homogénéisés et diététiques @fr
preferred label: Homogenizált, diétás étel gyártása
preferred label: Produzione di preparati omogeneizzati e di alimenti dietetici @it
preferred label: Homogenizuotų ir dietinių maisto produktų gamyba @lt
preferred label: Homogenizēto un diētisko pārtikas produktu ražošana @lv
preferred label: Manifattura ta' preparazzjonijiet ta' l-ikel omoġenizzati u ikel dietetiku @mt
preferred label: Vervaardiging van gehomogeniseerde voedingspreparaten en dieetvoeding @nl
preferred label: Produksjon av homogeniserte matprodukter og diettmat @no
preferred label: Produkcja artykułów spożywczych homogenizowanych i żywności dietetycznej @pl
preferred label: Fabricação de alimentos homogeneizados e dietéticos @pt
preferred label: Fabricarea preparatelor alimentare omogenizate şi alimentelor dietetice @ro
preferred label: Производство детского питания и диетических пищевых продуктов @ru
preferred label: Výroba a príprava homogenizovaných a diétnych potravín @sk
preferred label: Proizvodnja homogeniziranih in dietetičnih živil @sl
preferred label: Tillverkning av homogeniserade livsmedelspreparat inklusive dietmat @sv
preferred label: Hazır, homojenize gıda maddeleri ile diyet yiyecekleri imalatı @tr
broader: Manufacture of other food products

Manufacture of other food products n.e.c.
type: Concept
notation: 10.89
status: valid
status modified: 2013-10-18
accepted date: 2013-10-18
in scheme: Statistical Classification of Economic Activities in the European Community, Rev. 2 (2008)
scope note: - производство на супи и бульони - производство на заместители на мед и карамел - производство на бързоразвалящи се готови храни: • сандвичи • пресни, неизпечени пици - производство на хранителни добавки и други хранителни продукти, некласифицирани другаде - производство на мая - производство на екстракти и сокове от месо, риби, ракообразни или мекотели - производство на заместители на млечни продукти и сирена - производство на яйчни продукти и яйчен албумин - производство на изкуствени концентрати - производство на бързоразвалящи се готови храни от плодове и зеленчуци - 10.39 - производство на замразени пици - 10.85 - производство на спиртни напитки, пиво, вина и безалкохолни напитки - раздел 11 @bg
scope note: Z: - výrobu polévek a vývarů - výrobu umělého medu a karamelu - výrobu rychle se kazících hotových potravin, např.: • obložených chlebů • čerstvé (syrové) pizzy - výrobu potravinových doplňků a jiných potravinářských výrobků j. n. ZT: - výrobu droždí - výrobu výtažků a šťáv z masa, ryb, korýšů a měkkýšů - výrobu náhražek mléka a sýrů ne na bázi sekretů vylučovaných mléčnou žlázou - výrobu vaječných výrobků a vaječného albuminu - výrobu umělých koncentrátů N: - výrobu rychle se kazících potravin z ovoce a zeleniny (10.39) - výrobu mrazené pizzy (10.85) - výrobu destilátů, piva, vína a nealkoholických nápojů (oddíl 11) @cs
scope note: Diese Klasse umfasst: - Herstellung von Suppen und Brühen - Herstellung von Kunsthonig und Karamell - Herstellung von nicht haltbaren zubereiteten Nahrungsmitteln, z. B.: • Sandwiches • frische (nichtgegarte) Pizza - Herstellung von Nahrungsergänzungsmittel und andere Nahrungsmittel a. n. g. Diese Klasse umfasst ferner: - Herstellung von Hefe - Herstellung von Extrakten und Säften aus Fleisch, Fisch, Krebs- und Weichtieren - Herstellung von nicht auf Milchbasis hergestelltem Milch- und Käseersatz - Herstellung von Eierzeugnissen und Eieralbumin - Herstellung von künstlichen Konzentraten Diese Klasse umfasst nicht: - Herstellung nicht haltbarer zubereiteter Nahrungsmittel aus Obst und Gemüse (s. 10.39) - Herstellung von gefrorener Pizza (s. 10.85) - Herstellung von Branntwein, Bier, Wein und nichtalkoholischen Getränken (s. Abteilung 11) @de
scope note: This class includes: - manufacture of soups and broths - manufacture of artificial honey and caramel - manufacture of perishable prepared foods, such as: • sandwiches • fresh (uncooked) pizza - manufacture of food supplements and other food products n.e.c. This class also includes: - manufacture of yeast - manufacture of extracts and juices of meat, fish, crustaceans or molluscs - manufacture of non-dairy milk and cheese substitutes - manufacture of egg products, egg albumin - manufacture of artificial concentrates This class excludes: - manufacture of perishable prepared foods of fruit and vegetables, see 10.39 - manufacture of frozen pizza, see 10.85 - manufacture of spirits, beer, wine and soft drinks, see division 11 @en
scope note: Esta clase comprende: - la elaboración de sopas y caldos - la fabricación de caramelo y miel artificial - la elaboración de productos alimenticios preparados perecederos, como: •sandwiches •pizza fresca (sin hornear) - la elaboración de suplementos alimenticios y otros productos alimenticios n.c.o.p. Esta clase comprende también: - la elaboración de levadura - la fabricación de extractos y jugos de carne, pescados, crustáceos y moluscos - la producción de sucedáneos no lácteos de la leche y el queso - la elaboración de productos a base de huevo y ovoalbúmina - la fabricación de concentrados artificiales Esta clase no comprende: - la fabricación de productos alimenticios preparados perecederos a base de frutas, legumbres y hortalizas (véase 10.39); - la elaboración de pizza congelada (véase 10.85); - la fabricación de bebidas alcohólicas, cerveza, vino y bebidas no alcohólicas (véase la división 11). @es
scope note: Cette classe comprend: - la fabrication de potages ou de bouillons - la fabrication de succédanés du miel et de sucres et mélasses caramélisés - la préparation d’aliments préparés périssables, tels que: • sandwiches • pizzas fraîches (non cuites) - la fabrication de compléments alimentaires et d’autres produits alimentaires n.c.a. Cette classe comprend également: - la fabrication de levures - la fabrication d’extraits et de jus de viandes, de poissons, de crustacés et de mollusques - la fabrication de succédanés du lait ou du fromage - la production d’ovoproduits et d’ovalbumine - la production de concentrés artificiels Cette classe ne comprend pas: - la préparation d’aliments préparés périssables à base de fruits ou de légumes, voir 10.39 - la fabrication de pizzas surgelées, voir 10.85 - la production de spiritueux, de bières, de vins et de boissons rafraîchissantes, voir division 11 @fr
scope note: Ovaj razred uključuje: - proizvodnju juha od povrća i mesa - proizvodnju umjetnog meda i karamela - proizvodnju lako pokvarljivih gotovih jela kao što su: • sendviči • svježa (nepečena) pizza - proizvodnju dodataka hrani i drugih proizvoda hrane, d. n. Ovaj razred također uključuje: - proizvodnju kvasca - proizvodnju ekstrakata i sokova od mesa, riba, rakova ili mekušaca - proizvodnju nadomjestaka mlijeka i sira - proizvodnju proizvoda od jaja, albumina od jaja - proizvodnju umjetnih koncentrata Ovaj razred isključuje: - proizvodnju lako pokvarljive gotove hrane od voća i povrća, vidi 10.39 - proizvodnju smrznutih pizza, vidi 10.85 - proizvodnju alkoholnih pića, pive, vina i osvježavajućih pića, vidi odjeljak 11
scope note: Į šią klasę įeina: - sriubų ir sultinių gamyba - dirbtinio medaus ir karamelės gamyba - gatavo greitai gendančio maisto, tokio kaip: • sumuštiniai • šviežios (nekeptos) picos - maisto papildų ir kitų, niekur kitur nepriskirtų, maisto produktų gamyba Į šią klasę taip pat įeina: - mielių gamyba - mėsos, žuvies, vėžiagyvių ar moliuskų ekstraktų ir sulčių gamyba - negyvūninės kilmės pieno ir sūrio gamyba - kiaušinių produktų, kiaušinio albumino gamyba - dirbtinių koncentratų gamyba Į šią klasę neįeina: - greitai gendančio, paruošto iš vaisių, uogų ir daržovių maisto gamyba, žr. 10.39 - sušaldytos picos gamyba, žr. 10.85 - spirito, alaus, vyno ir nealkoholinių gėrimų gamyba, žr. 11 skyrių @lt
scope note: Этот класс включает: - производство готовых кормов для домашних животных, включая собак, кошек, птиц, рыб и т.д. Этот класс также включает: - переработку отходов со скотобойни для производства кормов для животных Этот класс исключает: - производство рыбной муки для кормления животных, см. 10.20 - производство жмыха из масличных семян, см. 10.41 - получение побочной продукции, пригодной для использования на корм для животных без специальной обработки, например, семена масличных культур (см. 10.41), измельченные остатки зерна (см. 10.61) и т.д. @ru
scope note: Bu sınıf aşağıdakileri kapsamaktadır; - çorbaların ve et/balık suyu imalatı, - suni bal ve karamela imalatı, - kolay bozulabilen hazır gıdaların imalatı, örneğin; • sandviç, • taze (pişmemiş) pizza, - başka yerde sınıflandırılmamış diğer yemek ürünleri imalatı. Ayrıca bu sınıf şunları da kapsamaktadır; - maya imalatı, - et, balık, kabuklu deniz hayvanları veya yumuşakçaların sularının ve özlerin imalatı, - mandıralarda üretilmeyen süt ve peynir yerine kullanılan ürünlerin imalatı, - yumurta ürünlerinin, yumurta albümininin imalatı, - suni konsantrelerin imalatı. Kapsam dışı olanlar; - çabuk bozulan hazır sebze ve meyve yemekleri imalatı, bkz. 10.39, - donmuş pizza imalatı, bkz. 10.85, - meşrubat, bira, şarap, alkolsüz içki imalatı, bkz. bölüm 11. @tr
preferred label: Производство на други хранителни продукти, некласифицирани другаде @bg
preferred label: Výroba ostatních potravinářských výrobků j. n. @cs
preferred label: Fremstilling af andre fødevarer i.a.n. @da
preferred label: Herstellung von sonstigen Nahrungsmitteln a. n. g. @de
preferred label: Παραγωγή άλλων ειδών διατροφής π.δ.κ.α. @el
preferred label: Elaboración de otros productos alimenticios n.c.o.p. @es
preferred label: Mujal liigitamata toiduainete tootmine @et
preferred label: Muualla luokittelematon elintarvikkeiden valmistus @fi
preferred label: Fabrication d'autres produits alimentaires n.c.a. @fr
preferred label: M.n.s.egyéb élelmiszer gyártása
preferred label: Produzione di altri prodotti alimentari n.c.a. @it
preferred label: Kitų, niekur kitur nepriskirtų, maisto produktų gamyba @lt
preferred label: Pārējo citur neklasificētu pārtikas produktu ražošana @lv
preferred label: Manifattura ta' prodotti oħra ta' l-ikel n.e.c. @mt
preferred label: Vervaardiging van andere voedingsmiddelen, n.e.g. @nl
preferred label: Produksjon av næringsmidler ikke nevnt annet sted @no
preferred label: Produkcja pozostałych artykułów spożywczych, gdzie indziej niesklasyfikowana @pl
preferred label: Fabricação de outros produtos alimentares, n.e. @pt
preferred label: Fabricarea altor produse alimentare n.c.a. @ro
preferred label: Производство прочих продуктов питания, не включенных в другие категории @ru
preferred label: Výroba ostatných potravinárskych produktov i. n. @sk
preferred label: Proizvodnja drugih prehrambenih izdelkov, drugje nerazvrščenih @sl
preferred label: Framställning av andra livsmedel @sv
preferred label: Başka yerde sınıflandırılmamış diğer gıda maddelerinin imalatı @tr
broader: Manufacture of other food products

Manufacture of prepared animal feeds
type: Concept
notation: 10.9
status: valid
status modified: 2013-10-18
accepted date: 2013-10-18
in scheme: Statistical Classification of Economic Activities in the European Community, Rev. 2 (2008)
scope note: Данный раздел включает производство безалкогольных напитков и минеральных вод, производство алкогольных напитков, в основном, методом ферментации, пива и вина, а также производство дистиллированных алкогольных напитков. Этот раздел исключает: - производство фруктовых и овощных соков, см. 10.32 - производство напитков на молочной основе, см. 10.51 - производство кофе, чая и мате, см. 10.83 @ru
preferred label: Производство на готови храни за животни @bg
preferred label: Výroba průmyslových krmiv @cs
preferred label: Fremstilling af færdige foderblandinger @da
preferred label: Herstellung von Futtermitteln @de
preferred label: Παραγωγή παρασκευασμένων ζωοτροφών @el
preferred label: Fabricación de productos para la alimentación animal @es
preferred label: Valmis loomasööda tootmine @et
preferred label: Eläinten ruokien valmistus @fi
preferred label: Fabrication d'aliments pour animaux @fr
preferred label: Takarmány gyártása
preferred label: Produzione di prodotti per l'alimentazione degli animali @it
preferred label: Paruoštų pašarų gyvuliams gamyba @lt
preferred label: Dzīvnieku barības ražošana @lv
preferred label: Manifattura ta' għalf għall-annimali lest @mt
preferred label: Vervaardiging van diervoeders @nl
preferred label: Produksjon av fôrvarer @no
preferred label: Produkcja gotowych paszy i karmy dla zwierząt @pl
preferred label: Fabricação de alimentos preparados para animais @pt
preferred label: Fabricarea preparatelor pentru hrana animalelor @ro
preferred label: Производство готовых кормов для животных @ru
preferred label: Výroba a príprava krmív pre zvieratá @sk
preferred label: Proizvodnja krmil in hrane za hišne živali @sl
preferred label: Framställning av beredda djurfoder @sv
preferred label: Hazır hayvan yemleri imalatı @tr
broader: Manufacture of food products
narrower: Manufacture of prepared feeds for farm animals
narrower: Manufacture of prepared pet foods

Manufacture of prepared feeds for farm animals
type: Concept
notation: 10.91
status: valid
status modified: 2013-10-18
accepted date: 2013-10-18
in scheme: Statistical Classification of Economic Activities in the European Community, Rev. 2 (2008)
scope note: - производство на готови храни за селскостопански животни, вкл. концентрати и премикси - производство на несмесени храни за селскостопански животни - обработване на кланични отпадъци за производство на храни за селскостопански животни - производство на рибно брашно за храна за животни - 10.20 - производство на кюспе и други твърди остатъци от маслодайни семена - 10.41 - дейности, при които се получават странични продукти, които без специална обработка се използват за храни за животни, например кюспе и други твърди остатъци при извличането на растителни масла и мазнини (10.41), трици, отсевки и други видове отпадъци, получени при смилане на зърното (10.61) и други @bg
scope note: Z: - výrobu krmných směsí pro užitková zvířata (vč. koncentrovaných krmiv a krmivových doplňků) - výrobu jednodruhových krmiv pro užitková zvířata ZT: - zpracování jatečního odpadu k výrobě krmiva N: - výrobu rybí moučky jako krmiva (10.20) - výrobu pokrutin (10.41) - činnosti, jejichž výsledkem je kromě hlavního produktu vedlejší produkt pro krmení zvířat bez potřeby dalšího speciálního zpracování, např. zbytky z výroby rostlinných olejů (10.41), zbytky z výroby mlýnských výrobků (10.61) @cs
scope note: Diese Klasse umfasst: - Herstellung von Mischfuttermitteln für Nutztiere einschließlich konzentrierten Viehfutters und von Futterzusätzen - Herstellung von Einzelfuttermitteln für Nutztiere Diese Klasse umfasst ferner: - Behandlung von Schlachtabfällen zur Herstellung von Futtermitteln Diese Klasse umfasst nicht: - Herstellung von Fischmehl als Futtermittel (s. 10.20) - Herstellung von Ölkuchen (s. 10.41) - Tätigkeiten, bei denen ohne besondere Behandlung als Futtermittel nutzbare Nebenerzeugnisse anfallen, z. B. Ölkuchen (s. 10.41), Rückstände von Mahl- und Schälmühlen (s. 10.61) @de
scope note: This class includes: - manufacture of prepared feeds for farm animals, including concentrated animal feed and feed supplements - preparation of unmixed (single) feeds for farm animals This class also includes: - treatment of slaughter waste to produce animal feeds This class excludes: - production of fishmeal for animal feed, see 10.20 - production of oilseed cake, see 10.41 - activities resulting in by-products usable as animal feed without special treatment, e.g. oilseeds (see 10.41), grain milling residues (see 10.61) etc. @en
scope note: Esta clase comprende: - la fabricación de productos para la alimentación de animales de granja incluidos los suplementos y concentrados de alimentación para animales; - la preparación de productos sin mezclar para la alimentación de los animales de granja. Esta clase comprende también: - el tratamiento de residuos de mataderos para la producción de productos para la alimentación animal. Esta clase no comprende: - la fabricación de productos a base de pescado para la alimentación animal (véase 10.20); - la fabricación de tortas a partir de semillas oleaginosas (véase 10.41); - las actividades que dan lugar a la obtención de subproductos utilizables para la alimentación animal sin tratamiento especial, como las semillas oleaginosas (véase 10.41), los residuos de la molienda de cereales (véase 10.61), etc. @es
scope note: Cette classe comprend: - la fabrication de produits pour l’alimentation des animaux de ferme, y compris les aliments concentrés pour animaux et les aliments de complément - la préparation de produits non mélangés pour l’alimentation des animaux de ferme Cette classe comprend également: - le traitement de déchets d’abattoir pour produire des aliments pour animaux Cette classe ne comprend pas: - la production de farines de poissons destinées à l’alimentation des animaux, voir 10.20 - la production de tourteaux oléagineux, voir 10.41 - les activités produisant des sous-produits pouvant être utilisés comme aliments pour animaux sans subir de traitement particulier, comme les oléagineux (voir 10.41), les résidus de la minoterie (voir 10.61) @fr
scope note: Ovaj razred uključuje: - proizvodnju gotove hrane za životinje, uključujući koncentrate i dodatke hrane za životinje - pripremanje nemiješane hrane za životinje Ovaj razred također uključuje: - obradu otpada iz klaonica za proizvodnju hrane za životinje Ovaj razred isključuje: - proizvodnju riblje hrane za hranjenje životinja, vidi 10.20 - proizvodnju pogača od uljanih sjemenki, vidi 10.41 - djelatnosti koje rezultiraju nusproizvodima koji se bez posebne obrade mogu upotrebljavati kao hrana za životinje, npr. pogača od uljanih sjemenki (vidi 10.41), ostaci mljevenih žitarica (vidi 10.61) itd.
scope note: Į šią klasę įeina: - paruoštų pašarų, įskaitant pašarų koncentratus ir pašarinius priedus, ūkio gyvuliams gamyba - vienarūšių (be priemaišų) pašarų ūkio gyvuliams paruošimas Į šią klasę taip pat įeina: - skerdyklų atliekų perdirbimas gyvūnų ėdalui gaminti Į šią klasę neįeina: - žuvų miltų pašarams gamyba, žr. 10.20 - aliejingųjų sėklų išspaudų gamyba, žr. 10.41 - veikla, kurios rezultate gaunami šalutiniai produktai be pecialaus apdorojimo tinkantys gyvūnų pašarui, pvz., aliejingųjų sėklų išspaudos (žr. 10.41), grūdų malimo liekanos (žr. 10. 61) ir kt. @lt
scope note: Bu sınıf aşağıdakileri kapsamaktadır; - çiftlik hayvanları için hazır yem imalatı; hayvan yemleri konsantre hayvan yemleri dahil, - çiftlik hayvanları için karma olmayan (tekil) yem imalatı. Ayrıca bu sınıf aşağıdakileri de kapsamaktadır; - çiftlik hayvanları yemi için kesilmiş hayvanlardan çıkan artıkların işlenmesi. Kapsam dışı olanlar; - hayvan yemi olarak kullanılmak üzere balık unu imalatı, bkz. 10.20, - yağ tohumundan küspe imalatı, bkz. 10.41, - özel bir işlem yapılmaksızın hayvan yemi olarak kullanabilen yan ürünler ile sonuçlanan faaliyetler, örn. yağ tohumları (bkz. 10.41), hububatların öğütülmesi sonucu oluşan tortular (bkz. 10.61) vb.. @tr
preferred label: Производство на готови храни (фуражи) за селскостопански животни @bg
preferred label: Výroba průmyslových krmiv pro hospodářská zvířata @cs
preferred label: Fremstilling af færdige foderblandinger til landbrugsdyr @da
preferred label: Herstellung von Futtermitteln für Nutztiere @de
preferred label: Παραγωγή παρασκευασμένων ζωοτροφών για ζώα που εκτρέφονται σε αγροκτήματα @el
preferred label: Fabricación de productos para la alimentación de animales de granja @es
preferred label: Valmissööda tootmine loomakasvatusele @et
preferred label: Kotieläinten rehujen valmistus @fi
preferred label: Fabrication d'aliments pour animaux de ferme @fr
preferred label: Haszonállat-eledel gyártása
preferred label: Produzione di mangimi per l'alimentazione degli animali da allevamento @it
preferred label: Paruoštų pašarų ūkio gyvuliams gamyba @lt
preferred label: Lauksaimniecības dzīvnieku barības ražošana @lv
preferred label: Manifattura ta' għalf għal annimali ta' l-irziezet lest @mt
preferred label: Vervaardiging van veevoeders @nl
preferred label: Produksjon av fôrvarer til husdyrhold @no
preferred label: Produkcja gotowej paszy dla zwierząt gospodarskich @pl
preferred label: Fabricação de alimentos para animais de criação @pt
preferred label: Fabricarea preparatelor pentru hrana animalelor de fermă @ro
preferred label: Производство готовых кормов для животных, содержащихся на фермах @ru
preferred label: Výroba a príprava krmív pre hospodárske zvieratá @sk
preferred label: Proizvodnja krmil @sl
preferred label: Framställning av beredda fodermedel @sv
preferred label: Çiftlik hayvanları için hazır yem imalatı @tr
broader: Manufacture of prepared animal feeds

Manufacture of prepared pet foods
type: Concept
notation: 10.92
status: valid
status modified: 2013-10-18
accepted date: 2013-10-18
in scheme: Statistical Classification of Economic Activities in the European Community, Rev. 2 (2008)
scope note: - производство на готови храни за домашни любимци, вкл. кучета, котки, птици, рибки и други - обработка на кланични отпадъци за производство на храни за домашни любимци - производство на рибно брашно за храна за животни - 10.20 - производство на кюспе и други твърди остатъци от маслодайни семена - 10.41 - дейности, при които се получават странични продукти, които без специална обработка се използват за храни за животни, например кюспе и други твърди остатъци при извличането на растителни масла и мазнини (10.41), трици, отсевки и други видове отпадъци, получени при смилане на зърното (10.61) и други @bg
scope note: Z: - výrobu krmiv pro zvířata v zájmovém chovu, vč. psů, koček, ptáků, ryb atd. ZT: - zpracování jatečního odpadu k výrobě krmiva N: - výrobu rybí moučky jako krmiva (10.20) - výrobu pokrutin (10.41) - činnosti, jejichž výsledkem je kromě hlavního produktu vedlejší produkt pro krmení zvířat bez potřeby dalšího speciálního zpracování, např. zbytky z výroby rostlinných olejů (10.41), zbytky z výroby mlýnských výrobků (10.61) @cs
scope note: Diese Klasse umfasst: - Herstellung von Futtermitteln für Heimtiere, einschließlich Hunde, Katzen, Vögel, Fische usw. Diese Klasse umfasst ferner: - Behandlung von Schlachtabfällen zur Herstellung von Futtermitteln Diese Klasse umfasst nicht: - Herstellung von Fischmehl als Futtermittel (s. 10.20) - Herstellung von Ölkuchen (s. 10.41) - Tätigkeiten, bei denen ohne besondere Behandlung als Futtermittel nutzbare Nebenerzeugnisse anfallen, z. B. Ölsaaten (s. 10.41), Rückstände von Mahl- und Schälmühlen (s. 10.61) @de
scope note: This class includes: - manufacture of prepared feeds for pets, including dogs, cats, birds, fish etc. This class also includes: - treatment of slaughter waste to produce animal feeds This class excludes: - production of fishmeal for animal feed, see 10.20 - production of oilseed cake, see 10.41 - activities resulting in by-products usable as animal feed without special treatment, e.g. oilseeds (see 10.41), grain milling residues (see 10.61) etc. @en
scope note: Esta clase comprende: - la fabricación de productos para la alimentación de animales de compañía, incluidos perros, gatos, pájaros, peces, etc. Esta clase comprende también: - el tratamiento de residuos de mataderos para la producción de productos para la alimentación animal. Esta clase no comprende: - la fabricación de productos a base de pescado para la alimentación animal (véase 10.20); - la fabricación de tortas a partir de semillas oleaginosas (véase 10.41); - las actividades que dan lugar a la obtención de subproductos utilizables para la alimentación animal sin tratamiento especial, como las semillas oleaginosas (véase 10.41), los residuos de la molienda de cereales (véase 10.61), etc. @es
scope note: Cette classe comprend: - la fabrication d’aliments préparés pour animaux de compagnie, y compris les chiens, les chats, les oiseaux, les poissons, etc. Cette classe comprend également: - le traitement de déchets d’abattoir pour produire des aliments pour animaux Cette classe ne comprend pas: - la production de farines de poissons destinées à l’alimentation des animaux, voir 10.20 - la production de tourteaux oléagineux, voir 10.41 - les activités produisant des sous-produits pouvant être utilisés comme aliments pour animaux sans subir de traitement particulier, comme les oléagineux (voir 10.41), les résidus de la minoterie (voir 10.61) @fr
scope note: Ovaj razred uključuje: - proizvodnju gotove hrane za kućne ljubimce, uključujući pse, mačke, ptice, ribe itd. Ovaj razred također uključuje: - preradu otpada iz klaonica za proizvodnju hrane za životinje Ovaj razred isključuje: - proizvodnju riblje hrane za životinje, vidi 10.20 - proizvodnju pogača od uljanih sjemenki, vidi 10.41 - djelatnosti koje rezultiraju nusproizvodima koji se bez posebne obrade mogu koristiti kao hrana za životinje, npr. pogače od uljanih sjemenki (vidi 10.41), ostaci mljevenih žitarica (vidi 10.61) itd.
scope note: Į šią klasę įeina: - paruoštų pašarų kambariniams gyvūnėliams, įskaitant šunis, kates, paukščius, žuvis ir kt., gamyba Į šią klasę taip pat įeina: - skerdyklų atliekų perdirbimas gyvūnų pašaro gamybai Į šią klasę neįeina: - žuvų miltų pašarams gamyba, žr. 10.20 - aliejingųjų sėklų išspaudų gamyba, žr. 10.41 - veikla, kurios rezultate gaunami šalutiniai produktai be pecialaus apdorojimo tinkantys gyvūnų pašarui, pvz., aliejingųjų sėklų išspaudos (žr. 10.41), grūdų malimo liekanos (žr. 10. 61) ir kt. @lt
scope note: Этот класс включает: - производство дистиллированных, питьевых, алкогольных напитков: виски, бренди, джина, ликера и т.д. - производство напитков, смешанных с дистиллированными алкогольными напитками - смешивание дистиллированных спиртных напитков - производство нейтральных спиртных напитков Этот класс исключает: - производство недистиллированных алкогольных напитков, см. 11.02-11.06 - производство синтетического этилового спирта, см. 20.14 - производство этилового спирта из ферментных материалов, см. 20.14 - разлив в бутылки и наклеивание этикеток, см. 46.34 (если является частью оптовой торговли) и 82.92 (если осуществляется за вознаграждение или на контрактной основе) @ru
scope note: Bu sınıf aşağıdakileri kapsamaktadır; - ev hayvanları için hazır yem imalatı (köpekler, kediler, kuşlar, balıklar vb. dahil). Ayrıca bu sınıf aşağıdakileri de kapsamaktadır; - ev hayvanı yemi üretmek için kesilmiş hayvanlardan çıkan artıkların işlenmesi. Kapsam dışı olanlar; - hayvan yemi olarak kullanılmak üzere balık unu imalatı, bkz. 10.20, - yağ tohumundan küspe imalatı, bkz. 10.41, - özel bir işlem yapılmaksızın hayvan yemi olarak kullanabilen yan mamuller ile sonuçlanan faaliyetler, örn. yağ tohumları (bkz. 10.41), hububatların öğütülmesi sonucu oluşan tortular (bkz. 10.61), vb.. @tr
preferred label: Производство на готови храни за домашни любимци @bg
preferred label: Výroba průmyslových krmiv pro zvířata v zájmovém chovu @cs
preferred label: Fremstilling af færdige foderblandinger til kæledyr @da
preferred label: Herstellung von Futtermitteln für sonstige Tiere @de
preferred label: Παραγωγή παρασκευασμένων ζωοτροφών για ζώα συντροφιάς @el
preferred label: Fabricación de productos para la alimentación de animales de compañía @es
preferred label: Lemmikloomade valmistoidu tootmine @et
preferred label: Lemmikkieläinten ruokien valmistus @fi
preferred label: Fabrication d'aliments pour animaux de compagnie @fr
preferred label: Hobbiállat-eledel gyártása
preferred label: Produzione di prodotti per l'alimentazione degli animali domestici @it
preferred label: Paruošto ėdalo naminiams gyvūnėliams gamyba @lt
preferred label: Mājdzīvnieku barības ražošana @lv
preferred label: Manifattura ta' ikel lest għall-annimali domestiċi @mt
preferred label: Vervaardiging van voeders voor huisdieren @nl
preferred label: Produksjon av fôrvarer til kjæledyr @no
preferred label: Produkcja gotowej karmy dla zwierząt domowych @pl
preferred label: Fabricação de alimentos para animais de estimação @pt
preferred label: Fabricarea preparatelor pentru hrana animalelor de companie @ro
preferred label: Производство готовых кормов для домашних животных @ru
preferred label: Výroba a príprava krmív pre domáce zvieratá @sk
preferred label: Proizvodnja hrane za hišne živali @sl
preferred label: Framställning av mat till sällskapsdjur @sv
preferred label: Ev hayvanları için hazır yem imalatı @tr
broader: Manufacture of prepared animal feeds

Manufacture of beverages
type: Concept
notation: 11
status: valid
status modified: 2013-10-18
accepted date: 2013-10-18
in scheme: Statistical Classification of Economic Activities in the European Community, Rev. 2 (2008)
scope note: производство на дестилирани алкохолни напитки; алкохолни напитки, получени главно чрез ферментация; пиво; вина; безалкохолни напитки и минерални води. - производство на плодови и зеленчукови сокове - 10.32 - производство на напитки на млечна основа - 10.51 - производство на продукти от кафе, чай и мате - 10.83 @bg
scope note: Tento oddíl zahrnuje výrobu nealkoholických nápojů (limonád, toniků, minerálních vod apod.), výrobu alkoholických nápojů vyráběných hlavně kvašením (piva, vína atd.) a výrobu lihovin. N: - výrobu ovocných a zeleninových šťáv (10.32) - výrobu mléčných nápojů (10.51) - výrobu produktů z kávy, čaje a maté (10.83) @cs
scope note: Diese Abteilung umfasst die Herstellung von Getränken wie nichtalkoholische Getränke und Mineralwasser, die Herstellung von alkoholischen Getränken vornehmlich durch Gärung, wie Bier, Wein und Spirituosen. Diese Abteilung umfasst nicht: - Herstellung von Frucht- und Gemüsesäften (s. 10.32) - Herstellung von Erfrischungsgetränken aus Milch (s. 10.51) - Herstellung von Erzeugnissen aus Kaffee, Tee und Mate (s. 10.83) @de
scope note: This division includes the manufacture of beverages, such as non-alcoholic beverages and mineral water, manufacture of alcoholic beverages mainly through fermentation, beer and wine, and the manufacture of distilled alcoholic beverages. This division excludes: - production of fruit and vegetable juices, see 10.32 - manufacture of milk-based drinks, see 10.51 - manufacture of coffee, tea and mate products, see 10.83 @en
scope note: Esta división comprende la fabricación de bebidas, tales como las bebidas no alcohólicas y el agua mineral, la fabricación de bebidas alcohólicas, fundamentalmente mediante fermentación, cerveza y vino, y la fabricación de bebidas alcohólicas destiladas. Esta división no comprende: - la producción de zumos de frutas y verduras (véase 10.32); - la producción de bebidas a base de leche (véase 10.51); - la elaboración de productos a base de café, té y hierba mate (véase 10.83). @es
scope note: Cette division comprend la fabrication de boissons, telles que les boissons non alcoolisées et les eaux minérales, la fabrication de boissons alcoolisées obtenues principalement par fermentation, de bières et de vins, ainsi que la fabrication de boissons alcoolisées distillées. Cette division ne comprend pas: - la production de jus de fruits et de légumes, voir 10.32 - la production de boissons à base de lait, voir 10.51 - la fabrication de produits à base de café, de thé et de maté, voir 10.83 @fr
scope note: Ovaj odjeljak uključuje proizvodnju pića kao što su bezalkoholna pića i mineralna voda, alkoholnih pića koja se uglavnom dobivaju fermentacijom, piva i vina te proizvodnju destiliranih alkoholnih pića. Ovaj odjeljak isključuje: - proizvodnju sokova od voća i povrća, vidi 10.32 - proizvodnju na mlijeku baziranih pića, vidi 10.51 - proizvodnju proizvoda od kave, čaja i matea, vidi 10.83
scope note: Į šį skyrių įeina nealkoholinių gėrimų ir mineralinio vandens bei alkoholinių gėrimų (tokių kaip alus, vynas, kiti fermentuoti gėrimai, spiritiniai gėrimai) ir etilo alkoholio gamyba. Į šį skyrių neįeina: - vaisių, uogų ir daržovių sulčių gamyba, žr. 10.32 - pieno gėrimų gamyba, žr. 10.51 - kavos, arbatos ir matės produktų gamyba, žr. 10.83 @lt
scope note: Этот класс включает: - производство вина - производство шипучего вина - производство вина из концентрированного виноградного сусла Этот класс также включает: - смешивание, очищение и разлив вина в бутылки - производство вина без алкоголя или с низким процентным содержанием алкоголя Этот класс исключает: - разлив в бутылки и наклеивание этикеток, см. 46.34 (если является частью оптовой торговли) и 82.92 (если осуществляется за вознаграждение или на контрактной основе) @ru
scope note: Bu bölüm, alkolsüz içecekler ve maden suları gibi içeceklerin imalatını, alkollü içeceklerin, temel olarak fermantasyon (mayalama) yöntemi ile şarap ve biranın imalatını ve damıtılmış alkollü içeceklerin imalatını kapsamaktadır. Kapsam dışı olanlar; - meyve ve sebze suları üretimi, bkz. 10.32, - süt temelli içeceklerin imalatı, bkz. 10.51, - kahve, çay ve Paraguay çayı ürünü imalatı, bkz. 10.83. @tr
preferred label: Производство на напитки @bg
preferred label: Výroba nápojů @cs
preferred label: Fremstilling af drikkevarer @da
preferred label: Getränkeherstellung @de
preferred label: Ποτοποιία @el
preferred label: Fabricación de bebidas @es
preferred label: Joogitootmine @et
preferred label: Juomien valmistus @fi
preferred label: Fabrication de boissons @fr
preferred label: Italgyártás
preferred label: Produzione di bevande @it
preferred label: Gėrimų gamyba @lt
preferred label: Dzērienu ražošana @lv
preferred label: Manifattura ta' xarbiet @mt
preferred label: Vervaardiging van dranken @nl
preferred label: Produksjon av drikkevarer @no
preferred label: Produkcja napojów @pl
preferred label: Indústria das bebidas @pt
preferred label: Fabricarea băuturilor @ro
preferred label: Производство напитков @ru
preferred label: Výroba nápojov @sk
preferred label: Proizvodnja pijač @sl
preferred label: Framställning av drycker @sv
preferred label: İçeceklerin imalatı @tr
broader: MANUFACTURING
narrower: Manufacture of beverages

Manufacture of beverages
type: Concept
notation: 11.0
status: valid
status modified: 2013-10-18
accepted date: 2013-10-18
in scheme: Statistical Classification of Economic Activities in the European Community, Rev. 2 (2008)
scope note: Этот класс включает: - производство ферментированных, но не дистиллированных алкогольных напитков: сакэ, сидра, грушевого сидра и прочих фруктовых вин Этот класс также включает: - производство медовых и смешанных напитков, содержащих фруктовые вина Этот класс исключает: - разлив в бутылки и наклеивание этикеток, см. 46.34 (если является частью оптовой торговли) и 82.92 (если осуществляется за вознаграждение или на контрактной основе) @ru
preferred label: Производство на напитки @bg
preferred label: Výroba nápojů @cs
preferred label: Fremstilling af drikkevarer @da
preferred label: Getränkeherstellung @de
preferred label: Ποτοποιία @el
preferred label: Fabricación de bebidas @es
preferred label: Joogitootmine @et
preferred label: Juomien valmistus @fi
preferred label: Fabrication de boissons @fr
preferred label: Italgyártás
preferred label: Produzione di bevande @it
preferred label: Gėrimų gamyba @lt
preferred label: Dzērienu ražošana @lv
preferred label: Manifattura ta' xarbiet @mt
preferred label: Vervaardiging van dranken @nl
preferred label: Produksjon av drikkevarer @no
preferred label: Produkcja napojów @pl
preferred label: Indústria das bebidas @pt
preferred label: Fabricarea băuturilor @ro
preferred label: Производство напитков @ru
preferred label: Výroba nápojov @sk
preferred label: Proizvodnja pijač @sl
preferred label: Framställning av drycker @sv
preferred label: İçecek imalatı @tr
broader: Manufacture of beverages
narrower: Distilling, rectifying and blending of spirits
narrower: Manufacture of wine from grape
narrower: Manufacture of cider and other fruit wines
narrower: Manufacture of other non-distilled fermented beverages
narrower: Manufacture of beer
narrower: Manufacture of malt
narrower: Manufacture of soft drinks; production of mineral waters and other bottled waters

Distilling, rectifying and blending of spirits
type: Concept
notation: 11.01
status: valid
status modified: 2013-10-18
accepted date: 2013-10-18
in scheme: Statistical Classification of Economic Activities in the European Community, Rev. 2 (2008)
scope note: - производство на дестилирани алкохолни напитки: уиски, джин, ракия, ликьори и други - производство на смесени напитки, съдържащи дестилирани спиртни напитки - смесване на дестилирани спиртни напитки - производство на неденатуриран спирт, годен за консумация - производство на недестилирани алкохолни напитки - 11.02 - 11.06 - производство на синтетичен етилов алкохол - 20.14 - производство на етилов алкохол от ферментирали продукти - 20.14 - бутилиране и етикетиране, извършвани като част от търговия на едро - 46.34 - бутилиране и етикетиране, извършвани срещу заплащане (по договор или еднократно) - 82.92 @bg
scope note: Z: - výrobu destilovaných, poživatelných alkoholických nápojů: whisky, brandy, ginu, likérů apod. - výrobu míchaných nápojů obsahujících lihoviny - míchání lihovin - výrobu čistého alkoholu N: - výrobu nedestilovaných alkoholických nápojů (11.02 až 11.05) - výrobu syntetického etylalkoholu (20.14) - výrobu etylalkoholu ze zkvašených materiálů (20.14) - samotné stáčení nápojů do lahví a jejich opatřování etiketami (46.34, je-li činnost prováděna v rámci velkoobchodu, a 82.92, je-li činnost prováděna na základě smlouvy nebo dohody) @cs
scope note: Diese Klasse umfasst: - Herstellung von destillierten, genießbaren alkoholischen Getränken: Whisky, Branntwein, Gin, Likör - Herstellung von Mischgetränken, die Spirituosen enthalten - Mischen von Spirituosen - Herstellung von reinem Alkohol Diese Klasse umfasst nicht: - Herstellung von nichtgebrannten alkoholischen Getränken (s. 11.02-11.06) - Herstellung von synthetischem Ethylalkohol (s. 20.14) - Herstellung von Gärungsalkohol aus Agrarrohstoffen durch Destillation (s. 20.14) - lediglich Abfüllen und Etikettieren (s. 46.34, falls im Großhandel durchgeführt, bzw. 82.92, falls im Lohnauftrag durchgeführt) @de
scope note: This class includes: - manufacture of distilled, potable, alcoholic beverages: whisky, brandy, gin, liqueurs etc. - manufacture of drinks mixed with distilled alcoholic beverages - blending of distilled spirits - production of neutral spirits This class excludes: - manufacture of non-distilled alcoholic beverages, see 11.02-11.06 - manufacture of synthetic ethyl alcohol, see 20.14 - manufacture of ethyl alcohol from fermented materials, see 20.14 - merely bottling and labelling, see 46.34 (if performed as part of wholesale) and 82.92 (if performed on a fee or contract basis) @en
scope note: Esta clase comprende: - la destilación de bebidas alcohólicas: güisqui, coñac, ginebra, licores, etc.; - la fabricación de bebidas mezcladas con bebidas alcohólicas destiladas; - la mezcla de bebidas alcohólicas destiladas; - la producción de alcohol rectificado. Esta clase no comprende: - la elaboración de bebidas alcohólicas no destiladas (véanse 11.02 a 11.06); - la producción de alcohol etílico sintético (véase 20.14); - la fabricación de alcohol etílico a partir de materias fermentadas (véase 20.14); - las tareas específicas de embotellado y etiquetado (véase 46.34 si se realizan como parte de la venta al por mayor, y 82.92, si se ejecutan por cuenta de terceros). @es
scope note: Cette classe comprend: - la fabrication de boissons alcoolisées distillées propres à la consommation: whisky, cognac, gin, liqueurs etc. - la fabrication de boissons mélangées avec des boissons alcoolisées distillées - le mélange de spiritueux distillés - la fabrication d’alcools neutres Cette classe ne comprend pas: - la fabrication de boissons alcoolisées non distillées, voir 11.02-11.06 - la fabrication d’alcool éthylique de synthèse, voir 20.14 - la fabrication d’alcool éthylique de fermentation, voir 20.14 - l’embouteillage et l’étiquetage simples, voir 46.34 (dans le cadre du commerce de gros) et 82.92 (pour le compte de tiers) @fr
scope note: Ovaj razred uključuje: - proizvodnju destiliranih alkoholnih pića: viskija, rakije, džina, likera itd. - proizvodnju pića miješanih s destiliranim alkoholnim pićima - miješanje destiliranog špirita - proizvodnju neutralnih špirita Ovaj razred isključuje: - proizvodnju nedestiliranih alkoholnih pića, vidi 11.02, 11.06 - proizvodnju sintetičkog etilnog alkohola, vidi 20.14 - proizvodnju etilnog alkohola iz fermentiranih materijala, vidi 20.14 - flaširanje i etiketiranje, vidi 46.34 (ako se obavlja u sklopu veletrgovine) i 82.92 (ako se obavlja uz naplatu ili na osnovi ugovora)
scope note: Į šią klasę įeina: - distiliuotų alkoholinių gėrimų (viskio, brendžio, džino, likerių ir kt.) gamyba - gėrimų mišinių su distiliuotais alkoholiniais gėrimais gamyba - distiliuoto spirito maišymas - neutralaus (rektifikuoto) etilo alkoholio gamyba Į šią klasę neįeina: - nedistiliuotų alkoholinių gėrimų gamyba, žr. 11.02 -11.06 - sintetinio etanolio gamyba, žr. 20.14 - etanolio gamyba iš fermentuotų medžiagų, žr. 20.14 - pilstymas į butelius ir ženklinimas, žr. 46.34 (jei yra neatsiejama didmeninės prekybos dalis) ir 82.92 (jei atliekama už atlygį ar pagal sutartį) @lt
scope note: Этот класс включает: - производство вермута и т.д. Этот класс исключает: - разлив в бутылки и наклеивание этикеток, см. 46.34 (если является частью оптовой торговли) и 82.92 (если осуществляется за вознаграждение или на контрактной основе) @ru
scope note: Bu sınıf aşağıdakileri kapsamaktadır; - damıtılmış alkollü içeceklerin imalatı: viski, brendi, cin, likör, rakı, votka vb., - damıtılmış alkollü içeceklerle karıştırılmış içki imalatı, - damıtılmış ispirtonun harmanlanması, - doğal ispirto imalatı. Kapsam dışı olanlar; - damıtılmamış alkollü içeceklerin imalatı, bkz. 11.02, 11.06, - sentetik etil alkol imalatı, bkz. 20.14, - mayalı maddelerden etil alkol üretimi, bkz. 20.14, - sadece şişeleme ve etiketleme, bkz. 46.34 (toptancılığın bir parçası olarak gerçekleştirildiğinde) ve bkz. 82.92 (bir ücret veya sözleşme neticesinde gerçekleştirildiğinde). @tr
preferred label: Производство на спиртни напитки @bg
preferred label: Destilace, rektifikace a míchaní lihovin @cs
preferred label: Destillation, rektifikation og blanding af alkohol @da
preferred label: Herstellung von Spirituosen @de
preferred label: Απόσταξη, ανακαθαρισμός και ανάμιξη αλκοολούχων ποτών @el
preferred label: Destilación, rectificación y mezcla de bebidas alcohólicas @es
preferred label: Kange alkoholi destilleerimine, rektifitseerimine ja segamine @et
preferred label: Alkoholijuomien tislaus ja sekoittaminen; etyylialkoholin valmistus käymisteitse @fi
preferred label: Production de boissons alcooliques distillées @fr
preferred label: Desztillált szeszes ital gyártása
preferred label: Distillazione, rettifica e miscelatura di alcolici @it
preferred label: Spirito distiliavimas, rektifikavimas ir maišymas @lt
preferred label: Spirtu destilēšana, rektificēšana un maisīšana @lv
preferred label: Distillazzjoni, rettifikazzjoni u taħlit ta' spirti @mt
preferred label: Vervaardiging van gedistilleerde dranken door distilleren, rectificeren en mengen @nl
preferred label: Destillering, rektifisering og blanding av sprit @no
preferred label: Destylowanie, rektyfikowanie i mieszanie alkoholi @pl
preferred label: Fabricação de bebidas alcoólicas destiladas; produção de álcool etílico de fermentação @pt
preferred label: Distilarea, rafinarea şi mixarea băuturilor alcoolice @ro
preferred label: Дистилляция, ректификация и смешивание спиртных напитков @ru
preferred label: Destilovanie, úprava a miešanie alkoholu @sk
preferred label: Proizvodnja žganih pijač @sl
preferred label: Destillering, rening och tillblandning av spritdrycker @sv
preferred label: Alkollü içeceklerin damıtılması, arıtılması ve harmanlanması @tr
broader: Manufacture of beverages

Manufacture of wine from grape
type: Concept
notation: 11.02
status: valid
status modified: 2013-10-18
accepted date: 2013-10-18
in scheme: Statistical Classification of Economic Activities in the European Community, Rev. 2 (2008)
scope note: - производство на вина: • трапезни вина • качествени вина, произведени в определени райони - производство на пенливи вина - производство на вина от концентрирана гроздова мъст - смесване (купажиране), пречистване и бутилиране на вина - производство на нискоалкохолни или безалкохолни вина - производство на вина от собствено отгледано грозде, когато по-голяма част от добавената стойност е от производство на вино, а не от отглеж - бутилиране и етикетиране, извършвани като част от търговия на едро - 46.34 - бутилиране и етикетиране, извършвани срещу заплащане (по договор или еднократно) - 82.92 @bg
scope note: Z: - výrobu vína - výrobu šumivého vína - výrobu vína z koncentrovaného hroznového moštu ZT: - míchání, čištění a stáčení vína do lahví - výrobu vína s nízkým obsahem alkoholu nebo vína nealkoholického N: - samotné stáčení nápojů do lahví a jejich opatřování etiketami (46.34, je-li činnost prováděna v rámci velkoobchodu, a 82.92, je-li činnost prováděna na základě smlouvy nebo dohody) @cs
scope note: Diese Klasse umfasst: - Herstellung von Wein - Herstellung von Schaumwein - Herstellung von Wein aus konzentriertem Traubenmost Diese Klasse umfasst ferner: - Verschneiden, Reinigen und Flaschenabfüllung von Wein - Herstellung von Wein mit geringem oder ohne Alkoholgehalt Diese Klasse umfasst nicht: - lediglich Abfüllen und Etikettieren (s. 46.34, falls im Großhandel durchgeführt, bzw. 82.92, falls im Lohnauftrag durchgeführt) @de
scope note: This class includes: - manufacture of wine - manufacture of sparkling wine - manufacture of wine from concentrated grape must This class also includes: - blending, purification and bottling of wine - manufacture of low or non-alcoholic wine This class excludes: - merely bottling and labelling, see 46.34 (if performed as part of wholesale) and 82.92 (if performed on a fee or contract basis) @en
scope note: Esta clase comprende: - la elaboración de vinos; - la elaboración de vinos espumosos; - la elaboración de vino a partir de mosto concentrado. Esta clase comprende también: - la mezcla, depuración y embotellado de vinos; - la elaboración de vino bajo en alcohol o sin alcohol. Esta clase no comprende: - las tareas específicas de embotellado y etiquetado (véase 46.34 si se realizan como parte de la venta al por mayor, y 82.92, si se ejecutan por cuenta de terceros). @es
scope note: Cette classe comprend: - la production de vins - la production de vins mousseux - la production de vins à partir de moût de raisin concentré Cette classe comprend également: - le mélange, la purification et l’embouteillage du vin - la fabrication de vin sans alcool ou faiblement alcoolisé Cette classe ne comprend pas: - l’embouteillage et l’étiquetage simples, voir 46.34 (dans le cadre du commerce de gros) et 82.92 (pour le compte de tiers) @fr
scope note: Ovaj razred uključuje: - proizvodnju vina - proizvodnju pjenušavog vina - proizvodnju vina od koncentriranoga vinskog mošta Ovaj razred također uključuje: - miješanje, pročišćavanje i flaširanje vina - proizvodnju vina s niskim sadržajem alkohola ili bezalkoholnog vina Ovaj razred isključuje: - flaširanje i etiketiranje, vidi 46.34 (ako se obavlja u sklopu veletrgovine) i 82.92 (ako se obavlja uz naplatu ili na osnovi ugovora)
scope note: Į šią klasę įeina: - vyno gamyba - putojančio vyno gamyba - vyno gamyba iš koncentruotos vynuogių misos Į šią klasę taip pat įeina: - vyno maišymas, valymas ir pilstymas į butelius - silpnų ar nealkoholinių vynų gamyba Į šią klasę neįeina: - pilstymas į butelius ir ženklinimas, žr. 46.34 (jei yra neatsiejama didmeninės prekybos dalis) ir 82.92 (jei atliekama už atlygį ar pagal sutartį) @lt
scope note: Этот класс включает: - производство солодовых напитков, таких как пива, эля, портера и стаута Этот класс также включает: - производство низкоалкогольного и безалкогольного пива @ru
scope note: Bu sınıf aşağıdakileri kapsamaktadır; - şarap üretimi, - köpüklü şarap üretimi, - konsantre üzüm şırasından elde edilen şarap imalatı. Ayrıca bu sınıf şunları da kapsamaktadır; - şarabın harmanlanması, arındırılması ve şişelenmesi, - alkolsüz veya düşük alkol seviyeli şarap imalatı. Kapsam dışı olanlar; - sadece şişeleme ve etiketleme, bkz. 46.34 (toptancılığın bir parçası olarak gerçekleştirildiğinde) ve bkz. 82.92 (bir ücret veya sözleşme neticesinde gerçekleştirildiğinde). @tr
preferred label: Производство на вина от грозде @bg
preferred label: Výroba vína z vinných hroznů @cs
preferred label: Fremstilling af vin af druer @da
preferred label: Herstellung von Traubenwein @de
preferred label: Παραγωγή οίνου από σταφύλια @el
preferred label: Elaboración de vinos @es
preferred label: Viinamarjaveini tootmine @et
preferred label: Viinin valmistus rypäleistä @fi
preferred label: Production de vin (de raisin) @fr
preferred label: Szőlőbor termelése
preferred label: Produzione di vini da uve @it
preferred label: Vynuogių vyno gamyba @lt
preferred label: Vīnu ražošana no vīnogām @lv
preferred label: Manifattura ta' inbid mill-għeneb @mt
preferred label: Vervaardiging van wijn uit druiven @nl
preferred label: Produksjon av vin @no
preferred label: Produkcja win gronowych @pl
preferred label: Indústria do vinho @pt
preferred label: Fabricarea vinurilor din struguri @ro
preferred label: Производство вина из винограда @ru
preferred label: Výroba hroznového vína @sk
preferred label: Proizvodnja vina iz grozdja @sl
preferred label: Framställning av vin från druvor @sv
preferred label: Üzümden şarap imalatı @tr
broader: Manufacture of beverages

Manufacture of cider and other fruit wines
type: Concept
notation: 11.03
status: valid
status modified: 2013-10-18
accepted date: 2013-10-18
in scheme: Statistical Classification of Economic Activities in the European Community, Rev. 2 (2008)
scope note: - производство на ферментирали, но недестилирани напитки от плодове - ябълки, круши и други - производство на медовина и смеси, съдържащи ферментирали напитки от плодове - бутилиране и етикетиране, извършвани като част от търговия на едро - 46.34 - бутилиране и етикетиране, извършвани срещу заплащане (по договор или еднократно) - 82.92 @bg
scope note: Z: - výrobu kvašených, ale nedestilovaných alkoholických nápojů: rýžového, jablečného, hruškového a jiných ovocných vín ZT: - výrobu medoviny a míchaných nápojů obsahujících ovocná vína N: - samotné stáčení nápojů do lahví a jejich opatřování etiketami (46.34, je-li činnost prováděna v rámci velkoobchodu, a 82.92, je-li činnost prováděna na základě smlouvy nebo dohody) @cs
scope note: Diese Klasse umfasst: - Herstellung von vergorenen, aber nichtdestillierten alkoholischen Getränken: Reiswein sowie Apfel- oder Birnenwein und andere Obstweine Diese Klasse umfasst ferner: - Herstellung von Met und von Mischgetränken, die Obstwein enthalten Diese Klasse umfasst nicht: - lediglich Abfüllen und Etikettieren (s. 46.34, falls im Großhandel durchgeführt, bzw. 82.92, falls im Lohnauftrag durchgeführt) @de
scope note: This class includes: - manufacture of fermented but not distilled alcoholic beverages: sake, cider, perry and other fruit wines This class also includes: - manufacture of mead and mixed beverages containing fruit wines This class excludes: - merely bottling and labelling, see 46.34 (if performed as part of wholesale) and 82.92 (if performed on a fee or contract basis) @en
scope note: Esta clase comprende: - la elaboración de bebidas alcohólicas fermentadas, pero no destiladas: sake, sidra, perada y otras bebidas fermentadas a partir de frutas. Esta clase comprende también: - la elaboración de aguamiel y bebidas mezcladas con bebidas fermentadas a partir de frutas. Esta clase no comprende: - las tareas específicas de embotellado y etiquetado (véase 46.34 si se realizan como parte de la venta al por mayor, y 82.92, si se ejecutan por cuenta de terceros). @es
scope note: Cette classe comprend: - la fabrication de boissons alcoolisées fermentées, mais non distillées: saké, cidre, poiré et autres vins de fruits Cette classe comprend également: - la fabrication d’hydromel et de boissons mélangées contenant des vins de fruits Cette classe ne comprend pas: - l’embouteillage et l’étiquetage simples, voir 46.34 (dans le cadre du commerce de gros) et 82.92 (pour le compte de tiers) @fr
scope note: Ovaj razred uključuje: - proizvodnju fermentiranih, ali nedestiliranih alkoholnih pića: rižina vina, jabukovače, kruškovače, medovine, drugih voćnih vina. Ovaj razred također uključuje: - proizvodnju medovine i miješanih pića koju sadrže voćna vina Ovaj razred isključuje: - flaširanje i etiketiranje, vidi 46.34 (ako se obavlja u sklopu veletrgovine) i 82.92 (ako se obavlja uz naplatu ili na osnovi ugovora)
scope note: Į šią klasę įeina: - fermentuotų, bet nedistiliuotų alkoholinių gėrimų (sakė, sidro, kriaušių sidro ir kitų vaisinių vynų) gamyb Į šią klasę taip pat įeina: - midaus ir mišriųjų gėrimų su vaisiniais vynais gamyba Į šią klasę neįeina: - pilstymas į butelius ir ženklinimas, žr. 46.34 (jei yra neatsiejama didmeninės prekybos dalis) ir 82.92 (jei atliekama už atlygį ar pagal sutartį) @lt
scope note: Bu sınıf aşağıdakileri kapsamaktadır; - mayalanmış fakat damıtılmamış alkollü içeceklerin imalatı: sake (pirinçten yapılan bir tür Japon rakısı), elma şarabı, armut şarabı ve diğer meyve şarapları. Ayrıca bu sınıf şunları da kapsamaktadır; - mayalanmış bal ve su ile yapılan alkollü içki (bal likörü) ve meyve şarapları içeren diğer karıştırılmış içecekler. Kapsam dışı olanlar; - sadece şişeleme ve etiketleme, bkz.46.34 (toptancılığın bir parçası olarak gerçekleştirildiğinde) ve bkz. 82.92 (bir ücret veya sözleşme neticesinde gerçekleştirildiğinde) @tr
preferred label: Производство на други ферментирали напитки @bg
preferred label: Výroba jablečného vína a jiných ovocných vín @cs
preferred label: Fremstilling af cider og anden frugtvin @da
preferred label: Herstellung von Apfelwein und anderen Fruchtweinen @de
preferred label: Παραγωγή μηλίτη και κρασιών από άλλα φρούτα @el
preferred label: Elaboración de sidra y otras bebidas fermentadas a partir de frutas @es
preferred label: Siidri ja muu marja- ja puuviljaveini tootmine @et
preferred label: Siiderin, hedelmä- ja marjaviinien valmistus @fi
preferred label: Fabrication de cidre et de vins de fruits @fr
preferred label: Gyümölcsbor termelése
preferred label: Produzione di sidro e di altri vini a base di frutta @it
preferred label: Sidro ir kitokių vaisių, uogų vynų gamyba @lt
preferred label: Sidra un citu augļu vīnu ražošana @lv
preferred label: Manifattura ta' sidru u nbejjed oħra tal-frott @mt
preferred label: Vervaardiging van cider en van andere vruchtenwijnen @nl
preferred label: Produksjon av sider og annen fruktvin @no
preferred label: Produkcja cydru i pozostałych win owocowych @pl
preferred label: Fabricação de cidra e outras bebidas fermentadas de frutos @pt
preferred label: Fabricarea cidrului şi a altor vinuri din fructe @ro
preferred label: Производство сидра и прочих фруктовых вин @ru
preferred label: Výroba jablčného vína a iného ovocného vína @sk
preferred label: Proizvodnja sadnih vin in podobnih fermentiranih pijač @sl
preferred label: Framställning av cider och andra fruktviner @sv
preferred label: Elma şarabı ve diğer meyve şaraplarının imalatı @tr
broader: Manufacture of beverages

Manufacture of other non-distilled fermented beverages
type: Concept
notation: 11.04
status: valid
status modified: 2013-10-18
accepted date: 2013-10-18
in scheme: Statistical Classification of Economic Activities in the European Community, Rev. 2 (2008)
scope note: - производство на ароматизирани вина (пелин, вермути) - бутилиране и етикетиране, извършвани като част от търговия на едро - 46.34 - бутилиране и етикетиране, извършвани срещу заплащане (по договор или еднократно) - 82.92 @bg
scope note: Z: - výrobu vermutů apod. N: - samotné stáčení nápojů do lahví a jejich opatřování etiketami (46.34, je-li činnost prováděna v rámci velkoobchodu, a 82.92, je-li činnost prováděna na základě smlouvy nebo dohody) @cs
scope note: Diese Klasse umfasst: - Herstellung von Wermutwein u. Ä. Diese Klasse umfasst nicht: - lediglich Abfüllen und Etikettieren (s. 46.34, falls im Großhandel durchgeführt, bzw. 82.92, falls im Lohnauftrag durchgeführt) @de
scope note: This class includes: - manufacture of vermouth and the like This class excludes: - merely bottling and labelling, see 46.34 (if performed as part of wholesale) and 82.92 (if performed on a fee or contract basis) @en
scope note: Esta clase comprende: - la elaboración de vermut y similares. Esta clase no comprende: - las tareas específicas de embotellado y etiquetado (véase 46.34 si se realizan como parte de la venta al por mayor, y 82.92, si se ejecutan por cuenta de terceros). @es
scope note: Cette classe comprend: - la fabrication de vermouths et de boissons similaires Cette classe ne comprend pas: - l’embouteillage et l’étiquetage simples, voir 46.34 (dans le cadre du commerce de gros) et 82.92 (pour le compte de tiers) @fr
scope note: Ovaj razred uključuje: - proizvodnju vermuta i sl. Ovaj razred isključuje: - flaširanje i etiketiranje, vidi 46.34 (ako se obavlja u sklopu veletrgovine) i 82.92 (ako se obavlja uz naplatu ili na osnovi ugovora)
scope note: Į šią klasę įeina: - vermuto ir panašaus vyno gamyba Į šią klasę neįeina: - pilstymas į butelius ir ženklinimas, žr. 46.34 (jei neatsiejama didmeninės prekybos dalis) ir 82.92 (jei atliekama už atlygį ar pagal sutartį) @lt
scope note: Этот класс включает производство безалкогольных напитков (за исключением безалкогольного пива и вина): - производство природной минеральной воды и прочих вод в бутылках - производство безалкогольных напитков: • безалкогольных ароматизированных и/или подслащенных напитков: лимонада, оранжада, колы, фруктовых напитков, тоников и т.д. Этот класс исключает: - производство фруктовых и овощных соков, см. 10.32 - производство напитков на молочной основе, см. 10.51 - производство кофе, чая и мате, см. 10.83 - производство напитков на алкогольной основе, см. 11.01, 11.02, 11.03, 11.04, 11.05 - производство безалкогольного вина, см. 11.02 - производство безалкогольного пива, см. 11.05 - производство льда, см. 35.30 - разлив в бутылки и наклеивание этикеток, см. 46.34 (если является частью оптовой торговли) и 82.92 (если осуществляется за вознаграждение или на контрактной основе) @ru
scope note: Bu sınıf aşağıdakileri kapsamaktadır; - vermut ve benzeri içki imalatı (boza dahil) Kapsam dışı olanlar; - sadece şişeleme ve etiketleme,bkz. 46.34 (toptancılığın bir parçası olarak gerçekleştirildiğinde) ve bkz. 82.92 (bir ücret veya sözleşme neticesinde gerçekleştirildiğinde). @tr
preferred label: Производство на други недестилирани алкохолни напитки @bg
preferred label: Výroba ostatních nedestilovaných kvašených nápojů @cs
preferred label: Fremstilling af andre ikke-destillerede gærede drikkevarer @da
preferred label: Herstellung von Wermutwein und sonstigen aromatisierten Weinen @de
preferred label: Παραγωγή άλλων μη αποσταγμένων ποτών που υφίστανται ζύμωση @el
preferred label: Elaboración de otras bebidas no destiladas, procedentes de la fermentación @es
preferred label: Muude destilleerimata kääritatud jookide tootmine @et
preferred label: Muiden tislaamattomien juomien valmistus käymisteitse @fi
preferred label: Production d'autres boissons fermentées non distillées @fr
preferred label: Egyéb nem desztillált, erjesztett ital gyártása
preferred label: Produzione di altre bevande fermentate non distillate @it
preferred label: Kitų nedistiliuotų fermentuotų gėrimų gamyba @lt
preferred label: Citu nedestilētu dzērienu ražošana no raudzētām izejvielām @lv
preferred label: Manifattura ta' xarbiet oħra ffermentati mhux iddistillati @mt
preferred label: Vervaardiging van andere niet-gedistilleerde gegiste dranken @nl
preferred label: Produksjon av andre ikke-destillerte gjærede drikkevarer @no
preferred label: Produkcja pozostałych niedestylowanych napojów fermentowanych @pl
preferred label: Fabricação de vermutes e de outras bebidas fermentadas não destiladas @pt
preferred label: Fabricarea altor băuturi nedistilate, obţinute prin fermentare @ro
preferred label: Производство прочих недистиллированных ферментированных напитков @ru
preferred label: Výroba iných nedestilovaných kvasených nápojov @sk
preferred label: Proizvodnja aromatiziranih vin iz grozdja @sl
preferred label: Framställning av andra icke-destillerade jästa drycker @sv
preferred label: Diğer damıtılmamış mayalı içeceklerin imalatı @tr
broader: Manufacture of beverages

Manufacture of beer
type: Concept
notation: 11.05
status: valid
status modified: 2013-10-18
accepted date: 2013-10-18
in scheme: Statistical Classification of Economic Activities in the European Community, Rev. 2 (2008)
scope note: - производство на различни видове пиво, вкл. безалкохолно @bg
scope note: Z: - výrobu nápojů ze sladu, tj. nejrůznějších druhů piva ZT: - výrobu piva s nízkým obsahem alkoholu nebo piva nealkoholického @cs
scope note: Diese Klasse umfasst: - Herstellung von Bier und Starkbier, u. a. Bockbier, Ale, Porter und Stout Diese Klasse umfasst ferner: - Herstellung von Bier mit geringem oder ohne Alkoholgehalt @de
scope note: This class includes: - manufacture of malt liquors, such as beer, ale, porter and stout This class also includes: - manufacture of low alcohol or non-alcoholic beer @en
scope note: Esta clase comprende: - la elaboración de bebidas alcohólicas de malta, como cerveza, ale, porter y stout. Esta clase comprende también: - la elaboración de cerveza sin alcohol o con bajo contenido alcohólico. @es
scope note: Cette classe comprend: - la fabrication de liqueurs de malt, telles que la bière, l’ale, le porter et le stout Cette classe comprend également: - la fabrication de bières sans alcool ou faiblement alcoolisées @fr
scope note: Ovaj razred uključuje: - proizvodnju pića priređenoga vrenjem slada kao što je pivo, englesko bijelo pivo (ale), porter (crno pivo) i stout (jako crno pivo) Ovaj razred također uključuje: - proizvodnju piva s niskim sadržajem alkohola ili bezalkoholnog piva
scope note: Į šią klasę įeina: - salyklinio alaus, tokio kaip alus, šviesusis alus, porteris ir stiprusis porteris, gamyba Į šią klasę taip pat įeina: - silpno ar nealkoholinio alaus gamyba @lt
scope note: Данный раздел включает переработку сельскохозяйственной продукции и выпуск табачных изделий и готовой продукции, предназначенной для людей. @ru
scope note: Bu sınıf aşağıdakileri kapsamaktadır; - bira, ale (bir çeşit bira), siyah bira ve stout (koyu bir bira türü) gibi malt likörlerin imalatı. Ayrıca bu sınıf aşağıdakileri de kapsamaktadır; - düşük alkol seviyesi içeren veya alkolsüz biraların imalatı. @tr
preferred label: Производство на пиво @bg
preferred label: Výroba piva ze sladu @cs
preferred label: Fremstilling af øl @da
preferred label: Herstellung von Bier @de
preferred label: Ζυθοποιία @el
preferred label: Fabricación de cerveza @es
preferred label: Õlletootmine @et
preferred label: Oluen valmistus @fi
preferred label: Fabrication de bière @fr
preferred label: Sörgyártás
preferred label: Fabbricazione di birra @it
preferred label: Alaus gamyba @lt
preferred label: Alus ražošana @lv
preferred label: Manifattura ta' birra @mt
preferred label: Vervaardiging van bier @nl
preferred label: Produksjon av øl @no
preferred label: Produkcja piwa @pl
preferred label: Fabricação de cerveja @pt
preferred label: Fabricarea berii @ro
preferred label: Производство пива @ru
preferred label: Výroba piva @sk
preferred label: Proizvodnja piva @sl
preferred label: Framställning av öl @sv
preferred label: Bira imalatı @tr
broader: Manufacture of beverages

Manufacture of malt
type: Concept
notation: 11.06
status: valid
status modified: 2013-10-18
accepted date: 2013-10-18
in scheme: Statistical Classification of Economic Activities in the European Community, Rev. 2 (2008)
preferred label: Производство на малц @bg
preferred label: Výroba sladu @cs
preferred label: Fremstilling af malt @da
preferred label: Herstellung von Malz @de
preferred label: Παραγωγή βύνης @el
preferred label: Fabricación de malta @es
preferred label: Linnasetootmine @et
preferred label: Maltaiden valmistus @fi
preferred label: Fabrication de malt @fr
preferred label: Malátagyártás
preferred label: Fabbricazione di malto @it
preferred label: Salyklo gamyba @lt
preferred label: Iesala ražošana @lv
preferred label: Manifattura ta' malt @mt
preferred label: Vervaardiging van mout @nl
preferred label: Produksjon av malt @no
preferred label: Produkcja słodu @pl
preferred label: Fabricação de malte @pt
preferred label: Fabricarea malţului @ro
preferred label: Производство солода @ru
preferred label: Proizvodnja slada @sl
preferred label: Framställning av malt @sv
preferred label: Malt imalatı @tr
broader: Manufacture of beverages

Manufacture of soft drinks; production of mineral waters and other bottled waters
type: Concept
notation: 11.07
status: valid
status modified: 2013-10-18
accepted date: 2013-10-18
in scheme: Statistical Classification of Economic Activities in the European Community, Rev. 2 (2008)
scope note: Този клас включва производство на безалкохолни напитки, с изключение на безалкохолни вина и пиво - производство на натурални минерални, изворни, трапезни и други бутилирани води - производство на безалкохолни напитки: • ароматизирани и/или подсладени безалкохолни напитки: лимонода, кола, тоник, нектари и други - производство на плодови и зеленчукови сокове - 10.32 - производство на млечни напитки - 10.51 - производство на продукти от кафе, чай и мате - 10.83 - производство на алкохолни напитки - 11.01, 11.02, 11.03, 11.04, 11.05 - производство на безалкохолни вина - 11.02 - производство на безалкохолно пиво - 11.05 - производство на лед - 35.30 - бутилиране и етикетиране, извършвани като част от търговия на едро - 46.34 - бутилиране и етикетиране, извършвани срещу заплащане (по договор или еднократно) - 82.92 @bg
scope note: Z: - výrobu nealkoholických nápojů (kromě nealkoholického piva a vína): • ochucených anebo slazených nápojů: citronády, oranžády, coly, ovocných nápojů, tonicu atd. - stáčení přírodních minerálních a ostatních vod do lahví N: - výrobu ovocných a zeleninových šťáv (10.32) - výrobu mléčných nápojů (10.51) - výrobu produktů z kávy, čaje a maté (10.83) - výrobu alkoholických nápojů (11.01 až 11.05) - výrobu nealkoholického vína (11.02) - výrobu nealkoholického piva (11.05) - výrobu ledu (35.30) - samotné stáčení nápojů do lahví a jejich opatřování etiketami (46.34, je-li činnost prováděna v rámci velkoobchodu, a 82.92, je-li činnost prováděna na základě smlouvy nebo dohody) @cs
scope note: Diese Klasse umfasst die Herstellung von nichtalkoholischen Getränken (außer nichtalkoholischem Bier und Wein) - Gewinnung natürlicher Mineralwässer und sonstiger Wässer in Flaschen - Herstellung von Erfrischungsgetränken: • alkoholfreie aromatisierte und/oder gesüßte Getränke: Limonade, Orangeade, Cola, Energy-Drinks, Fruchtsaftgetränke, Tonic usw. Diese Klasse umfasst nicht: - Herstellung von Obst- und Gemüsesäften (s. 10.32) - Herstellung von Erfrischungsgetränken aus Milch (s. 10.51) - Herstellung von Erzeugnissen aus Kaffee, Tee und Mate (s. 10.83) - Herstellung von Getränken auf der Grundlage von Alkohol (s. 11.01, 11.02, 11.03, 11.04, 11.05) - Herstellung von Traubenwein (s. 11.02) - Herstellung von nichtalkoholischem Bier (s. 11.05) - Herstellung von Eis (s. 35.30) - lediglich Abfüllen und Etikettieren (s. 46.34, falls im Großhandel durchgeführt, bzw. 82.92, falls im Lohnauftrag durchgeführt) @de
scope note: This class includes manufacture of non-alcoholic beverages (except non-alcoholic beer and wine): - production of natural mineral waters and other bottled waters - manufacture of soft drinks: • non-alcoholic flavoured and/or sweetened waters: lemonade, orangeade, cola, fruit drinks, tonic waters etc. This class excludes: - production of fruit and vegetable juice, see 10.32 - manufacture of milk-based drinks, see 10.51 - manufacture of coffee, tea and maté products, see 10.83 - manufacture of alcohol-based drinks, see 11.01, 11.02, 11.03, 11.04, 11.05 - manufacture of non-alcoholic wine, see 11.02 - manufacture of non-alcoholic beer, see 11.05 - manufacture of ice, see 35.30 - merely bottling and labelling, see 46.34 (if performed as part of wholesale) and 82.92 (if performed on a fee or contract basis) @en
scope note: Esta clase comprende la elaboración de bebidas no alcohólicas (excepto la cerveza y el vino sin alcohol): - la producción de aguas minerales naturales y otras aguas embotelladas; - la producción de bebidas no alcohólicas: • la producción de bebidas no alcohólicas aromatizadas o azucaradas: limonada, naranjada, cola, bebidas de frutas, aguas tónicas, etc. Esta clase no comprende: - la producción de zumos de frutas y verduras (véase 10.32); - la producción de bebidas a base de leche (véase 10.51); - la elaboración de productos a base de café, té y hierba mate (véase 10.83); - la fabricación de bebidas con una base alcohólica (véase 11.01, 11.02, 11.03, 11.04, 11.05); - la elaboración de vinos no alcohólicos (véase 11.02); - la elaboración de cerveza sin alcohol (véase 11.05); - la fabricación de hielo (véase 35.30); - las tareas específicas de embotellado y etiquetado (véase 46.34 si se realizan como parte de la venta al por mayor, y 82.92, si se ejecutan por cuenta de terceros). @es
scope note: Cette classe comprend la fabrication de boissons non alcoolisées (à l’exception de la bière et du vin sans alcool): - la production d’eaux minérales naturelles et d’autres eaux embouteillées - la production de boissons rafraîchissantes: • boissons non alcoolisées édulcorées et/ou aromatisées: citronnade, orangeade, cola, boissons à base de fruits, tonics, etc. Cette classe ne comprend pas: - la production de jus de fruits et de légumes, voir 10.32 - la production de boissons à base de lait, voir 10.51 - la fabrication de produits à base de café, de thé et de maté, voir 10.83 - la production de boissons alcoolisées, voir 11.01, 11.02, 11.03, 11.04 et 11.05 - la production de vins sans alcool, voir 11.02 - la production de bières sans alcool, voir 11.05 - la fabrication de glace, voir 35.30 - l’embouteillage et l’étiquetage simples, voir 46.34 (dans le cadre du commerce de gros) et 82.92 (pour le compte de tiers) @fr
scope note: Ovaj razred uključuje proizvodnju bezalkoholnih napitaka (osim bezalkoholne pive i vina): - proizvodnju prirodne mineralne vode i ostale flaširane vode - proizvodnju osvježavajućih napitaka: • bezalkoholne aromatizirane ili zaslađene vode: limunade, oranžade, kole, ledenih čajeva, tonika itd. Ovaj razred isključuje: - proizvodnju soka od voća i povrća, vidi 10.32 - proizvodnju na mlijeku baziranih pića, vidi 10.51 - proizvodnju proizvoda od kave, čaja i matea, vidi 10.83 - proizvodnju napitaka kojima je baza alkohol, vidi 11.01, 11.02, 11.03, 11.04, 11.05 - proizvodnju bezalkoholnog vina, vidi 11.02 - proizvodnju bezalkoholnog piva, vidi 11.05 - proizvodnju leda, vidi 35.30 - flaširanje i etiketiranje, vidi 46.34 (ako se obavlja u sklopu veletrgovine) i 82.92 (ako se obavlja uz naplatu ili na osnovi ugovora)
scope note: Į šią klasę įeina nealkoholinių gėrimų, išskyrus nealkoholinį alų ir vyną, gamyba: - natūralaus mineralinio ir kito, pilstomo į butelius, vandens gamyba - nealkoholinių gėrimų gamyba: • nealkoholinių aromatizuotų ir (arba) pasaldintų gėrimų: limonado, oranžado (apelsinų gėrimo), kolos, vaisvandenių, tonizuojančiojo vandens ir kt. Į šią klasę neįeina: - vaisių, uogų ir daržovių sulčių gamyba, žr. 10.32 - pieno gėrimų gamyba, žr. 10.51 - kavos, arbatos ir matės produktų gamyba, žr. 10.83 - alkoholinių gėrimų gamyba žr. 11.01, 11.02, 11.03, 11.04, 11.05 - nealkoholinio vyno gamyba, žr. 11.02 - nealkoholinio alaus gamyba, žr. 11.05 - ledo gamyba, žr. 35.30 - pilstymas į butelius ir ženklinimas, žr. 46.34 (jei yra neatsiejama didmeninės prekybos dalis) ir 82.92 (jei atliekama už atlygį ar pagal sutartį) @lt
scope note: Этот класс включает: - производство табачных изделий и их заменителей: сигарет, сигар, табака для курительных трубок, жевательного и нюхательного табака - производство «гомогенизированных» или «очищенных» табачных изделий Этот класс также включает: - нарезку и повторную сушку табачных изделий Этот класс исключает: - выращивание или первичную переработку табачных изделий, см. 01.15, 01.63 @ru
scope note: Bu sınıf alkolsüz içeceklerin üretilmesini kapsamaktadır (alkolsüz bira ve şarap hariç): - doğal maden suyu ve diğer şişelenmiş suların üretimi, - alkolsüz içecek üretimi; • aromalı ve/veya tatlandırılmış alkolsüz sular: limonata, portakal şurubu, kola, meyveli içecekler, tonik vb. Kapsam dışı olanlar; - meyve ve sebze suyu üretimi, bkz. 10.32, - süt temelli içeceklerin üretimi, bkz. 10.51, - kahve, çay ve Paraguay çayı üretimi, bkz. 10.83, - alkol temelli içkilerin üretimi, bkz, 11.01, 11.02, 11.03, 11.04 ve 11.05 - alkolsüz şarap üretimi, bkz. 11.02, - alkolsüz bira üretimi, bkz. 11.05, - buz üretimi, bkz. 35.30, - sadece şişeleme ve etiketleme, bkz. 46.34 (toptancılığın bir parçası olarak gerçekleştirildiğinde) ve bkz. 82.92 (bir ücret veya sözleşme neticesinde gerçekleştirildiğinde). @tr
preferred label: Производство на безалкохолни напитки, минерални и други бутилирани води @bg
preferred label: Výroba nealkoholických nápojů; stáčení minerálních a ostatních vod do lahví @cs
preferred label: Fremstilling af læskedrikke; fremstilling af mineralvand og andet vand på flaske @da
preferred label: Herstellung von Erfrischungsgetränken; Gewinnung natürlicher Mineralwässer @de
preferred label: Παραγωγή αναψυκτικών· παραγωγή μεταλλικού νερού και άλλων εμφιαλωμένων νερών @el
preferred label: Fabricación de bebidas no alcohólicas; producción de aguas minerales y otras aguas embotelladas @es
preferred label: Alkoholivaba joogi tootmine; mineraalvee ja muu villitud vee tootmine @et
preferred label: Virvoitusjuomien valmistus; kivennäisvesien ja muiden pullotettujen vesien tuotanto @fi
preferred label: Industrie des eaux minérales et autres eaux embouteillées et des boissons rafraîchissantes @fr
preferred label: Üdítőital, ásványvíz gyártása
preferred label: Produzione di bibite analcoliche, di acque minerali e di altre acque in bottiglia @it
preferred label: Gaiviųjų gėrimų gamyba; Mineralinio ir kito, pilstomo į butelius, vandens gamyba @lt
preferred label: Bezalkohola dzērienu ražošana; minerālūdeņu un pudelēs iepildītu citu ūdeņu ražošana @lv
preferred label: Manifattura ta' soft drinks; produzzjoni ta' ilmijiet minerali u ilmijiet oħra tal-fliexken @mt
preferred label: Vervaardiging van frisdranken; productie van mineraalwater en ander gebotteld water @nl
preferred label: Produksjon av mineralvann, leskedrikker og annet vann på flaske @no
preferred label: Produkcja napojów bezalkoholowych; produkcja wód mineralnych i pozostałych wód butelkowanych @pl
preferred label: Produção de bebidas refrescantes não alcoólicas; produção de águas minerais e de outras águas engarrafadas @pt
preferred label: Producţia de băuturi răcoritoare nealcoolice; producţia de ape minerale şi alte ape îmbuteliate @ro
preferred label: Производство безалкогольных напитков; производство минеральных вод и других вод в бутылках @ru
preferred label: Výroba nealkoholických nápojov; produkcia minerálnych vôd a iných fľaškových vôd @sk
preferred label: Proizvodnja brezalkoholnih pijač, mineralnih in drugih stekleničenih vod @sl
preferred label: Framställning av läskedrycker, mineralvatten och annat vatten på flaska @sv
preferred label: Alkolsüz içeceklerin imalatı; maden sularının ve diğer şişelenmiş suların üretimi @tr
broader: Manufacture of beverages

Manufacture of tobacco products
type: Concept
notation: 12
status: valid
status modified: 2013-10-18
accepted date: 2013-10-18
in scheme: Statistical Classification of Economic Activities in the European Community, Rev. 2 (2008)
scope note: Този раздел включва преработката на тютюн в изделия годни за крайна консумация @bg
scope note: Tento oddíl zahrnuje zpracování zemědělského produktu – tabák, na produkt vhodný ke konečné spotřebě. @cs
scope note: Diese Abteilung umfasst die Verarbeitung von Tabak zu einer für den Konsum geeigneten Ware. @de
scope note: This division includes the processing of an agricultural product, tobacco, into a form suitable for final consumption. @en
scope note: Esta división comprende la transformación de un producto agrario, el tabaco, en una forma adecuada para su consumo final. @es
scope note: Cette division comprend la transformation d’un produit agricole, le tabac, en un produit propre à la consommation finale. @fr
scope note: Ovaj odjeljak uključuje uzgoj i obradu duhana u oblik prikladan za konačnu potrošnju.
scope note: Į ši skyrių įeina žemės ūkio produkto - tabako - perdirbimas į galutiniam vartojimui tinkamą produktą. @lt
scope note: Данный раздел включает подготовку и прядение текстильных волокнистых, а также текстильных тканных и готовых текстильных изделий, отделку текстильных изделий и одежды, производство готовых текстильных изделий, за исключением одежды (например, домашнего белья, одеял, покрывал, веревок и т.д.). Выращивание природного волокнистого материала приведено в разделе 01, в то время как производство синтетических волокон, получаемых в процессе химического производства, классифицировано в классе 20.60. Производство одежды описано в разделе 14. @ru
scope note: Bu bölüm, bir tarım ürününün, tütünün, işlenerek nihai tüketim için uygun bir biçime dönüştürülmesini kapsamaktadır. @tr
preferred label: Производство на тютюневи изделия @bg
preferred label: Výroba tabákových výrobků @cs
preferred label: Fremstilling af tobaksprodukter @da
preferred label: Tabakverarbeitung @de
preferred label: Παραγωγή προϊόντων καπνού @el
preferred label: Industria del tabaco @es
preferred label: Tubakatoodete tootmine @et
preferred label: Tupakkatuotteiden valmistus @fi
preferred label: Fabrication de produits à base de tabac @fr
preferred label: Dohánytermék gyártása
preferred label: Industria del tabacco @it
preferred label: Tabako gaminių gamyba @lt
preferred label: Tabakas izstrādājumu ražošana @lv
preferred label: Manifattura ta' prodotti tat-tabakk @mt
preferred label: Vervaardiging van tabaksproducten @nl
preferred label: Produksjon av tobakksvarer @no
preferred label: Produkcja wyrobów tytoniowych @pl
preferred label: Indústria do tabaco @pt
preferred label: Fabricarea produselor din tutun @ro
preferred label: Производство табачных изделий @ru
preferred label: Výroba tabakových výrobkov @sk
preferred label: Proizvodnja tobačnih izdelkov @sl
preferred label: Tobaksvarutillverkning @sv
preferred label: Tütün ürünleri imalatı @tr
broader: MANUFACTURING
narrower: Manufacture of tobacco products

Manufacture of tobacco products
type: Concept
notation: 12.0
status: valid
status modified: 2013-10-18
accepted date: 2013-10-18
in scheme: Statistical Classification of Economic Activities in the European Community, Rev. 2 (2008)
preferred label: Производство на тютюневи изделия @bg
preferred label: Výroba tabákových výrobků @cs
preferred label: Fremstilling af tobaksprodukter @da
preferred label: Tabakverarbeitung @de
preferred label: Παραγωγή προϊόντων καπνού @el
preferred label: Industria del tabaco @es
preferred label: Tubakatoodete tootmine @et
preferred label: Tupakkatuotteiden valmistus @fi
preferred label: Fabrication de produits à base de tabac @fr
preferred label: Dohánytermék gyártása
preferred label: Produzione di tabacchi @it
preferred label: Tabako gaminių gamyba @lt
preferred label: Tabakas izstrādājumu ražošana @lv
preferred label: Manifattura ta' prodotti tat-tabakk @mt
preferred label: Vervaardiging van tabaksproducten @nl
preferred label: Produksjon av tobakksvarer @no
preferred label: Produkcja wyrobów tytoniowych @pl
preferred label: Indústria do tabaco @pt
preferred label: Fabricarea produselor din tutun @ro
preferred label: Производство табачных изделий @ru
preferred label: Výroba tabakových výrobkov @sk
preferred label: Proizvodnja tobačnih izdelkov @sl
preferred label: Tobaksvarutillverkning @sv
preferred label: Tütün ürünleri imalatı @tr
broader: Manufacture of tobacco products
narrower: Manufacture of tobacco products

Manufacture of tobacco products
type: Concept
notation: 12.00
status: valid
status modified: 2013-10-18
accepted date: 2013-10-18
in scheme: Statistical Classification of Economic Activities in the European Community, Rev. 2 (2008)
scope note: - производство на тютюневи изделия и изделия от заместители на тютюна: цигари, пури, тютюн за лула, за дъвчене или за смъркане (емфие) - производство на „хомогенизиран“ или „възстановен“ тютюн - обезжилване и повторно сушене на тютюн - отглеждане или първична обработка на тютюна - 01.15, 01.63 @bg
scope note: Z: - výrobu tabákových výrobků a tabákových náhražek: cigaret, doutníků, cigaretového tabáku a dýmkového tabáku, žvýkacího tabáku, šňupacího tabáku - výrobu „homogenizovaného“ nebo „rekonstituovaného“ tabáku: ZT: - odřapíkování a znovuusušení tabáku N: - pěstování tabáku nebo příprava, předzpracování tabáku (01.15, 01.63) @cs
scope note: Diese Klasse umfasst: - Herstellung von Erzeugnissen aus Tabak und Tabakersatzstoffen: Zigaretten, Zigarren, Feinschnitt und Pfeifentabake, Kautabak, Schnupftabak - Herstellung von "homogenisiertem" oder "rekonstituiertem" Tabak Diese Klasse umfasst ferner: - Entrippen und Redrying von Tabak Diese Klasse umfasst nicht: - Anbau von Tabak und Trocknen von Tabakblättern (s. 01.15, 01.63) @de
scope note: This class includes: - manufacture of tobacco products and products of tobacco substitutes: cigarettes, fine cut tobacco, cigars, pipe tobacco, chewing tobacco, snuff - manufacture of "homogenised" or "reconstituted" tobacco This class also includes: - stemming and redrying of tobacco This class excludes: - growing or preliminary processing of tobacco, see 01.15, 01.63 @en
scope note: Esta clase comprende: - la elaboración de productos de tabaco y sucedáneos del tabaco: cigarrillos, tabaco de picadura fina, cigarros puros, tabaco de pipa, tabaco para mascar y rapé; - la elaboración de tabaco homogeneizado o reconstituido. Esta clase comprende también: - el desvenado y resecado del tabaco. Esta clase no comprende: - el cultivo o tratamiento preliminar del tabaco (véase 01.15 y 01.63). @es
scope note: Cette classe comprend: - la fabrication de produits à base de tabac et de succédanés du tabac: cigarettes, tabac à fine coupe, cigares, tabacs à pipe, tabacs à mâcher, tabacs à priser - la fabrication de tabacs "homogénéisés" ou "reconstitués" Cette classe comprend également: - l’écôtage et le resséchage du tabac Cette classe ne comprend pas: - la culture ou le traitement préliminaire du tabac, voir 01.15 et 01.63 @fr
scope note: Ovaj razred uključuje: - proizvodnju duhanskih proizvoda i njegovih nadomjestaka: cigareta, duhanskih cigareta, cigara, duhana za lulu, duhana za žvakanje, duhana za šmrkanje - proizvodnju "homogeniziranog" ili "rekonstruiranog" duhana Ovaj razred također uključuje: - ižiljavanje i ponovno sušenje duhana Ovaj razred isključuje: - uzgoj i primarnu preradu duhana, vidi 01.15, 01.63
scope note: Į šią klasę įeina: - tabako gaminių ir tabako pakaitalų: cigarečių, smulkiai pjaustyto tabako, cigarų, pypkinio tabako, kramtomojo tabako, uostomojo tabako, gamyba - „homogenizuoto“ ar „atkurto“ tabako gamyba Į šią klasę taip pat įeina: - tabako kotelių nuskabymas ir pakartotinis džiovinimas Į šią klasę neįeina: - tabako auginimas ar pirminis apdorojimas, žr. 01.15, 01.63 @lt
scope note: Данный класс включает подготовку и прядение текстильных волокон. Данные материалы могут производиться из различного сырья, такого как шелк, шерсть, другие животные, растительные и искусственные волокна, бумага или стекловолокно и т.д. Этот класс включает: - подготовка текстильных волокон: • волочение и промывку шелкового волокна • обезжиривание и карбонизацию шерсти, окраску руна • растягивание и расчесывание всех видов волокна животного, растительного и искусственного происхождения - прядение и производство пряжи из шерсти для ткацкой или швейной промышленности, для продажи или дальнейшей переработки • трепание льна • текстурирование, скручивание пряжи, складывание, свивание и вымачивание синтетической или искусственной пряжи Этот класс также включает: - производство бумажной пряжи Этот класс исключает: - операции по подготовке, осуществляемые в сочетании с сельскохозяйственными работами, см. раздел 01 - мочку растений, содержащих растительное текстильное волокно (джут, лен, кокосовое волокно и т.д.), см. 01.16 - очистку хлопка от семян, см. 01.63 - производство синтетических или искусственных волокон и очесов из них, производство одинарной пряжи (включая высокопрочную пряжу и пряжу для ковров) из синтетических или искусственных волокон, see 20.60 - производство стекловолокна, см. 23.14 @ru
scope note: Bu sınıf aşağıdakileri kapsamaktadır; - tütün ürünlerinin ve tütün yerine ikame edilen ürünlerin imalatı: sigara, sigara tütünü, puro, puro tütünü, çiğneme tütünü, enfiye imalatı, - homojenize edilmiş tütün veya harmanlanmış tütün imalatı, Ayrıca bu sınıf aşağıdakileri de kapsamaktadır; - tütünün sıkılması ve tekrar kurutulması. Kapsam dışı olanlar; - tütünün yetiştirilmesi veya ön hazırlık işlenmesi, bkz. 01.15, 01.63. @tr
preferred label: Производство на тютюневи изделия @bg
preferred label: Výroba tabákových výrobků @cs
preferred label: Fremstilling af tobaksprodukter @da
preferred label: Tabakverarbeitung @de
preferred label: Παραγωγή προϊόντων καπνού @el
preferred label: Industria del tabaco @es
preferred label: Tubakatoodete tootmine @et
preferred label: Tupakkatuotteiden valmistus @fi
preferred label: Fabrication de produits à base de tabac @fr
preferred label: Dohánytermék gyártása
preferred label: Produzione di tabacchi @it
preferred label: Tabako gaminių gamyba @lt
preferred label: Tabakas izstrādājumu ražošana @lv
preferred label: Manifattura ta' prodotti tat-tabakk @mt
preferred label: Vervaardiging van tabaksproducten @nl
preferred label: Produksjon av tobakksvarer @no
preferred label: Produkcja wyrobów tytoniowych @pl
preferred label: Indústria do tabaco @pt
preferred label: Fabricarea produselor din tutun @ro
preferred label: Производство табачных изделий @ru
preferred label: Výroba tabakových výrobkov @sk
preferred label: Proizvodnja tobačnih izdelkov @sl
preferred label: Tobaksvarutillverkning @sv
preferred label: Tütün ürünleri imalatı @tr
broader: Manufacture of tobacco products

Manufacture of textiles
type: Concept
notation: 13
status: valid
status modified: 2013-10-18
accepted date: 2013-10-18
in scheme: Statistical Classification of Economic Activities in the European Community, Rev. 2 (2008)
scope note: подготовка и предене на текстилни влакна, производство на прежди, конци и платове (тъкани, плетени и други); облагородяване на текстил и облекло; производство на текстилни изделия, без облекло, например спално бельо, одеяла, килими, канапи и други. - отглеждане на влакнодайни растения - раздел 01 - производство на изкуствени и синтетични влакна - клас 20.60 - производство на облекло - раздел 14 @bg
scope note: Tento oddíl zahrnuje úpravu a spřádání textilních vláken, tkaní a konečnou úpravu textilií a oděvů, výrobu konfekčních textilních výrobků kromě oděvů (např. ložního a stolního prádla, přikrývek, koberců, provaznického zboží atd.). Pěstování přírodních vláken je zařazeno do oddílu 01, avšak výroba syntetických vláken je chemický proces klasifikovaný do třídy 20.60. Výroba oděvů je zahrnuta v oddílu 14. @cs
scope note: Diese Abteilung umfasst Spinnstoffaufbereitung und Spinnerei, Weberei, Veredlung von Textilien und Bekleidung, Herstellung von konfektionierten Textilwaren außer Bekleidung (z. B. Hauswäsche, Decken, Vorleger, Seilerwaren usw.). Der Anbau natürlicher Fasern ist in Abteilung 01 eingeordnet, die Herstellung von synthetischen Fasern als chemisches Verfahren jedoch in Klasse 20.60. Die Herstellung von Bekleidung ist Gegenstand von Abteilung 14. @de
scope note: This division includes preparation and spinning of textile fibres as well as textile weaving, finishing of textiles and wearing apparel, manufacture of made-up textile articles, except apparel (e.g. household linen, blankets, rugs, cordage etc.). Growing of natural fibres is covered under division 01, while manufacture of synthetic fibres is a chemical process classified in class 20.60. Manufacture of wearing apparel is covered in division 14. @en
scope note: Esta división comprende la preparación e hilado de fibras textiles, así como de tejidos textiles, el acabado de textiles y prendas de vestir, la fabricación de artículos confeccionados con textiles, excepto prendas (como ropa blanca, mantas, alfombras, cuerdas, etc.). El cultivo de fibras naturales corresponde a la división 01, mientras que la fabricación de fibras sintéticas es un proceso químico clasificado en la clase 20.60. La fabricación de prendas de vestir se considera en la división 14. @es
scope note: Cette division comprend la préparation et la filature de fibres textiles ainsi que le tissage, l’ennoblissement de textiles et d’articles vestimentaires, la fabrication d’articles confectionnés en matières textiles à l’exception des articles vestimentaires (par exemple: linge de maison, couvertures, tapis, ficelles, etc.). La production de fibres naturelles relève de la division 01, tandis que la fabrication de fibres synthétiques est une opération chimique qui doit être rangée dans la classe 20.60. L’industrie de l’habillement relève de la division 14. @fr
scope note: Ovaj odjeljak uključuje pripremanje i predenje tekstilnih vlakana i tekstilnih tkanina, dovršavanje tekstila i odjeće, proizvodnju gotovih tekstilnih proizvoda, osim odjeće (npr. rublja za kućanstvo, pokrivača, sagova, užadi itd.). Uzgoj prirodnih vlakana pripada odjeljku 01, dok je proizvodnja sintetičkih vlakana kemijski proces koji se razvrstava u razred 20.60. Proizvodnja odjeće razvrstava se u odjeljak 14.
scope note: Į šį skyrių įeina tekstilinių pluoštų paruošimas ir verpimas, taip pat audimas, tekstilės ir drabužių apdaila, gatavų tekstilės gaminių, išskyrus drabužius, (pvz., buitinių skalbinių, antklodžių, patiesalų, kilimėlių, pledų, suktinių gaminių ir kt.) gamyba. Natūraliųjų pluoštų auginimas klasifikuojamas 01 skyriuje, tačiau sintetinių pluoštų gamyba yra cheminis procesas, klasifikuojamas 20.60 klasėje. Drabužių siuvimas (gamyba) yra klasifikuojamas 14 skyriuje. @lt
scope note: Bu bölüm tekstilin dokunması da dahil tekstil elyafının hazırlanması ve bükülmesi; tekstil ve giyim eşyalarının aprelenmesi, boyanması vb. bitirme işlemleri ile tekstil ürünlerinin imalatını (ev tekstil ürünleri, battaniyeler, halılar, kilimler, kordon, halat, ip vb.kapsamaktadır (giyim eşyalarının imalatı hariç). Sentetik elyafın imalatı kimyasal bir işlem olduğundan sınıf 20.60 içerisinde sınıflandırılırken, lifli bitkilerin yetiştirilmesi (doğal elyaf) bölüm 01 içerisinde sınıflandırılmıştır. Giyim eşyalarının imalatı, bölüm 14 de sınıflandırılmıştır. @tr
preferred label: Производство на текстил и изделия от текстил, без облекло @bg
preferred label: Výroba textilií @cs
preferred label: Fremstilling af tekstiler @da
preferred label: Herstellung von Textilien @de
preferred label: Παραγωγή κλωστοϋφαντουργικών υλών @el
preferred label: Industria textil @es
preferred label: Tekstiilitootmine @et
preferred label: Tekstiilien valmistus @fi
preferred label: Fabrication de textiles @fr
preferred label: Textília gyártása
preferred label: Industrie tessili @it
preferred label: Tekstilės gaminių gamyba @lt
preferred label: Tekstilizstrādājumu ražošana @lv
preferred label: Manifattura ta' tessuti @mt
preferred label: Vervaardiging van textiel @nl
preferred label: Produksjon av tekstiler @no
preferred label: Produkcja wyrobów tekstylnych @pl
preferred label: Fabricação de têxteis @pt
preferred label: Fabricarea produselor textile @ro
preferred label: Производство текстильных изделий @ru
preferred label: Výroba textilu @sk
preferred label: Proizvodnja tekstilij @sl
preferred label: Textilvarutillverkning @sv
preferred label: Tekstil ürünlerinin imalatı @tr
broader: MANUFACTURING
narrower: Preparation and spinning of textile fibres
narrower: Weaving of textiles
narrower: Finishing of textiles
narrower: Manufacture of other textiles

Preparation and spinning of textile fibres
type: Concept
notation: 13.1
status: valid
status modified: 2013-10-18
accepted date: 2013-10-18
in scheme: Statistical Classification of Economic Activities in the European Community, Rev. 2 (2008)
scope note: Этот класс включает тканье текстильных изделий. Данные материалы могут производиться из различного сырья, такого как шелк, шерсть, другие животные, растительные и искусственные волокна, бумага или стекловолокно и т.д. Этот класс включает: - производство хлопчатобумажной, шерстяной, камвольной или шелковой ткани, включая смешанную, искусственную или синтетическую пряжу (полипропилен и т.д.) - производство прочих тканей, например, из льна, китайской крапивы, конопли, джута, лыка и специальной пряжи Этот класс также включает: - производство тканых материалов, таких как синель, махровая ткань, марля и т.д. - производство тканей из стекловолокна - производство карбонидных и арамидных нитей - производство искусственного меха ткацким способом Этот класс исключает: - производство вязаных и трикотажных тканей, см. 13.91 - производство текстильных половых покрытий, см. 13.93 - производство нетканых тканей, см. 13.95 - производство тисненых тканей, см. 13.96 - производство войлока и фетра, см. 13.99 @ru
preferred label: Подготовка и предене на текстилни влакна @bg
preferred label: Úprava a spřádání textilních vláken a příze @cs
preferred label: Forbehandling og spinding af tekstilfibre @da
preferred label: Spinnstoffaufbereitung und Spinnerei @de
preferred label: Προπαρασκευή και νηματοποίηση υφαντικών ινών @el
preferred label: Preparación e hilado de fibras textiles @es
preferred label: Tekstiilkiudude ettevalmistamine ja ketramine @et
preferred label: Tekstiilikuitujen valmistelu ja kehruu @fi
preferred label: Préparation de fibres textiles et filature @fr
preferred label: Textilszálak fonása
preferred label: Preparazione e filatura di fibre tessili @it
preferred label: Tekstilės pluoštų paruošimas ir verpimas @lt
preferred label: Tekstilšķiedru sagatavošana un vērpšana @lv
preferred label: Tħejjija u għażil ta' fibri tat-tessuti @mt
preferred label: Bewerken en spinnen van textielvezels @nl
preferred label: Bearbeiding og spinning av tekstilfibrer @no
preferred label: Przygotowanie i przędzenie włókien tekstylnych @pl
preferred label: Preparação e fiação de fibras têxteis @pt
preferred label: Pregătirea fibrelor şi filarea fibrelor textile @ro
preferred label: Подготовка и прядение текстильных волокон @ru
preferred label: Príprava a spriadanie textilných vlákien @sk
preferred label: Priprava in predenje tekstilnih vlaken @sl
preferred label: Garntillverkning @sv
preferred label: Tekstil elyafın hazırlanması ve bükülmesi @tr
broader: Manufacture of textiles
narrower: Preparation and spinning of textile fibres

Preparation and spinning of textile fibres
type: Concept
notation: 13.10
status: valid
status modified: 2013-10-18
accepted date: 2013-10-18
in scheme: Statistical Classification of Economic Activities in the European Community, Rev. 2 (2008)
scope note: Този клас включва подготвителни операции и предене на текстилните влакна по съответни технологии. Използват се разнообразни текстилни суровини като: памук и други растителни влакна; коприна, вълна и други животински влакна; химични (изкуствени и синтетични) влакна; хартия; стъкло и други. - подготвителни операции за предене на текстилни влакна: • свилоточене (източване и навиване на гранки на копринената нишка) и пране на естествена коприна • обезмазняване, карбонизиране и боядисване на вълна • влачене и изресване (пениране) на всякакъв вид животински, растителни или химични влакна - предене и производство на прежди или конци за тъкане, плетене или шиене, предназначени за търговската мрежа или за последваща преработка • очукване (мънене, швинговане) на лен • текстуриране, скатяване, усукване, пресукване и боядисване чрез потапяне на прежди от изкуствени или синтетични нишки - производство на хартиена прежда - подготвителни операции, които се осъществяват в комбинация с растениевъдството - раздел 01 - топене (отопяване) на влакнодайни растения (юта, лен, влакна от кокосов орех и други) - 01.16 - отделяне на семената от памука - 01.63 - производство на изкуствени или синтетични влакна и кабели, производство на изкуствени или синтетични нишки (вкл. с висока здравина и за килими) - 20.60 - производство на стъклени влакна - 23.14 - производство на азбестова прежда - 23.99 @bg
scope note: Tato třída zahrnuje postupy úpravy a spřádání textilních vláken. K tomu jsou vhodné různé suroviny, např. hedvábí, vlna a jiná rostlinná, živočišná a umělá vlákna, papír, skleněná vlákna atd. Z: - postupy úpravy textilních vláken: • navíjení a praní hedvábí • odmaštění a karbonizace vlny a barvení vlněného rouna • mykání a česání (všech druhů) živočišných, rostlinných a umělých vláken - spřádání a výrobu vlákna, příze nebo nití pro tkaní nebo šití, pro obchod, nebo k dalšímu zpracovávání • tření lnu • tvarování přízí, skaní, skládání (řasení), kabeláž a smáčení syntetických nebo umělých filamentových přízí z chemického hedvábí ZT: - výrobu papírových vláken N: - předběžné provozní činnosti uskutečněné ve spojení s zemědělstvím (01) - máčení přadných rostlin (juty, lnu, kokosu atd.) (01.16) - vyzrňování bavlny (01.63) - výrobu syntetických nebo umělých vláken a koudele, výrobu jednotlivých vláken (přízí) (včetně vysoce pevných přízí a kobercových přízí) (20.60) - výrobu skleněných vláken (23.14) @cs
scope note: Diese Klasse umfasst die Vorgänge des Aufbereitens auf textilen Fasern und das Verspinnen von Spinnstoffen. Dazu eignen sich unterschiedliche Rohstoffe, z. B. Seide, Wolle und andere tierische, pflanzliche und Kunstfasern, Papier, Glasfasern usw. Diese Klasse umfasst: - Aufbereitungsvorgänge an Spinnstoffen: • Haspeln und Waschen von Seide • Entfetten und Karbonisieren von Wolle und Färben von Wollvlies • Kardieren und Kämmen von tierischen, pflanzlichen und Kunstfasern - Spinnen und Herstellung von Garn zum Weben oder von Nähgarn, als Handelsware oder zur Weiterverarbeitung • Schwingen von Flachs • Texturieren, Zwirnen, Fachen, Drehen, Tauchfärben von synthetischen oder künstlichen Filamentgarnen Diese Klasse umfasst ferner: - Herstellung von Papiergarn Diese Klasse umfasst nicht: - Aufbereitungsvorgänge, die von der Landwirtschaft durchgeführt werden (s. Abteilung 01) - Rösten von Faserpflanzen (Flachs, Jute, Kokos usw.) (s. 01.16) - Baumwollentkörnung (s. 01.63) - Herstellung von synthetischen oder künstlichen Fasern und Fasergarnen, Herstellung von synthetischen oder künstlichen Filamentgarnen (einschließlich hochfesten Garnen und Teppichgarnen) (s. 20.60) - Herstellung von Glasfasern (s. 23.14) @de
scope note: This class includes preparatory operations on textile fibres and the spinning of textile fibres. This can be done from varying raw materials, such as silk, wool, other animal, vegetable or man-made fibres, paper or glass etc. This class includes: - preparatory operations on textile fibres: • reeling and washing of silk • degreasing and carbonising of wool and dyeing of wool fleece • carding and combing of all kinds of animal, vegetable and man-made fibres - spinning and manufacture of yarn or thread for weaving or sewing, for the trade or for further processing • scutching of flax • texturising, twisting, folding, cabling and dipping of synthetic or artificial filament yarns This class also includes: - manufacture of paper yarn This class excludes: - preparatory operations carried out in combination with agriculture, see division 01 - retting of plants bearing vegetable textile fibres (jute, flax, coir etc.), see 01.16 - cotton ginning, see 01.63 - manufacture of synthetic or artificial fibres and tows, manufacture of single yarns (including high-tenacity yarn and yarn for carpets) of synthetic or artificial fibres, see 20.60 - manufacture of glass fibres, see 23.14 @en
scope note: .10 Preparación e hilado de fibras textiles Esta clase comprende las operaciones preparatorias sobre fibras textiles y el hilado de fibras textiles. Esta tarea puede realizarse a partir de diversas materias primas, como la seda, la lana, otras fibras animales, vegetales o artificiales y sintéticas, papel, vidrio, etc. Esta clase comprende: - las operaciones preparatorias de fibras textiles: • devanado y lavado de la seda; • desuardado y carbonizado de la lana y teñido de vellones; • cardado y peinado de todo tipo de fibras animales, vegetales y artificiales y sintéticas; - hilado y fabricación de filamento o hilo para tejer o coser, para su comercialización o para un tratamiento ulterior; • espadado del lino; • texturado, torsión, plegado, cableado e inmersión de filamentos sintéticos y artificiales. Esta clase comprende también: - la fabricación de hilo de papel. Esta clase no comprende: - las operaciones preparatorias llevadas a cabo en combinación con la agricultura (véase división 01); - el enriado de plantas portadoras de fibras textiles vegetales (yute, lino, coco, etc.) (véase 01.16); - el desmotado de algodón (véase 01.63); - la fabricación de fibras y estopas sintéticos o artificiales, la fabricación de hilos sencillos (incluidos los hilos de alta tenacidad y el hilo para alfombras y tapices) de fibras sintéticas o artificiales (véase 20.60); - la fabricación de fibras de vidrio (véase 23.14). @es
scope note: Cette classe comprend les activités de préparation et la filature des fibres textiles. Les matières premières peuvent varier: soie, laine, fibres d’origine animale ou végétale ou fibres artificielles ou synthétiques, papier ou verre, etc. Cette classe comprend: - les activités de préparation des fibres textiles: • tirage et lavage de la soie • dégraissage et carbonisage de la laine et teinture de la laine de tonte • cardage et peignage de tout type de fibres d’origine animale, végétale ou de fibres artificielles ou synthétiques - la filature et la fabrication de filés et de fils pour le tissage ou la couture, pour la vente ou pour traitement ultérieur • le teillage du lin • la texturation, le retordage, l’assemblage à torsion zéro, le câblage et le foulardage de fils de filaments synthétiques ou artificiels Cette classe comprend également: - la fabrication de fils de papier Cette classe ne comprend pas: - les opérations préparatoires effectuées en combinaison avec l’agriculture, voir division 01 - le rouissage des végétaux donnant des fibres textiles telles que le jute, le lin ou le coir, voir 01.16 - l’égrenage du coton, voir 01.63 - la fabrication de fibres et de câbles synthétiques ou artificiels, la fabrication de fils simples (y compris les fils à haute ténacité et les fils pour tapis) de fibres synthétiques ou artificielles, voir 20.60 - la fabrication de fibres de verre, voir 23.14 @fr
scope note: Ovaj razred uključuje pripremne radnje za predenje tekstilnih vlakana. To se može činiti s pomoću različitih sirovina kao što su svila ili vuna, pomoću vlakana životinjskog, biljnog ili umjetnog podrijetla, te papira ili stakla itd. Ovaj razred uključuje: - pripremne radnje na tekstilnim vlaknima: • namatanje i pranje svile • odmašćivanje i karbonizaciju vune te bojenje runa • grebenanje i češljanje svih vrsta vlakana, bilo životinjskog, biljnog ili umjetnog podrijetla - predenje i proizvodnja pređe i konca za tkanje ili šivanje za prodaju ili daljnju proizvodnju • trljanje lana • teksturiranje, uvijanje, slaganje, uvrtanje i močenje prediva od sintetičnih i umjetnih filamenata Ovaj razred također uključuje: - proizvodnju papirnate pređe Ovaj razred isključuje: - pripremne radnje koje se obavljaju u kombinaciji s poljoprivredom, vidi odjeljak 01 - močenje biljaka koje sadrže biljna tekstilna vlakna (juta, lan, kokosovo vlakno itd.), vidi 01.16 - čišćenje pamuka od sjemenja, vidi 01.63 - proizvodnju sintetičkih ili umjetnih vlakana, proizvodnju jednostrukih pređa (uključujući visokootpornu pređu i pređu za sagove) od umjetnih i sintetičkih vlakana, vidi 20.60 - proizvodnju staklenih vlakana, vidi 23.14
scope note: Į šią klasę įeina tekstilės pluoštų paruošimo operacijos ir jų verpimas. Šioms operacijoms atlikti gali būti naudojamos įvairios žaliavos, tokios kaip šilkas, vilna, kiti gyvūniniai, augaliniai arba cheminiai pluoštai, popierius ar stiklas ir kt. Į šią klasę įeina: - tekstilės pluoštų paruošimas: • kokonų išvijimas ir plovimas • vilnų riebalų šalinimas, karbonizavimas ir dažymas • įvairių gyvūninių, augalinių ir cheminių pluoštų karšimas ir šukavimas - verpalų arba siūlų, skirtų austi arba siūti, mažmeninei ir didmeninei prekybai arba tolimesniam perdirbimui, verpimas ir gamyba • linų brukimas • sintetinių ar dirbtinių gijinių siūlų tekstūravimas, vijimas, lankstymas, sukimas ir įmirkymas Į šią klasę taip pat įeina: - popieriaus verpalų gamyba Į šią klasę neįeina: - paruošiamosios operacijos, atliekamos kartu su žemės ūkio darbais, žr. 01skyrių - augalų, turinčių augalinių tekstilės pluoštų, pvz., džiuto, linų, koiro (kokoso pluošto) ir kt., mirkymas, žr. 01.16 - medvilnės džinavimas, žr. 01.63 - sintetinių ar dirbtinių pluoštų ir gniūžčių, pirminių verpalų (įskaitant sustiprintus verpalus ir verpalus kilimams) iš sintetinių ar dirbtinių pluoštų gamyba, žr. 20.60 - stiklo pluoštų gamyba, žr. 23.14 @lt
scope note: Bu sınıf aşağıdakileri kapsamaktadır; - tekstil lifleri üzerinde yapılan hazırlayıcı faaliyetler; • ipeğin sarılması ve yıkanması, • yünlerin yağının giderilmesi ve karbonize edilmesi ve yün yapağının boyanması, • her türlü hayvansal, bitkisel veya suni lifin ayıklanması ve taraklanması, - ticaret veya daha ileri işlemler için pamuk ipliğinin veya ipliğin dokunmak (örülmek) veya dikilmek üzere eğirilmesi ve imalatı, • sentetik veya yapay (suni) ince pamuk ipliklerinin tekstile hazırlanması, bükülmesi, katlanması, kablolanması ve daldırılması. Ayrıca bu sınıf aşağıdakileri de kapsamaktadır; - kağıt ipliğinin imalatı. Kapsam dışı olanlar; - tarım veya çiftçilik ile bağlantılı olarak meydana getirilen hazırlık faaliyetleri, bkz. bölüm 01, - bitkisel tekstil lifleri (jüt, keten, büyük Hindistan cevizi lifi vb.), taşıyan bitkilerin ıslatılıp yumuşatılması, bkz. 01.16, - pamuk çırçırlama faaliyetleri, bkz. 01.63, - sentetik veya yapay (suni) lifler ve filament demetleri imalatı, sentetik veya yapay (suni) liflerden tek katlı ipliklerin (yüksek mukavemetli iplikler ve halı iplikleri dahil) imalatı, bkz. 20.60, - cam lifi imalatı, bkz. 23.14. @tr
preferred label: Подготовка и предене на текстилни влакна @bg
preferred label: Úprava a spřádání textilních vláken a příze @cs
preferred label: Forbehandling og spinding af tekstilfibre @da
preferred label: Spinnstoffaufbereitung und Spinnerei @de
preferred label: Προπαρασκευή και νηματοποίηση υφαντικών ινών @el
preferred label: Preparación e hilado de fibras textiles @es
preferred label: Tekstiilkiudude ettevalmistamine ja ketramine @et
preferred label: Tekstiilikuitujen valmistelu ja kehruu @fi
preferred label: Préparation de fibres textiles et filature @fr
preferred label: Textilszálak fonása
preferred label: Preparazione e filatura di fibre tessili @it
preferred label: Tekstilės pluoštų paruošimas ir verpimas @lt
preferred label: Tekstilšķiedru sagatavošana un vērpšana @lv
preferred label: Tħejjija u għażil ta' fibri tat-tessuti @mt
preferred label: Bewerken en spinnen van textielvezels @nl
preferred label: Bearbeiding og spinning av tekstilfibrer @no
preferred label: Przygotowanie i przędzenie włókien tekstylnych @pl
preferred label: Preparação e fiação de fibras têxteis @pt
preferred label: Pregătirea fibrelor şi filarea fibrelor textile @ro
preferred label: Подготовка и прядение текстильных волокон @ru
preferred label: Príprava a spriadanie textilných vlákien @sk
preferred label: Priprava in predenje tekstilnih vlaken @sl
preferred label: Garntillverkning @sv
preferred label: Tekstil elyafın hazırlanması ve bükülmesi @tr
broader: Preparation and spinning of textile fibres

Weaving of textiles
type: Concept
notation: 13.2
status: valid
status modified: 2013-10-18
accepted date: 2013-10-18
in scheme: Statistical Classification of Economic Activities in the European Community, Rev. 2 (2008)
scope note: Данный класс включает отделку текстильных изделий и одежды, т.е. процессы отбеливания, вываривания, окрашивания, обогащения и подобных видов деятельности. Этот класс включает: - отбеливание, вываривание и окрашивание текстильных волокон, пряжи, тканей и текстильных изделий, включая одежду - обогащение, сушку, паровую обработку, сжатие, улучшение, декатирование, мерсеризование текстильных изделий, включая одежду Этот класс также включает: - вываривание джинсов - плиссировку текстильных изделий и т.п. - гидроизоляцию материалов, окрашивание, прорезинивание или пропитывание приобретенной одежды - шелкотрафаретную печать на текстильных изделиях и одежде Этот класс исключает: - производство тканей пропитанных, окрашенных, покрытых или ламинированных резиной, где резина служит основным компонентом, см. 22.19 @ru
preferred label: Производство на тъкани @bg
preferred label: Tkaní textilií @cs
preferred label: Vævning af tekstiler @da
preferred label: Weberei @de
preferred label: Ύφανση κλωστοϋφαντουργικών υλών @el
preferred label: Fabricación de tejidos textiles @es
preferred label: Riidekudumine @et
preferred label: Kankaiden kudonta @fi
preferred label: Tissage @fr
preferred label: Textilszövés
preferred label: Tessitura @it
preferred label: Tekstilės audimas @lt
preferred label: Tekstilmateriālu aušana @lv
preferred label: Insiġ ta' tessuti @mt
preferred label: Weven van textiel @nl
preferred label: Veving av tekstiler @no
preferred label: Produkcja tkanin @pl
preferred label: Tecelagem de têxteis @pt
preferred label: Producţia de ţesături @ro
preferred label: Тканье текстильных изделий @ru
preferred label: Tkanie textilu @sk
preferred label: Tkanje tekstilij @sl
preferred label: Vävnadstillverkning @sv
preferred label: Dokuma @tr
broader: Manufacture of textiles
narrower: Weaving of textiles

Weaving of textiles
type: Concept
notation: 13.20
status: valid
status modified: 2013-10-18
accepted date: 2013-10-18
in scheme: Statistical Classification of Economic Activities in the European Community, Rev. 2 (2008)
scope note: Този клас включва производство на тъкани, изработени от прежди от различни текстилни суровини като памук и други растителни влакна; коприна, вълна и други животински влакна; химични влакна; хартия; стъкло и други. - производство на памучни и памучен тип тъкани - производство на щрайхгарни и камгарни вълнени и вълнен тип тъкани - производство на копринени и копринен тип тъкани - производство на тъкани от изкуствени или от синтетични прежди (полипропилен и други), вкл. от смеси - производство на ленени и ленен тип тъкани - производство на тъкани от прежди от рами, коноп, юта или ликови влакна, вкл. от смеси - производство на тъкани от специални прежди - производство на хавлиени тъкани, кадифета и плюшове, тъкани от шенилна прежда или със сплитка гаце и други - производство на тъкани от прежди от стъклени влакна - производство на тъкани от въглеродни и арамидни пресукани нишки - производство на имита - производство на плетени платове - 13.91 - производство на килими и текстилни подови настилки - 13.93 - производство на ленти и ширити - 13.96 - производство на нетъкани текстилни изделия и филц - 13.95, 13.99 - производство на нетъкани изделия от стъклени влакна - 23.14 - производство на тъкани от азбестова прежда - 23.99 @bg
scope note: Tato třída zahrnuje tkaní textilií. To je možné provést z různých neupravených (surových) materiálů, jako je hedvábí, vlna a jiná živočišná, rostlinná a umělá vlákna, papír nebo sklo atd. Z: - výrobu tkanin z přízí bavlněných, vlněných mykaných, vlněných česaných nebo hedvábných přízí, také ze směsových nebo umělých nebo syntetických přízí (polypropylenu atd.) - výrobu jiných tkanin z příze ze lnu, ramie, konopí (juta, sisal), lýkových vláken a specielních vláken ZT: - výrobu tkanin s vlasem nebo žinylkových tkanin, froté tkanin, mulové tkaniny (tylu) atd. - výrobu tkanin ze skleněných vláken - výrobu tkanin z uhlíkových vláken a vláken (nití) z aromatického polyamidu - výrobu imitace kožešiny tkaním N: - výrobu háčkovaných a pletených materiálů (13.91) - výrobu textilních podlahových krytin (13.93) - výrobu úzkých tkanin (pásů a stuh) (13.96) - výrobu netkaných textilií a plstí (13.99) @cs
scope note: Diese Klasse umfasst das Weben von Textilien. Dazu eignen sich unterschiedliche Rohstoffe, z. B. Seide, Wolle und andere tierische, pflanzliche und Kunstfasern, Papier, Glasfasern usw. Diese Klasse umfasst: - Herstellung von Geweben nach Art von Baumwoll-, Streich-, Kamm- oder Seidengarnenweberei, auch aus Misch-, künstlichen oder synthetischen Garnen (Polypropylen usw.) - Herstellung von Geweben aus Bast- und Hartfasergarnen (Flachs, Ramie, Hanf, Jute) und Spezialgarnen Diese Klasse umfasst ferner: - Herstellung von Velours- oder Chenillegewebe, Frottiergewebe, Mullgewebe usw. - Herstellung von Geweben aus Glasfaser - Herstellung von Geweben aus Kohlenstoff- und Aramidfäden - Herstellung von Webpelz Diese Klasse umfasst nicht: - Herstellung von gewirktem und gestricktem Stoff (s. 13.91) - Herstellung von textilen Bodenbelägen (s. 13.93) - Herstellung von Vliesstoffen (s. 13.95) - Herstellung von Bändern und Gurten (s. 13.96) - Herstellung von Filz (s. 13.99) @de
scope note: This class includes weaving of textiles. This can be done from varying raw materials, such as silk, wool, other animal, vegetable or man-made fibres, paper or glass etc. This class includes: - manufacture of broad woven cotton-type, woollen-type, worsted-type or silk-type fabrics, including from mixtures or artificial or synthetic yarns (polypropylene etc.) - manufacture of other broad woven fabrics, using flax, ramie, hemp, jute, bast fibres and special yarns This class also includes: - manufacture of woven pile or chenille fabrics, terry towelling, gauze etc. - manufacture of woven fabrics of glass fibres - manufacture of woven carbon and aramid threads - manufacture of imitation fur by weaving This class excludes: - manufacture of knitted and crocheted fabrics, see 13.91 - manufacture of textile floor coverings, see 13.93 - manufacture of non-woven fabrics, see 13.95 - manufacture of narrow fabrics, see 13.96 - manufacture of felts, see 13.99 @en
scope note: Esta clase comprende la fabricación de tejidos textiles. Esta tarea puede realizarse a partir de diversas materias primas, como la seda, la lana, otras fibras animales, vegetales o artificiales y sintéticas, papel, vidrio, etc. Esta clase comprende: - la fabricación de tejidos anchos de tipo algodón, lana, lana peinada o seda, incluidos los realizados a base de mezclas o hilos artificiales o sintéticos (poliprópileno, etc.); - la fabricación de otros tejidos anchos utilizando lino, ramio, cáñamo, yute, fibras blandas e hilados especiales. Esta clase comprende también: - la fabricación de tejidos de felpilla o chenilla, de toallería de tejido de rizo, de tejido de gasa, etc.; - la fabricación de tejidos de fibra de vidrio; - la fabricación de tejidos de carbono y aramida; - la fabricación de pieles de imitación obtenidas por tejido. Esta clase no comprende: - la fabricación de géneros de punto (véase 13.91); - la fabricación de revestimientos textiles para suelos (véase 13.93); - la fabricación de cintas tejidas (véase 13.96); - la fabricación de telas no tejidas y fieltros (véase 13.99). @es
scope note: Cette classe comprend le tissage de textiles. Les matières premières peuvent varier: soie, laine, fibres d’origine animale ou végétale ou fibres artificielles ou synthétiques, papier ou verre, etc. Cette classe comprend: - la fabrication de tissus de type cotonnier, de type lainier, de type peigné ou de type soie, y compris en mélanges ou en fibres artificielles ou en fibres synthétiques (polypropylène etc.) - la fabrication d’autres tissus de lin, de ramie, de chanvre, de jute, de fibres libériennes et de fibres spéciales Cette classe comprend également: - la fabrication de velours et de peluches tissés ou de tissus de chenille, de tissus bouclés du genre éponge, de tissus à point de gaze, etc. - la fabrication de tissus de fibres de verre - la fabrication de fils de carbone tissé ou d’aramide - la fabrication d’imitations de fourrure par tissage Cette classe ne comprend pas: - la fabrication d’étoffes à mailles, voir 13.91 - la fabrication de revêtements de sols en matières textiles, voir 13.93 - la fabrication des non-tissés, voir 13.95 - la fabrication d’articles de rubanerie, voir 13.96 - la fabrication du feutre, voir 13.99 @fr
scope note: Ovaj razred uključuje proizvodnju tekstila. To se može činiti pomoću različitih sirovina kao što su svila, vuna, ostala vlakna životinjskog, biljnog ili umjetnog podrijetla, papir ili staklo itd. Ovaj razred uključuje: - proizvodnju širokih tkanina od pređe pamučnog tipa, vunenog tipa, od češljane vune ili od pređe svilenoga tipa, uključujući mješavine, te od umjetne ili sintetičke pređe (polipropilen itd.) - proizvodnju ostalih širokih tkanina od lana, ramije, konoplje, jute, lika i specijalne pređe Ovaj razred također uključuje: - proizvodnju tkanina s floirom ili baršunastih tkanina, frotira za ručnike, gaze, itd. - proizvodnju tkanina od staklenih vlakana - proizvodnju konca od indigo-vlakna i aramidnog vlakna - proizvodnju imitacije krzna tkanjem Ovaj razred isključuje: - proizvodnju pletenih i kukičanih tkanina, vidi 13.91 - proizvodnju tekstilnih tapisona, vidi 13.93 - proizvodnju uskih tkanina, vidi 13.96 - proizvodnju netkanog tekstila i filca uskih tkanina, vidi 13.99
scope note: Į šią klasę įeina tekstilės gaminių audimas. Šiai operacijai atlikti gali būti naudojamos įvairios žaliavos, tokios kaip šilkas, vilna, kiti gyvūniniai, augaliniai arba cheminiai pluoštai, popierius ar stiklas ir kt. Į šią klasę įeina: - plačių medvilninių, vilnonių, šukuotinės vilnos, šilkinių, įskaitant maišytus ar dirbtinius, ar sintetinius verpalus, audinių gamyba - kitų plačių lininių, ramės, kanapių, džiuto, karnienos pluoštų ir specialiųjų verpalų audinių gamyba Į šią klasę taip pat įeina: - pūkinių ir šenilinių audinių, kilpinių rankšluosčių audinių, gazo ir kt. gamyba - audinių iš stiklo pluoštų gamyba - anglinio pluošto ir aramidinių siūlų audinių gamyba - dirbtinio kailio gamyba audimo būdu Į šią klasę neįeina: - megztinių (trikotažinių) ir nertinių medžiagų gamyba, žr. 13.91 - tekstilinių grindų dangų gamyba, žr. 13.93 - juostinių audinių gamyba, žr. 13.96 - neaustinių medžiagų ir veltinio gamyba, žr. 13.99 @lt
scope note: Данная группа включает производство текстильной продукции и изделий, за исключением одежды, таких как готовые текстильные изделия, ковры и паласы, веревки, сжатые ткани, ткани с отделкой и т.д. @ru
scope note: Bu grup tekstil ürünlerinin dokunmasını kapsamaktadır. Bu, ipek, yün, diğer hayvan, sebze veya suni veya sentetik lif, kağıt veya cam vb. gibi çeşitli ham maddelerden yapılabilmektedir. Bu sınıf aşağıdakileri kapsamaktadır; - pamuk-tipi, yünlü-tipi ve yün ve ipekli-tipi geniş dokunmuş kumaşların imalatı, karışık, suni veya sentetik iplikler (polipropilen vb.) dahil - keten, hasır, kenevir, jüt, teyel lifleri ve özel iplikler kullanılarak diğer geniş yünlü kumaşların imalatı. Ayrıca bu sınıf aşağıdakileri de kapsamaktadır; - yün tüy veya ipek veya pamuktan yapılmış kordon (saçak) kumaşlarının, havlu,havluluk bez, tülbent vb. imalatı, - cam elyafından yün kumaş imalatı, - yün karbon ve aramid iplik imalatı, - dokuma yoluyla imitasyon kürk imalatı. Kapsam dışı olanlar; - örgü ve tığ işi kumaşların imalatı, bkz. 13.91, - tekstil döşeme örtülerinin imalatı, bkz. 13.93, - dar dokunmuş kumaşların imalatı, bkz. 13.96, - dokuma olmayan kumaş ve keçelerin imalatı, bkz. 13.99. @tr
preferred label: Производство на тъкани @bg
preferred label: Tkaní textilií @cs
preferred label: Vævning af tekstiler @da
preferred label: Weberei @de
preferred label: Ύφανση κλωστοϋφαντουργικών υλών @el
preferred label: Fabricación de tejidos textiles @es
preferred label: Riidekudumine @et
preferred label: Kankaiden kudonta @fi
preferred label: Tissage @fr
preferred label: Textilszövés
preferred label: Tessitura @it
preferred label: Tekstilės audimas @lt
preferred label: Tekstilmateriālu aušana @lv
preferred label: Insiġ ta' tessuti @mt
preferred label: Weven van textiel @nl
preferred label: Veving av tekstiler @no
preferred label: Produkcja tkanin @pl
preferred label: Tecelagem de têxteis @pt
preferred label: Producţia de ţesături @ro
preferred label: Тканье текстильных изделий @ru
preferred label: Tkanie textilu @sk
preferred label: Tkanje tekstilij @sl
preferred label: Vävnadstillverkning @sv
preferred label: Dokuma @tr
broader: Weaving of textiles

Finishing of textiles
type: Concept
notation: 13.3
status: valid
status modified: 2013-10-18
accepted date: 2013-10-18
in scheme: Statistical Classification of Economic Activities in the European Community, Rev. 2 (2008)
scope note: Этот класс включает: - производство и обработку вязаного или трикотажного полотна: • ворсистого и плюшевого полотна • сетчатых и тюлевых тканей, выпущенных на рашелевом или подобных ткацких станках • прочих вязаных или трикотажных тканей Этот класс также включает: - производство искусственного меха методом вязания Этот класс исключает: - производство кружевных сетчатых и тюлевых тканей, выпущенные на рашелевом или подобных ткацких станках, см. 13.99 - производство вязаной и трикотажной одежды, см. 14.39 @ru
preferred label: Облагородяване на прежди, платове и облекло @bg
preferred label: Konečná úprava textilií @cs
preferred label: Efterbehandling af tekstiler @da
preferred label: Veredlung von Textilien und Bekleidung @de
preferred label: Τελειοποίηση (φινίρισμα) υφαντουργικών προϊόντων @el
preferred label: Acabado de textiles @es
preferred label: Tekstiili viimistlemine @et
preferred label: Tekstiilien viimeistely @fi
preferred label: Ennoblissement textile @fr
preferred label: Textilkikészítés
preferred label: Finissaggio dei tessili @it
preferred label: Tekstilės apdaila @lt
preferred label: Tekstilmateriālu apdare @lv
preferred label: Irfinar ta' tessuti @mt
preferred label: Textielveredeling @nl
preferred label: Etterbehandling av tekstiler @no
preferred label: Wykończanie wyrobów włókienniczych @pl
preferred label: Acabamento de têxteis @pt
preferred label: Finisarea materialelor textile @ro
preferred label: Отделка текстильных изделий @ru
preferred label: Konečná úprava textilu @sk
preferred label: Dodelava tekstilij @sl
preferred label: Blekning, färgning och annan textilberedning @sv
preferred label: Tekstil ürünlerinin bitirilmesi @tr
broader: Manufacture of textiles
narrower: Finishing of textiles

Finishing of textiles
type: Concept
notation: 13.30
status: valid
status modified: 2013-10-18
accepted date: 2013-10-18
in scheme: Statistical Classification of Economic Activities in the European Community, Rev. 2 (2008)
scope note: - избелване и багрене на влакна, прежди, платове, текстилни изделия, вкл. на облекло - апретиране, сушене, обработване с пара, свиване, отстраняване на дефекти, обработване против свиване, мерсеризиране на текстил, текстилни изделия, вкл. на облекло - избелване на дънки - плисиране и подобно обработване на текстилни изделия - нанасяне на водоустойчива апретура, промазване, импрегниране с каучук или друго импрегниране на закупено облекло - ситопечат върху текстил и облекло - производство на тъкани, импрегнирани, промазани, покрити или ламинирани с каучук, чието съдържание е преобладаващо - 22.19 @bg
scope note: Tato třída zahrnuje konečnou úpravu textilií a oděvů, tj. bělení, barvení, apretaci a podobné činnosti. Z: - bělení a barvení textilních vláken, přízí, tkanin a textilních výrobků, včetně oděvů - apretaci, sušení, napařování, srážení, opravy, nesrážlivou úpravu, zušlechťování (mercerování) textilí včetně oděvů ZT: - bělení džínoviny - plizování a podobné práce s textiliemi - nepromokavou úpravu, potažení, pogumování nebo impregnaci oděvů nepocházejících z vlastní výroby - sítotisk na textilie a oděvy N: - výrobu textilních vláken impregnovaných, potažených nebo laminovaných pryží, pokud pryž představuje hlavní součást výrobku (22.19) @cs
scope note: Diese Klasse umfasst die Veredlung von Textilien und Bekleidung, z. B. durch Bleichen, Färben, Appretieren und ähnliche Verfahren. Diese Klasse umfasst: - Bleichen und Färben von textilen Spinnstoffen, Textilwaren, Garnen, Stoffen und Textilien einschließlich Bekleidung - Appretieren, Trocknen, Dämpfen, Krumpfen, Ausbessern, Sanforisieren, Merzerisieren von Textilien einschließlich Bekleidung Diese Klasse umfasst ferner: - Bleichen von Jeans - Plissieren und ähnliche Behandlung von Textilien - Wasserdichtmachen, Beschichten, Gummieren oder Imprägnieren gekaufter Kleidung - Siebdrucken auf Textilien und Bekleidung Diese Klasse umfasst nicht: - Herstellung von mit Gummi imprägnierten, beschichteten, überzogenen oder laminierten Spinnstoffen, wenn Gummi den Hauptbestandteil darstellt (s. 22.19) @de
scope note: This class includes finishing of textiles and wearing apparel, i.e. bleaching, dyeing, dressing and similar activities. This class includes: - bleaching and dyeing of textile fibres, yarns, fabrics and textile articles, including wearing apparel - dressing, drying, steaming, shrinking, mending, sanforising, mercerising of textiles and textile articles, including wearing apparel This class also includes: - bleaching of jeans - pleating and similar work on textiles - waterproofing, coating, rubberising, or impregnating purchased garments - silk-screen printing on textiles and wearing apparel This class excludes: - manufacture of textile fabric impregnated, coated, covered or laminated with rubber, where rubber is the chief constituent, see 22.19 @en
scope note: Esta clase comprende el acabado de textiles y prendas de vestir, es decir, el blanqueo, teñido, apresto y actividades similares. Esta clase comprende: - el blanqueo y teñido de fibras textiles, hilos, tejidos y artículos textiles, incluidas las prendas de vestir; - el apresto, secado, vaporizado, encogimiento, remendado, sanforizado y mercerizado de materias textiles y de artículos textiles, incluidas las prendas de vestir. Esta clase comprende también: - el blanqueo de pantalones vaqueros; - el plisado y labores análogas sobre textiles; - la impermeabilización, el recuubrimiento, el engomado y la impregnación de prendas de vestir adquiridas; - el serigrafiado sobre textiles y prendas de vestir. Esta clase no comprende: - la fabricación de tejidos impregnados, recubiertos o estratificados con caucho, en los casos en que éste constituye el componente principal (véase 22.19). @es
scope note: Cette classe comprend l’ennoblissement de textiles et d’articles vestimentaires, c’est-à-dire le blanchiment, la teinture, l’apprêtage et les activités similaires. Cette classe comprend: - le blanchiment et la teinture de fibres textiles, de fils, de tissus et d’articles en textile, y compris les vêtements. - l’apprêtage, le séchage, le vaporisage, le décatissage, le stoppage, le sanforisage, le mercerisage de textiles et d’articles textiles, y compris les vêtements Cette classe comprend également: - la décoloration de jeans - le plissage et les opérations similaires effectuées sur des textiles - l’imperméabilisation, l’enduction, le caoutchoutage ou l’imprégnation de vêtements achetés - l’impression sérigraphique sur textiles et vêtements Cette classe ne comprend pas: - la fabrication de tissus imprégnés, enduits ou recouverts de caoutchouc ou stratifiés avec cette même matière, si le caoutchouc est l’élément principalement utilisé, voir 22.19 @fr
scope note: Ovaj razred uključuje dovršavanje tekstila i odjevnih predmeta, tj. bijeljenje, bojenje, uređivanje i slične djelatnosti. Ovaj razred uključuje: - bijeljenje i bojenje tekstilnih vlakana, pređe, tkanina i tekstilnih predmeta, uključujući odjevne predmete - uređivanje, sušenje, parenje, smanjivanje, popravljanje, sanforiziranje, merceriziranje tekstila i tekstilnih predmeta, uključujući odjevne predmete Ovaj razred također uključuje: - izbjeljivanje trapera - plisiranje i slične radove na tekstilu - hidroizolaciju, prevlačenje, gumiranje ili impregniranje na kupljenoj odjeći - tiskanje tekstila i odjevnih predmeta sitotiskom Ovaj razred isključuje: - proizvodnju tekstilnih tkanina impregniranih, prevučenih, prekrivenih ili laminiranih gumom, u kojima je guma glavni sastojak, vidi 22.19
scope note: Į šią klasę įeina tekstilės gaminių ir drabužių apdaila, t.y. balinimas, dažymas, apretavimas ir panaši veikla. Į šią klasę įeina: - tekstilės pluoštų, verpalų, gaminių ir tekstilės dirbinių, įskaitant drabužius, balinimas ir dažymas - tekstilės gaminių ir tekstilės dirbinių, įskaitant drabužius, apretavimas, džiovinimas, apdorojimas garu, traukimas, adymas, sanforizavimas, merserizavimas Į šią klasę taip pat įeina: - džinsų balinimas - tekstilės gaminių klostavimas ir panašūs darbai - gatavų drabužių impregnavimas, dengimas, gumavimas ar įmirkymas - šilkografinis spausdinimas ant tekstilės gaminių ir drabužių Į šią klasę neįeina: - guma įmirkytų, dengtų, apvilktų ar laminuotų tekstilės gaminių, kai guma yra pagrindinė sudedamoji dalis, gamyba, žr. 22.19 @lt
scope note: Этот класс включает: - производство готовых изделий из любых текстильных материалов, включая вязаные или трикотажные ткани: • одеял, включая пледы • постельного, столового, туалетного или кухонного белья • стеганых, пуховых одеял, пуфов, подушек, спальных мешков и т.д. - производство готовых предметов меблировки: • штор, занавесок, постельных покрывал, чехлов для мебели или оборудования и т.д. • брезента, тентов, кемпинговых принадлежностей, парусов, навесов, покрывал для автомобилей, техники или мебели и т.д. • флагов, знамен и т.д. • тряпок для вытирания пыли, кухонных полотенец и подобных изделий, спасательных жилетов, парашютов и т.д. Этот класс также включает: - производство текстильных частей для одеял с электрообогревом - производство тканых обоев Этот класс исключает: - производство текстильных изделий для технического применения, см. 13.96 @ru
scope note: Bu grup, tekstil ürünlerinin ve giyilecek diğer kıyafetlerin tamamlama faaliyetlerini kapsamaktadır örn. ağartma, boyama, kaplama vb.. Bu sınıf aşağıdakileri kapsamaktadır; - tekstil elyafının, ipliklerinin, kumaşlarının ve giyim kuşam da dahil tekstil maddelerinin ağartılması ve boyanması, - tekstil ürünlerinin ve giyim kuşam da dahil tekstil maddelerinin kaplanması, kurutulması, buharlanması, daraltılması, yamalanması, sanforlanması, merserize edilmesi. Ayrıca bu sınıf aşağıdakileri de kapsamaktadır; - kotların ağartılması, - tekstiller üzerine pliseve benzer işler yapılması, - satın alınan elbiselerin (giysilerin) su geçirmez yapılması, su geçirmez hale getirilmesi veya yapılması, - tekstil ürünlerinin ve giyim eşyalarının üzerine ipek baskı. Kapsam dışı olanlar; - kauçuk ana unsur olduğunda, kauçuk kullanarak yapılan, kaplanan, örtülen veya lamine edilen tekstil ürünlerinin imalatı, bkz. 22.19. @tr
preferred label: Облагородяване на прежди, платове и облекло @bg
preferred label: Konečná úprava textilií @cs
preferred label: Efterbehandling af tekstiler @da
preferred label: Veredlung von Textilien und Bekleidung @de
preferred label: Τελειοποίηση (φινίρισμα) υφαντουργικών προϊόντων @el
preferred label: Acabado de textiles @es
preferred label: Tekstiili viimistlemine @et
preferred label: Tekstiilien viimeistely @fi
preferred label: Ennoblissement textile @fr
preferred label: Textilkikészítés
preferred label: Finissaggio dei tessili @it
preferred label: Tekstilės apdaila @lt
preferred label: Tekstilmateriālu apdare @lv
preferred label: Irfinar ta' tessuti @mt
preferred label: Textielveredeling @nl
preferred label: Etterbehandling av tekstiler @no
preferred label: Wykończanie wyrobów włókienniczych @pl
preferred label: Acabamento de têxteis @pt
preferred label: Finisarea materialelor textile @ro
preferred label: Отделка текстильных изделий @ru
preferred label: Konečná úprava textilu @sk
preferred label: Dodelava tekstilij @sl
preferred label: Blekning, färgning och annan textilberedning @sv
preferred label: Tekstil ürünlerinin bitirilmesi @tr
broader: Finishing of textiles

Manufacture of other textiles
type: Concept
notation: 13.9
status: valid
status modified: 2013-10-18
accepted date: 2013-10-18
in scheme: Statistical Classification of Economic Activities in the European Community, Rev. 2 (2008)
scope note: Тази група включва производство на плетени платове и други текстилни изделия, без облекло: конфекционирани текстилни изделия, килими, ленти, пасмантерийни и други @bg
scope note: Tato skupina zahrnuje výrobu výrobků z textilií, kromě oděvů, jako jsou hotové konfekční textilní výrobky, koberce, předložky a běhouny, provaznické výrobky, stuhy, prýmky, (lemovky, ozdoby na šaty, krajky) atd. @cs
scope note: Diese Gruppe umfasst die Herstellung von Erzeugnissen aus Textilien außer Bekleidung, wie konfektionierte Textilwaren, Teppiche, Brücken und Läufer, Seilerwaren, Bänder, Posamentierwaren usw. @de
scope note: This group includes the manufacture of products produced from textiles, except wearing apparel, such as made-up textile articles, carpets and rugs, rope, narrow woven fabrics, trimmings etc. @en
scope note: Este grupo comprende la fabricación de productos obtenidos a partir de textiles, excepto las prendas de vestir, como los artículos confeccionados con textiles, alfombras y moquetas, cuerda, cintas tejidas, artículos de pasamanería, etc. @es
scope note: Ce groupe comprend la fabrication d’articles confectionnés en matière textile à l’exception des articles vestimentaires, tels que le linge de maison, les tapis et carpettes, les ficelles, les articles de rubanerie, les ouvrages de passementerie et articles analogues, etc. @fr
scope note: Ova skupina uključuje proizvodnju proizvoda od tekstila, osim odjevnih predmeta kao što su gotovi tekstilni predmeti, sagovi i tepisi, užad, uske tekstilne tkanine, ukrasi itd.
scope note: Į šią grupę įeina tekstilės gaminių, tokių kaip gatavi tekstilės dirbiniai, kilimai ir kilimėliai, virvės, juostiniai audiniai, aplikacijos ir kt., išskyrus drabužius, gamyba. @lt
scope note: Этот класс включает: - производство текстильных половых покрытий: • ковры, паласы и половики, напольные покрытия Этот класс также включает: - производство войлочных напольных покрытий Этот класс исключает: - производство циновок и половиков из материалов для плетения, см. 16.29 - производство пробковых напольных покрытий, см. 16.29 - производство эластичных покрытий, таких как винил, линолеум, см. 22.23 @ru
scope note: Bu grup, giyim eşyaları hariç, halı, kilim, ip, dar dokunmuş kumaşlar, saçaklar vb. ürünler gibi tekstilden üretilmiş ürünlerin imalatını kapsamaktadır. @tr
preferred label: Производство на други текстилни изделия @bg
preferred label: Výroba ostatních textilií @cs
preferred label: Fremstilling af andre tekstiler @da
preferred label: Herstellung von sonstigen Textilwaren @de
preferred label: Κατασκευή άλλων κλωστοϋφαντουργικών προϊόντων @el
preferred label: Fabricación de otros productos textiles @es
preferred label: Muu tekstiilitootmine @et
preferred label: Muiden tekstiilituotteiden valmistus @fi
preferred label: Fabrication d'autres textiles @fr
preferred label: Egyéb textiláru gyártása
preferred label: Altre industrie tessili @it
preferred label: Kitų tekstilės gaminių ir dirbinių gamyba @lt
preferred label: Pārējo tekstilizstrādājumu ražošana @lv
preferred label: Manifattura ta' tessuti oħra @mt
preferred label: Vervaardiging van andere textielproducten @nl
preferred label: Produksjon av andre tekstiler @no
preferred label: Produkcja pozostałych wyrobów tekstylnych @pl
preferred label: Fabricação de outros têxteis @pt
preferred label: Fabricarea altor articole textile @ro
preferred label: Производство прочих текстильных изделий @ru
preferred label: Výroba ostatného textilu @sk
preferred label: Proizvodnja drugih tekstilij @sl
preferred label: Annan textilietillverkning @sv
preferred label: Diğer tekstil ürünlerinin imalatı @tr
broader: Manufacture of textiles
narrower: Manufacture of knitted and crocheted fabrics
narrower: Manufacture of made-up textile articles, except apparel
narrower: Manufacture of carpets and rugs
narrower: Manufacture of cordage, rope, twine and netting
narrower: Manufacture of non-wovens and articles made from non-wovens, except apparel
narrower: Manufacture of other technical and industrial textiles
narrower: Manufacture of other textiles n.e.c.

Manufacture of knitted and crocheted fabrics
type: Concept
notation: 13.91
status: valid
status modified: 2013-10-18
accepted date: 2013-10-18
in scheme: Statistical Classification of Economic Activities in the European Community, Rev. 2 (2008)
scope note: - производство и обработка на плетени платове: • кадифета, плюшени и хавлиени платове • мрежи и декоративен тип платове за прозорци (пердета), плетени на рашел или на подобни машини • други плетени платове - производство на имитация на кожухарски кожи, получени чрез плетене - производство на тюл, мрежи, дантела, ленти и други - 13.99 - производство на плетено облекло - 14.39 @bg
scope note: Z: - výrobu a zpracování pletených a háčkovaných materiálů: • vlasových a smyčkových materiálů • síťoviny a záclonových materiálů, vyráběných na Rašlových nebo podobných strojích • ostatních pletených a háčkovaných materiálů ZT: - výrobu pletené umělé kožešiny N: - výrobu síťovin nebo záclonových materiálů z krajky, vyráběných na Rašlových nebo podobných strojích (13.99) - výrobu háčkovaných a pletených oděvů (14.39) @cs
scope note: Diese Klasse umfasst: - Herstellung von und Verarbeitung von Gestricken und Gewirken: • Plüsch- und Frottiergewirke • netz- und gardinenartige Stoffe, die auf einer Raschelmaschine oder ähnlichen Maschinen hergestellt werden • sonstiger gewirkter und gestrickter Stoff Diese Klasse umfasst ferner: - Herstellung von gewirktem künstlichem Pelzwerk Diese Klasse umfasst nicht: - Herstellung von netz- und gardinenartigen Stoffen aus Spitze, die auf Raschelmaschinen oder ähnlichen Maschinen hergestellt werden (s. 13.99) - Herstellung von gewirkter und gestrickter Bekleidung (s. 14.39) @de
scope note: This class includes: - manufacture and processing of knitted or crocheted fabrics: • pile and terry fabrics • net and window furnishing type fabrics knitted on Raschel or similar machines • other knitted or crocheted fabrics This class also includes: - manufacture of imitation fur by knitting This class excludes: - manufacture of net and window furnishing type fabrics of lace knitted on Raschel or similar machines, see 13.99 - manufacture of knitted and crocheted apparel, see 14.39 @en
scope note: Esta clase comprende: - la fabricación y el tratamiento de géneros de punto: • tejidos de rizo y de pelo; • tejidos de mallas anudadas para visillos y cortinas fabricados con máquinas Raschel o similares; • otros géneros de punto Esta clase comprende también: - la fabricación de pieles de imitación obtenidas mediante tricotaje. Esta clase no comprende: - la fabricación de tejidos de mallas anudadas para cortinas y visillos hechos con encajes fabricados en máquinas Raschel o similares (véase 13.99); - la fabricación de prendas de punto (véase 14.39). @es
scope note: Cette classe comprend: - la fabrication et la transformation, au sein de la même unité, d’étoffes à mailles: • velours, peluches et étoffes bouclées • tissus des types utilisés pour filets, rideaux et vitrages, tricotés sur métier Rachel ou sur des métiers similaires • autres étoffes à mailles Cette classe comprend également: - la fabrication d’imitations de fourrure par tricotage Cette classe ne comprend pas: - la fabrication de tissus des types utilisés pour filets, rideaux et vitrages, en dentelle, réalisés sur métier Rachel ou sur des métiers similaires, voir 13.99 - la fabrication d’étoffes à mailles, voir 14.39 @fr
scope note: Ovaj razred uključuje: - proizvodnju i obradu pletenih i kukičanih tkanina: • vunenih i frotirnih vlakana • mrežastih tkanina i tkanina za prozorske zavjese pletenih na rašelu i sl. strojevima • ostalih pletenih i kukičanih tkanina Ovaj razred također uključuje: - proizvodnju umjetnoga krzna pletenjem Ovaj razred isključuje: - proizvodnju mrežastih tkanina i prozorskih zavjesa pletenih na rašelu i sl. strojevima, vidi 13.99 - proizvodnju pletene i kukičane odjeće, vidi 14.39
scope note: Į šią klasę įeina: - megztinių (trikotažinių) ar nertinių medžiagų gamyba ir jų apdaila: • pūkinių ir kilpinių medžiagų • „Rašel“ ar panašiomis mašinomis megztų užuolaidų ir langų apdailos medžiagų • kitų megztinių (trikotažinių) ar nertinių medžiagų Į šią klasę taip pat įeina: - dirbtinio kailio gamyba mezgimo būdu Į šią klasę neįeina: - „Rašel“ ar panašiomis mašinomis megztų užuolaidų ir langų apdailos nėrinių gamyba, žr. 13.99 - megztinių (trikotažinių) ir nertinių drabužių gamyba, žr. 14.39 @lt
scope note: Этот класс включает: - производство шпагата, канатов, веревок и тросов из текстильных волокон, лент и аналогичных материалов, с пропиткой и без пропитки, с покрытием или без, защищенных или не защищенных оболочкой из резины или пластмассы - производство сетей из шпагата, канатов и веревок - производство изделий из веревок или сетного полотна: рыболовных сетей, предохранительных сеток на судах, защитных средств, используемых при разгрузочных работах, строп, веревок или тросов с металлическими кольцами и т.п. Этот класс исключает: - производство сеток для волос, см. 14.19 - производство проволочных канатов, см. 25.93 - производство сетчатых ловушек для спортивной рыбной ловли, см. 32.30 @ru
scope note: Bu sınıf aşağıdakileri kapsamaktadır; - örgü ve tığ işi kumaşların imalatı ve işlenmesi; • havlı ve havlu kumaşlar, • Raschel veya benzeri makineler kullanılarak örülen tüller ve perdeler, • diğer örgü ile veya tığ ile örülmüş dokuma ürünleri. Ayrıca bu sınıf aşağıdakileri de kapsamaktadır; - örme yoluyla imitasyon kürk imalatı. Kapsam dışı olanlar; - Raschel veya benzeri makineler kullanılarak örülen ağlar ve pencere mobilyası tipi dantelli dokumaların imalatı, bkz. 13.99, - örgü veya tığ ile örülmüş kıyafet imalatı, bkz. 14.39. @tr
preferred label: Производство на плетени платове @bg
preferred label: Výroba pletených a háčkovaných materiálů @cs
preferred label: Fremstilling af trikotagestoffer @da
preferred label: Herstellung von gewirktem und gestricktem Stoff @de
preferred label: Κατασκευή πλεκτών υφασμάτων και υφασμάτων πλέξης κροσέ @el
preferred label: Fabricación de tejidos de punto @es
preferred label: Silmkoe- ja heegelkanga (trikookanga) tootmine @et
preferred label: Neulosten valmistus @fi
preferred label: Fabrication d'étoffes à mailles @fr
preferred label: Kötött, hurkolt kelme gyártása
preferred label: Fabbricazione di tessuti a maglia @it
preferred label: Megztų (trikotažinių) ir nertų medžiagų gamyba @lt
preferred label: Adīto un tamborēto audumu ražošana @lv
preferred label: Manifattura ta' drappijiet maħduma bil-labar (knitted) jew bil-ganċ (crocheted) @mt
preferred label: Vervaardiging van gebreide en gehaakte stoffen @nl
preferred label: Produksjon av stoffer av trikotasje @no
preferred label: Produkcja dzianin metrażowych @pl
preferred label: Fabricação de tecidos de malha @pt
preferred label: Fabricarea de metraje prin tricotare sau croşetare @ro
preferred label: Производство вязаного и трикотажного полотна @ru
preferred label: Výroba pleteného a háčkovaného textilu @sk
preferred label: Proizvodnja pletenih in kvačkanih materialov @sl
preferred label: Tillverkning av trikåväv @sv
preferred label: Örgü ve tığ işi kumaşların imalatı @tr
broader: Manufacture of other textiles

Manufacture of made-up textile articles, except apparel
type: Concept
notation: 13.92
status: valid
status modified: 2013-10-18
accepted date: 2013-10-18
in scheme: Statistical Classification of Economic Activities in the European Community, Rev. 2 (2008)
scope note: - производство на конфекционирани изделия от всякакъв вид текстилен материал, вкл. и от плетени платове: • производство на одеяла, вкл. пътни завивки • спално бельо, покривки за маса, ленени кърпи за тоалет или за кухня • юргани, възглавници, завивки с пълнеж от перушина или пух, спални чували и други - производство на други конфекционирани текстилни изделия: • завеси, дамаски, транспаранти, кувертюри, покривала от леки платове за мебели, машини и други • покривала (брезенти), палатки, изделия за къмпинг, платна за плавателни съдове, щори, чергила за коли, калъфи за коли, машини или мебели и други • флагове, знамена, вимпели и други • кърпи за бърсане на прах, на съдове и подобни домакински кърпи; спасителни жилетки; парашути и други - производство на текстилни части за електрически одеяла - производство на ръчно тъкани гоблени - производство на текстилни изделия за техническа употреба - 13.96 - хирургически стерилни покривки за операции - 32.50 - поправка на покривала (брезенти) - 33.19 @bg
scope note: Z: - výrobu konfekčních výrobků z textilií všeho druhu včetně pletených nebo háčkovaných materiálů: • přikrývek včetně cestovních • ložního prádla, stolních, toaletních nebo kuchyňských lněných tkanin (plátěného zboží) • prošívaných přikrývek, prachových přikrývek, polštářů na sedadla, polštářů, spacích pytlů atd. - výrobu konfekčních textilií pro zařízení interiérů a jiné účely: • záclon, závěsů, rolet, žaluzií, přehozů, potahů na nábytek, ochranných přikrývek na stroje atd. • plachet, plachetek, stanů, kempingových výrobků, markýz, krycích plachet pro automobily a stroje, ochranných potahů na nábytek atd. • praporů, vlajek, mávátek atd. • prachovek, utěrek apod. výrobků, záchranných plovacích vest, padáků atd. ZT: - výrobu textilních částí elektrických podušek a přikrývek - výrobu ručně tkaných koberců na stěnu N: - výrobu technických textilií (13.96) @cs
scope note: Diese Klasse umfasst: - Herstellung von Konfektionswaren aus Textilien aller Art einschließlich gewirkter und gestrickter Stoffe: • Decken einschließlich Reisedecken • Bett-, Tisch- und andere Hauswäsche • Steppdecken, Daunendecken, Sitzkissen, Sitzpolster, Kopfkissen, Schlafsäcke usw. - Herstellung von konfektionierten Textilien für die Innenausstattung und für andere Zwecke: • Vorhänge, Rollos, Jalousien, Tagesbettdecken, Möbelbezüge, Abdeckhauben für Maschinen usw. • Planen, Zelte, Campingwaren, Segel, Markisen, Abdeckungen für Autos und Maschinen, Schutzbezüge für Möbel usw. • Flaggen, Fahnen, Wimpel usw. • Staubtücher, Geschirrtücher u. Ä., Schwimmwesten, Fallschirme usw. Diese Klasse umfasst ferner: - Herstellung textiler Teile elektrischer Heizkissen und -decken - Herstellung von handgewebten Wandteppichen Diese Klasse umfasst nicht: - Herstellung von technischen Textilien (s. 13.96) @de
scope note: This class includes: - manufacture, of made-up articles of any textile material, including of knitted or crocheted fabrics: • blankets, including travelling rugs • bed, table, toilet or kitchen linen • quilts, eiderdowns, cushions, pouffes, pillows, sleeping bags etc. - manufacture of made-up furnishing articles: • curtains, valances, blinds, bedspreads, furniture or machine covers etc. • tarpaulins, tents, camping goods, sails, sunblinds, loose covers for cars, machines or furniture etc. • flags, banners, pennants etc. • dust cloths, dishcloths and similar articles, life jackets, parachutes etc. This class also includes: - manufacture of the textile part of electric blankets - manufacture of hand-woven tapestries This class excludes: - manufacture of textile articles for technical use, see 13.96 @en
scope note: Esta clase comprende: - la fabricación de artículos confeccionados con cualquier material textil, incluidos los géneros de punto: • mantas, incluidas las de viaje; • ropa de cama, mesa, baño y cocina; • acolchados, edredones, almohadones, pufes, almohadas, sacos de dormir, etc.; - la fabricación de artículos confeccionados para el hogar: • cortinas, visillos, cenefas, estores, cubrecamas, cubiertas de mobiliario o máquinas, etc. • lonas, tiendas de campaña y otros artículos análogos de acampada, velas para embarcaciones, toldos, cubiertas sueltas para vehículos automóviles, maquinaria o mobiliario, etc.; • banderas, gallardetes, estandartes, etc.; • bayetas, arpilleras para fregar y artículos similares, chalecos salvavidas, paracaídas, etc. Esta clase comprende también: - la fabricación de los componentes textiles para mantas eléctricas; - la fabricación de tapices tejidos a mano Esta clase no comprende: - la fabricación de artículos confeccionados con materias textiles para uso técnico (véase 13.96). @es
scope note: Cette classe comprend: - la fabrication d’articles confectionnés en toutes matières textiles, y compris en étoffes à mailles: • couvertures • linge de lit, de table, de toilette ou de cuisine • couvre-pieds, édredons, coussins, poufs, oreillers, sacs de couchage, etc. - la fabrication d’articles confectionnés pour l’ameublement: • rideaux, tours de lit, stores, couvre-lits, housses pour machines ou mobilier, etc. • bâches, tentes, articles de campement, voiles pour embarcations, stores d’extérieur, housses amovibles pour voitures, machines ou mobilier etc. • drapeaux, banderoles, bannières, etc. • chiffons à épousseter, lavettes et articles similaires, gilets de sauvetage, parachutes, etc. Cette classe comprend également: - la fabrication de la partie textile des couvertures chauffantes électriques - la fabrication de tapisseries tissées à la main Cette classe ne comprend pas: - la fabrication d’articles textiles pour usages techniques, voir 13.96 @fr
scope note: Ovaj razred uključuje: - proizvodnju gotovih proizvoda od svih vrsta tekstilnih materijala, uključujući od pletenih i kukičanih tkanina: • vunenih pokrivača, uključujući putne vunene pokrivače • posteljnog, stolnog, kupaoničkog ili kuhinjskog rublja • popluna, perina, jastuka za krevete, za sjedenje, vreća za spavanje itd. - proizvodnju gotovih proizvoda za opremanje stana: • zavjesa, zastora, roleta, prekrivača za krevet, navlaka za namještaj ili strojeve itd. • cerada, tenda, proizvoda za kampiranje, jedara, sjenila protiv sunca, prekrivača za automobile, strojeve i namještaj itd. • zastava za razne potrebe • krpa za čišćenje, pranje suđa i sl. proizvoda, pojaseva za spašavanje, padobrana itd. Ovaj razred također uključuje: - proizvodnju tekstilnog dijela električnog popluna - proizvodnju ručno tkanih tapiserija Ovaj razred isključuje: - proizvodnju tekstilnih proizvoda za tehničke svrhe, vidi 13.96
scope note: Į šią klasę įeina: - gatavų gaminių iš įvairių tekstilės medžiagų, įskaitant megztines (trikotažines) ar nertines medžiagas, gamyba: • antklodžių, įskaitant kelioninius pledus • lovos, stalo, tualeto ar virtuvės skalbinių - vatinių ir pūkinių antklodžių, pagalvėlių, pampsukų (pufų), pagalvių, miegmaišių ir kt. - gatavų namų apyvokos reikmenų gamyba: • užuolaidų, užuolaidėlių, lango uždangų, lovatiesių, baldų ar mašinų apdangalų ir kt. • brezento, palapinių, turizmo (stovyklavimo) reikmenų, burių, žaliuzių nuo saulės, lengvųjų automobilių, mašinų ar baldų apdangalų ir kt. • vėliavų, vėliavėlių, gairelių ir kt. • pašluosčių dulkėms valyti ar indams šluostyti, gelbėjimosi liemenių, parašiutų ir kt. Į šią klasę taip pat įeina: - elektrinių antklodžių tekstilinių dalių gamyba - rankų pynimo gobelenų gamyba Į šią klasę neįeina: - techninės paskirties tekstilės gaminių gamyba, žr. 13.96 @lt
scope note: Этот класс включает все виды деятельности, имеющие отношение к производству текстильных изделий или текстильной продукции, не обозначенной в разделах 13 или 14, включающей в себя большое количество процессов обработки и разнообразие производимой продукции. @ru
scope note: Bu sınıf aşağıdakileri kapsamaktadır; - örülmüş veya tığ işi kumaşlar da dahil herhangi tekstil maddesinden yapılmış eşyaların imalatı: • seyahat örtüleri de dahil battaniyeler, • yatak, masa, tuvalet veya mutfak havlusu, • yorgan, çarşaf, minder, puf, yastık, uyku tulumu vb. - konfeksiyon mefruşat (döşeme) maddelerinin imalatı: • perdeler, saçaklar, çekme perdeler, yatak örtüleri, mobilya veya makine örtüleri vb., • bez astarlı muşambalar, tenteler, çadırlar, kamp malzemeleri, yelkenler, güneşlikler, araba kılıfları, makineler veya mobilyaları örtmede kullanılan örtüler vb., • bayraklar, sancaklar, flamalar vb., • toz bezleri, bulaşık bezleri ve benzer maddeler, cankurtaran yelekleri, paraşütler vb. Ayrıca bu sınıf aşağıdakileri de kapsamaktadır; - elektrikli battaniyelerin tekstil kısımlarının imalatı, - elle dokunan resim dokumalı duvar örtüsü imalatı, Kapsam dışı olanlar; - teknik kullanım amacıyla tekstil maddeleri imalatı, bkz. 13.96. @tr
preferred label: Производство на конфекционирани текстилни изделия, без облекло @bg
preferred label: Výroba konfekčních textilních výrobků, kromě oděvů @cs
preferred label: Fremstilling af færdige tekstilvarer undtagen beklædningsartikler @da
preferred label: Herstellung von konfektionierten Textilwaren (ohne Bekleidung) @de
preferred label: Κατασκευή έτοιμων κλωστοϋφαντουργικών ειδών, εκτός από ενδύματα @el
preferred label: Fabricación de artículos confeccionados con textiles, excepto prendas de vestir @es
preferred label: Valmis tekstiiltoodete tootmine, v.a rõivad @et
preferred label: Sovitettujen tekstiilituotteiden valmistus (pl. vaatteet) @fi
preferred label: Fabrication d'articles textiles, sauf habillement @fr
preferred label: Konfekcionált textiláru gyártása (kivéve: ruházat)
preferred label: Fabbricazione di articoli tessili, esclusi gli articoli di abbigliamento @it
preferred label: Gatavų tekstilės dirbinių, išskyrus drabužius, gamyba @lt
preferred label: Gatavo tekstilizstrādājumu ražošana, izņemot apģērbu @lv
preferred label: Manifattura ta' oġġetti tat-tessuti maħduma, għajr ilbies @mt
preferred label: Vervaardiging van geconfectioneerde artikelen van textiel, exclusief kleding @nl
preferred label: Produksjon av tekstilvarer, unntatt klær @no
preferred label: Produkcja gotowych wyrobów tekstylnych, z wyłączeniem odzieży @pl
preferred label: Fabricação de artigos têxteis confeccionados, excepto vestuário @pt
preferred label: Fabricarea de articole confecţionate din textile (cu excepţia îmbrăcămintei şi lenjeriei de corp) @ro
preferred label: Производство готовых текстильных изделий, кроме одежды @ru
preferred label: Výroba textilných výrobkov okrem odevov @sk
preferred label: Proizvodnja končnih tekstilnih izdelkov, razen oblačil @sl
preferred label: Tillverkning av sydda textilvaror utom beklädnadsvaror @sv
preferred label: Giyim eşyası dışındaki tamamlanmış tekstil ürünlerinin imalatı @tr
broader: Manufacture of other textiles

Manufacture of carpets and rugs
type: Concept
notation: 13.93
status: valid
status modified: 2013-10-18
accepted date: 2013-10-18
in scheme: Statistical Classification of Economic Activities in the European Community, Rev. 2 (2008)
scope note: - производство на килими и текстилни подови настилки от всякакъв вид текстилни материали • килими, пътеки, изтривалки - производство на иглонабити килимени изделия (мокети) - производство на изделия от материали за плетене - рогозки, изтривалки, паравани и други подобни - 16.29 - производство на подови настилки от естествен или агломериран корк - 16.29 - производство на линолеум и подобни еластични настилки - 22.23 @bg
scope note: Z: - výrobu textilních podlahových krytin: • koberců, koberečků, pokrývek, houní a rohoží, textilních dlaždic ZT: - výrobu plstěných podlahových krytin z jehličkových stavů N: - výrobu rohoží a podlahových krytin z splétaných materiálů (16.29) - výrobu podlahových krytin z korku (16.29) - výrobu elastických podlahových krytin, např. vinyl, linoleum (22.23) @cs
scope note: Diese Klasse umfasst: - Herstellung von textilen Bodenbelägen: • Teppiche, Brücken, Läufer und Matten, Teppichfliesen Diese Klasse umfasst ferner: - Herstellung von Bodenbelägen aus Nadelfilz Diese Klasse umfasst nicht: - Herstellung von Matten und Fußmatten aus Flechtgewebe (s. 16.29) - Herstellung von Bodenbelägen aus Kork (s. 16.29) - Herstellung von elastischen Bodenbelägen, z. B. aus Vinyl, Linoleum (s. 22.23) @de
scope note: This class includes: - manufacture of textile floor coverings: • carpets, rugs and mats, tiles This class also includes: - manufacture of needle-loom felt floor coverings This class excludes: - manufacture of mats and matting of plaiting materials, see 16.29 - manufacture of floor coverings of cork, see 16.29 - manufacture of resilient floor coverings, such as vinyl, linoleum, see 22.23 @en
scope note: Esta clase comprende: - la fabricación de revestimientos textiles para suelos: • alfombras, moquetas, felpudos y esteras, baldosas Esta clase comprende también: - la fabricación de revestimientos para suelos de fieltro Esta clase no comprende: - la fabricación de felpudos y esteras de materias trenzables (véase 16.29); - la fabricación de revestimientos de suelos a base de corcho (véase 16.29); - la fabricación de revestimientos de suelos resistentes, como los de vinilo o linóleo (véase 22.23). @es
scope note: Cette classe comprend: - la fabrication de revêtements de sols en matières textiles: • tapis, carpettes, paillassons, carreaux Cette classe comprend également: - la fabrication de revêtements de sols en feutres aiguilletés Cette classe ne comprend pas: - la fabrication de nattes et de paillassons en matières à tresser, voir 16.29 - la fabrication de revêtements de sols en liège, voir 16.29 - la fabrication de revêtements de sols résistants, en vinyle ou en linoléum, voir 22.23 @fr
scope note: Ovaj razred uključuje: - proizvodnju tekstilnih prekrivača za pod: • tepiha, sagova, prostiraka i otirača Ovaj razred također uključuje: - proizvodnju iglanih prekrivača za pod od filca Ovaj razred isključuje: - proizvodnju otirača i prostirača od pletarskih materijala, vidi 16.29 - proizvodnju prostirki za pod od pluta, vidi 16.29 - proizvodnju savitljivih podnih prostirki kao što su vinil, linoleum, vidi 22.23
scope note: Į šią klasę įeina: - austinių grindų dangų gamyba: • kilimų, gauruotų kilimėlių ir paklotų, plytelių Į šią klasę taip pat įeina: - veltinių grindų dangų gamyba Į šią klasę neįeina: - paklotų ir demblių iš pynimo medžiagų gamyba, žr. 16.29 - kamštienos grindų dangų gamyba, žr. 16.29 - tampriųjų grindų dangų, tokių kaip vinilplastis, linoleumas, gamyba, žr. 22.23 @lt
scope note: Этот класс включает: - производство сжатых тканей, включая ткани с нетканой липкой основой - производство этикеток, эмблем и т.п. - производство декоративных аксессуаров: шнуров, тесьмы, кистей, помпонов и т.д. - производство пропитанных, окрашенных, прорезиненных и покрытых пластиком тканей - производство металлизированной пряжи, резиновых нитей и текстильных веревок, текстильной пряжи или пропитанных, окрашенных, прорезиненных и покрытых пластиком шнуров - производство резиновой ткани из высокопрочного искусственного материала - производство прочих обработанных и пропитанных тканей: кальки, канвы готовой для использования художниками, холстов и подобных грубых текстильных тканей, тканей покрытых клеем или эмульсией - производство разнотипных текстильных изделий: фитилей, кожухов для газовых труб - производство плащевой ткани, ткани для пожарных рукавов/шлангов, трансмиссионных и конвейерных ремней (усиленных и не усиленных металлическими или прочими материалами), сетчатой ткани, эластичной одежды - производство предметов декоративной отделки автомобиля - производство холстов для рисования и кальки Этот класс исключает: - производство лент и ремней для конвейеров и транспортеров из текстильных тканей или из текстильной пряжи или корда с пропиткой, покрытием, верхним слоем или прослойкой из резины, где резина служит основным компонентом, см. 22.19 - производство пластин или листов из пористой резины или пластмассы в сочетании с текстилем, используемым только для укрепления, см. 22.19, 22.21 - производство тканей из металлической проволоки, см. 25.93 @ru
scope note: Bu sınıf aşağıdakileri kapsamaktadır; - tekstil yer kaplamalarının imalatı: • halılar, kilim ve hasırlar, yer döşemeleri. Ayrıca bu sınıf aşağıdakileri de kapsamaktadır; - iğneli dokuma tezgahlarında dokunan keçe yer kaplamaları imalatı. Kapsam dışı olanlar; - hasır ve örgü malzemelerinden hasır örgüsü imalatı, bkz. 16.29, - mantar yer kaplamaları imalatı, bkz. 16.29, - vinil, muşamba gibi esnek yer kaplamalarının imalatı, bkz. 22.23. @tr
preferred label: Производство на килими и текстилни подови настилки @bg
preferred label: Výroba koberců a kobercových předložek @cs
preferred label: Fremstilling af tæpper @da
preferred label: Herstellung von Teppichen @de
preferred label: Κατασκευή χαλιών και κιλιμιών @el
preferred label: Fabricación de alfombras y moquetas @es
preferred label: Vaipade ja vaipkatete tootmine @et
preferred label: Mattojen valmistus @fi
preferred label: Fabrication de tapis et moquettes @fr
preferred label: Szőnyeggyártás
preferred label: Fabbricazione di tappeti e moquette @it
preferred label: Kilimų ir kilimėlių gamyba @lt
preferred label: Paklāju un grīdsegu ražošana @lv
preferred label: Manifattura ta' twapet u twapet żgħar (rugs) @mt
preferred label: Vervaardiging van vloerkleden en tapijt @nl
preferred label: Produksjon av gulvtepper, -matter og -ryer @no
preferred label: Produkcja dywanów i chodników @pl
preferred label: Fabricação de tapetes e carpetes @pt
preferred label: Fabricarea de covoare şi mochete @ro
preferred label: Производство ковров и ковровых изделий @ru
preferred label: Výroba kobercov a rohoží @sk
preferred label: Proizvodnja preprog @sl
preferred label: Tillverkning av mattor @sv
preferred label: Halı ve kilim imalatı @tr
broader: Manufacture of other textiles

Manufacture of cordage, rope, twine and netting
type: Concept
notation: 13.94
status: valid
status modified: 2013-10-18
accepted date: 2013-10-18
in scheme: Statistical Classification of Economic Activities in the European Community, Rev. 2 (2008)
scope note: - производство на канапи, въжета и дебели въжета от текстилни влакна или ленти или други подобни - импрегнирани, покрити или обшити с каучук или пластмаси или необработени по този начин - производство на мрежи със завързани бримки от прежди, канапи, въжета или дебели въжета - производство на мрежи или изделия от въжета: риболовни мрежи, корабни фендери, въжета с метални пръстени и други - производство на тънки мрежички за коса - 14.19 - производство на метални въжета - 25.93 - производство на риболовни мрежи за спортни цели (кепчета) - 32.30 - поправка на риболовни мрежи, вкл. изкърпване - 33.19 @bg
scope note: Z: - výrobu provazů, lanoví, motouzů a kotevních lan z textilních vláken, pruhů textilu apod., také impregnovaných, potažených nebo obalených pryží nebo plastem - výrobu uzlovaných síťovin z provázků, lanoví nebo provazů - výrobu produktů z provazu nebo síťoviny: rybářských sítí, lodních chráničů - odrazníků, nákladních sítí, zvedacích lan, provazů a lan opatřených kovovými kroužky atd. N: - výrobu sítěk na vlasy (14.19) - výrobu drátěných lan (25.93) - výroba podběráků pro sportovní rybářství (32.30) @cs
scope note: Diese Klasse umfasst: - Herstellung von Bindfäden, Tauwerk, Seilen und Kabeln aus Textilfasern, -streifen o. ä., auch imprägniert, mit Gummi oder Kunststoffen beschichtet, überzogen oder umhüllt - Herstellung von geknüpftem Netzwerk aus Netzgarn, Tauwerk oder Seilen - Herstellung von Erzeugnissen aus Seilen oder Netzwerk: Fischernetze, Fender, Entladekissen, Stroppen, mit Metallringen besetzte Seile und Kabel usw. Diese Klasse umfasst nicht: - Herstellung von Haarnetzen (s. 14.19) - Herstellung von Drahtseilen (s. 25.93) - Herstellung von Keschern für die Sportfischerei (s. 32.30) @de
scope note: This class includes: - manufacture of twine, cordage, rope and cables of textile fibres or strip or the like, whether or not impregnated, coated, covered or sheathed with rubber or plastics - manufacture of knotted netting of twine, cordage or rope - manufacture of products of rope or netting: fishing nets, ships' fenders, unloading cushions, loading slings, rope or cable fitted with metal rings etc. This class excludes: - manufacture of hairnets, see 14.19 - manufacture of wire rope, see 25.93 - manufacture of landing nets for sports fishing, see 32.30 @en
scope note: Esta clase comprende: - la fabricación de cuerdas, cordeles, bramantes y cordajes de fibras textiles, cintas y similares, estén o no impregnados, bañados, recubiertos o revestidos de caucho o materias plásticas - la fabricación de redes de punto anudado hechas de cordelería; - la fabricación de productos de cordelería y de redes: redes para pescar, guardamancebos para embarcaciones, cojines de descarga, eslingas, cuerdas o cables equipados con anillas metálicas, etc. Esta clase no comprende: - la fabricación de redecillas para el pelo (véase 14.19) - la fabricación de cable metálico (véase 25.93) - la fabricación de salabres para pesca deportiva (véase 32.30) @es
scope note: Cette classe comprend: - la fabrication de ficelles, de cordes et de cordages en fibres textiles, lames ou formes similaires, même imprégnés, enduits, recouverts ou gainés de caoutchouc ou de matière plastique - la fabrication de filets à mailles nouées obtenus à partir de ficelles, de cordes ou de cordages - la fabrication d’articles de corderie et de filets: filets de pêche, défenses de bateaux, coussins de déchargement, élingues de chargement, cordes ou cordages munis d’anneaux métalliques, etc. Cette classe ne comprend pas: - la fabrication de résilles et filets à cheveux, voir 14.19 - la fabrication de câbles métalliques, voir 25.93 - la fabrication d’épuisettes pour la pêche sportive, voir 32.30 @fr
scope note: Ovaj razred uključuje: - proizvodnju upletenoga konca, konopca i kabela od tekstilnih vlakana, vrpca i sl. bez obzira na to jesu li imregnirani ili nisu, presvučeni, prekriveni, zaštićeni gumom ili plastikom - proizvodnju čvoranih mreža od upletenoga konca, konopca ili užeta - proizvodnju proizvoda od užadi ili mreža: ribarskih mreža, odbojnika za brodove, jastuka za iskrcaj, omči za ukrcaj, užadi ili kabela opremljenih metalnim kolutima itd. Ovaj razred isključuje: - proizvodnju mrežica za kosu, vidi 14.19 - proizvodnju žičanoga konopca, vidi 25.93 - proizvodnju mreža za sportski ribolov, vidi 32.30
scope note: Į šią klasę įeina: - guma ir plastikais įmirkytų arba neįmirkytų, dengtų ar nedengtų, apvilktų ar neapvilktų, aptrauktų ar neaptrauktų tekstilės pluoštų virvių, virvelių, lynų, laivavirvių ar juostelių, ar panašių dirbinių gamyba - tinklų iš virvių, virvelių ar lynų gamyba - tinklinės medžiagos ar virvių dirbinių, pvz., tinklų žuvims gaudyt, laivo fenderių, iškrovimo pagalvių, pakrovimo stropų, lynų ar laivavirvių su metaliniais žiedais ir kt., gamyba Į šią klasę neįeina: - tinklelių plaukams gamyba, žr. 14.19 - metalinių virvių gamyba, žr. 25.93 - sportinės žūklės graibštukų gamyba, žr. 32.30 @lt
scope note: Этот класс включает: - производство войлока и фетра - производство тюля и прочих сетчатых тканей, кружев и вышивок в виде полотна, ленты или орнамента - производство тканевой ленты, чувствительной к сдавливанию - производство текстильных шнурков для ботинок - производство пуховок и перчаток Этот класс исключает: - производство войлочных напольных покрытий, см. 13.93 - производство текстильного материала для набивки и изделий из материала для набивки: гигиенических полотенец, тампонов и т.д., см. 17.22 @ru
scope note: Bu sınıf aşağıdakileri kapsamaktadır; - kauçuk veya plastik ile emdirilmiş, kaplanmış, örtülmüş veya kılıflanmış olsun ya da olmasın tekstil elyafından veya şeritten ya da benzerlerinden kalın sicim, ip, halat ve kordon imalatı, - sicim, ip veya halattan örülmüş ağ imalatı, - ip ve ağ ürünleri imalatı: balık ağı, gemi halatları, yük boşaltma ağları, metal halkalarla donatılmış ip veya tekstille kaplanmış kablolar, vb. Kapsam dışı olanlar; - saç filesi imalatı, bkz. 14.19, - tel kablo (halat) imalatı, bkz. 25.93, - balıkçılık sporu için gerekli olan, balık yakalamaya özgü ağ kepçeleri imalatı, bkz. 32.30. @tr
preferred label: Производство на канапи, въжета, мрежи и изделия от тях @bg
preferred label: Výroba lan, provazů a síťovaných výrobků @cs
preferred label: Fremstilling af reb, tovværk, sejlgarn og netstoffer @da
preferred label: Herstellung von Seilerwaren @de
preferred label: Κατασκευή χοντρών και λεπτών σχοινιών, σπάγγων και διχτυών @el
preferred label: Fabricación de cuerdas, cordeles, bramantes y redes @es
preferred label: Nööri-, köie- ja võrgulina tootmine @et
preferred label: Purjelankojen, nuoran, sidelangan ja verkkojen valmistus @fi
preferred label: Fabrication de ficelles, cordes et filets @fr
preferred label: Kötéláru gyártása
preferred label: Fabbricazione di spago, corde, funi e reti @it
preferred label: Virvių, lynų, virvelių ir tinklų gamyba @lt
preferred label: Tauvu, virvju, auklu un tīklu ražošana @lv
preferred label: Manifattura ta' ċwiemi, ħbula, spag u xbieki @mt
preferred label: Vervaardiging van koord, bindgaren, touw en netten @nl
preferred label: Produksjon av tauverk og nett @no
preferred label: Produkcja wyrobów powroźniczych, lin, szpagatów i wyrobów sieciowych @pl
preferred label: Fabricação de cordoaria e redes @pt
preferred label: Fabricarea de odgoane, frânghii, sfori şi plase @ro
preferred label: Производство веревок, канатов, бечевок, шнурков, шнуров и плетения сетей @ru
preferred label: Výroba povrazov, šnúr, motúzov a sieťovín @sk
preferred label: Proizvodnja vrvi, vrvic in mrež @sl
preferred label: Tågvirkes- och bindgarnstillverkning @sv
preferred label: Halat, ip, sicim ve ağ imalatı @tr
broader: Manufacture of other textiles

Manufacture of non-wovens and articles made from non-wovens, except apparel
type: Concept
notation: 13.95
status: valid
status modified: 2013-10-18
accepted date: 2013-10-18
in scheme: Statistical Classification of Economic Activities in the European Community, Rev. 2 (2008)
scope note: Този клас включва разнообразни дейности, свързани с текстилната промишленост, некласифицирани никъде другаде в раздели 13 и 14. @bg
scope note: Tato třída zahrnuje všechny činnosti související s výrobou textilií a textilních výrobků, neuvedené jinde v oddílech 13 nebo 14, a které obsahují velký počet výrobních postupů a množství různých výrobků. @cs
scope note: Diese Klasse umfasst alle Tätigkeiten im Zusammenhang mit der Herstellung von Textilien und Textilwaren, die in den Abteilungen 13 oder 14 nicht anderweit genannt sind, und beinhaltet eine große Anzahl von Verfahren sowie eine Vielzahl unterschiedlicher Güter. @de
scope note: This class includes all activities related to the manufacture of textiles or textile products, not specified elsewhere in division 13 or 14, involving a large number of processes and a great variety of goods produced. @en
scope note: Esta clase comprende todas las actividades relacionadas con la fabricación de textiles y productos confeccionados con éstos no especificadas en las divisiones 13 ó 14, que incluyen un gran número de procesos y una amplia gama de artículos producidos. @es
scope note: Cette classe comprend toutes les activités de production des textiles ou des produits textiles, non citées dans les divisions 13 ou 14, ainsi qu’un grand nombre de processus et une grande variété de produits confectionnés. @fr
scope note: Ovaj razred uključuje sve djelatnosti koje se odnose na proizvodnju tekstila i tekstilnih proizvoda te nisu razvrstane u odjeljcima 13 ili 14, a uključuju velik broj prerada i širok raspon proizvedenih dobara.
scope note: Į šią klasę įeina visos veiklos rūšys, susijusios su tekstile ar tekstilės gaminiais ir dirbiniais, tiksliai neapibrėžtais nei 13, nei 14 skyriuose, tačiau aprėpiančios labai daug technologinių procesų ir labai daug įvairių pagamintų daiktų. @lt
scope note: Данный раздел включает все швейные изделия (готовые или сделанные по индивидуальному заказу) из всех материалов (например, из кожи, текстильных тканей, вязаных и трикотажных тканей и т.д.), все виды одежды (например, верхняя одежда, нижнее белье для мужчин, женщин или детей; рабочая, офисная или повседневная одежда и т.д.) и аксессуары. Не существует каких-либо разграничений между одеждой для взрослых и для детей или между современной и традиционной одеждой. Раздел 14 также включает производство кожаной одежды (меховых изделий). @ru
scope note: Bu sınıf tekstillerle veya tekstil ürünleri imalatı ile ilgili olup 13 veya 14`üncü bölümlerde özel olarak belirtilmemiş olan ve çok büyük sayıda işlem gören ve çok çeşitli üretilmiş malları içeren tüm faaliyetleri kapsamaktadır. @tr
preferred label: Производство на нетъкани текстилни изделия, без облекло @bg
preferred label: Výroba netkaných textilií a výrobků z nich, kromě oděvů @cs
preferred label: Fremstilling af fiberdug og varer af fiberdug undtagen beklædningsartikler @da
preferred label: Herstellung von Vliesstoff und Erzeugnissen daraus (ohne Bekleidung) @de
preferred label: Κατασκευή μη υφασμένων ειδών και προϊόντων από μη υφασμένα είδη, εκτός από τα ενδύματα @el
preferred label: Fabricación de telas no tejidas y artículos confeccionados con ellas, excepto prendas de vestir @es
preferred label: Lausriide ja lausriidest toodete tootmine, v.a rõivad @et
preferred label: Kuitukankaiden ja kuitukangastuotteiden valmistus (pl. vaatteet) @fi
preferred label: Fabrication de non-tissés, sauf habillement @fr
preferred label: Nem szőtt textília és termék gyártása (kivéve: ruházat)
preferred label: Fabbricazione di tessuti non tessuti e di articoli in tali materie, esclusi gli articoli di abbigliamento @it
preferred label: Neaustinių medžiagų ir neaustinių medžiagų gaminių ir dirbinių, išskyrus drabužius, gamyba @lt
preferred label: Neaustu drānu un to izstrādājumu ražošana, izņemot apģērbu @lv
preferred label: Manifattura ta' oġġetti mhux minsuġa u oġġetti oħra magħmula minn oġġetti mhux minsuġa, għajr lbies @mt
preferred label: Vervaardiging van gebonden textielvlies en van artikelen van gebonden textielvlies, exclusief kleding @nl
preferred label: Produksjon av ikke-vevde tekstiler og tekstilvarer, unntatt klær @no
preferred label: Produkcja włóknin i wyrobów wykonanych z włóknin, z wyłączeniem odzieży @pl
preferred label: Fabricação de não tecidos e respectivos artigos, excepto vestuário @pt
preferred label: Fabricarea de textile neţesute şi articole din acestea, cu excepţia confecţiilor de îmbrăcăminte @ro
preferred label: Производство нетканых изделий, за исключением одежды @ru
preferred label: Výroba netkaného textilu a výrobkov z neho okrem odevov @sk
preferred label: Proizvodnja netkanih tekstilij in izdelkov iz njih, razen oblačil @sl
preferred label: Tillverkning av bondad duk @sv
preferred label: Dokuma olmayan kumaşlar ile dokuma olmayan kumaştan yapılan ürünlerin imalatı, giyim eşyası hariç @tr
broader: Manufacture of other textiles

Manufacture of other technical and industrial textiles
type: Concept
notation: 13.96
status: valid
status modified: 2013-10-18
accepted date: 2013-10-18
in scheme: Statistical Classification of Economic Activities in the European Community, Rev. 2 (2008)
scope note: - производство на ленти, вкл. с основа без вътък, „съединена“ посредством адхезив (свързващо вещество) - производство на етикети, емблеми и други - производство на пасмантерийни и аналогични орнаментни изделия: ширити, пискюли, помпони и други - производство на тъкани, импрегнирани, покрити или ламинирани с пластмаси - производство на метализирана прежда или обвита (облечена) с метал прежда; нишки и въжета от каучук, покрити с текстилен материал; текстилна прежда или ленти, покрити, импрегнирани или обвити с каучук или с пластмаси - платна за пневматични гуми от химични прежди с висока здравина - производство на други обработени или покрити платове: проклеено ленено (памучно) платно и подобни колосани текстилни платове; платове, покрити с лепила или нишестени материали - производство на разнообразни текстилни изделия: текстилни фитили, чорапчета за газови лампи - производство на плат за нажежаеми чорапчета, маркучи, транспортни ленти и трансмисионни ремъци (дори подсилени с метални нишки или други материали), платове за пресяване и филтриране и други подобни - производство на гарнитури за автомобили - производство на платна за рисуване или чертане (копиране на образец) - производство на трансмисионни ремъци и транспортни ленти от текстилни платове и нишки, импрегнирани, покрити, обвити или ламинирани с каучук, чието съдържание е преобладаващо - 22.19 - производство на листове или плочи от порести пластмаси или каучук, подсилени с текстил - 22.19, 22.21 - производство на метални платна от тел - 25.93 @bg
scope note: Z: - výrobu pásů a stuh včetně bezútkových textilií, vyrobených s použitím lepidel - výrobu štítků, nálepek, odznaků atd. - výrobu ornamentálních ozdob: stuh, prýmků, střapců, bambulí atd. - výrobu tkanin impregnovaných, potažených, opředených nebo laminovaných plasty - výrobu metalizovaných vláken nebo metalizovaných přízí, gumových nití (vláken) a motouzů opředených textilními vlákny, textilních vláken nebo pruhů textilu opředených, impregnovaných, potažených nebo zesílených pryží nebo plasty - výrobu kordové tkaniny pro pneumatiky z vysoce odolných přízí z umělých vláken - výrobu jiných impregnovaných nebo potažených tkanin: tuhá plátna a podobné vyztužené textilní tkaniny potažené gumou nebo škrobovitými substancemi - výrobu rozmanitých textilních výrobků: knoty, žárové punčošky (žhavící vlákna do plynových svítidel) - výrobu potahovaných tkanin, hadicového vedení, hnacích řemenů nebo řemenových pohonů (také zesílených kovy nebo jinými materiály), nosné a napínací tkaniny - výrobu textilních výrobků pro vybavení motorových vozidel N: - výrobu dopravníkových pásů a hnacích řemenů z vláken, příze nebo kordu, impregnovaných, potažených nebo laminovaných pryží, představuje-li pryž hlavní součást (22.19) - výrobu desek anebo tabulí z lehčené pryže nebo lehčených plastů, které jsou textilem pouze zesílené (22.19, 22.21) - výrobu tkanin s vetkaným kovovým drátem (25.93) @cs
scope note: Diese Klasse umfasst: - Herstellung von Bändern und Gurten einschließlich Gewebe aus geklebten Ketten ohne Schuss - Herstellung von Etiketten, Abzeichen usw. - Herstellung von Verzierungsborten: Besätze, Quasten, Troddeln usw. - Herstellung von mit Kunststoffen imprägnierten, überzogenen, besetzten oder laminierten Geweben - Herstellung von Geweben mit Metalleinlage und metallisierten Gimpen, von mit Spinnstoffen besetzten Schnüren aus Gummifäden, von mit Gummi oder Kunststoffen besetzten, imprägnierten, überzogenen oder verstärkten Textilgarnen oder -streifen - Herstellung von Cordgewebe für Kraftfahrzeugreifen aus hochfesten Kunstfasergarnen - Herstellung von sonstigen behandelten oder beschichteten Geweben: Steifleinen oder ähnliche versteifte Textilgewebe, mit Gummi oder stärkehaltigen Substanzen überzogene Gewebe - Herstellung von verschiedenen Textilwaren des technischen Bedarfs: Dochte, Glühstrümpfe, Gewebe dafür - Herstellung von Glühstrumpfgewebe, Schläuchen, Förderbändern und Treibriemen (auch mit Metall oder anderen Stoffen verstärkt), Müllergaze, Filtertüchern - Herstellung von Textilerzeugnissen zur Ausstattung von Kraftfahrzeugen - Herstellung von mit Malerleinwand beklebten Platten und Pausleinen Diese Klasse umfasst nicht: - Herstellung von Förderbändern und Treibriemen aus Spinnstoffen, Garn oder Cord, die mit Gummi imprägniert, beschichtet, überzogen oder laminiert sind, wenn Gummi den Hauptbestandteil darstellt (s. 22.19) - Herstellung von mit Textilien lediglich verstärkten Platten und Matten aus Zellkautschuk oder Zellkunststoff (s. 22.19, 22.21) - Herstellung von Metallgeweben (s. 25.93) @de
scope note: This class includes: - manufacture of narrow woven fabrics, including fabrics consisting of warp without weft assembled by means of an adhesive - manufacture of labels, badges etc. - manufacture of ornamental trimmings: braids, tassels, pompons etc. - manufacture of fabrics impregnated, coated, covered or laminated with plastics - manufacture of metallised yarn or metallised gimped yarn, rubber thread and cord covered with textile material, textile yarn or strip covered, impregnated, coated or sheathed with rubber or plastics - manufacture of tyre cord fabric of high-tenacity man-made yarn - manufacture of other treated or coated fabrics: buckram and similar stiffened textile fabrics, fabrics coated with gum or amylaceous substances - manufacture of diverse textile articles: textile wicks, incandescent gas mantles and tubular gas - manufacture of mantle fabric, hosepiping, transmission or conveyor belts or belting (whether or not reinforced with metal or other material), bolting cloth, straining cloth - manufacture of automotive trimmings - manufacture of artists' canvas boards and tracing cloth This class excludes: - manufacture of transmission or conveyor belts of textile fabric, yarn or cord impregnated, coated, covered or laminated with rubber, where rubber is the chief constituent, see 22.19 - manufacture of plates or sheets of cellular rubber or plastic combined with textiles for reinforcing purposes only, see 22.19, 22.21 - manufacture of cloth of woven metal wire, see 25.93 @en
scope note: Esta clase comprende: - la fabricación de cintas tejidas, incluidas las consistentes en urdimbre sin trama unidas por medio de un adhesivo - la fabricación de etiquetas, insignias, etc. - la fabricación de guarniciones ornamentales: galones, borlas, pompones, etc. - la fabricación de tejidos impregnados, bañados, recubiertos o estratificados con materias plásticas - la fabricación de hilo metalizado y de hilo recubierto metalizado, de cuerda de hilo de goma recubierta de materia textil, de hilo o cinta textil recubiertos, impregnados, bañados o revestidos con caucho o materias plásticas - la fabricación de tejido de cordelería para neumáticos de hilo sintético o artificial de alta tenacidad - la fabricación de otros tejidos tratados o recubiertos: bucarán y otros tejidos reforzados similares, tejidos bañados en goma o almidón - la fabricación de productos textiles diversos: mechas textiles, manguitos (camisas) incandescentes para gas y tejido tubular para su fabricación - la fabricación de tejidos para manguitos, mangueras, cintas transportadoras o de transmisión (reforzadas o no con metal u otro material), gasas y telas para cerner, tejidos filtrantes - la fabricación de guarnicionería para automóviles - la fabricación de lienzos para pintura y papel tela para dibujo Esta clase no comprende: - la fabricación de cintas transportadoras o de transmisión de tejidos, hilos o cuerdas impregnados, bañados, recubiertos o estratificados con caucho, en los casos en que éste constituye el componente principal (véase 22.19) - la fabricación de planchas u hojas de caucho celular o plástico combinadas con textiles únicamente con fines de refuerzo (véase 22.19 y 22.21) - la fabricación de tela de cable metálico tejido (véase 25.93) @es
scope note: Cette classe comprend: - la fabrication d’articles de rubanerie, y compris les rubans sans trame, en fils ou fibres parallélisés et encollés - la fabrication d’étiquettes, d’écussons, etc. - la fabrication d’ouvrages de passementerie et d’articles ornementaux analogues: tresses, glands, pompons, etc. - la fabrication de tissus imprégnés, enduits ou recouverts de matière plastique ou stratifiés avec de la matière plastique - la fabrication de filés métalliques et de fils métallisés, même guipés, de fils et de cordes de caoutchouc recouverts de textiles, de fils textiles ou de lames recouverts, imprégnés, enduits ou gainés de caoutchouc ou de matière plastique - la fabrication de nappes tramées pour pneumatiques obtenues à partir de fils synthétiques ou artificiels à haute ténacité - la fabrication d’autres tissus traités ou enduits: bougrans et tissus raidis similaires, tissus enduits de colle ou de matières amylacées - la fabrication d’articles divers en matières textiles: mèches, manchons à incandescence et étoffes tubulaires servant à leur fabrication - la fabrication d’étoffes tubulaires, tuyaux pour pompes, courroies transporteuses ou de transmission (renforcées ou non de métal ou d’autres matériaux), gazes et toiles à bluter, étamines - la fabrication de garnitures pour automobiles - la fabrication de toiles préparées pour la peinture, de toiles à calquer ou transparentes pour le dessin Cette classe ne comprend pas: - la fabrication de courroies transporteuses ou de transmission en tissus imprégnés, enduits ou recouverts de caoutchouc ou stratifiés avec cette même matière, si le caoutchouc est l’élément principalement utilisé, voir 22.19 - la fabrication de plaques ou de feuilles en caoutchouc alvéolaire ou en matières plastiques associés à des matières plastiques uniquement à des fins de renforcement, voir 22.19, 22.21 - la fabrication de toiles métalliques, voir 25.93 @fr
scope note: Ovaj razred uključuje: - proizvodnju uskih tkanina, uključujući tkanine s osnovom bez potke, sastavljenu ljepilom - proizvodnju naljepnica, značaka itd. - proizvodnju ukrasnog pribora: vrpca, resa, pompona (loptica) itd. - proizvodnju tkanina impregniranih, presvučenih, prekrivenih ili laminiranih plastikom - proizvodnju metalizirane pređe i obavijene pređe, gumenoga konca i korda pokrivenoga s tekstilnim materijalom, tekstilne pređe ili vrpci prekrivenih, impregniranih, presvučenih gumom ili plastikom - proizvodnju korda za autogume od umjetne pređe visoke čvrstoće - proizvodnju raznih tekstilnih proizvoda: fitilja i vatrootpornih mrežica za plin - proizvodnju tekstilnih crijeva za vodu, pogonskih traka i remena (bez obzira na to jesu li su pojačani metalom ili nekim drugim materijalom ili nisu), tkanina za sita, za filtere - proizvodnju tekstilnih proizvoda za opremanje motornih vozila - proizvodnju slikarskog platna Ovaj razred isključuje: - proizvodnju prijenosnih vrpca, prijenosnoga pogonskog remenja od tekstilne tkanine, pređe ili korda impregniranog, presvučenog, prekrivenog ili laminiranoga s gumom, kada je guma pretežni sadržaj, vidi 22.19 - proizvodnju ploča i folija od celularne gume ili plastike u kombinaciji s tekstilom samo radi pojačanja, vidi 22.19, 22.21 - proizvodnju tkanina od pletene metalne žice, vidi 25.93
scope note: Į šią klasę įeina: - juostinių audinių, įskaitant beataudinius audinius, sutvirtintus rišamosiomis medžiagomis, gamyba - žymenų (etikečių), emblemų ir kt., gamyba - puošybinių apsiuvų, juostelių, kutų, bumbulų (pomponų) ir kt., gamyba - įmirkytų, aptrauktų, padengtų, arba laminuotų plastiku audinių gamyba - metalizuotų ar metalizuotų galioninių verpalų, guminių siūlų ir virvelių, padengtų tekstilės medžiagomis, tekstilės pluoštais ar juostomis, ir įmirkytų, padengtų, aptrauktų ar apvilktų guma ar plastikais, gamyba - padangų kordo audinių iš sustiprintų cheminių verpalų gamyba - kitų apdorotų ar padengtų tekstilės gaminių, pvz., klijuotės ir panašių standintų tekstilės audinių, padengtų guma ar krakmolingomis medžiagomis, gamyba - įvairių tekstilės dirbinių, pvz., dagčių, kaitinamųjų tinklelių ir cilindrinio tinklelių audinio, gamyba - apvalkalinių audinių, laistomųjų žarnų, pavarų diržų, konvejerių juostų arba diržinių pavarų, sietinių audeklų ir filtrų audinio gamyba - automobilių apsiuvų gamyba - tapybai skirtų storų drobių ir kopijavimo audinių gamyba Į šią klasę neįeina: - pavarų diržai ar konvejerių juostų, gaminamų iš tekstilės audinių, verpalų ar kordų įmirkytų, padengtų, aptrauktų arba laminuotų guma, kai guma yra pagrindinė sudedamoji dalis, žr. 22.19 - plokščių, lakštų arba juostelių gamyba iš akytosios gumos arba akytojo plastiko, derinant šias medžiagas su tekstilinėmis medžiagomis, kuriose audinys yra naudojamas tik sustiprinti, žr. 22.19, 22.21 - austinio vielinio audinio gamyba, žr. 25.93 @lt
scope note: Данная группа включает производство одежды. Материалами, используемыми в данной промышленности, могут быть любые виды тканей, в т.ч. обработанные, пропитанные или прорезиненные. @ru
scope note: Bu sınıf aşağıdakileri kapsamaktadır; - dar dokunan kumaşların imalatı, çözgülü kumaşlar dahil, bir yapıştırıcı ile birleştirilmiş, örülmüş kumaşlar hariç, - etiket, rozet vb. imalatı, - süsleme amaçlı aksesuar imalatı: kordonlar, kurdeleler, püsküller, ponponlar vb., - plastikle emdirilmiş kaplanmış, örtülmüş ya da preslenmiş kumaşlar imalatı, - metalize iplik ya da metalize kalın ipliklerin, tekstil maddeleri ile kaplanmış kauçuk ipliklerin ve sicimlerin, kauçukla ya da plastikle kaplanmış, örtülmüş, emdirilmiş veya kalıplanmış tekstil ipliklerinin veya şeritlerinin imalatı, - yüksek mukavemetli suni veya sentetik ipliklerden lastik kord bezi imalatı, - diğer işlem görmüş ya da kaplanmış diğer kumaşların imalatı: tela ve benzer sertleştirilmiş kumaşlar, zamk veya nişastalı maddelerle kaplanmış kumaşlar - çeşitli tekstil ürünleri imalatı: tekstil fitilleri, lüks lambası gömlekleri ile tüp şeklindeki gaz fitilleri, - lüks lambası gömleklerinin kumaşları, tekstil malzemelerinden hortumlar, taşıma ve konveyör bantları veya kayışları (metal ile ya da diğer materyallerle güçlendirilmiş olsun ya da olmasın), elek bezi ve süzgeç bezi imalatı, - otomobil süsleri imalatı, - ressamların kullanımı için tuval ve çizim kumaşı imalatı. Kapsam dışı olanlar; - kauçuk ana unsur olduğu durumlarda kauçukla kaplanmış, emdirilmiş, kaplanmış ya da kılıflanmış dokumacılık kumaşlarından, ipliklerden ya da sicimlerden nakliyecilik ya da taşımacılık kuşaklarının imalatı, bkz. 22.19, - yalnızca güçlendirme amacıyla gözenekli kauçukların ya da plastiklerin tekstillerle birleştirilmesinden oluşan tabaka ve levhaların imalatı, bkz. 22.19, 22.21, - dokunmuş metal tellerden kıyafet imalatı, bkz. 25.93. @tr
preferred label: Производство на други текстилни изделия за техническа и производствена употреба @bg
preferred label: Výroba ostatních technických a průmyslových textilií @cs
preferred label: Fremstilling af andre tekniske og industrielle tekstiler @da
preferred label: Herstellung von technischen Textilien @de
preferred label: Κατασκευή άλλων τεχνικών και βιομηχανικών κλωστοϋφαντουργικών ειδών @el
preferred label: Fabricación de otros productos textiles de uso técnico e industrial @es
preferred label: Tehnilise ja tööstusliku otstarbega tekstiilide tootmine @et
preferred label: Teknisten ja teollisuustekstiilien valmistus @fi
preferred label: Fabrication d'autres textiles techniques et industriels @fr
preferred label: Műszaki, textiláru gyártása
preferred label: Fabbricazione di tessuti per uso tecnico e industriale @it
preferred label: Kitų techninės ir pramoninės tekstilės gaminių ir dirbinių gamyba @lt
preferred label: Tehniski un rūpnieciski izmantojamu tekstilmateriālu ražošana @lv
preferred label: Manifattura ta' tessuti tekniċi u industrijali @mt
preferred label: Vervaardiging van ander technisch en industrieel textiel @nl
preferred label: Produksjon av tekstiler til teknisk og industriell bruk @no
preferred label: Produkcja pozostałych technicznych i przemysłowych wyrobów tekstylnych @pl
preferred label: Fabricação de têxteis para uso técnico e industrial @pt
preferred label: Fabricarea de articole tehnice şi industriale din textile @ro
preferred label: Производство прочих технических и промышленных текстильных изделий @ru
preferred label: Výroba ostatného technického a pracovného textilu @sk
preferred label: Proizvodnja tehničnega in industrijskega tekstila @sl
preferred label: Tillverkning av andra tekniska textilier och industritextilier @sv
preferred label: Diğer teknik ve endüstriyel tekstillerin imalatı @tr
broader: Manufacture of other textiles

Manufacture of other textiles n.e.c.
type: Concept
notation: 13.99
status: valid
status modified: 2013-10-18
accepted date: 2013-10-18
in scheme: Statistical Classification of Economic Activities in the European Community, Rev. 2 (2008)
scope note: - производство на филц - производство на тюл, мрежи, дантела, бродерия на парчета, на ленти или на мотиви - производство на самозалепващи се ленти от плат - производство на връзки за обувки - производство на пухове и пухчета за пудра и ръкавици с един пръст за масаж (пилинг) - производство на иглонабити текстилни подови настилки - 13.93 - производство на вати от текстилни материали и на изделия от тях: превръзки, тампони и пелени за бебета - 17.22 @bg
scope note: Z: - výrobu plstí - výrobu tylů a jiných síťových tkanin, typu krajek (tkanic, prýmků) a výšivek v kuse, pásech nebo motivech - výrobu samolepicích textilních pásek - výrobu textilních tkanic do obuvi - výrobu labutěnek (pudřenek) a rukavic N: - výrobu podlahových krytin z jehlové plsti (13.93) - výrobu vatelínů a výrobků z vaty: menstruačních vložek, tamponů atd. (17.22) @cs
scope note: Diese Klasse umfasst: - Herstellung von Filz - Herstellung von Tüll und anderen Netzgeweben, von Spitze am Stück, in Streifen oder mit Motiven, von Stickereien - Herstellung von selbstklebendem Gewebeband - Herstellung von Schnürsenkeln aus Spinnstoffen - Herstellung von Puderquasten und langen Handschuhen ohne Finger Diese Klasse umfasst nicht: - Herstellung von Bodenbelägen aus Nadelfilz (s. 13.93) - Herstellung von Textilwatte und Erzeugnissen aus Watte: Monatsbinden, Tampons usw. (s. 17.22) @de
scope note: This class includes: - manufacture of felt - manufacture of tulles and other net fabrics, and of lace and embroidery, in the piece, in strips or in motifs - manufacture of pressure sensitive cloth-tape - manufacture of shoe-lace, of textiles - manufacture of powder puffs and mitts This class excludes: - manufacture of needle-loom felt floor coverings, see 13.93 - manufacture of textile wadding and articles of wadding: sanitary towels, tampons etc., see 17.22 @en
scope note: Esta clase comprende: - la fabricación de fieltro - la fabricación de tules y de tejidos de mallas anudadas, de encajes en pieza, en tiras o en motivos, de bordados - la fabricación de cintas de tela sensibles a la presión - la fabricación de cordones de zapatos de materias textiles - la fabricación de borlas y pompones para maquillaje Esta clase no comprende: - la fabricación de revestimientos para suelos de fieltros (véase 13.93) - la fabricación de guata y artículos textiles de guata: compresas higiénicas, tampones, etc. (véase 17.22) @es
scope note: Cette classe comprend: - la fabrication de feutre - la fabrication de tulles, de tulles-bobinots et d’autres tissus à mailles nouées, de dentelles en pièces, en bandes ou en motifs, de broderies - la fabrication de ruban adhésif pour vêtements - la fabrication de lacets de chaussures en matières textiles - la fabrication de houppes à poudrer et de gants Cette classe ne comprend pas: - la fabrication de revêtements de sols en feutres aiguilletés, voir 13.93 - la fabrication d’ouates de matières textiles et d’articles en ces ouates: serviettes et tampons hygiéniques, etc. voir 17.22 @fr
scope note: Ovaj razred uključuje: - proizvodnju filca - proizvodnju tila i drugih mrežastih tkanina, čipke u metraži, u vrpcama ili u motivima vezenih tkanina - proizvodnju tekstilnih vrpci osjetljivih na pritisak - proizvodnju vezica za cipele, od tekstila - proizvodnju jastučića za pudranje i rukavica bez prstiju Ovaj razred isključuje: - proizvodnju iglanih pokrivača za pod od filca, vidi 13.93 - proizvodnju vate od tekstila i predmeta od vate: sanitarnih uložaka, tampona itd., vidi 17.22
scope note: Į šią klasę įeina: - veltinio gamyba - tiulio ir kitų tinklinių medžiagų, nėrinių ir siuvinėjimo dirbinių gabalų, juostelių ar motyvų pavidalo gamyba - slėgiui jautrių audeklinių juostų gamyba - tekstilinių batraiščių gamyba - pudrinukų veidui ir kūnui gamyba Į šią klasę neįeina: - veltinių grindų dangų gamyba, žr. 13.93 - tekstilinės vatos ir reikmenų iš vatos, pvz., higieninių rankšluosčių, tamponų ir kt., gamyba, žr. 17.22 @lt
scope note: Этот класс включает: - производство одежды из кожи или одежды с частичными кожаными вставками, включая рабочую кожаную одежду, аксессуары, например, кожаный фартук сварщика Этот класс исключает: - производство меховой одежды, см. 14.20 - производство спортивных кожаных перчаток и спортивных головных уборов, см. 32.30 - производство огнестойкой и защитной одежды, см. 32.99 @ru
scope note: Bu sınıf aşağıdakileri kapsamaktadır; - keçe imalatı, - tüller ve diğer ağ kumaşları imalatı ile parçalar, şeritler ya da motifler halinde dantel ve nakış imalatı, - basınçlı hassas giysi dokumaları imalatı, - tekstilden ayakkabı bağı imalatı, - pudra ponponu ve parmaksız eldiven imalatı. Kapsam dışı olanlar; - iğneli dokuma tezgahında keçeden yer kaplaması imalatı, bkz. 13.93, - tampon nevilerinin ve tampon parçalarının imalatı: pedler, adet bezleri, tamponlar vb., bkz. 17.22. @tr
preferred label: Производство на други текстилни изделия, некласифицирани другаде @bg
preferred label: Výroba ostatních textilií j. n. @cs
preferred label: Fremstilling af andre tekstiler i.a.n. @da
preferred label: Herstellung von sonstigen Textilwaren a. n. g. @de
preferred label: Κατασκευή άλλων υφαντουργικών προϊόντων π.δ.κ.α. @el
preferred label: Fabricación de otros productos textiles n.c.o.p. @es
preferred label: Mujal liigitamata tekstiilitootmine @et
preferred label: Muualla luokittelematon tekstiilituotteiden valmistus @fi
preferred label: Fabrication d'autres textiles n.c.a. @fr
preferred label: Egyéb textiláru gyártása m.n.s.
preferred label: Fabbricazione di altri prodotti tessili n.c.a. @it
preferred label: Kitų, niekur kitur nepriskirtų, tekstilės gaminių ir dirbinių gamyba @lt
preferred label: Citur neklasificētu tekstilizstrādājumu ražošana @lv
preferred label: Manifattura ta' tessuti oħra n.e.c. @mt
preferred label: Vervaardiging van andere textielproducten, n.e.g. @nl
preferred label: Produksjon av tekstiler ikke nevnt annet sted @no
preferred label: Produkcja pozostałych wyrobów tekstylnych, gdzie indziej niesklasyfikowana @pl
preferred label: Fabricação de outros têxteis n.e. @pt
preferred label: Fabricarea altor articole textile n.c.a. @ro
preferred label: Производство прочих текстильных изделий, не вошедших в другие категории @ru
preferred label: Výroba ostatného textilu i. n. @sk
preferred label: Proizvodnja drugje nerazvrščenih tekstilij @sl
preferred label: Övrig textilietillverkning @sv
preferred label: Başka yerde sınıflandırılmamış diğer tekstillerin imalatı @tr
broader: Manufacture of other textiles

Manufacture of wearing apparel
type: Concept
notation: 14
status: valid
status modified: 2013-10-18
accepted date: 2013-10-18
in scheme: Statistical Classification of Economic Activities in the European Community, Rev. 2 (2008)
scope note: производство на облекло (конфекция, по еталон или по поръчка) от всякакви материали (кожи, тъкани, плетени платове и други), всякакви видове (горно и долно; за мъже, жени или деца; работно, официално или всекидневно) и допълнения за облекло. Няма разграничение между облекло за възрастни или за деца, между модно и традиционно облекло. Този раздел включва още производство на изделия от кожухарски кожи. @bg
scope note: Tento oddíl zahrnuje všechny krejčovské práce (konfekční oděvy nebo oděvy na míru) ze všech materiálů (např. kůže, tkaniny, háčkovaných a pletených materiálů), pro všechny jednotlivé části oděvů (např. svrchní ošacení, pánské, dámské anebo dětské prádlo, pracovní oděvy, vycházkové oblečení nebo oblečení pro volný čas) a doplňky. Přitom se nerozlišuje mezi oděvy pro dospělé a dětskými oděvy nebo mezi moderním a tradičním oblečením. Oddíl 14 také zahrnuje kožešnický průmysl (kožešiny a kožešinové oděvy). @cs
scope note: Diese Abteilung umfasst alle Schneiderarbeiten (Konfektionskleidung oder Maßanfertigung) aus allen Materialien (Leder, Gewebe, gewirkter und gestrickter Stoff usw.) für alle Bekleidungsartikel (z. B. Oberbekleidung, Herren-, Damen- und Kinderwäsche, Arbeits-, Stadt- oder Freizeitkleidung) und Bekleidungszubehör. Es wird dabei nicht unterschieden zwischen Bekleidung für Erwachsene und Bekleidung für Kinder oder zwischen moderner und traditioneller Bekleidung. Die Abteilung 14 umfasst ferner die Herstellung von Pelzwaren (Pelzfelle und Pelzbekleidung). @de
scope note: This division includes all tailoring (ready-to-wear or made-to-measure), in all materials (e.g. leather, fabric, knitted and crocheted fabrics etc.), of all items of clothing (e.g. outerwear, underwear for men, women or children; work, city or casual clothing etc.) and accessories. There is no distinction made between clothing for adults and clothing for children, or between modern and traditional clothing. Division 14 also includes the fur industry (fur skins and wearing apparel). @en
scope note: Esta división abarca todo tipo de confección (confeccionada en serie o a medida), en todos los materiales (cuero, tejidos, punto, etc.), de todo tipo de prendas (exteriores, ropa interior para hombre, mujer y niño, ropa de trabajo, ropa de calle e informal, etc.) y accesorios. No se hace distinción entre prendas para adultos y para niños, o entre prendas modernas y tradicionales. La división 14 comprende también la industria peletera (pieles y prendas de vestir). @es
scope note: Cette division vise toute la confection (prêt-à-porter ou sur mesure), en toutes matières (cuir, tissu, étoffes à maille, etc.), de tous vêtements (dessus, dessous pour hommes, femmes, enfants, travail, ville, loisirs) et accessoires. Il n’est pas fait de distinction entre les vêtements pour adultes ou enfants ni entre les vêtements modernes et traditionnels. La division 14 comprend aussi l’industrie des fourrures (pelleteries et vêtements). @fr
scope note: Ovaj odjeljak uključuje izradu odjeće (gotove ili po mjeri), od svih materijala (npr. kože, tkanina, pletenih ili kukičanih tkanina itd.) i svih vrsta odjeće (npr. vanjske odjeće i rublja za muškarce, žene ili djecu; radne odjeće, odjeće za izlaske i svakodnevne odjeće, itd.) i pribora. Ovdje nema razlike između odjeće za odrasle i odjeće za djecu, kao ni između moderne ili tradicionalne odjeće. Odjeljak 14 također uključuje industriju krzna (krzno i odjeća od krzna).
scope note: Į šį skyrių įeina visų rūšių (standartinių dydžių ar individualių matmenų) iš įvairių medžiagų (pvz., odos, audinių, megztinių (trikotažinių) ir nertinių medžiagų ir kt.) ir įvairios paskirties (vyriškų, moteriškų ar vaikiškų; apatinių ar viršutinių; darbo, išeiginių ar kasdienių ir kt.) drabužių siuvimas, taip pat įvairių priedų drabužiams siuvimas. Nėra skirtumo, ar drabužiai siuvami suaugusiesiems, ar vaikams, taip pat ar siuvami modernūs, ar įprasti (tradiciniai) drabužiai. Į 14 skyrių taip pat įeina kailių pramonės veikla (kailių išdirbimas ir kailinių gaminių gamyba). @lt
scope note: Этот класс исключает: - производство обуви, см. 15.20 - производство огнестойкой и защитной одежды, см. 32.99 - ремонт одежды, см. 95.29 @ru
scope note: Bu bölüm, herhangi bir malzemeden (örn. deri, kumaş, örgü ve kroşe kumaşlar v.b) giysilerin (örn. dış giyim eşyaları, erkekler, kadınlar ve çocuklar için iç çamaşırları; iş kıyafetleri, veya günlük giysiler v.s.) ve aksesuarların dikim faaliyetlerini (hazır giyim, konfeksiyon veya ısmarlama elbise yapılması) kapsamaktadır. Yetişkinler ve çocuklar için üretilen giysiler veya modern ve geleneksel giysi üretilmesi arasında herhangi bir fark bulunmamaktadır. 14. bölüm ayrıca kürk sanayini (kürkten yapılan derileri ve giyim eşyalarını) de kapsamaktadır. @tr
preferred label: Производство на облекло @bg
preferred label: Výroba oděvů @cs
preferred label: Fremstilling af beklædningsartikler @da
preferred label: Herstellung von Bekleidung @de
preferred label: Κατασκευή ειδών ένδυσης @el
preferred label: Confección de prendas de vestir @es
preferred label: Rõivatootmine @et
preferred label: Vaatteiden valmistus @fi
preferred label: Industrie de l'habillement @fr
preferred label: Ruházati termék gyártása
preferred label: Confezione di articoli di abbigliamento @it
preferred label: Drabužių siuvimas (gamyba) @lt
preferred label: Apģērbu ražošana @lv
preferred label: Manifattura ta' ħwejjeġ li jintlibsu @mt
preferred label: Vervaardiging van kleding @nl
preferred label: Produksjon av klær @no
preferred label: Produkcja odzieży @pl
preferred label: Indústria do vestuário @pt
preferred label: Fabricarea articolelor de îmbrăcăminte @ro
preferred label: Производство одежды @ru
preferred label: Výroba odevov @sk
preferred label: Proizvodnja oblačil @sl
preferred label: Tillverkning av kläder @sv
preferred label: Giyim eşyalarının imalatı @tr
broader: MANUFACTURING
narrower: Manufacture of wearing apparel, except fur apparel
narrower: Manufacture of articles of fur
narrower: Manufacture of knitted and crocheted apparel

Manufacture of wearing apparel, except fur apparel
type: Concept
notation: 14.1
status: valid
status modified: 2013-10-18
accepted date: 2013-10-18
in scheme: Statistical Classification of Economic Activities in the European Community, Rev. 2 (2008)
scope note: Тази група включва производство на облекло, като употребеният материал може да бъде от всякакъв вид, т.е. покрит, импрегниран или гумиран. @bg
scope note: Tato skupina zahrnuje výrobu oděvů. Pro tuto výrobu mohou být používány materiály všeho druhu, které mohou být také potažené, impregnované nebo pogumované. @cs
scope note: Diese Gruppe umfasst die Herstellung von Bekleidung. Dazu können Stoffe aller Art verwendet werden, und diese können überdies beschichtet, imprägniert oder gummiert sein. @de
scope note: This group includes manufacture of wearing apparel. The material used may be of any kind and may be coated, impregnated or rubberised. @en
scope note: Este grupo comprende la fabricación de prendas de vestir. El material utilizado puede ser de cualquier tipo, y estar bañado, impregnado o engomado. @es
scope note: Ce groupe comprend la fabrication de vêtements. Les matériaux utilisés peuvent être de tout type et peuvent être enduits, imprégnés ou recouverts de caoutchouc. @fr
scope note: Ova skupina uključuje proizvodnju odjeće. Materijal korišten u proizvodnji može biti bilo koje vrste te može biti presvučen, impregniran ili gumiran.
scope note: Į šią grupę įeina drabužių siuvimas. Gali būti naudojamos visų rūšių medžiagos, jos gali būti padengtos kitomis medžiagomis, įmirkytos arba gumuotos. @lt
scope note: Этот класс включает: - производство прочих видов верхней одежды, изготовленных из тканых, вязаных или трикотажных тканей, нетканых и др. тканей для мужчин, женщин и детей: • пальто, костюмов, жакетов, брюк, юбок и т.д. Этот класс также включает: - индивидуальный пошив - пошив отдельных частей вышеназванной продукции Этот класс исключает: - производство одежды из меха (за исключением головных уборов), см. 14.20 - производство не сшивной, а скрепляемой одежды из резины или пластмассы, см. 22.19, 22.29 - производство огнестойкой и защитной одежды, см. 32.99 - ремонт одежды, см. 95.29 @ru
scope note: Bu grup giyim eşyası imalatını kapsamaktadır. Giyim eşyası üretilmesinde kullanılan maddeler herhangi bir çeşitte olabilir ve bu maddeler kaplanmış, emdirilmiş veya lastikle kaplanmış olabilir. @tr
preferred label: Производство на облекло, без кожухарско @bg
preferred label: Výroba oděvů, kromě kožešinových výrobků @cs
preferred label: Fremstilling af beklædningsartikler undtagen beklædningsartikler af pelsskind @da
preferred label: Herstellung von Bekleidung (ohne Pelzbekleidung) @de
preferred label: Κατασκευή ειδών ένδυσης εκτός από γούνινα ενδύματα @el
preferred label: Confección de prendas de vestir, excepto de peletería @es
preferred label: Rõivatootmine, v.a karusnahast rõivad @et
preferred label: Vaatteiden valmistus (pl. turkisvaatteet) @fi
preferred label: Fabrication de vêtements, autres qu'en fourrure @fr
preferred label: Ruházat gyártása (kivéve: szőrmeruházat)
preferred label: Confezione di articoli di abbigliamento, eccetto l'abbigliamento in pelliccia @it
preferred label: Drabužių, išskyrus kailinius drabužius, siuvimas (gamyba) @lt
preferred label: Apģērbu ražošana, izņemot kažokādu apģērbu @lv
preferred label: Manifattura ta' ħwejjeġ li jintlibsu, għajr lbies tal-fer @mt
preferred label: Vervaardiging van kleding, exclusief bontkleding @nl
preferred label: Produksjon av klær, unntatt pelsvarer @no
preferred label: Produkcja odzieży, z wyłączeniem wyrobów futrzarskich @pl
preferred label: Confecção de artigos de vestuário, excepto artigos de pele com pêlo @pt
preferred label: Fabricarea articolelor de îmbrăcăminte, cu excepţia articolelor din blană @ro
preferred label: Производство одежды, кроме одежды из меха @ru
preferred label: Výroba odevov okrem kožušinových odevov @sk
preferred label: Proizvodnja oblačil, razen krznenih @sl
preferred label: Tillverkning av kläder, utom pälsvaror @sv
preferred label: Kürk hariç, giyim eşyası imalatı @tr
broader: Manufacture of wearing apparel
narrower: Manufacture of leather clothes
narrower: Manufacture of workwear
narrower: Manufacture of other outerwear
narrower: Manufacture of underwear
narrower: Manufacture of other wearing apparel and accessories

Manufacture of leather clothes
type: Concept
notation: 14.11
status: valid
status modified: 2013-10-18
accepted date: 2013-10-18
in scheme: Statistical Classification of Economic Activities in the European Community, Rev. 2 (2008)
scope note: - производство на облекло от естествени или възстановени меки кожи или от изкуствени кожи, вкл. кожени престилки за оксиженисти и подобни - производство на облекло от кожухарски кожи - 14.20 - производство на спортни ръкавици и спортни шапки, от обработени меки кожи - 32.30 - производство на огнеустойчиво и защитно облекло за пожарникари - 32.99 @bg
scope note: Z: - výrobu oděvů z kůže nebo kompozice kůže , včetně pracovních ochranných oděvů jako kožené zástěry pro svářeče N: - výrobu kožešinových oděvů (14.20) - výrobu sportovních kožených rukavic a sportovních pokrývek hlavy (32.30) - výrobu žáruvzdorných ochranných bezpečnostních oděvů (32.99) @cs
scope note: Diese Klasse umfasst: - Herstellung von Bekleidung aus Leder oder rekonstituiertem Leder, einschließlich Arbeitsschutzkleidung wie Lederschürzen für Schweißer. Diese Klasse umfasst nicht: - Herstellung von Pelzbekleidung (s. 14.20) - Herstellung von Sporthandschuhen und Sportkopfbedeckungen aus Leder (s. 32.30) - Herstellung von feuerbeständiger Schutzkleidung (s. 32.99) @de
scope note: This class includes: - manufacture of wearing apparel made of leather or composition leather including leather industrial work accessories as welder's leather aprons This class excludes: - manufacture of fur wearing apparel, see 14.20 - manufacture of leather sports gloves and sports headgear, see 32.30 - manufacture of fire-resistant and protective safety clothing, see 32.99 @en
scope note: Esta clase comprende: - la fabricación de prendas de vestir confeccionadas con cuero o cuero artificial o regenerado, incluidos los accesorios de cuero para actividades industriales, como los delantales de cuero para soldadura Esta clase no comprende: - la fabricación de prendas de vestir de piel (véase 14.20) - la fabricación de guantes y gorros de deporte de cuero (véase 32.30) - la fabricación de prendas ignífugas y prendas protectoras de seguridad (véase 32.99) @es
scope note: Cette classe comprend: - la fabrication de vêtements en cuir naturel ou en simili-cuir, y compris d’équipements du travail en cuir, tels que les tabliers de soudeur en cuir Cette classe ne comprend pas: - la fabrication d'articles en fourrure, voir 14.20 - la fabrication de gants de sport et de coiffures de sport en cuir, voir 32.30 - la fabrication de vêtements de sécurité résistant au feu et de protection, voir 32.99 @fr
scope note: Ovaj razred uključuje: - proizvodnju odjeće od kože ili rekonstruirane kože uključujući, industrijski radni pribor od kože kao što je kožna pregača za zavarivanje Ovaj razred isključuje: - proizvodnju krznenih odjevnih predmeta, vidi 14.20 - proizvodnju kožnih sportskih rukavica i sportskih pokrivala za glavu, vidi 32.30 - proizvodnju protupožarne i zaštitne sigurnosne odjeće, vidi 32.99
scope note: Į šią klasę įeina: - odinių ir dirbtinės odos drabužių, įskaitant odinius pramoninius reikmenis, pvz., suvirintojo odines prijuostes, siuvimas Į šią klasę neįeina: - kailinių drabužių siuvimas, žr. 14.20 - sportinių odinių pirštinių ir galvos apdangalų gamyba, žr. 32.30 - atsparių ugniai ir apsauginių drabužių gamyba, žr. 32.99 @lt
scope note: Этот класс включает: - производство нижнего белья и ночного белья из тканых, вязаных или трикотажных тканей, кружев и т.д. для мужчин, женщин и детей: • рубашек, футболок, кальсонов, шорт, пижам, ночных сорочек, платьев, блуз, нижних юбок, комбинаций, бюстгальтеров, корсетов и т.д. Этот класс исключает: - ремонт одежды, см. 95.29 @ru
scope note: Bu sınıf aşağıdakileri kapsamaktadır; - deri ve deri karışımlı giyim eşyası imalatı deriden veya deri endüstrisi çalışmaları ile üretilen aksesuarlar ve deriden kaynak önlüklerinin imalatı dahil. Kapsam dışı olanlar; - kürk giyim eşyası imalatı, bkz. 14.20, - deriden spor eldivenleri ve spor başlıkları imalatı, bkz. 32.30, - yangına dayanıklı ve koruyucu güvenlik elbiseleri imalatı, bkz. 32.99. @tr
preferred label: Производство на облекло от обработени меки кожи @bg
preferred label: Výroba kožených oděvů @cs
preferred label: Fremstilling af beklædningsartikler af læder @da
preferred label: Herstellung von Lederbekleidung @de
preferred label: Κατασκευή δερμάτινων ενδυμάτων @el
preferred label: Confección de prendas de vestir de cuero @es
preferred label: Nahkrõivaste tootmine @et
preferred label: Nahkavaatteiden valmistus @fi
preferred label: Fabrication de vêtements en cuir @fr
preferred label: Bőrruházat gyártása
preferred label: Confezione di abbigliamento in pelle @it
preferred label: Odinių drabužių siuvimas @lt
preferred label: Ādas apģērbu ražošana @lv
preferred label: Manifattura ta' ħwejjeġ tal-ġilda @mt
preferred label: Vervaardiging van kleding van leer @nl
preferred label: Produksjon av klær av lær @no
preferred label: Produkcja odzieży skórzanej @pl
preferred label: Confecção de vestuário em couro @pt
preferred label: Fabricarea articolelor de îmbrăcăminte din piele @ro
preferred label: Производство одежды из кожи @ru
preferred label: Výroba kožených odevov @sk
preferred label: Proizvodnja usnjenih oblačil @sl
preferred label: Tillverkning av läder- och skinnkläder @sv
preferred label: Deri giyim eşyası imalatı @tr
broader: Manufacture of wearing apparel, except fur apparel

Manufacture of workwear
type: Concept
notation: 14.12
status: valid
status modified: 2013-10-18
accepted date: 2013-10-18
in scheme: Statistical Classification of Economic Activities in the European Community, Rev. 2 (2008)
scope note: - производство на обувки - 15.20 - производство на облекло от азбестови прежди - 23.99 - производство на огнеустойчиво и защитно облекло за пожарникари - 32.99 - поправка на облекло - 95.29 @bg
scope note: N: - výrobu obuvi (15.20) - výrobu žáruvzdorných ochranných bezpečnostních oděvů (32.99) - opravy oděvů (95.29) @cs
scope note: Diese Klasse umfasst nicht: - Herstellung von Schuhen (s. 15.20) - Herstellung von feuerbeständiger Schutzkleidung (s. 32.99) - Reparatur von Bekleidung (s. 95.29) @de
scope note: This class excludes: - manufacture of footwear, see 15.20 - manufacture of fire-resistant and protective safety clothing, see 32.99 - repair of wearing apparel, see 95.29 @en
scope note: Esta clase no comprende: - la fabricación de calzado (véase 15.20) - la fabricación de prendas ignífugas y prendas protectoras de seguridad (véase 32.99) - la reparación de prendas de vestir (véase 95.29) @es
scope note: Cette classe ne comprend pas: - la fabrication de chaussures, voir 15.20 - la fabrication de vêtements de sécurité résistant au feu et de protection, voir 32.99 - la réparation de vêtements, voir 95.29 @fr
scope note: Ovaj razred isključuje: - proizvodnju obuće, vidi 15.20 - proizvodnju protupožarne i zaštitne sigurnosne odjeće, vidi 32.99 - popravak odjevnih predmeta, vidi 95.29
scope note: Į šią klasę neįeina: - avalynės gamyba, žr. 15.20 - atsparių ugniai ir apsauginių drabužių gamyba, žr. 32.99 - drabužių taisymas, žr. 95.29 @lt
scope note: Этот класс включает: - производство одежды для детей младшего возраста, спортивных, лыжных костюмов, купальников и т.д. - производство шляп и шапок - производство прочих аксессуаров: перчаток, ремней, платков, галстуков, шарфов, сеток для волос и т.д. Этот класс также включает: - производство головных уборов из меха - производство обуви из текстильных материалов без наложения подошвы - пошив отдельных частей вышеназванной продукции Этот класс исключает: - производство спортивных головных уборов, см. 32.30 - производство защитных головных уборов (за исключением спортивных головных уборов), см. 32.99 - производство огнестойкой и защитной одежды, см. 32.99 - ремонт одежды, см. 95.29 @ru
scope note: Kapsam dışı olanlar; - ayakkabı imalatı, bkz. 15.20, - yangına dayanıklı ve koruyucu güvenlik elbiseleri imalatı, bkz. 32.99, - giyim eşyası tamiratı, bkz. 95.29. @tr
preferred label: Производство на работно облекло @bg
preferred label: Výroba pracovních oděvů @cs
preferred label: Fremstilling af arbejdsbeklædning @da
preferred label: Herstellung von Arbeits- und Berufsbekleidung @de
preferred label: Κατασκευή ενδυμάτων εργασίας @el
preferred label: Confección de ropa de trabajo @es
preferred label: Töörõivaste tootmine @et
preferred label: Työvaatteiden valmistus @fi
preferred label: Fabrication de vêtements de travail @fr
preferred label: Munkaruházat gyártása
preferred label: Confezione di indumenti da lavoro @it
preferred label: Darbo drabužių siuvimas @lt
preferred label: Darba apģērbu ražošana @lv
preferred label: Manifattura ta' ħwejjeġ tax-xogħol @mt
preferred label: Vervaardiging van werkkleding @nl
preferred label: Produksjon av arbeidstøy @no
preferred label: Produkcja odzieży roboczej @pl
preferred label: Confecção de vestuário de trabalho @pt
preferred label: Fabricarea de articole de îmbrăcăminte pentru lucru @ro
preferred label: Производство спецодежды @ru
preferred label: Výroba pracovných odevov @sk
preferred label: Proizvodnja delovnih oblačil @sl
preferred label: Tillverkning av arbets-, skydds- och överdragskläder @sv
preferred label: İş giysisi imalatı @tr
broader: Manufacture of wearing apparel, except fur apparel

Manufacture of other outerwear
type: Concept
notation: 14.13
status: valid
status modified: 2013-10-18
accepted date: 2013-10-18
in scheme: Statistical Classification of Economic Activities in the European Community, Rev. 2 (2008)
scope note: - производство на горно облекло за мъже, жени и деца от тъкани, плетени платове, нетъкан текстил и други: • палта, манта, сака, костюми, панталони, поли и други - шиене на облекло по еталон или поръчка - производство на детайли за облекло - производство на облекло от кожухарски кожи - 14.20 - производство на облекло от каучук или пластмаси, което не е „съединено“ чрез шиене, а само слепено - 22.19, 22.29 - производство на огнеустойчиво и защитно облекло за пожарникари - 32.99 - поправка на облекло - 95.29 @bg
scope note: Z: - výrobu ostatního pánského, dámského a dětského svrchního ošacení z tkaných, pletených nebo háčkovaných materiálů, netkaných látek atd.: • plášťů, obleků, kompletů, saka (bundy, kabátky), vest, kalhot, sukní atd. ZT: - šití oděvů na zakázku - výrobu částí výše uvedených výrobků N: - výrobu oděvů z kožešin (kromě pokrývek hlavy) (14.20) - výrobu oděvů z pryže nebo plastů, které nejsou sešité, nýbrž pouze svařené nebo lepené (22.19, 22.29) - výrobu ohnivzdorných ochranných oděvů (32.99) - opravy oděvů (95.29) @cs
scope note: Diese Klasse umfasst: - Herstellung von sonstiger Herren-, Damen- und Kinderoberbekleidung aus gewebten, gewirkten oder gestrickten Stoffen, Vliesstoff usw.: • Mäntel, Anzüge, Kostüme, Jacken, Hosen, Röcke usw. Diese Klasse umfasst ferner: - Maßanfertigung - Herstellung von Teilen der vorgenannten Erzeugnisse Diese Klasse umfasst nicht: - Herstellung von Bekleidung aus Pelzfellen (außer Kopfbedeckungen (s. 14.20) - Herstellung von Gummi- oder Kunststoffbekleidung, die nicht zusammengenäht, sondern lediglich geschweißt oder geklebt wird (s. 22.19, 22.29) - Herstellung von feuerbeständiger Schutzkleidung (s. 32.99) - Reparatur von Bekleidung (s. 95.29) @de
scope note: This class includes: - manufacture of other outerwear made of woven, knitted or crocheted fabric, non-wovens etc. for men, women and children: • coats, suits, ensembles, jackets, trousers, skirts etc. This class also includes: - custom tailoring - manufacture of parts of the products listed This class excludes: - manufacture of wearing apparel of fur skins (except headgear), see 14.20 - manufacture of wearing apparel of rubber or plastics not assembled by stitching but merely sealed together, see 22.19, 22.29 - manufacture of fire-resistant and protective safety clothing, see 32.99 - repair of wearing apparel, see 95.29 @en
scope note: Esta clase comprende: - la confección de otras prendas exteriores con tejidos, géneros de punto, tela no tejida, etc., para hombres, mujeres y niños: • abrigos, trajes, conjuntos, chaquetas, pantalones, faldas, etc. Esta clase comprende también: - la sastrería a medida - la fabricación de partes de los productos mencionados en esta clase Esta clase no comprende: - la confección de prendas de vestir de piel (excepto sombrerería) (véase 14.20) - la confección de prendas de vestir de caucho o materias plásticas, no unidas por costuras sino simplemente pegadas (véanse 22.19 y 22.29) - la fabricación de prendas ignífugas y prendas protectoras de seguridad (véase 32.99) - la reparación de prendas de vestir (véase 95.29) @es
scope note: Cette classe comprend: - la fabrication d’autres vêtements de dessus pour hommes, femmes et enfants à partir de tissus, d’étoffes à mailles, de non-tissés, etc.: • manteaux, costumes, complets, tailleurs, ensembles, vestes, vestons, pantalons, jupes, etc. Cette classe comprend également: - la confection sur mesure - la fabrication d’éléments entrant dans la confection des produits cités Cette classe ne comprend pas: - la fabrication de vêtements en fourrure (à l’exception des chapeaux), voir 14.20 - la fabrication de vêtements en caoutchouc ou en matières plastiques non assemblés par couture, mais simplement collés, voir 22.19 et 22.29 - la fabrication de vêtements de sécurité résistant au feu et de protection, voir 32.99 - la réparation de vêtements, voir 95.29 @fr
scope note: Ovaj razred uključuje: - proizvodnju ostale šivane vanjske odjeće od tkanoga, pletenoga i kukičanoga tekstila, netkanoga tekstila itd. za muškarce, žene i djecu: • dugih kaputa, odijela, kompleta, jakni, hlača, suknji itd. Ovaj razred također uključuje: - šivanje po mjeri - proizvodnju dijelova za spomenute proizvode Ovaj razred isključuje: - proizvodnju odjeće od krzna (osim pokrivala za glavu), vidi 14.20 - proizvodnju odjeće od gume i plastike koja nije šivana, nego samo slijepljena, vidi 22.19, 22.29 - proizvodnju protupožarne i zaštitne sigurnosne odjeće, vidi 32.99 - popravak odjevnih predmeta, vidi 95.29
scope note: Į šią klasę įeina: - viršutinių drabužių vyrams, moterims ir vaikams iš austinių, megztinių (trikotažinių) ar nertinių, neaustinių ir kt. medžiagų siuvimas: • apsiaustų, kostiumų, ansamblių, švarkelių, kelnių, sijonų ir kt. Į šią klasę taip pat įeina: - siuvimas pagal užsakymą - šioje klasėje paminėtų drabužių dalių gamyba Į šią klasę neįeina: - kailinių drabužių siuvimas (išskyrus galvos apdangalus), žr. 14.20 - nesiūtų, tik sutvirtintų guminių ar plastikinių drabužių gamyba, žr. 22.19, 22.29 - atsparių ugniai ir apsauginių drabužių gamyba, žr. 32.99 - drabužių taisymas, žr. 95.29 @lt
scope note: Bu sınıf aşağıdakileri kapsamaktadır; - erkek, kadın ve çocuklar için dokunmuş, örme ve kroşe örgü vb. kumaştan, dantelden yapılmış diğer dış giyim eşyası imalatı; • kabanlar, takım elbiseler, döpiyesler, ceketler, pantolonlar, etekler vb. Ayrıca bu sınıf aşağıdakileri de kapsamaktadır; - terzilerin faaliyetleri (giyim eşyası tamirleri hariç), - kabanlar, takım elbiseler, döpiyesler, ceketler, pantolonlar, etekler vb. ürünlerin parçalarının imalatı. Kapsam dışı olanlar; - kürkten giyim eşyalarının imalatı (baş giysileri hariç), bkz. 14.20, - sıcak pres yöntemiyle birleştirilmiş dikişsiz lastik veya kauçuktan giyim eşyası imalatı, bkz. 22.19, 22.29, - ateşe dayanıklı ve koruyucu güvenlik elbiseleri imalatı, bkz. 32.99, - giyim eşyalarının tamir edilmesi, bkz. 95.29. @tr
preferred label: Производство на горно облекло, без работно @bg
preferred label: Výroba ostatních svrchních oděvů @cs
preferred label: Fremstilling af anden yderbeklædning @da
preferred label: Herstellung von sonstiger Oberbekleidung @de
preferred label: Κατασκευή άλλων εξωτερικών ενδυμάτων @el
preferred label: Confección de otras prendas de vestir exteriores @es
preferred label: Muude pealisrõivaste tootmine @et
preferred label: Muu takkien, pukujen, housujen, hameiden yms. valmistus @fi
preferred label: Fabrication de vêtements de dessus @fr
preferred label: Felsőruházat gyártása (kivéve: munkaruházat)
preferred label: Confezione di altro abbigliamento esterno @it
preferred label: Kitų viršutinių drabužių siuvimas @lt
preferred label: Pārējo virsdrēbju ražošana @lv
preferred label: Manifattura ta' ħwejjeġ oħra ta' fuq @mt
preferred label: Vervaardiging van andere bovenkleding @nl
preferred label: Produksjon av annet yttertøy @no
preferred label: Produkcja pozostałej odzieży wierzchniej @pl
preferred label: Confecção de outro vestuário exterior @pt
preferred label: Fabricarea altor articole de îmbrăcăminte (exclusiv lenjeria de corp) @ro
preferred label: Производство прочей верхней одежды @ru
preferred label: Výroba ostatného vrchného ošatenia @sk
preferred label: Proizvodnja drugih vrhnjih oblačil @sl
preferred label: Tillverkning av andra gång- och ytterkläder @sv
preferred label: Diğer dış giyim eşyaları imalatı @tr
broader: Manufacture of wearing apparel, except fur apparel

Manufacture of underwear
type: Concept
notation: 14.14
status: valid
status modified: 2013-10-18
accepted date: 2013-10-18
in scheme: Statistical Classification of Economic Activities in the European Community, Rev. 2 (2008)
scope note: - производство на бельо и долно облекло за мъже, жени и деца от тъкани, плетени платове, нетъкан текстил, дантела и други: • ризи, блузи, фланелки, долни гащета, слипове, пижами, нощници, халати, сутиени, корсажи и други - поправка на облекло - 95.29 @bg
scope note: Z: - výrobu spodního a nočního prádla z tkaných, pletených nebo háčkovaných materiálů, krajek atd. pro muže, ženy a děti: • košil, triček, spodků, kalhotek, pyžam, nočních košil, županů, blůz, slipů, podprsenek, korzetů atd. N: - opravy oděvů (95.29) @cs
scope note: Diese Klasse umfasst: - Herstellung von Herren-, Damen- und Kinderwäsche aus gewebten, gewirkten oder gestrickten Stoffen, Spitzen usw.: • Hemden, T-Shirts, Unterhosen, Schlafanzüge, Nachthemden, Morgenröcke, Blusen, Slips, Büstenhalter, Korsetts usw. Diese Klasse umfasst nicht: - Reparatur von Bekleidung (s. 95.29) @de
scope note: This class includes: - manufacture of underwear and nightwear made of woven, knitted or crocheted fabric, lace etc. for men, women and children: • shirts, T-shirts, underpants, briefs, pyjamas, nightdresses, dressing gowns, blouses, slips, brassieres, corsets etc. This class excludes: - repair of wearing apparel, see 95.29 @en
scope note: Esta clase comprende: - la confección de ropa interior y de dormir con tejidos, género de punto, encaje, etc. para hombres, mujeres y niños: • camisas, camisetas, calzoncillos, pijamas, camisones, batas, blusas, bragas, sujetadores, corsés, etc. Esta clase no comprende: - la reparación de prendas de vestir (véase 95.29) @es
scope note: Cette classe comprend: - la fabrication de vêtements de dessous et de nuit pour hommes, femmes et enfants à partir de tissus, d’étoffes à mailles, de dentelles, etc.: • chemises, chemisiers, chemisettes, slips, caleçons, pyjamas, chemises de nuit, robes de chambre, soutiens-gorge, corsets, etc. Cette classe ne comprend pas: - la réparation de vêtements, voir 95.29 @fr
scope note: Ovaj razred uključuje: - proizvodnju šivanog rublja od tkanog, pletenog ili kukičanog tekstila, čipke itd., za muškarce, žene i djecu: • košulja, T-majica, dugih gaća, gaćica, pidžama, spavaćica, kućnih ogrtača, bluza, kombinea, grudnjaka, korzeta itd. Ovaj razred isključuje: - popravak odjevnih predmeta, vidi 95.29
scope note: Į šią klasę įeina: - apatinių drabužių vyrams, moterims ir vaikams iš austinių, megztinių (trikotažinių) ar nertinių medžiagų, nėrinių ir kt. siuvimas: • marškinių, polo marškinėlių, apatinių kelnių, trumpikių, pižamų, naktinukų, kambarinių chalatų, palaidinių, kelnaičių, liemenėlių, korsetų ir kt. Į šią klasę neįeina: - drabužių taisymas, žr. 95.29 @lt
scope note: Этот класс включает: - производство изделий из меха: • меховой одежды и аксессуаров • наборов из меха, например, отдельные куски меха, пластины, коврики, полосы и т.д. • различных изделий из меха: ковриков, ненабитых пуфиков, промышленных тряпок для полировки Этот класс исключает: - производство меховых шкурок, см. 01.4, 01.70 - производство сырых шкур и кож, см. 10.11 - производство искусственного меха (ткань с длинным ворсом из тканых или трикотажных материалов), см. 13.20, 13.91 - производство меховых шляп, см. 14.19 - производство одежды, отделанной мехом, см. 14.19 - выделку и окрашивание меха, см. 15.11 - производство ботинок или туфлей с меховыми вставками, см. 15.20 @ru
scope note: Bu sınıf aşağıdakileri kapsamaktadır; - erkek, kadın ve çocuklar için dokunmuş, örme ve kroşe örgü vb. kumaştan, dantelden yapılmış iç giyim eşyası imalatı; • gömlekler, tişörtler, tayt, külot, pijama, gecelik, robdöşambır, sabahlık, bluz, mayo, sutyen, korse vb. Kapsam dışı olanlar; - giyim eşyası tamiratı, bkz. 95.29. @tr
preferred label: Производство на долно облекло @bg
preferred label: Výroba osobního prádla @cs
preferred label: Fremstilling af underbeklædning @da
preferred label: Herstellung von Wäsche @de
preferred label: Κατασκευή εσωρούχων @el
preferred label: Confección de ropa interior @es
preferred label: Alusrõivaste tootmine @et
preferred label: Alusvaatteiden valmistus @fi
preferred label: Fabrication de vêtements de dessous @fr
preferred label: Alsóruházat gyártása
preferred label: Confezione di biancheria intima @it
preferred label: Apatinių drabužių siuvimas @lt
preferred label: Apakšveļas ražošana @lv
preferred label: Manifattura ta' ħwejjeġ ta' taħt @mt
preferred label: Vervaardiging van onderkleding @nl
preferred label: Produksjon av undertøy og innertøy @no
preferred label: Produkcja bielizny @pl
preferred label: Confecção de vestuário interior @pt
preferred label: Fabricarea de articole de lenjerie de corp @ro
preferred label: Производство нижнего белья @ru
preferred label: Výroba spodnej bielizne @sk
preferred label: Proizvodnja spodnjega perila @sl
preferred label: Tillverkning av underkläder, skjortor och blusar @sv
preferred label: İç giyim eşyası imalatı @tr
broader: Manufacture of wearing apparel, except fur apparel

Manufacture of other wearing apparel and accessories
type: Concept
notation: 14.19
status: valid
status modified: 2013-10-18
accepted date: 2013-10-18
in scheme: Statistical Classification of Economic Activities in the European Community, Rev. 2 (2008)
scope note: - производство на бебешко облекло, горно спортно облекло, бански костюми - производство на шапки - производство на други допълнения за облекло: ръкавици, колани, шалове, вратовръзки, мрежи за коса и други - производство на кожени шапки - производство на терлици от текстилни материали, без прикрепени външни ходила - производство на детайли за облекло или за допълнение за облекло - ръкавици с един пръст за масаж (пилинг) - 13.99 - производство на спортни ръкавици и спортни шапки - 32.30 - производство на предпазни каски, без спортните шапки - 32.99 - огнеустойчиво и защитно облекло за пожарникари - 32.99 - поправка на облекло - 95.29 @bg
scope note: Z: - výrobu kojeneckého oblečení, teplákových souprav, lyžařského oblečení, plavek atd. - výrobu klobouků a čepic - výrobu ostatních oděvních doplňků: rukavic, pasků, šál, kravat, sítěk na vlasy atd. ZT: - výrobu pokrývek hlavy z kožešin - výroba obuvi z textilních materiálů bez podrážek - výrobu částí výše uvedených výrobků N: - výrobu sportovních pokrývek hlavy (32.30) - výrobu bezpečnostních pokrývek hlavy (kromě sportovních pokrývek hlavy) (32.99) - výrobu ohnivzdorných ochranných oděvů (32.99) - opravy oděvů (95.29) @cs
scope note: Diese Klasse umfasst: - Herstellung von Babybekleidung, Trainingsanzügen, Skianzügen, Badebekleidung usw. - Herstellung von Hüten und Mützen - Herstellung von sonstigem Bekleidungszubehör: Handschuhe, Gürtel, Schals, Krawatten, Haarnetze usw. Diese Klasse umfasst ferner: - Herstellung von Kopfbedeckungen aus Pelzfellen - Herstellung von Schuhen ohne Sohle aus Textilfasern - Herstellung von Teilen der vorgenannten Erzeugnisse Diese Klasse umfasst nicht: - Herstellung von Sportkopfbedeckungen (s. 32.30) - Herstellung von Sicherkeitskopfbedeckungen (außer Sportkopfbedeckungen) (s. 32.99) - Herstellung von feuerbeständiger Schutzkleidung (s. 32.99) - Reparatur von Bekleidung (s. 95.29) @de
scope note: This class includes: - manufacture of babies' garments, tracksuits, ski suits, swimwear etc. - manufacture of hats and caps - manufacture of other clothing accessories: gloves, belts, shawls, ties, cravats, hairnets etc. This class also includes: - manufacture of headgear of fur skins - manufacture of footwear of textile material without applied soles - manufacture of parts of the products listed This class excludes: - manufacture of sports headgear, see 32.30 - manufacture of safety headgear (except sports headgear), see 32.99 - manufacture of fire-resistant and protective safety clothing, see 32.99 - repair of wearing apparel, see 95.29 @en
scope note: Esta clase comprende: - la confección de prendas para bebés, prendas para la práctica de deportes, prendas de esquí, bañadores, etc. - la fabricación de sombreros y gorras - la fabricación de otros accesorios de vestir: guantes, cinturones, chales, corbatas, corbatines, redecillas para el pelo, etc. Esta clase comprende también: - la confección de gorros de piel - la fabricación de calzado de materias textiles sin suela incorporada - la fabricación de componentes de los productos consignados Esta clase no comprende: - la fabricación de gorros de deporte (véase 32.30) - la fabricación de cascos de seguridad (excepto gorros de deporte) (véase 32.99) - la fabricación de prendas ignífugas y prendas protectoras de seguridad (véase 32.99) - la reparación de prendas de vestir (véase 95.29) @es
scope note: Cette classe comprend: - la fabrication de vêtements pour bébés, de survêtements de sport, de combinaisons et d’ensembles de ski, de maillots, de culottes et de slips de bain, etc. - la fabrication de chapeaux et de bonnets - la fabrication d’autres accessoires du vêtement: gants, ceintures, châles, cravates, foulards, résilles et filets à cheveux, etc. Cette classe comprend également: - la fabrication de chapeaux en fourrure - la fabrication de chaussures en matières textiles, sans semelle rapportée - la fabrication d’éléments entrant dans la confection des produits cités Cette classe ne comprend pas: - la fabrication de coiffures de sport, voir 32.30 - la fabrication de coiffures de sécurité (à l’exception des coiffures de sport), voir 32.99 - la fabrication de vêtements de sécurité résistant au feu et de protection, voir 32.99 - la réparation de vêtements, voir 95.29 @fr
scope note: Ovaj razred uključuje: - proizvodnju odjeće za dojenčad i malu djecu, trenirki, skijaške odjeće, kupaćih kostima itd. - proizvodnju šešira i kapa - proizvodnju ostalog pribora za odjeću: rukavica, remenja, šalova, kravata, mrežica za kosu itd Ovaj razred također uključuje: - proizvodnju krznenih pokrivala za glavu - proizvodnju obuće od tekstilnog materijala bez pričvršćenih potpetica - proizvodnju dijelova za gore spomenute proizvode Ovaj razred isključuje: - proizvodnju sportskih pokrivala za glavu, vidi 32.30 - proizvodnju sigurnosnih pokrivala za glavu (osim sportskih pokrivala), vidi 32.99 - proizvodnju protupožarne i zaštitne sigurnosne odjeće, vidi 32.99 - popravak odjevnih predmeta, vidi 95.29
scope note: Į šią klasę įeina: - kūdikių drabužėlių, sportinių kostiumų, slidinėjimo kostiumų, maudymosi aprangos ir kt. siuvimas - skrybėlių ir kepurių gamyba - kitų drabužių priedų gamyba: pirštinių, diržų, šalikų, kaklajuosčių, kaklaraiščių, tinklelių plaukams ir kt. Į šią klasę įeina: - kūdikių drabužėlių, sportinių kostiumų, slidinėjimo kostiumų, maudymosi aprangos ir kt. siuvimas - skrybėlių ir kepurių gamyba - kitų drabužių priedų gamyba: pirštinių, diržų, šalikų, kaklajuosčių, kaklaraiščių, tinklelių plaukams ir kt. Į šią klasę neįeina: - sportinių galvos apdangalų gamyba, žr. 32.30 - apsauginių galvos apdangalų, išskyrus sportinius, gamyba, žr. 32.99 - atsparių ugniai ir apsauginių drabužių gamyba, žr. 32.99 - drabužių taisymas, žr. 95.29 @lt
scope note: Bu sınıf şunları kapsamaktadır. - bebek giysileri, sporcu antreman giysileri, kayak kıyafetleri, yüzme kıyafetleri vb. imalatı, - şapka ve kep imalatı, - diğer giyim aksesuarları imalatı: eldiven, kemer, şal, papyon, kravat, fular, saç fileleri vb.. Ayrıca bu sınıf aşağıdakileri de kapsamaktadır; - kürkten başlık imalatı, - ayakkabı pençesi vurulmamış tekstil maddelerinden ayakkabı imalatı, - yukarıdaki ürünlerinin parçalarının imalatı. Kapsam dışı olanlar; - sporlarda kullanılan başlık imalatı, bkz. 32.30, - kask imalatı (sporlarda kullanılan başlık hariç), bkz. 32.99, - yangına dirençli ve koruyucu, güvenli kıyafetler imalatı, bkz. 32.99, - giyim eşyası tamiratı, bkz. 95.29. @tr
preferred label: Производство на друго облекло и допълнения за облекло @bg
preferred label: Výroba ostatních oděvů a oděvních doplňků @cs
preferred label: Fremstilling af andre beklædningsartikler samt tilbehør @da
preferred label: Herstellung von sonstiger Bekleidung und Bekleidungszubehör a. n. g. @de
preferred label: Κατασκευή άλλων ενδυμάτων και εξαρτημάτων ένδυσης @el
preferred label: Confección de otras prendas de vestir y accesorios @es
preferred label: Muude rõivaste ja rõivalisandite tootmine @et
preferred label: Muiden vaatteiden ja asusteiden valmistus @fi
preferred label: Fabrication d'autres vêtements et accessoires @fr
preferred label: Egyéb ruházat, kiegészítők gyártása
preferred label: Confezione di altri articoli di abbigliamento ed accessori @it
preferred label: Kitų drabužių siuvimas ir drabužių priedų gamyba @lt
preferred label: Cita veida apģērbu un apģērbu piederumu ražošana @lv
preferred label: Manifattura ta' ħwejjeġ oħra li jintlibsu u aċċessorji @mt
preferred label: Vervaardiging van andere kleding en toebehoren @nl
preferred label: Produksjon av klær og tilbehør ellers @no
preferred label: Produkcja pozostałej odzieży i dodatków do odzieży @pl
preferred label: Confecção de outros artigos e acessórios de vestuário @pt
preferred label: Fabricarea altor articole de îmbrăcăminte şi accesorii n.c.a. @ro
preferred label: Производство прочих видов одежды и аксессуаров @ru
preferred label: Výroba ostatných odevov a doplnkov @sk
preferred label: Proizvodnja drugih oblačil, pokrival ter dodatkov @sl
preferred label: Tillverkning av andra beklädnadsvaror och tillbehör @sv
preferred label: Diğer giyim eşyalarının ve aksesuarlarının imalatı @tr
broader: Manufacture of wearing apparel, except fur apparel

Manufacture of articles of fur
type: Concept
notation: 14.2
status: valid
status modified: 2013-10-18
accepted date: 2013-10-18
in scheme: Statistical Classification of Economic Activities in the European Community, Rev. 2 (2008)
scope note: Этот класс включает: - производство чулочных изделий, включая носки, трико и колготки @ru
preferred label: Производство на облекло и изделия от кожухарски кожи @bg
preferred label: Výroba kožešinových výrobků @cs
preferred label: Fremstilling af varer af pelsskind @da
preferred label: Herstellung von Pelzwaren @de
preferred label: Κατασκευή γούνινων ειδών @el
preferred label: Fabricación de artículos de peletería @es
preferred label: Karusnahatoodete tootmine @et
preferred label: Turkisvaatteiden ja -tuotteiden valmistus @fi
preferred label: Fabrication d'articles en fourrure @fr
preferred label: Szőrmecikk gyártása
preferred label: Confezione di articoli in pelliccia @it
preferred label: Kailinių dirbinių ir gaminių gamyba @lt
preferred label: Kažokādu izstrādājumu ražošana @lv
preferred label: Manifattura ta' oġġetti tal-fer @mt
preferred label: Vervaardiging van artikelen van bont @nl
preferred label: Produksjon av pelsvarer @no
preferred label: Produkcja wyrobów futrzarskich @pl
preferred label: Confecção de artigos de peles com pêlo @pt
preferred label: Fabricarea articolelor din blană @ro
preferred label: Производство меховых изделий @ru
preferred label: Výroba kožušinových výrobkov @sk
preferred label: Proizvodnja krznenih izdelkov @sl
preferred label: Tillverkning av pälsvaror @sv
preferred label: Kürkten eşya imalatı @tr
broader: Manufacture of wearing apparel
narrower: Manufacture of articles of fur

Manufacture of articles of fur
type: Concept
notation: 14.20
status: valid
status modified: 2013-10-18
accepted date: 2013-10-18
in scheme: Statistical Classification of Economic Activities in the European Community, Rev. 2 (2008)
scope note: - производство на облекло и изделия от кожухарски кожи: • облекло и допълнения за облекло • платна квадратни, правоъгълни или други от комбинирани изрезки от кожухарски кожи (квадрати, правоъгълници, ленти и други) • разнообразни изделия от кожухарски кожи: постелки и килимчета, възглавници без пълнеж, изделия за техническа употреба (накрайници за полиране, боядисване или за декорация) - добиване на сурови кожухарски кожи от селските стопанства и от лов - 01.4, 01.70 - добиване на сурови кожи от кланици - 10.11 - производство на имитация на кожухарски кожи, получени чрез тъкане или плетене (платове с дълъг влас, буклета, плюшове и други подобни) - 13.20, 13.91 - производство на шапки от кожухарски кожи - 14.19 - производство на облекло, гарнирано с кожухарски кожи - 14.19 - обработка на кожухарски кожи - 15.11 - производство на ботуши и обувки, гарнирани с кожухарски кожи - 15.20 @bg
scope note: Z: - výrobu kožešinových výrobků: • kožešinových oděvů a oděvních doplňků • zpracovaných odstřižků kožešin, „bodies“, obložení, pásů atd. • různých výrobků z kožešin: koberečků, předložek, nevycpaných polštářů sedadel, (taburetů), hadrů používaných k leštění v průmyslu N: - produkci surových nezpracovaných kožešin (01.4, 01.70) - produkci surových kůží, usní (10.11) - výrobu kožešinových imitací (látek s dlouhým vlasem připravovaných tkaním nebo pletením) (13.20, 13.91) - výrobu kožešinových klobouků (14.19) - výrobu oděvů zdobených kožešinou (14.19) - úpravu a barvení kožešin (15.11) - výrobu holinek nebo obuvi zdobených část. kožešinou (15.20) @cs
scope note: Diese Klasse umfasst: - Herstellung von Pelzwaren: • Pelzbekleidung, -besatz und -zubehör • zusammengesetzte Pelzfelle wie "ausgelassene" Pelzfelle, Platten, Matten, Streifen usw. • verschiedene Waren aus Pelzfellen: Brücken, Teppiche, nichtausgestopfte Sitzkissen, Poliertücher für den industriellen Bedarf Diese Klasse umfasst nicht: - Erzeugung von rohen Pelzfellen (s. 01.4, 01.70) - Herstellung von rohen Fellen und Häuten (s. 10.11) - Herstellung von Pelzimitationen (gewebten oder gewirkten Hochflorgeweben) (s. 13.20, 13.91) - Herstellung von Pelzkappen und -mützen (s. 14.19) - Herstellung von Bekleidung mit Pelzbesatz (s. 14.19) - Zurichten und Färben von Fellen (s. 15.11) - Herstellung von Stiefeln und Schuhen mit Pelzbesatz (s. 15.20) @de
scope note: This class includes: - manufacture of articles made of fur skins: • fur wearing apparel and clothing accessories • assemblies of fur skins such as "dropped" fur skins, plates, mats, strips etc. • diverse articles of fur skins: rugs, unstuffed pouffes, industrial polishing cloths This class excludes: - production of raw fur skins, see 01.4, 01.70 - production of raw hides and skins, see 10.11 - manufacture of imitation furs (long-hair cloth obtained by weaving or knitting), see 13.20, 13.91 - manufacture of fur hats, see 14.19 - manufacture of apparel trimmed with fur, see 14.19 - dressing and dyeing of fur, see 15.11 - manufacture of boots or shoes containing fur parts, see 15.20 @en
scope note: Esta clase comprende: - la confección de artículos de peletería: • prendas de vestir y accesorios de piel • productos a partir de recortes de piel como pieles cosidas, láminas, tapetes, cintas, etc. • artículos de peletería diversos: alfombras, pufes sin rellenar, gamuzas para la limpieza industrial Esta clase no comprende: - la producción de pieles de peletería en bruto (véanse 01.4 y 01.70) - la producción de cueros y pieles en bruto procedentes de mataderos (véase 10.11) - la fabricación de pieles de imitación (tela de pelo largo obtenida por tejido y tricotaje) (véanse 13.20 y 13.91) - la fabricación de gorros de piel (véase 14.19) - la fabricación de prendas de vestir guarnecidas con piel (véase 14.19) - la preparación y el teñido de pieles (véase 15.11) - la fabricación de calzado con partes de piel (véase 15.20) @es
scope note: Cette classe comprend: - la fabrication d’articles en fourrure: • vêtements et accessoires du vêtement en pelleteries • assemblages de pelleteries tels que peaux dites "allongées", nappes, nappettes, carrés et bandes, etc. • divers articles en fourrure: tapis, poufs non garnis, peaux à polir pour l’industrie Cette classe ne comprend pas: - la production de peaux et fourrures, voir 01.4 et 01.70 - la production de peaux brutes, voir 10.11 - la fabrication d’imitations de fourrure (étoffes à longs poils obtenues par tissage ou tricotage), voir 13.20 et 13.91 - la fabrication de chapeaux en fourrure, voir 14.19 - la fabrication de vêtements garnis de fourrure, voir 14.19 - la préparation et la teinture de fourrures, voir 15.11 - la fabrication de bottes ou de chaussures comprenant des parties en fourrure, voir 15.20 @fr
scope note: Ovaj razred uključuje: - proizvodnju predmeta od krzna: • krznene odjeće i pribora • spojena krzna u oblike kao što su ploče, vrpce, trake itd. • raznovrsne predmete od krzna: prostirke za pod, jastuci (nepunjeni), industrijske krpe za poliranje Ovaj razred isključuje: - proizvodnju sirovih koža s krznom, vidi 01.4, 01.70 - proizvodnju sirovih koža, vidi 10.11 - proizvodnju imitacije krzna (dugodlake tkanine dobivene tkanjem ili pletenjem), vidi 13.20, 13.91 - proizvodnju pokrivala za glavu od krzna, vidi 14.19 - proizvodnju odjeće ukrašene krznom, vidi 14.19 - doradu i bojenje krzna, vidi 15.11 - proizvodnju čizama ili cipela s krznenim dijelovima, vidi 15.20
scope note: Į šią klasę įeina: - kailinių gaminių ir dirbinių gamyba: • kailinių drabužių ir drabužių priedų • kailinių sudurstytų gaminių ir dirbinių, tokių kaip sudurstyti kailių gabaliukai, plokštės, paklotai, juostos ir kt. • įvairių kailinių gaminių ir dirbinių: kilimėlių, neprikimštų pamsukų (pufų), gabaliukų pramoniniam blizginimui (poliravimui) Į šią klasę neįeina: - žaliaminių kailių gamyba, žr. 01.4, 01.70 - žaliaminių kailių ir odų gamyba, žr. 10.11 - kailių pakaitalų (austų ar megztų ilgaplaukių medžiagų) gamyba, žr. 13.20, 13.91 - kailinių kepurių gamyba, žr. 14.19 - kailiu papuoštų drabužių gamyba, žr. 14.19 - kailių išdirbimas ir dažymas, žr. 15.11 - batų ar batelių su kailio detalėmis gamyba, žr. 15.20 @lt
scope note: Этот класс включает: - производство вязаных или трикотажных изделий и прочих готовых изделий, таких как: пуловеры, свитера, кардиганы, вязаные кофты, жилеты и подобные изделия Этот класс исключает: - производство вязаных и трикотажных тканей, см. 13.91 - производство чулочных изделий, см. 14.31 @ru
scope note: Bu sınıf aşağıdakileri kapsamaktadır; - Kürklü deriden yapılmış eşya imalatı; • kürk giyim eşyası ve elbise aksesuarları, • kürkün bir araya getirilmesi; örneğin serpme kürk, levha, keçe, şerit vb. • kürklü deriden yapılan çeşitli ürünler: kilimler, kumaşsız puflar, endüstriyel cilalı giysiler. Kapsam dışı olanlar; - ham kürk imalatı, bkz. 01.4, 01.70, - ham post ve deri imalatı, bkz. 10.11, - imitasyon kürk imalatı (dokuma veya örme yoluyla elde edilen uzun tüylü kıyafetler), bkz.13.20, 13.91, - kürkten şapka imalatı, bkz. 14.19, - kürk ile süslenmiş giysi imalatı, bkz. 14.19, - kürkün terbiye edilmesi ve boyanması, bkz. 15.11, - kürk parçaları ihtiva eden çizme, ayakkabı botlar imalatı, bkz. 15.20. @tr
preferred label: Производство на облекло и изделия от кожухарски кожи @bg
preferred label: Výroba kožešinových výrobků @cs
preferred label: Fremstilling af varer af pelsskind @da
preferred label: Herstellung von Pelzwaren @de
preferred label: Κατασκευή γούνινων ειδών @el
preferred label: Fabricación de artículos de peletería @es
preferred label: Karusnahatoodete tootmine @et
preferred label: Turkisvaatteiden ja -tuotteiden valmistus @fi
preferred label: Fabrication d'articles en fourrure @fr
preferred label: Szőrmecikk gyártása
preferred label: Confezione di articoli in pelliccia @it
preferred label: Kailinių dirbinių ir gaminių gamyba @lt
preferred label: Kažokādu izstrādājumu ražošana @lv
preferred label: Manifattura ta' oġġetti tal-fer @mt
preferred label: Vervaardiging van artikelen van bont @nl
preferred label: Produksjon av pelsvarer @no
preferred label: Produkcja wyrobów futrzarskich @pl
preferred label: Confecção de artigos de peles com pêlo @pt
preferred label: Fabricarea articolelor din blană @ro
preferred label: Производство меховых изделий @ru
preferred label: Výroba kožušinových výrobkov @sk
preferred label: Proizvodnja krznenih izdelkov @sl
preferred label: Tillverkning av pälsvaror @sv
preferred label: Kürkten eşya imalatı @tr
broader: Manufacture of articles of fur

Manufacture of knitted and crocheted apparel
type: Concept
notation: 14.3
status: valid
status modified: 2013-10-18
accepted date: 2013-10-18
in scheme: Statistical Classification of Economic Activities in the European Community, Rev. 2 (2008)
scope note: Данный раздел включает выделку и окрашивание меха и обработку шкурок дублением или вялением и выделкой кожи для использования в быту. Он также включает производство подобных продуктов из прочих материалов (искусственной кожи или кожзаменителей), таких как резиновая обувь, багажные сумки и т.д. Продукция, изготовленная из кожзаменителя, также включена в данный раздел, поскольку она изготовлена теми же способами, что и кожаные изделия (например, багажные сумки) и зачастую производится на том же оборудовании. @ru
preferred label: Производство на други трикотажни изделия @bg
preferred label: Výroba pletených a háčkovaných oděvů @cs
preferred label: Fremstilling af strikkede og hæklede beklædningsartikler @da
preferred label: Herstellung von Bekleidung aus gewirktem und gestricktem Stoff @de
preferred label: Κατασκευή πλεκτών ειδών και ειδών πλέξης κροσέ @el
preferred label: Confección de prendas de vestir de punto @es
preferred label: Silmkoe- ja heegelrõivaste tootmine @et
preferred label: Neulevaatteiden ja sukkien valmistus @fi
preferred label: Fabrication d'articles à mailles @fr
preferred label: Kötött, hurkolt cikk gyártása
preferred label: Fabbricazione di articoli di maglieria @it
preferred label: Megztų (trikotažinių) ir nertų drabužių gamyba @lt
preferred label: Trikotāžas izstrādājumu ražošana @lv
preferred label: Manifattura ta' lbies maħdum bil-labar u bil-ganċ @mt
preferred label: Vervaardiging van gebreide en gehaakte kleding @nl
preferred label: Produksjon av klær av trikotasje @no
preferred label: Produkcja odzieży dzianej @pl
preferred label: Fabricação de artigos de malha @pt
preferred label: Fabricarea articolelor de îmbrăcăminte prin tricotare sau croşetare @ro
preferred label: Производство вязаных и трикотажных изделий одежды @ru
preferred label: Výroba pletených a háčkovaných odevov @sk
preferred label: Proizvodnja pletenih in kvačkanih oblačil @sl
preferred label: Tillverkning av trikåvaror @sv
preferred label: Örme (trikotaj) ve tığ işi ürünlerin imalatı @tr
broader: Manufacture of wearing apparel
narrower: Manufacture of knitted and crocheted hosiery
narrower: Manufacture of other knitted and crocheted apparel

Manufacture of knitted and crocheted hosiery
type: Concept
notation: 14.31
status: valid
status modified: 2013-10-18
accepted date: 2013-10-18
in scheme: Statistical Classification of Economic Activities in the European Community, Rev. 2 (2008)
scope note: - производство на чорапи (вкл. къси и дълги) и чорапогащници, изплетени машинно или ръчно @bg
scope note: Z: - výrobu punčochových výrobků jako ponožek, podkolenek, punčoch a punčocháčů @cs
scope note: Diese Klasse umfasst: - Herstellung von Strumpfwaren wie Socken, Strümpfe und Strumpfhosen @de
scope note: This class includes: - manufacture of hosiery, including socks, tights and pantyhose @en
scope note: Esta clase comprende: - la fabricación de artículos de calcetería, incluidos calcetines, medias ordinarias y medias pantalón @es
scope note: Cette classe comprend: - la fabrication d’articles chaussants, y compris les chaussettes, les bas et les collants @fr
scope note: Ovaj razred uključuje: - proizvodnju čarapa, uključujući sokne, hulahup-čarape, obične i bez stopala
scope note: Į šią klasę įeina: - trikotažo, įskaitant puskojines, triko ir pėdkelnes, gamyba @lt
scope note: Данная группа включает в себя производство кожаных и меховых изделий. @ru
scope note: Bu sınıf aşağıdakileri kapsamaktadır; - çorap imalatı; kısa çorap, tayt ve külotlu çorap dahil. @tr
preferred label: Производство на чорапи и чорапогащи @bg
preferred label: Výroba pletených a háčkovaných punčochových výrobků @cs
preferred label: Fremstilling af strikkede og hæklede strømpevarer @da
preferred label: Herstellung von Strumpfwaren @de
preferred label: Κατασκευή ειδών καλτσοποιίας απλής πλέξης και πλέξης κροσέ @el
preferred label: Confección de calcetería @es
preferred label: Suka- ja sokitootmine @et
preferred label: Sukkien ja sukkahousujen valmistus @fi
preferred label: Fabrication d'articles chaussants à mailles @fr
preferred label: Kötött, hurkolt harisnyafélék gyártása
preferred label: Fabbricazione di articoli di calzetteria in maglia @it
preferred label: Pėdkelnių, triko, kojinių ir kitų panašių megztų (trikotažinių) ir nertų gaminių bei dirbinių gamyba @lt
preferred label: Trikotāžas zeķu ražošana @lv
preferred label: Manifattura ta' maljerija maħduma bil-labar u bil-ganċ @mt
preferred label: Vervaardiging van gebreide en gehaakte kousen en sokken @nl
preferred label: Produksjon av strømpevarer @no
preferred label: Produkcja wyrobów pończoszniczych @pl
preferred label: Fabricação de meias e similares de malha @pt
preferred label: Fabricarea prin tricotare sau croşetare a ciorapilor şi articolelor de galanterie @ro
preferred label: Производство вязаных и трикотажных чулочных изделий @ru
preferred label: Výroba pletených a háčkovaných pančúch @sk
preferred label: Proizvodnja nogavic @sl
preferred label: Tillverkning av strumpor @sv
preferred label: Örme (trikotaj) ve tığ işi çorap imalatı @tr
broader: Manufacture of knitted and crocheted apparel

Manufacture of other knitted and crocheted apparel
type: Concept
notation: 14.39
status: valid
status modified: 2013-10-18
accepted date: 2013-10-18
in scheme: Statistical Classification of Economic Activities in the European Community, Rev. 2 (2008)
scope note: - плетене по кройка на пуловери, жилетки, блузи, фланелки и други подобни изделия, машинно или ръчно, вкл. на една кука - производство на плетени платове - 13.91 - производство на чорапи и чорапогащи - 14.31 @bg
scope note: Z: - výrobu oděvů a jiného konfekčního zboží pletením nebo háčkováním (do hotového tvaru): • pulovrů, vest, svetrů a podobných výrobků N: - výrobu háčkovaných a pletených materiálů (13.91) - výroba punčochových výrobků (14.31) @cs
scope note: Diese Klasse umfasst: - Herstellung von Bekleidung und anderen konfektionierten Waren durch Stricken oder Wirken: Pullover, Strickjacken, Unterziehpullis, Westen und ähnliche Erzeugnisse Diese Klasse umfasst nicht: - Herstellung von gewirktem und gestricktem Stoff (s. 13.91) - Herstellung von Strumpfwaren (s. 14.31) @de
scope note: This class includes: - manufacture of knitted or crocheted wearing apparel and other made-up articles directly into shape: pullovers, cardigans, jerseys, waistcoats and similar articles This class excludes: - manufacture of knitted and crocheted fabrics, see 13.91 - manufacture of hosiery, see 14.31 @en
scope note: Esta clase comprende: - la confección de prendas en tejido de punto y otros artículos confeccionados modelados directamente: jerseys, chaquetas de punto, chalecos y artículos similares. Esta clase no comprende: - la fabricación de tejidos de punto (véase 13.91); - la fabricación de calcetería (véase 14.31) @es
scope note: Cette classe comprend: - la fabrication d’articles vestimentaires confectionnés en toutes matières textiles, y compris d’articles mis directement en forme au tricot ou au crochet: pull-overs, cardigans, chandails, gilets et articles similaires à mailles Cette classe ne comprend pas: - la fabrication d’étoffes à mailles, voir 13.91 - la fabrication d’articles chaussants, voir 14.31 @fr
scope note: Ovaj razred uključuje: - proizvodnju pletene i kukičane odjeće i ostalih gotovih predmeta neposredno u oblike: pulovera, jakni (kardigan), džerseja, prsluka i sličnih predmeta Ovaj razred isključuje: - proizvodnju pletenog i kukičanog tekstila, vidi 13.91 - proizvodnju hulahup-čarapa, vidi 14.31
scope note: Į šią klasę įeina: - megztinių (trikotažinių) ar nertinių drabužių ir kitų gatavų tam tikros formos dirbinių, pvz., puloverių, susagstomų megztinių, megztinių, liemenių ir panašių gaminių bei dirbinių, gamyba Į šią klasę neįeina: - megztinių (trikotažinių) ir nertinių medžiagų gamyba, žr. 13.91 - trikotažo gamyba, žr. 14.31 @lt
scope note: Этот класс включает: - дубление, окрашивание и выделку шкур и кожи - производство замши, нубука, гладкой или металлизированной кожи - производство составных кожаных изделий - выскабливание/сбривание, стрижку, удаление пеньков, выделку, дубление, вымачивание и окрашивание кожи и шкур с волосяным покровом Этот класс исключает: - производство шкур и кож как часть фермерской деятельности, см. 01.4 - производство шкур и кож при забое скота, см. 10.11 - производство кожаной одежды, см. 14.11 - производство искусственной кожи не на основе натуральной кожи, см. 22.19, 22.29 @ru
scope note: Bu sınıf aşağıdakileri kapsamaktadır; - örme (trikotaj) ve tığ (kroşe) giyim eşyası ve diğer tamamlanmış eşyanın imalatı; kazak, hırka, jarseden giyim eşyası,ceket, yelek ve benzeri ürünler. Kapsam dışı olanlar; - örme (trikotaj) ve tığ işi kumaşların imalatı, bkz. 13.91. - çorap imalatı, bkz. 14.31. @tr
preferred label: Производство на класически (машинно или ръчно плетени) пуловери, жилетки и други подобни изделия @bg
preferred label: Výroba ostatních pletených a háčkovaných oděvů @cs
preferred label: Fremstilling af andre strikkede og hæklede beklædningsartikler @da
preferred label: Herstellung von sonstiger Bekleidung aus gewirktem und gestricktem Stoff @de
preferred label: Κατασκευή άλλων πλεκτών ειδών και ειδών πλέξης κροσέ @el
preferred label: Confección de otras prendas de vestir de punto @es
preferred label: Muude silmkoe- ja heegelrõivaste tootmine @et
preferred label: Muiden neulevaatteiden valmistus @fi
preferred label: Fabrication d'autres articles à mailles @fr
preferred label: Egyéb kötött, hurkolt ruházati termék gyártása
preferred label: Fabbricazione di altri articoli di maglieria @it
preferred label: Kitų megztų (trikotažinių) ir nertų drabužių gamyba @lt
preferred label: Pārējo trikotāžas izstrādājumu ražošana @lv
preferred label: Manifattura ta' lbies maħdum bil-labar u bil-ganċ @mt
preferred label: Vervaardiging van andere gebreide en gehaakte kleding @nl
preferred label: Produksjon av andre klær av trikotasje @no
preferred label: Produkcja pozostałej odzieży dzianej @pl
preferred label: Fabricação de outro vestuário de malha @pt
preferred label: Fabricarea prin tricotare sau croşetare a altor articole de îmbrăcăminte @ro
preferred label: Производство прочих вязаных и трикотажных изделий @ru
preferred label: Výroba ostatných pletených a háčkovaných odevov @sk
preferred label: Proizvodnja drugih pletenih in kvačkanih oblačil @sl
preferred label: Tillverkning av andra trikåvaror @sv
preferred label: Örme (trikotaj) ve tığ işi diğer giyim eşyası imalatı @tr
broader: Manufacture of knitted and crocheted apparel

Manufacture of leather and related products
type: Concept
notation: 15
status: valid
status modified: 2013-10-18
accepted date: 2013-10-18
in scheme: Statistical Classification of Economic Activities in the European Community, Rev. 2 (2008)
scope note: обработка и боядисване на кожухарски кожи; дъбене и последваща обработка на сурови кожи от едър рогат добитък и други животни за производство на кожени изделия. Тук е включено и производството на изделия от други материали, различни от кожата, при чието производство се използват технологии, идентични с тези в кожарските предприятия, например обувки, чанти. @bg
scope note: Tento oddíl zahrnuje úpravy a barvení kožešin a zpracování kůží na usně činěním nebo konzervováním a další úpravou a zpracováním kůže na spotřební předměty. Kromě toho zahrnuje výrobu obdobných výrobků z jiných materiálů (umělé kůže nebo náhražky kůže), např. gumovou obuv, textilní zavazadla. Výrobky z náhražky kůže jsou zde zařazeny, protože se výrobní postup používaný při jejich výrobě podobá postupu výroby výrobků z usní (např. cestovních zavazadel) a tyto výrobky se často vyrábějí ve stejném závodě. @cs
scope note: Diese Abteilung umfasst das Zurichten und Färben von Pelzen und die Verarbeitung von Fellen zu Leder durch Gerben und Zurichten sowie die Weiterverarbeitung des Leders zu Gebrauchsgegenständen. Sie beinhaltet ferner die Herstellung von gleichartigen Erzeugnissen aus anderen Stoffen (Kunstleder oder Lederersatz), etwa von Schuhwerk aus Gummi, von Reisekoffern und –taschen aus Textilien usw. Die Erzeugnisse aus Lederersatz werden deshalb hier eingereiht, weil das Verfahren zu ihrer Herstellung dem für Erzeugnisse aus Leder ähnelt (z. B. Reisegepäck) und sie oft in der selben statistischen Einheit hergestellt werden. @de
scope note: This division includes dressing and dyeing of fur and the transformation of hides into leather by tanning or curing and fabricating the leather into products for final consumption. It also includes the manufacture of similar products from other materials (imitation leathers or leather substitutes), such as rubber footwear, textile luggage etc. The products made from leather substitutes are included here, since they are made in ways similar to those in which leather products are made (e.g. luggage) and are often produced in the same unit. @en
scope note: Esta división comprende la preparación y el teñido de pieles y la transformación de pieles en cuero mediante el curtido o el curado, así como la conversión del cuero en productos para el consumo final. Comprende asimismo la elaboración de productos similares a partir de otros materiales (cueros de imitación o sucedáneos de cuero), como el calzado de caucho, artículos de viaje textiles, etc. Los productos elaborados a partir de sucedáneos de cuero se incluyen en esta categoría porque se fabrican de manera similar a la empleada en el caso de los productos de cuero (p. ej., artículos de viaje), y suelen producirse en la misma unidad. @es
scope note: Cette division comprend la préparation et la teinture de fourrures et la transformation des peaux en cuir par le tannage ou le corroyage et la fabrication de produits en cuir destinés à la consommation finale. Elle comprend également la fabrication d’articles similaires en d’autres matières (imitations de cuir ou cuirs synthétiques), tels que chaussures en caoutchouc, articles de voyage en matières textiles, etc. Les produits confectionnés à partir de cuirs synthétiques sont également compris, puisque leur mode de production est similaire à celui des articles en cuir (par exemple: les articles de voyage) et qu’ils sont souvent fabriqués dans la même unité. @fr
scope note: Ovaj odjeljak uključuje obradu i bojenje krzna, te preradu krzna u kožu, štavljenjem ili sušenjem, i preradu kože u proizvode finalne potrošnje. Također uključuje proizvodnju sličnih proizvoda od ostalih materijala (imitaciju kože ili nadomjestaka kože) kao što su obuća od gume, kovčezi od tekstila itd. Proizvodi od nadomjestaka kože uključeni su ovdje, jer su izrađeni na sličan način kao i proizvodi od kože (npr.kovčezi) i često se proizvode u istoj jedinici.
scope note: Į šį skyrių įeina kailių išdirbimas ir dažymas, odos gamyba šikšninant, rauginant ir apdorojant kailius (odas) ir odinių galutinio vartojimo gaminių gamyba. Čia taip pat įeina panašių gaminių, tokių kaip guminė avalynė, tekstilės lagaminai ir kt., iš kitų medžiagų (dirbtinės odos ir odos pakaitalų) gamyba. Gaminiai, pagaminti iš odos pakaitalų yra klasifikuojami šiame skyriuje, jei jie yra gaminami panašiu būdu, kaip ir odiniai gaminiai (pvz., lagaminai) ir dažniausiai gaminami toje pačioje vietoje. @lt
scope note: Этот класс включает: - производство багажных сумок, дамских сумочек и т.п. из кожи, кусочков кожи или любых прочих материалов, таких как пластиковые вставки, текстильные материалы, вулканизированные волокна или картон по тем же технологическим методам, которые применяются для натуральной кожи - производство шорных изделий и сбруи - производство неметаллических браслетов для наручных часов (например, из ткани, кожи, пластика) - производство различных изделий из кожи или кусочков кожи: приводных ремней, ранцев и т.д. - производство шнурков для ботинок из кожи - производство кнутов и снаряжения для верховой езды Этот класс исключает: - производство кожаной одежды, см. 14.11 - производство кожаных перчаток и головных уборов, см. 14.19 - производство обуви, см. 15.20 - производство седел для велосипедов, см. 30.92 - производство ценных металлических браслетов для наручных часов, см. 32.12 - производство неценных металлических браслетов для наручных часов, см. 32.13 - производство ремней безопасности для линейных монтеров и прочих ремней для профессионального использования, см. 32.99 @ru
scope note: Bu bölüm, kürklerin boyanması ve işlenmesin,hayvan postlarının tabaklanması ve ıslah edilmesi yöntemleriyle deriye dönüştürülmesini ve derinin nihai tüketim amacıyla ürünler olarak üretilmesini kapsamaktadır. Bu bölüm, ayrıca diğer materyallerden (imitasyon deriler ya da deri ikamelerinden), kauçuk ayakkabılar, dokuma kumaştan bagajlar v.s. gibi benzer ürünlerin imalatını de kapsamaktadır. Deri yerine kullanılan malzemelerden imal edilen ürünler de bu bölüme dahildir; çünkü onlar da deri ürünler ile benzer şekilde imal edilirler (örn. bavullar) ve genellikle aynı birim tarafından imal edilirler. @tr
preferred label: Обработка на кожи; производство на обувки и други изделия от обработени кожи без косъм @bg
preferred label: Výroba usní a souvisejících výrobků @cs
preferred label: Fremstilling af læder og lædervarer @da
preferred label: Herstellung von Leder, Lederwaren und Schuhen @de
preferred label: Βιομηχανία δέρματος και δερμάτινων ειδών @el
preferred label: Industria del cuero y del calzado @es
preferred label: Nahatöötlemine ja nahktoodete tootmine @et
preferred label: Nahan ja nahkatuotteiden valmistus @fi
preferred label: Industrie du cuir et de la chaussure @fr
preferred label: Bőr, bőrtermék, lábbeli gyártása
preferred label: Confezione di articoli in pelle e simili @it
preferred label: Odos ir odos dirbinių gamyba @lt
preferred label: Ādas un ādas izstrādājumu ražošana @lv
preferred label: Manifattura ta' prodotti tal-ġilda u prodotti relatati @mt
preferred label: Vervaardiging van leer en van producten van leer @nl
preferred label: Produksjon av lær og lærvarer @no
preferred label: Produkcja skór i wyrobów ze skór wyprawionych @pl
preferred label: Indústria do couro e dos produtos do couro @pt
preferred label: Tăbăcirea şi finisarea pieilor; fabricarea articolelor de voiaj şi marochinărie, harnaşamentelor şi încălţămintei; prepararea şi vopsirea blănurilor @ro
preferred label: Производство кожаной и относящейся к ней продукции @ru
preferred label: Výroba kože a kožených výrobkov @sk
preferred label: Proizvodnja usnja, usnjenih in sorodnih izdelkov @sl
preferred label: Tillverkning av läder, läder- och skinnvaror m.m. @sv
preferred label: Deri ve ilgili ürünlerin imalatı @tr
broader: MANUFACTURING
narrower: Tanning and dressing of leather; manufacture of luggage, handbags, saddlery and harness; dressing and dyeing of fur
narrower: Manufacture of footwear

Tanning and dressing of leather; manufacture of luggage, handbags, saddlery and harness; dressing and dyeing of fur
type: Concept
notation: 15.1
status: valid
status modified: 2013-10-18
accepted date: 2013-10-18
in scheme: Statistical Classification of Economic Activities in the European Community, Rev. 2 (2008)
scope note: Тази група включва производство на обработени кожи (без косъм и кожухарски) и изделия от тях @bg
scope note: Tato skupina zahrnuje výrobu kůží a kožešin a výrobků z nich @cs
scope note: Diese Gruppe umfasst die Herstellung von Leder und Fellen sowie von Erzeugnissen daraus. @de
scope note: This group includes the manufacture of leather and fur and products thereof. @en
scope note: Este grupo comprende la fabricación de cuero, pieles y productos elaborados con éstos. @es
scope note: Ce groupe comprend la production de cuir et de fourrure et la fabrication des produits en cuir ou en fourrure. @fr
scope note: Ova skupina uključuje proizvodnju kože i krzna i njihovih proizvoda.
scope note: Į šią grupę įeina odos bei kailių ir gaminių iš jų gamyba. @lt
scope note: Bu grup, deri, kürk ve bunlardan elde edilen ürünlerin imalatını kapsamaktadır. @tr
preferred label: Обработка на кожи; производство на изделия за пътуване и сарашки изделия @bg
preferred label: Činění a úprava usní (vyčiněných kůží); výroba brašnářských a sedlářských výrobků; zpracování a barvení kožešin @cs
preferred label: Garvning og beredning af læder; fremstilling af tasker, kufferter, sadelmagervarer mv.; beredning og farvning af pelsskind @da
preferred label: Herstellung von Leder und Lederwaren (ohne Herstellung von Lederbekleidung) @de
preferred label: Κατεργασία και δέψη δέρματος· κατασκευή ειδών ταξιδίου (αποσκευών), τσαντών, ειδών σελλοποιίας και σαγματοποιίας· κατεργασία και βαφή γουναρικών @el
preferred label: Preparación, curtido y acabado del cuero; fabricación de artículos de marroquinería, viaje y de guarnicionería y talabartería; preparación y teñido de pieles @es
preferred label: Nahatöötlemine ja -parkimine; kohvrite, käekottide, sadulsepatoodete ja rakmete tootmine; karusnaha töötlemine ja värvimine @et
preferred label: Nahan parkitseminen ja muokkaus; matka- ja käsilaukkujen, satuloiden ja valjaiden valmistus; turkisten muokkaus ja värjäys @fi
preferred label: Apprêt et tannage des cuirs; préparation et teinture des fourrures; fabrication d'articles de voyage, de maroquinerie et de sellerie @fr
preferred label: Bőr, szőrme kikészítése; táskafélék, szíjazat gyártása
preferred label: Preparazione e concia del cuoio; fabbricazione di articoli da viaggio, borse, pelletteria e selleria; preparazione e tintura di pellicce @it
preferred label: Odų rauginimas ir išdirbimas; lagaminų, rankinių, balno reikmenų ir pakinktų gamyba; kailių išdirbimas ir dažymas @lt
preferred label: Ādu miecēšana un apstrāde; ceļojuma piederumu, somu un zirglietu piederumu ražošana; kažokādu apstrāde un krāsošana @lv
preferred label: Kunzatura u rfinar ta' ġilda; manifattura ta' bagalji, ħendbegs, oġġetti tas-sarraġ u xedd; irfinar u żbigħ ta' fer @mt
preferred label: Looien en bewerken van leer; vervaardiging van koffers, tassen, zadel- en tuigmakerswerk; bereiden en verven van bont @nl
preferred label: Beredning av lær, produksjon av reiseeffekter og salmakerartikler og beredning og farging av pelsskinn @no
preferred label: Garbowanie, i wyprawa skór; produkcja toreb bagażowych, toreb ręcznych i podobnych wyrobów rymarskich i kaletniczych; wyprawa i barwienie skór futerkowych @pl
preferred label: Curtimenta e acabamento de peles sem pêlo; fabricação de artigos de viagem e de uso pessoal, de marroquinaria, de correeiro e de seleiro; curtimenta e acabamento de de peles com pêlo @pt
preferred label: Tăbăcirea şi finisarea pieilor; fabricarea articolelor de voiaj şi marochinărie şi a articolelor de harnaşament; prepararea şi vopsirea blănurilor @ro
preferred label: Дубление и выделка кожи; производство чемоданов, сумок, шорно-седельных изделий; выделка и крашение меха @ru
preferred label: Činenie a apretovanie kože; výroba kufrov, kabeliek, sediel a popruhov; úprava a farbenie kože @sk
preferred label: Strojenje in dodelava usnja in krzna; proizvodnja potovalne galanterije in sedlarskih izdelkov @sl
preferred label: Garvning och annan läderberedning; tillverkning av reseffekter, handväskor, sadel- och seldon; pälsberedning @sv
preferred label: Derinin tabaklanması ve işlenmesi; bavul, el çantası, saraçlık ve koşum takımı imalatı; kürkün işlenmesi ve boyanması @tr
broader: Manufacture of leather and related products
narrower: Tanning and dressing of leather; dressing and dyeing of fur
narrower: Manufacture of luggage, handbags and the like, saddlery and harness

Tanning and dressing of leather; dressing and dyeing of fur
type: Concept
notation: 15.11
status: valid
status modified: 2013-10-18
accepted date: 2013-10-18
in scheme: Statistical Classification of Economic Activities in the European Community, Rev. 2 (2008)
scope note: - дъбене, обработка и багрене на кожи без косъм - производство на велурирани кожи; кожи, обработени като пергамент; кожи с лаково или метализирано покритие - производство на възстановени кожи - подготвителни операции, дъбене, избелване, стригане, багрене и друга обработка на кожухарски кожи - добиване на сурови кожи в селските стопанства (фермите) - 01.4 - добиване на сурови кожи от кланици - 10.11 - производство на облекло от обработени меки кожи - 14.11 - производство на изкуствени кожи на основа, различна от естествената кожа - 22.19, 22.29 @bg
scope note: Z: - činění, barvení a úpravu kůží a kožek - výrobu semišové (jelenicové), pergamenové a lakové úsně nebo usně s metalickým efektem - výrobu kompozitních kůží - třídění (koženého odpadu), činění, bělení, stříhání, rupování a barvení kožešin a surových kožek (ještě nezbavených chlupů N: - produkci kůží a kožek při živočišné výrobě (01.4) - produkci kůží a kožek na jatkách (10.11) - výrobu kožených oděvů (14.11) - výrobu imitace kůže (22.19, 22.29 @cs
scope note: Diese Klasse umfasst: - Gerben, Färben und Zurichten von Fellen und Häuten - Herstellung von Sämisch-, Pergament-, Lack- oder metallisiertem Leder - Herstellung von Lederfaserstoff - Schaben, Scheren, Rupfen, Gerben, Bleichen und Färben von (noch behaarten) Fellen Diese Klasse umfasst nicht: - Erzeugung von Fellen und Häuten bei der Tierhaltung (s. 01.4) - Erzeugung von Fellen und Häuten beim Schlachten (s. 10.11) - Herstellung von Lederbekleidung (s. 14.11) - Herstellung von Kunstleder nicht auf der Grundlage von natürlichem Leder (s. 22.19, 22.29) @de
scope note: This class includes: - tanning, dyeing and dressing of hides and skins - manufacture of chamois dressed, parchment dressed, patent or metallised leathers - manufacture of composition leather - scraping, shearing, plucking, currying, tanning, bleaching and dyeing of fur skins and hides with the hair on This class excludes: - production of hides and skins as part of ranching, see 01.4 - production of hides and skins as part of slaughtering, see 10.11 - manufacture of leather apparel, see 14.11 - manufacture of imitation leather not based on natural leather, see 22.19, 22.29 @en
scope note: Esta clase comprende: - la preparación, curtido, teñido y acabado de cueros y pieles - la fabricación de cueros agamuzados, apergaminados, acharolados y metalizados - la fabricación de cuero artificial o regenerado - el raspado, tundido, despinzado, adobado, curtido, blanqueo y teñido de pieles y cueros sin depilar Esta clase no comprende: - la producción de cueros y pieles en granjas (véase 01.4) - la producción de cueros y pieles procedentes de mataderos (véase 10.11) - la fabricación de prendas de cuero (véase 14.11) - la fabricación de cuero de imitación no procedente de cuero natural (véanse 22.19 y 22.29) @es
scope note: Cette classe comprend: - le tannage, la teinture et la préparation des peaux - la fabrication de cuirs et de peaux chamoisés, parcheminés, vernis ou métallisés - la fabrication de cuirs reconstitués - le drayage, le corroyage, le tannage, le blanchiment, le tondage, l’épluchage et la teinture des pelleteries et des peaux non épilées Cette classe ne comprend pas: - la production de cuirs et de peaux provenant de fermes d’élevage, voir 01.4 - la production de cuirs et de peaux provenant d’abattoirs, voir 10.11 - la fabrication de vêtements en cuir, voir 14.11 - la fabrication d’imitations de cuir non basées sur le cuir naturel, voir 22.19 et 22.29 @fr
scope note: Ovaj razred uključuje: - štavljenje, bojenje i obradu kože - proizvodnju semiš-kože, pergament-kože, lakirane kože ili metalizirane kože - proizvodnju kože sastavljene od kožnih otpadaka (kompozitne kože) - struganje, mekšanje, štavljenje, bijeljenje, šišanje i čupanje, bojenje kože s krznom i sirove kože s dlakama Ovaj razred isključuje: - proizvodnju sirovih koža kao dio uzgoja životinja, vidi 01.4 - proizvodnju sirovih koža kao dio klaoničarstva, vidi 10.11 - proizvodnju kožne odjeće, vidi 14.11 - proizvodnju imitacija kože koje nemaju podlogu od prirodne kože, vidi 22.19, 22.29
scope note: Į šią klasę įeina: - kailių ir odų rauginimas, dažymas ir išdirbimas - zomšos, pergamento, lakuotų ar metalizuotų odų gamyba - kompozicinės odos gamyba - kailių ir plaukuotų odų skutimas (valymas), kirpimas, plaukų išpešiojimas, šikšninimas, riebalų šalinimas, rauginimas, balinimas ir dažymas Į šią klasę neįeina: - kailių ir odų gavyba, kuri yra žemės ūkių veiklos dalis, žr. 01.4 - kailių ir odų gavyba, kuri yra skerdyklų veiklos dalis, žr. 10.11 - odinių drabužių siuvimas, žr. 14.11 - odos pakaitalų, nenaudojant natūralios odos, gamyba, žr. 22.19, 22.29 @lt
scope note: Этот класс включает: - производство обуви из любых материалов любыми способами, включая формовку (исключения см. ниже) - производство кожаных частей обуви: наружных и внутренних частей, подошв, каблуков и т.д. - производство крагов, леггинсов и подобных изделий Этот класс исключает: - производство обуви из текстильных материалов без наложения подошвы, см. 14.19 - производство деревянных частей для обуви (например, каблуков), см. 16.29 - производство резиновых ботинок, каблуков и подошв и прочих резиновых частей для обуви, см. 22.19 - производство пластиковых частей для обуви, см. 22.29 - производство лыжных ботинок, см. 32.30 - производство ортопедической обуви, см. 32.50 @ru
scope note: Bu sınıf aşağıdakileri kapsamaktadır; - kürkün ve derinin tabaklanması, boyanması, işlenmesi, - elbiselik güderi, elbiselik parşömen deri, açık ve metalize deri imalatı, - birleştirilmiş deri imalatı, - kürklü derinin ve postların kazınarak temizlenmesi, kırkılması, tüylerinin yolunması, tabaklanması, ağartılması ve boyanması. Kapsam dışı olanlar; - çiftçiliğin bir parçası olarak hayvan derisi ve post imalatı, bkz. 01.4, - kesim faaliyetlerinin bir parçası olarak hayvan derisi ve post imalatı, bkz. 10.11, - deri giyim eşyası imalatı, bkz. 14.11, - doğal deri temelli olmayan suni (imitasyon) deri imalatı, bkz. 22.19, 22.29. @tr
preferred label: Обработка на кожи без косъм; обработка и багрене на кожухарски кожи @bg
preferred label: Činění a úprava usní (vyčiněných kůží); zpracování a barvení kožešin @cs
preferred label: Garvning og beredning af læder; beredning og farvning af pelsskind @da
preferred label: Herstellung von Leder und Lederfaserstoff; Zurichtung und Färben von Fellen @de
preferred label: Κατεργασία και δέψη δέρματος· κατεργασία και βαφή γουναρικών @el
preferred label: Preparación, curtido y acabado del cuero; preparación y teñido de pieles @es
preferred label: Nahatöötlemine ja -parkimine; karusnaha töötlemine ja värvimine @et
preferred label: Turkisten ja nahan muokkaus ja värjäys @fi
preferred label: Apprêt et tannage des cuirs; préparation et teinture des fourrures @fr
preferred label: Bőr, szőrme kikészítése
preferred label: Preparazione e concia del cuoio; preparazione e tintura di pellicce @it
preferred label: Odų rauginimas ir išdirbimas; kailių išdirbimas ir dažymas @lt
preferred label: Ādu miecēšana un apstrāde; kažokādu apstrāde un krāsošana @lv
preferred label: Kunzatura u rfinar ta' ġilda; kunzatura u rfinar ta' fer @mt
preferred label: Looien en bereiden van leer; bereiden en verven van bont @nl
preferred label: Beredning av lær, og beredning og farging av pelsskinn @no
preferred label: Garbowanie i wyprawa skór; wyprawa i barwienie skór futerkowych @pl
preferred label: Curtimenta e acabamento de peles sem pêlo e com pêlo @pt
preferred label: Tăbăcirea şi finisarea pieilor; prepararea şi vopsirea blănurilor @ro
preferred label: Дубление и выделка кожи; выделка и окрашивание меха @ru
preferred label: Činenie a apretovanie kože; úprava a farbenie kožušín @sk
preferred label: Strojenje in dodelava usnja in krzna @sl
preferred label: Garvning och annan läderberedning; pälsberedning @sv
preferred label: Derinin tabaklanması ve işlenmesi; kürkün işlenmesi ve boyanması @tr
broader: Tanning and dressing of leather; manufacture of luggage, handbags, saddlery and harness; dressing and dyeing of fur

Manufacture of luggage, handbags and the like, saddlery and harness
type: Concept
notation: 15.12
status: valid
status modified: 2013-10-18
accepted date: 2013-10-18
in scheme: Statistical Classification of Economic Activities in the European Community, Rev. 2 (2008)
scope note: - производство на куфари, чанти и подобни изделия от обработени кожи без косъм или възстановени кожи и от други материали като пластмаси, текстил, вулканизирани влакна или картон, където се използва същата технология, както при обработените кожи без косъм - производство на сарашки и седларски изделия - производство на каишки за часовници от текстил, кожи и пластмаси - производство на разнообразни изделия от обработени кожи без косъм или възстановени кожи: колани за автомобили, изделия за техническа употреба и други - производство на кожени връзки и каишки за обувки - производство на камшици, бичове и подобни изделия - производство на облекло от обработени меки кожи - 14.11 - производство на ръкавици и шапки от обработени меки кожи - 14.19 - производство на обувки - 15.20 - производство на седла за велосипеди - 30.92 - производство на верижки за часовници от благородни метали - 32.12 - производство на верижки за часовници от неблагородни метали - 32.13 - производство на предпазни и осигурителни колани - 32.99 @bg
scope note: Z: - výrobu kufrů, kabelek a jiných výrobků z kůže, umělé kůže nebo jiných materiálů jako plastových folií, textilních materiálů, vulkanizovaných vláken nebo lepenky, kde se používá stejná technologie jako při výrobě výrobků z kůže - výrobu sedlářských výrobků a popruhů - výrobu nekovových pásků k náramkovým hodinkám (např. z látky, usní, plastů) - výrobu různých výrobků z usní nebo umělé kůže: hnací řemeny, ploché těsnění atd. - výrobu tkaniček do bot, z usní - výrobu jezdeckých a jiných bičů N: - výrobu kožených oděvů (14.11) - výrobu kožených rukavic a klobouků (14.19) - výrobu obuvi (15.20) - výrobu sedel na jízdní kola (30.92) - výrobu pásků k náramkovým hodinkám z drahých kovů (32.12) - výrobu pásků k náramkovým hodinkám z obecných kovů (32.13) - výrobu bezpečnostních pásů pro pochůzkáře (žel.) a jiných pásů používaných pro výkon povolání (32.99) @cs
scope note: Diese Klasse umfasst: - Herstellung von Koffern, Taschen und anderen Waren aus Leder, Kunstleder oder anderen Materialien wie Kunststofffolien, Spinnstoffen, Vulkanfiber oder Pappe, bei denen die gleiche Technologie angewendet wird wie bei Leder - Herstellung von Sattlerwaren - Herstellung von nichtmetallischen Uhrarmbändern (z. B. aus Stoff, Leder, Kunststoff) - Herstellung von verschiedenen Artikeln aus Leder oder Kunstleder: Treibriemen, Dichtungen usw. - Herstellung von Schnürsenkeln aus Leder - Herstellung von Reit- und anderen Peitschen Diese Klasse umfasst nicht: - Herstellung von Lederbekleidung (s. 14.11) - Herstellung von Lederhandschuhen, -hüten und -mützen (s. 14.19) - Herstellung von Schuhen (s. 15.20) - Herstellung von Fahrradsätteln (s. 30.92) - Herstellung von Uhrarmbändern aus Edelmetallen (s. 32.12) - Herstellung von Uhrarmbändern aus unedlen Metallen (s. 32.13) - Herstellung von Haltegurten und anderen Gurten für die Berufsausübung (s. 32.99) @de
scope note: This class includes: - manufacture of luggage, handbags and the like, of leather, composition leather or any other material, such as plastic sheeting, textile materials, vulcanised fibre or paperboard, where the same technology is used as for leather - manufacture of saddlery and harness - manufacture of non-metallic watch bands (e.g. fabric, leather, plastic) - manufacture of diverse articles of leather or composition leather: driving belts, packings etc. - manufacture of shoe-lace, of leather - manufacture of horse whips and riding crops This class excludes: - manufacture of leather wearing apparel, see 14.11 - manufacture of leather gloves and hats, see 14.19 - manufacture of footwear, see 15.20 - manufacture of saddles for bicycles, see 30.92 - manufacture of precious metal watch bands, see 32.12 - manufacture of non-precious metal watch bands, see 32.13 - manufacture of linemen's safety belts and other belts for occupational use, see 32.99 @en
scope note: Esta clase comprende: - la fabricación de artículos de viaje, bolsos de mano y artículos semejantes de cuero natural, artificial o regenerado, o de cualquier otro material como plástico, materias textiles, fibra vulcanizada o cartón, siempre que se utilice la misma tecnología que para el cuero - la fabricación de artículos de guarnicionería y talabartería - la fabricación de correas no metálicas para relojes de pulsera (p. ej., tela, cuero, plástico) - la fabricación de diversos artículos de cuero natural o de cuero artificial o regenerado: correas de transmisión, envases, etc. - la fabricación de cordones de zapatos, de cuero - la fabricación de látigos y fustas Esta clase no comprende: - la fabricación de prendas de vestir de cuero (véase 14.11) - la fabricación de guantes y sombreros de cuero (véase 14.19) - la fabricación de calzado (véase 15.20) - la fabricación de sillines de bicicleta (véase 30.92) - la fabricación de correas de relojes de metales preciosos (véase 32.12) - la fabricación de correas de relojes de metales no preciosos (véase 32.13) - la fabricación de arneses de seguridad y otros cinturones para uso profesional (véase 32.99) @es
scope note: Cette classe comprend: - la fabrication d’articles de voyage, d’articles de maroquinerie et d’articles similaires en cuir naturel, en cuir reconstitué ou en tout autre matériau, par exemple: les matières plastiques, les matières textiles, les fibres vulcanisées ou le carton, pour autant que la technologie utilisée soit identique à celle employée pour le cuir - la fabrication d’articles de sellerie et de bourrellerie - la fabrication de bracelets de montres autres qu’en métal (par exemple: tissu, cuir, matières plastiques) - la fabrication d’articles divers en cuir naturel ou reconstitué: courroies, joints, etc. - la fabrication de lacets de chaussures en cuir - la fabrication de fouets et de cravaches Cette classe ne comprend pas: - la fabrication de vêtements en cuir, voir 14.11 - la fabrication de gants et de chapeaux en cuir, voir 14.19 - la fabrication de chaussures, voir 15.20 - la fabrication de selles pour vélos, voir 30.92 - la fabrication de bracelets de montres en métaux précieux, voir 32.12 - la fabrication de bracelets de montres en métaux non précieux, voir 32.13 - la fabrication de ceintures de sécurité pour poseurs de rails et autres ceintures à usage professionnel, voir 32.99 @fr
scope note: Ovaj razred uključuje: - proizvodnju kovčega, ručnih torbica i slično, od kože, kožnih ostataka ili drugih materijala, npr. plastičnih folija, tekstila, vulkanfibera (kartona), pri čemu se koristi ista tehnologija kao i za kožu - proizvodnju sedlarskih i remenarskih proizvoda - proizvodnju nemetalnog remena za satove (npr. platnenoga, kožnoga, plastičnoga) - proizvodnju raznih proizvoda od kože ili kožnih ostataka: pogonskog remena, britvi itd. - proizvodnju kožnih vezica za cipele - proizvodnju korbača i bičeva za konje Ovaj razred isključuje: - proizvodnju kožne odjeće, vidi 14.11 - proizvodnju kožnih rukavica i šešira, vidi 14.19 - proizvodnju obuće, vidi 15.20 - proizvodnju sjedala za bicikle, vidi 30.92 - proizvodnju remena za satove od plemenitih kovina, vidi 32.12 - proizvodnju remena za satove od neplemenitih kovina, vidi 32.13 - proizvodnju linijsku sigurnosnih pojaseva i ostalih pojaseva za profesionalnu uporabu, vidi 32.99
scope note: Į šią klasę įeina: - lagaminų, rankinių ir panašių reikmenų iš odos, kompozicinės odos ir bet kurių kitų medžiagų, tokių kaip plastiko lakštai, tekstilės medžiagos, vulkanizuoti pluoštai ar kartonas, kurių gamybos technologija yra tokia kaip odos gaminių, gamyba - balno reikmenų ir pakinktų gamyba - nemetalinių laikrodžių dirželių (laikiklių) iš medžiagos, odos, plastiko ir kt., gamyba - kitų odos ar kompozicinės odos reikmenų (pavarų diržų, kuprinių ir kt.) gamyba - odinių batraiščių gamyba - arklių botagų ir jodinėjimo botago kotų gamyba Į šią klasę neįeina: - odinių drabužių gamyba, žr. 14.11 - odinių pirštinių ir skrybėlių gamyba, žr. 14.19 - avalynės gamyba, žr. 15.20 - dviračių balnelių gamyba, žr. 30.92 - laikrodžių dirželių (laikiklių) iš tauriųjų metalų gamyba, žr. 32.12 - laikrodžių dirželių (laikiklių) iš netauriųjų metalų gamyba, žr. 32.13 - elektromonterių saugos diržų ir kitų profesinės paskirties diržų gamyba, žr. 32.99 @lt
scope note: Данный раздел включает обработку древесины и производство деревянных изделий, таких как строевой лес, панели, фанеру, тару, паркет, строительные конструкции и сборные строения. Обработка древесины включает распиловку, строгание, профилирование, вальцевание, сборку деревянных изделий, начиная от бревен, которые распиливаются на куски, или строевого леса, который может распиливаться далее, формироваться на токарном станке или других инструментах. Строевой лес обрабатывается для получения строганных пиломатериалов, отшлифованных и далее используемых для производства готовых продуктов, например, деревянной тары. За исключением лесопиления, данный раздел подразделен на части по определенным видам продукции. Данный раздел исключает производство мебели (31.0) и столярные операции и т.п. (43.32, 43.33, 43.39). @ru
scope note: Bu sınıf aşağıdakileri kapsamaktadır; - deriye uygulanan teknolojilerin aynısının uygulandığı elyaf ve karton, tekstil ürünleri plastik tabakalar gibi diğer materyaller, karma deri ve deriden bavul, el çantası ve benzeri ürünler imalatı, - saraçlık ve koşum takımı imalatı, - metal olmayan saat kayışı imalatı (örn. kumaş, deri, plastik), - deri veya karma deriden çeşitli mamul imalatı: çark kayışı, ambalajlama ürünleri vb., - deriden ayakkabı bağı imalatı, - at kamçıları ve binicilik eşyaları imalatı. Kapsam dışı olanlar; - deri giyim eşyası imalatı, bkz.14.11, - deri eldiven ve şapka imalatı, bkz.14.19, - ayakkabı imalatı, bkz.15.20, - bisikletler için sele imalatı, bkz. 30.92, - değerli metallerden saat kayışı imalatı, bkz. 32.12, - değerli olmayan metallerden saat kayışı imalatı, bkz. 32.13, - demiryolu hat işçilerine emniyet kemeri ve mesleki amaçla kullanılan diğer kemerlerin imalatı, bkz. 32.99. @tr
preferred label: Производство на куфари, чанти и други изделия за пътуване, сарашки и седларски изделия @bg
preferred label: Výroba brašnářských, sedlářských a podobných výrobků @cs
preferred label: Fremstilling af tasker, kufferter, sadelmagervarer mv. @da
preferred label: Lederverarbeitung (ohne Herstellung von Lederbekleidung) @de
preferred label: Κατασκευή ειδών ταξιδιού (αποσκευών), τσαντών και παρόμοιων ειδών, ειδών σελλοποιίας και σαγματοποιίας @el
preferred label: Fabricación de artículos de marroquinería, viaje y de guarnicionería y talabartería @es
preferred label: Kohvrite, käekottide jms, sadulsepatoodete ja rakmete tootmine @et
preferred label: Matka-, käsi- ym. laukkujen, satuloiden ja valjaiden valmistus @fi
preferred label: Fabrication d'articles de voyage, de maroquinerie et de sellerie @fr
preferred label: Táskafélék, szíjazat gyártása
preferred label: Fabbricazione di articoli da viaggio, borse e simili, pelletteria e selleria @it
preferred label: Lagaminų, rankinių ir panašių reikmenų, balno reikmenų ir pakinktų gamyba @lt
preferred label: Ceļojuma piederumu, somu un līdzīgu izstrādājumu, zirglietu piederumu ražošana @lv
preferred label: Manifattura ta' bagalji, hendbegs u oġġetti bħal dawn, oġġetti tas-sarraġ u xedd @mt
preferred label: Vervaardiging van koffers, tassen en dergelijke en van zadel- en tuigmakerswerk @nl
preferred label: Produksjon av reiseeffekter og salmakerartikler @no
preferred label: Produkcja toreb bagażowych, toreb ręcznych i podobnych wyrobów rymarskich i kaletniczych @pl
preferred label: Fabricação de artigos de viagem e de uso pessoal, de marroquinaria, de correeiro e de seleiro @pt
preferred label: Fabricarea articolelor de voiaj şi marochinărie şi a articolelor de harnaşament @ro
preferred label: Производство багажных сумок, дамских сумочек и т.п., шорных изделий и сбруи @ru
preferred label: Výroba kufrov, kabeliek a podobných výrobkov, sediel a popruhov @sk
preferred label: Proizvodnja potovalne galanterije, sedlarskih in jermenarskih izdelkov @sl
preferred label: Tillverkning av reseffekter, handväskor, sadel- och seldon m.m. @sv
preferred label: Bavul, el çantası ve benzerleri ile saraçlık ve koşum takımı imalatı (deri giyim eşyası hariç) @tr
broader: Tanning and dressing of leather; manufacture of luggage, handbags, saddlery and harness; dressing and dyeing of fur

Manufacture of footwear
type: Concept
notation: 15.2
status: valid
status modified: 2013-10-18
accepted date: 2013-10-18
in scheme: Statistical Classification of Economic Activities in the European Community, Rev. 2 (2008)
preferred label: Производство на обувки @bg
preferred label: Výroba obuvi @cs
preferred label: Fremstilling af fodtøj @da
preferred label: Herstellung von Schuhen @de
preferred label: Κατασκευή υποδημάτων @el
preferred label: Fabricación de calzado @es
preferred label: Jalatsitootmine @et
preferred label: Jalkineiden valmistus @fi
preferred label: Fabrication de chaussures @fr
preferred label: Lábbeligyártás
preferred label: Fabbricazione di calzature @it
preferred label: Avalynės gamyba @lt
preferred label: Apavu ražošana @lv
preferred label: Manifattura ta' xedd tas-saqajn @mt
preferred label: Vervaardiging van schoeisel @nl
preferred label: Produksjon av skotøy @no
preferred label: Produkcja obuwia @pl
preferred label: Indústria de calçado @pt
preferred label: Fabricarea încălţămintei @ro
preferred label: Производство обуви @ru
preferred label: Proizvodnja obutve @sl
preferred label: Tillverkning av skodon @sv
preferred label: Ayakkabı, terlik vb. imalatı @tr
broader: Manufacture of leather and related products
narrower: Manufacture of footwear

Manufacture of footwear
type: Concept
notation: 15.20
status: valid
status modified: 2013-10-18
accepted date: 2013-10-18
in scheme: Statistical Classification of Economic Activities in the European Community, Rev. 2 (2008)
scope note: - производство на всички видове обувки от всякакъв вид материали, с изключение на посочените подолу - производство на части за обувки от кожи: горни части, ходила, токове, табани, фортове, бомбета и други - производство на ботуши, галоши, гамаши, джапанки и други подобни изцяло лети, формовани от каучук или поливинилхлорид - производство на терлици от текстилни материали, без прикрепени външни ходила - 14.19 - производство на части за обувки от дървен материал (например токове, обущарски калъпи) - 16.29 - производство на части за обувки от каучук (токове, ходила и други) - 22.19 - производство на части за обувки от пластмаси - 22.29 - производство на обувки от азбест - 23.99 - производство на обувки за ски - 32.30 - производство на ортопедични обувки - 32.50 @bg
scope note: Z: - výrobu obuvi pro všechny účely, z jakéhokoliv materiálu, za použití jakéhokoliv postupu včetně lití (výjimky níže) - výrobu dílů obuvi z usní: svršků a částí svršků, vnějších i vnitřních podrážek, podpatků atd. - výrobu natahovacích holínek, kamaší apod. N: - výrobu obuvi z textilních vláken bez podrážek (14.19) - výrobu dílů obuvi ze dřeva (např. podpatků a kopyt) (16.29) - výrobu podpatků a podrážek pro holínky a obuv z pryže jakož i jiných dílů obuvi z gumy (pryže) (22.19) - výrobu dílů obuvi z plastů (22.29) - výrobu lyžařské obuvi (32.30) - výrobu ortopedické obuvi (32.50) @cs
scope note: Diese Klasse umfasst: - Herstellung von Schuhen aller Art, aus beliebigem Material, in beliebigen Verfahren einschließlich Gießverfahren (Ausnahmen siehe unten) - Herstellung von Schuhteilen aus Leder: Oberteile und Teile davon, Lauf- und Innensohlen, Absätze usw. - Herstellung von Zugstiefeln, Gamaschen u. Ä. Diese Klasse umfasst nicht: - Herstellung von Schuhen aus Textilfasern ohne Sohle (s. 14.19) - Herstellung von Schuhteilen aus Holz (z. B. Absätze und Leisten) (s. 16.29) - Herstellung von Absätzen und Sohlen für Gummistiefel und –schuhe sowie von anderen Gummiteilen für Schuhe (s. 22.19) - Herstellung von Kunststoffteilen für Schuhe (s. 22.29) - Herstellung von Skischuhen (s. 32.30) - Herstellung von orthopädischen Schuhen (s. 32.50) @de
scope note: This class includes: - manufacture of footwear for all purposes, of any material, by any process, including moulding (see below for exceptions) - manufacture of leather parts of footwear: manufacture of uppers and parts of uppers, outer and inner soles, heels etc. - manufacture of gaiters, leggings and similar articles This class excludes: - manufacture of footwear of textile material without applied soles, see 14.19 - manufacture of wooden shoe parts (e.g. heels and lasts), see 16.29 - manufacture of rubber boot and shoe heels and soles and other rubber footwear parts, see 22.19 - manufacture of plastic footwear parts, see 22.29 - manufacture of ski-boots, see 32.30 - manufacture of orthopaedic shoes, see 32.50 @en
scope note: Esta clase comprende: - la fabricación de calzado de cualquier tipo y de cualquier material, producido mediante cualquier proceso, incluso el vaciado (véanse las excepciones más adelante) - la fabricación de partes de cuero del calzado: palas y sus componentes, suelas y plantillas, tacones, etc. - la fabricación de polainas, botines y artículos similares Esta clase no comprende: - la fabricación de calzado con materias textiles sin suela incorporada (véase 14.19) - la fabricación de partes del calzado de madera (p. ej., tacones y hormas) (véase 16.29) - la fabricación de tacones y suelas de caucho y otros partes del calzado de caucho (véase 22.19) - la fabricación de partes del calzado de plástico (véase 22.29) - la fabricación de botas de esquí (véase 32.30) - la fabricación de calzado ortopédico (véase 32.50) @es
scope note: Cette classe comprend: - la fabrication de chaussures pour tous usages, en toutes matières, par tous procédés, y compris le moulage (voir ci-après pour les exceptions) - la fabrication de parties en cuir de chaussures: dessus et parties de dessus, semelles extérieures et intérieures, talons, etc. - la fabrication de guêtres, de jambières et d’articles similaires Cette classe ne comprend pas: - la fabrication de chaussures en matières textiles sans semelle rapportée, voir 14.19 - la fabrication de parties de chaussures en bois (par exemple: talons et formes), voir 16.29 - la fabrication de chaussures en caoutchouc et de talons et semelles de chaussures et d’autres parties de chaussures en caoutchouc, voir 22.19 - la fabrication de parties de chaussures en matières plastiques, voir 22.29 - la fabrication de chaussures de ski, voir 32.30 - la fabrication de chaussures orthopédiques, voir 32.50 @fr
scope note: Ovaj razred uključuje: - proizvodnju obuće svih namjena, od svih vrsta materijala, po svim postupcima, uključujući lijevanje u kalupe (vidi iznimke navedene ispod) - proizvodnju kožnih dijelova obuće: proizvodnju gornjih dijelova, vanjskih i unutarnjih potplata, potpetica itd. - proizvodnju kaljača, sara i sličnih proizvoda Ovaj razred isključuje: - proizvodnju obuće od tekstilnog materijala bez pričvršćenih potplata, vidi 14.19 - proizvodnju drvenih dijelova obuće (npr. potpetica i kalupa), vidi 16.29 - proizvodnju gumenih čizama, potpetica i potplata te ostalih gumenih dijelova obuće, vidi 22.19 - proizvodnju obuće od plastičnih dijelova, vidi 22.29 - proizvodnju skijaških cipela (pancerica), vidi 32.30 - proizvodnju ortopedskih cipela, vidi 32.50
scope note: Į šią klasę įeina: - įvairios paskirties, įvairių medžiagų, įvairios gamybos technologijos, įskaitant liejimą (žr. išimtis), avalynės gamyba - odinių avalynės dalių gamyba: batviršių ir batviršių dalių, padų ir vidpadžių, kulnų ir kt. - antkurpių, antblauzdžių ir panašių dirbinių gamyba Į šią klasę neįeina: - medžiaginės, be pritvirtinto pado, avalynės gamyba, žr. 14.19 - medinių batų dalių (pvz., kulnų ir kurpalių) gamyba, žr. 16.29 - guminių batų ir pusbačių kulnų ir padų, ir kitų guminių avalynės dalių gamyba, žr. 22.19 - plastikinių avalynės dalių gamyba, žr. 22.29 - slidžių batų gamyba, žr. 32.30 - ortopedinės avalynės gamyba, žr. 32.50 @lt
scope note: Этот класс включает: - распил, обработку древесины на строгальном станке - расщепление, очистку или рубку бревен - производство деревянных железнодорожных шпал - производство несобранного деревянного напольного покрытия - производство древесного волокна, древесной муки, щепы и стружек и т.п. Этот класс также включает: - сушку древесины - пропитку или химическую обработку древесины при помощи пропиточного состава или прочих материалов Этот класс исключает: - заготовку леса и производство сырой древесины, см. 02.20 - производство лущеного шпона, достаточно тонкого для использования в производстве фанеры, досок и панелей, см. 16.21 - производство кровельной дранки и гонта, калевок и багета, см. 16.23 - производство дров или прессованной древесины, см. 16.29 @ru
scope note: Bu sınıf aşağıdakileri kapsamaktadır; - kalıplama dahil, herhangi bir işlemle, herhangi bir malzemeden, ayakkabı, terlik vb. imalatı, (istisnalar için aşağıya bakınız.) - ayakkabıların deri kısımlarının imalatı: üst ve üst parçaları, dış ve iç tabanlar, topuklar vb. imalatı, - tozluk ve benzeri ürünlerin imalatı. Kapsam dışı olanlar; - tekstil malzemelerinden ayakkabı, terlik vb. imalatı, bkz. 14.19, - tahta ayakkabı parçaları imalatı (örn topuk, ökçe), bkz.16.29, - lastik bot ve ayakkabı topukları ve pençeleri ve lastik ayakkabıların diğer parçalarının imalatı, bkz. 22.19, - plastik ayakkabı parçaları imalatı, bkz. 22.29, - kayak ayakkabısı imalatı, bkz. 32.30, - ortopedik ayakkabı imalatı, bkz. 32.50, - örgü ve tığ işi tozluk imalatı, 14.31. @tr
preferred label: Производство на обувки @bg
preferred label: Výroba obuvi @cs
preferred label: Fremstilling af fodtøj @da
preferred label: Herstellung von Schuhen @de
preferred label: Κατασκευή υποδημάτων @el
preferred label: Fabricación de calzado @es
preferred label: Jalatsitootmine @et
preferred label: Jalkineiden valmistus @fi
preferred label: Fabrication de chaussures @fr
preferred label: Lábbeligyártás
preferred label: Fabbricazione di calzature @it
preferred label: Avalynės gamyba @lt
preferred label: Apavu ražošana @lv
preferred label: Manifattura ta' xedd tas-saqajn @mt
preferred label: Vervaardiging van schoeisel @nl
preferred label: Produksjon av skotøy @no
preferred label: Produkcja obuwia @pl
preferred label: Indústria de calçado @pt
preferred label: Fabricarea încălţămintei @ro
preferred label: Производство обуви @ru
preferred label: Proizvodnja obutve @sl
preferred label: Tillverkning av skodon @sv
preferred label: Ayakkabı, terlik vb. imalatı @tr
broader: Manufacture of footwear

Manufacture of wood and of products of wood and cork, except furniture; manufacture of articles of straw and plaiting materials
type: Concept
notation: 16
status: valid
status modified: 2013-10-18
accepted date: 2013-10-18
in scheme: Statistical Classification of Economic Activities in the European Community, Rev. 2 (2008)
scope note: производство на изделия от дървен материал - дограма, фурнир и плочи от дървесни частици, опаковки, дървен паркет, сглобяеми конструкции и детайли за тях. Производственият процес обхваща отрязване, разбичване, рендосване и сглобяване на изделия от дървен материал. Той започва с разбичването на трупите на греди или дъски, които по-късно могат да бъдат нарязани или профилирани на струг или други обработващи машини. Тези изделия, от своя страна, също могат да бъдат рендосани или полирани и сглобени в крайни продукти - например в дървени опаковки. С изключение на дъскорезниците всички останали единици се подразделят според вида на произвежданите продукти. - производство на мебели - 31.0 - монтаж на дървена дограма, интериорни и други завършващи елементи - 43.32, 43.33, 43.39 @bg
scope note: Tento oddíl zahrnuje výrobu dřevěných výrobků jako jsou stavební dřevo, překližky, dýhy, dřevěné kontejnery a nádoby, řezivo (připravené k prodeji), podlahové krytiny, příhradové nosníky, prefabrikované dřevěné části budov nebo celky. Výrobní postupy zahrnují řezání pilkou, hoblování, obrábění, laminování a sestavování dřevěných výrobků. Na začátku takového výrobního postupu je kulatina rozřezaná na polena nebo stavební dřevo, které může být dále řezáno nebo obráběno soustruhy či jinými tvarovacími stroji. Stavební dřevo nebo jiné opracované tvary dřeva mohou být následně ještě hoblovány nebo hlazeny a kompletovány do konečných výrobků jako obaly a dřevěné kontejnery. S výjimkou zpracování na pile je tento oddíl dále členěn v zásadě hlavně podle specifických výrobků. Nezahrnuje výrobu nábytku (31.0), nebo montáž dřevěných spojovacích prvků apod. (43.32, 43.33, 43.39). @cs
scope note: Diese Abteilung umfasst die Herstellung von Holzwaren wie Bauholz, Sperrholz, Furniere, Verpackungsmittel, Lagerbehälter und Ladungsträger, Bodenbeläge, Fachwerk, vorgefertigte Gebäude. Das Produktionsverfahren umfasst Sägen, Hobeln, Drechseln, Laminieren und Zusammenbau von Holzerzeugnissen, ausgehend von in Blöcke geschnittenen Stämmen oder Bauholz, das geschnitten oder von Dreh- und Schälmaschinen oder anderem Werkzeug bearbeitet wird. Das Bauholz oder andere bearbeitete Holzteile können dann noch gehobelt oder anders zugerichtet und zu Fertigerzeugnissen wie Verpackungsmittel, Lagerbehälter und Ladungsträger zusammengebaut werden. Abgesehen von den Sägewerken richtet sich die Untergliederung dieser Abteilung im Wesentlichen nach den jeweils hergestellten Erzeugnissen. Diese Abteilung umfasst nicht die Herstellung von Möbeln (31.0) oder den Einbau von Konstruktions- und Ausbauelementen aus Holz (43.32, 43.33, 43.39) @de
scope note: This division includes the manufacture of wood products, such as lumber, plywood, veneers, wood containers, wood flooring, wood trusses, and prefabricated wood buildings. The production processes include sawing, planing, shaping, laminating, and assembling of wood products starting from logs that are cut into bolts, or lumber that may then be cut further, or shaped by lathes or other shaping tools. The lumber or other transformed wood shapes may also be subsequently planed or smoothed, and assembled into finished products, such as wood containers. With the exception of sawmilling, this division is subdivided mainly based on the specific products manufactured. This division does not include the manufacture of furniture (31.0), or the installation of wooden fittings and the like (43.32, 43.33, 43.39). @en
scope note: Esta división comprende la fabricación de productos de madera, como madera de construcción, contrachapados, chapas, envases y embalajes de madera, entarimados, vigas trianguladas de madera y edificios de madera prefabricados. Entre los procedimientos de producción se incluyen el aserrado, el cepillado, la conformación, la laminación y el ensamblaje de productos de madera, empezando por los troncos que se cortan en trozas, o madera de construcción que puede seguir cortándose ulteriormente, o conformada con el torno u otras herramientas. La madera de construcción y otras formas de madera transformada pueden también cepillarse o pulirse posteriormente y ensamblarse en productos acabados, como envases y embalajes de madera. Con la excepción del aserrado, esta división se subdivide con arreglo principalmente a los productos específicos fabricados. Esta división no comprende la fabricación de muebles (31.0), ni la instalación de trabajos de carpintería y similares (43.32, 43.33, 43.39). @es
scope note: Cette division comprend la fabrication de produits en bois tels que bois de charpente, panneaux de bois, placages, emballages en bois, parquets en bois, armatures en bois et bâtiments en bois préfabriqués. Les opérations de production comprennent le sciage, le rabotage, le façonnage, le laminage et l’assemblage de produits en bois à partir de rondins qui sont débités en planches ou de bois de charpente qui peut être ensuite coupé ou façonné au moyen de tours ou autres outils de façonnage. Le bois de charpente ou les autres formes de bois transformé peuvent également être ultérieurement rabotés ou polis et assemblés en produits finis tels que des emballages en bois. À l’exception des scieries, les unités sont regroupées en filières, basées essentiellement sur les produits spécifiques qui sont fabriqués. Cette division ne comprend ni la fabrication de meubles (31.0), ni la pose des menuiseries (43.32, 43.33 et 43.39). @fr
scope note: Ovaj odjeljak uključuje proizvodnju proizvoda od drva kao što su građevno drvo, šperploče, furnir, drveni sanduci, drveni podovi, drvene konstrukcije i montažne kuće od drva. Proizvodni proces uključuje piljenje, blanjanje, oblikovanje, laminiranje i sastavljanje proizvoda od drva počevši od sječenog drva koje je rezano na komade ili građevnog drva koje se može dalje rezati ili oblikovati blanjalicom ili ostalim alatima za oblikovanje. Građevno drvo i ostali transformirani oblici drva mogu dalje biti piljeni ili glačani i sastavljani u konačne proizvode kao što su drveni sanduci. S iznimkom piljenja, podjela ovog odjeljka se prvenstveno temelji na proizvodnji specifičnih proizvoda. Ovaj odjeljak ne uključuje proizvodnju namještaja (31.0) ili instalaciju od drvenog pribora te slično (43.32, 43.33, 43.39).
scope note: Į šį skyrių įeina medienos gaminių, tokių kaip padarinė mediena, sluoksniuotoji mediena, lukštai, medinė tara, medinės grindų dangos, medinės santvaros ir surenkamieji mediniai statiniai, gamyba. Į gamybos procesą įeina pjaustymas, obliavimas, drožimas, sluoksniavimas ir medienos gaminių surinkimas, pradedant rąstais, kurie yra pjaustomi į gabalus ar išpjaunama padarinė mediena, kuri gali būti toliau pjaustoma arba tekinimo staklėmis ir kitokiais formavimo įrankiais suteikiama tam tikra forma. Pjautinė ar kitokios formos mediena vėliau taip pat gali būti obliuojama ar šlifuojama ir iš jos gaminami baigti gaminiai, tokie kaip medinė tara. Išskyrus lentpjūves, šis skyrius yra suskirstytas daugiausiai pagal gaminamos produkcijos savybes. Į šį skyrių neįeina nei baldų gamyba (31.0), nei medžio surenkamų detalių ir pan. dirbinių įrengimas (43.32, 43.33, 43.39) @lt
scope note: Данная группа включает производство продукции из древесины, пробки, соломки или материалов для плетения, включая основные формы, а также сборные продукты. @ru
scope note: Bu bölüm, kereste, kontrplak, kaplama, ahşap konteyner, ahşap yer kaplamaları, ahşap kiriş ve prefabrik ahşap yapıların imalatını kapsamaktadır. Üretim süreci; çubuklar halinde kesilen kütüklerden ya da tornalar ya da diğer biçim verme araçları kullanılarak şekillendirilen keresteden başlayan ahşap ürünlerin, testereleme, planyalama, biçim verme, lamine etme ve birleştirilmesini içerir. Kereste ya da biçimi değiştirilen diğer ahşap ürünler, daha sonra ayrıca planyalanabilir ya da düzleştirilebilir ve ahşap sandıklar gibi nihai ürünler içinde birleştirilebilir. Kereste ve diğer biçim değiştirilmiş tahtalar sonradan rendelenebilir veya düzleştirilebilir ve nihai ürünlerle birleştirilebilir, örneğin tahta muhafazalar. Bıçkı atölyelerinin faaliyetleri haricinde, bu bölüm, imal ettikleri özel ürünler temeline göre alt bölümlere ayrılmıştır. Bu bölüm, mobilya imalatını (31.0), ve ahşap tertibatların ve benzerlerinin kurulmasını (43.32, 43.33, 43.39) kapsamamaktadır.. @tr
preferred label: Производство на дървен материал и изделия от дървен материал и корк, без мебели; производство на изделия от слама и материали за плетене @bg
preferred label: Zpracování dřeva, výroba dřevěných a korkových výrobků, kromě nábytku; výroba proutěných a slaměných výrobků @cs
preferred label: Fremstilling af træ og varer af træ og kork, undtagen møbler; fremstilling af varer af strå og flettematerialer @da
preferred label: Herstellung von Holz-, Flecht-, Korb- und Korkwaren (ohne Möbel) @de
preferred label: Βιομηχανία ξύλου και κατασκευή προϊόντων από ξύλο και φελλό, εκτός από έπιπλα· κατασκευή ειδών καλαθοποιίας και σπαρτοπλεκτικής @el
preferred label: Industria de la madera y del corcho, excepto muebles; cestería y espartería @es
preferred label: Puidutöötlemine ning puit- ja korktoodete tootmine, v.a mööbel; õlest ja punumismaterjalist toodete tootmine @et
preferred label: Sahatavaran sekä puu- ja korkkituotteiden valmistus (pl. huonekalut; olki- ja punontatuotteiden valmistus) @fi
preferred label: Travail du bois et fabrication d'articles en bois et en liège, à l’exception des meubles; fabrication d’articles en vannerie et sparterie @fr
preferred label: Fafeldolgozás (kivéve: bútor), fonottáru gyártása
preferred label: Industria del legno e dei prodotti in legno e sughero, esclusi i mobili; fabbricazione di articoli in paglia e materiali da intreccio @it
preferred label: Medienos bei medienos ir kamštienos gaminių, išskyrus baldus, gamyba; gaminių iš šiaudų ir pynimo medžiagų gamyba @lt
preferred label: Koksnes, koka un korķa izstrādājumu ražošana, izņemot mēbeles; salmu un pīto izstrādājumu ražošana @lv
preferred label: Manifattura ta' injam u ta' prodotti ta' l-injam u tas-sufra, għajr għamara; manifattura ta' oġġetti tat-tiben u materjal għall-immaljar @mt
preferred label: Houtindustrie en vervaardiging van artikelen van hout en van kurk, exclusief meubelen; vervaardiging van artikelen van riet en van vlechtwerk @nl
preferred label: Produksjon av trelast og varer av tre, kork, strå og flettematerialer, unntatt møbler @no
preferred label: Produkcja wyrobów z drewna i korka, z wyłączeniem mebli; produkcja wyrobów ze słomy i materiałów używanych do wyplatania @pl
preferred label: Indústrias da madeira e da cortiça e suas obras, excepto mobiliário; fabricação de artigos de espartaria e cestaria @pt
preferred label: Prelucrarea lemnului, fabricarea produselor din lemn şi plută, cu excepţia mobilei; fabricarea articolelor din paie şi din alte materiale vegetale împletite @ro
preferred label: Производство деревянных и пробковых изделий, кроме мебели; производство изделий из соломки и материалов для плетения @ru
preferred label: Výroba dreva a výrobkov z dreva a korku okrem nábytku; výroba predmetov zo slamy a prúteného materiálu @sk
preferred label: Obdelava in predelava lesa; proizvodnja izdelkov iz lesa, plute, slame in protja, razen pohištva @sl
preferred label: Tillverkning av trä och varor av trä, kork, rotting o.d. utom möbler @sv
preferred label: Ağaç, ağaç ürünleri ve mantar ürünleri imalatı (mobilya hariç); saz, saman ve benzeri malzemelerden örülerek eşyaların imalatı @tr
broader: MANUFACTURING
narrower: Sawmilling and planing of wood
narrower: Manufacture of products of wood, cork, straw and plaiting materials

Sawmilling and planing of wood
type: Concept
notation: 16.1
status: valid
status modified: 2013-10-18
accepted date: 2013-10-18
in scheme: Statistical Classification of Economic Activities in the European Community, Rev. 2 (2008)
scope note: Этот класс включает: - производство лущеного шпона, достаточно тонкого для использования в производстве фанеры, досок или в других целях: • полированных, окрашенных, покрытых, пропитанных, укрепленных (при помощи бумаги или ткани) • изготовленных в виде орнамента - производство клееной фанеры, однослойной фанеры и подобных ламинированных деревянных листовых изделий - производство сборных досок и прочих листовых материалов - производство волокнистых листовых материалов средней плотности и прочих волокнистых материалов - производство уплотненной древесины - производство клееных ламинированных деревянных изделий, ламинированной однослойной фанеры @ru
preferred label: Разкрояване, рендосване и импрегниране на дървен материал @bg
preferred label: Výroba pilařská a impregnace dřeva @cs
preferred label: Udsavning og høvling af træ @da
preferred label: Säge-, Hobel- und Holzimprägnierwerke @de
preferred label: Πριόνισμα, πλάνισμα και εμποτισμός ξύλου @el
preferred label: Aserrado y cepillado de la madera @es
preferred label: Puidu saagimine ja hööveldamine @et
preferred label: Puun sahaus, höyläys ja kyllästys @fi
preferred label: Sciage et rabotage du bois @fr
preferred label: Fűrészárugyártás
preferred label: Taglio e piallatura del legno @it
preferred label: Medienos pjaustymas ir obliavimas @lt
preferred label: Zāģēšana, ēvelēšana un impregnēšana @lv
preferred label: Serrar u nċanar ta' njam @mt
preferred label: Zagen en schaven van hout @nl
preferred label: Saging, høvling og impregnering av tre @no
preferred label: Produkcja wyrobów tartacznych @pl
preferred label: Serração e aplainamento da madeira @pt
preferred label: Tăierea şi rindeluirea lemnului @ro
preferred label: Лесопильное и строгальное производство @ru
preferred label: Pilovanie a hobľovanie dreva @sk
preferred label: Žaganje, skobljanje in impregniranje lesa @sl
preferred label: Sågning och hyvling av trä @sv
preferred label: Ağaçların biçilmesi ve planyalanması @tr
broader: Manufacture of wood and of products of wood and cork, except furniture; manufacture of articles of straw and plaiting materials
narrower: Sawmilling and planing of wood

Sawmilling and planing of wood
type: Concept
notation: 16.10
status: valid
status modified: 2013-10-18
accepted date: 2013-10-18
in scheme: Statistical Classification of Economic Activities in the European Community, Rev. 2 (2008)
scope note: - нарязване, рендосване и машинно обработване на дървен материал - нарязване, обелване или цепене на объл дървен материал - производство на дървени траверси за релсов път - производство на несглобени дървени паркетни дъски - производство на дървесен талаш, дървесно брашно, технологични трески - сушене на дървесина - импрегниране и химична обработка на дървесина с консерванти или други химикали - производство на цепени и заострени колове и колчета - дърводобив - 02.20 - производство на тънки фурнирни листа, предназначени за производство на дървесни плочи - 16.21 - производство на покривни шиндри и шейкове - 16.23 - производство на дърва за горене или пелети, от пресована дървесина - 16.29 @bg
scope note: Z: - řezání pilou, hoblování a jiné strojní obrábění dřeva - krájení na plát, dělení nebo rozřezání na třísky, hobliny - výrobu dřevěných železničních pražců - výrobu podlahové krytiny ze dřeva, nemontované, nekompletované - výrobu dřevité vlny, dřevité moučky, třísek, pilin ZT: - sušení dřeva - impregnaci anebo chemickou úpravu dřeva konzervačními nebo jinými hmotami N: - těžbu a produkci surového dřeva (02.20) - výrobu dýh dostatečně tenkých pro zpracování na překližky, desky a panely (16.21) - výrobu šindelů, obrub, obkladů a lišt (16.23) - výrobu palivového dřeva nebo lisovaného dřeva (16.29) @cs
scope note: Diese Klasse umfasst: - Sägen, Hobeln und sonstiges maschinelles Bearbeiten von Holz - Säumen, Schälen und Messern von Rundholz - Herstellung von Eisenbahnschwellen aus Holz - Herstellung von Einzelteilen für Bodenbeläge aus Holz - Herstellung von Holzwolle, -mehl, -schnitzeln und -plättchen Diese Klasse umfasst ferner: - Holztrocknung - Imprägnieren und chemisches Behandeln von Holz mit Konservierungs- und anderen Stoffen Diese Klasse umfasst nicht: - Holzfällerei und Gewinnung von Rohholz (s. 02.20) - Herstellung von für die Verarbeitung zu Sperrholz und Platten ausreichend dünnen Furnieren (s. 16.21) - Herstellung von Schindeln, Stäben und Leisten (s. 16.23) - Herstellung von Brennholz aus Pressholz (s. 16.29) @de
scope note: This class includes: - sawing, planing and machining of wood - slicing, peeling or chipping logs - manufacture of wooden railway sleepers - manufacture of unassembled wooden flooring - manufacture of wood wool, wood flour, chips, particles This class also includes: - drying of wood - impregnation or chemical treatment of wood with preservatives or other materials This class excludes: - logging and production of wood in the rough, see 02.20 - manufacture of veneer sheets thin enough for use in plywood, boards and panels, see 16.21 - manufacture of shingles and shakes, beadings and mouldings, see 16.23 - manufacture of fire logs or pressed wood, see 16.29 @en
scope note: Esta clase comprende: - el aserrado y el cepillado de la madera - el corte, el pelado y el desbarbado de troncos - la fabricación de traviesas de madera para vías férreas - la fabricación de maderas sin ensamblar para suelos - la fabricación de lana, harina y virutas de madera Esta clase comprende también: - el secado de la madera - la impregnación o tratamiento químico de la madera con agentes conservantes u otras materias Esta clase no comprende: - la explotación forestal y la producción de madera en bruto (véase 02.20) - la fabricación de chapas de la delgadez suficiente para su utilización en tableros contrachapados y en otros tableros y paneles (véase 16.21) - la fabricación de ripias para tejados, listones y molduras (véase 16.23) - la fabricación de madera para combustible o prensada (véase 16.29). @es
scope note: Cette classe comprend: - le sciage, le rabotage et le façonnage du bois - la fabrication de bois tranchés, déroulés ou dédossés - la fabrication de traverses en bois pour voies ferrées - la fabrication de lames pour parquets non assemblées - la fabrication de laine (paille) de bois, de farine de bois, de bois en plaquettes ou en particules Cette classe comprend également: - le séchage du bois - l’imprégnation ou le traitement chimique du bois au moyen d’agents de conservation ou d’autres produits Cette classe ne comprend pas: - l’exploitation forestière et la production de bois bruts, voir 02.20 - la fabrication de feuilles de placage suffisamment minces pour la production de contreplaqués, de bois plaqués et de panneaux, voir 16.21 - la fabrication de bardeaux, de baguettes et de moulures, voir 16.23 - la fabrication de bûches ou de bois pressés, voir 16.29 @fr
scope note: Ovaj razred uključuje: - piljenje, blanjanje i strojno obrađivanje drva - rezanje, ljuštenje i cijepanje trupaca - proizvodnju drvenih željezničkih pragova - proizvodnju nesastavljenoga drvenog materijala za podove - proizvodnju drvne vune i drvnog brašna, iverja, sječka Ovaj razred također uključuje: - sušenje drva - impregnaciju ili kemijsku obradu drva sa zaštitnim sredstvima ili drugim materijalima Ovaj razred isključuje: - sječu drva i proizvodnju grubo obrađenog drva, vidi 02.20 - proizvodnju furnira dovoljno tankog da se može koristiti za šperploče, ploče i panele, vidi 16.21 - proizvodnju šindre i cijepanog (tesanog) drva te tokarenih profila, vidi 16.23 - proizvodnju cjepanica ili prešanog drva, vidi 16.29
scope note: Į šią klasę įeina: - medienos pjaustymas, obliavimas ir mechaninis apdirbimas - rąstų pjaustymas, lukštenimas ir smulkinimas - medinių geležinkelio pabėgių gamyba - nesurinktų medinių grindų dangų gamyba - medienos vilnos, medienos miltų, drožlių, smulkinių gamyba Į šią klasę taip pat įeina: - medienos džiovinimas - medienos įmirkymas ar cheminis apdorojimas konservantais ar kitomis medžiagomis Į šią klasę neįeina: - medienos ruoša ir žaliavinės medienos gamyba, žr. 02.20 - pakankamai plonų lukštų lakštų, naudojamų sluoksniuotajai medienai, plokštėms ir skydams gaminti, gamyba, žr. 16.21 - malksnų, skalų, figūrinių lentjuosčių ir bagetų gamyba, žr. 16.23 - malkų ar presuotos medienos gamyba, žr. 16.29 @lt
scope note: Этот класс включает: - производство деревянного паркета и т.д. и филенки Этот класс исключает: - производство несобранного деревянного напольного покрытия, см. 16.10 @ru
scope note: Bu sınıf aşağıdakileri kapsamaktadır; - ağaçların biçilmesi, planyalanması ve şekillendirilmesi, - kütüklerin dilimlenmesi, soyulması, yontulması, - Ahşap demiryolu traversi imalatı, - birleştirilmemiş ahşap döşemelerin imalatı, - ağaç yünü, ağaç unu, ağaç talaşı, ağaç yonga ve kırıntıları imalatı. Ayrıca bu sınıf aşağıdakileri de kapsamaktadır; - ağacın kurutulması, - ağacın koruyucu kimyasal maddeler, veya diğer maddeler vasıtasıyla çektirilmesi veya kimyasal işlemlere tabi tutulması. Kapsam dışı olanlar; - tomruk üretimi, bkz. 02.20, - kontrplak, tahta ve pano yapımında kullanılmak üzere yeterince ince olan cilalanmış levhalar imalatı, bkz. 16.21, - ahşap kiremitler ve çatı padavraları, işlemeli tahtalar ve pervazlar imalatı, bkz. 16.23. - yakacak odun ve kütükler ile sıkıştırılmış odun imalatı, bkz. 16.29. @tr
preferred label: Разкрояване, рендосване и импрегниране на дървен материал @bg
preferred label: Výroba pilařská a impregnace dřeva @cs
preferred label: Udsavning og høvling af træ @da
preferred label: Säge-, Hobel- und Holzimprägnierwerke @de
preferred label: Πριόνισμα, πλάνισμα και εμποτισμός ξύλου @el
preferred label: Aserrado y cepillado de la madera @es
preferred label: Puidu saagimine ja hööveldamine @et
preferred label: Puun sahaus, höyläys ja kyllästys @fi
preferred label: Sciage et rabotage du bois @fr
preferred label: Fűrészárugyártás
preferred label: Taglio e piallatura del legno @it
preferred label: Medienos pjaustymas ir obliavimas @lt
preferred label: Zāģēšana, ēvelēšana un impregnēšana @lv
preferred label: Serrar u nċanar ta' njam @mt
preferred label: Zagen en schaven van hout @nl
preferred label: Saging, høvling og impregnering av tre @no
preferred label: Produkcja wyrobów tartacznych @pl
preferred label: Serração e aplainamento da madeira @pt
preferred label: Tăierea şi rindeluirea lemnului @ro
preferred label: Лесопильное и строгальное производство @ru
preferred label: Pilovanie a hobľovanie dreva @sk
preferred label: Žaganje, skobljanje in impregniranje lesa @sl
preferred label: Sågning och hyvling av trä @sv
preferred label: Ağaçların biçilmesi ve planyalanması @tr
broader: Sawmilling and planing of wood

Manufacture of products of wood, cork, straw and plaiting materials
type: Concept
notation: 16.2
status: valid
status modified: 2013-10-18
accepted date: 2013-10-18
in scheme: Statistical Classification of Economic Activities in the European Community, Rev. 2 (2008)
scope note: Тази група включва производство на изделия от дървен материал, корк, слама или материали за плетене, вкл. както отделни детайли, така и сглобени продукти. @bg
scope note: Tato skupina zahrnuje výrobu dřevěných, korkových, proutěných anebo slaměných výrobků, a to jak v základních formách tak ve formě sestavených, kompletovaných výrobků. @cs
scope note: Diese Gruppe umfasst die Herstellung von Holz-, Kork-, Flecht- und Korbwaren, und zwar sowohl von Grundformen als auch von zusammengebauten Erzeugnissen. @de
scope note: This group includes the manufacture of products of wood, cork, straw or plaiting materials, including basic shapes as well as assembled products. @en
scope note: Este grupo comprende la fabricación de productos de madera, corcho, cestería y espartería, incluidas tanto formas básicas, como productos montados @es
scope note: Ce groupe comprend la fabrication d’articles en bois, liège, vannerie et sparterie et comprend tant les éléments de base que les produits assemblés. @fr
scope note: Ova skupina uključuje proizvodnju proizvoda od drva, pluta, slame ili pletarskog materijala, uključujući osnovne oblike kao i sastavljene proizvode.
scope note: Į šią grupę įeina medienos, kamštienos, šiaudų ir pynimo medžiagų gaminių ir dirbinių, įskaitant paprasčiausias formas, taip pat surenkamus gaminius, gamyba. @lt
scope note: Этот класс включает: - производство деревянных изделий, предназначенных для первичного производства в строительной индустрии:: • балок и бруса, стропил, опор для крыш • клееных ламинированных и металлических соединений, изготовленных заводским способом • дверей, окон, ставней, опалубков с металлической гарнитурой, такой как петли, замки и т.д. и без нее • лестниц, перил, поручней • деревянных штапиков и форм, кровельной дранки - производство заводским способом деревянных конструкций или составляющих, например, для сауны/парной - производство передвижных домов - производство деревянных перегородок (кроме свободно стоящих) Этот класс исключает: - производство кухонных, книжных, плательных шкафов и т.д., см. 31.01, 31.02, 31.09 - производство деревянных перегородок, свободно стоящих, см. 31.01, 31.02, 31.09 @ru
scope note: Bu grup, birleştirilmiş olanlar da dahil, ağaç, mantar, kamış ve örgü malzeme ürünleri imalatını kapsamaktadır. @tr
preferred label: Производство на изделия от дървен материал, корк, слама и материали за плетене @bg
preferred label: Výroba dřevěných, korkových, proutěných a slaměných výrobků @cs
preferred label: Fremstilling af varer af kork, strå og flettematerialer @da
preferred label: Herstellung von sonstigen Holz-, Kork-, Flecht- und Korbwaren (ohne Möbel) @de
preferred label: Κατασκευή προϊόντων από ξύλο καιφελλό και ειδών καλαθοποιίας και σπαρτοπλεκτικής @el
preferred label: Fabricación de productos de madera, corcho, cestería y espartería @es
preferred label: Puidust, korgist, õlest ja punumismaterjalist toodete tootmine @et
preferred label: Puu-, korkki-, olki- ja punontatuotteiden valmistus @fi
preferred label: Fabrication d'articles en bois, liège, vannerie et sparterie @fr
preferred label: Fa-, parafatermék, fonottáru gyártása
preferred label: Fabbricazione di prodotti in legno, sughero, paglia e materiali da intreccio @it
preferred label: Gaminių ir dirbinių iš medienos, kamštienos, šiaudų ir pynimo medžiagų gamyba @lt
preferred label: Koka, korķa, salmu un pīto izstrādājumu ražošana @lv
preferred label: Manifattura ta' prodotti ta' l-injam, sufra, tiben u materjal għall-immaljar @mt
preferred label: Vervaardiging van artikelen van hout, kurk, riet of vlechtwerk @nl
preferred label: Produksjon av varer av tre, kork, strå og flettematerialer @no
preferred label: Produkcja wyrobów z drewna, korka, słomy i materiałów używanych do wyplatania @pl
preferred label: Fabricação de artigos de madeira, de cortiça, de espartaria e cestaria @pt
preferred label: Fabricarea produselor din lemn, plută, paie şi din alte materiale vegetale @ro
preferred label: Производство продукции из древесины, пробки, соломки и материалов для плетения @ru
preferred label: Výroba výrobkov z dreva, korku, slamy a hobľovanie materiálu @sk
preferred label: Proizvodnja lesenih, plutovinastih, pletarskih izdelkov @sl
preferred label: Tillverkning av varor av trä, kork, halm, rotting o.d. @sv
preferred label: Ağaç, mantar, kamış ve örgü malzeme ürünü imalatı @tr
broader: Manufacture of wood and of products of wood and cork, except furniture; manufacture of articles of straw and plaiting materials
narrower: Manufacture of veneer sheets and wood-based panels
narrower: Manufacture of assembled parquet floors
narrower: Manufacture of other builders' carpentry and joinery
narrower: Manufacture of wooden containers
narrower: Manufacture of other products of wood; manufacture of articles of cork, straw and plaiting materials

Manufacture of veneer sheets and wood-based panels
type: Concept
notation: 16.21
status: valid
status modified: 2013-10-18
accepted date: 2013-10-18
in scheme: Statistical Classification of Economic Activities in the European Community, Rev. 2 (2008)
scope note: - производство на фурнирни листа, предназначени за облицовка, производство на дървесни плочи или други цели: • шлифовани, с лаковобояджийско покритие, импрегнирани или подсилени с хартия или текстил на гърба на листа • във форми, изобразяващи декоративни мотиви - производство на шперплат, фурнировани плочи и подобна слоеста дървесина - производство на плочи от ориентирани частици (OSB) и други плочи от дървесни частици - производство на плочи от дървесни влакна, произведени по сух метод (MDF) и други плочи от дървесни влакна - производство на „уплътнен“ дървен материал - производство на слепена слоеста дървесина и слоеста дървесина от фурнир @bg
scope note: Z: - výrobu dýh, které jsou dostatečně tenké a vyhovují pro dýhování, zpracování na překližky nebo k jiným účelům: • hlazené, barvené, potahované, impregnované, vyztužené (na zadní straně papírem nebo tkaninou) • zpracování formou motivů - výrobu překližek, dýhovaných desek (panelů) a podobných vrstvených (laminátových) dřevěných desek a listů - výrobu OSB desek (její štěpky jsou složené do 3 vrstev k sobě kolmo orientované)a jiných dřevotřískových desek - výrobu středně silných dřevovláknitých izolačních desek (MDF) a jiných dřevovláknitých desek - výrobu zhuštěného dřeva - výrobu klíženého vrstveného dřeva, vrstvených dřevěných dýh @cs
scope note: Diese Klasse umfasst: - Herstellung von Furnieren, die ausreichend dünn sind, um sich zum Furnieren, zur Verarbeitung zu Sperrholz oder ob zu anderen Zwecken zu eignen • Glätten, Färben, Beschichten, Imprägnieren, Verstärken (Rückenverstärkung mit Papier oder Gewebe) • Anfertigung in Form von Motiven - Herstellung von Sperrholz, Furnierplatten und ähnlichen laminierten Holzplatten und -blättern - Herstellung von OSB-Spanplatten und anderen Spanplatten - Herstellung von mitteldichten Faserplatten (MDF) und anderen Faserplatten - Herstellung von verdichtetem Holz - Herstellung von schichtverleimtem Holz, Pressschichtholz @de
scope note: This class includes: - manufacture of veneer sheets thin enough to be used for veneering, making plywood or other purposes: • smoothed, dyed, coated, impregnated, reinforced (with paper or fabric backing) • made in the form of motifs - manufacture of plywood, veneer panels and similar laminated wood boards and sheets - manufacture of oriented strand board (OSB) and other particle board - manufacture of medium density fibreboard (MDF) and other fibreboard - manufacture of densified wood - manufacture of glue laminated wood, laminated veneer wood @en
scope note: Esta clase comprende: - la fabricación de chapas de la delgadez suficiente para su utilización en enchapados, la elaboración de contrachapados y otros fines: • pulido, teñido, bañado, impregnado, reforzado (con forro de papel o tejido) • elaboración en forma de motivos - la fabricación de tableros contrachapados, chapas y tableros de madera laminada similares - la fabricación de tableros con filamentos orientados (OSB) y otros tableros de partículas; - la fabricación de tableros de fibras de densidad media (MDF) y otros trableros de fibras - la fabricación de madera densificada - la fabricación de madera laminada encolada y madera de chapado laminada @es
scope note: Cette classe comprend: - la fabrication de feuilles de placage suffisamment minces pour la production de contreplaqués ou d’autres utilisations • polies, teintes, enduites, imprégnées, renforcées (avec dos en papier ou en tissu) • fabriquées sous la forme de motifs - la fabrication de contreplaqués, de bois plaqués et de panneaux - la fabrication de panneaux à particules orientées et d’autres panneaux de particules - la fabrication de panneaux de fibres de densité moyenne (MDF) et autres panneaux de fibres - la fabrication de bois densifié - la fabrication de lamellé collé @fr
scope note: Ovaj razred uključuje: - proizvodnju furnira dovoljno tankog da se može koristiti za šperploče, ploče i panele i za druge namjene: • izglačanih, suženih, prevučenih, impregniranih, ojačanih (s poleđinom od papira ili tekstila) • izrađenih u obliku uzorka (motiva) - proizvodnju šperploča, furnirskih panel-ploča i sličnih laminiranih drvenih ploča i listova - proizvodnju i tzv. orijentiranih ivernih ploča te ostalih ploča iverica i ploča vlaknatica - proizvodnju srednje gustih ploča vlaknatica (MDF) i ostalih ploča vlaknatica - proizvodnju zgusnutog (zbijenog) drva - proizvodnju lijepljenog laminiranog drva, laminiranog furnira
scope note: Į šią klasę įeina: - pakankamai plonų lukštų lakštų, naudojamų paviršiams faneruoti, sluoksniuotajai medienai gaminti ar kitiems tikslams, gamyba: • šlifuotų, nudažytų, padengtų, įmirkytų, popieriaus ar audinio pagrindu sustiprintų • išmargintų raštais - sluoksniuotosios medienos, faneruotų skydų ir panašių laminuotų medienos plokščių ir lakštų gamyba - orientuotų medienos drožlių plokščių (OSB) ir kitų smulkinių plokščių gamyba - vidutinio tankio medienos plaušų plokščių (MDF) ir kitų plaušų plokščių gamyba - presuotosios medienos gamyba - klijuotos daugiasluoksnės medienos, daugiasluoksnės lukštinės medienos gamyba @lt
scope note: Этот класс включает: - производство упаковочных ящиков, коробок, тары, ящиков для упаковки товаров и подобных упаковочных деревянных приспособлений - производство деревянных паллет, ящичных поддонов и прочих грузовых приспособлений - производство бочек, баков, чанов и прочих приспособлений - производство деревянных барабанов для намотки кабеля Этот класс исключает: - производство багажных сумок, см. 15.12 - производство коробок из плетенки, см. 16.29 @ru
scope note: Bu sınıf aşağıdakileri kapsamaktadır; - kaplamada kullanılmak, kontrplak yapmak ya da diğer amaçlarla kullanmak için yeterince ince olan kaplama levhaların imalatı; • pürüzsüz, boyalı, kaplanmış, emdirilmiş, takviye edilmiş (kağıt ya da bez ile takviye), • motifli ahşap plaka ve levhalar. - kontrplak, kaplanmış pano ve benzeri tabakaları preslenmiş tahta levha imalatı, - kontrplak yerine çatı kaplamasında kullanılan yönlendirilmiş yonga levhaların (OSB) ve diğer özel levhaların imalatı, - kapı panelleri yapmak için üretilen bir tip tahta olan MDF`nin ve sıkıştırılmış liflerden yapılan diğer levhaların imalatı, - sıkıştırılarak yoğunluğu artırılmış ahşap plaka ve levhaların imalatı, - lamine edilmiş plaka ve levhaların imalatı. @tr
preferred label: Производство на фурнир и дървесни плочи @bg
preferred label: Výroba dýh a desek na bázi dřeva @cs
preferred label: Fremstilling af finerplader og træbaserede plader @da
preferred label: Herstellung von Furnier-, Sperrholz-, Holzfaser- und Holzspanplatten @de
preferred label: Κατασκευή αντικολλητών (κόντρα-πλακέ) και άλλων πλακών με βάση το ξύλο @el
preferred label: Fabricación de chapas y tableros de madera @es
preferred label: Spooni ja puitplaatide tootmine @et
preferred label: Vaneriviilun ja puupaneelien valmistus @fi
preferred label: Fabrication de placage et de panneaux de bois @fr
preferred label: Falemezgyártás
preferred label: Fabbricazione di fogli da impiallacciatura e di pannelli a base di legno @it
preferred label: Faneravimo dangos ir medienos plokščių gamyba @lt
preferred label: Finiera lokšņu un koka paneļu ražošana @lv
preferred label: Manifattura ta'folji tal-veneer u pannelli ta' l-injam @mt
preferred label: Vervaardiging van fineer en van panelen op basis van hout @nl
preferred label: Produksjon av finerplater og andre bygnings- og møbelplater av tre @no
preferred label: Produkcja arkuszy fornirowych i płyt wykonanych na bazie drewna @pl
preferred label: Fabricação de folheados e painéis à base de madeira @pt
preferred label: Fabricarea de furnire şi a panourilor din lemn @ro
preferred label: Производство шпона, фанеры, плит и панелей @ru
preferred label: Výroba dosiek a drevených panelov @sk
preferred label: Proizvodnja furnirja in plošč na osnovi lesa @sl
preferred label: Tillverkning av fanér och träbaserade skivor @sv
preferred label: Ahşap plaka ve levha imalatı @tr
broader: Manufacture of products of wood, cork, straw and plaiting materials

Manufacture of assembled parquet floors
type: Concept
notation: 16.22
status: valid
status modified: 2013-10-18
accepted date: 2013-10-18
in scheme: Statistical Classification of Economic Activities in the European Community, Rev. 2 (2008)
scope note: - производство на детайли (елементи) за подови настилки от дървесина, сглобени в паркетни плочи - производство на несглобени дървени паркетни дъски - 16.10 @bg
scope note: Z: - výrobu dřevěných parketových podlahových bloků, pásů atd., sestavených do panelů N: - výrobu podlahových krytin ze dřeva, nesestavených (16.10) @cs
scope note: Diese Klasse umfasst: - Herstellung von zu Dielen oder Tafeln zusammengesetzten Parkettbodenstäben, -stäbchen und -lamellen Diese Klasse umfasst nicht: - Herstellung von Einzelteilen für Bodenbeläge aus Holz (s.16.10) @de
scope note: This class includes: - manufacture of wooden parquet floor blocks, strips etc., assembled into panels This class excludes: - manufacture of unassembled wooden floors, see 16.10 @en
scope note: Esta clase comprende: - la fabricación de placas de parquet, tiras, etc. de madera, ensambladas en planchas Esta clase no comprende: - la fabricación de maderas sin ensamblar para suelos (véase 16.10) @es
scope note: Cette classe comprend: - la fabrication de blocs, lames, etc., pour parquets, assemblés en panneaux Cette classe ne comprend pas: - la fabrication de lames pour parquets non assemblées, voir 16.10 @fr
scope note: Ovaj razred uključuje: - proizvodnju parketnih blokova, traka itd., sastavljenih u panele Ovaj razred isključuje: - proizvodnju nespojenih drvenih podnih ploča, vidi 16.10
scope note: Į šią klasę įeina: - surinktų medinių parketinių grindų blokelių, grindlenčių ir kt. plokščių gamyba Į šią klasę neįeina: - nesurinktų medinių grindų gamyba, žr. 16.10 @lt
scope note: Этот класс включает: - производство различной деревянной продукции: • деревянных ручек и ящиков для инструментов, щеток, кистей • деревянных колодок, вешалок для одежды • домашних принадлежностей и кухонных предметов из дерева • производство деревянных статуэток, деревянных инкрустаций • деревянных ящиков для драгоценностей, столовых приборов и подобных изделий • деревянных катушек, шпулек, бобин для швейных ниток и подобных изделий • прочих деревянных изделий - переработку природного пробкового материала, производство агломерированной пробки - производство изделий из природной или агломерированной пробки, включая напольное покрытие - производство плетенки и изделий из материалов для плетения: половиков, циновок, ширм, коробок и т.д. - производство бельевых корзин и плетеных изделий - производство дров и брикетов, изготовленных из прессованной древесины или ее заменителей, таких как молотые зерна кофе или соевых бобов - производство деревянных рам для зеркал и картин - производство рам для холстов художников - производство деревянных частей для обуви (например, каблуков и колодок) - производство ручек для зонтов, тростей и т.п. - производство блоков для производства курительных трубок Этот класс исключает: - производство матов и циновок из текстильных материалов, см. 13.92 - производство багажных сумок, см. 15.12 - производство деревянной обуви, см. 15.20 - производство спичек, см. 20.51 - производство корпусов для часов, см. 26.52 - производство деревянных катушек и бобин для текстильных станков, см. 28.94 - производство мебели, см. 31.0 - производство деревянных игрушек, см. 32.40 - производство метел и щеток, см. 32.91 - производство гробов, см. 32.99 - производство пробковых спасательных жилетов, см. 32.99 @ru
scope note: Bu sınıf aşağıdakileri kapsamaktadır; • paneller halinde birleştirilmiş ahşap parke yer blokları, strip parkeler vb. Kapsam dışı olanlar; - Birleştirilmemiş ahşap yer kaplamaları imalatı, bkz. 16.10. @tr
preferred label: Производство на сглобени паркетни плочи @bg
preferred label: Výroba sestavených parketových podlah @cs
preferred label: Fremstilling af sammensatte parketstave @da
preferred label: Herstellung von Parketttafeln @de
preferred label: Κατασκευή συναρμολογούμενων δαπέδων παρκέ @el
preferred label: Fabricación de suelos de madera ensamblados @es
preferred label: Kilpparketi tootmine @et
preferred label: Asennettavien parkettilevyjen valmistus @fi
preferred label: Fabrication de parquets assemblés @fr
preferred label: Parkettagyártás
preferred label: Fabbricazione di pavimenti a parquet assemblati @it
preferred label: Sumontuotų parketo grindų gamyba @lt
preferred label: Parketa paneļu ražošana @lv
preferred label: Manifattura ta' art tal-parké mmuntata @mt
preferred label: Vervaardiging van parketvloeren @nl
preferred label: Produksjon av sammensatte parkettstaver @no
preferred label: Produkcja gotowych parkietów podłogowych @pl
preferred label: Fabricação de pavimentos em painéis montados @pt
preferred label: Fabricarea parchetului asamblat în panouri @ro
preferred label: Производство сборных паркетных покрытий @ru
preferred label: Výroba podlahových parkiet @sk
preferred label: Proizvodnja sestavljenega parketa @sl
preferred label: Tillverkning av sammansatta parkettstavar @sv
preferred label: Birleştirilmiş parke yer döşemelerinin imalatı @tr
broader: Manufacture of products of wood, cork, straw and plaiting materials

Manufacture of other builders' carpentry and joinery
type: Concept
notation: 16.23
status: valid
status modified: 2013-10-18
accepted date: 2013-10-18
in scheme: Statistical Classification of Economic Activities in the European Community, Rev. 2 (2008)
scope note: - производство на изделия от дървен материал, предназначени предимно за строителството: • греди, подпорни греди, ребра и подпори за покриви • покривни конструкции (ферми) от слепена слоеста дървесина, сглобени с метални свръзки • врати, прозорци и техните каси, вкл. съдържащи панти, брави и други метални приспособления • стълбища и парапети • покривни шиндри и шейкове - производство на сглобяеми постройки и детайли за тях от преобладаващ дървен материал - например сауни - производство на мобилни къщи от дървен материал - производство на преградни стени от дървен материал, без параваните - производство на кухненски шкафове, библиотеки, гардероби и други мебели - 31.01, 31.02, 31.09 - производство на дървени паравани - 31.01, 31.02, 31.09 - монтажни работи на сглобяеми къщи от дървен материал - 41.20 - монтаж на дървена дограма - 43.32 @bg
scope note: Z: - výrobu dřevěných výrobků určených především pro použití ve stavebnictví: • trámů, nosníků, krokví a vaznic • klížených, vrstvených a kovem spojených, prefabrikovaných dřevěných konstrukcí krovů • dveří, oken, okenic a jejich rámů, bez nebo s kováním, např. panty, závěsy, čepy, zámky • schodů, zábradlí (plotů, ohrad) • dřevěných lišt a vlisů, krytinových desek a šindelů - výrobu prefabrikovaných celků budov nebo částí, převážně ze dřeva, např. saun - výrobu mobilních domků - výrobu příček ze dřeva (kromě volně stojících) N: - výrobu kuchyňských, šatních skříní, knihoven atd. (31.01, 31.02, 31.09) - výrobu volně stojících příček ze dřeva (31.01, 31.02, 31.09) @cs
scope note: Diese Klasse umfasst: - Herstellung von vorwiegend für den Bau bestimmten Holzwaren: • Balken, Binder, Pfetten und Sparren • schichtverleimte und metallisch verbundene Dachstuhlkonstruktionen aus Holz • Türen, Fenster, Fensterläden, Rahmen und Verkleidungen dafür, auch mit Metallbeschlägen wie Scharnieren, Schlössern und dergleichen • Treppen und Geländer • Schindeln, Stäbe und Leisten - Herstellung von vorgefertigten Gebäuden oder Teilen davon, vorwiegend aus Holz, z. B. Saunen - Herstellung von Mobilheimen - Herstellung von Trennwänden aus Holz (außer frei stehenden) Diese Klasse umfasst nicht: - Herstellung von Küchen-, Bücher-, Kleiderschränken usw. (s. 31.01, 31.02, 31.09) - Herstellung von frei stehenden Trennwänden aus Holz (s. 31.01, 31.02, 31.09) @de
scope note: This class includes: - manufacture of wooden goods intended to be used primarily in the construction industry: • beams, rafters, roof struts • glue-laminated and metal connected, prefabricated wooden roof trusses • doors, windows, shutters and their frames, whether or not containing metal fittings, such as hinges, locks etc. • stairs, railings • wooden beadings and mouldings, shingles and shakes - manufacture of prefabricated buildings, or elements thereof, predominantly of wood, e.g. saunas - manufacture of mobile homes - manufacture of wood partitions (except free standing) This class excludes: - manufacture of kitchen cabinets, bookcases, wardrobes etc., see 31.01, 31.02, 31.09 - manufacture of wood partitions, free standing, see 31.01, 31.02, 31.09 @en
scope note: Esta clase comprende: - la fabricación de estructuras de madera y piezas de carpintería destinadas principalmente a la construcción: • vigas, viguetas, vigas maestras • vigas trianguladas de madera laminada encolada para tejados, prefabricadas y conectadas por elementos metálicos • puertas, ventanas, persianas y sus marcos, contengan o no accesorios metálicos como herrajes, cerraduras, etc. • escaleras y barandillas • listones y molduras, ripias para tejados - la construcción de edificios prefabricados o sus elementos, hechos en su mayor parte con madera, por ejemplo, saunas - la fabricación de viviendas móviles - la fabricación de tabiques de madera (excepto los paneles móviles independientes) Esta clase no comprende: - la fabricación de mobiliario de cocina, librerías, armarios, etc. (véanse 31.01, 31.02 y 31.09) - la fabricación de paneles de madera móviles independientes (véanse 31.01, 31.02 y 31.09) @es
scope note: Cette classe comprend: - la fabrication d’articles en bois destinés principalement à l’industrie du bâtiment: • poutres, poutrelles, chevrons, solives • lamellé collé et armatures en bois et bâtiments en bois préfabriqués • portes, fenêtres, rideaux et leurs encadrements, avec ou sans accessoires métalliques, tels que serrures et ferrures • escaliers, rampes d’escaliers • bardeaux, baguettes et moulures - la fabrication de bâtiments préfabriqués ou d’éléments de ces bâtiments, en bois, par exemple: saunas - la fabrication de caravanes - la fabrication de cloisons en bois (à l’exception des cloisons mobiles) Cette classe ne comprend pas: - la fabrication de placards de cuisine, bibliothèques, penderies, etc., voir 31.01, 31.02 et 31.09 - la fabrication de cloisons mobiles en bois, voir 31.01, 31.02 et 31.09 @fr
scope note: Ovaj razred uključuje: - proizvodnju drvenih dobara ponajprije namijenjenih uporabi u industriji građevinarstva: • traverza, greda, krovnih konstrukcija • lijepljenih laminiranih i povezanih metalom te montažnih nosača od drva • vrata, prozora, kapaka i njihovih okvira, sa ili bez sadržaja metalnih dijelova kao što su zglobovi, brave itd. • stuba, ograda • tokarski profila od drva, šindre i cijepanog (tesanog) drva - proizvodnju montažnih kuća i njihovih elemenata, pretežno od drva, npr. sauna - proizvodnju pokretnih kuća - proizvodnju drvenih pregrada (osim samostojećih) Ovaj razred isključuje: - izradu kuhinjskog namještaja, polica za knjige, ormara za odjeću itd., vidi 31.01, 31.02, 31.09 - izradu samostojećih drvenih pregrada, vidi 31.01, 31.02, 31.09
scope note: Į šią klasę įeina: - medienos dirbinių, pirmiausia naudojamų statyboje, gamyba: • tašų, gegnių, stogo atramų • klijuotų medinių ir metalu sujungtų konstrukcijų, surenkamų medinių gegrinių santvarų • durų, langų, langinių ir jų staktų, nesvarbu komplektuotų ar ne su metalo jungiamosiomis detalėmis, tokiomis, kaip vyriai, užraktai ir kt. • laiptų, turėklų • figūrinių lentjuosčių, bagetų, malksnų, skalų - daugiausia medinių surenkamųjų statinių ar jų dalių gamyba, pvz., saunų - pervežamų namelių gamyba - medinių pertvarų, išskyrus neįtvirtinamas, gamyba Į šią klasę neįeina: - virtuvės spintelių, knygų spintų, drabužių spintų ir kt., gamyba, žr. 31.01, 31.02, 31.09 - medinių neįtvirtinamų pertvarų gamyba, žr. 31.01, 31.02, 31.09 @lt
scope note: Данный раздел включает производство бумажной массы и бумаги или изделий из дополнительно обработанной бумаги. При производстве этих товаров применяется вертикальная интеграция видов деятельности, так как различные операции осуществляются одной и той же единицей последовательно. Выделяются три основных вида экономической деятельности. Производство бумажной массы состоит в отделении целлюлозных волокон от примесей, содержащихся в древесине, или растворении или очищении от чернил использованной бумаги и смешивании в небольшом количестве реагентов для усиления сплетения волокон. Производство бумаги сопряжено с выливанием бумажной массы на движущуюся проволочную сетку, в результате чего формируется сплошной лист. Изделия из макулатуры производятся из бумаги и других материалов при помощи различных технологий. Печатание изделий из бумаги (напр., обои, подарочная бумага и т.п.) также включено в данный раздел при условии, что полиграфическая деятельность является вспомогательной. Производство древесной массы и целлюлозы, бумаги и картона без упаковки помещено в группу 17.1, в то время как остальные классы включают описание дальнейшего процесса производства бумаги и бумажной продукции. @ru
scope note: Bu sınıf aşağıdakileri kapsamaktadır; - temel olarak inşaat sanayinde kullanılması amaçlanan ahşap malzeme imalatı: • kirişler, kalaslar, payandalar, • tutkalla lamine edilmiş ve metal bağlantılı, prefabrik ahşap çatı kirişleri, • menteşe, kilit vb. gibi metal donatımlar içerip içermediklerine bakılmaksızın kapılar, pencereler, kepenkler ve onların çerçeveleri, • merdivenler, tırabzanlar, • işlemeli tahtalar, pervazlar, ahşap kiremitler ve çatı padavraları. - prefabrik binalar, veya onun esas olarak tahtadan yapılmış unsurlarının imalatı, örn. saunalar, - taşınabilir ahşap ev imalatı, - ahşap bölmelerin imalatı (bağımsız olarak sabit duranlar hariç). Kapsam dışı olanlar; - mutfak dolapları, kitaplıklar, elbise dolapları imalatı, bkz. 31.01, 31.02, 31.09, - bağımsız olarak sabit duran ahşap bölmelerin imalatı, , bkz. 31.01, 31.02, 31.09. @tr
preferred label: Производство на дограма и други изделия от дървен материал за строителството @bg
preferred label: Výroba ostatních výrobků stavebního truhlářství a tesařství @cs
preferred label: Fremstilling af bygningstømmer og snedkeriartikler i øvrigt @da
preferred label: Herstellung von sonstigen Konstruktionsteilen, Fertigbauteilen, Ausbauelementen und Fertigteilbauten aus Holz @de
preferred label: Κατασκευή άλλων ξυλουργικών προϊόντων οικοδομικής @el
preferred label: Fabricación de otras estructuras de madera y piezas de carpintería y ebanistería para la construcción @es
preferred label: Ehituspuusepa- ja tisleritoodete tootmine @et
preferred label: Muiden rakennuspuusepäntuotteiden valmistus @fi
preferred label: Fabrication de charpentes et d'autres menuiseries @fr
preferred label: Épületasztalos-ipari termék gyártása
preferred label: Fabbricazione di altri prodotti di carpenteria in legno e falegnameria per l'edilizia @it
preferred label: Kitų statybinių dailidžių ir stalių dirbinių gamyba @lt
preferred label: Namdaru un galdniecības izstrādājumu ražošana @lv
preferred label: Manifattura ta' xogħol ta' injam ieħor tal-bennejja @mt
preferred label: Vervaardiging van ander schrijn- en timmerwerk @nl
preferred label: Produksjon av andre bygningsartikler @no
preferred label: Produkcja pozostałych wyrobów stolarskich i ciesielskich dla budownictwa @pl
preferred label: Fabricação de outras obras de carpintaria para a construção @pt
preferred label: Fabricarea altor elemente de dulgherie şi tâmplărie, pentru construcţii @ro
preferred label: Производство прочих деревянных строительных конструкций и столярных изделий @ru
preferred label: Výroba ostatná stavebnostolárska a tesárska @sk
preferred label: Stavbno mizarstvo in tesarstvo @sl
preferred label: Tillverkning av andra byggnads- och inredningssnickerier @sv
preferred label: Diğer bina doğramacılığı ve marangozluk ürünlerinin imalatı @tr
broader: Manufacture of products of wood, cork, straw and plaiting materials

Manufacture of wooden containers
type: Concept
notation: 16.24
status: valid
status modified: 2013-10-18
accepted date: 2013-10-18
in scheme: Statistical Classification of Economic Activities in the European Community, Rev. 2 (2008)
scope note: - производство на каси, касетки, кутии, щайги и други опаковки, от дървен материал - производство на обикновени палети, бокс палети и други плоскости за товарене, от дървен материал - производство на каци, качета, бъчви, бъчвички и други бъчварски изделия, от дървен материал - производство на барабани за кабели от дървен материал - производство на куфари - 15.12 - производство на опаковки от материали за плетене - 16.29 @bg
scope note: Z: - výrobu balicích beden, krabic, přepravek, bubnů a podobných dřevěných obalů - výrobu palet a jiných desek ze dřeva pro nakládání - výrobu sudů, cisteren, kádí, věder a jiných bednářských výrobků ze dřeva - výrobu dřevěných kabelových (lanových) bubnů N: - výrobu kufrů (15.12) - výrobu beden z proutí a podobných materiálů (16.29) @cs
scope note: Diese Klasse umfasst: - Herstellung von Schachteln, Kisten, Trommeln und ähnlichen Verpackungsmitteln aus Holz - Herstellung von Paletten und anderen Ladungsträgern aus Holz - Herstellung von Fässern, Bottichen, Trögen und anderen Böttcherwaren aus Holz - Herstellung von Kabeltrommeln aus Holz Diese Klasse umfasst nicht: - Herstellung von Koffern (s. 15.12) - Herstellung von Behältnissen aus Flechtstoffen (s. 16.29) @de
scope note: This class includes: - manufacture of packing cases, boxes, crates, drums and similar packings of wood - manufacture of pallets, box pallets and other load boards of wood - manufacture of barrels, vats, tubs and other coopers' products of wood - manufacture of wooden cable-drums This class excludes: - manufacture of luggage, see 15.12 - manufacture of cases of plaiting material, see 16.29 @en
scope note: Esta clase comprende: - la fabricación de cajas, cajitas, jaulas, cilindros, urnas y envases similares de madera - la fabricación de palets y otros paneles de madera para carga - la fabricación de barriles, cubas, tinas y otras manufacturas de tonelería, de madera - la fabricación de bobinas de madera para cables Esta clase no comprende: - la fabricación de artículos de viaje (véase 15.12) - la fabricación de artículos de cestería (véase 16.29) @es
scope note: Cette classe comprend: - la fabrication de caisses, caissettes, cageots, cylindres et emballages similaires, en bois - la fabrication de palettes simples, caisses-palettes et autres plateaux de chargement, en bois - la fabrication de tonneaux, cuves, baquets et autres ouvrages de tonnellerie, en bois - la fabrication de tambours pour câbles, en bois Cette classe ne comprend pas: - la fabrication d’articles de voyage, voir 15.12 - la fabrication de caisses en matières à tresser, voir 16.29 @fr
scope note: Ovaj razred uključuje: - proizvodnju sanduka, kutija, gajbi, bubnjeva i slične ambalaže od drva - proizvodnju paleta, paletnih kutija i drugih utovarnih ambalaža od drva - proizvodnju bačava, vjedara, kaca i drugih bačvarskih proizvoda od drva - proizvodnju kotura za kabele od drva Ovaj razred isključuje: - proizvodnju kovčega, vidi 15.12 - proizvodnju sanduka i kutija od pletarskih materijala, vidi 16.29
scope note: Į šią klasę įeina: - pakavimo dėžučių, skrynučių, narvinių dėžių, būgnų ir panašios medinės pakavimo taros gamyba - medinių padėklų, dėžinių padėklų ir kitų krovinių plokščių gamyba - medinių statinių, kubilų, puskubilių ir kitokių talpyklų iš medienos gamyba - medinių kabelio būgnų gamyba Į šią klasę neįeina: - lagaminų gamyba, žr. 15.12 - pintų dėžučių gamyba, žr. 16.29 @lt
scope note: Bu sınıf aşağıdakileri kapsamaktadır; - kutu, sandık, fıçı, varil ve benzeri ahşap ambalaj malzemelerinin imalatı, - paletler, kutu paletler ve ahşaptan imal edilen diğer yükleme tahtalarının imalatı, - variller, fıçılar, ahşap şarap ve ekmek tekneleri gibi ahşaptan yapılmış diğer fıçıcılık malzemelerinin imalatı, - ahşap kablo makaraları imalatı. Kapsam dışı olanlar; - bavul imalatı, bkz. 15.12, - örgü örmede kullanılan maddelerin imalatı, bkz. 16.29. @tr
preferred label: Производство на опаковки от дървен материал @bg
preferred label: Výroba dřevěných obalů @cs
preferred label: Fremstilling af træemballage @da
preferred label: Herstellung von Verpackungsmitteln, Lagerbehältern und Ladungsträgern aus Holz @de
preferred label: Κατασκευή ξύλινων εμπορευματοκιβωτίων @el
preferred label: Fabricación de envases y embalajes de madera @es
preferred label: Puittaara tootmine @et
preferred label: Puupakkausten valmistus @fi
preferred label: Fabrication d'emballages en bois @fr
preferred label: Tároló fatermék gyártása
preferred label: Fabbricazione di imballaggi in legno @it
preferred label: Medinės taros gamyba @lt
preferred label: Koka taras ražošana @lv
preferred label: Manifattura ta' kontenituri magħmula mill-injam @mt
preferred label: Vervaardiging van houten emballage @nl
preferred label: Produksjon av treemballasje @no
preferred label: Produkcja opakowań drewnianych @pl
preferred label: Fabricação de embalagens de madeira @pt
preferred label: Fabricarea ambalajelor din lemn @ro
preferred label: Производство деревянной тары @ru
preferred label: Výroba drevených kontajnerov @sk
preferred label: Proizvodnja lesene embalaže @sl
preferred label: Träförpackningstillverkning @sv
preferred label: Ahşap konteyner imalatı @tr
broader: Manufacture of products of wood, cork, straw and plaiting materials

Manufacture of other products of wood; manufacture of articles of cork, straw and plaiting materials
type: Concept
notation: 16.29
status: valid
status modified: 2013-10-18
accepted date: 2013-10-18
in scheme: Statistical Classification of Economic Activities in the European Community, Rev. 2 (2008)
scope note: - производство на разнообразни изделия от дървен материал: • инструменти, дръжки, ръкохватки и тела за инструменти, метли и четки • калъпи и опъвачи за обувки, закачалки за дрехи • съдове и прибори за сервиране или за кухня • статуетки и други изделия за украса, вкл. с гравюри или инкрустации • кутии за бижута и подобни изделия • цеви, шпули, масури, бобини, макари за конци и подобни изделия от стругован дървен материал • други изделия от дървен материал, некласифицирани другаде - обработка на естествен корк, производство на агломериран корк - производство на изделия от естествен и агломериран корк, вкл. подови настилки - производство на сплитки и изделия от материали за плетене: рогозки, изтривалки, паравани, плетени обвивки за стъклени опаковки и други подобни - производство на кошничарски изделия - производство на дърва за горене или пелети, получени от пресована дървесина или заместители (утайки от кафе или остатъци от мелене на соя) - производство на рамки за картини, фотографии, огледала или други подобни, от дървен материал - производство на рамки за опъване на платна на картини, от дървен материал - производство на части за обувки от дървен материал - например токове - производство на дръжки за чадъри, бастуни и подобни, от дървен материал - производство на заготовки за лули от дървен материал - производство на текстилни подови настилки - 13.93 - производство на куфари - 15.12 - производство на обувки от дървен материал - 15.20 - производство на кибрити - 20.51 - производство на кутии за часовници -26.52 - производство на цеви, шпули, масури, бобини като част от машините за текстил - 28.94 - производство на мебели - 31.0 - производство на дървени играчки - 32.40 - производство на метли и четки - 32.91 - производство на ковчези - 32.99 - производство на предпазни спасителни средства от корк - 32.99 @bg
scope note: Z: - výrobu různých dřevěných výrobků: • držáků a násad pro nářadí, na košťata, na kartáče • obuvnických a ševcovských kopyt, napínáků obuvi, ramínek na šaty • kuchyňského nádobí pro domácnost ze dřeva • dřevěných sošek a ozdob, intarzií, vykládaných dřevem • dřevěných pouzder a skříněk na šperky, příbory a podobné výrobky • dřevěných cívek, vřeten, špulek, navijáků nití a podobných výrobků z osoustruženého dřeva • jiných dřevěných výrobků - zpracování přírodního korku, výrobu aglomerovaného korku - výrobu výrobků z přírodního nebo aglomerovaného korku, včetně podlahových krytin - výrobu výrobků z proutí a podobných materiálů: podložek, rohoží, zástěn, kufrů (beden) atd. - výrobu košíkářského zboží a proutěného (rákosového) pletiva - výrobu palivového dřeva a pelet, z lisovaného dřeva nebo náhradních materiálů z kávového nebo sójového odpadu - výrobu obrazových nebo zrcadlových rámů - výrobu rámů pro malířská plátna - výrobu dřevěných dílů obuvi (např. podpatků a kopyt) - výrobu rukojetí k deštníkům, vycházkovým holím a podobně - výrobu polotovarů pro výrobu tabákových dýmek N: - výrobu podložek a rohoží z textilních materiálů (13.93) - výrobu kufrů (15.12) - výrobu dřevěné obuvi (15.20) - výrobu zápalek (20.51) - výrobu skříněk (pouzder) na hodiny (26.52) - výrobu dřevěných vřeten, cívek a kotoučků které jsou součástí textilních strojů (28.94) - výrobu nábytku (31.0) - výrobu dřevěných hraček (32.40) - výrobu kartáčů a košťat (32.91) - výrobu truhel, rakví (32.99) - výrobu korkových záchranných vest, pásů (32.99) @cs
scope note: Diese Klasse umfasst: - Herstellung von verschiedenen Holzwaren: • Griffe und Stiele für Werkzeuge, Besen, Bürsten • Formen, Leisten und Schuhspanner, Kleiderbügel • Haushaltsartikel und Küchengeräte aus Holz • Figuren und Schmuck, Intarsien und andere Einlegearbeiten • hölzerne Schachteln, Kassetten und Etuis für Schmuck, Schneidwaren u. Ä. • Spulen, Rollen und ähnliche Artikel aus gedrechseltem Holz • Holzwaren a. n. g. - Verarbeitung von Naturkork, Herstellung von Presskork - Herstellung von Waren aus Naturkork oder Presskork, einschließlich Bodenbeläge - Herstellung von Geflechten und Waren aus Flechtstoffen: Matten, Fußmatten, Gittergeflechte, Körbe usw. - Herstellung von Flechtwaren und Korbwaren - Herstellung von Brennholz und –pellets aus Pressholz oder Holzersatzstoffen wie Kaffeesatz oder Sojabohnen-Mahlrückständen (Okara) - Herstellung von Rahmen für Bilder oder Spiegel - Herstellung von Rahmen für Malleinwände - Herstellung von Schuhteilen aus Holz (z. B. Absätze und Leisten) - Herstellung von Griffen für Schirme, Rohrstöcke und dergleichen - Herstellung von Blöcken für die Herstellung von Tabakspfeifen Diese Klasse umfasst nicht: - Herstellung von Matten und Fußmatten aus Spinnstoffen (s. 13.92) - Herstellung von Koffern (s. 15.12) - Herstellung von Holzschuhen (s. 15.20) - Herstellung von Streichhölzern (s. 20.51) - Herstellung von Uhrengehäusen (s. 26.52) - Herstellung von hölzernen Rollen, Spulen und Spindeln als Teile von Textilmaschinen (s. 28.94) - Herstellung von Möbeln (s. 31.0) - Herstellung von Holzspielzeug (s. 32.40) - Herstellung von Bürsten und Besen (s. 32.91) - Herstellung von Särgen (s. 32.99) - Herstellung von Rettungsmitteln aus Kork (s. 32.99) @de
scope note: This class includes: - manufacture of various wood products: • wooden handles and bodies for tools, brooms, brushes • wooden boot or shoe lasts and trees, clothes hangers • household utensils and kitchenware of wood • wooden statuettes and ornaments, wood marquetry, inlaid wood • wooden cases for jewellery, cutlery and similar articles • wooden spools, cops, bobbins, sewing thread reels and similar articles of turned wood • other articles of wood - natural cork processing, manufacture of agglomerated cork - manufacture of articles of natural or agglomerated cork, including floor coverings - manufacture of plaits and products of plaiting materials: mats, matting, screens, cases etc. - manufacture of basket-ware and wickerwork - manufacture of fire logs and pellets for energy, made of pressed wood or substitute materials like coffee or soybean grounds - manufacture of wooden mirror and picture frames - manufacture of frames for artists' canvases - manufacture of wooden shoe parts (e.g. heels and lasts) - manufacture of handles for umbrellas, canes and similar - manufacture of blocks for the manufacture of smoking pipes This class excludes: - manufacture of mats or matting of textile materials, see 13.92 - manufacture of luggage, see 15.12 - manufacture of wooden footwear, see 15.20 - manufacture of matches, see 20.51 - manufacture of clock cases, see 26.52 - manufacture of wooden spools and bobbins that are part of textile machinery, see 28.94 - manufacture of furniture, see 31.0 - manufacture of wooden toys, see 32.40 - manufacture of brushes and brooms, see 32.91 - manufacture of coffins, see 32.99 - manufacture of cork life preservers, see 32.99 @en
scope note: Esta clase comprende: - la fabricación de productos diversos de madera: • la fabricación de monturas y mangos de herramientas, escobas y cepillos • la fabricación de hormas de madera para el calzado, perchas • la fabricación de utensilios domésticos y de cocina de madera • la fabricación de estatuillas y otros objetos decorativos de madera, madera con trabajo de marquetería o taracea • la fabricación de cajas, estuches y joyeros, y artículos similares de madera • la fabricación de canillas, carretes y bobinas para hilos y artículos similares de madera torneada • la fabricación de otros artículos de madera - el tratamiento de corcho natural en bruto, la fabricación de corcho aglomerado; - la fabricación de artículos de corcho natural o aglomerado, incluidos revestimientos para suelos - la fabricación de trenzas y artículos de materias trenzables: esteras, salvamanteles, pantallas, cajas, etc. - la fabricación de artículos de cestería y mimbre - la fabricación de madera para combustible y pellets como recurso energético, elaborados de madera prensada o materiales sustitutivos como posos de café o semilla de soja - la fabricación de marcos de madera para espejos y cuadros - la fabricación de marcos para lienzos de pintura - la fabricación de partes de madera para el calzado (p. ej., tacones y hormas) - la fabricación de mangos para paraguas, bastones y artículos similares - la fabricación de bloques para la fabricación de pipas Esta clase no comprende: - la fabricación de esteras y esterillas confeccionadas con materias textiles (véase 13.92) - la fabricación de artículos de viaje (véase 15.12) - la fabricación de calzado de madera (véase 15.20) - la fabricación de cerillas (véase 20.51) - la fabricación de cajas de relojes (véase 26.52) - la fabricación de canillas y bobinas de madera que forman parte de la maquinaria textil (véase 28.94) - la fabricación de muebles (véase 31.0) - la fabricación de juguetes de madera (véase 32.40) - la fabricación de escobas y cepillo… @es
scope note: Cette classe comprend: - la fabrication d’objets divers en bois: • manches et montures pour outils, brosses, balais • formes, embauchoirs et tendeurs pour chaussures, cintres pour vêtements • articles de ménage et ustensiles de cuisine • statuettes et objets d’ornement, bois marquetés et bois incrustés • coffrets, écrins et étuis pour bijouterie ou orfèvrerie et ouvrages similaires • canettes, busettes, bobines pour filatures et tissage et pour fil à coudre et articles similaires, en bois tourné • autres articles en bois - le travail du liège naturel, la fabrication de liège aggloméré - la fabrication d’ouvrages en liège naturel ou aggloméré, y compris revêtements de sols - la fabrication de tresses et d’ouvrages de sparterie: nattes, paillassons, claies, etc. - la fabrication d’ouvrages de sparterie et de vannerie - la fabrication de bûches et de pellets pour la production d’énergie, fabriqués à partir de bois pressés ou de produits de substitution (marc de café, etc.) - la fabrication de miroirs en bois et d’encadrements pour photos - la fabrication d’encadrements pour des toiles d’artistes - la fabrication de parties de chaussures en bois (par exemple: talons et formes) - la fabrication de manches de parapluies, de cannes et d’articles similaires - la fabrication de blocs destinés à la fabrication de pipes Cette classe ne comprend pas: - la fabrication de nattes en matières textiles, voir 13.92 - la fabrication d’articles de voyage, voir 15.12 - la fabrication de chaussures en bois, voir 15.20 - la fabrication d’allumettes, voir 20.51 - la fabrication de cages et de cabinets d’appareils d’horlogerie, voir 26.52 - la fabrication de canettes, busettes et bobines comme pièces de machines pour l’industrie textile, voir 28.94 - la fabrication de meubles, voir 31.0 - la fabrication de jouets en bois, voir 32.40 - la fabrication de brosses et de balais, voir 32.91 - la fabrication de cercueils, voir 32.99 - la fabrication de bouées de sauvetage en liège, voir 32.99 @fr
scope note: Ovaj razred uključuje: - proizvodnju različitih proizvoda od drva: • drvenih držača i dijelova za alate, metle i četke • kalupa za čizme, cipele i drugu obuću, vješalica za odjeću • potrepština za kućanstvo i kuhinjsko posuđe od drva • figurica i ukrasa od drva, sitnih galanterijskih proizvoda i intarzija od drva • drvenih kutija za nakit, pribora za jelo i sličnih predmeta od drva • drvenih „špula", poklopaca, bobina, namota za konac i sličnih tokarskih proizvoda od drva • ostalih proizvoda od drva - preradu prirodnog pluta, proizvodnju aglomeriranog pluta - proizvodnju predmeta od prirodnog ili aglomeriranog pluta, uključujući one za pokrivanje podova - proizvodnju pletenica i proizvoda od pletarskog materijala: prostirki, staza, zaslona, kutija itd. - proizvodnju košaračkih i pletarskih predmeta - proizvodnju cjepanica za vatru i tableta za potpaljivanje vatre izrađenih od prešanog drva ili zamjenskog materijala kao što su podzemni dijelovi kave ili soje - proizvodnju drvenih okvira za ogledala i slike - proizvodnju okvira za slikarska platna - proizvodnju drvenih dijelova obuće (npr. potpetica i kalupa) - proizvodnju držača za kišobrane, štapove i slično - proizvodnju blokova za proizvodnju lula za pušenje Ovaj razred isključuje: - proizvodnju prostirki i staza od tekstilnih materijala, vidi 13.92 - proizvodnju kovčega, vidi 15.12 - proizvodnju drvene obuće, vidi 15.20 - proizvodnju šibica, vidi 20.51 - proizvodnju kutija za satove, vidi 26.52 - proizvodnju „špula" i bobina od drva koji su dio tekstilnih strojeva, vidi 28.94 - proizvodnju namještaja, vidi 31.0 - proizvodnju drvenih igračaka, vidi 32.40 - proizvodnju četki i metli, vidi 32.91 - proizvodnju pogrebnih lijesova, vidi 32.99 - proizvodnju pojaseva za spašavanje, vidi 32.99
scope note: Į šią klasę įeina: - įvairių medienos gaminių gamyba: • medinių kotų, rankenų ir korpusų įrankiams, šluotoms, šepečiams, teptukams • medinių kurpalių batams ar pusbačiams ir kailiamaučių, drabužių pakabų • medinių buitinių įrankių, virtuvės indų ir reikmenų • medinių statulėlių ir puošybinių dirbinių, medienos mozaikų, inkrustuotosios medienos • medinių dėžučių juvelyriniams dirbiniams, stalo įrankiams ir panašiems dirbiniams • medinių ričių, šeivų, verpsčių, siuvimo siūlų ričių ir panašių tekintų medinių dirbinių • kitų medinių dirbinių - natūraliosios kamštienos apdirbimas, aglomeruotos kamštienos gamyba - dirbinių gamyba iš natūraliosios ar aglomeruotos kamštienos, įskaitant grindų dangas - pynių ir panašių dirbinių (paklotų, demblių, širmų, dėžučių ir kt.) iš pynimo medžiagų gamyba - pintinių ir pintų dirbinių gamyba - malkų ir kuro granulių iš presuotos medienos ar pakaitalų, panašių į kavos ar sojų pupelių nuosėdas, gamyba - medinių veidrodžių ir nuotraukų rėmelių gamyba - drobėje tapytų paveikslų rėmų gamyba - medinių batų dalių (pvz., kulnų ir kurpalių) gamyba - skėčių, lazdų ir panašių dirbinių rankenų gamyba - trinkų pypkėms gaminti gamyba Į šią klasę neįeina: - paklotų ar demblių iš tekstilinių medžiagų gamyba, žr. 13.92 - lagaminų gamyba, žr. 15.12 - medinės avalynės gamyba, žr. 15.20 - degtukų gamyba, žr. 20.51 - laikrodžių korpusų gamyba, žr. 26.52 - medinių ričių ir verpsčių gamyba, kuri yra tekstilės gamybos mašinų dalis, žr. 28.94 - baldų gamyba, žr. 31.0 - medinių žaislų gamyba, žr. 32.40 - šepečių, šluotų ir teptukų gamyba, žr. 32.91 - karstų gamyba, žr. 32.99 - gelbėjimosi liemenių iš kamštienos gamyba, žr. 32.99 @lt
scope note: Этот класс включает: - производство отбеленной, не полностью отбеленной или неотбеленной бумажной древесной массы и целлюлозы механическим, химическим (растворение или неполное растворение), а также полухимическим методом переработки - линтоотделение древесной массы и целлюлозы - удаление чернил и типографской краски и производство древесной массы и целлюлозы из бумажных отходов @ru
scope note: Bu sınıf aşağıdakileri kapsamaktadır; - muhtelif ahşap ürünlerin imalatı: • maşalar, saplı çalı süpürgeleri, fırçalar için tahtadan kulp ve gövdeler, • ahşaptan bot veya ayakkabı kalıbı, elbise askıları, • ahşap ev aletleri ve mutfak eşyaları, • ahşaptan heykelcikler (biblolar) ve süs eşyaları, ahşaptan kakma işleri, kakmalı tahtalar, • mücevherat, kaşık-çatal takımları ve benzer eşyalar için ahşap kasalar, • ahşap makaralar, masuralar, bobinler, dikiş ipliği makaraları ve dönüştürülmüş ahşaptan benzeri eşyalar, • ahşaptan yapılan diğer eşyalar. - doğal mantarların işlenmesi, aglomera edilmiş mantar imalatı, - doğal veya topak haline getirilmiş mantar ürünlerinin imalatı, yer döşemeleri de dahil., - örgüler ve örgü materyalleri ürünleri imalatı: hasırlar, hasır örgüler, perdeler, kafesler vb., - sepetçi eşyaları ve hasır imalatı, - enerji için, sıkıştırılmış odundan ya da kahve ya da soya fasulyesi küspesi gibi malzemelerden yapılan yakıt kütükleri ve topaklarının imalatı, - tahtadan ayna ve pencere çerçevelikleri imalatı, - tuvaller için ahçep çerçeve imalatı, - tahtadan ayakkabı parçaları imalatı (örn. topuklar ve ayakkabı ökçeleri), - şemsiyeler, bastonlar ve benzerleri için kulp imalatı, - pipo imalatı için ahşap blokların imalatı. Kapsam dışı olanlar; - paspas veya tekstil ürünlerinden paspas imal edilmesi, bkz. 13.92, - bavul imalatı, bkz.15.12, - tahtadan ayakkabı imalatı, bkz.15.20, - kibrit imalatı, bkz. 20.51, - saat kasaları imalatı, bkz. 26.52, - tekstil makinelerin parçaları olan tahta makaralar ve bobinler imalatı, bkz. 28.94, - mobilya imalatı, bkz. 31.0, - tahtadan oyuncaklar imalatı, bkz. 32.40, - fırçalar ve saplı çalı süpürgeleri imalatı, bkz. 32.91, - tabut imalatı, bkz. 32.99, • mantarlı can simidi imalatı, bkz. 32.99. @tr
preferred label: Производство на други изделия от дървен материал; производство на изделия от корк, слама и материали за плетене @bg
preferred label: Výroba ostatních dřevěných výrobků, kromě nábytku; výroba ostatních korkových, proutěných a slaměných výrobků @cs
preferred label: Fremstilling af andre træprodukter; fremstilling af varer af kork, strå og flettematerialer @da
preferred label: Herstellung von Holzwaren a.n.g, Kork-, Flecht- und Korbwaren (ohne Möbel) @de
preferred label: Κατασκευή άλλων προϊόντων από ξύλο· κατασκευή ειδών από φελλό και ειδών καλαθοποιίας και σπαρτοπλεκτικής @el
preferred label: Fabricación de otros productos de madera; artículos de corcho, cestería y espartería @es
preferred label: Muude puittoodete tootmine; korgist, õlest ja punumismaterjalist toodete tootmine @et
preferred label: Muiden puutuotteiden valmistus; korkki-, olki- ja punontatuotteiden valmistus @fi
preferred label: Fabrication d'objets divers en bois; fabrication d'objets en liège, vannerie et sparterie @fr
preferred label: Egyéb fa-, parafatermék, fonottáru gyártása
preferred label: Fabbricazione di altri prodotti in legno, fabbricazione di articoli in sughero, paglia e materiali da intreccio @it
preferred label: Kitų medienos gaminių gamyba; dirbinių iš kamštienos, šiaudų ir pynimo medžiagų gamyba @lt
preferred label: Pārējo koka izstrādājumu ražošana; korķa, salmu un pīto izstrādājumu ražošana @lv
preferred label: Manifattura ta' prodotti oħra ta' njam; manifattura ta' oġġetti ta' sufra, tiben u materjal għall-immaljar @mt
preferred label: Vervaardiging van andere artikelen van hout; vervaardiging van artikelen van kurk, riet of vlechtwerk @nl
preferred label: Produksjon av andre trevarer og varer av kork, strå og flettematerialer @no
preferred label: Produkcja pozostałych wyrobów z drewna; produkcja wyrobów z korka, słomy i materiałów używanych do wyplatania @pl
preferred label: Fabricação de outras obras de madeira; fabricação de artigos de cortiça, de espartaria e cestaria @pt
preferred label: Fabricarea altor produse din lemn; fabricarea articolelor din plută, paie şi din alte materiale vegetale împletite @ro
preferred label: Производство прочих деревянных изделий; производство изделий из пробки, соломки и материалов для плетения @ru
preferred label: Výroba ostatných výrobkov z dreva; výroba výrobkov z korku, slamy a prúteného materiálu @sk
preferred label: Proizvodnja drugih izdelkov iz lesa, plute, slame in protja @sl
preferred label: Övrig trävarutillverkning; tillverkning av varor av kork, halm, rotting o.d. @sv
preferred label: Diğer ağaç ürünleri imalatı; mantar, saz, saman ve benzeri malzemelerden yapılmış ürünlerin imalatı @tr
broader: Manufacture of products of wood, cork, straw and plaiting materials

Manufacture of paper and paper products
type: Concept
notation: 17
status: valid
status modified: 2013-10-18
accepted date: 2013-10-18
in scheme: Statistical Classification of Economic Activities in the European Community, Rev. 2 (2008)
scope note: производство на влакнести полуфабрикати, хартия, картон и изделия от тях. Производството на тези продукти е групирано заедно, защото представлява серия от вертикално свързани процеси. Една единица често осъществява повече от една дейност. По същество има три дейности. Производството на влакнести полуфабрикати включва извличане, отделяне на целулозни влакна от дървесина или разтваряне, очистване, остраняване на печатарски мастила от употребявана хартия и смесване с малки количества реагенти, имащи за цел да подобрят сцеплението между влакната. Производството на хартия включва отливането на целулозната маса върху телено сито, като по този начин се оформя непрекъснат хартиен лист. Производството на изделия от хартия и картон включва по-нататъшната обработка на хартията и картона посредством различни технологични методи. Изделията от хартия и картон могат да бъдат със или без печат в зависимост от изискванията към тях (например тапети, луксозна хартия за подаръци и други). Производството на изделия с печат се класифицира в този раздел, когато видът на отпечатаната информация не е определящ признак. Производството на дървесна маса, хартия и картон се включва в група 17.1, докато останалите класове обхващат по-нататъшната обработка на хартията и картона и изделията от тях. @bg
scope note: Tento oddíl zahrnuje výrobu buničiny, (papírové kaše, drti), papíru a konečných výrobků z papíru. Výroba těchto výrobků je shrnuta v jednom oddílu, protože tvoří řadu vertikálně propojených procesů. Výrobní jednotka provádí většinou více než jeden výrobní proces. V podstatě se jedná o tři druhy činností: Výroba dřevoviny a buničiny spočívá v oddělování vláken celulózy od ostatních látek obsažených ve dřevu nebo v rozpuštění a odbarvení použitého papíru a přimíchání činidel v malých množstvích za účelem zajištění soudržnosti vláken. Při výrobě papíru se papírovina nabírá na drátěné síto a tvoří nekonečný arch. Konečné papírové výrobky se vyrábějí z papíru nebo jiného materiálu různými výrobními postupy. Dále zahrnuje také potištěné výrobky z papíru (např. tapety, dárkový balicí papír ), pokud hlavním účelem činnosti není tisk informací. Výroba dřevoviny a buničiny, papíru, kartonu a lepenky je zahrnuta ve skupině 17.1, ostatní třídy zahrnují výrobu další zpracování papíru a výrobků z papíru. @cs
scope note: Diese Abteilung umfasst die Herstellung von Holz- und Zellstoff und veredelten Papiererzeugnissen. Die Herstellung dieser Erzeugnisse wird zusammengefasst, da sie eine Reihe von vertikal verbundenen Verfahren bildet. In einer Einheit werden häufig mehrere Verfahren durchgeführt. Es gibt im Wesentlichen drei Tätigkeiten: Die Herstellung von Holz- und Zellstoff besteht in der Trennung der Zellstofffasern von den anderen im Holz enthaltenen Stoffen oder in der Auflösung und Entfärbung von Altpapier sowie der Beimischung von Reagenzien in kleinen Mengen, um den Zusammenhalt der Fasern zu verstärken. Bei der Herstellung von Papier wird der Zellstoffbrei auf ein Drahtsieb aufgebracht und bildet ein Endlosblatt. Veredelte Papiererzeugnisse werden aus Papier und anderem Material durch verschiedene Verfahren hergestellt. Eingeschlossen sind auch bedruckte Papiererzeugnisse (z. B. Tapeten, Geschenkpapier usw.), sofern das Drucken von Informationen nicht der Hauptzweck ist. Die Herstellung von Holz- und Zellstoff, Papier, Karton und Pappe zählt zur Gruppe 17.1, die übrigen Klassen umfassen die Herstellung von weiterverarbeitetem Papier und Papiererzeugnissen. @de
scope note: This division includes the manufacture of pulp, paper and converted paper products. The manufacture of these products is grouped together because they constitute a series of vertically connected processes. More than one activity is often carried out in a single unit. There are essentially three activities: The manufacture of pulp involves separating the cellulose fibres from other matter in wood, or dissolving and de-inking of used paper, and mixing in small amounts of reagents to reinforce the binding of the fibres. The manufacture of paper involves releasing pulp onto a moving wire mesh so as to form a continuous sheet. Converted paper products are made from paper and other materials by various techniques. The paper articles may be printed (e.g. wallpaper, gift wrap etc.), as long as the printing of information is not the main purpose. The production of pulp, paper and paperboard in bulk is included in group 17.1, while the remaining classes include the production of further-processed paper and paper products. @en
scope note: Esta división abarca la fabricación de pasta papelera, papel y productos de papel transformado. La fabricación de estos productos se agrupa porque constituye una serie de procesos conectados verticalmente. Con frecuencia se realiza más de una actividad en la misma unidad. Fundamentalmente se llevan a cabo tres actividades. La fabricación de pasta papelera consiste en separar las fibras de celulosa de otros materiales en la madera, o en disolver y destintar el papel usado, y añadir a la mezcla pequeñas cantidades de reactivos para reforzar la aglutinación de las fibras. La fabricación del papel comprende el vertido de la pasta en una criba móvil con el fin de formar una hoja continua. Los productos de papel transformado se fabrican con papel y otros materiales mediante diversas técnicas. Los artículos de papel pueden estar impresos (papeles pintados, envoltorios para regalo, etc.), siempre que la finalidad principal no sea la impresión de información. La producción de pasta papelera, papel y cartón a granel se incluye en el grupo 17.1, mientras que el resto de clases comprende la producción de papel y productos de papel sometidos a transformaciones ulteriores. @es
scope note: Cette division couvre la fabrication de la pâte à papier, du papier ou des produits en papier recyclé. La fabrication de ces produits est regroupée parce qu’elle représente une série d’opérations liées verticalement. Plusieurs d’entre elles sont souvent accomplies dans une même unité. On distingue trois activités essentielles. La fabrication de pâte à papier consiste à séparer les fibres cellulosiques des impuretés contenues dans le bois ou à dissoudre et désencrer le papier recyclé et à y mélanger de faibles quantités de réactifs afin de renforcer le liant des fibres. La fabrication du papier consiste à répartir la pulpe sur une grille mobile en vue de former une feuille continue. Les produits à base de papier recyclé sont fabriqués à partir de papier et d’autres matières par différentes techniques. Les articles en papier peuvent être imprimés (papiers peints, papiers cadeaux, etc.), dès lors que l’information imprimée n’est pas la finalité principale. La production de pulpe, de papiers ou de cartons en gros est comprise dans le groupe 17.1, tandis que les autres classes comprennent la production d’articles et de produits en papier ayant fait l’objet d’une transformation ultérieure. @fr
scope note: Ovaj odjeljak uključuje proizvodnju celuloze, papira i konvertirane proizvode od papira. Proizvodnja tih proizvoda grupirana je zajedno jer čini seriju vertikalno povezanih postupaka prerade. U jednoj jedinici često se obavlja više od jedne djelatnosti. Ovdje je riječ o trima djelatnostima: proizvodnja celuloze zahtijeva razdvajanje celularnih vlakana od ostalih nečistoća u drvu ili u upotrijebljenom (starom) papiru. Proizvodnja papira zahtijeva uzdužno polaganje tih vlakana u listove. Konvertirani proizvodi izrađeni su od papira i drugih materijala s različitim tehnikama rezanja i oblikovanja. Predmeti od papira mogu se tiskati (npr. zidne tapete, papir za zamatanje itd.) dok god tiskana informacija nije glavna svrha tiskanja. Proizvodnja celuloze, papira i kartona u slobodnim listovima uključena je u skupinu 17.1, dok ostali razredi uključuju proizvodnju papira i proizvoda od papira koji su dalje prerađeni.
scope note: Šiame skyriuje klasifikuojama plaušienos, popieriaus ar pakartotinai perdirbto popieriaus gaminių gamyba. Šių produktų gamyba yra klasifikuojama kartu, nes sudaro seką vertikaliai integruotų procesų. Dažniausiai atskiras gamybos vienetas atlieka daugiau nei vieną veiklos rūšį. Yra trys esminės veiklos rūšys. Į plaušienos gamybą įeina celiuliozės pluoštų išskyrimas iš kitos medienos ar naudoto ištirpinto popieriaus, iš kurio išplauti dažai ir maišymas su mažais reagentų kiekiais, siekiant padidinti pluoštų rišimąsi. Popieriaus gamyba susideda iš plaušienos paskleidimo ant metalinio judančio tinklo, siekiant suformuoti nepertraukiamus lakštus. Pakartotinai perdirbto popieriaus gaminiai yra gaminami iš popieriaus ir kitų medžiagų, naudojant įvairias technologijas. Popieriaus gaminiai gali būti spausdinti (pvz., popieriniai sienų apmušalai, dovanų vyniojimui skirtas popierius ir kt.), jeigu tik spausdintoji informacija nėra gamybos tikslas. Nesupakuotos plaušienos, popieriaus ir kartono gamyba klasifikuojama 17.1 grupėje, tuo tarpu likusiose šio skyriaus klasėse klasifikuojama popierinių gaminių iš gatavo popieriaus ir kartono gamyba. @lt
scope note: Этот класс включает: - производство бумаги и картона, предназначенные для дальнейшей промышленной переработки Этот класс также включает: - дальнейшую переработку бумаги и картона: • нанесение покрытия, включающее пропитку бумаги и картона • производство крепированной целлюлозной ваты или гофрированной бумаги • производство ламинированной бумаги, картона и фольги - производство бумаги вручную - производство газетной бумаги и прочей печатной или писчей бумаги - производство целлюлозного материала для набивки и ваты из целлюлозных волокон - производство копировальной бумаги или трафаретной бумаги в рулонах или больших листах Этот класс исключает: - производство гофрированной бумаги и картона, см. 17.21 - производство других изделий из бумаги, картона или целлюлозы, см. 17.22, 17.23, 17.24, 17.29 - производство бумаги с покрытием или пропиткой, когда покрытие или пропитка являются главным составным компонентом, (см. класс к которому относятся производство покрытия или пропитки) - производство наждачной бумаги, см. 23.91 @ru
scope note: Bu bölüm, kağıt hamuru, kağıt ve dönüştürülmüş kağıt ürünleri imalatını kapsamaktadır. Bu tür ürünler dikey entegrasyon işlemi oluşturduğundan, bunların imalatı bir arada değerlendirilmiştir. Genellikle tek bir birim tarafından birden fazla faaliyet yürütülmektedir. Buradaki temel olarak üç faaliyet; Kağıt hamuru imalatı, odundan selüloz liflerinin ayrıştırılması, kullanılmış kağıdın hamurlaştırılmasını ve mürekkebinin alınması ile liflerin bağlarının güçlendirilmesi için az miktarda ayıraçlarla karıştırılmasını kapsamaktadır. Kağıt imalatı, bu liflerin kağıt tabakalara dönüştürülmesini kapsamaktadır. Dönüştürülmüş kağıt ürünleri, çeşitli tekniklerle kağıttan ve diğer materyallerden elde edilmektedir. Kağıt ürünleri, bilgi içermedikçe basılı da olabilir (örn. duvar kağıtları, süslü hediye ambalaj kağıdı). Dökme kağıt hamuru, kağıt ve mukavvanın imalatı grup 17.1`de sınıflandırılırken, daha ileri seviyede işlenmiş kağıt ve kağıt ürünlerinin imalatı diğer sınıflarda yer almaktadır. @tr
preferred label: Производство на хартия, картон и изделия от хартия и картон @bg
preferred label: Výroba papíru a výrobků z papíru @cs
preferred label: Fremstilling af papir og papirvarer @da
preferred label: Herstellung von Papier, Pappe und Waren daraus @de
preferred label: Χαρτοποιία και κατασκευή χάρτινων προϊόντων @el
preferred label: Industria del papel @es
preferred label: Paberi ja pabertoodete tootmine @et
preferred label: Paperin, paperi- ja kartonkituotteiden valmistus @fi
preferred label: Industrie du papier et du carton @fr
preferred label: Papír, papírtermék gyártása
preferred label: Fabbricazione di carta e di prodotti di carta @it
preferred label: Popieriaus ir popieriaus gaminių gamyba @lt
preferred label: Papīra un papīra izstrādājumu ražošana @lv
preferred label: Manifattura ta' karta u ta' prodotti tal-karta @mt
preferred label: Vervaardiging van papier en papierwaren @nl
preferred label: Produksjon av papir og papirvarer @no
preferred label: Produkcja papieru i wyrobów z papieru @pl
preferred label: Fabricação de pasta, de papel, de cartão e seus artigos @pt
preferred label: Fabricarea hârtiei şi a produselor din hârtie @ro
preferred label: Производство бумаги и бумажной продукции @ru
preferred label: Výroba papiera a papierových výrobkov @sk
preferred label: Proizvodnja papirja in izdelkov iz papirja @sl
preferred label: Pappers- och pappersvarutillverkning @sv
preferred label: Kağıt ve kağıt ürünlerinin imalatı @tr
broader: MANUFACTURING
narrower: Manufacture of pulp, paper and paperboard
narrower: Manufacture of articles of paper and paperboard

Manufacture of pulp, paper and paperboard
type: Concept
notation: 17.1
status: valid
status modified: 2013-10-18
accepted date: 2013-10-18
in scheme: Statistical Classification of Economic Activities in the European Community, Rev. 2 (2008)
preferred label: Производство на влакнести полуфабрикати, хартия и картон @bg
preferred label: Výroba buničiny, papíru a lepenky @cs
preferred label: Fremstilling af papirmasse, papir og pap @da
preferred label: Herstellung von Holz- und Zellstoff, Papier, Karton und Pappe @de
preferred label: Παραγωγή χαρτοπολτού· κατασκευή χαρτιού και χαρτονιού @el
preferred label: Fabricación de pasta papelera, papel y cartón @es
preferred label: Paberimassi, paberi- ja papitootmine @et
preferred label: Massan, paperin, kartongin ja pahvin valmistus @fi
preferred label: Fabrication de pâte à papier, de papier et de carton @fr
preferred label: Papíripari rostanyag, papír gyártása
preferred label: Fabbricazione di pasta-carta, carta e cartone @it
preferred label: Plaušienos, popieriaus ir kartono gamyba @lt
preferred label: Celulozes, papīra un kartona ražošana @lv
preferred label: Manifattura ta' polpa, karta u kartun @mt
preferred label: Vervaardiging van pulp, papier en karton @nl
preferred label: Produksjon av papirmasse, papir og papp @no
preferred label: Produkcja masy włóknistej, papieru i tektury @pl
preferred label: Fabricação de pasta, de papel e de cartão (excepto canelado) @pt
preferred label: Fabricarea celulozei, hârtiei şi cartonului @ro
preferred label: Производство древесной массы и целлюлозы, бумаги и картона @ru
preferred label: Výroba celulózy, papiera a lepenky @sk
preferred label: Proizvodnja vlaknin, papirja in kartona @sl
preferred label: Massa-, pappers- och papptillverkning @sv
preferred label: Kağıt hamuru, kağıt ve mukavva imalatı @tr
broader: Manufacture of paper and paper products
narrower: Manufacture of pulp
narrower: Manufacture of paper and paperboard

Manufacture of pulp
type: Concept
notation: 17.11
status: valid
status modified: 2013-10-18
accepted date: 2013-10-18
in scheme: Statistical Classification of Economic Activities in the European Community, Rev. 2 (2008)
scope note: - производство на избелена, полуизбелена и неизбелена дървесна маса (разтворена или неразтворена) по механичен, химичен или полухимичен метод - производство на влакнеста маса от памучен линтер - отстраняване на печатарските мастила и производство на хартиена маса от употребявани хартия и картон @bg
scope note: Z: - výrobu bělené, částečně bělené nebo nebělené papírové vlákniny mechanickými, chemickými (rozpouštěním nebo nerozpouštěním) nebo polochemickými procesy - výrobu buničiny z bavlněných semen (linters) - odstraňování inkoustu / tiskařské barvy a výrobu vlákniny z starého papíru @cs
scope note: Diese Klasse umfasst: - Herstellung von gebleichter, halbgebleichter oder ungebleichter Papiermasse durch mechanische, chemische (auflösende oder nichtauflösende) oder halbchemische Aufbereitung von Papiermasse - Herstellung von Zellstoff aus Baumwoll-Samenhaaren (Linters) - Entfernen von Druckfarben und Herstellung von Holzschliff aus Altpapier @de
scope note: This class includes: - manufacture of bleached, semi-bleached or unbleached paper pulp by mechanical, chemical (dissolving or non-dissolving) or semi-chemical processes - manufacture of cotton-linters pulp - removal of ink and manufacture of pulp from waste paper @en
scope note: Esta clase comprende: - la fabricación de pasta de papel blanqueada, semiblanqueada o cruda mediante procedimientos mecánicos, químicos (solubles o no) o semiquímicos - la fabricación de pasta papelera de borras de algodón - la eliminación de tinta y la fabricación de pasta papelera a partir de papel usado @es
scope note: Cette classe comprend: - la fabrication de pâtes à papier blanchies, mi-blanchies ou écrues par des procédés mécaniques, chimiques (pâtes à dissoudre ou autres) ou mi-chimiques - la production de pulpe de linters de coton - le désencrage de vieux papiers et la fabrication de pâtes à papier à partir de déchets de papier @fr
scope note: Ovaj razred uključuje: - proizvodnju bijeljene, polubijeljene i nebijeljene celuloze primjenom mehaničkoga, kemijskoga ili polukemijskog procesa - proizvodnju celuloze pamučnog lintera - uklanjanje tiskarske boje i proizvodnju celuloze od papirnog otpada
scope note: Į šią klasę įeina: - balintos, pusiau balintos ar nebalintos plaušienos gamyba mechaniniu, cheminiu (tirpdymo ar netirpdymo) ar pusiau cheminiu būdu - plaušienos gamyba iš medvilnės linterio - spaustuvės dažų pašalinimas ir plaušienos gamyba iš makulatūros @lt
scope note: Этот класс включает: - производство гофрированной бумаги и картона - производство тары из гофрированной бумаги или картона - производство складной тары из гофрированного картона - производство тары из твердого картона - производство другой тары из бумаги и картона - производство мешков и пакетов из бумаги - производство офисных папок и подобных изделий Этот класс исключает: - производство конвертов, см. 17.23 - производство рельефных или прессованных бумажных изделий из древесной массы и целлюлозы (например, коробок для упаковки яиц, одноразовых бумажных тарелок), см. 17.29 @ru
scope note: Bu sınıf aşağıdakileri kapsamaktadır; - mekanik, kimyasal (çözülmüş ya da çözülmemiş) veya yarı kimyasal işlemler ile beyazlatılmış, yarı-beyazlatılmış ya da beyazlatılmamış kağıt hamuru imalatı, - pamuk linterinden hamur imalatı, - atık kağıttan mürekkebin temizlenmesi ve kağıt hamuru imalatı. @tr
preferred label: Производство на влакнести полуфабрикати @bg
preferred label: Výroba buničiny @cs
preferred label: Fremstilling af papirmasse @da
preferred label: Herstellung von Holz- und Zellstoff @de
preferred label: Παραγωγή χαρτοπολτού @el
preferred label: Fabricación de pasta papelera @es
preferred label: Paberimassi tootmine @et
preferred label: Massan valmistus @fi
preferred label: Fabrication de pâte à papier @fr
preferred label: Papíripari rostanyag gyártása
preferred label: Fabbricazione di pasta-carta @it
preferred label: Plaušienos gamyba @lt
preferred label: Celulozes (papīrmasas) ražošana @lv
preferred label: Manifattura ta' polpa @mt
preferred label: Vervaardiging van pulp @nl
preferred label: Produksjon av papirmasse @no
preferred label: Produkcja masy włóknistej @pl
preferred label: Fabricação de pasta @pt
preferred label: Fabricarea celulozei @ro
preferred label: Производство древесной массы и целлюлозы @ru
preferred label: Výroba celulózy @sk
preferred label: Proizvodnja vlaknin @sl
preferred label: Massatillverkning @sv
preferred label: Kağıt hamuru imalatı @tr
broader: Manufacture of pulp, paper and paperboard

Manufacture of paper and paperboard
type: Concept
notation: 17.12
status: valid
status modified: 2013-10-18
accepted date: 2013-10-18
in scheme: Statistical Classification of Economic Activities in the European Community, Rev. 2 (2008)
scope note: - производство на хартия и картон, подлежащи на по-нататъшна промишлена преработка - по-нататъшна преработка на хартия и картон: • покриване, наслояване и импрегниране на хартия и картон • производство на крепирана или навълнена хартия • производство на ламинирани хартия и картон - производство на ръчно отлети хартия и картон - производство на вълнообразен картон (велпапе) - 17.21 - производство на изделия от хартия, подлежащи на по-нататъшна преработка - 17.22, 17.23, 17.24, 17.29 - производство на покрита или импрегнирана хартия, когато покритието или средството за импрегниране е основната съставка, класифицирането е в класа на производство на покритието или средството за импрегниране - производство на шкурка - 23.91 @bg
scope note: Z: - výrobu papíru a lepenky pro další průmyslové zpracování ZT: - další zpracování papíru a lepenky: • potahování, natírání a impregnaci papíru a lepenky • výrobu krepového nebo zvlněného papíru • výrobu laminátů a folií laminovaných papírem nebo lepenkou - výrobu ručního papíru - výrobu novinového a jiného tiskového nebo psacího papíru - výrobu buničité vaty a buničité tkaniny - výrobu karbonového, průpisového a přetiskového papíru v rolích nebo širokých arších N: - výrobu vlnitého papíru a lepenky (17.21) - výrobu dále zpracovaných výrobků z papíru, lepenky nebo buničiny (17.22, 17.23, 17.24, 17.29) - výrobu natřeného nebo impregnovaného papíru, pokud nátěr nebo impregnační prostředek tvoří hlavní součást výrobku (viz třída, do které je zahrnuto potahování/natírání nebo impregnace) - výrobu brusného papíru (23.91) @cs
scope note: Diese Klasse umfasst: - Herstellung von Papier, Karton und Pappe zur industriellen Weiterverarbeitung Diese Klasse umfasst ferner: - Weiterverarbeitung von Papier, Karton und Pappe: • Umhüllen, Beschichten und Imprägnieren von Papier und Pappe • Herstellung von Krepp- und Faltpapier • Herstellung von Laminaten und Folien, die mit Papier, Karton oder Pappe laminiert sind - Herstellung von Büttenpapier und -pappe (handgeschöpft) - Herstellung von Zeitungspapier und anderem Druck- oder Schreibpapier - Herstellung von Zellstoffwatte und Vliese aus Zellstofffasern - Herstellung von Kohle-, Durchschreibe- oder Umdruckpapier in Rollen oder breiten Bogen Diese Klasse umfasst nicht: - Herstellung von Wellpapier und –pappe (s. 17.21) - Herstellung von weiterverarbeiteten Papier-, Pappe- oder Zellstoffwaren (s. 17.22, 17.23, 17.24, 17.29) - Herstellung von beschichtetem oder imprägniertem Papier, sofern die Beschichtung oder das Imprägniermittel den Hauptbestandteil darstellt (siehe die Klasse, in der die Beschichtung oder das Imprägniermittel eingereiht ist) - Herstellung von Schleifpapier (s. 23.91) @de
scope note: This class includes: - manufacture of paper and paperboard intended for further industrial processing This class also includes: - further processing of paper and paperboard: • coating, covering and impregnation of paper and paperboard • manufacture of crêped or crinkled paper • manufacture of laminates and foils, if laminated with paper or paperboard - manufacture of handmade paper - manufacture of newsprint and other printing or writing paper - manufacture of cellulose wadding and webs of cellulose fibres - manufacture of carbon paper or stencil paper in rolls or large sheets This class excludes: - manufacture of corrugated paper and paperboard, see 17.21 - manufacture of further-processed articles of paper, paperboard or pulp, see 17.22, 17.23, 17.24, 17.29 - manufacture of coated or impregnated paper, where the coating or impregnant is the main ingredient, see class in which the manufacture of the coating or impregnant is classified - manufacture of abrasive paper, see 23.91 @en
scope note: Esta clase comprende: - la fabricación de papel y cartón con vistas a un tratamiento industrial posterior Esta clase comprende también: - el tratamiento ulterior de papel y cartón: • el encolado, el recubrimiento y la impregnación de papel y cartón • la fabricación de papel rizado o plegado • la fabricación de laminados y papel de aluminio, si se laminan con papel o cartón - la fabricación de papel hecho a mano - la fabricación de papel prensa y otro papel de impresión o escritura - la fabricación de guata de celulosa y bandas de fibras de celulosa - la fabricación de papel de calco y papel para clichés de multicopista en rollos o grandes pliegos Esta clase no comprende: - la fabricación de papel y cartón ondulados (véase 17.21) - la fabricación de artículos de papel, cartón o pasta papelera (véanse 17.22, 17.23, 17.24 y 17.29) - la fabricación de papel revestido o impregnado, cuando el revestimiento o la impregnación constituyan el principal ingrediente (véase la clase en la que se clasifica la fabricación del revestimiento o la impregnación) - la fabricación de papel abrasivo (véase 23.91) @es
scope note: Cette classe comprend: - la fabrication de papiers et de cartons destinés à faire l’objet d’une transformation ultérieure par l’industrie Cette classe comprend également: - la transformation ultérieure des papiers et des cartons • le couchage, l’enduction et l’imprégnation des papiers et des cartons • la fabrication de papiers crêpés ou plissés • la fabrication de produits stratifiés et de bandes, si ces produits sont stratifiés avec du papier ou du carton - la fabrication de papier à la main - la fabrication de papier journal et de papier pour l’impression ou l’écriture - la fabrication d’ouate de cellulose et de nappes en fibres de cellulose - la fabrication de papiers carbone et de papiers stencil en rouleaux ou en larges feuilles Cette classe ne comprend pas: - la fabrication de papiers et de cartons ondulés, voir 17.21 - la fabrication d’articles en papier, carton ou pâte à papier ayant fait l’objet d’une transformation ultérieure, voir 17.22, 17.23, 17.24 et 17.29 - la fabrication de papier enduit ou imprégné dans lequel la matière dont il est enduit ou imprégné est l’élément principal, voir la classe où est rangée la fabrication du produit servant à enduire ou à imprégner - la fabrication de papiers abrasifs, voir 23.91 @fr
scope note: Ovaj razred uključuje: - proizvodnju papira i kartona namijenjenih daljnjoj industrijskoj preradi Ovaj razred također uključuje: - daljnju preradu papira i kartona: • premazivanje, prekrivanje i impregniranje papira i kartona • proizvodnju kraft papira • proizvodnju laminata i folija ako su laminirani papirom ili kartonom - proizvodnju ručno izrađenog papira - proizvodnju novinskog papira i ostalog papira za printanje i pisanje - proizvodnju celulozne vate i vrpca od celuloznih vlakana - proizvodnju karbonskog papira ili papira sa šablonama u rolama i listovima Ovaj razred isključuje: - proizvodnju valovitog papira i kartona, vidi 17.21 - proizvodnju dalje prerađenih predmeta od papira, kartona ili celuloze, vidi 17.22, 17.23, 17.24, 17.29 - proizvodnju premazanog ili impregniranog papira, gdje je premaz ili impregnat glavni sastojak, vidi razred u kojem je razvrstana proizvodnja premaza ili impregnata - proizvodnju abrazivnog papira, vidi 23.91
scope note: Į šią klasę įeina: - popieriaus ir kartono, skirto tolesniam pramoniniam apdirbimui, gamyba Į šią klasę taip pat įeina: - tolesnis popieriaus ir kartono apdorojimas: • popieriaus ir kartono padengimas, apdengimas ir įmirkymas • krepinio ar klostyto popieriaus gamyba • sluoksniuoto popieriaus ir folijos, jeigu sluoksniuojama su popieriumi ar kartonu, gamyba - rankų darbo popieriaus gamyba - laikraštinio ir kito spausdinamojo ar rašomojo popieriaus gamyba - celiuliozinės vatos ir celiuliozinių pluoštų klodų gamyba - kalkės ar trafaretinio popieriaus gamyba rulonais arba dideliais lakštais Į šią klasę neįeina: - gofruotojo popieriaus ir kartono gamyba, žr. 17.21 - popierinių gaminių iš gatavo popieriaus, kartono ir plaušienos gamyba, žr. 17.22, 17.23, 17.24, 17.29 - padengto arba įmirkyto popieriaus, kai padengimas arba įmirkymas yra pagrindinis veiksnys, gamyba klasifikuojama impregnuotų ir įmirkytų gaminių gamybos klasėje - švitrinio popieriaus gamyba, žr. 23.91 @lt
scope note: Этот класс включает: - производство бумажной продукции для использования в целях личной гигиены и набивки из целлюлозной ваты: • бумажных салфеток • носовых платков, полотенец, салфеток • туалетной бумаги • гигиенических полотенец и тампонов, салфеток и полотенец для детей младшего возраста • бумажных стаканчиков, тарелок и подносов - производство текстильного материала для набивки и изделий из материала для набивки: гигиенических полотенец, тампонов и т.д. Этот класс исключает: - производство целлюлозных материалов для набивки, см. 17.12 @ru
scope note: Bu sınıf aşağıdakileri kapsamaktadır; - daha ileri sanayi işlemi için kağıt ve mukavva imalatı. Bu sınıf ayrıca şunları kapsamaktadır: - kağıt ve mukavvanın ilave işlemlerden geçirilmesi, • kağıdın ve mukavvanın tabakalanması, kaplanması ve emprenye edilmesi, • krepon ya da kırışık kağıt imalatı, • kağıt ya da mukavva ile lamine edilmiş ince tabaka ve folyo imalatı, (meyve suyu ve süt kutuları gibi) - el ile yapılmış yüksek kaliteli yazı kağıdı imalatı, - gazete kağıdı ve diğer basım veya yazı kağıdı imalatı, - selülozik vatka (destek) ve selüloz elyaflardan tabakaların imalatı, - karbon kağıdının veya mumlu kağıdın tomar olarak ya da büyük levhalar halinde imalatı. Kapsam dışı olanlar; - oluklu karton ya da mukavva imalatı, bkz. 17.21, - daha ileri işlenmiş kağıt, mukavva ya da kağıt hamuru imalatı, bkz.17.22, 17.23, 17.24, 17.29, - kaplama ya da doyurulma ana bileşen iken kuşe kağıdı ya da karışımdan oluşan kağıtlar imalatı, kaplanmanın ya da doyurulmanın imalatının sınıflandırıldığı sınıfa bakınız. - cila kağıtları imalatı, bkz. 23.91, @tr
preferred label: Производство на хартия и картон @bg
preferred label: Výroba papíru a lepenky @cs
preferred label: Fremstilling af papir og pap @da
preferred label: Herstellung von Papier, Karton und Pappe @de
preferred label: Κατασκευή χαρτιού και χαρτονιού @el
preferred label: Fabricación de papel y cartón @es
preferred label: Paberi- ja papitootmine @et
preferred label: Paperin, kartongin ja pahvin valmistus @fi
preferred label: Fabrication de papier et de carton @fr
preferred label: Papírgyártás
preferred label: Fabbricazione di carta e di cartone @it
preferred label: Popieriaus ir kartono gamyba @lt
preferred label: Papīra un kartona ražošana @lv
preferred label: Manifattura ta' karta u kartun @mt
preferred label: Vervaardiging van papier en karton @nl
preferred label: Produksjon av papir og papp @no
preferred label: Produkcja papieru i tektury @pl
preferred label: Fabricação de papel e de cartão (excepto canelado) @pt
preferred label: Fabricarea hârtiei şi cartonului @ro
preferred label: Производство бумаги и картона @ru
preferred label: Výroba papiera a lepenky @sk
preferred label: Proizvodnja papirja in kartona @sl
preferred label: Pappers- och papptillverkning @sv
preferred label: Kağıt ve mukavva imalatı @tr
broader: Manufacture of pulp, paper and paperboard

Manufacture of articles of paper and paperboard
type: Concept
notation: 17.2
status: valid
status modified: 2013-10-18
accepted date: 2013-10-18
in scheme: Statistical Classification of Economic Activities in the European Community, Rev. 2 (2008)
scope note: Этот класс включает: - производство печатной и писчей бумаги, готовой для использования - производство бумаги для принтеров, готовой для использования - производство самокопирующей бумаги, готовой для использования - производство трафаретной и копировальной бумаги, готовой для использования - производство самоклеящейся бумаги, готовой для использования - производство конвертов и открыток - производство школьных и офисных канцелярских товаров (тетрадей, общих тетрадей, регистров, бухгалтерских журналов, бланков и т.д.), где нанесение изображения на бумагу не является основным направлением - производство коробок, сумок и пакетов, футляров, письменных и прочих бумажных принадлежностей и канцелярских товаров Этот класс исключает: - печать на бумажной продукции, см. 18.1 @ru
preferred label: Производство на изделия от хартия и картон @bg
preferred label: Výroba výrobků z papíru a lepenky @cs
preferred label: Fremstilling af papir- og papvarer @da
preferred label: Herstellung von Waren aus Papier, Karton und Pappe @de
preferred label: Κατασκευή ειδών από χαρτί και χαρτόνι @el
preferred label: Fabricación de artículos de papel y de cartón @es
preferred label: Paber- ja papptoodete tootmine @et
preferred label: Paperi-, kartonki- ja pahvituotteiden valmistus @fi
preferred label: Fabrication d'articles en papier ou en carton @fr
preferred label: Papírtermék gyártása
preferred label: Fabbricazione di articoli di carta e di cartone @it
preferred label: Popieriaus ir kartoninių gaminių gamyba @lt
preferred label: Papīra un kartona izstrādājumu ražošana @lv
preferred label: Manifattura ta' oġġetti tal-karti u kartun @mt
preferred label: Vervaardiging van artikelen van papier of karton @nl
preferred label: Produksjon av varer av papir og papp @no
preferred label: Produkcja wyrobów z papieru i tektury @pl
preferred label: Fabricação de artigos de papel e de cartão @pt
preferred label: Fabricarea articolelor din hârtie şi carton @ro
preferred label: Производство изделий из бумаги и картона @ru
preferred label: Výroba výrobkov z papiera a lepenky @sk
preferred label: Proizvodnja izdelkov iz papirja in kartona @sl
preferred label: Tillverkning av pappers- och pappvaror @sv
preferred label: Kağıt ve mukavva ürünleri imalatı @tr
broader: Manufacture of paper and paper products
narrower: Manufacture of corrugated paper and paperboard and of containers of paper and paperboard
narrower: Manufacture of household and sanitary goods and of toilet requisites
narrower: Manufacture of paper stationery
narrower: Manufacture of wallpaper
narrower: Manufacture of other articles of paper and paperboard

Manufacture of corrugated paper and paperboard and of containers of paper and paperboard
type: Concept
notation: 17.21
status: valid
status modified: 2013-10-18
accepted date: 2013-10-18
in scheme: Statistical Classification of Economic Activities in the European Community, Rev. 2 (2008)
scope note: - производство на вълнообразен картон (велпапе) - производство на опаковки от хартия и вълнообразен картон (велпапе) - производство на сгъваеми опаковки от невълнообразни хартия и картон - производство на опаковки от невълнообразен плътен картон - производство на други опаковки от хартия и картон - производство на чували и торби от хартия - производство на картонени изделия за канцеларски цели, магазини или подобни - производство на пликове за писма - 17.23 - производство на отлети или пресовани изделия от хартиена маса, вкл. опаковки на гнезда за яйца - 17.29 @bg
scope note: Z: - výrobu vlnitého papíru a lepenky - výrobu obalů z vlnitého papíru a lepenky - výrobu skládacích obalů z lepenky - výrobu obalů z pevné lepenky - výrobu jiných obalů z papíru a lepenky - výrobu sáčků a pytlů z papíru - výrobu kancelářských pořadačů apod. výrobků N: - výrobu obálek (17.23) - výrobu tvarovaných nebo lisovaných výrobků z papíroviny (papírové drti) (např. krabičky na balení vajec, tištěné papírové desky (tácky) (17.29) @cs
scope note: Diese Klasse umfasst: - Herstellung von Wellpapier und -pappe - Herstellung von Verpackungsmitteln aus Wellpapier und -pappe - Herstellung von Faltschachteln aus Pappe - Herstellung von Verpackungsmitteln aus Vollpappe - Herstellung von anderen Verpackungsmitteln aus Papier, Karton und Pappe - Herstellung von Säcken und Beuteln aus Papier - Herstellung von Büroschachteln u. Ä. Diese Klasse umfasst nicht: - Herstellung von Briefumschlägen (s. 17.23) - Herstellung von aus Papierbrei geformten oder gepressten Waren (z. B. Eierschachteln, Papierteller) (s. 17.29) @de
scope note: This class includes: - manufacture of corrugated paper and paperboard - manufacture of containers of corrugated paper or paperboard - manufacture of folding paperboard containers - manufacture of containers of solid board - manufacture of other containers of paper and paperboard - manufacture of sacks and bags of paper - manufacture of office box files and similar articles This class excludes: - manufacture of envelopes, see 17.23 - manufacture of moulded or pressed articles of paper pulp (e.g. boxes for packing eggs, moulded pulp paper plates), see 17.29 @en
scope note: Esta clase comprende: - la fabricación de papel y cartón ondulados - la fabricación de embalajes de papel o cartón ondulados - la fabricación de embalajes plegables de cartón - la fabricación de embalajes de cartón duro - la fabricación de otros embalajes de papel y cartón - la fabricación de sacos y bolsas de papel - la fabricación de archivadores de cartón de oficina y artículos similares Esta clase no comprende: - la fabricación de sobres (véase 17.23) - la fabricación de artículos moldeados o prensados de pasta papelera (p. ej., cajas para el envasado de huevos, platos moldeados de pasta de papel) (véase 17.29) @es
scope note: Cette classe comprend: - la fabrication de papiers et de cartons ondulés - la fabrication d’emballages en papier ou en carton ondulé - la fabrication de cartonnages pliants - la fabrication d’emballages en carton homogène - la fabrication d’autres emballages en papier et en carton - la fabrication de sacs et de sachets en papier - la fabrication de cartonnages de bureau et d’articles similaires Cette classe ne comprend pas: - la fabrication d’enveloppes, voir 17.23 - la fabrication d’articles moulés ou pressés en pâte à papier (par exemple: cartons à œufs, plaques en pâte à papier moulées), voir 17.29 @fr
scope note: Ovaj razred uključuje: - proizvodnju valovitog papira i kartona - proizvodnju ambalaže od valovitog papira i kartona - proizvodnju složive ambalaže od papira i kartona - proizvodnju ambalaže od tvrdih ploča - proizvodnju ostale ambalaže od papira i kartona - proizvodnju vreća i vrećica od papira - proizvodnju uredskih registratora i sličnih proizvoda Ovaj razred isključuje: - proizvodnju omotnica, vidi 17.23 - proizvodnju oblikovanih i prešanih predmeta od ljepenke (npr. kartona za pakiranje jaja, oblikovanih podloga od ljepenke), vidi 17.29
scope note: Į šią klasę įeina: - gofruotojo popieriaus ir kartono gamyba - gofruotojo popieriaus ar kartono taros gamyba - sulankstomos taros iš kartono gamyba - taros iš kietojo kartono gamyba - kitos taros iš popieriaus ir kartono gamyba - popierinių krepšių ir maišų gamyba - įstaigų kartotekų dėžių ir panašių gaminių gamyba Į šią klasę neįeina: - vokų gamyba, žr. 17.23 - lietų ar presuotų gaminių iš popieriaus plaušienos (pvz., kiaušinių įpakavimo dėžučių, išlietų popierinių lėkščių) gamyba, žr. 17.29 @lt
scope note: Этот класс включает: - производство обоев и т.п., включая обои с виниловым покрытием и текстильных обоев Этот класс исключает: - производство бумаги или картона без упаковки, см. 17.12 - производство пластиковых обоев, см. 22.29 @ru
scope note: Bu sınıf aşağıdakileri kapsamaktadır; - oluklu kağıt veya oluklu mukavva imalatı, - oluklu kağıt veya oluklu mukavvadan ambalaj kutuları imalatı, - katlanabilir (bükülebilir) mukavvadan ambalaj kutuları imalatı, - kesintisiz, bütün mukavvadan ambalaj kutuları imalatı, - diğer kağıt veya mukavvadan ambalaj kutuları imalatı, - karton torba ve çanta imalatı, - büro tipi dosya kutuları ve benzeri. eşyaların imalatı. Kapsam dışı olanlar; - mektup zarflarının imalatı, bkz. 17.23, - kağıt hamurundan kalıplanmış veya preslenmiş eşya imalatı (örn. yumurta viyolü, kağıt hamurundan kalıplanmış tabakalar) bkz. 17.29. @tr
preferred label: Производство на вълнообразен картон и опаковки от хартия и картон @bg
preferred label: Výroba vlnitého papíru a lepenky, papírových a lepenkových obalů @cs
preferred label: Fremstilling af bølgepap og pap og emballage af papir og pap @da
preferred label: Herstellung von Wellpapier und -pappe sowie von Verpackungsmitteln aus Papier, Karton und Pappe @de
preferred label: Κατασκευή κυματοειδούς χαρτιού και χαρτονιού και εμπορευματοκιβωτίων από χαρτί και χαρτόνι @el
preferred label: Fabricación de papel y cartón ondulados; fabricación de envases y embalajes de papel y cartón @es
preferred label: Lainepaberi ja -papi ning paber- ja papptaara tootmine @et
preferred label: Aaltopaperin ja -pahvin sekä paperi-, kartonki- ja pahvipakkausten valmistus @fi
preferred label: Fabrication de papier et carton ondulés et d'emballages en papier ou en carton @fr
preferred label: Papír csomagolóeszköz gyártása
preferred label: Fabbricazione di carta e cartoni ondulati e di imballaggi di carta e cartone @it
preferred label: Gofruotojo popieriaus ir kartono bei taros iš popieriaus ir kartono gamyba @lt
preferred label: Gofrētā papīra un kartona ražošana; papīra un kartona taras ražošana @lv
preferred label: Manifattura ta' karta u kartun immewġa u ta' kontenituri magħmula mill-karti u l-kartun @mt
preferred label: Vervaardiging van gegolfd papier en golfkarton en van verpakkingsmateriaal van papier en karton @nl
preferred label: Produksjon av bølgepapp og emballasje av papir og papp @no
preferred label: Produkcja papieru falistego i tektury falistej oraz opakowań z papieru i tektury @pl
preferred label: Fabricação de papel e de cartão canelados e de embalagens de papel e cartão @pt
preferred label: Fabricarea hârtiei şi cartonului ondulat şi a ambalajelor din hârtie şi carton @ro
preferred label: Производство гофрированной бумаги и картона, бумажной и картонной тары @ru
preferred label: Výroba vlnitého papiera a lepenky a krabíc z papiera a lepenky @sk
preferred label: Proizvodnja valovitega papirja in kartona ter papirne in kartonske embalaže @sl
preferred label: Tillverkning av wellpapp och pappers- och pappförpackningar @sv
preferred label: Oluklu kağıt ve oluklu mukavva imalatı ile kağıt ve mukavvadan yapılan ambalaj kutuları imalatı @tr
broader: Manufacture of articles of paper and paperboard

Manufacture of household and sanitary goods and of toilet requisites
type: Concept
notation: 17.22
status: valid
status modified: 2013-10-18
accepted date: 2013-10-18
in scheme: Statistical Classification of Economic Activities in the European Community, Rev. 2 (2008)
scope note: - производство на домакински, санитарно-хигиенни и тоалетни изделия, от хартия, картон или целулозна вата: • салфетки за почистване на грим • носни кърпички, кърпички за подсушаване на ръцете, салфетки • тоалетна хартия • дамски превръзки, тампони, пелени и подобни хигиенни изделия • чаши, чинии и табли - производство на текстилна вата и артикули от нея: дамски превръзки, тампони и други - производство на целулозна вата - 17.12 @bg
scope note: Z: - výrobu domácích a osobních hygienických potřeb z papíru i z buničité vaty: • čistících papírů, papírových kapesníčků • kapesníků, ručníků a ubrousků • toaletního papíru • hygienických vložek a tamponů, plen, plenkových vložek pro malé děti • pohárků, talířků, tácků a podnosů - výrobu textilní vaty a výrobků z vaty: dámských vložek, tamponů atd. N: - výrobu buničité vaty (17.12) @cs
scope note: Diese Klasse umfasst: - Herstellung von Haushalts- und Hygieneartikeln aus Papier oder Pappe sowie von Waren aus Zellstoffwatte: • Reinigungstücher • Taschentücher, Handtücher und Servietten • Toilettenpapier • hygienische Binden und Tampons, Windeln und Windeleinlagen für Kleinkinder • Tassen, Teller und Tabletts - Herstellung von Textilwatte und Erzeugnissen aus Watte: Monatsbinden, Tampons usw. Diese Klasse umfasst nicht: - Herstellung von Zellstoffwatte (s. 17.12) @de
scope note: This class includes: - manufacture of household and personal hygiene paper and cellulose wadding products: • cleansing tissues • handkerchiefs, towels, serviettes • toilet paper • sanitary towels and tampons, napkins and napkin liners for babies • cups, dishes and trays - manufacture of textile wadding and articles of wadding: sanitary towels, tampons etc. This class excludes: - manufacture of cellulose wadding, see 17.12 @en
scope note: Esta clase comprende: - la fabricación de papel para uso doméstico e higiene personal, y de productos de guata de celulosa: • toallitas para desmaquillar • pañuelos, toallas, servilletas • papel higiénico • compresas higiénicas y tampones, pañales para bebés • vasos, platos y bandejas - la fabricación de guata y artículos textiles de guata: compresas higiénicas, tampones, etc. Esta clase no comprende: - la fabricación de guata de celulosa (véase 17.12) @es
scope note: Cette classe comprend: - la fabrication d’articles en papier ou en ouate de cellulose, à usage sanitaire et domestique: • serviettes à démaquiller • mouchoirs, essuie-mains, serviettes de table • papier hygiénique • serviettes et tampons hygiéniques, couches pour bébés • plateaux, plats, tasses et gobelets - la fabrication d’ouates de matières textiles et d’articles en ces ouates: serviettes et tampons hygiéniques Cette classe ne comprend pas: - la fabrication d’ouate de cellulose, voir 17.12 @fr
scope note: Ovaj razred uključuje: - proizvodnju proizvoda od papira za kućanstvo i osobnu higijenu te proizvoda od celulozne vate: • listića za čišćenje • rupčića, ručnika, papirnatih ubrusa • toaletnog papira • higijenskih ručnika i tampona, pelena i podložaka za dječje pelene • čaša, tanjura i poslužavnika - proizvodnju tekstilne vate i proizvoda od vate: higijenskih ručnika i tampona, itd. Ovaj razred isključuje: - proizvodnju vate od celuloze, vidi 17.12
scope note: Į šią klasę įeina: - buitinių ir asmeninės higienos popierinių ir celiuliozinės vatos dirbinių gamyba: • higieninių servetėlių • popierinių nosinių, rankšluosčių, servetėlių • tualetinio popieriaus • higieninių rankšluosčių ir tamponų, vystyklų, trikampiukų kūdikiams • puodelių, indų ir padėklų - tekstilinės vatos ir reikmenų iš vatos, pvz., higieninių rankšluosčių, tamponų ir kt., gamyba Į šią klasę neįeina: - celiuliozinės vatos gamyba, žr. 17.12 @lt
scope note: Этот класс включает: - производство этикеток - производство фильтровальной бумаги и картона - производство бумажных и картонных бобин, катушек и т.д. - производство лотков для яиц и прочих бумажных рельефных упаковочных изделий - производство мелких бумажных предметов - производство бумажных или картонных перфокарт для использования на жаккардовом ткацком станке Этот класс исключает: - производство игральных карт, см. 32.40 - производство игр и игрушек из бумаги или картона, см. 32.40 @ru
scope note: Bu sınıf aşağıdakileri kapsamaktadır; - ev eşyası ve kişisel hijyenik kağıt ve selüloz tampon ürünleri imalatı: • temizlik kağıtları, • mendiller, havlular, sofra peçeteleri, • tuvalet kağıdı, • adet bezleri ve tamponlar, çocuk bezleri ve bebek bez astarları, • kağıttan bardaklar, sofra takımları, tepsiler - tekstil vatkaları (destek ve dolgu malzemeleri) ve vatkadan ürünlerin imalatı: hijyenik havlular, tamponlar vb. Kapsam dışı olanlar; - selüloz tampon imalatı, bkz. 17.12. @tr
preferred label: Производство на домакински, санитарно-хигиенни и тоалетни изделия от хартия и картон @bg
preferred label: Výroba domácích potřeb, hygienických a toaletních výrobků z papíru @cs
preferred label: Fremstilling af husholdningsartikler og hygiejneartikler samt toiletartikler af papir og pap @da
preferred label: Herstellung von Haushalts-, Hygiene- und Toilettenartikeln aus Zellstoff, Papier und Pappe @de
preferred label: Κατασκευή ειδών οικιακής χρήσης, ειδών υγιεινής και ειδών τουαλέτας @el
preferred label: Fabricación de artículos de papel y cartón para uso doméstico, sanitario e higiénico @es
preferred label: Paberist kodu- ja hügieenitarvete ning tualettpaberi tootmine @et
preferred label: Paperisten talous- ja hygieniatarvikkeiden valmistus @fi
preferred label: Fabrication d'articles en papier à usage sanitaire ou domestique @fr
preferred label: Háztartási, egészségügyi papírtermék gyártása
preferred label: Fabbricazione di prodotti di carta e cartone per uso domestico e igienico-sanitario @it
preferred label: Buitinių ir higienos reikmenų bei tualeto reikmenų gamyba @lt
preferred label: Sadzīves, higiēnisko priekšmetu un tualetes piederumu ražošana @lv
preferred label: Manifattura ta' oġġetti tad-dar u tal-kamra tal-banju u ta' ħtiġiet tat-twaletta @mt
preferred label: Vervaardiging van huishoudelijke en sanitaire papierwaren @nl
preferred label: Produksjon av husholdnings-, sanitær- og toalettartikler av papir @no
preferred label: Produkcja artykułów gospodarstwa domowego, toaletowych i sanitarnych @pl
preferred label: Fabricação de artigos de papel para uso doméstico e sanitário @pt
preferred label: Fabricarea produselor de uz gospodăresc şi sanitar, din hârtie sau carton @ro
preferred label: Производство бумажных изделий хозяйственно-бытового и санитарно-гигиенического назначения @ru
preferred label: Výroba výrobkov pre domácnosť, hygienické a toaletné výrobky @sk
preferred label: Proizvodnja gospodinjskih, higienskih in toaletnih potrebščin iz papirja @sl
preferred label: Tillverkning av hushålls- och hygienartiklar av papper @sv
preferred label: Kağıttan yapılan ev eşyası, sıhhi ve tuvalet malzemeleri imalatı @tr
broader: Manufacture of articles of paper and paperboard

Manufacture of paper stationery
type: Concept
notation: 17.23
status: valid
status modified: 2013-10-18
accepted date: 2013-10-18
in scheme: Statistical Classification of Economic Activities in the European Community, Rev. 2 (2008)
scope note: - производство на хартия за писане и печат, готова за употреба - производство на принтерна хартия, готова за употреба - производство на автокопирна хартия, готова за употреба - производство на индиго и восъчни листа (циклостилни), готови за употреба - производство на гумирана хартия или хартия с лепилен слой, готови за употреба - производство на пликове и листа пликове за писма - производство на образователни и търговски канцеларски материали (тетрадки, бележници, регистри, счетоводни книги, квитанции), когато видът на отпечатаната информация не е определящ признак - производство на кутии, папки и други подобни, съдържащи комплекти канцеларски материали - печатане на изделия от хартия - 18.1 @bg
scope note: Z: - výrobu tiskového (tiskařského) a psacího papíru pro přímé použití - výrobu papíru pro tiskárny k počítačům pro přímé použití - výrobu samokopírovacího papíru pro přímé použití - výrobu rozmnožovacích (cyklostylových) blan a kopírovacího (uhlového) papíru pro přímé použití - výrobu lepicího papíru nebo lepicí pásky pro přímé použití - výrobu obálek a dopisních papírů - výrobu kancelářského papírnického zboží pro vzdělávání a obchod (reklamu) (zápisníky, rychlovazače, katalogy, účetní knihy, formuláře atd.), pokud tištěná informace zde není nejdůležitější - výrobu krabic, pytlíků, peněženek a psacích kompletů (příruček), obsahujících směs papírnického zboží N: - potisk výrobků z papíru (18.1) @cs
scope note: Diese Klasse umfasst: - Herstellung von gebrauchsfertigem Druck- und Schreibpapier - Herstellung von gebrauchsfertigem Papier für Computerdrucker - Herstellung von gebrauchsfertigem präpariertem Durchschreibpapier - Herstellung von gebrauchsfertigen vollständigen Dauerschablonen und Kohlepapier - Herstellung von gebrauchsfertigem gummiertem oder mit einer Klebeschicht versehenem Papier - Herstellung von Briefumschlägen und Einstückbriefen - Herstellung von Schreibwaren aus Papier oder Pappe für Ausbildung und Beruf (Hefte, Mappen, Hefter, Ordner, Register, Hauptbücher für die Buchhaltung, Vordrucke usw., sofern die aufgedruckte Information nicht das Hauptmerkmal darstellt - Herstellung von Zusammenstellungen solcher Schreibwaren in Schachteln, Taschen und ähnlichen Behältnissen Diese Klasse umfasst nicht: - Bedrucken von Papiererzeugnissen (s. 18.1) @de
scope note: This class includes: - manufacture of printing and writing paper ready for use - manufacture of computer printout paper ready for use - manufacture of self-copy paper ready for use - manufacture of duplicator stencils and carbon paper ready for use - manufacture of gummed or adhesive paper ready for use - manufacture of envelopes and letter-cards - manufacture of educational and commercial stationery (notebooks, binders, registers, accounting books, business forms etc.), when the printed information is not the main characteristic - manufacture of boxes, pouches, wallets and writing compendiums containing an assortment of paper stationery This class excludes: - printing on paper products, see 18.1 @en
scope note: Esta clase comprende: - la fabricación de papel listo para impresión y escritura - la fabricación de papel para impresora de ordenador - la fabricación de papel autocopiativo listo para su uso - la fabricación de clichés de multicopista y papel de calco listo para su uso - la fabricación de papel engomado o adhesivo listo para su uso - la fabricación de sobres y tarjetas postales - la fabricación de artículos de papelería educativos y comerciales (cuadernos, carpetas, registros, libros contables, formularios comerciales, etc.) cuando la información impresa no constituya su característica principal - la fabricación de cajas, carteras y juegos de artículos de escritorio que incluyan un surtido de material de papelería Esta clase no comprende: - la impresión en papel (véase 18.11) @es
scope note: Cette classe comprend: - la fabrication de papiers prêts à l’emploi pour l’écriture et l’imprimerie - la fabrication de papiers pour imprimantes prêts à l’emploi - la fabrication de papiers dits "autocopiants" prêts à l’emploi - la fabrication de stencils complets et de papiers carbone prêts à l’emploi - la fabrication de papiers gommés ou adhésifs - la fabrication d’enveloppes et de cartes-lettres - la fabrication d’articles de papeterie à usage scolaire et commercial (cahiers, classeurs, registres, livres comptables, formulaires commerciaux, etc.), dès lors que l’information imprimée n’est pas la finalité principale - la fabrication de boîtes, de pochettes et de présentations similaires renfermant un assortiment d’articles de correspondance Cette classe ne comprend pas: - l’impression sur des articles en papier, voir 18.1 @fr
scope note: Ovaj razred uključuje: - proizvodnju papira za tiskanje i pisanje, spremnog za upotrebu - proizvodnju tiskovnog papira za računala, spremnog za upotrebu - proizvodnju samokopirajućeg papira, spremnog za upotrebu - proizvodnju matrica za umnožavanje karbon-papira, spremnog za upotrebu - proizvodnju gumiranog i ljepivog papira, spremnog za upotrebu - proizvodnju poštanskih omotnica i pisama omotnica - proizvodnju školskog i uredskog pribora za pisanje (bilježnica, registratora, računovodstvenih knjiga, poslovih obrazaca itd.), kada tiskana informacija nije glavna karakteristika - proizvodnju kutija, vrećica i notesa koji sadrže određeni asortiman papira za pisanje Ovaj razred isključuje: - tiskanje na proizvodima od papira, vidi 18.1
scope note: Į šią klasę įeina: - paruošto naudoti spaudos ir rašomojo popieriaus gamyba - paruošto naudoti popieriaus kompiuteriniams spausdinimo įrenginiams gamyba - paruošto naudoti savaiminio kopijavimo popieriaus gamyba - popierinių kopijavimo aparatų matricų ir anglinio popieriaus (kalkės) gamyba - paruošto naudoti klijinto ir lipniojo popieriaus gamyba - vokų ir sulenkiamųjų atvirukų gamyba - mokymo priemonių ir verslui naudojamų raštinės reikmenų (sąsiuvinių, bloknotų, segtuvų, įrašų žurnalų, sąskaitybos knygų, verslo blankų ir kt.) gamyba, kai juose spausdinama informacija nėra pagrindinė charakteristika - dėžučių, krepšelių, aplankų ir rašymo rinkinių, sudarytų iš įvairių popierinių reikmenų, gamyba Į šią klasę neįeina: - spausdinimas ant popierinių gaminių, žr. 18.1 @lt
scope note: Данный раздел включает издание такой печатной продукции как газеты, книги, периодические издания, бланки, поздравительные открытки и прочие материалы, поддержку таких видов деятельности, как переплетное дело, изготовление печатных форм и обработка изображений. Сопутствующие данным видам деятельности работы составляют неотъемлемую часть печатной промышленности, а продукт (печатная форма, переплетенная книга, компьютерный диск или файл), который всегда сопровождает печатные работы, почти всегда производится при помощи таких действий. Процессы, используемые в печати, включают множество методов для передачи изображения с электронного носителя на обрабатываемые поверхности, такие как бумага, пластмасса, металл, текстильные или деревянные изделия. Основным из данных методов является метод передачи изображения с электронного носителя на поверхность путем литографической печати, гравюры, экранной печати или флексографии. Зачастую компьютерный файл отправляется напрямую ''на печать'', т.е. на печатающий механизм, чтобы создать изображение бесконтактным способом (цифровая печать или бесконтактная печать). Хотя печать и издательские работы могут выполняться на том же самом оборудовании (например, газетная продукция), все реже бывает так, что эти отдельные виды деятельности осуществляются физически в одном месте. Данный раздел также включает воспроизведение носителей записи, таких как, компакт-диски, видео записи, программное обеспечение на дисках, записи и т.д. Данный раздел не включает издательскую деятельность (см. секцию J). @ru
scope note: Bu sınıf aşağıdakileri kapsamaktadır; - kullanıma hazır basım ve yazım kağıdı imalatı, - bilgisayar çıktısı için kullanılacak kağıt imalatı, - kullanıma hazır kopya kağıdı imalatı, - kullanıma hazır karbon kağıdı, mumlu teksir kağıdı imalatı, - kullanıma hazır zamklı ya da yapışkan kağıt imalatı, - zarf ve kartpostal imalatı, -ana niteliği bilgi içermeyen, eğitim ve ticari kırtasiye malzemeleri (defterler, dosyalar, klasörler, kayıt defterleri, muhasebe defterleri, iş formları vb.) imalatı, - kağıt kırtasiye ürünlerinden olan kutu, kese, cüzdan ve bir kağıt kırtasiye türü içeren yazı malzemelerinin imalatı. Kapsam dışı olanlar; - kağıt ürünleri üzerine basım, bkz. 18.1. - hassaslaştırılmış fotoğrafçılık kağıtları, bkz. 20.59. @tr
preferred label: Производство на канцеларски материали от хартия и картон @bg
preferred label: Výroba kancelářských potřeb z papíru @cs
preferred label: Fremstilling af kontorartikler af papir @da
preferred label: Herstellung von Schreibwaren und Bürobedarf aus Papier, Karton und Pappe @de
preferred label: Κατασκευή ειδών χαρτοπωλείου (χαρτικά) @el
preferred label: Fabricación de artículos de papelería @es
preferred label: Paberist kirjatarvete tootmine @et
preferred label: Paperikauppatavaroiden valmistus @fi
preferred label: Fabrication d'articles de papeterie @fr
preferred label: Irodai papíráru gyártása
preferred label: Fabbricazione di prodotti cartotecnici @it
preferred label: Popierinių raštinės reikmenų gamyba @lt
preferred label: Rakstāmpapīra ražošana @lv
preferred label: Manifattura ta' kartolerija tal-karti @mt
preferred label: Vervaardiging van kantoorbenodigdheden van papier @nl
preferred label: Produksjon av kontorartikler av papir @no
preferred label: Produkcja artykułów piśmiennych @pl
preferred label: Fabricação de artigos de papel para papelaria @pt
preferred label: Fabricarea articolelor de papetărie @ro
preferred label: Производство писчебумажных изделий @ru
preferred label: Výroba papiernických potrieb @sk
preferred label: Proizvodnja pisarniških potrebščin iz papirja @sl
preferred label: Tillverkning av skrivpapper, kuvert o.d. @sv
preferred label: Kağıt kırtasiye ürünleri imalatı @tr
broader: Manufacture of articles of paper and paperboard

Manufacture of wallpaper
type: Concept
notation: 17.24
status: valid
status modified: 2013-10-18
accepted date: 2013-10-18
in scheme: Statistical Classification of Economic Activities in the European Community, Rev. 2 (2008)
scope note: - производство на тапети и подобни стенни облицовки, вкл. покрити с винил и стенни облицовки от текстилни материали - производство на хартия или картон на роли и на листа с големи размери - 17.12 - производство на самозалепващи стенни облицовки от пластмаси - 22.29 @bg
scope note: Z: - výrobu tapet a podobných krytin na zeď včetně tapet potahovaných vinylem a textilních tapet N: - výrobu papíru nebo kartonu a lepenky velkých rozměrů (17.12) - výrobu tapet z plastů (22.29) @cs
scope note: Diese Klasse umfasst: - Herstellung von Tapeten und ähnlichen Wandverkleidungen einschließlich vinylbeschichteter und textiler Wandverkleidungen Diese Klasse umfasst nicht: - Herstellung von nichtzugeschnittenem Papier, Karton und Pappe (s. 17.12) - Herstellung von Kunststofftapeten (s. 22.29) @de
scope note: This class includes: - manufacture of wallpaper and similar wall coverings, including vinyl-coated and textile wallpaper This class excludes: - manufacture of paper or paperboard in bulk, see 17.12 - manufacture of plastic wall paper, see 22.29 @en
scope note: Esta clase comprende: - la fabricación de papeles pintados y otros revestimientos similares para paredes, incluido el papel con un baño de vinilo y el papel textil Esta clase no comprende: - la fabricación de papel y cartón en bruto (véase 17.12) - la fabricación de papeles pintados de plástico (véase 22.29) @es
scope note: Cette classe comprend: - la fabrication de papiers peints et de revêtements muraux similaires, y compris les papiers peints enduits de vinyle et textiles Cette classe ne comprend pas: - la fabrication de papiers ou de cartons en gros, voir 17.12 - la fabrication de papiers peints en matières plastiques, voir 22.29 @fr
scope note: Ovaj razred uključuje: - proizvodnju zidnih tapeta i sličnih zidnih obloga, uključujući one prevučene plastikom i tekstilne zidne tapete Ovaj razred isključuje: - proizvodnju papira i kartona u rasutom stanju, vidi 17.12 - proizvodnju plastičnih zidnih tapeta, vidi 22.29
scope note: Į šią klasę įeina: - sienų apmušalų ir panašių sienų dangų, įskaitant vinilu padengtus ir tekstilinius sienų apmušalus, gamyba Į šią klasę neįeina: - nepakuoto popieriaus ar kartono gamyba, žr. 17.12 - plastikinių sienų apmušalų gamyba, žr. 22.29 @lt
scope note: Данная группа включает издание такой печатной продукции как газеты, книги, периодические издания, бланки, поздравительные открытки и прочие материалы, поддержку таких видов деятельности, как переплетное дело, изготовление печатных форм и обработка изображений. Печать выполняется при применении различных технологий и на различных материалах. @ru
scope note: Bu sınıf aşağıdakileri kapsamaktadır; - vinil (sentetik) kaplı duvar kağıdı ve tekstil duvar kağıdı dahil duvar kağıdı ve benzer duvar kaplayıcıların imalatı. Kapsam dışı olanlar; - büyük hacimlerde kağıt ve mukavva imalatı, bkz. 17.12, - plastik duvar kağıdı imalatı, bkz. 22.29. @tr
preferred label: Производство на тапети и подобни стенни облицовки @bg
preferred label: Výroba papírových tapet @cs
preferred label: Fremstilling af tapet @da
preferred label: Herstellung von Tapeten @de
preferred label: Κατασκευή χαρτιού για επενδύσεις τοίχων (ταπετσαρίες) @el
preferred label: Fabricación de papeles pintados @es
preferred label: Tapeeditootmine @et
preferred label: Tapettien valmistus @fi
preferred label: Fabrication de papiers peints @fr
preferred label: Tapétagyártás
preferred label: Fabbricazione di carta da parati @it
preferred label: Sienų apmušalų (tapetų) gamyba @lt
preferred label: Tapešu ražošana @lv
preferred label: Manifattura ta' karta tal-ħajt @mt
preferred label: Vervaardiging van behangpapier @nl
preferred label: Produksjon av tapeter @no
preferred label: Produkcja tapet @pl
preferred label: Fabricação de papel de parede @pt
preferred label: Fabricarea tapetului @ro
preferred label: Производство обоев @ru
preferred label: Výroba tapiet @sk
preferred label: Proizvodnja tapet @sl
preferred label: Tapettillverkning @sv
preferred label: Duvar kağıdı imalatı @tr
broader: Manufacture of articles of paper and paperboard

Manufacture of other articles of paper and paperboard
type: Concept
notation: 17.29
status: valid
status modified: 2013-10-18
accepted date: 2013-10-18
in scheme: Statistical Classification of Economic Activities in the European Community, Rev. 2 (2008)
scope note: - производство на етикети - производство на филтърни хартия и картон - производство на барабани, макари, масури и други подобни, от хартия и картон - производство на отлети или пресовани изделия от хартиена маса, вкл. опаковки с гнезда за яйца - производство на изделия за празненства, карнавали и други развлечения, от хартия и картон - производство на перфорирани хартии и картони за жакардови машини - производство на карти за игра - 32.40 - производство на игри и играчки от хартия и картон - 32.40 @bg
scope note: Z: - výrobu nálepek - výrobu filtračních papírů a lepenky - výrobu papírových a lepenkových cívek, vřeten a špulek atd. - výrobu proložek pro přepravu vajec a jiných obalových výrobků z papírové vlákniny atd. - výrobu papírových novinek - výrobu karet z papíru nebo lepenky pro použití na žakárových strojích N: - výrobu hracích karet (32.40) - výrobu her a hraček z papíru nebo lepenky (32.40) @cs
scope note: Diese Klasse umfasst: - Herstellung von Etiketten - Herstellung von Filterpapier und -pappe - Herstellung von Rollen, Spulen usw. aus Papier oder Pappe - Herstellung von Eierschachteln und sonstigen Verpackungsmitteln aus Höckerpappe usw. - Herstellung von Dekorations- und Unterhaltungsartikel aus Papier - Herstellung von Papier- oder Pappkarten zum Einsatz in Jacquardmaschinen Diese Klasse umfasst nicht: - Herstellung von Spielkarten (s. 32.40) - Herstellung von Spielen und Spielzeug aus Papier oder Pappe (s. 32.40) @de
scope note: This class includes: - manufacture of labels - manufacture of filter paper and paperboard - manufacture of paper and paperboard bobbins, spools, cops etc. - manufacture of egg trays and other moulded pulp packaging products etc. - manufacture of paper novelties - manufacture of paper or paperboard cards for use on Jacquard machines This class excludes: - manufacture of playing cards, see 32.40 - manufacture of games and toys of paper or paperboard, see 32.40 @en
scope note: Esta clase comprende: - la fabricación de etiquetas - la fabricación de papel y cartón filtrantes - la fabricación de tambores, bobinas, canillas, etc. de papel y cartón - la fabricación de embalajes alveolares de pasta de papel para huevos y otros productos similares, etc. - la fabricación de artículos promocionales y de regalo de papel - la fabricación de tarjetas de papel o cartón para máquinas Jacquard Esta clase no comprende: - la fabricación de cartas para juegos de mesa (véase 32.40) - la fabricación de juegos y juguetes de papel y cartón (véase 32.40) @es
scope note: Cette classe comprend: - la fabrication d’étiquettes - la fabrication de papier-filtre et de carton-filtre - la fabrication de tambours, de bobines, de busettes, de canettes, etc., en papier et en carton - la fabrication d’emballages pour œufs et d’autres articles moulés en pâte à papier, pour l’emballage - la fabrication de gadgets en papier - la fabrication de cartes en papier ou en carton pour mécaniques Jacquard Cette classe ne comprend pas: - la fabrication de cartes à jouer, voir 32.40 - la fabrication de jeux et de jouets en papier ou en carton, voir 32.40 @fr
scope note: Ovaj razred uključuje: - proizvodnju etiketa - proizvodnju filtar-papira i kartona - proizvodnju bobina, „špula", poklopaca itd., od papira i kartona - proizvodnju kutija za jaja i drugih proizvoda za pakiranje od prešanoga kartona itd. - proizvodnju noviteta od papira - proizvodnju kartica od papira ili kartona za uporabu u žakard-strojevima Ovaj razred isključuje: - proizvodnju igraćih karata, vidi 32.40 - proizvodnju igara i igračaka od papira i kartona, vidi 32.40
scope note: Į šią klasę įeina: - žymenų gamyba - filtravimo popieriaus ir kartono gamyba - popierinių ir kartoninių tūtelių, ričių, šeivų ir kt., gamyba - kiaušindėčių ir kitokių įpakavimo gaminių, išlietų iš plaušienos, gamyba - popierinių niekučių gamyba - žakardo mašinų popierinių ar kartoninių kortų gamyba Į šią klasę neįeina: - lošimo kortų gamyba, žr. 32.40 - popierinių ar kartoninių žaidimų ir žaislų gamyba, žr. 32.40 @lt
scope note: Этот класс также включает: - печать прочих периодических изданий, выходящих, по крайней мере, четыре раза в неделю Этот класс исключает: - публикацию печатных материалов, см. 58.1 - копирование/снятие копий с документов, см. 82.19 @ru
scope note: Bu sınıf aşağıdakileri kapsamaktadır; - basılmış olsun veya olmasın etiket imalatı, - filtreli kağıt ve karton imalatı, - kağıt ve karton bobinler, makaralar, masuralar vb. imalatı, - yumurta viyolü ve diğer şekil verilmiş kağıt hamurundan ambalaj ürünleri vb. imalatı, - kağıttan hediyelik ve süs eşyaları imalatı, - Jakar makinelerinde kullanmak için kağıt veya mukavva kartları imalatı. Kapsam dışı olanlar; - iskambil kağıdı imalatı, bkz. 32.40, - kağıt ve mukavvadan oyun ve oyuncak imalatı, bkz. 32.40. @tr
preferred label: Производство на други изделия от хартия и картон @bg
preferred label: Výroba ostatních výrobků z papíru a lepenky @cs
preferred label: Fremstilling af andre papir- og papvarer @da
preferred label: Herstellung von sonstigen Waren aus Papier, Karton und Pappe @de
preferred label: Κατασκευή άλλων ειδών από χαρτί και χαρτόνι @el
preferred label: Fabricación de otros artículos de papel y cartón @es
preferred label: Muude paber- ja papptoodete tootmine @et
preferred label: Muiden paperi-, kartonki- ja pahvituotteiden valmistus @fi
preferred label: Fabrication d'autres articles en papier ou en carton @fr
preferred label: Egyéb papír-, kartontermék gyártása
preferred label: Fabbricazione di altri articoli di carta e cartone @it
preferred label: Kitų popierinių ir kartoninių gaminių gamyba @lt
preferred label: Cita veida papīra un kartona izstrādājumu ražošana @lv
preferred label: Manifattura ta' oġġetti oħra tal-karti u l-kartun @mt
preferred label: Vervaardiging van andere artikelen van papier of karton @nl
preferred label: Produksjon av varer av papir og papp ellers @no
preferred label: Produkcja pozostałych wyrobów z papieru i tektury @pl
preferred label: Fabricação de outros artigos de papel e de cartão @pt
preferred label: Fabricarea altor articole din hârtie şi carton n.c.a. @ro
preferred label: Производство прочих изделий из бумаги и картона @ru
preferred label: Výroba ostatných výrobkov z papiera a lepenky @sk
preferred label: Proizvodnja drugih izdelkov iz papirja in kartona @sl
preferred label: Tillverkning av andra pappers- och pappvaror @sv
preferred label: Kağıt ve mukavvadan diğer ürünlerin imalatı @tr
broader: Manufacture of articles of paper and paperboard

Printing and reproduction of recorded media
type: Concept
notation: 18
status: valid
status modified: 2013-10-18
accepted date: 2013-10-18
in scheme: Statistical Classification of Economic Activities in the European Community, Rev. 2 (2008)
scope note: отпечатване на книги, вестници, периодични издания, бизнес формуляри, поздравителни картички и други материали. Включва още свързаните спомагателни дейности: подвързване, изработване на клишета (печатни форми) и изображения. Тези дейности са неразделна част от печатането и техните продукти са: печатна форма, подвързана книга, компютърен диск или файл. Процесите, използвани при печатната дейност, включват много различни методи за пренасяне на оригинала върху печатната форма, на растерното изображение, компютърните данни върху други носители: хартия, пластмаси, метал или дърво. Най-често използваните методи са литографски, дълбок, сито- и флексопечат. При създаването на образа често се използва компютърният файл, който директно управлява печатния механизъм, електростатичното или друг тип оборудване (дигитален или цифров печат). Действително има единици, които осъществяват едновременно печатна и издателска дейност (например вестници), но тези случаи все повече намаляват, тъй като посочените дейности са различни и не се осъществяват от една и съща единица. възпроизвеждане на записани носители: компактдискове (CD), видеозаписи, стандартен (системен или приложен) софтуер и данни от оригинал върху разнообразни дискове и ленти. - издателска дейност - сектор J „Създаване и разпространение на информация и творчески продукти; далекосъобщения“ @bg
scope note: Tento oddíl zahrnuje tisk novin, knih, periodik (časopisů, magazínů), obchodních formulářů, pohlednic a jiných materiálů a s tím související činnosti, např. vazbu knih, výrobu tiskových desek a snímání dat. Související činnosti zde zahrnuté jsou nedílnou součástí polygrafického průmyslu a produkt (tisková deska, vázaná kniha, počítačový disk nebo záznam), který je nedílnou součástí tiskařského průmyslu, je téměř vždy podmíněn těmito operacemi. Výrobní postupy používané v polygrafii zahrnují různé metody pro přenos obrazu z desek, obrazovky nebo počítačových záznamů na média jako je papír, plast, kov, textilie nebo dřevo. Nejvýznačnější z těchto metod je přenos obrazu z desek nebo štočků na médium prostřednictvím litografie, hlubotisku, sítotisku nebo flexografie. Často se také využívá počítačového záznamu pro účely přímého řízení mechanizmu tisku, elektrostatického nebo jiného zařízení pro přímé vytvoření obrazu (digitální nebo bezdotykový tisk). Ačkoliv tisk a vydavatelství mohou být prováděny stejnou jednotkou (např. noviny), stále méně a méně případů odlišných aktivit je prováděných na (fyzicky) stejném místě. Tento oddíl zahrnuje také rozmnožování nahraných nosičů, jako kompaktních disků, videozáznamů nebo softwaru na discích, páskách, deskách atd. Tento oddíl nezahrnuje podnikání v nakladatelství (sekce J). @cs
scope note: Diese Abteilung umfasst Drucken von Erzeugnissen wie Zeitungen, Zeitschriften, Bücher, Geschäftsvordrucke, Grußkarten usw. und beinhaltet auch Unterstützungstätigkeiten wie Buchbinderei, Klischeeherstellung und Data Imaging. Die hier eingeordneten Unterstützungstätigkeiten sind integraler Bestandteil der Herstellung von Druckerzeugnissen, und ein Erzeugnis (Druckplatte, Computer-Speicherplatte oder -datei), das integraler Bestandteil der Herstellung von Druckerzeugnissen ist, wird fast immer im Rahmen dieser Tätigkeiten hergestellt. Die beim Drucken angewandten Verfahren beinhalten eine Reihe von Techniken zur Bildübertragung von Platten, Rastern oder Computerdateien auf andere Medien wie Papier, Kunststoff, Metall, Textilien oder Holz. Am häufigsten ist die Bildübertragung von Platten oder Rastern auf das Medium (Lithografie, Tief-, Sieb- und Flexodruck). Häufig dient die Computerdatei auch dazu, den Druckmechanismus, eine elektrostatische oder eine sonstige Vorrichtung unmittelbar zu steuern, um ein Bild zu erzeugen (digitaler oder anschlagfreier Druck). Zwar können Drucken und Verlegen in der gleichen Einheit erfolgen, doch geht der Trend dahin, dass diese verschiedenen Tätigkeiten nicht in der gleichen Arbeitsstätte ausgeführt werden. Diese Abteilung umfasst auch die Vervielfältigung bespielter Datenträger, z. B. CDs, Videoaufzeichnungen oder Software auf Bändern, Platten usw. Nicht zu dieser Abteilung gehört das Verlagswesen (s. Abschnitt J) @de
scope note: This division includes printing of products, such as newspapers, books, periodicals, business forms, greeting cards, and other materials, and associated support activities, such as bookbinding, plate-making services, and data imaging. The support activities included here are an integral part of the printing industry, and a product (a printing plate, a bound book, or a computer disk or file) that is an integral part of the printing industry is almost always provided by these operations. Processes used in printing include a variety of methods for transferring an image from a plate, screen or computer file to a medium, such as paper, plastics, metal, textile articles, or wood. The most prominent of these methods entails the transfer of the image from a plate or screen to the medium through lithographic, gravure, screen or flexographic printing. Often a computer file is used to directly ''drive'' the printing mechanism to create the image or electrostatic and other types of equipment (digital or non-impact printing). Though printing and publishing can be carried out by the same unit (a newspaper, for example), it is less and less the case that these distinct activities are carried out in the same physical location. This division also includes the reproduction of recorded media, such as compact discs, video recordings, software on discs or tapes, records etc. This division excludes publishing activities (see section J). @en
scope note: Esta división comprende la impresión de periódicos, libros, publicaciones periódicas, impresos comerciales, tarjetas de felicitación y otros materiales impresos, y las actividades complementarias asociadas, como la encuadernación, los servicios de fotograbado y la representación en imágenes de los datos. Las actividades complementarias incluidas aquí forman parte integrante de la industria de la impresión y estas operaciones en casi todos los casos ofrecen un producto (una plancha para impresión, un libre encuadernado o un disco o fichero informático) que forma parte integrante de la industria de las artes gráficas. Entre los procedimientos que se utilizan en las artes gráficas se encuentran una serie de métodos de transferencia de imágenes desde una plancha, pantalla o fichero informático a un soporte, como papel, plástico, metal, artículos textiles o madera. Los métodos más importantes consisten en la transferencia de la imagen desde una plancha o pantalla al soporte por medio de la litografía, el huecograbado, la serigrafía o la flexografía. Aunque una sola unidad puede realizar la impresión y la edición (un periódico, por ejemplo), cada vez es menos frecuente que se lleven a cabo estas actividades diferenciadas en la misma ubicación física. Esta división comprende también la reproducción de soportes grabados, como discos compactos, grabaciones de vídeo y programas informáticos en discos o cintas, etc. Esta división no comprende las actividades de edición (véase la sección J). @es
scope note: Cette division concerne l’impression de produits tels que journaux, livres, périodiques, formulaires commerciaux, cartes de vœux et autres matériaux et recouvre également des activités accessoires telles que les services de reliure, de photogravure et de photocomposition. Les activités accessoires incluses ici font partie intégrante de l’imprimerie et un produit (une plaque d’impression, un livre relié ou un fichier ou disque informatique) issu de cette industrie est presque toujours obtenu à partir de ces opérations. Les procédés utilisés dans l’imprimerie comprennent une variété de méthodes servant à transférer une image d’une plaque, d’un écran ou d’un fichier informatique sur un support en papier, en plastique, en métal, en tissu ou en bois. La principale de ces méthodes consiste à transférer l’image d’une plaque ou d’un écran sur le support (lithographie, photogravure, sérigraphie et flexographie). Un fichier informatique est souvent utilisé pour "piloter" directement le mécanisme d’impression qui crée l’image et de nouveaux types d’équipements électrostatiques ou autres (impression numérique ou sans impact). Bien que l’impression et l’édition puissent être réalisées par la même unité (par exemple, un journal), il arrive de moins en moins que ces deux activités distinctes soient effectuées au même endroit. Cette division comprend également la reproduction de supports enregistrés, tels que disques compact, enregistrements vidéo, logiciels sur disques ou sur bandes, enregistrements, etc. Cette division ne comprend pas l’édition (voir section J). @fr
scope note: Ovaj odjeljak uključuje tiskanje proizvoda kao što su novine, knjige, periodične publikacije, poslovni obrasci, čestitke i drugi materijali te obavlja pripadajuće pomoćne djelatnosti kao što su uvezivanje knjiga, izrada tiskarske forme i prikazivanje podataka. Pomoćne djelatnosti koje su ovdje uključene čine integralni dio tiskarske industrije, a proizvodi (tiskarska ploča, uvezena knjiga, CD ili datoteka) su sastavni dio te industrije i gotovo uvijek nastaju kao rezultat tih operacija. Proizvodni procesi pri tiskanju uključuju različite metode za prenošenje zapisa s ploče, platna ili računalne datoteke na neki medij kao što je papir, plastika, metal, tekstilni predmet ili drvo. Najistaknutije od tih metoda zahtijevaju prijenos zapisa s ploče ili platna na medij s pomoću litografskog tiskanja, gravure, tiskanja na platno i fleksografskog tiskanja. Često puta se računalna datoteka koristi za izravno pokretanje mehanizma za tiskanje kako bi se stvorila slika ili elektrostatika te ostalih vrsta opreme (digitalni ili nemehanički pisač). Iako se tiskanje i izdavanje mogu izvoditi u istoj jedinici (novine, na primjer), sve je rjeđe slučaj da se te različite djelatnosti obavljaju na istoj lokaciji. Ovaj odjeljak također uključuje umnožavanje snimljenih zapisa kao što su CD i DVD, videozapisi, softver na disku ili kaseti, ploče, itd. Ovaj odjeljak isključuje izdavačke djelatnosti (vidi područje J).
scope note: Į šį skyrių įeina produkcijos, tokios kaip laikraščiai, knygos, periodiniai leidiniai, verslo blankai, sveikinimo atvirukai ir kitokios medžiagos, spausdinimas ir su spausdinimu susijusi veikla, tokia kaip knygų įrišimas, spausdinimo formų gamyba ir kompiuterinių vaizdų atgaminimas. Čia įeinanti su spausdinimu susijusi veikla ir jos tiekiama produkcija (spausdinimo forma, įrišta knyga ar kompiuterinis diskas arba rinkmena) yra neatsiejama spausdinimo veiklos dalis ir beveik visada yra teikiama kaip sudėtinė jos dalis. Spausdinimo proceso metu perkelti vaizdui iš spausdinimo formų, trafareto ar kompiuterinės rinkmenos į tam tikras laikmenas, tokias kaip popierius, plastikas, metalas, tekstilės gaminiai ar mediena, taikomi įvairūs metodai. Labiausiai iš šių metodų paplitęs vaizdo perkėlimas iš spausdinimo formų ar trafareto į atitinkamą terpę, atliekant litografinį, fotograviūrinį, trafaretinį ir fleksografinį spausdinimą. Dažnai kompiuterio rinkmena naudojama tiesiogiai valdyti spausdinimo mechanizmą vaizdui sukurti ar elektrostatinę ir kitos rūšies (skaitmeninio ar nesmūginio spausdinimo) įrangą. Nors tas pats gamybos vienetas gali užsiimti spausdinimu ir leidyba (pvz., laikraščių), tačiau tokių atvejų, kai šios skirtingos veiklos rūšys atliekamos toje pačioje fizinėje buveinėje, sparčiai mažėja. Į šį skyrių taip pat įeina įrašytų laikmenų, tokių kaip kompaktiniai diskai, vaizdo įrašai, diskai ar magnetinės juostos su programine įranga, garso įrašai ir kt., tiražavimas. Į šį skyrių neįeina leidybos veikla (žr. J sekciją). @lt
scope note: Этот класс включает: - печать журналов и прочих периодических изданий, выходящих менее четырех раз в неделю - печать книг и брошюр, музыкальных нот, карт, атласов, плакатов, рекламных каталогов, проспектов и прочей печатной рекламной продукции, почтовых марок, налоговых форм, титульных документов, чеков и прочих ценных бумаг, смарт-карт, альбомов, дневников, календарей и прочей офисной печатной продукции, персональных канцелярских бланков на машине высокой печати, офсетным способом, способом фотогравюры, флексографии, печати с экрана и т.д., печати на копировальных машинах, компьютерных принтерах, устройстве для изготовления рельефных знаков на гуммированной ленте и т.д., включая моментальную печать - печать прямо на текстильных изделиях, пластике, стекле, металле, дереве и керамике Печатаются, как правило, материалы, защищенные авторским правом. Этот класс также включает: - печать этикеток или ярлыков (литография, гравюрная печать, флексография и т.д.) Этот класс исключает: - шелкотрафаретную печать на текстильных изделиях и одежде, см. 13.30 - производство канцелярских товаров (тетрадей, общих тетрадей, регистров, бухгалтерских журналов, бланков и т.д.), где нанесение изображения на бумагу не является основным направлением, см. 17.23 - публикацию печатных материалов, см. 58.1 @ru
scope note: Bu bölüm, gazetelerin, kitapların, mecmuaların, iş formlarının, tebrik kartlarının, ve diğer materyallerin basılmasını ve ciltçilik, madeni baskı kalıbı yapılması ve veri görüntüleme gibi ortak destekleyici faaliyetleri kapsamaktadır. Bu bölümde kapsanan destekleyici faaliyetler basım sanayiinin ayrılmaz bir parçasıdır ve basım sanayinin entegre bir parçası olan bir ürün (bir baskı levhası, kitap cildi ya da bilgisayar diski ya da dosyası) hemen hemen her zaman bu işlemler sonucunda elde edilir. Basımda kullanılan süreçler; baskı kalıbında, ekranda, ya da bilgisayar dosyasında yer alan bir görüntünün kağıt, plastik, metal, tekstil ürünleri ya da ahşap üzerine baskısını sağlayan değişik yöntemleri içermektedir. Bu yöntemlerin en çok bilineni, görüntünün baskı kalıbından ya da ekrandan litografik baskı(taş baskı), klişe baskı, ekran baskısı, fleksografik baskı (esnek kauçuk ya da plastiğe yapılan baskı) kullanılarak bir ortama baskı yapılmasıdır. Görüntü veya elektrostatik ve diğer tiplerde teçhizatları (dijital veya vuruşsuz baskı) oluşturmak için doğrudan basım sürecinin yürütülmesinde genellikle bir bilgisayar dosyası kullanılmaktadır. Basım ve yayım faaliyetleri aynı birim tarafından yürütülebilmesine karşın (bir gazete örneğin) bu farklı faaliyetler aynı fiziksel ortamda yürütülmesi giderek azalmaktadır.. Bu bölüm ayrıca kompakt diskler, video kayıtları, diskler ve kasetler üzerine yapılan yazılımlar, kayıtlar vb. gibi kayıtlı medyanın çoğaltılmasını kapsamaktadır. Bu bölüm, yayım faaliyetlerini hariç tutmaktadır (bkz. Kısım J). @tr
preferred label: Печатна дейност и възпроизвеждане на записани носители @bg
preferred label: Tisk a rozmnožování nahraných nosičů @cs
preferred label: Trykning og reproduktion af indspillede medier @da
preferred label: Herstellung von Druckerzeugnissen; Vervielfältigung von bespielten Ton-, Bild- und Datenträgern @de
preferred label: Εκτυπώσεις και αναπαραγωγή προεγγεγραμμένων μέσων @el
preferred label: Artes gráficas y reproducción de soportes grabados @es
preferred label: Trükindus ja salvestiste paljundus @et
preferred label: Painaminen ja tallenteiden jäljentäminen @fi
preferred label: Imprimerie et reproduction d'enregistrements @fr
preferred label: Nyomdai és egyéb sokszorosítási tevékenység
preferred label: Stampa e riproduzione su supporti registrati @it
preferred label: Spausdinimas ir įrašytų laikmenų tiražavimas @lt
preferred label: Poligrāfija un ierakstu reproducēšana @lv
preferred label: Stampar u riproduzzjoni ta' midja rreġistrata @mt
preferred label: Drukkerijen, reproductie van opgenomen media @nl
preferred label: Trykking og reproduksjon av innspilte opptak @no
preferred label: Poligrafia i reprodukcja zapisanych nośników informacji @pl
preferred label: Impressão e reprodução de suportes gravados @pt
preferred label: Tipărire şi reproducerea pe suporţi a înregistrărilor @ro
preferred label: Печать и воспроизведение записанных материалов @ru
preferred label: Tlač a reprodukcia záznamových médií @sk
preferred label: Tiskarstvo in razmnoževanje posnetih nosilcev zapisa @sl
preferred label: Grafisk produktion och reproduktion av inspelningar @sv
preferred label: Kayıtlı medyanın basılması ve çoğaltılması @tr
broader: MANUFACTURING
narrower: Printing and service activities related to printing
narrower: Reproduction of recorded media

Printing and service activities related to printing
type: Concept
notation: 18.1
status: valid
status modified: 2013-10-18
accepted date: 2013-10-18
in scheme: Statistical Classification of Economic Activities in the European Community, Rev. 2 (2008)
scope note: печатане на следните продукти: вестници, книги, периодични издания, бизнес формуляри, поздравителни картички и други. Включва още свързаните спомагателни дейности: подвързване на книги, дейности по изработване на печатната форма и изображения. Печатането се извършва чрез използване на разнообразни технологии и различни материали. @bg
scope note: Tato skupina zahrnuje tisk výrobků jako novin, časopisů, knih, obchodních formulářů, pohlednic a jiných materiálů a zahrnuje také související činnosti s tím spojené jako vazbu knih, výrobu (tiskových desek) štočků a zobrazování dat (data imaging). Tisk může být prováděn za použití rozdílných technik a na různé materiály. @cs
scope note: Diese Gruppe umfasst das Drucken von Erzeugnissen wie Zeitungen, Zeitschriften, Bücher, Geschäftsdrucksachen, Grußkarten usw. und beinhaltet auch Unterstützungstätigkeiten wie Buchbinderei, Klischeeherstellung und Data Imaging. Das Drucken kann mit unterschiedlichen Verfahren auf unterschiedliche Materialien erfolgen. @de
scope note: This group includes printing of products, such as newspapers, books, periodicals, business forms, greeting cards, and other materials, and associated support activities, such as bookbinding, plate-making services, and data imaging. Printing can be done using various techniques and on different materials. @en
scope note: Este grupo comprende la impresión de periódicos, libros, publicaciones periódicas, impresos comerciales, tarjetas de felicitación y otros materiales impresos, y las actividades complementarias asociadas, como la encuadernación, los servicios de fotograbado y la representación en imágenes de los datos. La impresión puede realizarse utilizando diversas técnicas y en distintos materiales. @es
scope note: Ce groupe concerne l’impression de produits tels que journaux, livres, périodiques, formulaires commerciaux, cartes de vœux et autres matériaux et recouvre également des activités accessoires telles que les services de reliure, de photogravure et de photocomposition. L’imprimerie peut faire appel à des techniques variées et à différents types de matériaux. @fr
scope note: Ova skupina uključuje tiskarske proizvode kao što su novine, knjige, periodične publikacije, poslovni obrasci, čestitke i ostali materijali te pripadajuće pomoćne djelatnosti kao što su uvezivanje knjiga, izrada tiskarske forme i prikazivanje podataka. Tiskanje se može vršiti koristeći se različitim tehnikama te na različitim materijalima.
scope note: Į šią grupę įeiną tokių produktų, kaip laikraščiai, knygos, periodiniai leidiniai, verslo blankai, sveikinimo atvirukai ir kitokie spaudiniai, spausdinimas ir su spausdinimu susijusi veikla, tokia kaip knygų įrišimas, spausdinimo formų gamyba ir kompiuterinių vaizdų atgaminimas. Spausdinimas gali būti atliekamas naudojant įvairius būdus ir ant skirtingų medžiagų. @lt
scope note: Этот класс включает: - составление, набор текста, фотонабор, допечатную подготовку данных, включая сканирование и оптическое распознавание символов/текста, электронный набор - подготовку данных для различных средств информации (печать на бумаге, CD-ROM, Интернет) - изготовление печатных форм, включая разработку изображений (для машин высокой и офсетной печати) - подготовку цилиндров: гравировку цилиндров для глубокой печати - обработку копии на печатной пластине: «с компьютера на пластину» (также фотополимерные пластины) - подготовку пластин и клише для рельефной штамповки или печати - подготовку: • художественных работ технического плана, таких как литографические стенды и деревянные блоки • средств для презентаций, напр., прозрачные слайды и прочие формы презентации • набросков, разметок, эскизов и т.д. • производство корректурных оттисков Этот класс исключает: - работы по проведению специализированного дизайна, см. 74.10 @ru
scope note: Bu grup, gazetelerin, kitapların, mecmuaların, iş formlarının, tebrik kartlarının ve diğer ürünlerin basılmasını ve ciltçilik, madeni baskı kalıbı yapılması, ve veri görüntüleme gibi ortak destekleyici faaliyetleri kapsamaktadır. Matbaacılık bir çok değişik teknik kullanılarak ve bir çok değişik malzeme üzerine yapılabilir. @tr
preferred label: Печатна дейност @bg
preferred label: Tisk a činnosti související s tiskem @cs
preferred label: Trykning og serviceydelser i forbindelse hermed @da
preferred label: Herstellung von Druckerzeugnissen @de
preferred label: Εκτυπωτικές και συναφείς δραστηριότητες @el
preferred label: Artes gráficas y servicios relacionadas con las mismas @es
preferred label: Trükindus ja selle sidusalad @et
preferred label: Painaminen ja siihen liittyvät palvelut @fi
preferred label: Imprimerie et services annexes @fr
preferred label: Nyomdai tevékenység
preferred label: Stampa e servizi connessi alla stampa @it
preferred label: Spausdinimas ir su spausdinimu susijusios paslaugos @lt
preferred label: Poligrāfija un ar to saistītas palīgdarbības @lv
preferred label: Attivitajiet ta' stampar u ta' servizz relatati ma' l-istampar @mt
preferred label: Drukkerijen en diensten in verband met drukkerijen @nl
preferred label: Trykking og tjenester tilknyttet trykking @no
preferred label: Drukowanie i działalność usługowa związana z poligrafią @pl
preferred label: Impressão e actividades dos serviços relacionados com a impressão @pt
preferred label: Tipărire şi activităţi de servicii conexe tipăririi @ro
preferred label: Издательское дело и услуги, связанные с издательским делом @ru
preferred label: Tlač a služby súvisiace s tlačou @sk
preferred label: Tiskarstvo in z njim povezane storitve @sl
preferred label: Grafisk produktion @sv
preferred label: Basım ve basım ile ilgili hizmet faaliyetleri @tr
broader: Printing and reproduction of recorded media
narrower: Printing of newspapers
narrower: Other printing
narrower: Pre-press and pre-media services
narrower: Binding and related services

Printing of newspapers
type: Concept
notation: 18.11
status: valid
status modified: 2013-10-18
accepted date: 2013-10-18
in scheme: Statistical Classification of Economic Activities in the European Community, Rev. 2 (2008)
scope note: - печатане на други периодични издания, излизащи най-малко четири пъти седмично - издаване на книги, периодични издания и друга издателска дейност - 58.1 - размножаване/фотокопиране на документи - 82.19 @bg
scope note: ZT: - tisk jiných periodických tiskovin, které vycházejí nejméně čtyřikrát týdně N: - vydávání tiskovin (58.1) - kopírování dokladů (82.19) @cs
scope note: Diese Klasse umfasst ferner: - Druck von Zeitungen und anderen periodischen Druckschriften, die mindestens viermal wöchentlich erscheinen Diese Klasse umfasst nicht: - Verlegen von Druckerzeugnissen (s. 58.1) - Fotokopieren von Unterlagen (s. 82.19) @de
scope note: This class also includes: - printing of other periodicals, appearing at least four times a week This class excludes: - publishing of printed matter, see 58.1 - photocopying of documents, see 82.19 @en
scope note: Esta clase comprende también: - la impresión de otras publicaciones periódicas que se publican al menos cuatro veces por semana Esta clase no comprende: - la edición de material impreso (véase 58.1) - el fotocopiado de documentos (véase 82.19) @es
scope note: Cette classe comprend également: - l’impression d’autres périodiques, paraissant au moins quatre fois par semaine Cette classe ne comprend pas: - l'édition d’imprimés, voir 58.1 - la photocopie de documents, voir 82.19 @fr
scope note: Ovaj razred također uključuje: - tiskanje ostalih periodičkih publikacija koje izlaze više od četiri puta na tjedan Ovaj razred isključuje: - izdavanje tiskanog materijala, vidi 58.1 - fotokopiranje dokumenata, vidi 82.19
scope note: Į šią klasę įeina: - periodinių leidinių, išeinančių mažiausiai keturis kartus per savaitę, spausdinimas Į šią klasę neįeina: - spaudinių leidyba, žr. 58.1 - dokumentų fotokopijavimas, žr. 82.19 @lt
scope note: Этот класс включает: - выпуск специализированных периодических изданий, установку образцов и постпечатные услуги, например завершающую подготовку обложек, книг, брошюр, журналов, каталогов и т.д., нанесение пленки, подрезание и выравнивание листов, сборку, стачивание отдельных частей, прошивание нитками, бесшовное клеевое скрепление блока, укладку, склеивание, упорядочение, наметывание, тиснение золотом; скрепление металлической и пластиковой спиралью - переплет и обработка печатной бумаги или печатного картона, сгибание, тиснение, пробивание отверстий, гравировка, склеивание, ламинирование - завершающую подготовку для CD-ROM - рассылку по электронной почте, настройку или изготовление продукта под требования (технические условия) заказчика, подготовку обложки - прочие завершающие виды деятельности, такие как штамповка, прессовка, тиснение, печать для незрячих @ru
scope note: Ayrıca bu sınıf aşağıdakileri de kapsamaktadır; - haftada en az dört kez yayınlanan diğer süreli yayınların basımı. Kapsam dışı olanlar; - basılı ürünlerin yayımlanması, bkz. 58.1, - dokümanların fotokopilerinin çekilmesi, bkz. 82.19. @tr
preferred label: Печатане на вестници @bg
preferred label: Tisk novin @cs
preferred label: Trykning af dagblade @da
preferred label: Drucken von Zeitungen @de
preferred label: Εκτύπωση εφημερίδων @el
preferred label: Impresión de periódicos @es
preferred label: Ajalehtede trükkimine @et
preferred label: Sanomalehtien painaminen @fi
preferred label: Imprimerie de journaux @fr
preferred label: Napilapnyomás
preferred label: Stampa di giornali @it
preferred label: Laikraščių spausdinimas @lt
preferred label: Laikrakstu iespiešana @lv
preferred label: Stampar ta' gazzetti @mt
preferred label: Krantendrukkerijen @nl
preferred label: Trykking av aviser @no
preferred label: Drukowanie gazet @pl
preferred label: Impressão de jornais @pt
preferred label: Tipărirea ziarelor @ro
preferred label: Печатание газет @ru
preferred label: Tlač novín @sk
preferred label: Tiskanje časopisov @sl
preferred label: Tryckning av dagstidningar @sv
preferred label: Gazetelerin basımı @tr
broader: Printing and service activities related to printing

Other printing
type: Concept
notation: 18.12
status: valid
status modified: 2013-10-18
accepted date: 2013-10-18
in scheme: Statistical Classification of Economic Activities in the European Community, Rev. 2 (2008)
scope note: - печатане на списания и други периодични издания, излизащи по-малко от четири пъти седмично - печатане на книги и брошури, нотни издания и партитури, карти, атласи, плакати, постери, рекламни каталози, проспекти и други печатни рекламни материали, пощенски марки, таксови марки, облигации, чекове и други ценни книжа, карти, съдържащи електронна интегрална схема ("smart" карти), албуми, дневници, календари, формуляри и други търговски канцеларски материали, лични и служебни печатни изделия и други печатни продукти с помощта на машини за висок, офсетов, дълбок, флексо- и ситопечат и други печатарски машини, копирно-размножителни машини, принтери, машини за преговане, вкл. бърз печат - печатане директно върху текстил, пластмаси, стъкло, метал, дърво и керамика По правило отпечатваните материали притежават авторски права. - печатане на етикети (литографски, дълбок, флексо- или други видове печат) - ситопечат върху текстил и облекло - 13.30 - производство на канцеларски материали (тетрадки, бележници, регистри, счетоводни книги, квитанции), когато вида на отпечатаната информация не е определящ признак - 17.23 - издаване на книги, периодични издания и друга издателска дейност - 58.1 @bg
scope note: Z: - tisk časopisů a jiných periodik, které vycházejí méně než čtyřikrát týdně - tisk knih a brožur, hudebnin a partitur, map, atlasů, plakátů, katalogů, reklamních katalogů, prospektů a jiných propagačních tiskovin, poštovních známek, kolků, cenných papírů, šeků a jiných bankovkových papírů, čipových karet, památníků, deníků, kalendářů a jiných obchodních tiskovin, osobních dopisních papírů (papírnického zboží) a jiných tiskovin knihtiskem, ofsetem, hlubotiskem, flexografií, sítotiskem a jinými tisky, kopírovacími stroji, počítačovými tiskárnami, razicími kalandry včetně rychlotisku - přímý potisk textilií, plastů, skla, kovu, dřeva a keramiky Potištěné předměty (materiály) jsou typicky chráněny autorským právem. ZT: - tisk na etikety nebo přívěsky (litografie, hlubotisk, flexografie nebo jiný tisk) N: - sítotisk na textilie a oděvy (13.30) - výrobu papírnického zboží (sešitů, desek, pořadačů, registrů, účetních knih, tiskopisů atd.), pokud tištěná informace nepředstavuje hlavní účel činnosti (17.23) - vydávání tiskovin (58.1) @cs
scope note: Diese Klasse umfasst: - Drucken von Zeitschriften und anderen periodischen Druckschriften, die weniger als viermal wöchentlich erscheinen - Drucken von Büchern und Broschüren, Musikalien und Notenvorlagen, Karten, Atlanten, Plakaten, Katalogen, Prospekten und anderen Werbedruckschriften, Postwertzeichen, Steuermarken, Wertpapieren, Chipkarten, Alben, Tagebüchern, Kalendern, Formularen und anderen Geschäftsdrucksachen, Familiendrucksachen und anderen Druckerzeugnissen auf Hoch-, Offset-, Tief-, Flexo-, Sieb- und anderen Druckmaschinen, Vervielfältigungsmaschinen, Computerdruckern, Prägemaschinen, einschließlich Schnelldruck - Bedrucken von Textilien, Kunststoff, Glass, Metall, Holz und Keramik (außer Siebdrucken auf Textilien und Bekleidung) Für die bedruckten Gegenstände besteht üblicherweise Urheberrechtsschutz. Diese Klasse umfasst ferner: - Bedrucken von Etiketten und Anhängern (Lithografie, Tiefdruck, Flexo- oder anderer Druck) Diese Klasse umfasst nicht: - Siebdrucken auf Textilien und Bekleidung (s. 13.30) - Herstellung von Schreibwaren aus Papier oder Pappe (Hefte, Mappen, Hefter, Ordner, Register, Hauptbücher für die Buchhaltung, Vordrucke usw.), sofern die aufgedruckte Information nicht das Hauptmerkmal darstellt (s. 17.23) - Verlegen von Druckerzeugnissen (s. 58.1) @de
scope note: This class includes: - printing of magazines and other periodicals, appearing less than four times a week - printing of books and brochures, music and music manuscripts, maps, atlases, posters, advertising catalogues, prospectuses and other printed advertising, postage stamps, taxation stamps, documents of title, cheques and other security papers, smart cards, albums, diaries, calendars and other commercial printed matter, personal stationery and other printed matter by letterpress, offset, photogravure, flexographic, screen printing and other printing presses, duplication machines, computer printers, embossers etc., including quick printing - printing directly onto textiles, plastic, glass, metal, wood and ceramics (except silk-screen printing on textiles and wearing apparel) The material printed is typically copyrighted. This class also includes: - printing on labels or tags (lithographic, gravure printing, flexographic printing, other) This class excludes: - silk-screen printing on textiles and wearing apparel, see 13.30 - manufacture of stationery (notebooks, binders, registers, accounting books, business forms etc.), when the printed information is not the main characteristic, see 17.23 - publishing of printed matter, see 58.1 @en
scope note: Esta clase comprende: - la impresión de otras revistas y publicaciones periódicas que se publican menos de cuatro veces por semana - la impresión de libros y folletos, cuadernos y partituras de música, mapas, atlas, carteles, catálogos, prospectos y otros impresos publicitarios, sellos de correos, timbres fiscales, documentos de propiedad, cheques y otros títulos, tarjetas inteligentes, álbumes, dietarios, calendarios y otros impresos comerciales, artículos de papelería de uso personal y otros impresos, por medio de prensas de imprenta, offset, fotograbado, flexografía, serigrafía u otros métodos de impresión por estampación, por multicopistas, impresoras controladas por ordenador, grabadoras en relieve, etc., incluyendo la impresión rápida - la impresión directa en textiles, plástico, vidrio, metal, madera y cerámica El material impreso generalmente está sujeto a derechos de autor. Esta clase comprende también: - la impresión en etiquetas (impresión litográfica, fotograbado, flexografía u otras) Esta clase no comprende: - el serigrafiado de textiles y prendas de vestir (véase 13.30) - la fabricación de artículos de papelería (cuadernos, carpetas, registros, libros contables, formularios comerciales, etc.) cuando la información impresa no constituya su característica principal (véase 17.23) - la edición de material impreso (véase 58.1) @es
scope note: Cette classe comprend: - l’impression de magazines et d’autres périodiques, paraissant moins de quatre fois par semaine - l’impression de livres et de brochures, de partitions musicales, de cartes géographiques, d’atlas, d’affiches, de catalogues, de prospectus et d’autres imprimés publicitaires, de timbres, de timbres fiscaux, de moyens de paiement et d’autres papiers-valeurs, de cartes à puce, d’albums, d’agendas, de calendriers et d’autres imprimés commerciaux, de papier à lettres à en-tête personnel et d’autres imprimés sur des presses typographiques, offset, d’héliogravure, flexigraphiques, sérigraphiques et d’autres presses graphiques, appareils de reproduction, imprimantes électroniques, appareils de gaufrage, y compris les travaux d’impression rapide - l’impression directe sur textiles, matières plastiques, verre, métal, bois et céramique (à l’exception de l’impression sérigraphique sur textiles et vêtements) Les motifs imprimés sont généralement protégés par les droits d’auteur. Cette classe comprend également: - l’impression d’étiquettes (lithographie, photogravure, flexographie, etc.) Cette classe ne comprend pas: - l’impression sérigraphique sur textiles et vêtements, voir 13.30 - la fabrication d’articles de papeterie (cahiers, classeurs, registres, livres comptables, formulaires commerciaux, etc.), dès lors que l’information imprimée n’est pas la finalité principale, voir 17.23 - l'édition d’imprimés, voir 58.1 @fr
scope note: Ovaj razred uključuje: - tiskanje magazina i ostalih periodičkih publikacija koje izlaze manje od četiri puta na tjedan - tiskanje knjiga i brošura, glazbenih djela i glazbenih rukopisa, zemljopisnih karata, atlasa, plakata, reklamnih kataloga, prospekata i drugih tiskanih oglasa, poštanskih marki, upravnih biljega, dokumenata, čekova i drugih vrijednosnih papira, pametnih kartica, albuma, dnevnika, kalendara, poslovnih obrazaca i ostalih tiskanih komercijalnih publikacija, papirnatih potrepština za osobne potrebe i drugih materijala tiskanih pomoću knjigotiska, ofseta, fotogravure, fleksografije, sitotiska i drugih tiskarskih strojeva, strojeva za umnožavanje, računalnih pisača, pisača itd., uključujući brzo tiskanje - izravno tiskanje na tekstilu, plastici, staklu, metalu, drvu i keramici Tiskani materijali su obično zaštićeni autorskim pravom. Ovaj razred također uključuje: - tiskanje naljepnica ili etiketa (litografija, gravura, fleksografija i ostalih) Ovaj razred isključuje: - tiskanje tekstila i odjevnih predmeta sitotiskom, vidi 13.30 - proizvodnju pribora za pisanje (bilježnica, registratora, računovodstvenih knjiga, poslovnih obrazaca itd.), kada tiskana informacija nije glavna karakteristika, vidi 17.23 - izdavanje tiskanog materijala, vidi 58.1
scope note: Į šią klasę įeina: - žurnalų ir kitų periodinių leidinių, išeinančių rečiau negu keturis kartus per savaitę, spausdinimas - knygų, brošiūrų, muzikos kūrinių ir rankraščių, žemėlapių, atlasų, plakatų, reklamos katalogų, prospektų ir kitų reklaminių spaudinių, pašto ir mokesčių ženklų, prekių lydraščių, čekių ir kitų vertybinių popierių, intelektinių kortelių, albumų, dienynų, kalendorių ir kitokių komercinių spaudinių, asmeninių raštinės reikmenų ir kitų spaudinių spausdinimas tekstinės, ofsetinės, fotograviūrinės, fleksografinės (linoraižinių), trafaretinės spaudos būdais ar kitokiomis spausdinimo ir kopijavimo mašinomis, kompiuterių spausdintuvais, įspaudimo ir kt. mašinomis, įskaitant greitąjį spausdinimą - tiesioginis spausdinimas ant tekstilės medžiagos, plastiko, stiklo, metalo, medienos ir keramikos Spausdinamoji medžiaga paprastai yra autorių teisės saugomas objektas. Į šią klasę taip pat įeina: - spausdinimas ant etikečių ar žymenų (litografinis, fotograviūrinis, fleksografinis ir kitoks spausdinimas) Į šią klasę neįeina: - šilkografinis spausdinimas ant tekstilės gaminių ir drabužių, žr. 13.30 - raštinės reikmenų (sąsiuvinių, bloknotų, segtuvų, aplankų, įrašų žurnalų, buhalterinių knygų, verslo blankų ir kt.) gamyba, kai juose spausdinama informacija nėra pagrindinė charakteristika žr. 17.23 - spaudinių leidyba, žr. 58.1 @lt
scope note: Bu sınıf aşağıdakileri kapsamaktadır; - haftada dört kereden daha az yayınlanan dergilerin ve diğer mecmuaların basılması, - kitapların ve broşürlerin, müzik eserlerinin ve müzik el yazmalarının, haritaların, atlasların, posterlerln, reklam kataloglarının, prospektüslerin ve diğer basılı duyuruların, posta pullarının, vergi pullarının, tapu senetlerinin, çeklerin ve diğer kıymetli evrakların, akıllı kartların, albümlerin, günlüklerin, takvimlerin, iş formlarının ve diğer ticari içerikli basılmış evrakların, kişisel kırtasiye ürünleri ve diğer tipo baskı yoluyla basılan ürünlerin, ofset baskı, fotogravür, fleksografik baskı, ekran baskısı ve basım için kullanılan diğer baskı aletleri, teksir makineleri, bilgisayar yazıcıları, kabartmalı baskı yapan makineler vb. kullanılarak basılması (hızlı basım dahil), - doğrudan tekstil ürünleri, plastik ürünler, cam, metal, ahşap ve seramik üzerine baskı yapılması. Ayrıca bu sınıf aşağıdakileri de kapsamaktadır; - yaftaların ve etiketlerin basılması (litografik, gravür baskı, fleksografik baskı, diğer) Kapsam dışı olanlar; - tekstil ürünlerine ve giyeceklere ipek baskı uygulanması, bkz.13.30, - ana unsuru bilgi içermeyen eğitim ve ticari kırtasiye malzemeleri (not defterleri, ajandalar, kayıt defterleri, muhasebe defterleri, iş formları vb.), imalatı, bkz. 17.23, - basılı ürünlerin yayınlanması, bkz. 58.1. @tr
preferred label: Печатане на други издания и печатни продукти @bg
preferred label: Ostatní tisk @cs
preferred label: Anden trykning @da
preferred label: Drucken a. n. g. @de
preferred label: Άλλες εκτυπωτικές δραστηριότητες @el
preferred label: Otras actividades de impresión y artes gráficas @es
preferred label: Muu trükkimine @et
preferred label: Muu painaminen @fi
preferred label: Autre imprimerie (labeur) @fr
preferred label: Nyomás (kivéve: napilap)
preferred label: Altra stampa @it
preferred label: Kitas spausdinimas @lt
preferred label: Cita veida izdevumu iespiešana @lv
preferred label: Stampar ieħor @mt
preferred label: Overige drukkerijen @nl
preferred label: Trykking ellers @no
preferred label: Drukowanie pozostałe @pl
preferred label: Outra impressão @pt
preferred label: Alte activităţi de tipărire n.c.a. @ro
preferred label: Прочие виды издательской деятельности @ru
preferred label: Iná tlač @sk
preferred label: Drugo tiskanje @sl
preferred label: Annan tryckning @sv
preferred label: Diğer matbaacılık @tr
broader: Printing and service activities related to printing

Pre-press and pre-media services
type: Concept
notation: 18.13
status: valid
status modified: 2013-10-18
accepted date: 2013-10-18
in scheme: Statistical Classification of Economic Activities in the European Community, Rev. 2 (2008)
scope note: - набор, вкл. фотонабор, предварително въвеждане на данни, вкл. сканиране и дигитализация на предпечат, електронно страниране - подготовка на файловете от данни за мултимедийно приложение (печатане върху хартия, CD-ROM, Internet) - изработване на печатната форма, вкл. илюстрации и текст (за висок и офсетов печат) - подготовка на печатните цилиндри, гравиране или разяждане (ецване) на дълбокопечатните формени цилиндри - подготовка на печатната форма чрез технология CTP (Компютър – Печатна форма), вкл. фотополимерни форми - изработване на печатни форми и матрици за релефно преговане - изработване на: • художествено оформени литографски камъни и дървени блокчета • носители за представяне на информация: екранно прозрачно фолио (слайт) и други форми на представяне • скици, планове, макети и други • пробен отпечатък - специализирани дейности в областта на дизайна - 74.10 @bg
scope note: Z: - skládání, sazbu textu, fotosazbu, vkládání dat včetně skenování a optickou kontrolu znaků, elektronickou úpravu - přípravu digitálních dat pro multimedia (tisk na papíře, CD-ROM, internet) - služby spojené s výrobou tiskových (tiskařských) desek zahrnují nastavení zobrazení a obrazovou přílohu (pro tištěný text a ofset) - přípravu válců: rytí nebo leptání válců pro hlubotisk - zpracování desek :„ od počítače k tiskařské desce “ CTP (také fotopolymerových desek) - přípravu desek a matric pro reliéfní ražení (ocelotisk) nebo polygrafii - přípravu: • uměleckých prací technického charakteru, např. přípravu kamenů pro litografii a dřevoryt (dřevořez) • prezentace médií, např. folií pro stolní zpětnou projekci a jiné formy prezentace • náčrtů, návrhů úprav tisku, atrap atd. • výroby polygrafických obtahů (pro korektury) N: - specializované návrhářské činnosti (74.10) @cs
scope note: Diese Klasse umfasst: - Satzherstellung einschließlich Fotosatz, Dateneingabe auf der Vorstufe einschließlich Scannen und optische Zeichenerkennung, elektronischer Seitenaufbau - Vorbereitung von Dateien für Multimedia-Anwendungen (Ausdruck auf Papier, CD-ROM, Internet) - Stereotypieleistungen einschließlich Bild- und Plattensatz (für Hochdruck- und Offset-Druckverfahren) - Vorbereitung der Druckzylinder: Gravieren oder Ätzen von Tiefdruckwalzen - Vorbereitung der Druckplatten: "computer to plate" CTP (auch Fotopolymer-Platten) - Vorbereitung von Platten und Formen für Reliefdruck - Vorbereitung von: • Kunstwerken technischer Art, etwa Vorbereiten von Lithografie-Steinen und Holzblöcken • Datenträger für Präsentationen, z. B. Folien für Tageslichtprojektoren und andere Präsentationsformen • Skizzen, Layouts, Dummys usw. • Herstellung von Korrekturabzüge Diese Klasse umfasst nicht: - Ateliers für Textil-, Schmuck-, Möbel- u. ä. Design (s. 74.10) @de
scope note: This class includes: - composing, typesetting, phototypesetting, pre-press data input including scanning and optical character recognition, electronic make-up - preparation of data files for multi-media (printing on paper, CD-ROM, Internet) applications - plate-making services including image setting and plate setting (for the printing processes letterpress and offset) - cylinder preparation: engraving or etching of cylinders for gravure printing - plate processing: "computer to plate" CTP (also photopolymer plates) - preparation of plates and dies for relief stamping or printing - preparation of: • artistic works of technical character, such as preparation of lithographic stones and wood blocks • presentation media, e.g. overhead foils and other forms of presentation • sketches, layouts, dummies, etc. • production of proofs This class excludes: - specialised design activities, see 74.10 @en
scope note: Esta clase comprende: - la composición, la fotocomposición, la introducción de datos para preimpresión, incluido el escaneado y el reconocimiento óptico de caracteres, la compaginación electrónica - la preparación de ficheros de datos para aplicaciones multimedia (impresión en papel, CD-ROM, Internet) - los servicios de fotograbado, incluida la composición de imágenes y de clichés (para los procedimientos de impresión tipográfica y offset) - la preparación de cilindros: el grabado de cilindros de fotograbado - el procesado de planchas: "del ordenador a la plancha ("computer to plate" CTP) (incluidas las planchas de fotopolímeros) - la preparación de planchas y troqueles para la impresión o la estampación en relieve - la preparación de: • trabajos artísticos de carácter técnico, como la preparación bloques de madera o piedra para litografía • soportes de presentación, por ejemplo transparencias y otras formas de presentación • bocetos, croquis, maquetas, etc. • producción de pruebas Esta clase no comprende: - las actividades de diseño especializadas (véase 74.10) @es
scope note: Cette classe comprend: - la composition, la photocomposition, la saisie de données, y compris par numérisation et reconnaissance optique des caractères, la mise en forme électronique - la préparation de fichiers de données pour des applications multimédia (impression sur papier, CD-ROM, Internet) - les services de photogravure, y compris la photocomposition et la réalisation de plaques (pour les procédés d’impression typographique et offset) - la préparation des cylindres: la gravure de cylindres pour la reproduction de gravures - le transfert CTP ("computer to plate", de l’ordinateur à la plaque, également plaques en photopolymères) - la préparation de plaques et matrices pour estampage ou impression en relief - la préparation de: • travaux artistiques de nature technique, tels que la préparation des pierres lithographiques et des blocs de bois • la production de supports de présentation, par exemple: de transparents pour rétroprojecteur et d’autres formes de présentation • croquis, modèles, maquettes, etc. • la production d’épreuves Cette classe ne comprend pas: - les activités spécialisées de design, voir 74.10 @fr
scope note: Ovaj razred uključuje: - djelatnosti unošenja podataka: pripremu tiskarskog oblika, podešavanje izgleda teksta, podešavanje izgleda slike, ulaznih podataka, uključujući skeniranje i prepoznavanje optičkih obilježja, elektroničkog izgleda - priprema datoteka za aplikacije na raznim medijima (tiskanje na papir, CD-ROM, internet) - kreiranje dokumenata, objavljivanje na računalu, te ostale srodne radnje - usluge izrade tiskarskih ploča, uključujući podešavanje slika i ploča (za proces običnog i ofset tiskanja) - pripreme cilindara: graviranje ili kliširanje cilindra za gravure - obrađivanje ploča: "s računala na ploču" (također fotopolimerskih ploča) - pripremu ploča i matrica za reljefno utiskivanje i tiskanje - pripremu: • umjetničkih radova tehničkog karaktera kao što su litografske ploče i drveni blokovi • medija za potrebe prezentacija, npr. prozirnica za projektore te ostalih oblika digitalne prezentacije • nacrta, skica, uzoraka itd. • proizvodnju otisaka za korekturu Ovaj razred isključuje: - specijalizirane dizajnerske djelatnosti, vidi 74.10
scope note: Į šią klasę įeina: - rinkimas, tipografinis rinkimas, fototipinis rinkimas, parengiamųjų duomenų įvedimas, įskaitant skaitmeninį vizualizavimą ir optinį rašmenų atpažinimą, elektroninį laužymą - duomenų rinkmenų paruošimas multimedijos taikymams (spausdinimas popieriuje, įrašymas į CD -ROM, internetinė leidyba) - spausdinimo formų gamyba, įskaitant vaizdų suderinimą ir spausdinimo formų nustatymą (iškiliaspaudžiam ir ofsetiniam spausdinimui) - cilindrų paruošimas: giliaspaudės cilindrų graviravimas ar ėsdinimas - spausdinimo formų apdorojimas: „kompiuterį į spausdinimo formą“ CTP (taip pat į fotopolimerines plokšteles) - spausdinimo formų ir štampų paruošimas reljefiniam atspaudimui arba spausdinimui - paruošimas: • techninio charakterio meninių darbų, tokių kaip litografiniai akmenys ir medinės spausdinimo formos • pateikties laikmenų, pvz., skaidrių ir kitokio pavidalo pateikčių • maketų, eskizų, prototipų ir pan. • bandomųjų atspaudų, korektūrų Į šią klasę neįeina: - specializuotoji projektavimo veikla, žr. 74.10 @lt
scope note: Этот класс включает: - воспроизведение с главной копии граммофонных записей, компакт-дисков, музыкальных записей и т.п. - воспроизведение с главной копии записей, компакт дисков, записей кинофильмов и прочих видеозаписей - воспроизведение с главной копии программного обеспечения и баз данных на дисках и пленках Этот класс исключает: - воспроизведение печатных материалов, см. 18.11, 18.12 - издание программного обеспечения, см. 58.2 - производство и распространение кинофильмов, видеозаписей и фильмов на DVD или подобных носителях, см. 59.11, 59.12, 59.13 - тиражирование кинофильмов для кинопроката, см. 59.12 - производство оригинальных экземпляров записей или звукового материала, см. 59.20 @ru
scope note: Bu sınıf aşağıdakileri kapsamaktadır; - tarama ve optik karakter tanımlanması, elektronik makyajlama da dahil dizgi, karakter-dizgisi, foto-karakter-dizgisi, baskı öncesi veri girişi, - multi-medya (kağıt üzerine baskı, CD-ROM, Internet) uygulamaları için veri dosyalarının hazırlanması, - resim yerleştirme ve tabaka yerleştirme dahil tabaka yapım hizmetleri (tipo baskı ve ofset baskı işlemleri için), - silindirlerin hazırlanması: gravür baskı için silindirlerin kazınması veya asitle aşındırılması, - tabakanın şekillendirilmesi: `bilgisayardan tabakaya` (CTP) (aynı zamanda foto polimeri tabakaları için de), - rölyef mühür ve baskı için tabakalar ve kalıpların hazırlanması. Aşağıdakilerin hazırlanması: - ahşap blokların ve litografik taşların hazırlanması gibi, teknik özellikli sanatsal çalışmaların hazırlanması, - sunumlar için saydamların, asetatların vb. hazırlanması, - taslaklar, planlar, mizanpajlar, vb.nin hazırlanması, - baskı provaları Kapsam dışı olanlar; - özel tasarım faaliyetleri, bkz. 74.10. @tr
preferred label: Предпечатна подготовка @bg
preferred label: Příprava tisku a digitálních dat @cs
preferred label: Prepress- og premedia-arbejde @da
preferred label: Druck- und Medienvorstufe @de
preferred label: Υπηρεσίες προεκτύπωσης και προεγγραφής μέσων @el
preferred label: Servicios de preimpresión y preparación de soportes @es
preferred label: Trükieelne tegevus @et
preferred label: Painamista ja julkaisemista edeltävät palvelut @fi
preferred label: Activités de prépresse @fr
preferred label: Nyomdai előkészítő tevékenység
preferred label: Lavorazioni preliminari alla stampa e ai media @it
preferred label: Parengiamoji spausdinimo ir žiniasklaidos veikla @lt
preferred label: Salikšana un iespiedformu izgatavošana @lv
preferred label: Servizzi bi tħejjija għall-istampar u bi tħejjija għall-midja @mt
preferred label: Prepress- en premediadiensten @nl
preferred label: Ferdiggjøring før trykking og publisering @no
preferred label: Działalność usługowa związana z przygotowywaniem do druku @pl
preferred label: Actividades de preparação da impressão e de produtos media @pt
preferred label: Servicii pregătitoare pentru pretipărire @ro
preferred label: Изготовление печатных форм и информационная деятельность @ru
preferred label: Služby pre tlač a média @sk
preferred label: Priprava za tisk in objavo @sl
preferred label: Grafiska tjänster före tryckning (prepress/premedia) @sv
preferred label: Basım ve yayım öncesi hizmetler @tr
broader: Printing and service activities related to printing

Binding and related services
type: Concept
notation: 18.14
status: valid
status modified: 2013-10-18
accepted date: 2013-10-18
in scheme: Statistical Classification of Economic Activities in the European Community, Rev. 2 (2008)
scope note: - ръчно подвързване на нискотиражни и пробни екземпляри (мостри), изработване на пробния екземпляр и операции, извършвани след отпечатването, които са спомагателни при печатането на: книги, брошури, списания, каталози и други чрез сгъване (фалцуване), изрязване и обрязване, събиране, свързване, подшиване, слепване, комплектуване на книжното тяло, златно щамповане, свързване с метална и пластмасова спирала - подвързване и довършителни операции на напечатани хартия или картон чрез сгъване/нагъване, щамповане, свързаване, пробиване, щанцоване, перфориране, слепване, подшиване, подрязване, ламиниране - довършителни операции за компактдискове (CD-ROMs) - довършителни дейности по изготвяне на пликове и опаковки за експедиция по поръчка на клиента - други довършителни дейности: преговане или щанцоване, Брайлов шрифт @bg
scope note: Z: - průmyslovou vazbu, tvorbu zkušebních výtisků a potiskové úpravy jako související činnosti tisku, např. vázání a konečnou úpravu knih, brožur, časopisů, katalogů atd. skládáním, řezáním, kompletováním, sešíváním, lepením spojů nebo klihem, ořezáváním, reliéfním ražením, vázáním Lumbeckovou metodou, prošíváním hřbetů, zlacením, spirálovou vazbou s použitím drátů nebo plastů - vázání a konečné zpracování potištěného papíru nebo kartonu skládáním, lisováním, děrováním, perforováním, vrtáním, reliéfním ražením, lepením, laminováním - dokončovací práce pro CD-ROM - potiskové úpravy dokončovací, např. úpravy dle představ zákazníka, přípravu obálek - ostatní dokončovací práce, např. děrování, orazítkování, rozmnožování Braillova písma @cs
scope note: Diese Klasse umfasst: - Binden von Kleinauflagen und Probeexemplaren sowie Drucknachbereitung, z. B. Binden und Fertigstellen von Büchern, Broschüren, Zeitschriften, Katalogen usw. durch Falzen, Zusammentragen, Klammern, Leimen, Heften, Klebebinden, Beschneiden, Prägen, Lumbecken, Rückenstichheften, Anbringen von Goldschnitt, Spiralbindung mit Draht oder Kunststoff - Binden und Fertigbearbeiten von bedrucktem Papier oder Karton durch Falten, Stanzen, Stempeln, Lochen, Perforieren, Bohren, Prägen, Kleben, Leimen, Laminieren - Fertigbearbeiten für CD-ROM - Versandfertigmachen, z. B. kundenspezifische Anpassung, Vorbereitung der Versandverpackung - sonstige Endbearbeitungstätigkeiten wie Stanzen, Stempeln, Brailledrucken @de
scope note: This class includes: - trade binding, sample mounting and post press services in support of printing activities, e.g. trade binding and finishing of books, brochures, magazines, catalogues, etc., by folding, cutting and trimming, assembling, stitching, thread sewing, adhesive binding, cutting and cover laying, gluing, collating, basting, gold stamping; spiral binding and plastic wire binding - binding and finishing of printed paper or printed cardboard, by folding, stamping, drilling, punching, perforating, embossing, sticking, gluing, laminating - finishing services for CD-ROMs - mailing finishing services such as customisation, envelope preparation - other finishing activities such as die, sinking or stamping, Braille copying @en
scope note: Esta clase comprende: - la encuadernación comercial, montaje de muestras y servicios de postimpresión de apoyo a las actividades de impresión, como la encuadernación comercial y el acabado de libros, folletos, revistas, catálogos, etc. mediante plegado, corte, alzado, embastado, encuadernación, encolado, estampado en oro; la encuadernación espiral y la encuadernación con cable de plástico - la encuadernación y el acabado de papel o cartón impresos mediante plegado, estampado, perforación, taladrado, grabado, pegado, encolado, laminado - los servicios de acabado para CD-ROM - los servicios de acabado para la expedición de correspondencia, como la personalización y la preparación de sobres - otras actividades de acabado como troquelado, grabado y estampación, copia de Braille. @es
scope note: Cette classe comprend: - les services de reliure industrielle, de montage d’échantillons et les services de soutien d’après-presse aux imprimeurs, par exemple: la reliure et la finition de livres, de brochures, de périodiques, de catalogues, etc., par pliage, coupage et massicotage, assemblage, agrafage, reliure avec et sans couture, coupage et pose de couverture, collage, assemblage, dorage, reliure à spirale et avec fil en plastique - la reliure et la finition de papiers ou de cartons imprimés, par pliage, estampage, poinçonnage, perforage, gaufrage, collage, pelliculage - les services de finition pour CD-ROM - les services de finition pour publipostage, tels que personnalisation ou préparation des enveloppes - d’autres activités de finition, telles que la gravure ou l’estampage de matrices, la copie en braille @fr
scope note: Ovaj razred uključuje: - uvezivanje otisnutih listova, izradu oglednih primjeraka i dotiskivanje, npr. uvezivanje knjiga, brošura, časopisa, kataloga itd., slaganje, rezanje i orezivanje, spajanje, šivanje, bušenje, rezanje i postavljanje naslovnice, lijepljenje, uspoređivanje, zlatotisak, spiralni uvez i uvezivanje plastičnom žicom - uvezivanje i dovršavanje tiskanog papira ili kartona, slaganje, tiskanje, bušenje, probijanje rupa, perforiranje, reljefno tiskanje, lijepljenje, lameliranje - završne radove na CD-ROM-u - završne poštanske radove kao što su standardiziranje, priprema omotnica i adresiranje - ostale završne djelatnosti kao što su stavljanje u kalup, utiskivanje ili otiskivanje, brailovo kopiranje
scope note: Į šią klasę įeina: - mašininio įrišimo, bandomojo egzemplioriaus montavimo ir veikla išspausdinus, pvz.: knygų, brošiūrų, žurnalų, katalogų ir kt. mašininis įrišimas ir apdaila, atliekant sulankstymą, pjaustymą ir apipjaustymą, surinkimą, brošiūravimą, dygsniavimą, susiuvimą, klijuotinį sutvirtinimą, pjaustymą ir viršelių uždėjimą, klijavimą, lankų tikrinimą, peltakiavimą, paauksavimų įspaudimą; spiralinį įrišimą ir įrišimą plastikine spirale - spaudinių ant popieriaus arba kartono įrišimas ir apdailinimas, atliekant sulankstymą, atspaudimą, skylučių gręžimą, skylučių pramušimą, perforavimą, įspaudų darymą, štampavimą, klijavimą, dengimą (laminavimą) - kompaktinių diskų (CD - ROM) apdaila - siuntimo paštu baigiamieji darbai, tokie kaip pritaikymas užsakovo reikalavimams, vokų paruošimas - kitos apdailos veiklos rūšys, tokios kaip graviūros klišių darymas, graviravimas ar įspaudimas, perrašymas Brailio šriftu @lt
scope note: Данный раздел включает переработку сырой нефти и угля в продукты, готовые для к использованию. Основная деятельность – это очистка нефти, которая состоит в сепарации сырой нефти на компоненты путем крекинга и дистилляции. Также включается производство таких газов как этан, пропан и бутан, а также продуктов нефтеперерабатывающих заводов. Раздел также включает производство за собственный счет типичных продуктов (например, кокса, бутана, пропана, бензина, керосина, мазута и т.п.), а также услуги по переработке (например, переработку традиционными методами). В раздел не включено производство таких газов другими предприятиями (20.14), производство промышленных газов (класс 20.11), добыча природного газа (метана, этана, бутана или пропана) (класс 06.20) и производство топливного газа, кроме нефтяного газа (например, угольный, водяной, генераторный газы, газ, производимый газовыми заводами) (класс 35.21). Производство нефтехимикатов из очищенной нефти представлено в разделе 20. @ru
scope note: Bu sınıf aşağıdakileri kapsamaktadır; - ticari ciltçilik, model montajlama ve baskı faaliyetlerini destekleyici baskı sonrası hizmetler, örn. ticari kitap kapaklarının hazırlanması ve katlama, kesme ve süsleme, toplama, dikme, lif ile dikme, tutkallama, kesme ve dış kapağının koyulması, harmanlama, altın pres yapma, spiral veya plastik tel ile tutturularak kitapların, broşürlerin, dergilerin, katalogların v.s. ciltlenmesi ve tamamlanması, - basılmış kağıtları veya basılmış mukavvaları katlama, yaldızlama, delme, zımbalama, delik açma, kabartma, yapışkan sürme, tutkallama, yaprak haline getirme yöntemleriyle ciltlenmesi ve tamamlanması, - CD-ROM`lar için tamamlama hizmetleri, - müşterinin tercihleri doğrultusunda katlama, desteleme, zarflama gibi posta tamamlama hizmetleri, - kalıplama, kalıba batırma, kabartma ve Braille alfabesi (kör alfabesi) kopyalama gibi diğer tamamlama faaliyetleri,. @tr
preferred label: Подвързване и подобни дейности, свързани с печатането @bg
preferred label: Vázání a související činnosti @cs
preferred label: Bogbinding og lignende serviceydelser @da
preferred label: Binden von Druckerzeugnissen und damit verbundene Dienstleistungen @de
preferred label: Βιβλιοδετικές και συναφείς δραστηριότητες @el
preferred label: Encuadernación y servicios relacionados con la misma @es
preferred label: Köitmine ja selle sidusalad @et
preferred label: Sidonta ja siihen liittyvät palvelut @fi
preferred label: Reliure et activités connexes @fr
preferred label: Könyvkötés, kapcsolódó szolgáltatás
preferred label: Rilegatura e servizi connessi @it
preferred label: Įrišimas ir susijusios paslaugos @lt
preferred label: Iesiešana un ar to saistītas palīgdarbības @lv
preferred label: Illegar u servizzi relatati @mt
preferred label: Binderijen en aanverwante diensten @nl
preferred label: Bokbinding og tilknyttede tjenester @no
preferred label: Introligatorstwo i podobne usługi @pl
preferred label: Encadernação e actividades relacionadas @pt
preferred label: Legătorie şi servicii conexe @ro
preferred label: Брошюровочно-переплетная и отделочная деятельность и сопутствующие услуги @ru
preferred label: Viazanie kníh a služby súvisiace s viazaním kníh @sk
preferred label: Knjigoveštvo in sorodne dejavnosti @sl
preferred label: Bokbindning och andra tjänster i samband med tryckning @sv
preferred label: Ciltçilik ve ilgili hizmetler @tr
broader: Printing and service activities related to printing

Reproduction of recorded media
type: Concept
notation: 18.2
status: valid
status modified: 2013-10-18
accepted date: 2013-10-18
in scheme: Statistical Classification of Economic Activities in the European Community, Rev. 2 (2008)
preferred label: Възпроизвеждане на записани носители @bg
preferred label: Rozmnožování nahraných nosičů @cs
preferred label: Reproduktion af indspillede medier @da
preferred label: Vervielfältigung von bespielten Ton-, Bild- und Datenträgern @de
preferred label: Αναπαραγωγή προεγγεγραμμένων μέσων @el
preferred label: Reproducción de soportes grabados @es
preferred label: Salvestiste paljundus @et
preferred label: Ääni-, kuva- ja atk-tallenteiden tuotanto @fi
preferred label: Reproduction d'enregistrements @fr
preferred label: Egyéb sokszorosítás
preferred label: Riproduzione su supporti registrati @it
preferred label: Įrašytų laikmenų tiražavimas @lt
preferred label: Ierakstu reproducēšana @lv
preferred label: Riproduzzjoni ta' midja rreġistrata @mt
preferred label: Reproductie van opgenomen media @nl
preferred label: Reproduksjon av innspilte opptak @no
preferred label: Reprodukcja zapisanych nośników informacji @pl
preferred label: Reprodução de suportes gravados @pt
preferred label: Reproducerea înregistrărilor @ro
preferred label: Воспроизведение записей с носителя @ru
preferred label: Reprodukcia záznamových médií @sk
preferred label: Razmnoževanje posnetih nosilcev zapisa @sl
preferred label: Reproduktion av inspelningar @sv
preferred label: Kayıtlı medyanın çoğaltılması @tr
broader: Printing and reproduction of recorded media
narrower: Reproduction of recorded media

Reproduction of recorded media
type: Concept
notation: 18.20
status: valid
status modified: 2013-10-18
accepted date: 2013-10-18
in scheme: Statistical Classification of Economic Activities in the European Community, Rev. 2 (2008)
scope note: - дейности по възпроизвеждане на звукозаписи от оригинал върху разнообразни носители (грамофонни плочи, компактдискове (CD), цифрови дискове (DVD), магнитни ленти и други) - дейности по възпроизвеждане на видеозаписи (игрални, документални, анимационни и други видове кино- и видеофилми) от оригинал върху разнообразни носители (цифрови дискове (DVD), видеокасети и други) - дейности по възпроизвеждане на стандартен (системен или приложен) софтуер и данни от оригинал върху разнообразни дискове и ленти - печатане на вестници и други печатни продукти - 18.11, 18.12 - издаване на програмни продукти - 58.2 - производство и разпространение на филми и телевизионни предавания върху разнообразни носители - 59.11, 59.12, 59.13 - възпроизвеждане на филми, предназначени за разпространение в киносалони - 59.12 - създаване на звукозаписен оригинал - 59.20 @bg
scope note: Z: - rozmnožování gramofonových desek, CD a magnetofonových pásků s hudebními nebo jinými zvukovými nahrávkami z originálních (masterových) záznamů - rozmnožování CD, DVD a videokazet s nahrávkami filmů a jinými videonahrávkami z originálních (masterových) záznamů - rozmnožování softwaru z originálních (masterových) záznamů a rozmnožování údajů na discích a páskách N: - rozmnožování tiskovin (18.11, 18.12) - vydávání softwaru (58.2) - výrobu a distribuci filmů, videokazet a filmů na DVD nebo podobných nosičích dat (59.11, 59.12, 59.13) - rozmnožování hraných filmů za účelem jejich zapůjčení (59.12) - výrobu originálních (masterových) zvukových záznamů (59.20) @cs
scope note: Diese Klasse umfasst: - Vervielfältigung von Schallplatten, CDs und Bändern mit Musik- oder sonstigen Tonaufnahmen anhand von Masterbändern - Vervielfältigung von CDs, DVDs und Videobändern mit Film- und sonstigen Bildaufnahmen anhand von Masterbändern - Vervielfältigung von Masteraufzeichnungen von Software und Daten auf Disketten, CDs und Magnetbändern Diese Klasse umfasst nicht: - Vervielfältigen von Druckerzeugnissen (s. 18.11, 18.12) - Verlegen von Software (s. 58.2) - Herstellung und Vertrieb von Filmen und Videobändern auf DVD und ähnlichen Datenträgern (s. 59.11, 59.12, 59.13) - Vervielfältigung von Kinofilmen zwecks Verleih an Lichtspielhäuser (s. 59.12) - Herstellung von Masteraufzeichnungen für Schallplatten oder andere Tonträger (s. 59.20) @de
scope note: This class includes: - reproduction from master copies of gramophone records, compact discs and tapes with music or other sound recordings - reproduction from master copies of records, compact discs and tapes with motion pictures and other video recordings - reproduction from master copies of software and data on discs and tapes This class excludes: - reproduction of printed matter, see 18.11, 18.12 - publishing of software, see 58.2 - production and distribution of motion pictures, video tapes and movies on DVD or similar media, see 59.11, 59.12, 59.13 - reproduction of motion picture film for theatrical distribution, see 59.12 - production of master copies for records or audio material, see 59.20 @en
scope note: Esta clase comprende: - la reproducción, a partir de grabaciones originales, de discos, discos compactos y cintas de música u otras grabaciones sonoras - la reproducción, a partir de grabaciones originales, de discos, discos compactos y cintas de películas u otras grabaciones de vídeo - la reproducción, a partir de grabaciones originales, de programas y datos en discos y cintas Esta clase no comprende: - la reproducción de material impreso (véanse 18.11 y 18.12) - la edición de programas informáticos (véase 58.2) - la producción y distribución de películas de celuloide, cintas de vídeo y películas en DVD o medios similares (véanse 59.11, 59.12 y 59.13) - la reproducción de películas cinematográficas para su distribución en salas de proyección (véase 59.12) - la producción de copias originales de discos o material de sonido (véase 59.20) @es
scope note: Cette classe comprend: - la reproduction, à partir d’une matrice, de disques, de CD et de bandes contenant de la musique ou d’autres enregistrements sonores - la reproduction, à partir d’une matrice, de disques, de CD et de bandes contenant des films ou d’autres enregistrements vidéo - la reproduction, à partir d’une matrice, de logiciels et de données informatiques sur disques et sur bandes Cette classe ne comprend pas: - la reproduction d’imprimés, voir 18.11 et 18.12 - l’édition de logiciels, voir 58.2 - la production et la distribution de films sur vidéocassettes, DVD ou supports similaires, voir 59.11, 59.12 et 59.13 - la reproduction de films destinés à être projetés dans des salles, voir 59.12 - la production de matrices d’enregistrements ou de matériel audio, voir 59.20 @fr
scope note: Ovaj razred uključuje: - umnožavanje s master-kopija gramofonskih ploča, CD-a, DVD-a i vrpca s glazbenim i drugim zvučnim zapisima - umnožavanje s master-kopija zapisa, CD-a, DVD-a i vrpca s filmovima i drugim videozapisima - umnožavanje s master-kopija softvera i podataka na diskovima i vrpcama Ovaj razred isključuje: - umnožavanje tiskanog materijala, vidi 18.11, 18.12 - izdavanje softvera, vidi 58.2 - izdavanje i distribuciju filmova, videovrpci i filmova na DVD-u i sličnim medijima, vidi 59.11, 59.12, 59.13 - umnožavanje filmova za javnu distribuciju, vidi 59.12 - proizvodnju master-kopija za snimljeni ili audiomaterijal, vidi 59.20
scope note: Į šią klasę įeina: - muzikos ir kitų garso įrašų tiražavimas iš patefono plokštelių, kompaktinių diskų ir garsajuosčių ar kitų garso įrašų originalų - kino filmų ir kitų vaizdo įrašų tiražavimas iš diskų, kompaktinių diskų, vaizdajuosčių ar kitų vaizdo įrašų originalų - programinės įrangos ir duomenų tiražavimas iš originalų į diskus ir juostas Į šią klasę neįeina: - spaudinių tiražavimas, žr. 18.11, 18.12 - programinės įrangos leidyba, žr. 58.2 - kino filmų, vaizdajuosčių ir filmų įrašytų skaitmeniniuose vaizdo diskuose (DVD) ar kitose laikmenose, leidyba ir platinimas, žr. 59.11, 59.12, 59.13 - kino filmų tiražavimas platinti kino teatruose, žr. 59.12 - įrašų ar garsinės medžiagos originalų gamyba, žr. 59.20 @lt
scope note: Этот класс включает: - работу коксовых печей - производство кокса и полукокса/низкотемпературного кокса - производство смолы, пека, асфальта и пекового кокса - производство коксового газа - производство сырого угля или смолы бурого угля - агломерацию кокса Этот класс исключает: - производство угольных брикетов, см. 19.20 @ru
scope note: Bu sınıf aşağıdakileri kapsamaktadır; - müzikli veya diğer ses kayıtlı gramofon plaklarının, kompakt disklerin ve kasetlerin ana kopyalarından çoğaltılması, - sinema filmi ve diğer video kayıtları içeren kompakt disklerin ve kasetlerin ana kopyalarından çoğaltılması, - CD ve kasetlerdeki bilgisayar yazılım ve verilerin ana kopyalarından çoğaltılması. Kapsam dışı olanlar; - basılı ürünlerin çoğaltılması, bkz. 18.11, 18.12, - bilgisayar yazılımının yayımlanması, bkz. 58.2, - sinema filmlerinin, video kayıt bantları ve filmlerin DVD veya benzer aletler ile üretilmesi ve dağıtılması, bkz. 59.11, 59.12, 59.13, - sinema filmlerinin toplu gösterim amacına yönelik olarak çoğaltılması, bkz. 59.12, - ses kayıtları veya ses malzemeleri için ana kopyaların imalatı, bkz. 59.20. @tr
preferred label: Възпроизвеждане на записани носители @bg
preferred label: Rozmnožování nahraných nosičů @cs
preferred label: Reproduktion af indspillede medier @da
preferred label: Vervielfältigung von bespielten Ton-, Bild- und Datenträgern @de
preferred label: Αναπαραγωγή προεγγεγραμμένων μέσων @el
preferred label: Reproducción de soportes grabados @es
preferred label: Salvestiste paljundus @et
preferred label: Ääni-, kuva- ja atk-tallenteiden tuotanto @fi
preferred label: Reproduction d'enregistrements @fr
preferred label: Egyéb sokszorosítás
preferred label: Riproduzione su supporti registrati @it
preferred label: Įrašytų laikmenų tiražavimas @lt
preferred label: Ierakstu reproducēšana @lv
preferred label: Rieproduzzjoni ta' midja rreġistrata @mt
preferred label: Reproductie van opgenomen media @nl
preferred label: Reproduksjon av innspilte opptak @no
preferred label: Reprodukcja zapisanych nośników informacji @pl
preferred label: Reprodução de suportes gravados @pt
preferred label: Reproducerea înregistrărilor @ro
preferred label: Воспроизведение записей с носителя @ru
preferred label: Reprodukcia záznamových médií @sk
preferred label: Razmnoževanje posnetih nosilcev zapisa @sl
preferred label: Reproduktion av inspelningar @sv
preferred label: Kayıtlı medyanın çoğaltılması @tr
broader: Reproduction of recorded media

Manufacture of coke and refined petroleum products
type: Concept
notation: 19
status: valid
status modified: 2013-10-18
accepted date: 2013-10-18
in scheme: Statistical Classification of Economic Activities in the European Community, Rev. 2 (2008)
scope note: Преработка на суров нефт и въглища в използваеми продукти. Преобладава преработката на нефта - извличане на съставки от суровия нефт чрез крекинг и дестилиране. Обхваща също и производство за собствена сметка на характерни продукти (кокс, бутан, пропан, бензин, керосин, мазут и други), както производствени услуги (рафиниране по поръчка). Производството на газове, такива като етан, пропан и бутан като продукти на нефтените рафинерии се класифицира в този раздел. - добив на природен газ (метан, етан, бутан или пропан) - 06.20 - производство на нефтохимикали - раздел 20 - производство на промишлени газове - 20.11 - производство на нефтени газове (етан, пропан, бутан и други) от единици, различни от рафинериите - 20.14 - производство на газообразни горива, различни от нефтените газове (каменовъглен, воден, генераторен и заводски газ) - 35.21 @bg
scope note: Tento oddíl zahrnuje přeměnu surové ropy a uhlí na použitelné produkty určené ke konečné spotřebě. Dominantním procesem je rafinace ropy, která zahrnuje separaci jednotlivých komponent surové ropy za použití techniky krakování a destilace. Tento oddíl zahrnuje výrobu plynů jako jsou etan, propan a butan jako produktů rafinerií ropy. Tento oddíl zahrnuje také výrobu charakteristických produktů na vlastní účet (např. koksu, butanu, propanu, benzinu, petroleje (ke svícení), topného oleje) rovněž tak činnosti zpracovatelské (např. rafinaci na zakázku). Nezahrnuje výrobu těchto plynů v jiných třídách (20.14), výrobu průmyslových plynů (20.11), těžbu zemního plynu (metanu, etanu, butanu nebo propanu) (06.20) a výrobu topného (pohonného) plynu jiného než ropného (např. uhelného plynu, vodního plynu, generátorového plynu, plynárenského plynu) (35.21). Výroba petrochemikálií z rafinované ropy je klasifikována v oddílu 20. @cs
scope note: Diese Abteilung umfasst die Verarbeitung von Rohöl und Kohle zu gebrauchsfertigen Erzeugnissen. Das vorherrschende Verfahren ist die Mineralölverarbeitung durch Trennung von Rohöl in Teilerzeugnisse anhand von Verfahren wie Spaltung und Destillation. Diese Abteilung umfasst die Herstellung von Gasen wie Ethan, Propan und Butan als Erzeugnisse von Erdölraffinerien. Diese Abteilung umfasst sowohl die Herstellung charakteristischer Produkte auf eigene Rechnung (z. B. Koks, Butan, Propan, Benzin, Kerosin, Heizöl usw.) als auch Weiterverarbeitungsleistungen (z. B. Mineralölraffination im Lohnauftrag). Nicht eingeschlossen ist die Herstellung von Gasen in anderen Einheiten (20.14), die Herstellung von Industriegasen (20.11), die Gewinnung von Erdgas (Methan, Ethan, Butan bzw. Propan) (06.20) und die Herstellung gasförmiger Brennstoffe außer Erdölgas (z. B. Kohlengas, Wassergas, Generatorgas, Gas von Gaswerken) (35.21). Die Herstellung von petrochemischen Erzeugnissen aus raffiniertem Erdöl ist in Abteilung 20 eingereiht. @de
scope note: This division includes the transformation of crude petroleum and coal into usable products. The dominant process is petroleum refining, which involves the separation of crude petroleum into component products through such techniques as cracking and distillation. This division includes the manufacture of gases such as ethane, propane and butane as products of petroleum refineries. This division also includes the manufacture for own account of characteristic products (e.g. coke, butane, propane, petrol, kerosene, fuel oil etc.) as well as processing services (e.g. custom refining). Not included is the manufacture of such gases in other units (20.14), manufacture of industrial gases (20.11), extraction of natural gas (methane, ethane, butane or propane) (06.20), and manufacture of fuel gas, other than petroleum gases (e.g. coal gas, water gas, producer gas, gasworks gas) (35.21). The manufacture of petrochemicals from refined petroleum is classified in division 20. @en
scope note: Esta división comprende la transformación de crudo de petróleo y carbón en productos utilizables. El proceso dominante es el refino de petróleo, que consiste en la separación del crudo de petróleo en sus componentes mediante técnicas como el craqueo y la destilación. Esta división comprende también la elaboración por cuenta propia de productos característicos (por ejemplo, coque, butano, propano, queroseno, fueloil, etc.), así como los servicios de tratamiento (por ejemplo, refino por encargo). Esta división comprende la fabricación de gases como etano, propano y butano como productos de las refinerías de petróleo. No se incluye la fabricación de dichos gases en otras unidades (20.14), la fabricación de gases industriales (20.11), la extracción de gas natural (metano, etano, butano o propano) (06.20) ni la producción de gas combustible distinto de los gases de petróleo (por ejemplo, gas de hulla, gas de agua, gas pobre) (35.21). La fabricación de productos petroquímicos a partir de petróleo refinado se clasifica en la división 20. @es
scope note: Cette division concerne la transformation du pétrole brut et du charbon en produits utilisables. Le processus dominant est le raffinage du pétrole, qui implique la séparation du pétrole brut en composants par des techniques telles que le craquage et la distillation. Cette division comprend la fabrication de gaz tels que l’éthane, le propane et le butane en tant que produits des raffineries de pétrole. Cette division vise aussi bien la fabrication pour compte propre des produits caractéristiques (coke, butane, propane, essence, kérosène, fuel, etc.) que des services de traitement (raffinage à façon). Ne sont pas comprises la fabrication de tels gaz dans d’autres unités (20.14), la fabrication de gaz industriels (20.11), l’extraction de gaz naturel (méthane, éthane, butane ou propane) (06.20) et la fabrication de combustibles gazeux autres que les gaz de pétrole (par exemple: gaz de houille, gaz à l’eau, gaz de gazogène, gaz d’usine à gaz) (35.21). La fabrication de produits pétrochimiques à partir de pétrole raffiné est rangée dans la division 20. @fr
scope note: Ovaj odjeljak uključuje transformaciju sirove nafte i ugljena u proizvode prikladne za upotrebu. Dominantan proces jest rafiniranje nafte i uključuje odvajanje sirove nafte u komponentne proizvode korištenjem tehnika kao što su krekiranje i destilacija. Ovaj odjeljak također uključuje proizvodnju karakterističnih proizvoda za vlastiti račun (npr. koks, butan, propan, nafta, kerozin, ulja za loženje itd.) kao i usluge obrade (npr. rafiniranje za korisnike). Ovaj odjeljak uključuje proizvodnju plinova kao što su etan, propan i butan, kao proizvode naftnih rafinerija Nije uključena prerada tih plinova u drugim jedinicama (20.14), prerada industrijskih plinova (20.11), vađenje zemnog plina (metana, etana, butana ili propana) (06.20) i prerada plinovitih goriva, osim naftnih plinova (npr. plin od ugljena, vodeni plin, proizvodni plin, plin iz plinara, 35.21). Proizvodnja petrokemikalija iz rafinirane nafte razvrstava se u odjeljak 20.
scope note: Į šį skyrių įeina žalios naftos ir akmens anglių perdirbimas į tinkamus vartoti produktus. Vyraujantis technologijos procesas yra naftos rafinavimas, į kurį įeina žalios naftos išskaidymas į sudedamuosius produktus, taikant krekingo metodą arba distiliuojant. Į šį skyrių taip pat įeina būdingų produktų, pvz., kokso, butano, propano, benzino, žibalo, mazuto ir kt., gamyba savo sąskaita ir apdorojimo paslaugų teikimas, pvz., užsakomasis rafinavimas. Į šį skyrių įeina etano, propano ir butano dujų ir kt., kaip naftos rafinavimo produktų, gamyba. Čia neįeina minėtų dujų gamyba kituose verslo vienetuose (20.14), pramoninių dujų gamyba (20.11), gamtinių dujų (metano, etano, butano ar propano) gavyba (06.20) ir kurui naudojamų dujų, kitokių nei naftos dujos, pvz., akmens anglių, vandens, generatorinių ar gamyklinių dujų, gamyba (35.21). Rafinuotos naftos chemijos produktų gamyba klasifikuojama 20 skyriuje. @lt
scope note: Bu bölüm, ham petrolün ve maden kömürünün kullanılabilir ürünlere dönüştürülmesini kapsamaktadır. Ana süreç, ham petrolün parçalama ve damıtma gibi teknikler vasıtasıyla olan ham petrolün bileşenlere ayrılmasını kapsayan petrolün rafine edilmesidir. Ayrıca bu bölüm, işleme hizmetleri de (örn. fason rafine) dahil kendi hesaplarına özellikli ürünlerin (örn. kok kömürü, bütan gazı, propan gazı, petrol, gaz yağı, fuel oil v.b.) imalatını kapsamaktadır. Bu bölüm, etan, propan, bütan gibi petrol rafineri ürünlerinin imalatını da kapsamaktadır. Rafineri dışında diğer birimlerde üretilen gazların imalatı (20.14), sanayi gazların imalatı (20.11), doğal gazın çıkarılması (metan, etan, bütan veya propan) (06.20), petrol ürünü gazları dışında ısıtmada kullanılan gazların imalatı (örn. havagazı, su gazı, jeneratör gazı, gazhane gazı) (35.21). Rafine edilmiş petrolden petro kimyasalların imalatı bölüm 20 de @tr
preferred label: Производство на кокс и рафинирани нефтопродукти @bg
preferred label: Výroba koksu a rafinovaných ropných produktů @cs
preferred label: Fremstilling af koks og raffinerede mineralolieprodukter @da
preferred label: Kokerei und Mineralölverarbeitung @de
preferred label: Παραγωγή οπτάνθρακα και προϊόντων διύλισης πετρελαίου @el
preferred label: Coquerías y refino de petróleo @es
preferred label: Koksi ja puhastatud naftatoodete tootmine @et
preferred label: Koksin ja jalostettujen öljytuotteiden valmistus @fi
preferred label: Cokéfaction et raffinage @fr
preferred label: Kokszgyártás, kőolaj-feldolgozás
preferred label: Fabbricazione di coke e prodotti derivanti dalla raffinazione del petrolio @it
preferred label: Kokso ir rafinuotų naftos produktų gamyba @lt
preferred label: Koksa un naftas pārstrādes produktu ražošana @lv
preferred label: Manifattura ta' kokk u prodotti taż-żejt irraffinat @mt
preferred label: Vervaardiging van cokes en van geraffineerde aardolieproducten @nl
preferred label: Produksjon av kull- og raffinerte petroleumsprodukter @no
preferred label: Wytwarzanie i przetwarzanie koksu i produktów rafinacji ropy naftowej @pl
preferred label: Fabricação de coque e de produtos petrolíferos refinados @pt
preferred label: Fabricarea produselor de cocserie şi a produselor obţinute din prelucrarea ţiţeiului @ro
preferred label: Производство кокса и продуктов нефтепереработки @ru
preferred label: Výroba koksu a rafinovaných ropných produktov @sk
preferred label: Proizvodnja koksa in naftnih derivatov @sl
preferred label: Tillverkning av stenkolsprodukter och raffinerade petroleumprodukter @sv
preferred label: Kok kömürü ve rafine edilmiş petrol ürünleri imalatı @tr
broader: MANUFACTURING
narrower: Manufacture of coke oven products
narrower: Manufacture of refined petroleum products

Manufacture of coke oven products
type: Concept
notation: 19.1
status: valid
status modified: 2013-10-18
accepted date: 2013-10-18
in scheme: Statistical Classification of Economic Activities in the European Community, Rev. 2 (2008)
scope note: Данный класс включает производство жидких, горючих газообразных веществ или прочих продуктов из сырой нефти, битуминозных минералов или их фракционных продуктов. Очищение нефти включает несколько ступеней: фракционирование; непосредственно дистилляцию сырой нефти и разделение/крекинг-процесс. Этот класс включает: - производство моторного/дизельного топлива: газолина, керосина и т.д. - производство топлива: облегченного, среднего и тяжелого горючего, очищенных газов, таких как этан, пропан, бутан и т.д. - производство смазочных масел или смазок, включая выпуск продукции из отходов нефти - производство продуктов для нефтехимической промышленности и для строительства дорог - производство различных видов продукции: уайт-спирита, вазелина, твердого парафина, петролатума и т.д. - производство нефтебрикетов - производство бензоспирта путем смешения Этот класс также включает: - производство торфяных брикетов - производство угольных брикетов и брикетов из лигнита @ru
preferred label: Производство на кокс и продукти на коксуването @bg
preferred label: Výroba koksárenských produktů @cs
preferred label: Fremstilling af koks mv. @da
preferred label: Kokerei @de
preferred label: Παραγωγή προϊόντων οπτανθρακοποίησης (κωκοποίησης) @el
preferred label: Coquerías @es
preferred label: Koksitootmine @et
preferred label: Koksituotteiden valmistus @fi
preferred label: Cokéfaction @fr
preferred label: Kokszgyártás
preferred label: Fabbricazione di prodotti di cokeria @it
preferred label: Koksavimo krosnių produktų gamyba @lt
preferred label: Koksēšanas produktu ražošana @lv
preferred label: Manifattura ta' prodotti tal-forn tal-kokk @mt
preferred label: Vervaardiging van cokesovenproducten @nl
preferred label: Produksjon av kullprodukter @no
preferred label: Wytwarzanie i przetwarzanie koksu @pl
preferred label: Fabricação de produtos de coqueria @pt
preferred label: Fabricarea produselor de cocserie @ro
preferred label: Производство продукции коксовых печей @ru
preferred label: Výroba produktov koksárenských pecí @sk
preferred label: Proizvodnja koksa @sl
preferred label: Tillverkning av stenkolsprodukter @sv
preferred label: Kok fırını ürünlerinin imalatı @tr
broader: Manufacture of coke and refined petroleum products
narrower: Manufacture of coke oven products

Manufacture of coke oven products
type: Concept
notation: 19.10
status: valid
status modified: 2013-10-18
accepted date: 2013-10-18
in scheme: Statistical Classification of Economic Activities in the European Community, Rev. 2 (2008)
scope note: - експлоатация коксови пещи - производство на кокс и полукокс - смоли и смолен (пеков) кокс от каменовъглен катран - производство на газ от коксови пещи - производство на ретортен въглен и катран от въглища - агломериране на кокс - производство на брикети от антрацитни и черни въглища - 19.20 @bg
scope note: Z: - provoz koksárenských pecí - výrobu koksu a polokoksu - výrobu dehtu a dehtového koksu - výrobu plynu z koksárenské pece - produkce surového (nezpracovaného) uhlí a hnědouhelných dehtů - aglomerace (spékání) koksu N: - výrobu uhelných palivových briket (19.20) @cs
scope note: Diese Klasse umfasst: - Betrieb von Koksöfen - Herstellung von Koks und Schwelkoks - Herstellung von Pech und Pechkoks - Herstellung von Steinkohlegas - Herstellung von Steinkohle- und Braunkohlerohteer - Agglomerieren von Koks Diese Klasse umfasst nicht: - Herstellung von Braunkohlenbriketts (s. 19.20) @de
scope note: This class includes: - operation of coke ovens - production of coke and semi-coke - production of pitch and pitch coke - production of coke oven gas - production of crude coal and lignite tars - agglomeration of coke This class excludes: - manufacture of coal fuel briquettes, see 19.20 @en
scope note: Esta clase comprende: - la explotación de coquerías - la producción de coque y semicoque - la producción de brea y coque de brea - la producción de gas de hulla en coquerías - la producción de alquitranes de hulla y lignito en bruto - la aglomeración de coque Esta clase no comprende: - la fabricación de briquetas combustibles de hulla (véase 19.20) @es
scope note: Cette classe comprend: - l’exploitation de fours à coke - la production de coke ou de semi-coke - la production de brai et de coke de brai - la production de gaz de cokerie - la production de goudrons bruts de houille et de lignite - l’agglomération du coke Cette classe ne comprend pas: - la fabrication de briquettes de houille, voir 19.20 @fr
scope note: Ovaj razred uključuje: - rad koksnih peći - proizvodnju koksa i polukoksa - proizvodnju smole i smolastoga koksa - proizvodnju koksnog plina iz koksnih peći - proizvodnju sirovoga katrana iz ugljena i lignita - briketiranje koksa Ovaj razred isključuje: - proizvodnju goriva od briketa ugljena, vidi 19.20
scope note: Į šią klasę įeina: - koksavimo krosnių eksploatavimas - kokso ar puskoksio gamyba - pikio ir pikio kokso gamyba - koksavimo krosnių dujų gamyba - žalios anglies ir rusvųjų akmens anglių degutų gamyba - kokso aglomeravimas Į šią klasę neįeina: - akmens anglių kuro briketų gamyba, žr. 19.20 @lt
scope note: Данный раздел включает переработку органического и неорганического сырья, материалов посредством химических процессов и выпуск готовой продукции. Он разделен на производство основных химических веществ, которые относятся к первой промышленной группе, куда включено промежуточное производство и готовую продукцию, полученную путем дальнейшей переработки основных химикатов, которые относятся к остальным направлениям в промышленности. @ru
scope note: Bu sınıf aşağıdakileri kapsamaktadır; - kok fırınlarının işletimi, - kok ve yarı-kok üretilmesi, - zift ve zift koku üretilmesi, - kok gazı üretilmesi, - ham kömür ve linyit katranlarının üretilmesi, - kok kömürünün topak haline getirilmesi Kapsam dışı olanlar; - kömür yakıtı briketlerinin imal edilmesi, bkz. 19.20. @tr
preferred label: Производство на кокс и продукти на коксуването @bg
preferred label: Výroba koksárenských produktů @cs
preferred label: Fremstilling af koks mv. @da
preferred label: Kokerei @de
preferred label: Παραγωγή προϊόντων οπτανθρακοποίησης (κωκοποίησης) @el
preferred label: Coquerías @es
preferred label: Koksitootmine @et
preferred label: Koksituotteiden valmistus @fi
preferred label: Cokéfaction @fr
preferred label: Kokszgyártás
preferred label: Fabbricazione di prodotti di cokeria @it
preferred label: Koksavimo krosnių produktų gamyba @lt
preferred label: Koksēšanas produktu ražošana @lv
preferred label: Manifattura ta' prodotti tal-forn tal-kokk @mt
preferred label: Vervaardiging van cokesovenproducten @nl
preferred label: Produksjon av kullprodukter @no
preferred label: Wytwarzanie i przetwarzanie koksu @pl
preferred label: Fabricação de produtos de coqueria @pt
preferred label: Fabricarea produselor de cocserie @ro
preferred label: Производство продукции коксовых печей @ru
preferred label: Výroba produktov koksárenských pecí @sk
preferred label: Proizvodnja koksa @sl
preferred label: Tillverkning av stenkolsprodukter @sv
preferred label: Kok fırını ürünlerinin imalatı @tr
broader: Manufacture of coke oven products

Manufacture of refined petroleum products
type: Concept
notation: 19.2
status: valid
status modified: 2013-10-18
accepted date: 2013-10-18
in scheme: Statistical Classification of Economic Activities in the European Community, Rev. 2 (2008)
scope note: Данная группа включает производство основных химических продуктов, удобрений и азотных смесей, а также пластика и основных синтетических резиновых изделий в первичных формах. @ru
preferred label: Производство на рафинирани нефтопродукти и брикети от въглища и торф @bg
preferred label: Výroba rafinovaných ropných produktů @cs
preferred label: Fremstilling af raffinerede mineralolieprodukter @da
preferred label: Mineralölverarbeitung @de
preferred label: Παραγωγή προϊόντων διύλισης πετρελαίου @el
preferred label: Refino de petróleo @es
preferred label: Puhastatud naftatoodete tootmine @et
preferred label: Jalostettujen öljytuotteiden valmistus @fi
preferred label: Raffinage du pétrole @fr
preferred label: Kőolaj-feldolgozás
preferred label: Fabbricazione di prodotti derivanti dalla raffinazione del petrolio @it
preferred label: Rafinuotų naftos produktų gamyba @lt
preferred label: Naftas pārstrādes produktu ražošana @lv
preferred label: Manifattura ta' prodotti taż-żejt irraffinat @mt
preferred label: Vervaardiging van geraffineerde aardolieproducten @nl
preferred label: Produksjon av raffinerte petroleumsprodukter @no
preferred label: Wytwarzanie i przetwarzanie produktów rafinacji ropy naftowej @pl
preferred label: Fabricação de produtos petrolíferos refinados @pt
preferred label: Fabricarea produselor obţinute din prelucrarea ţiţeiului @ro
preferred label: Производство продуктов нефтепереработки @ru
preferred label: Výroba rafinovaných ropných produktov @sk
preferred label: Proizvodnja naftnih derivatov @sl
preferred label: Petroleumraffinering @sv
preferred label: Rafine edilmiş petrol ürünleri imalatı @tr
broader: Manufacture of coke and refined petroleum products
narrower: Manufacture of refined petroleum products

Manufacture of refined petroleum products
type: Concept
notation: 19.20
status: valid
status modified: 2013-10-18
accepted date: 2013-10-18
in scheme: Statistical Classification of Economic Activities in the European Community, Rev. 2 (2008)
scope note: Производството на течни, газообразни горива или други продукти от суров нефт, битуминозни материали или техни фракционни продукти е включено в този клас. Рафинирането на нефта включва една или повече от следните дейности: фракциониране, пряка дестилация и крекинг. - производство на гориво за двигатели: бензин, керосин и други - производство на гориво - леки, средни и тежки нефтени дестилати, нефтени газове от рафинерии: етан, пропан, бутан и други - производство на смазочни и други масла на нефтена основа, вкл. отпадъчни масла - производство на продукти за нефтохимия и за пътни настилки - производство на разнообразни нефтени продукти: минерален терпентин (White spirit), вазелин, восъци, нефтен битум и други - производство на брикети на нефтена основа - производство на бензиново-алкохолни смеси (газохол), т.е. смесване на биогориво (алкохол) с нефт - производство на брикети от торф - производство на брикети от антрацитни, черни, кафяви и лигнитни въглища @bg
scope note: Tato třída zahrnuje výrobu kapalných nebo plynných paliv nebo jiných produktů ze surové ropy, bituminózních minerálů (rud, hornin) nebo jejich frakčních produktů. Rafinace ropy zahrnuje jednu nebo více z následujících činností: frakcionace; přímá destilace surové ropy; krakování Z: - výrobu motorového paliva: benzin, petrolej ke svícení (kerosin) atd. - výrobu paliva: lehký, střední a těžký topný olej, rafinérské plyny jako etan, propan, butan atd. - výrobu mazacích olejů a vazelín na bázi olejů včetně olejů odpadních - výrobu produktů pro petrochemický průmysl a pro výrobu silničních svršků - výrobu různých produktů: lakový benzín, vazelína (vč. technické), parafin atd. - výrobu briket z ropy (ropných produktů) - míchání biopaliv, tj. alkoholů s ropou (např. gasohol) ZT: - výrobu briket z rašeliny - výrobu briket z černého a hnědého uhlí (lignitu) @cs
scope note: Diese Klasse umfasst die Herstellung von flüssigen oder gasförmigen Brennstoffen aus Rohöl, bituminösen Mineralen und deren Fraktionierungsprodukten. Das Raffinieren von Erdöl umfasst mindestens eine der folgenden Tätigkeiten: Fraktionierung; direkte Destillation von Rohöl; Spaltung Diese Klasse umfasst: - Herstellung von Motorentreibstoff: Benzin, Kerosin usw. - Herstellung von Brennstoff: leichtes, mittelschweres und schweres Heizöl, Raffineriegase wie Ethan, Propan, Butan usw. - Herstellung von Schmierölen und -fetten aus Roh- und Altöl - Herstellung von Erzeugnissen für die erdölchemische Industrie und die Herstellung von Straßenbelägen - Herstellung verschiedener Erzeugnisse: Testbenzin, Vaseline, Paraffin, Vaselin usw. - Herstellung von Ölbriketts - Beimischen von Bio-Kraftstoffen, d. h. von Alkoholen zu Motorentreibstoffen (z. B. Gasohol) Diese Klasse umfasst ferner: - Herstellung von Torfbriketts - Herstellung von Stein- und Braunkohlebriketts @de
scope note: This class includes the manufacture of liquid or gaseous fuels or other products from crude petroleum, bituminous minerals or their fractionation products. Petroleum refining involves one or more of the following activities: fractionation; straight distillation of crude oil; and cracking. This class includes: - production of motor fuel: gasoline, kerosene etc. - production of fuel: light, medium and heavy fuel oil, refinery gases such as ethane, propane, butane etc. - manufacture of oil-based lubricating oils or greases, including from waste oil - manufacture of products for the petrochemical industry and for the manufacture of road coverings - manufacture of various products: white spirit, vaseline, paraffin wax, petroleum jelly etc. - manufacture of petroleum briquettes - blending of biofuels, i.e. blending of alcohols with petroleum (e.g. gasohol) This class also includes: - manufacture of peat briquettes - manufacture of hard-coal and lignite fuel briquettes @en
scope note: Esta clase comprende la fabricación de combustibles líquidos y gaseosos y de otros productos a partir del crudo de petróleo, minerales bituminosos o los productos de su fraccionamiento. El refino de petróleo comprende una o varias de las actividades siguientes: fraccionamiento, destilación directa de crudo de petróleo y craqueo. Esta clase comprende: - la producción de combustible para motores: gasolina, queroseno, etc. - la producción de combustible: fueloil ligero, medio y pesado, gases de refinería como etano, propano, butano, etc. - la fabricación de aceites o grasas lubricantes derivados del petróleo, incluso a partir de residuos de lubricantes - la fabricación de productos para la industria petroquímica y para la elaboración de revestimientos de carreteras - la fabricación de diversos productos: bencina mineral, vaselina, cera de parafina, petrolato, etc. - la fabricación de briquetas de petróleo - la mezcla de biocombustibles, es decir, la mezcla de alcoholes con petróleo (p. ej., gasohol) Esta clase comprende también: - la fabricación de briquetas de turba - la fabricación de briquetas combustibles de hulla y lignito @es
scope note: Cette classe comprend la fabrication de combustibles liquides ou gazeux ou d’autres produits obtenus à partir du pétrole brut, de minéraux bitumineux ou résultant de leur distillation fractionnée. Les techniques de raffinage du pétrole impliquent la mise en œuvre d’une ou plusieurs activités: la distillation fractionnée, la distillation directe du pétrole brut et le craquage. Cette classe comprend: - la production de carburants pour moteurs: essence, kérosène, etc. - la production de combustibles: fiouls légers, demi-lourds et lourds, gaz de raffinerie tels qu’éthane, propane, butane, etc. - la fabrication d’huiles de graissage et de graisses lubrifiantes à partir de pétrole, y compris les résidus de raffinage - la fabrication de produits pour la pétrochimie et pour les revêtements routiers - la fabrication de produits divers: white-spirit, vaseline, paraffine, etc. - la fabrication de briquettes de pétrole - le mélange de biocarburants, c’est-à-dire l’ajout d’alcool dans le pétrole (essence-alcool, par exemple) Cette classe comprend également: - la fabrication de briquettes de tourbe - la fabrication de briquettes de houille et de lignite @fr
scope note: Ovaj razred uključuje proizvodnju tekućih i plinovitih goriva te drugih proizvoda od sirove nafte, bitumenoznih minerala ili proizvoda njihovih frakcija. Rafiniranje nafte uključuje samo jednu ili neke od sljedećih djelatnosti: frakcioniranje, izravnu destilaciju sirove nafte i krekiranje. Ovaj razred uključuje: - proizvodnju motornih goriva: benzina, kerozina itd. - proizvodnju destiliranih goriva: lakih, srednjih i teških, rafiniranih plinova kao što su etan, propan butan itd. - proizvodnju mazivih ulja i maziva na bazi nafte te na bazi otpadnog ulja - proizvodnju proizvoda za petrokemijsku industriju te potrebe cestogradnje - proizvodnju različitih proizvoda: bijelog špirita (drvnog alkohola), vazelina, parafina, voska itd. - proizvodnju naftnog briketa - miješanje biogoriva tj. miješanje alkohola s naftom (npr. gazohol) Ovaj razred također uključuje: - proizvodnju briketiranog treseta - proizvodnju briketiranog kamenog ugljena i briketiranog lignita
scope note: Į šią klasę įeina skystojo ar dujinio kuro ar kitų gaminių gamyba iš žalios naftos, bituminės mineralinės žaliavos ar jos frakcijų. Naftos perdirbimui priskiriamos viena arba keletas iš paminėtų veiklų: frakcionavimas, žalios naftos tiesioginis distiliavimas ir krekingas. Į šią klasę įeina: - automobilinių degalų: benzino, žibalo ir kt., gamyba - kuro: lengvojo, vidutinio ir sunkiojo mazuto, naftos perdirbimo įmonių dujų, tokių kaip etano, propano, butano ir kt., gamyba - tepalinių alyvų ir tepalų, įskaitant pagamintus iš alyvų atliekų, gamyba - produktų naftos chemijos pramonei ir kelio dangoms gamyba - įvairių produktų: vaitspirito, vazelino, parafino, techninio vazelino ir kt., gamyba - naftos briketų gamyba - biokuro maišymas, t.y. etanolio maišymas su naftos produktais, pvz., gazolinu Į šią klasę taip pat įeina: - durpių briketų gamyba - juodųjų akmens anglių ir rusvųjų akmens anglių kuro briketų gamyba @lt
scope note: Этот класс включает: - производство сжиженных или сжатых неорганических промышленных или медицинских газов: • природного газа • жидкого или сжатого воздуха • паров хладагента • смешанных промышленных газов • инертных газов, таких как углекислый газ • изолирующего газа Этот класс исключает: - добычу таких газов как метан, этан, бутан или пропан, см. 06.20 - производство горючих газов, таких как, этан, бутан или пропан в результате очистки нефти, см. 19.20 - производство газообразного горючего из угля, отходов и т.д., см. 35.21 @ru
scope note: Bu sınıf, ham petrolden, bitümlü (ziftli) minerallerden ya da ayrışmış ürünlerinden sıvı ya da gazlı yakıtların veya diğer ürünlerin imalatını kapsamaktadır. Petrolün rafine edilmesi, aşağıdaki faaliyetlerden birini veya daha fazlasını kapsamaktadır: Kısımlara ayırma; ham petrolün doğrudan damıtılması ve parçalanması. Bu sınıf aşağıdakileri kapsamaktadır - motor yakıtı üretimi: benzin, gazyağı vb., - sıvı yakıt üretimi: hafif, orta ve ağır sıvı yakıtlar, etan, propan, bütan vb. rafine edilmiş gazlar, - atık yağlardan olanlar dahil petrol temelli yağlama yağları (makine yağları) veya gres yağları imalatı, - petrokimya sanayii için ve yol kaplamalarının imali için ürünlerin imalatı, - çeşitli ürünlerin imalatı: white spirit, vazelin, parafin, saf vazelin vb., - petrol briketlerinin imalatı - bio yakıtların harmanlanması, örn. alkollerin petrol ile harmanlanması (örn. biobenzin (gasohol), biodizel) Ayrıca bu sınıf aşağıdakileri de kapsamaktadır; - turba briketleri (linyit ve kömür tozundan basınçla elde edilen yakıt) imalatı, - taş kömürü ve linyit kömürü briketleri (linyit ve kömür tozundan basınçla elde edilen yakıt) imalatı. @tr
preferred label: Производство на рафинирани нефтопродукти и брикети от въглища и торф @bg
preferred label: Výroba rafinovaných ropných produktů @cs
preferred label: Fremstilling af raffinerede mineralolieprodukter @da
preferred label: Mineralölverarbeitung @de
preferred label: Παραγωγή προϊόντων διύλισης πετρελαίου @el
preferred label: Refino de petróleo @es
preferred label: Puhastatud naftatoodete tootmine @et
preferred label: Jalostettujen öljytuotteiden valmistus @fi
preferred label: Raffinage du pétrole @fr
preferred label: Kőolaj-feldolgozás
preferred label: Fabbricazione di prodotti derivanti dalla raffinazione del petrolio @it
preferred label: Rafinuotų naftos produktų gamyba @lt
preferred label: Naftas pārstrādes produktu ražošana @lv
preferred label: Manifattura ta' prodotti taż-żejt irraffinat @mt
preferred label: Vervaardiging van geraffineerde aardolieproducten @nl
preferred label: Produksjon av raffinerte petroleumsprodukter @no
preferred label: Wytwarzanie i przetwarzanie produktów rafinacji ropy naftowej @pl
preferred label: Fabricação de produtos petrolíferos refinados @pt
preferred label: Fabricarea produselor obţinute din prelucrarea ţiţeiului @ro
preferred label: Производство продуктов нефтепереработки @ru
preferred label: Výroba rafinovaných ropných produktov @sk
preferred label: Proizvodnja naftnih derivatov @sl
preferred label: Petroleumraffinering @sv
preferred label: Rafine edilmiş petrol ürünleri imalatı @tr
broader: Manufacture of refined petroleum products

Manufacture of chemicals and chemical products
type: Concept
notation: 20
status: valid
status modified: 2013-10-18
accepted date: 2013-10-18
in scheme: Statistical Classification of Economic Activities in the European Community, Rev. 2 (2008)
scope note: Преобразуване на органични и неорганични суровини чрез химични процеси и получаването на химични продукти. Производството на основните химични вещества (20.1) се разграничава от производството на междинни и крайни продукти, получени чрез допълнителна преработка на основните химични вещества (20.2 - 20.7). @bg
scope note: Tento oddíl zahrnuje transformaci organických a anorganických surovin chemickými procesy a vytváření chemických produktů. Rozlišuje zde mezi výrobou základních chemických látek, které tvoří první průmyslovou skupinu a výrobou meziproduktů a konečných produktů, které jsou výsledkem dalšího zpracování základních chemických látek tvořících zbývající průmyslové (odvětvové) třídy. @cs
scope note: Diese Abteilung umfasst die Verarbeitung organischer und anorganischer Rohstoffe in einem chemischen Verfahren zu chemischen Erzeugnissen. Hierbei wird unterschieden zwischen der Herstellung von chemischen Grundstoffen (in der ersten Gruppe) und der Herstellung von Zwischen- und Endprodukten durch Weiterverarbeitung chemischer Grundstoffe (s. übrige Gruppen). @de
scope note: This division includes the transformation of organic and inorganic raw materials by a chemical process and the formation of products. It distinguishes the production of basic chemicals that constitute the first industry group from the production of intermediate and end products produced by further processing of basic chemicals that make up the remaining industry classes. @en
scope note: Esta división comprende la transformación de materias primas orgánicas e inorgánicas mediante un proceso químico y la formación de productos. Distingue entre la fabricación de productos químicos básicos que constituye el primer grupo, y la fabricación de productos intermedios y finales mediante el tratamiento de productos químicos básicos, que se incluyen en las demás clases. @es
scope note: Cette division comprend la transformation de matières premières organiques et inorganiques par un procédé chimique et la formation de produits. Elle distingue la production de produits chimiques de base, qui constituent le premier groupe de la fabrication de produits intermédiaires et finals produits par transformation de produits chimiques de base, qui constituent les autres classes. @fr
scope note: Ovaj odjeljak uključuje transformaciju organskih ili anorganskih sirovina kemijskim procesom te oblikovanje proizvoda. Ovdje razlikujemo proizvodnju osnovnih kemikalija, koje čine prvu industrijsku skupinu od intermedijarnih i konačnih proizvoda, koji čine preostale industrijske razrede, a proizvedeni su daljnjom preradom osnovnih kemikalija.
scope note: Į šį skyrių įeina organinių ir neorganinių žaliavų cheminis perdirbimas ir chemijos produktų gamyba. Jis atskiria pagrindinių chemikalų gamybą, sudarančią pirmąją pramoninę grupę, nuo tarpinių ir galutinių produktų, gautų toliau perdirbant pagrindinius chemikalus, gamybos, sudarančios likusias pramonines klases. @lt
scope note: Этот класс включает: - производство окрашивающих веществ и пигментов из любых источников в основных формах или концентратах Этот класс также включает: - производство продуктов, используемых для флуоресцентного или люминесцентного освещения Этот класс исключает: - производство готовых красителей и пигментов, см. 20.30 @ru
scope note: Bu bölüm, organik ve inorganik hammaddelerin kimyasal işlemlerle dönüştürülmesini ve ürünlerin oluşumunu kapsamaktadır. Bu durum, ilk sanayi grubundan oluşan ana kimyasalların üretimini; geri kalan faaliyet gruplarını oluşturan ana kimyasalların daha ileri işlemlerle üretilen ara ve nihai ürünlerin üretiminden ayırır. @tr
preferred label: Производство на химични продукти @bg
preferred label: Výroba chemických látek a chemických přípravků @cs
preferred label: Fremstilling af kemiske produkter @da
preferred label: Herstellung von chemischen Erzeugnissen @de
preferred label: Παραγωγή χημικών ουσιών και προϊόντων @el
preferred label: Industria química @es
preferred label: Kemikaalide ja keemiatoodete tootmine @et
preferred label: Kemikaalien ja kemiallisten tuotteiden valmistus @fi
preferred label: Industrie chimique @fr
preferred label: Vegyi anyag, -termék gyártása
preferred label: Fabbricazione di prodotti chimici @it
preferred label: Chemikalų ir chemijos produktų gamyba @lt
preferred label: Ķīmisko vielu un ķīmisko produktu ražošana @lv
preferred label: Manifattura ta' kimiċi u prodotti kimiċi @mt
preferred label: Vervaardiging van chemische producten @nl
preferred label: Produksjon av kjemikalier og kjemiske produkter @no
preferred label: Produkcja chemikaliów i wyrobów chemicznych @pl
preferred label: Fabricação de produtos químicos e de fibras sintéticas e artificiais @pt
preferred label: Fabricarea substanţelor şi a produselor chimice @ro
preferred label: Производство продуктов химической промышленности @ru
preferred label: Výroba chemikálií a chemických produktov @sk
preferred label: Proizvodnja kemikalij, kemičnih izdelkov @sl
preferred label: Tillverkning av kemikalier och kemiska produkter @sv
preferred label: Kimyasalların ve kimyasal ürünlerin imalatı @tr
broader: MANUFACTURING
narrower: Manufacture of basic chemicals, fertilisers and nitrogen compounds, plastics and synthetic rubber in primary forms
narrower: Manufacture of pesticides and other agrochemical products
narrower: Manufacture of paints, varnishes and similar coatings, printing ink and mastics
narrower: Manufacture of soap and detergents, cleaning and polishing preparations, perfumes and toilet preparations
narrower: Manufacture of other chemical products
narrower: Manufacture of man-made fibres

Manufacture of basic chemicals, fertilisers and nitrogen compounds, plastics and synthetic rubber in primary forms
type: Concept
notation: 20.1
status: valid
status modified: 2013-10-18
accepted date: 2013-10-18
in scheme: Statistical Classification of Economic Activities in the European Community, Rev. 2 (2008)
scope note: Тази група включва производство на основни химични вещества, азотни съединения и торове, полимери и синтетичен каучук в първични форми. @bg
scope note: Tato skupina zahrnuje výrobu základních chemických látek, hnojiv a příslušných dusíkatých sloučenin jakož i plastů a syntetického kaučuku v primárních formách. @cs
scope note: Diese Gruppe umfasst die Herstellung von chemischen Grundstoffen, Düngemitteln und den entsprechenden Stickstoffverbindungen sowie von Kunststoffen und synthetischem Kautschuk in Primärformen. @de
scope note: This group includes the manufacture of basic chemical products, fertilisers and associated nitrogen compounds, as well as plastics and synthetic rubber in primary forms. @en
scope note: Este grupo comprende la fabricación de productos químicos básicos, fertilizantes y compuestos nitrogenados, así como de plásticos y caucho sintético en sus formas primarias. @es
scope note: Ce groupe comprend la fabrication de produits chimiques de base, de produits azotés et d’engrais, ainsi que de matières plastiques de base et de caoutchouc synthétique. @fr
scope note: Ova skupina uključuje proizvodnju osnovnih kemijskih proizvoda, mineralnih gnojiva i pripadajućih dušičnih spojeva, kao i proizvodnju plastike i sintetičke gume u primarnom obliku.
scope note: Į šią grupę įeina pagrindinių chemikalų, trąšų ir susijusių azoto junginių, taip pat pirminių formų plastikų ir sintetinio kaučiuko gamyba. @lt
scope note: Данный класс включает производство химикатов при помощи простых процессов. Результатом данных процессов обычно служит получение отдельных химических элементов или определенных химических смесей. Этот класс включает: - производство химических элементов (за исключением промышленных газов и основных металлов) - производство неорганических кислот, за исключением азотной кислоты - производство щелочи, щелока и прочих неорганических веществ, за исключением аммония - производство прочих неорганических смесей - обжиг железного колчедана - производство дистиллированной воды Этот класс также включает: - обогащение урановой и ториевой руды Этот класс исключает: - производство промышленных газов, см. 20.11 - производство азотных удобрений и азотных соединений, см. 20.15 - производство аммония, см. 20.15 - производство хлорида аммония, см. 20.15 - производство нитритов и нитрата калия, см. 20.15 - производство углекислого аммония, см. 20.15 - производство ароматизированной дистиллированной воды, см. 20.53 - производство основных металлов, см. раздел 24 @ru
scope note: Bu grup, temel kimyasal maddelerin, gübrelerin ve azot bileşikleri imalatını kapsadığı gibi ilk formda plastik ve sentetik kauçukların imalatını da kapsamaktadır. @tr
preferred label: Производство на основни химични вещества @bg
preferred label: Výroba základních chemických látek, hnojiv a dusíkatých sloučenin, plastů a syntetického kaučuku v primárních formách @cs
preferred label: Fremstilling af basiskemikalier, gødningsstoffer og nitrogenprodukter, plast og syntetisk gummi i ubearbejdet form @da
preferred label: Herstellung von chemischen Grundstoffen, Düngemitteln und Stickstoffverbindungen, Kunststoffen in Primärformen und synthetischem Kautschuk in Primärformen @de
preferred label: Παραγωγή βασικών χημικών προϊόντων, λιπασμάτων και αζωτούχων ενώσεων, πλαστικών και συνθετικών υλών σε πρωτογενείς μορφές @el
preferred label: Fabricación de productos químicos básicos, compuestos nitrogenados, fertilizantes, plásticos y caucho sintético en formas primarias @es
preferred label: Põhikemikaalide, väetise ja lämmastikuühendite tootmine; plasti ja sünteeskautšuki tootmine algkujul @et
preferred label: Peruskemikaalien, lannoitteiden ja typpiyhdisteiden, muoviaineiden ja synteettisen kumiraaka-aineen valmistus @fi
preferred label: Fabrication de produits chimiques de base, de produits azotés et d'engrais, de matières plastiques de base et de caoutchouc synthétique @fr
preferred label: Vegyi alapanyag gyártása
preferred label: Fabbricazione di prodotti chimici di base, di fertilizzanti e di composti azotati, di materie plastiche e gomma sintetica in forme primarie @it
preferred label: Pagrindinių chemikalų, trąšų ir azoto junginių, pirminių plastikų ir pirminio sintetinio kaučiuko gamyba @lt
preferred label: Ķīmisko pamatvielu, minerālmēslu un slāpekļa savienojumu, plastmasu un sintētiskā kaučuka ražošana pirmapstādes formās @lv
preferred label: Manifattura ta' kimiċi bażiċi, fertilizzanti u taħlitiet tan-nitroġenu, plastik u lasktu sintetiku f'forom primarji @mt
preferred label: Vervaardiging van chemische basisproducten, kunstmeststoffen en stikstofverbindingen en van kunststoffen en synthetische rubber in primaire vormen @nl
preferred label: Produksjon av kjemiske råvarer, gjødsel og nitrogenforbindelser, basisplast og syntetisk gummi @no
preferred label: Produkcja podstawowych chemikaliów, nawozów i związków azotowych, tworzyw sztucznych i kauczuku syntetycznego w formach podstawowych @pl
preferred label: Fabricação deprodutos químicos de base, adubos e compostos azotados, matérias plásticas e borracha sintética sob formas primárias @pt
preferred label: Fabricarea produselor chimice de bază, a îngrăşămintelor şi produselor azotoase; fabricarea materialelor plastice şi a cauciucului sintetic, în forme primare @ro
preferred label: Производство основных химикатов, удобрений и азотных соединений, пластмасс и синтетического каучука в первичных формах @ru
preferred label: Výroba základných chemikálií, priemyselných hnojív a dusíkatých zlúčenín (zmesí), plastov a syntetického kaučuku v primárnej forme @sk
preferred label: Proizvodnja osnovnih kemikalij, gnojil in dušikovih spojin, plastičnih mas in sintetičnega kavčuka v primarni obliki @sl
preferred label: Tillverkning av baskemikalier, gödselmedel och kväveprodukter, plaster och syntetgummi i obearbetad form @sv
preferred label: Temel kimyasal maddelerin, kimyasal gübre ve azot bileşikleri, birincil formda plastik ve sentetik kauçuk imalatı @tr
broader: Manufacture of chemicals and chemical products
narrower: Manufacture of industrial gases
narrower: Manufacture of dyes and pigments
narrower: Manufacture of other inorganic basic chemicals
narrower: Manufacture of other organic basic chemicals
narrower: Manufacture of fertilisers and nitrogen compounds
narrower: Manufacture of plastics in primary forms
narrower: Manufacture of synthetic rubber in primary forms

Manufacture of industrial gases
type: Concept
notation: 20.11
status: valid
status modified: 2013-10-18
accepted date: 2013-10-18
in scheme: Statistical Classification of Economic Activities in the European Community, Rev. 2 (2008)
scope note: - производство на втечнени или сгъстени промишлени или медицински газове: • елементарни (прости) газове • втечнен или сгъстен въздух • хладилни агенти • смеси от промишлени газове • инертни газове: въглероден диоксид и други • отделени в чисто състояние газове - добив на метан, етан, бутан или пропан - 06.20 - производство на газообразни горива (етан, бутан или пропан) в нефтени рафинерии - 19.20 - производство на газообразни горива от въглища, отпадъци и други - 35.21 @bg
scope note: Z: - výrobu zkapalněných nebo stlačených anorganických plynů pro použití v průmyslu nebo ve zdravotnictví: • jednoprvkových základních plynů • zkapalněného nebo stlačeného vzduchu • chladicích plynů • směsných technických plynů • inertních plynů jako je kysličník uhličitý • izolačních plynů N: - těžbu metanu, etanu, butanu nebo propanu (06.20) - výrobu pohonných (topných) plynů jako etan, butan nebo propan v naftových rafineriích (19.20) - výrobu plynných paliv z uhlí, odpadu atd. (35.21) @cs
scope note: Diese Klasse umfasst: - Herstellung von technischen und medizinischen Flüssig- oder Druckgasen: • Elementargase • Flüssig- oder Druckluft • gasförmige Kühlmittel • Misch-Industriegase • Inertgase wie Kohlendioxid • Isoliergase Diese Klasse umfasst nicht: - Gewinnung von Methan, Ethan, Butan oder Propan (s. 06.20) - Herstellung von gasförmigen Brennstoffen wie Ethan, Butan oder Propan in Erdölraffinerien (s. 19.20) - Herstellung von gasförmigen Brennstoffen aus Kohle, Abfall usw. (s. 35.21) @de
scope note: This class includes: - manufacture of liquefied or compressed inorganic industrial or medical gases: • elemental gases • liquid or compressed air • refrigerant gases • mixed industrial gases • inert gases such as carbon dioxide • isolating gases This class excludes: - extraction of methane, ethane, butane or propane, see 06.20 - manufacture of fuel gases such as ethane, butane or propane in a petroleum refinery, see 19.20 - manufacture of gaseous fuels from coal, waste etc., see 35.21 @en
scope note: Esta clase comprende: - la fabricación de gases inorgánicos industriales o médicos licuados o comprimidos: • gases elementales • aire líquido o comprimido • gases refrigerantes • mezclas de gases industriales • gases inertes, tales como dióxido de carbono • gases aislantes Esta clase no comprende: - la extracción de metano, etano, butano o propano (véase 06.20) - la fabricación de gases combustibles tales como etano, butano o propano, en refinerías de petróleo (véase 19.20) - la fabricación de combustibles gaseosos a partir de carbón, residuos, etc. (véase 35.21) @es
scope note: Cette classe comprend: - la fabrication de gaz industriels ou médicaux inorganiques liquéfiés ou comprimés: • gaz élémentaires • air liquide ou comprimé • gaz réfrigérants • gaz industriels mélangés • gaz inertes tel l’anhydride carbonique • gaz isolants Cette classe ne comprend pas: - l’extraction du méthane, de l’éthane, du butane ou du propane, voir 06.20 - la fabrication de combustibles gazeux tels que l’éthane, le butane ou le propane, dans les raffineries de pétrole, voir 19.20 - la fabrication de combustibles gazeux à partir de charbon, de déchets, etc., voir 35.21 @fr
scope note: Ovaj razred uključuje: - proizvodnju tekućih i komprimiranih anorganskih industrijskih ili medicinskih plinova: • pojedinačnih plinova • tekućega i komprimiranog zraka • rashladnih plinova • miješanih industrijskih plinova • inertnih plinova poput ugljičnog dioksida • izolirajućih plinova Ovaj razred isključuje: - vađenje metana, etana, butana ili propana, vidi 06.20 - proizvodnju gorivih plinova kao što su etan, propan ili butan u rafinerijama nafte, vidi 19.20 - proizvodnju plinskih goriva od ugljena, otpada itd., vidi 35.21
scope note: Į šią klasę įeina: - neorganinių suskystintųjų arba suslėgtųjų pramoninių ar medicininių dujų gamyba: • elementinių dujų • skystojo ar suslėgtojo oro • šaldomųjų dujų • pramoninių dujų mišinių • inertinių dujų, tokių kaip anglies dioksido • izoliacinių dujų Į šią klasę neįeina: - metano, etano, butano ar propano gavyba, žr. 06.20 - dujinio kuro, pvz., etano, butano ar propano gamyba naftos perdirbimo įmonėse, žr. 19.20 - dujinio kuro gamyba iš akmens anglių, atliekų ir kt., žr. 35.21 @lt
scope note: Данный класс включает производство химикатов при помощи простых процессов, таких как тепловой крекинг и дистилляция. Результатом данных процессов обычно служит получение отдельных химических элементов или определенных химических смесей. Этот класс включает: - производство основных органических химических веществ: • нецикличных углеводородов, насыщенных и ненасыщенных • цикличных углеводородов, насыщенных и ненасыщенных • нециклических и циклических спиртов • моно- и поликарбоксильных кислот, включая уксусную кислоту • прочих кислородных соединений, включая альдегиды, кетоны, хиноны и двух- или поливалентные кислородные соединения • синтетического глицерина • азотно-функциональных органических соединений, включая амины • ферментацию сахарного тростника, зерна или т.п. для производства спирта и эфиров • прочих органических соединений, включая продукты переработки древесины (например, древесный уголь) и т.д. - производство синтетических ароматических продуктов - дистилляцию каменноугольной смолы Этот класс исключает: - производство пластика в первичных формах, см. 20.16 - производство синтетического каучука в первичной форме, см. 20.17 - производство неочищенного глицерина, см. 20.41 - производство натуральных эфирных масел, см. 20.53 - производство салициловых и O-ацетилсалициловых кислот, см. 21.10 @ru
scope note: Bu sınıf aşağıdakileri kapsamaktadır; - sıvılaştırılmış veya sıkıştırılmış inorganik endüstriyel veya tıbbi gazların imalatı: • asal (temel) gazlar, • sıvılaştırılmış veya sıkıştırılmış hava, • soğutucu-dondurucu gazlar, • karışık endüstriyel gazlar, • karbondioksit gibi soy gazlar, • ayırıcı gazlar. Kapsam dışı olanlar; - metan, etan, bütan veya propan gazlarının çıkarılması, bkz. 06.20, - petrol rafinerisinde etan, bütan veya propan gibi yakıt gazlarının imalatı, bkz. 19.20, - kömür, atık ve benzerlerinden gaz yakıtı imalatı, bkz. 35.21. @tr
preferred label: Производство на промишлени газове @bg
preferred label: Výroba technických plynů @cs
preferred label: Fremstilling af industrigasser @da
preferred label: Herstellung von Industriegasen @de
preferred label: Παραγωγή βιομηχανικών αερίων @el
preferred label: Fabricación de gases industriales @es
preferred label: Tööstusgaaside tootmine @et
preferred label: Teollisuuskaasujen valmistus @fi
preferred label: Fabrication de gaz industriels @fr
preferred label: Ipari gáz gyártása
preferred label: Fabbricazione di gas industriali @it
preferred label: Pramoninių dujų gamyba @lt
preferred label: Rūpniecisko gāzu ražošana @lv
preferred label: Manifattura ta' gassijiet industrijali @mt
preferred label: Vervaardiging van industriële gassen @nl
preferred label: Produksjon av industrigasser @no
preferred label: Produkcja gazów technicznych @pl
preferred label: Fabricação de gases industriais @pt
preferred label: Fabricarea gazelor industriale @ro
preferred label: Производство промышленных газов @ru
preferred label: Výroba priemyselných plynov @sk
preferred label: Proizvodnja tehničnih plinov @sl
preferred label: Industrigasframställning @sv
preferred label: Sanayi gazları imalatı @tr
broader: Manufacture of basic chemicals, fertilisers and nitrogen compounds, plastics and synthetic rubber in primary forms

Manufacture of dyes and pigments
type: Concept
notation: 20.12
status: valid
status modified: 2013-10-18
accepted date: 2013-10-18
in scheme: Statistical Classification of Economic Activities in the European Community, Rev. 2 (2008)
scope note: - производство на багрила и пигменти от всякакви източници в основна форма или като концентрат - производство на продукти, използвани като средства за флуоресценция или като луминофори - производство на готови бои и пигменти - 20.30 @bg
scope note: Z: - výrobu barviv a pigmentů z jakýchkoliv zdrojů v základní podobě nebo ve formě koncentrátu ZT: - výrobu produktů používaných jako zjasňovací prostředky nebo luminofory N: - výrobu hotových barev a (barviv) pigmentů (20.30) @cs
scope note: Diese Klasse umfasst: - Herstellung von Farbstoffen und Pigmenten jeder Herkunft als Grundstoff oder Konzentrat Diese Klasse umfasst ferner: - Herstellung von als fluoreszierende Aufheller oder Luminophore verwendeten Erzeugnissen Diese Klasse umfasst nicht: - Herstellung von zubereiteten Farbstoffen und Pigmenten (s. 20.30) @de
scope note: This class includes: - manufacture of dyes and pigments from any source in basic form or as concentrate This class also includes: - manufacture of products of a kind used as fluorescent brightening agents or as luminophores This class excludes: - manufacture of prepared dyes and pigments, see 20.30 @en
scope note: Esta clase comprende: - la fabricación de colorantes y pigmentos de cualquier origen, en forma básica o concentrada Esta clase comprende también: - la fabricación de productos que se utilizan como agentes abrillantadores fluorescentes o como luminóforos Esta clase no comprende: - la fabricación de colorantes y pigmentos preparados (véase 20.30) @es
scope note: Cette classe comprend: - la fabrication de colorants et de pigments, quelle qu’en soit l’origine, sous forme fondamentale ou concentrée Cette classe comprend également: - la fabrication de produits utilisés comme agents d’avivage ou comme luminophores Cette classe ne comprend pas: - la fabrication de colorants et de pigments préparés, voir 20.30 @fr
scope note: Ovaj razred uključuje: - proizvodnju koloranata i pigmenata, bilo kojeg podrijetla, u osnovnom obliku ili kao koncentrat Ovaj razred također uključuje: - proizvodnju proizvoda koji se upotrebljavaju kao nosioci fluorescentnog svjetla ili luminofornog svjetla Ovaj razred isključuje: - proizvodnju pripremljenih koloranata i pigmenata, vidi 20.30
scope note: Į šią klasę įeina: - bazinių dažiklių ir pigmentų ar jų koncentratų iš bet kokių žaliavų šaltinių gamyba Į šią klasę taip pat įeina: - panašių į fluorescencines švytinčias medžiagas ar švytalus (liuminoforus) produktų gamyba Į šią klasę neįeina: - paruoštų dažiklių ir pigmentų gamyba, žr. 20.30 @lt
scope note: Этот класс включает: - производство удобрений: • азотных или азотосодержащих, фосфорных или калийных удобрений • мочевины, природных фосфатов и природных калийных солей из сырой нефти - производство азотосодержащих продуктов: • азотных кислот и сульфата азота, аммония, хлорида аммония, карбоната аммония, нитритов и нитратов калия Этот класс также включает: - производство торфяного грунта в брикетах - производство брикетов торфа, смешанного с почвой, природным грунтом, песком, глиной, минеральными удобрениями Этот класс исключает: - добычу гуано, см. 08.91 - производство агрохимической продукции, такой как пестициды, см. 20.20 @ru
scope note: Bu sınıf aşağıdakileri kapsamaktadır; - birincil formda veya konsantre olarak herhangi bir kaynaktan boya ve pigmentlerin imalatı. Ayrıca bu sınıf aşağıdakileri de kapsamaktadır; - floresanlı parlatıcı maddeler veya fosforlu boya maddelerinin imalatı. Kapsam dışı olanlar; - hazır boya ve pigmentlerin imalatı, bkz. 20.30. @tr
preferred label: Производство на багрила и пигменти @bg
preferred label: Výroba barviv a pigmentů @cs
preferred label: Fremstilling af farvestoffer og pigmenter @da
preferred label: Herstellung von Farbstoffen und Pigmenten @de
preferred label: Παραγωγή χρωστικών υλών @el
preferred label: Fabricación de colorantes y pigmentos @es
preferred label: Värvainete ja pigmentide tootmine @et
preferred label: Värien ja pigmenttien valmistus @fi
preferred label: Fabrication de colorants et de pigments @fr
preferred label: Színezék, pigment gyártása
preferred label: Fabbricazione di coloranti e pigmenti @it
preferred label: Dažiklių ir pigmentų gamyba @lt
preferred label: Krāsvielu un pigmentu ražošana @lv
preferred label: Manifattura ta' koloranti u pigmenti @mt
preferred label: Vervaardiging van kleurstoffen en pigmenten @nl
preferred label: Produksjon av fargestoffer og pigmenter @no
preferred label: Produkcja barwników i pigmentów @pl
preferred label: Fabricação de corantes e pigmentos @pt
preferred label: Fabricarea coloranţilor şi a pigmenţilor @ro
preferred label: Производство красителей и пигментов @ru
preferred label: Výroba farbív a pigmentov @sk
preferred label: Proizvodnja barvil in pigmentov @sl
preferred label: Tillverkning av färgämnen @sv
preferred label: Boya maddeleri ve pigment imalatı @tr
broader: Manufacture of basic chemicals, fertilisers and nitrogen compounds, plastics and synthetic rubber in primary forms

Manufacture of other inorganic basic chemicals
type: Concept
notation: 20.13
status: valid
status modified: 2013-10-18
accepted date: 2013-10-18
in scheme: Statistical Classification of Economic Activities in the European Community, Rev. 2 (2008)
scope note: Производството на химични вещества посредством основни процеси като термично разлагане и дестилация е включено в този клас. Получената продукция е обикновено отделни химични елементи или определени химични съединения. - производство на химични елементи, с изключение на промишлените, елементарни газове и метали - производство на неорганични киселини и техните съединения, с изключение на азотната киселина - производство на основи, концентрирани разтвори на алкални основи и други неорганични основи, с изключение на амоняк - производство на други неорганични съединения - пържене на железни пирити - производство на дестилирани води - обогатяване на уран и торий - производство на промишлени газове - 20.11 - производство на азотни съединения и торове - 20.15 - производство на амоняк - 20.15 - производство на амониев хлорид - 20.15 - производство на калиеви нитрити и нитрати - 20.15 - производство на амониев карбонат - 20.15 - производство на ароматични дестилирани води - 20.53 - производство на основни метали - раздел 24 @bg
scope note: Tato třída zahrnuje výrobu chemikálií vyráběných základními postupy. Výsledkem tohoto zpracovávání jsou zpravidla oddělené chemické prvky nebo chemicky definované směsi. Z: - výrobu chemických prvků (kromě průmyslových plynů a základních kovů) - výrobu anorganických kyselin s výjimkou kyseliny dusičné - výrobu zásad, louhů a jiných anorganických bází s výjimkou čpavku - výrobu jiných anorganických směsí - pražení železných pyritů (kyzů) - výrobu destilované vody ZT: - obohacení uranových a thoriových rud N: - výrobu průmyslových plynů (20.11) - výrobu dusíkatých hnojiv a dusíkatých sloučenin (20.15) - výrobu čpavku (20.15) - výrobu chloridu amonného (20.15) - výrobu dusitanů a dusičnanů draselných (20.15) - výrobu uhličitanu amonného (20.15) - výrobu destilovaných aromatizovaných vod (20.53) - výrobu základních kovů (oddíl 24) @cs
scope note: Diese Klasse umfasst die Herstellung von chemischen Stoffen nach grundlegenden Verfahren. Das Ergebnis dieser Verfahren sind in der Regel getrennte chemische Elemente oder chemische Verbindungen. Diese Klasse umfasst: - Herstellung von chemischen Elementen (außer Industriegasen und Grundmetallen) - Herstellung anorganischer Säuren mit Ausnahme von Salpetersäure - Herstellung von Alkalien, Laugen und sonstigen anorganischen Basen mit Ausnahme von Ammoniak - Herstellung sonstiger anorganischer Verbindungen - Rösten von Eisenkies - Herstellung von destilliertem Wasser Diese Klasse umfasst ferner: - Anreicherung von Uran- und Thoriumerzen Diese Klasse umfasst nicht: - Herstellung von Industriegasen (s. 20.11) - Herstellung von Düngemitteln und Stickstoffverbindungen (s. 20.15) - Herstellung von Ammoniak (s. 20.15) - Herstellung von Ammoniumchlorid (s. 20.15) - Herstellung von Kaliumnitriten und -nitraten (s. 20.15) - Herstellung von Ammoniumkarbonaten (s. 20.15) - Herstellung von destillierten aromatischen Wässern (s. 20.53) - Herstellung von Grundmetallen (s. Abteilung 24) @de
scope note: This class includes the manufacture of chemicals using basic processes. The output of these processes are usually separate chemical elements or separate chemically defined compounds. This class includes: - manufacture of chemical elements (except industrial gases and basic metals) - manufacture of inorganic acids except nitric acid - manufacture of alkalis, lyes and other inorganic bases except ammonia - manufacture of other inorganic compounds - roasting of iron pyrites - manufacture of distilled water This class also includes: - enrichment of uranium and thorium ores This class excludes: - manufacture of industrial gases, see 20.11 - manufacture of nitrogenous fertilisers and nitrogen compounds, see 20.15 - manufacture of ammonia, see 20.15 - manufacture of ammonium chloride, see 20.15 - manufacture of nitrites and nitrates of potassium, see 20.15 - manufacture of ammonium carbonates, see 20.15 - manufacture of aromatic distilled water, see 20.53 - manufacture of basic metals, see division 24 @en
scope note: Esta clase comprende la fabricación de productos químicos utilizando procesos básicos. El producto de estos procesos suele consistir en elementos químicos independientes o compuestos definidos químicamente independientes. Esta clase comprende: - la fabricación de elementos químicos (excepto gases industriales y metales básicos) - la fabricación de ácidos inorgánicos excepto el ácido nítrico - la fabricación de álcalis, lejías y otras bases inorgánicas excepto el amoníaco - la fabricación de otros compuestos inorgánicos - el tostado de piritas de hierro - la fabricación de agua destilada Esta clase comprende también: - el enriquecimiento de minerales de uranio y de torio Esta clase no comprende: - la producción de gases industriales (véase 20.11) - la fabricación de fertilizantes nitrogenados y de compuestos nitrogenados (véase 20.15). - la fabricación de amoníaco (véase 20.15) - la fabricación de cloruro de amonio (véase 20.15) - la fabricación de nitritos y nitratos de potasio (véase 20.15) - la fabricación de carbonatos de amonio (véase 20.15) - la fabricación de agua destilada aromática (véase 20.53) - la fabricación de metales básicos (véase la división 24) @es
scope note: Cette classe comprend la fabrication de produits chimiques par des processus de base. Ces processus permettent généralement d’obtenir des éléments chimiques distincts ou des composés chimiquement définis. Cette classe comprend: - la fabrication d’éléments chimiques (à l’exclusion des gaz d’origine industrielle et de la métallurgie) - la fabrication des acides inorganiques, à l’exclusion de l’acide nitrique - la fabrication d’alcalis, de lessives et d’autres bases inorganiques, à l’exclusion de l’ammoniac - la fabrication d’autres composés inorganiques - le grillage de la pyrite de fer - la fabrication d’eau distillée Cette classe comprend également: - l’enrichissement de minerais d’uranium et de thorium Cette classe ne comprend pas: - la fabrication de gaz industriels, voir 20.11 - la fabrication d’engrais azotés et de composés azotés, voir 20.15 - la fabrication d’ammoniac, voir 20.15 - la fabrication de chlorure d’ammonium, voir 20.15 - la fabrication de nitrates et de nitrates de potassium, voir 20.15 - la fabrication de carbonates d’ammonium, voir 20.15 - la fabrication d’eaux distillées aromatiques, voir 20.53 - la métallurgie, voir division 24 @fr
scope note: Ovaj razred uključuje proizvodnju kemikalija koristeći se osnovnim procesima kao što su termalno krekiranje i destiliranje. Izlazni produkti tih procesa obično su izdvojeni kemijski elementi ili izdvojeni kemijski spojevi. Ovaj razred uključuje: - proizvodnju kemijskih elemenata (osim industrijskih plinova i osnovnih metala) - proizvodnju anorganskih kiselina, osim dušične kiseline - proizvodnju baza, baznih otopina i drugih anorganskih baza, osim amonijaka - proizvodnju ostalih anorganskih spojeva - prženje željeznog pirita - proizvodnju destilirane vode Ovaj razred također uključuje: - obogaćivanje uranovih i torijevih ruda Ovaj razred isključuje: - proizvodnju industrijskih plinova, vidi 20.11 - proizvodnju dušičnih mineralnih gnojiva i dušičnih spojeva, vidi 20.15 - proizvodnju amonijaka, vidi 20.15 - proizvodnju amonijevih klorida, vidi 20.15 - proizvodnju nitrita i kalijevoga nitrata, vidi 20.15 - proizvodnju amonij-karbonata, vidi 20.15 - proizvodnju aromatične destilirane vode, vidi 20.53 - proizvodnju osnovnih metala, vidi odjeljak 24
scope note: Į šią klasę įeina chemikalų gamyba, naudojant pagrindinius procesus. Šių procesų sukurta produkcija dažniausiai yra atskiri cheminiai elementai arba atskiri nustatytos cheminės sudėties junginiai. Į šią klasę įeina: - cheminių elementų, išskyrus pramonines dujas ir pagrindinius metalus, gamyba - neorganinių rūgščių, išskyrus azoto rūgštį, gamyba - šarmų, kitų neorganinių junginių, išskyrus amoniaką, gamyba - kitų neorganinių junginių gamyba - geležies piritų iškaitinimas - distiliuoto vandens gamyba Į šią klasę taip pat įeina: - urano ir torio rūdų sodrinimas Į šią klasę neįeina: - pramoninių dujų gamyba, žr. 20.11 - azoto trąšų ir azoto junginių gamyba, žr. 20.15 - amoniako gamyba, žr. 20.15 - amonio chlorido gamyba, žr. 20.15 - kalio nitritų ir nitratų gamyba, žr. 20.15 - amonio karbonato gamyba, žr. 20.15 - kvepiančio distiliuoto vandens gamyba, žr. 20.53 - pagrindinių metalų gamyba, žr. skyrių 24 @lt
scope note: Данный класс включает производство смолы, канифоли, камеди, пластика и невулканизированного термопластического эластомера, смешение смолы обычным способом, а также производство немодифицированных синтетических смол. Этот класс включает: - производство пластика в первичных формах: • полимеров, включая, этилен, пропилен, стинин, винилхлорид, винилацетат и акрилы • полиамидов • феноловых и эпоксидных смол и полиэтилена • алкидных и полиэстеровых смол и полимеров • силикона • ионообменных смол, основанных на полимерах Этот класс также включает: - производство целлюлозы и ее химических производных Этот класс исключает: - производство искусственных и синтетических волокон, ниток и пряжи, см. 20.60 - измельчение пластиковых продуктов, см. 38.32 @ru
scope note: Bu sınıf, temel işlemleri kullanan kimyasalların imalatını kapsamaktadır. Bu işlemlerin ürünleri, genellikle birbirinden bağımsız kimyasal maddeler veya birbirinden bağımsız kimyasal olarak tanımlanabilecek bileşiklerdir. Bu sınıf aşağıdakileri kapsamaktadır; - kimyasal maddelerin imalatı (endüstriyel gazlar ve ana metaller hariç), - inorganik asitlerin imalatı (nitrik asit hariç), - alkaliler, çamaşır suyu ve diğer inorganik bazların imalatı (amonyak hariç), - diğer inorganik bileşiklerin imalatı, - demir piritlerin kavrulması, - damıtılmış su (saf su) imalatı. Ayrıca bu sınıf aşağıdakileri de kapsamaktadır; - uranyum ve toryum cevherlerinin zenginleştirilmesi. Kapsam dışı olanlar; - endüstriyel gazların imalatı, bkz. 20.11, - azotlu gübrelerin ve azotlu bileşiklerin imalatı, bkz. 20.15, - amonyak imalatı, bkz. 20.15, - amonyumklorid imalatı, bkz. 20.15, - nitrik asit tuzları ve potasyum nitrat imalatı, bkz. 20.15, - amonyum karbonat imalatı, bkz. 20.15, - aromatik damıtılmış su imalatı, bkz. 20.53, - ana metallerin imalatı, bkz. bölüm 24. @tr
preferred label: Производство на други основни неорганични химични вещества @bg
preferred label: Výroba jiných základních anorganických chemických látek @cs
preferred label: Fremstilling af andre uorganiske basiskemikalier @da
preferred label: Herstellung von sonstigen anorganischen Grundstoffen und Chemikalien @de
preferred label: Παραγωγή άλλων ανόργανων βασικών χημικών ουσιών @el
preferred label: Fabricación de otros productos básicos de química inorgánica @es
preferred label: Muude anorgaaniliste põhikemikaalide tootmine @et
preferred label: Muiden epäorgaanisten peruskemikaalien valmistus @fi
preferred label: Fabrication d'autres produits chimiques inorganiques de base @fr
preferred label: Szervetlen vegyi alapanyag gyártása
preferred label: Fabbricazione di altri prodotti chimici di base inorganici @it
preferred label: Kitų pagrindinių neorganinių chemikalų gamyba @lt
preferred label: Pārējo neorganisko ķīmisko pamatvielu ražošana @lv
preferred label: Manifattura ta' kimiċi bażiċi oħra mhux organiċi @mt
preferred label: Vervaardiging van andere anorganische chemische basisproducten @nl
preferred label: Produksjon av andre uorganiske kjemikalier @no
preferred label: Produkcja pozostałych podstawowych chemikaliów nieorganicznych @pl
preferred label: Fabricação de outros produtos químicos inorgânicos de base @pt
preferred label: Fabricarea altor produse chimice anorganice, de bază @ro
preferred label: Производство прочих основных неорганических химических веществ @ru
preferred label: Výroba ostatných základných anorganických chemikálií @sk
preferred label: Proizvodnja drugih anorganskih osnovnih kemikalij @sl
preferred label: Tillverkning av andra organiska baskemikalier @sv
preferred label: Diğer inorganik temel kimyasal maddelerin imalatı @tr
broader: Manufacture of basic chemicals, fertilisers and nitrogen compounds, plastics and synthetic rubber in primary forms

Manufacture of other organic basic chemicals
type: Concept
notation: 20.14
status: valid
status modified: 2013-10-18
accepted date: 2013-10-18
in scheme: Statistical Classification of Economic Activities in the European Community, Rev. 2 (2008)
scope note: Производство на химични вещества посредством основни процеси, такива като термично разлагане и дестилация. Получената продукция е обикновено отделни химични елементи или определени химични съединения. - производство на основни органични химични вещества: • ациклени въглеводороди, наситени и ненаситени (етен, пропен, бутен, бутадиен и други) • циклени въглеводороди, наситени и ненаситени (бензен, толуен, ксилен и други продукти, получавани при преработката на каменовъглена смола и нефт) • ациклени и циклени алкохоли • моно- и поликарбоксилни киселини, вкл. оцетна киселина • други съединения с кислородни функционални групи, вкл. алдехиди, кетони, хинони и съединения с две или повече кислородни функционални групи • синтетичен глицерол • органични съединения с азотни функционални групи, вкл. амини • ферментация на захарна тръстика, зърнени култури и подобни за производство на алкохол и естери • други органични съединения, вкл. продукти, получени при суха дестилация на дървесина (например дървени въглища) - производство на синтетични ароматни продукти - дестилация на каменовъглен катран - производство на полимери в първични форми - 20.16 - производство на синтетичен каучук в първични форми - 20.17 - производство на суров глицерол - 20.41 - производство на етерични масла - 20.53 - производство на салицилова и o-ацетилсалицилова киселини - 21.10 @bg
scope note: Tato třída zahrnuje výrobu chemických látek vyráběných základními postupy jako tepelným krakováním a destilací. Výsledkem tohoto zpracovávání jsou zpravidla oddělené chemické prvky nebo chemicky definované směsi. Z: - výrobu základních organických chemických látek: • nasycených a nenasycených acyklických uhlovodíků • nasycených a nenasycených cyklických uhlovodíků • acyklických a cyklických alkoholů - mono- a polykarboxylové kyseliny, včetně kyseliny octové - další sloučeniny s působením kyslíku, včetně aldehydů, ketonů, chinonů a podvojných nebo polyfunkčních kyslíkových sloučenin (obsahují dvě nebo více kyslíkových funkčních skupin) • syntetický glycerin • organické sloučeniny s dusíkovou funkční skupinou, včetně aminů • kvašení cukrové třtiny, pšenice (obilí) nebo podobných surovin za účelem výroby alkoholu a esterů • jiné organické sloučeniny včetně výrobků z destilace dřeva (např. dřevěné uhlí) atd. - výrobu syntetických aromatických výrobků - destilaci černouhelného dehtu N: - výrobu plastů v primárních formách (20.16) - výrobu syntetického kaučuku v primárních formách (20.17) - výrobu surového glycerinu (20.41) - výrobu přírodních esenciálních olejů (20.53) - výrobu salicylových a O-acetylsalicylových kyselin (21.10) @cs
scope note: Diese Klasse umfasst die Herstellung von chemischen Stoffen nach grundlegenden Verfahren wie thermisches Spalten und Destillation. Das Ergebnis dieser Verfahren sind in der Regel getrennte chemische Elemente oder chemische Verbindungen. Diese Klasse umfasst: - Herstellung von organischen chemischen Grundstoffen: • gesättigte und ungesättigte azyklische Kohlenwasserstoffe • gesättigte und ungesättigte zyklische Kohlenwasserstoffe • azyklische und zyklische Alkohole • Mono- und Polykarbonsäuren einschließlich Essigsäure • sonstige Verbindungen mit Sauerstoffgruppen einschließlich Aldehyden, Ketonen, Chinonen und Verbindungen mit zwei oder mehreren Sauerstoffgruppen • synthetisches Glycerin • organische Verbindungen mit Stickstoffgruppen einschließlich Aminen • Vergärung von Zuckerrohr, Mais oder ähnlichen Agrarerzeugnissen zur Herstellung von Alkohol und Estern • sonstige organische Verbindungen einschließlich Erzeugnissen der Holzdestillation (z. B. Holzkohle) usw. - Herstellung von synthetischen Aromen - Destillation von Steinkohleteer Diese Klasse umfasst nicht: - Herstellung von Kunststoffen in Primärformen (s. 20.16) - Herstellung von synthetischem Kautschuk in Primärformen (s. 20.17) - Herstellung von Rohglycerin (s. 20.41) - Herstellung von etherischen Ölen (s. 20.53) - Herstellung von Salicyl- und o-Acetylsalicylsäure (s. 21.10) @de
scope note: This class includes the manufacture of chemicals using basic processes, such as thermal cracking and distillation. The output of these processes are usually separate chemical elements or separate chemically defined compounds. This class includes: - manufacture of basic organic chemicals: • acyclic hydrocarbons, saturated and unsaturated • cyclic hydrocarbons, saturated and unsaturated • acyclic and cyclic alcohols • mono- and polycarboxylic acids, including acetic acid • other oxygen-function compounds, including aldehydes, ketones, quinones and dual or poly oxygen-function compounds • synthetic glycerol • nitrogen-function organic compounds, including amines • fermentation of sugarcane, corn or similar to produce alcohol and esters • other organic compounds, including wood distillation products (e.g. charcoal) etc. - manufacture of synthetic aromatic products - distillation of coal tar This class excludes: - manufacture of plastics in primary forms, see 20.16 - manufacture of synthetic rubber in primary forms, see 20.17 - manufacture of crude glycerol, see 20.41 - manufacture of natural essential oils, see 20.53 - manufacture of salicylic and O-acetylsalicylic acids, see 21.10 @en
scope note: Esta clase comprende la fabricación de productos químicos utilizando procesos básicos, como el craqueo térmico y la destilación. El producto de estos procesos suele consistir en elementos químicos independientes o compuestos definidos químicamente independientes. Esta clase comprende: - la fabricación de productos químicos orgánicos básicos: • hidrocarburos acíclicos, saturados y no saturados • hidrocarburos cíclicos, saturados y no saturados • alcoholes acíclicos y cíclicos • ácidos mono- y policarboxílicos, incluido el ácido acético • otros compuestos de función oxígeno, incluidos aldehídos, cetonas, quinonas y compuestos de función oxígeno binarios o múltiples • glicerol sintético • compuestos de función nitrógeno, incluidas las aminas • fermentación de caña de azúcar, maíz o productos similares para producir alcoholes y esteres • otros compuestos orgánicos incluidos los productos procedentes de la destilación de la madera (p. ej., carbón vegetal), etc. - la fabricación de productos sintéticos aromáticos - la destilación de alquitrán de hulla Esta clase no comprende: - la fabricación de plásticos en sus formas primarias (véase 20.16) - la fabricación de caucho sintético en sus formas primarias (véase 20.17) - la fabricación de glicerol en bruto (véase 20.41) - la fabricación de aceites esenciales naturales (véase 20.53) - la fabricación de ácidos salicílico y O-acetilsalicílico (véase 21.10) @es
scope note: Cette classe comprend la fabrication de produits chimiques par des processus de base, tels que le craquage thermique et la distillation. Ces processus permettent généralement d’obtenir des éléments chimiques distincts ou des composés chimiquement définis. Cette classe comprend: - la fabrication des produits chimiques de base: • hydrocarbures acycliques, saturés ou non saturés • hydrocarbures cycliques, saturés ou non saturés • alcools acycliques et cycliques • acides monocarboxyliques et polycarboxyliques, y compris l’acide acétique • autres composés à fonctions oxygénées, y compris les aldéhydes, les cétones, les quinones et les composés contenant deux fonctions oxygénées ou plus • glycérine synthétique • composés organiques à fonctions azotées, y compris les amines • fermentation de la canne à sucre, du maïs ou d’autres produits similaires pour produire de l’alcool et des esters • autres composés organiques, y compris les produits de la distillation du bois (charbon de bois, par exemple), etc. - la fabrication de produits aromatiques synthétiques - la distillation des goudrons de houille Cette classe ne comprend pas: - la fabrication de matières plastiques sous formes primaires, voir 20.16 - la fabrication de caoutchouc synthétique sous formes primaires, voir 20.17 - la fabrication de glycérine, voir 20.41 - la fabrication d’huiles essentielles naturelles, voir 20.53 - la fabrication des acides salicylique et O-acétylsalicylique, voir 21.10 @fr
scope note: Ovaj razred uključuje proizvodnju kemikalija koristeći se osnovnim procesima kao što su termalno krekiranje i destiliranje. Izlazni produkti tih procesa su obično izdvojeni kemijski elementi ili izdvojeni kemijski spojevi. Ovaj razred uključuje: - proizvodnju osnovnih organskih kemikalija: • acikličnih ugljikovodika, zasićenih ili nezasićenih • cikličnih ugljikovodika, zasićenih ili nezasićenih • acikličnih i cikličnih alkohola • monokarboksilne i polikarboksilne kiseline, uključujući octenu kiselinu • fermentaciju šećerne trske, žitarica i sličnoga za proizvodnju alkohola i estera • ostalih spojeva s funkcijom kisika, uključujući aldehide, ketone, kinone i spojeve s dualnom ili polikisik- funkcijom • sintetički glicerol • organskih spojeva s dušik-funkcijom, uključujući amine • ostalih organskih spojeva, uključujući proizvode destilacije drva (npr. drveni ugljen) itd. - proizvodnju sintetičkih aromatičnih proizvoda - destilaciju ugljenoga katrana Ovaj razred isključuje: - proizvodnju plastike u primarnim oblicima, vidi 20.16 - proizvodnju sintetičkoga kaučuka u primarnim oblicima, vidi 20.17 - proizvodnju sirovog glicerola, vidi 20.41 - proizvodnju prirodnih eteričnih ulja, vidi 20.53 - proizvodnju salicilne i O-acetilsalicilne kiseline, vidi 21.10
scope note: Į šią klasę įeina chemikalų gamyba, naudojant pagrindinius procesus, pvz., terminį krekingą ir distiliavimą. Šių procesų metu dažniausiai pagaminami atskiri cheminiai elementai arba atskiri nustatytos cheminės sudėties junginiai. Į šią klasę įeina: - pagrindinių organinių chemikalų gamyba: • alifatinių, sočiųjų ir nesočiųjų angliavandenilių • ciklinių, sočiųjų ir nesočiųjų angliavandenilių • alifatinių ir ciklinių alkoholių • mono - ir polikarboksilo rūgščių, įskaitant acto rūgštį • kitų junginių su funkcine deguonies grupe, įskaitant aldehidus, ketonus, chinonus ir dvilypius ar polinominius junginius su funkcine deguonies grupe • sintetinio glicerolio • junginių su funkcine organine azoto grupe, įskaitant aminus • cukranendrių, grūdų arba panašių produktų fermentavimas alkoholio ir esterių gavybai • kitų organinių junginių, įskaitant medienos distiliavimo produktus (pvz., medžio anglys) ir kt. - sintetinių aromatinių produktų gamyba - akmens anglių deguto distiliavimas Į šią klasę neįeina: - pirminių plastikų gamyba, žr. 20.16 - pirminio sintetinio kaučiuko gamyba, žr. 20.17 - neapdoroto glicerolio gamyba, žr. 20.41 - natūralių eterinių aliejų gamyba, žr. 20.53 - salicilo ir O-acetilsalicilo rūgščių gamyba, žr. 21.10 @lt
scope note: Этот класс включает: - производство синтетического каучука в первичной форме: • синтетического каучука • фактиса - производство смесей из синтетической резины и природных резиновых компонентов наподобие жевательной резины, (например, балата) @ru
scope note: Bu sınıf ısı yoluyla parçalama, damıtma gibi temel işlemler kullanılarak kimyasalların imalatını kapsamaktadır. Bu işlemlerin ürünleri, genellikle birbirinden bağımsız kimyasal maddeler veya birbirinden bağımsız kimyasal olarak tanımlanabilecek bileşiklerdir. Bu sınıf aşağıdakileri kapsamaktadır; - temel organik kimyasalların imalatı: • asiklik (tek kutuplu) hidrokarbonlar, doymuş ve doymamış, • siklik (halkalı) hidrokarbonlar, doymuş ve doymamış, • asiklik ve siklik alkoller, • mono ve polikarboksilik asitler, asetik asit de dahil, • diğer oksijen fonksiyonlu bileşikler, aldehidler, ketonlar, kinonlar ve ikili ya da poli oksijen-fonksiyonlu bileşikler, • sentetik gliserin, • azot fonksiyonlu organik bileşikler, amin dahil, • şeker kamışı, mısır veya alkol ve ester üretiminde kullanılan benzer ürünlerin fermantasyonu, • diğer organik bileşikler, ağaç damıtım ürünleri (örn. odun kömürü) vb. de dahil. - sentetik aromatik ürünler imalatı, - kömür katranının damıtılması. Kapsam dışı olanlar; - birincil formda plastik imalatı, bkz. 20.16, - birincil formda sentetik kauçuk imalatı, bkz. 20.17, - gliserin imalatı, bkz. 20.41, - doğal eter yağı imalatı, bkz. 20.53, - salisilik ve O-asetilsalisilik asitlerin imalatı, bkz. 21.10. @tr
preferred label: Производство на други основни органични химични вещества @bg
preferred label: Výroba jiných základních organických chemických látek @cs
preferred label: Fremstilling af andre organiske basiskemikalier @da
preferred label: Herstellung von sonstigen organischen Grundstoffen und Chemikalien @de
preferred label: Παραγωγή άλλων οργανικών βασικών χημικών ουσιών @el
preferred label: Fabricación de otros productos básicos de química orgánica @es
preferred label: Muude orgaaniliste põhikemikaalide tootmine @et
preferred label: Muiden orgaanisten peruskemikaalien valmistus @fi
preferred label: Fabrication d'autres produits chimiques organiques de base @fr
preferred label: Szerves vegyi alapanyag gyártása
preferred label: Fabbricazione di altri prodotti chimici di base organici @it
preferred label: Kitų pagrindinių organinių chemikalų gamyba @lt
preferred label: Pārējo organisko ķīmisko pamatvielu ražošana @lv
preferred label: Manifattura ta' kimiċi bażiċi oħra organiċi @mt
preferred label: Vervaardiging van andere organische chemische basisproducten @nl
preferred label: Produksjon av andre organiske kjemiske råvarer @no
preferred label: Produkcja pozostałych podstawowych chemikaliów organicznych @pl
preferred label: Fabricação de outros produtos químicos orgânicos de base @pt
preferred label: Fabricarea altor produse chimice organice, de bază @ro
preferred label: Производство прочих основных органических химических веществ @ru
preferred label: Výroba ostatných základných organických chemikálií @sk
preferred label: Proizvodnja drugih organskih osnovnih kemikalij @sl
preferred label: Tillverkning av andra organiska baskemikalier @sv
preferred label: Diğer organik temel kimyasalların imalatı @tr
broader: Manufacture of basic chemicals, fertilisers and nitrogen compounds, plastics and synthetic rubber in primary forms

Manufacture of fertilisers and nitrogen compounds
type: Concept
notation: 20.15
status: valid
status modified: 2013-10-18
accepted date: 2013-10-18
in scheme: Statistical Classification of Economic Activities in the European Community, Rev. 2 (2008)
scope note: - производство на торове: • еднокомпонентни и комплексни азотни, фосфорни и калиеви торове • карбамид, естествени фосфати и естествени калиеви соли, пригодени за продажба на дребно - производство на азотни съединения: • азотна киселина, смеси от азотна и сярна киселина, амоняк, амониев хлорид, амониев карбонат, калиеви нитрити и нитрати - производство на саксийна пръст, съдържаща основно торф - производство на саксийна пръст, съдържаща смес от естествена пръст, пясък, глина и минерали - добив на гуано - 08.91 - производство на агрохимикали - 20.20 @bg
scope note: Z: - výrobu hnojiv: • jednoduchých nebo komplexních dusíkatých, fosfornatých (fosforečných) nebo draselných hnojiv • močoviny, surových přírodních fosfátů a surových přírodních draselných solí - výrobu přidružených (asociovaných) výrobků s obsahem dusíku: • kyseliny dusičné a nitrosírové (sulphonitric), čpavku, chloridu amonného, uhličitanu amonného, dusitanů a dusičnanů draslíku ZT: - výrobu zahradní zeminy s rašelinou jako hlavní složkou - výrobu směsi zahradní zeminy z přírodní zeminy, písků, jílů a minerálů N: - těžbu guána (08.91) - výrobu agrochemických výrobků jako jsou pesticidy (20.20) @cs
scope note: Diese Klasse umfasst: - Herstellung von Düngemitteln: • einfache oder zusammengesetzte stickstoff-, phosphat- oder kaliumhaltige Düngemittel • Harnstoff, natürliches Rohphosphat und natürliches Rohkalisalz - Herstellung von assoziierten Stickstoffprodukten: • Stickstoff- und Sulfosäuren, Ammoniak, Ammoniumchlorid, Ammoniumkarbonat, Kaliumnitrite und -nitrate Diese Klasse umfasst ferner: - Herstellung von Gartenerde mit Torf als Hauptbestandteil - Herstellung von Gartenerdemischungen aus Mutterboden, Sand, Ton und Mineralen Diese Klasse umfasst nicht: - Gewinnung von Guano (s. 08.91) - Herstellung von agrochemischen Erzeugnissen wie Pestiziden (s. 20.20) @de
scope note: This class includes: - manufacture of fertilisers: • straight or complex nitrogenous, phosphatic or potassic fertilisers • urea, crude natural phosphates and crude natural potassium salts - manufacture of associated nitrogen products: • nitric and sulphonitric acids, ammonia, ammonium chloride, ammonium carbonate, nitrites and nitrates of potassium This class also includes: - manufacture of potting soil with peat as main constituent - manufacture of potting soil mixtures of natural soil, sand, clays and minerals This class excludes: - mining of guano, see 08.91 - manufacture of agrochemical products, such as pesticides, see 20.20 @en
scope note: Esta clase comprende: - la fabricación de abonos: • abonos nitrogenados, fosfatados o potásicos puros o complejos • urea, fosfatos naturales en bruto y sales de potasio naturales en bruto - la fabricación de productos nitrogenados afines: • ácido nítrico y ácido sulfonítrico, amoníaco, cloruro de amonio, carbonato de amonio, nitritos y nitratos de potasio Esta clase comprende también: - la fabricación de sustratos para plantación con turba como componente principal - la fabricación de sustratos para plantación a base de mezclas de tierra natural, arena, arcilla y minerales Esta clase no comprende: - la extracción de guano (véase 08.91) - la fabricación de productos agroquímicos, como plaguicidas (véase 20.20) @es
scope note: Cette classe comprend: - la fabrication d’engrais: • engrais azotés, phosphatés ou potassiques, simples ou complexes • urée, phosphates naturels bruts et sels de potassium naturels bruts - la fabrication de produits azotés associés: • acides nitrique et sulfonitrique, ammoniac, chlorure d’ammonium, carbonates d’ammonium, nitrites et nitrates de potassium Cette classe comprend également: - la fabrication de mélanges pour plantes en pots à base essentiellement de tourbe - la fabrication de mélanges pour plantes en pots à base de terre naturelle, de sable, d’argile et de minéraux Cette classe ne comprend pas: - le ramassage du guano, voir 08.91 - la fabrication de produits agrochimiques, tels que les pesticides, voir 20.20 @fr
scope note: Ovaj razred uključuje: - proizvodnju mineralnih gnojiva: • jednostavnih ili kompleksnih dušičnih, fosfornih ili kalijevih gnojiva • ureje, sirovih prirodnih fosfata i sirovih prirodnih kalijevih soli - proizvodnju pripadajućih dušičnih proizvoda: • dušičnih i sulfodušičnih kiselina, amonijaka, amonij-klorida, amonij-karbonata, nitrita i nitrata kalija Ovaj razred također uključuje: - proizvodnju zemlje za cvijeće s tresetom kao glavnim sastojkom - proizvodnju zemlje za cvijeće, mješavinu prirodne zemlje, pijeska, ilovače i minerala Ovaj razred isključuje: - kopanje guana, vidi 08.91 - proizvodnju agrokemijskih proizvoda kao što su pesticidi, vidi 20.20
scope note: Į šią klasę įeina: - trąšų gamyba: • grynųjų ar kompleksinių azoto, fosforo ar kalio trąšų • karbamido, neapdorotų gamtinių fosfatų ir gamtinių kalio druskų - sudėtinių azoto produktų gamyba: • azoto ir amonio sulfato rūgščių, amoniako, amonio chlorido, amonio karbonato, kalio nitritų ir nitratų Į šią klasę taip pat įeina: - vazoniniams augalams skirtų žemės mišinių iš durpių, sudarančių pagrindinę dalį, gamyba - vazoniniams augalams skirtų žemės mišinių iš natūralaus dirvožemio, smėlio, molio ir mineralų gamyba Į šią klasę neįeina: - guano kasyba, žr. 08.91 - agrocheminių produktų, tokių kaip pesticidai, gamyba, žr. 20.20 @lt
scope note: Bu sınıf aşağıdakileri kapsamaktadır; - gübrelerin imalatı: • saf ya da kompleks azotlu, fosfatlı ya da potasyumlu gübreler, • üre, ham doğal fosfatlar ve ham doğal potasyum tuzları, - bileşik azotlu ürünlerin imalatı: • nitrik ve sülfonitrik asitler, amonyak, amonyum klorid, amonyum karbonat, nitritler ve potasyum nitratlar Ayrıca bu sınıf aşağıdakileri de kapsamaktadır; - ana bileşeni turba olan saksı toprağı imalatı, - doğal toprak, kum, kil ve minerallerin karışımından saksı toprağı imalatı. Kapsam dışı olanlar; - guano madenciliği, bkz. 08.91, - böcek ilaçları gibi zirai- kimyasal ürünlerin imalatı, bkz. 20.20. @tr
preferred label: Производство на азотни съединения и торове @bg
preferred label: Výroba hnojiv a dusíkatých sloučenin @cs
preferred label: Fremstilling af gødningsstoffer og nitrogenprodukter @da
preferred label: Herstellung von Düngemitteln und Stickstoffverbindungen @de
preferred label: Παραγωγή λιπασμάτων και αζωτούχων ενώσεων @el
preferred label: Fabricación de fertilizantes y compuestos nitrogenados @es
preferred label: Väetiste ja lämmastikuühendite tootmine @et
preferred label: Lannoitteiden ja typpiyhdisteiden valmistus @fi
preferred label: Fabrication de produits azotés et d'engrais @fr
preferred label: Műtrágya, nitrogénvegyület gyártása
preferred label: Fabbricazione di fertilizzanti e di composti azotati @it
preferred label: Trąšų ir azoto junginių gamyba @lt
preferred label: Minerālmēslu un slāpekļa savienojumu ražošana @lv
preferred label: Manifattura ta' fertilizzanti u taħlitiet tan-nitroġenu @mt
preferred label: Vervaardiging van kunstmeststoffen en stikstofverbindingen @nl
preferred label: Produksjon av gjødsel, nitrogenforbindelser og vekstjord @no
preferred label: Produkcja nawozów i związków azotowych @pl
preferred label: Fabricação de adubos e de compostos azotados @pt
preferred label: Fabricarea îngrăşămintelor şi produselor azotoase @ro
preferred label: Производство удобрений и азотосодержащих смесей @ru
preferred label: Výroba priemyselných hnojív a dusíkatých zlúčenín @sk
preferred label: Proizvodnja gnojil in dušikovih spojin @sl
preferred label: Tillverkning av gödselmedel och kväveprodukter @sv
preferred label: Kimyasal gübre ve azot bileşiklerin imalatı @tr
broader: Manufacture of basic chemicals, fertilisers and nitrogen compounds, plastics and synthetic rubber in primary forms

Manufacture of plastics in primary forms
type: Concept
notation: 20.16
status: valid
status modified: 2013-10-18
accepted date: 2013-10-18
in scheme: Statistical Classification of Economic Activities in the European Community, Rev. 2 (2008)
scope note: Производството на смоли, полимери, невулканизируеми термопластични еластомери, смесване на смоли по поръчка и производство на стандартни/неспециални синтетични смоли е включено в този клас. - производство на полимери в първични форми: • полимери на етилена, пропилена, стирена, винилхлорида, винилацетата и други акрилови полимери • полиамиди • фенолни и епоксидни смоли, и полиуретани • алкидни смоли, полиестери и полиетери • силикони • йонообменни смоли на основата на полимери - производство на целулоза, целулозни нитрати, ацетати и други химични производни на целулозата - производство на изкуствени и синтетични влакна, нишки и прежди - 20.60 - раздробяване на пластмасови отпадъци - 38.32 @bg
scope note: Tato třída zahrnuje výrobu pryskyřic, plastů a nevulkanizovatelných termoplastických elastomerů, míchání a mixování pryskyřic dle zadání zákazníka jakož i výrobu syntetických pryskyřic Z: - výrobu plastů v primárních formách: • polymerů, včetně z etylenu, propylenu, styrenu, vinylchloridu, vinylacetátu a akrylových pryskyřic • polyamidů • fenolových a epoxidových pryskyřic a polyuretanů • alkydových a polyesterových pryskyřic a polyéterů • silikonů • iontoměničů založených na polymerech ZT: - výrobu celulózy a jejich chemických derivátů N: - výrobu umělých (chemických) a syntetických vláken, žhavicích vláken a nití (příze) (20.60) - skartaci plastů (38.32) @cs
scope note: Diese Klasse umfasst die Herstellung von Harzen, Kunststoffen und nichtvulkanisierbaren thermoplastischen Elastomeren sowie das Mischen und Verschneiden von Harzen nach Kundenwunsch und die Herstellung von synthetischen Harzen nach eigener Spezifikation. Diese Klasse umfasst: - Herstellung von Kunststoffen in Primärformen: • Polymere, auch von Ethylen, Propylen, Styrol, Vinylchlorid, Vinylacetat und Acryl • Polyamide • Phenol- und Epoxidharze und Polyurethane • Alkyd- und Polyesterharze und Polyether • Silicone • Ionenaustauscher auf der Grundlage von Polymeren Diese Klasse umfasst ferner: - Herstellung von Zellulose und ihren chemischen Derivaten Diese Klasse umfasst nicht: - Herstellung von Chemiefasern (s. 20.60) - Zerkleinern von Kunststoffen (s. 38.32) @de
scope note: This class includes the manufacture of resins, plastics materials and non-vulcanisable thermoplastic elastomers, the mixing and blending of resins on a custom basis, as well as the manufacture of non-customised synthetic resins. This class includes: - manufacture of plastics in primary forms: • polymers, including those of ethylene, propylene, styrene, vinyl chloride, vinyl acetate and acrylics • polyamides • phenolic and epoxide resins and polyurethanes • alkyd and polyester resins and polyethers • silicones • ion-exchangers based on polymers This class also includes: - manufacture of cellulose and its chemical derivatives This class excludes: - manufacture of artificial and synthetic fibres, filaments and yarn, see 20.60 - shredding of plastic products, see 38.32 @en
scope note: Esta clase comprende la fabricación de resinas, materiales plásticos y elastómeros termoplásticos no vulcanizables, así como la mezcla y combinación por encargo de resinas y la fabricación de resinas sintéticas no producidas según especificaciones. Esta clase comprende: - la fabricación de primeras materias plásticas: • polímeros, incluidos los polímeros de etileno, propileno, estireno, cloruro de vinilo, acetato de vinilo y acrílicos • poliamidas • resinas fenólicas, resinas de expóxido y poliuretano • resinas alquídicas, resinas de poliéster y poliésteres • siliconas • intercambiadores de iones basados en polímeros Esta clase comprende también: - la fabricación de celulosa y sus derivados químicos Esta clase no comprende: - la fabricación de fibras, filamentos e hilo artificiales y sintéticos (véase 20.60) - la trituración de productos plásticos (véase 38.32) @es
scope note: Cette classe comprend la fabrication de résines synthétiques, de matières plastiques et d’élastomères thermoplastiques non vulcanisables, ainsi que le mélange de résines sur commande et la fabrication de résines synthétiques standards. Cette classe comprend: - la fabrication de matières plastiques sous formes primaires: • polymères, y compris les polymères d’éthylène, de propylène, de styrène, de chlorure de vinyle, d’acétate de vinyle et les polymères acryliques • polyamides • résines phénoliques, résines époxydes et polyuréthannes • résines alkydes, résines polyesters et polyéthers • silicones • échangeurs d’ions à base de polymères Cette classe comprend également: - la fabrication de cellulose et de ses dérivés chimiques Cette classe ne comprend pas: - la fabrication de fibres, de filaments et de fils artificiels ou synthétiques, voir 20.60 - le broyage des produits en matières plastiques, voir 38.32 @fr
scope note: Ovaj razred uključuje proizvodnju smole, plastičnih materijala i nevulkaniziranih termoplastičnih elastomera, mješavina i smjesa smola na korisničkoj bazi te proizvodnju nekorisničkih sintetičnih smola. Ovaj razred uključuje: - proizvodnju plastike u primarnim oblicima: • polimera, uključujući one od etilena, propilena, stirena, vinilklorida, vinilacetata i akrilata • poliamida • fenolne i epoksi-smole i poliuretana • alkidne i poliester smole i polietera • silikona • izmjenjivača iona na bazi polimera Ovaj razred također uključuje: - proizvodnju celuloze od njezinih kemijskih derivata Ovaj razred isključuje: - proizvodnju umjetnih i sintetičkih vlakana, silamebata i pređe, vidi 20.60 - uništavanje plastičnih proizvoda, vidi 38.32
scope note: Į šią klasę įeina dervų, plastikų medžiagų, nevulkanizuojamų termoplastinių elastomerų gamyba, maišymas ir dervos mišinių ruošimas pagal užsakymą, taip pat nepritaikytos individualiam vartotojui sintetinės dervos gamyba. Į šią klasę įeina: - pirminių plastikų gamyba: • polimerų, įskaitant etileną, propileną, stirolą, vinilchloridą, vinilacetatą ir akrilą • poliamidų • fenolio ir epoksidinių dervų ir poliuretanų • alkidinių ir polieterinių dervų ir polieterių • polisiloksanų (silikonų) • polimerinių jonitų Į šią klasę taip pat įeina: - celiuliozės ir jos cheminių darinių gamyba Į šią klasę neįeina: - dirbtinių ir sintetinių pluoštų, gijų bei verpalų gamyba, žr. 20.60 - plastiko dirbinių smulkinimas, žr. 38.32 @lt
scope note: Этот класс включает: - производство инсектицидов/средств от насекомых, родентицидов, фунгицидов, гербицидов, акарицидов, молюстицидов, биоцидов - производство продуктов, регулирующих рост растений - производство дезинфицирующих средств (для сельскохозяйственных целей и прочего использования) - производство прочих агрохимических продуктов, не включенных в другие категории Этот класс исключает: - производство химических удобрений и азотных соединений, см. 20.15 @ru
scope note: Bu sınıf, müşteri isteğine göre hazırlanmamış sentetik reçinelerin imalatı da dahil, reçineler, plastik materyaller ve vulkanize edilemez (kükürtle işlenemez) termoplastik (ısı ile yumuşayan) elastomerler (sentetik kauçuk gibi elastik maddeler), ısmarlama temeline dayalı karıştırılmış ve harmanlanmış reçine imalatını da kapsar. Bu sınıf aşağıdakileri kapsamaktadır; - birincil formda plastik imalatı: • polimerler, (etilen, propilen, stiren (feniletilen), vinil klorid, vinil asetat ve akrilikler dahil), • poliamitler, • fenollu ve epoksit reçineler ve poliüretanlar, • alkid ve polyester reçineler ve polieterler, • silikonlar, • polimerler bazlı iyon değiştiricileri. Ayrıca bu sınıf aşağıdakileri de kapsamaktadır; - selülöz ve kimyasal türevlerinin imalatı. Kapsam dışı olanlar; - suni ve sentetik elyaf, filaman ve iplik imalatı, bkz. 20.60, - plastik atıkların parçalanması, bkz. 38.32. @tr
preferred label: Производство на полимери в първични форми @bg
preferred label: Výroba plastů v primárních formách @cs
preferred label: Fremstilling af plast i ubearbejdet form @da
preferred label: Herstellung von Kunststoffen in Primärformen @de
preferred label: Παραγωγή πλαστικών σε πρωτογενείς μορφές @el
preferred label: Fabricación de plásticos en formas primarias @es
preferred label: Plasti tootmine algkujul @et
preferred label: Muoviaineiden valmistus @fi
preferred label: Fabrication de matières plastiques de base @fr
preferred label: Műanyag-alapanyag gyártása
preferred label: Fabbricazione di materie plastiche in forme primarie @it
preferred label: Pirminių plastikų gamyba @lt
preferred label: Plastmasu ražošana pirmapstrādes formās @lv
preferred label: Manifattura ta' plastik f'forom primarji @mt
preferred label: Vervaardiging van kunststoffen in primaire vormen @nl
preferred label: Produksjon av basisplast @no
preferred label: Produkcja tworzyw sztucznych w formach podstawowych @pl
preferred label: Fabricação de matérias plásticas sob formas primárias @pt
preferred label: Fabricarea materialelor plastice în forme primare @ro
preferred label: Производство пластика в первичных формах @ru
preferred label: Výroba plastov v primárnej forme @sk
preferred label: Proizvodnja plastičnih mas v primarni obliki @sl
preferred label: Basplastframställning @sv
preferred label: Birincil formda plastik hammaddelerin imalatı @tr
broader: Manufacture of basic chemicals, fertilisers and nitrogen compounds, plastics and synthetic rubber in primary forms

Manufacture of synthetic rubber in primary forms
type: Concept
notation: 20.17
status: valid
status modified: 2013-10-18
accepted date: 2013-10-18
in scheme: Statistical Classification of Economic Activities in the European Community, Rev. 2 (2008)
scope note: - производство на синтетичен каучук в първични форми: • синтетичен каучук • фактис - производство на смеси от синтетичен с естествен каучук или с аналогични естествени гуми (балата) @bg
scope note: Z: - výrobu syntetického kaučuku v primárních formách • syntetický kaučuk • faktis - výroba směsí syntetického a přírodního kaučuku nebo kaučuku jako guma vypadající (např. balata) @cs
scope note: Diese Klasse umfasst: - Herstellung von synthetischem Kautschuk in Primärformen • synthetischer Kautschuk • Faktis - Herstellung von Mischungen aus synthetischem Kautschuk und Naturkautschuk oder kautschukähnlichen Gummiharzen (z. B. Balata) @de
scope note: This class includes: - manufacture of synthetic rubber in primary forms: • synthetic rubber • factice - manufacture of mixtures of synthetic rubber and natural rubber or rubber-like gums (e.g. balata) @en
scope note: Esta clase comprende: - la fabricación de caucho sintético en sus formas primarias: • caucho sintético • factis - la fabricación de mezclas de caucho sintético y caucho natural o gomas similares al caucho (por ejemplo, balata) @es
scope note: Cette classe comprend: - la fabrication de caoutchouc synthétique sous formes primaires: • caoutchouc synthétique • caoutchouc factice - la fabrication de mélanges de caoutchouc synthétique et de caoutchouc naturel ou de gommes caoutchouteuses (par exemple, le balata) @fr
scope note: Ovaj razred uključuje: - proizvodnju sintetičkoga kaučuka u primarnim oblicima: • sintetičkoga kaučuka • faktisa - proizvodnju mješavina od sintetičkog i prirodnoga kaučuka ili kaučuku sličnih guma (npr. balata)
scope note: Į šią klasę įeina: - pirminio sintetinio kaučiuko gamyba: • sintetinio kaučiuko • faktiso - sintetinio ir natūraliojo kaučiuko mišinių ar kaučiukinių dervų (pvz., balatos) gamyba @lt
scope note: Bu sınıf aşağıdakileri kapsamaktadır; - birincil formda sentetik kauçuk imalatı: • sentetik kauçuk, • suni lastik. - sentetik kauçuk ve doğal kauçuk veya kauçuk benzeri lastik (örneğin, balata) karışımların imalatı. @tr
preferred label: Производство на синтетичен каучук в първични форми @bg
preferred label: Výroba syntetického kaučuku v primárních formách @cs
preferred label: Fremstilling af syntetisk gummi i ubearbejdet form @da
preferred label: Herstellung von synthetischem Kautschuk in Primärformen @de
preferred label: Παραγωγή συνθετικού ελαστικού (συνθετικού καουτσούκ) σε πρωτογενείς μορφές @el
preferred label: Fabricación de caucho sintético en formas primarias @es
preferred label: Sünteeskautšuki (toorkummi) tootmine algkujul @et
preferred label: Synteettisen kumiraaka-aineen valmistus @fi
preferred label: Fabrication de caoutchouc synthétique @fr
preferred label: Szintetikus kaucsuk alapanyag gyártása
preferred label: Fabbricazione di gomma sintetica in forme primarie @it
preferred label: Pirminio sintetinio kaučiuko gamyba @lt
preferred label: Sintētiskā kaučuka ražošana pirmapstrādes formās @lv
preferred label: Manifattura ta' lasktu sintetiku f'forom primarji @mt
preferred label: Vervaardiging van synthetische rubber in primaire vormen @nl
preferred label: Produksjon av syntetisk gummi @no
preferred label: Produkcja kauczuku syntetycznego w formach podstawowych @pl
preferred label: Fabricação de borracha sintética sob formas primárias @pt
preferred label: Fabricarea cauciucului sintetic în forme primare @ro
preferred label: Производство синтетического каучука в первичной форме @ru
preferred label: Výroba syntetického kaučuku v primárnej forme @sk
preferred label: Proizvodnja sintetičnega kavčuka v primarni obliki @sl
preferred label: Tillverkning av syntetiskt basgummi @sv
preferred label: Birincil formda sentetik kauçuk imalatı @tr
broader: Manufacture of basic chemicals, fertilisers and nitrogen compounds, plastics and synthetic rubber in primary forms

Manufacture of pesticides and other agrochemical products
type: Concept
notation: 20.2
status: valid
status modified: 2013-10-18
accepted date: 2013-10-18
in scheme: Statistical Classification of Economic Activities in the European Community, Rev. 2 (2008)
scope note: Этот класс включает: - производство красок, лаков и эмалей - производство готовых красящих веществ и колеров - производство эмалей, лаков, покрывающих составов и подобных препаратов - производство мастики - производство шпатлевки и подобных препаратов для выравнивания поверхности - производство органических композитных растворителей и разбавителей - производство готовых жидкостей для снятия краски или лака - производство типографской краски Этот класс исключает: - производство красителей и пигментов, см. 20.12 - производство чернил и туши, см. 20.59 @ru
preferred label: Производство на пестициди и други агрохимикали @bg
preferred label: Výroba pesticidů a jiných agrochemických přípravků @cs
preferred label: Fremstilling af pesticider og andre agrokemiske produkter @da
preferred label: Herstellung von Schädlingsbekämpfungs-, Pflanzenschutz- und Desinfektionsmitteln @de
preferred label: Παραγωγή παρασιτοκτόνων και άλλων αγροχημικών προϊόντων @el
preferred label: Fabricación de pesticidas y otros productos agroquímicos @es
preferred label: Taimekaitsevahendite ja muude agrokeemiatoodete tootmine @et
preferred label: Torjunta-aineiden ja muiden maatalouskemikaalien valmistus @fi
preferred label: Fabrication de pesticides et d'autres produits agrochimiques @fr
preferred label: Mezőgazdasági vegyi termék gyártása
preferred label: Fabbricazione di fitofarmaci e di altri prodotti chimici per l'agricoltura @it
preferred label: Pesticidų ir kitų agrocheminių medžiagų gamyba @lt
preferred label: Pesticīdu un citu agroķīmisko preparātu ražošana @lv
preferred label: Manifattura ta' pestiċidi u prodotti oħra agrokimiċi @mt
preferred label: Vervaardiging van verdelgingsmiddelen en van andere chemische producten voor de landbouw @nl
preferred label: Produksjon av plantevern- og skadedyrmidler og andre landbrukskjemiske produkter @no
preferred label: Produkcja pestycydów i pozostałych środków agrochemicznych @pl
preferred label: Fabricação de pesticidas e outros produtos agroquímicos @pt
preferred label: Fabricarea pesticidelor şi a altor produse agrochimice @ro
preferred label: Производство пестицидов и прочей агрохимической продукции @ru
preferred label: Výroba pesticídov a iných agrochemických produktov @sk
preferred label: Proizvodnja razkužil, pesticidov in drugih agrokemičnih izdelkov @sl
preferred label: Tillverkning av bekämpningsmedel och andra lantbrukskemiska produkter @sv
preferred label: Haşere ilaçları ve diğer zirai-kimyasal ürünlerin imalatı @tr
broader: Manufacture of chemicals and chemical products
narrower: Manufacture of pesticides and other agrochemical products

Manufacture of pesticides and other agrochemical products
type: Concept
notation: 20.20
status: valid
status modified: 2013-10-18
accepted date: 2013-10-18
in scheme: Statistical Classification of Economic Activities in the European Community, Rev. 2 (2008)
scope note: - производство на инсектициди, фунгициди, хербициди, акарициди, молюсцициди, родентициди - производство на инхибитори на кълненето и регулатори на растежа на растенията - производство на дезинфекционни средства (за селскостопанска и друга употреба) - производство на други агрохимикали, некласифицирани другаде - производство на азотни съединения и торове - 20.15 @bg
scope note: Z: - výrobu insekticidů, rodenticidů, fungicidů, herbicidů, pesticidů k hubení: roztočů, měkkýšů, biocidů (ničí živé organizmy) - výrobu přípravků proti klíčení, růstových stimulátorů rostlin - výrobu dezinfekčních prostředků (pro zemědělské a jiné účely) - výrobu ostatních agrochemických výrobků j. n. N: - výrobu hnojiv a dusíkatých sloučenin (20.15) @cs
scope note: Diese Klasse umfasst: - Herstellung von Insektiziden, Rodentiziden, Fungiziden, Herbiziden, Milbenbekämpfungsmitteln, Schneckengiften, Bioziden - Herstellung von Keimhemmungsmitteln, Wachstumsregulatoren - Herstellung von Desinfektionsmitteln (für landwirtschaftliche und andere Zwecke) - Herstellung von sonstigen agrochemischen Erzeugnissen a. n. g. Diese Klasse umfasst nicht: - Herstellung von Düngemitteln und Stickstoffverbindungen (s. 20.15) @de
scope note: This class includes: - manufacture of insecticides, rodenticides, fungicides, herbicides, acaricides, molluscicides, biocides - manufacture of anti-sprouting products, plant growth regulators - manufacture of disinfectants (for agricultural and other use) - manufacture of other agrochemical products n.e.c. This class excludes: - manufacture of fertilisers and nitrogen compounds, see 20.15 @en
scope note: Esta clase comprende: - la fabricación de insecticidas, raticidas, fungicidas, herbicidas, acaricidas, moluscicidas, biocidas - la fabricación de inhibidores de germinación y reguladores del crecimiento de las plantas - la fabricación de desinfectantes tanto agrícolas como para otros usos - la fabricación de otros productos agroquímicos n.c.o.p. Esta clase no comprende: - la fabricación de abonos y compuestos de nitrógeno (véase 20.15) @es
scope note: Cette classe comprend: - la fabrication d’insecticides, de rodonticides, de fongicides, d’herbicides, d’acaricides, de molluscicides, de biocides - la fabrication d’inhibiteurs de germination, de régulateurs de croissance pour plantes - la fabrication de désinfectants (à usage agricole ou autre) - la fabrication d’autres produits agrochimiques n.c.a. Cette classe ne comprend pas: - la fabrication d’engrais et de produits azotés, voir 20.15 @fr
scope note: Ovaj razred uključuje: - proizvodnju insekticida, rodenticida, fungicida, herbicida, akaricida, pužomora i biocida - proizvodnju repelenata i regulatora rasta biljaka - proizvodnju sredstava za dezinfekciju (za potrebe poljoprivrede i druge svrhe) - proizvodnju drugih agrokemijskih proizvoda, d. n. Ovaj razred isključuje: - proizvodnju umjetnih gnojiva i dušičnih spojeva, vidi 20.15
scope note: Į šią klasę įeina: - insekticidų, rodenticidų, fungicidų, herbicidų, akaricidų, moliuskocidų ir biocidų gamyba - augalų dygimo lėtiklių ir augalų augimo reguliatorių gamyba - dezinfekcijos priemonių gamyba (žemės ūkiui ir kitoms reikmėms) - kitų, niekur kitur nepriskirtų, agrocheminių medžiagų gamyba Į šią klasę neįeina: - trąšų ir azoto junginių gamyba, žr. 20.15 @lt
scope note: Bu sınıf aşağıdakileri kapsamaktadır; - böcek ilaçları, kemirgen ilaçları, küf öldürücüler, yabancı ot ilaçları imalatı, - çimlenmeyi engelleyen ürünler, bitki büyütme düzenleyicileri imalatı, - dezenfektanların imalatı (tarımsal ve diğer kullanımlar için), - başka yerde sınıflandırılmamış diğer zirai-kimyasal ürünlerin imalatı. Kapsam dışı olanlar; - gübreler ve azotlu bileşiklerin imalatı, bkz. 20.15. @tr
preferred label: Производство на пестициди и други агрохимикали @bg
preferred label: Výroba pesticidů a jiných agrochemických přípravků @cs
preferred label: Fremstilling af pesticider og andre agrokemiske produkter @da
preferred label: Herstellung von Schädlingsbekämpfungs-, Pflanzenschutz- und Desinfektionsmitteln @de
preferred label: Παραγωγή παρασιτοκτόνων και άλλων αγροχημικών προϊόντων @el
preferred label: Fabricación de pesticidas y otros productos agroquímicos @es
preferred label: Taimekaitsevahendite ja muude agrokeemiatoodete tootmine @et
preferred label: Torjunta-aineiden ja muiden maatalouskemikaalien valmistus @fi
preferred label: Fabrication de pesticides et d'autres produits agrochimiques @fr
preferred label: Mezőgazdasági vegyi termék gyártása
preferred label: Fabbricazione di fitofarmaci e di altri prodotti chimici per l'agricoltura @it
preferred label: Pesticidų ir kitų agrocheminių medžiagų gamyba @lt
preferred label: Pesticīdu un citu agroķīmisko preparātu ražošana @lv
preferred label: Manifattura ta' pestiċidi u prodotti oħra agrokimiċi @mt
preferred label: Vervaardiging van verdelgingsmiddelen en van andere chemische producten voor de landbouw @nl
preferred label: Produksjon av plantevern- og skadedyrmidler og andre landbrukskjemiske produkter @no
preferred label: Produkcja pestycydów i pozostałych środków agrochemicznych @pl
preferred label: Fabricação de pesticidas e outros produtos agroquímicos @pt
preferred label: Fabricarea pesticidelor şi a altor produse agrochimice @ro
preferred label: Производство пестицидов и прочей агрохимической продукции @ru
preferred label: Výroba pesticídov a iných agrochemických produktov @sk
preferred label: Proizvodnja razkužil, pesticidov in drugih agrokemičnih izdelkov @sl
preferred label: Tillverkning av bekämpningsmedel och andra lantbrukskemiska produkter @sv
preferred label: Haşere ilaçları ve diğer zirai-kimyasal ürünlerin imalatı @tr
broader: Manufacture of pesticides and other agrochemical products

Manufacture of paints, varnishes and similar coatings, printing ink and mastics
type: Concept
notation: 20.3
status: valid
status modified: 2013-10-18
accepted date: 2013-10-18
in scheme: Statistical Classification of Economic Activities in the European Community, Rev. 2 (2008)
scope note: Этот класс включает: - производство органических поверхностно-активных препаратов - производство бумаги, салфеток и т.д. покрытых или пропитанных моющими средствами - производство глицерина - производство мыла, за исключением косметического мыла - производство поверхностно-активных препаратов: • стиральных порошков в твердой или жидкой форме и прочих моющих средств • препаратов для мытья посуды • ароматизирующих и смягчающих средств для добавления при стирке - производство очищающих и полирующих средств: • освежителей воздуха • искусственного воска • средств по уходу за кожаными изделиями • полиролей для деревянных поверхностей • полиролей для стеклянных и металлических поверхностей • чистящих паст и порошков, включая салфетки, покрытые или пропитанные подобными средствами Этот класс исключает: - производство смесей с определенным химическим составом, см. 20.13, 20.14 - производство глицерина из нефтепродуктов, см. 20.14 - производство косметического мыла, см. 20.42 @ru
preferred label: Производство на бои, лакове и подобни продукти, печатарско мастило и китове @bg
preferred label: Výroba nátěrových barev, laků a jiných nátěrových materiálů, tiskařských barev a tmelů @cs
preferred label: Fremstilling af maling, lak og lignende overfladebehandlingsmidler, trykfarver samt tætningsmaterialer @da
preferred label: Herstellung von Anstrichmitteln, Druckfarben und Kitten @de
preferred label: Παραγωγή χρωμάτων, βερνικιών και παρόμοιων επιχρισμάτων, μελανιών τυπογραφίας και μαστιχών @el
preferred label: Fabricación de pinturas, barnices y revestimientos similares; tintas de imprenta y masillas @es
preferred label: Värvide, lakkide ja muude viimistlusvahendite ning trükivärvide ja mastiksite tootmine @et
preferred label: Maalien, lakan, painovärien yms. valmistus @fi
preferred label: Fabrication de peintures, vernis, encres et mastics @fr
preferred label: Festék, bevonóanyag gyártása
preferred label: Fabbricazione di pitture, vernici e smalti, inchiostri da stampa e adesivi sintetici @it
preferred label: Dažų, lakų ir panašių dangų medžiagų, spaustuvinių dažų ir mastikų gamyba @lt
preferred label: Krāsu, laku un līdzīgu pārklājumu, tipogrāfijas krāsu un mastikas ražošana @lv
preferred label: Manifattura ta' żebgħa, verniċ u kisi simili, inka ta' l-istampar u mastiċi @mt
preferred label: Vervaardiging van verf, vernis e.d., drukinkt en mastiek @nl
preferred label: Produksjon av maling og lakk, trykkfarger og tetningsmidler @no
preferred label: Produkcja farb, lakierów i podobnych powłok, farb drukarskich i mas uszczelniających @pl
preferred label: Fabricação de tintas, vernizes e produtos similares, tintas de impressão e mastiques @pt
preferred label: Fabricarea vopselelor, lacurilor, cernelii tipografice şi masticurilor @ro
preferred label: Производство красок, лаков и аналогичных красящих веществ, типографской краски и мастики @ru
preferred label: Výroba farieb, lakov a podobných náterov, tlačiarenských farieb a tmelov @sk
preferred label: Proizvodnja barv, lakov in podobnih premazov, tiskarskih barv in kitov @sl
preferred label: Tillverkning av färg, lack, tryckfärg m.m. @sv
preferred label: Boya, vernik ve benzeri kaplayıcı maddeler ile matbaa mürekkebi ve macun imalatı @tr
broader: Manufacture of chemicals and chemical products
narrower: Manufacture of paints, varnishes and similar coatings, printing ink and mastics

Manufacture of paints, varnishes and similar coatings, printing ink and mastics
type: Concept
notation: 20.30
status: valid
status modified: 2013-10-18
accepted date: 2013-10-18
in scheme: Statistical Classification of Economic Activities in the European Community, Rev. 2 (2008)
scope note: - производство на бои, лакове, емайллакове - производство на готови пигменти, готови препарати за матиране и оцветяване - производство остъкляващи емайли, ангоби, течни лустра и подобни препарати - производство на кит за прозорци, свързващи смоли и други китове - производство на покрития, използвани при боядисване и на смеси от неогнеупорни материали за шпакловане и измазване на фасади, вътрешни стени, подове, тавани и подобни - производство на сложни органични разтворители и разредители - производство на препарати за премахване на бои и лакове - производство на печатарско мастило - производство на багрила и пигменти - 20.12 - производство на мастило за писане и туш за чертане - 20.59 @bg
scope note: Z: - výrobu barev a laků, smaltů a jemných laků - výrobu hotových pigmentů a barviv, kalidel a barev - výrobu emailových smaltů a glazur a engoby (nástřepí) a podobných přípravků - výrobu tmelů - výrobu těsnicích tmelů a podobných nežáruvzdorných plnidel nebo přípravků povrchové úpravy - výrobu organických směsných rozpouštědel a ředidel - výrobu hotových barev (laků, nátěrů) nebo odlakovačů - výrobu tiskařských barev N: - výrobu barviv a pigmentů (20.12) - výrobu inkoustu a tuše (20.59) @cs
scope note: Diese Klasse umfasst: - Herstellung von Farben und Lacken, Lackharzen - Herstellung von zubereiteten Pigmenten und Farbstoffen, Trübungsmitteln und Farben - Herstellung von verglasbaren Emaillen, Glasuren, Engoben und ähnlichen Zubereitungen - Herstellung von Kitten - Herstellung von Dichtungsbestandteilen und ähnlichen nichtfeuerfesten Spachtel- und Verputzmassen - Herstellung von zusammengesetzten organischen Lösungs- und Verdünnungsmitteln - Herstellung von zubereiteten Farb- und Lackentfernern - Herstellung von Druckfarben Diese Klasse umfasst nicht: - Herstellung von Farbstoffen (s. 20.12) - Herstellung von Tinte und Tusche (s. 20.59) @de
scope note: This class includes: - manufacture of paints and varnishes, enamels or lacquers - manufacture of prepared pigments and dyes, opacifiers and colours - manufacture of vitrifiable enamels and glazes and engobes and similar preparations - manufacture of mastics - manufacture of caulking compounds and similar non-refractory filling or surfacing preparations - manufacture of organic composite solvents and thinners - manufacture of prepared paint or varnish removers - manufacture of printing ink This class excludes: - manufacture of dyestuffs and pigments, see 20.12 - manufacture of writing and drawing ink, see 20.59 @en
scope note: Esta clase comprende: - la fabricación de pinturas y barnices, esmaltes o lacas - la fabricación de pigmentos y tintes, opacificadores y colores preparados - la fabricación de esmaltes vitrificables y vidriados y engobes y preparados similares - la fabricación de masillas - la fabricación de compuestos de calafateado, plastes o masillas de relleno no refractarios similares - la fabricación de disolventes y diluyentes orgánicos compuestos - la fabricación de preparados quitapinturas y quitabarnices - la fabricación de tintas de imprenta Esta clase no comprende: - la fabricación de tintes y colorantes (véase 20.12) - la fabricación de tintas para escribir o dibujar (véase 20.59) @es
scope note: Cette classe comprend: - la fabrication de peintures, de vernis et d’émaux - la fabrication de pigments, d’opacifiants et de couleurs préparés - la fabrication de compositions vitrifiables, d’engobes et de préparations similaires - la fabrication de mastics - la fabrication d’enduits utilisés en peinture et d’autres enduits non réfractaires des types utilisés en maçonnerie - la fabrication de solvants et de diluants organiques composites - la fabrication de décapants pour peintures et vernis - la fabrication d’encres d’imprimerie Cette classe ne comprend pas: - la fabrication de colorants et de pigments, voir 20.12 - la fabrication d’encres à écrire ou à dessiner, voir 20.59 @fr
scope note: Ovaj razred uključuje: - proizvodnju boja i lakova, emajla ili lak-boja - proizvodnju pripremljenih pigmenata i boja, opacifijenata i koloranata - proizvodnju staklastog emajla, glazura i engoba te sličnih pripravaka - proizvodnju kitova - proizvodnju složenih punila i sličnih nevatrostalnih pripravaka za punjenje ili površinsku obradu - proizvodnju organskih složenih otapala i razrjeđivača boja - proizvodnju pripravaka za skidanje boja i lakova - proizvodnju grafičkih boja Ovaj razred isključuje: - proizvodnju koloranata, pigmenata i turpentina, vidi 20.12 - proizvodnju tinte za pisanje i crtanje, vidi 20.59
scope note: Į šią klasę įeina: - dažų ir lakų, emalių ir politūrų gamyba - paruoštų pigmentų ir dažiklių, drumstiklių ir dažų gamyba - stiklėjančių emalinių dažų ir glazūrų bei aplipdų (angobų) ir panašių preparatų gamyba - mastikų gamyba - užpildomųjų kompaundų ir panašių ugniai neatsparių užpildų arba gruntų gamyba - organinių sudėtinių tirpiklių ir skiediklių gamyba - paruoštų dažų ar lakų pašalinimo preparatų gamyba - spaustuvinių dažų gamyba Į šią klasę neįeina: - dažiklių ir pigmentų gamyba, žr. 20.12 - rašalo ir tušo gamyba, žr. 20.59 @lt
scope note: Этот класс включает: - производство парфюмерных и косметических средств: • духов и туалетной воды • косметических препаратов и декоративной косметики • средств для загара • средств для маникюра и педикюра • шампуней, лаков для волос, средств для завивки и укладки волос • зубных паст, порошков и препаратов для ухода за полостью рта и зубными протезами • средств для бритья, включая средства для бритья и после бритья • дезодорантов и солей для ванны • средств для депиляции - производство косметического мыла Этот класс исключает: - производство и очистку натуральных эфирных масел, см. 20.53 @ru
scope note: Bu sınıf aşağıdakileri kapsamaktadır; - boyalar, vernikler, mineler (emaye) veya lakların imalatı, - hazır pigmentlerin, şeffaf veya renkli boyaların imalatı, - cam haline getirilebilir mineler, şeffaf sırlar ve benzer karışımların imalatı, - macun imalatı, - kalafat macunları ve benzer ateşe dayanıklı olmayan dolgu veya yüzey müstahzarları imalatı, - organik kompozit solventler (çözücüler) ve tinerlerin (incelticilerin) imalatı, - hazır boya ya da cila temizleyicileri ve çıkarıcıları imalatı, - matbaa mürekkebi imalatı. Kapsam dışı olanlar; - boya maddeleri (konsantre olarak) ve pigmentlerin imalatı, bkz. 20.12, - yazım ve çizim mürekkebi imalatı, bkz. 20.59. @tr
preferred label: Производство на бои, лакове и подобни продукти, печатарско мастило и китове @bg
preferred label: Výroba nátěrových barev, laků a jiných nátěrových materiálů, tiskařských barev a tmelů @cs
preferred label: Fremstilling af maling, lak og lignende overfladebehandlingsmidler, trykfarver samt tætningsmaterialer @da
preferred label: Herstellung von Anstrichmitteln, Druckfarben und Kitten @de
preferred label: Παραγωγή χρωμάτων, βερνικιών και παρόμοιων επιχρισμάτων, μελανιών τυπογραφίας και μαστιχών @el
preferred label: Fabricación de pinturas, barnices y revestimientos similares; tintas de imprenta y masillas @es
preferred label: Värvide, lakkide ja muude viimistlusvahendite ning trükivärvide ja mastiksite tootmine @et
preferred label: Maalien, lakan, painovärien yms. valmistus @fi
preferred label: Fabrication de peintures, vernis, encres et mastics @fr
preferred label: Festék, bevonóanyag gyártása
preferred label: Fabbricazione di pitture, vernici e smalti, inchiostri da stampa e adesivi sintetici @it
preferred label: Dažų, lakų ir panašių dangų medžiagų, spaustuvinių dažų ir mastikų gamyba @lt
preferred label: Krāsu, laku un līdzīgu pārklājumu, tipogrāfijas krāsu un mastikas ražošana @lv
preferred label: Manifattura ta' żebgħa, verniċ u kisi simili, inka ta' l-istampar u mastiċi @mt
preferred label: Vervaardiging van verf, vernis e.d., drukinkt en mastiek @nl
preferred label: Produksjon av maling og lakk, trykkfarger og tetningsmidler @no
preferred label: Produkcja farb, lakierów i podobnych powłok, farb drukarskich i mas uszczelniających @pl
preferred label: Fabricação de tintas, vernizes e produtos similares, tintas de impressão e mastiques @pt
preferred label: Fabricarea vopselelor, lacurilor, cernelii tipografice şi masticurilor @ro
preferred label: Производство красок, лаков и аналогичных красящих веществ, типографской краски и мастики @ru
preferred label: Výroba farieb, lakov a podobných náterov, tlačiarenských farieb a tmelov @sk
preferred label: Proizvodnja barv, lakov in podobnih premazov, tiskarskih barv in kitov @sl
preferred label: Tillverkning av färg, lack, tryckfärg m.m. @sv
preferred label: Boya, vernik ve benzeri kaplayıcı maddeler ile matbaa mürekkebi ve macun imalatı @tr
broader: Manufacture of paints, varnishes and similar coatings, printing ink and mastics

Manufacture of soap and detergents, cleaning and polishing preparations, perfumes and toilet preparations
type: Concept
notation: 20.4
status: valid
status modified: 2013-10-18
accepted date: 2013-10-18
in scheme: Statistical Classification of Economic Activities in the European Community, Rev. 2 (2008)
scope note: Данная группа включает производство взрывчатых и пиротехнических веществ, клеев, эфирных масел и химической продукции, не включенных в другие категории, например, фотографических химических препаратов (включая пленку и бумагу для печати фотографий), порошков и смесей для комбинированной диагностики и т.д. @ru
preferred label: Производство на почистващи, миещи, тоалетни и козметични препарати @bg
preferred label: Výroba mýdel, detergentů, čisticích a lešticích prostředků, parfémů a toaletních přípravků @cs
preferred label: Fremstilling af sæbe, rengørings- og rensemidler samt poleremidler, parfume, hårshampoo, tandpasta mv. @da
preferred label: Herstellung von Seifen, Wasch-, Reinigungs- und Körperpflegemitteln sowie von Duftstoffen @de
preferred label: Παραγωγή σαπουνιών και απορρυπαντικών, προϊόντων καθαρισμού και στίλβωσης, αρωμάτων και παρασκευασμάτων καλλωπισμού @el
preferred label: Fabricación de jabones, detergentes y otros artículos de limpieza y abrillantamiento; fabricación de perfumes y cosméticos @es
preferred label: Seebi, pesemis-, puhastus- ja poleervahendite, parfüümide ja tualetitarvete tootmine @et
preferred label: Saippuan, pesu-, puhdistus- ja kiillotusaineiden; hajuvesien ja hygieniatuotteiden valmistus @fi
preferred label: Fabrication de savons, de produits d'entretien et de parfums @fr
preferred label: Tisztítószer, testápolási cikk gyártása
preferred label: Fabbricazione di saponi e detergenti, di prodotti per la pulizia e la lucidatura, di profumi e cosmetici @it
preferred label: Muilo ir ploviklių, valiklių ir blizgiklių, kvepalų ir tualeto priemonių gamyba @lt
preferred label: Ziepju, mazgāšanas, tīrīšanas un spodrināšanas līdzekļu, smaržu un kosmētisko līdzekļu ražošana @lv
preferred label: Manifattura ta' sapun u deterġenti, sustanzi għat-tindif u l-illustrar, fwejjaħ u preparazzjonijiet tat-twaletta @mt
preferred label: Vervaardiging van zeep, wasmiddelen, poets- en reinigingsmiddelen, parfums en toiletartikelen @nl
preferred label: Produksjon av såpe og vaskemidler, rense- og polermidler, parfyme og toalettartikler @no
preferred label: Produkcja mydła i detergentów, środków myjących i czyszczących, wyrobów kosmetycznych i toaletowych @pl
preferred label: Fabricação de sabões e detergentes, produtos de limpeza e de polimento, perfumes e produtos de higiene @pt
preferred label: Fabricarea săpunurilor, detergenţilor şi a produselor de întreţinere, cosmetice şi de parfumerie @ro
preferred label: Производство мыла и моющих средств, чистящих и полирующих препаратов, парфюмерной продукции и косметических средств @ru
preferred label: Výroba mydla a pracích prostriedkov, čistiacich a leštiacich prípravkov, parfumérskych a toaletných prípravkov @sk
preferred label: Proizvodnja mil in pralnih sredstev, čistilnih in polirnih sredstev, parfumov in toaletnih sredstev @sl
preferred label: Tillverkning av rengöringsmedel, parfym och toalettartiklar @sv
preferred label: Sabun ve deterjan, temizlik ve parlatıcı maddeleri; parfüm; kozmetik ve tuvalet malzemeleri imalatı @tr
broader: Manufacture of chemicals and chemical products
narrower: Manufacture of soap and detergents, cleaning and polishing preparations
narrower: Manufacture of perfumes and toilet preparations

Manufacture of soap and detergents, cleaning and polishing preparations
type: Concept
notation: 20.41
status: valid
status modified: 2013-10-18
accepted date: 2013-10-18
in scheme: Statistical Classification of Economic Activities in the European Community, Rev. 2 (2008)
scope note: - производство на органични повърхностноактивни вещества - хартия, вата, филц и нетъкан текстил, напоени, промазани или покрити със сапун или детергенти - производство на суров глицерол - производство на сапун, с изключение на тоалетен и козметичен сапун - производство на повърхностноактивни препарати: • перилни и почистващи препарати в твърда или течна форма • препарати за миене на съдове • омекотители за тъкани - производство на ароматизатори и препарати за чистене и лъскане: • препарати за ароматизиране или обезмирисяване на помещения • изкуствени восъци и восъчни препарати • вакси и кремове, за кожа • паркетин и подобни препарати за поддържане на дървени изделия • препарати за лъскане на каросерии, стъкла и метали • пасти и прахове, за почистване и лъскане, вкл. хартия, вата и други, напоени, промазани или покрити с тях - производсто на определени химични съединения - 20.13, 20.14 - производство на синтетичен глицерол, получен от нефтени продукти - 20.14 - производство на тоалетен и козметичен сапун - 20.42 @bg
scope note: Z: - výrobu organických povrchově aktivních přísad (činidel) - výrobu papíru, vaty, plsti a netkaných textilií napuštěných nebo potažených mýdlem nebo čisticími prostředky - výrobu glycerinu - výrobu mýdla, kromě toaletních mýdel - výrobu povrchově aktivních přípravků: • detergentů a čisticích prostředků • prostředků na mytí nádobí • změkčovadel na textil - výrobu čisticích a lešticích prostředků: • přípravků pro parfémování nebo dezodoraci místností • umělých a upravených vosků • přípravků na ošetření usní • přípravků na ošetření dřeva • lešticích prostředků pro karoserie, sklo a kovy • brusných past a prášků, včetně papíru, rouna atd. jimi potaženými N: - výrobu oddělených chemických sloučenin (20.13, 20.14) - výrobu syntetického glycerinu z ropných produktů (20.14) - výrobu toaletních mýdel (20.42) @cs
scope note: Diese Klasse umfasst: - Herstellung von organischen grenzflächenaktiven Stoffen - Herstellung von Papier, Watte, Filz und Vliesstoffe, mit Seife oder Reinigungsmitteln getränkt oder überzogen - Herstellung von Glycerin - Herstellung von Seifen, außer solcher zur Körperpflege - Herstellung von grenzflächenaktiven Zubereitungen: • Wasch- und Reinigungsmittel • Geschirrspülmittel • Textilweichspüler - Herstellung von Reinigungs- und Poliermitteln: • Zubereitungen zum Parfümieren und Deodorieren von Räumen • künstliche und zubereitete Wachse • Lederpflegemittel • Holzpflegemittel • Poliermittel für Karosserien, Glas und Metall • Scheuerpasten und –pulver, einschließlich mit Scheurpasten und –pulver beschichtetem Papier, Vliesen usw. Diese Klasse umfasst nicht: - Herstellung von getrennten chemischen Verbindungen (s. 20.13, 20.14) - Herstellung von aus Mineralölerzeugnissen synthetisiertem Glycerin (s. 20.14) - Herstellung von Seife zur Körperpflege (s. 20.42) @de
scope note: This class includes: - manufacture of organic surface-active agents - manufacture of paper, wadding, felt etc. coated or covered with soap or detergent - manufacture of glycerol - manufacture of soap, except cosmetic soap - manufacture of surface-active preparations: • washing powders in solid or liquid form and detergents • dish-washing preparations • textile softeners - manufacture of cleaning and polishing products: • preparations for perfuming or deodorising rooms • artificial waxes and prepared waxes • polishes and creams for leather • polishes and creams for wood • polishes for coachwork, glass and metal • scouring pastes and powders, including paper, wadding etc. coated or covered with these This class excludes: - manufacture of separate, chemically defined compounds, see 20.13, 20.14 - manufacture of glycerol, synthesised from petroleum products, see 20.14 - manufacture of cosmetic soap, see 20.42 @en
scope note: Esta clase comprende: - la fabricación de agentes tensoactivos orgánicos - la fabricación de papel, guata, fieltro, etc., revestidos o recubiertos con jabón o detergente - la fabricación de glicerina bruta - la fabricación de jabón, excepto jabón cosmético - la fabricación de preparados tensoactivos: • polvos para lavar y detergentes en forma sólida o líquida • preparados para lavavajillas • suavizantes de tejidos - la fabricación de productos de limpieza y de abrillantamiento: • preparados para perfumar y desodorizar locales • ceras artificiales y ceras preparadas • lustres y cremas para cuero • lustres y cremas para madera • lustres para carrocerías de automóviles, cristales y metales • polvos o pastas de limpieza, incluidos papel, guata, etc revestidos o recubiertos con estos productos Esta clase no comprende: - la fabricación de compuestos separados definidos químicamente (véanse 20.13 y 20.14) - la fabricación de glicerol sintetizado a partir de productos del petróleo (véase 20.14) - la fabricación de jabón cosmético (véase 20.42) @es
scope note: Cette classe comprend: - la fabrication d’agents de surface organiques - la fabrication de papier, d’ouate, de feutre, etc., enduit ou recouvert de savon ou de détergent - la fabrication de glycérine - la fabrication de savon, à l’exception du savon cosmétique - la fabrication de préparations tensioactives: • poudres pour lessives, sous formes solides ou liquides, et détergents • préparations pour la vaisselle • adoucissants pour textiles - la fabrication de produits d’entretien: • préparations pour parfumer ou désodoriser les locaux • cires artificielles et cires préparées • cirages et crèmes pour le cuir • cires et encaustiques pour l’entretien du bois • brillants pour les carrosseries, le verre et les métaux • pâtes et poudres à récurer, y compris les articles en papier, ouate, feutre, etc., enduits ou recouverts de celles-ci Cette classe ne comprend pas: - la fabrication d’éléments chimiques distincts ou de composés chimiquement définis, voir 20.13 et 20.14 - la fabrication de glycérine synthétique obtenue à partir de produits pétroliers, voir 20.14 - la fabrication de savon cosmétique, voir 20.42 @fr
scope note: Ovaj razred uključuje: - proizvodnju organskih površinski aktivnih tvari - proizvodnju papira, vate, filca itd., presvučenih ili prekrivenih sapunom ili deterdžentom - proizvodnju sirovoga glicerola - proizvodnju sapuna, osim kozmetičkog sapuna - proizvodnju površinski aktivnih preparata: • prašaka za pranje, čvrstih ili tekućih te deterdženata • prašaka za pranje posuđa • omekšivača za tekstil - proizvodnju sredstava za čišćenje i poliranje: • sredstava za osvježivanje zraka u prostorijama • umjetnih voskova i preparata za bazi voskova • politura i krema za kožu • politura i krema za drvo • politura za karoserije, staklo i metal • pasta i praškova za ribanje, uključujući papir, vatu itd. kojima su presvučeni ili prekriveni Ovaj razred isključuje: - proizvodnju pojedinačnih, kemijski definiranih spojeva, vidi 20.13, 20.14 - proizvodnju glicerola sintetiziranoga iz naftnih proizvoda, vidi 20.14 - proizvodnju kozmetičkog sapuna, vidi 20.42
scope note: Į šią klasę įeina: - organinių aktyviųjų paviršiaus medžiagų gamyba - muilu ar valymo priemonėmis padengto ar prisotinto popieriaus, vatos, veltinio ir kt., gamyba - glicerolio gamyba - muilo, išskyrus kosmetinį, gamyba - aktyviųjų paviršiaus preparatų gamyba: • skystų ar kietų skalbimo miltelių ir ploviklių • indų plovimo preparatų • audinių minkštiklių - valiklių ir blizgiklių gamyba: • patalpų oro kvėpinimo preparatų arba gaiviklių • dirbtinių ir paruoštų vaškų • odos blizgiklių ir tepalų • medienos blizgiklių ir tepalų • kėbulų, stiklo ir metalo blizgiklių • šveitimo pastų ir miltelių, įskaitant jais padengtą ar prisotintą popierių, vatą ir kt. Į šią klasę neįeina: - atskirų, chemiškai apibrėžtų junginių gamyba, žr. 20.13, 20.14 - glicerolio, sintetinamo iš naftos produktų, gamyba, žr. 20.14 - kosmetinio muilo gamyba, žr. 20.42 @lt
scope note: Этот класс включает: - производство взрывчатых порошков - производство взрывчатых и пиротехнических веществ, включая взрыватели, детонаторы, сигнальные ракеты и т.д. Этот класс также включает: - производство спичек @ru
scope note: Bu sınıf aşağıdakileri kapsamaktadır; - organik yüzey-aktif maddelerin imalatı, - sabunlu veya deterjanlı kağıt, vatka, keçe vb. imalatı, - gliserin imalatı, - sabun imalatı (kozmetik sabunlar hariç), - yüzey-aktif müstahzarların imalatı: • katı veya sıvı biçimdeki çamaşır tozları ve deterjanlar, • bulaşık temizleme ürünleri, • tekstil yumuşatıcıları (çamaşır yumuşatıcıları dahil). - temizleyici ve parlatıcı ürünlerin imalatı: • oda parfümleri veya deodorantlar, • suni cilalar ve hazır cilalar, • deri parlatıcıları ve kremleri (ayakkabı boyaları dahil), • ahşap parlatıcıları ve kremleri, • araç, cam ve metaller için parlatıcılar, • temizleme pastaları ve tozları (bunlarla kaplanmış veya emdirilmiş kağıt, vatka vb. ürünler dahil) Kapsam dışı olanlar; - kimyasal olarak tanımlanabilen bileşiklerin ayrıştırılması, bkz. 20.13, 20.14, - petrol ürünlerinden sentezlenmiş gliserin imalatı, bkz. 20.14, - kozmetik sabun imalatı, bkz. 20.42. @tr
preferred label: Производство на сапун, миещи, почистващи и полиращи препарати @bg
preferred label: Výroba mýdel, detergentů a čisticích a lešticích prostředků @cs
preferred label: Fremstilling af sæbe, rengørings- og rensemidler samt poleremidler @da
preferred label: Herstellung von Seifen, Wasch-, Reinigungs- und Poliermitteln @de
preferred label: Παραγωγή σαπουνιών και απορρυπαντικών, προϊόντων καθαρισμού και στίλβωσης @el
preferred label: Fabricación de jabones, detergentes y otros artículos de limpieza y abrillantamiento @es
preferred label: Seebi, pesemis-, puhastus- ja poleervahendite tootmine @et
preferred label: Saippuan, pesu-, puhdistus- ja kiillotusaineiden valmistus @fi
preferred label: Fabrication de savons, détergents et produits d'entretien @fr
preferred label: Tisztítószer gyártása
preferred label: Fabbricazione di saponi e detergenti, di prodotti per la pulizia e la lucidatura @it
preferred label: Muilo ir ploviklių, valiklių ir blizgiklių gamyba @lt
preferred label: Ziepju, mazgāšanas, tīrīšanas un spodrināšanas līdzekļu ražošana @lv
preferred label: Manifattura ta' sapun u deterġenti, sustanzi għat-tindif u l-illustrar @mt
preferred label: Vervaardiging van zeep en wasmiddelen, poets- en reinigingsmiddelen @nl
preferred label: Produksjon av såpe og vaskemidler, rense- og polermidler @no
preferred label: Produkcja mydła i detergentów, środków myjących i czyszczących @pl
preferred label: Fabricação de sabões e detergentes, produtos de limpeza e de polimento @pt
preferred label: Fabricarea săpunurilor, detergenţilor şi a produselor de întreţinere @ro
preferred label: Производство мыла и моющих средств, чистящих и полирующих препаратов @ru
preferred label: Výroba mydla a pracích prostriedkov, čistiacich a leštiacich prípravkov @sk
preferred label: Proizvodnja mil in pralnih sredstev, čistilnih in polirnih sredstev @sl
preferred label: Tillverkning av tvål, såpa, tvättmedel och polermedel @sv
preferred label: Sabun ve deterjan ile temizlik ve parlatıcı maddeler imalatı @tr
broader: Manufacture of soap and detergents, cleaning and polishing preparations, perfumes and toilet preparations

Manufacture of perfumes and toilet preparations
type: Concept
notation: 20.42
status: valid
status modified: 2013-10-18
accepted date: 2013-10-18
in scheme: Statistical Classification of Economic Activities in the European Community, Rev. 2 (2008)
scope note: - производство на парфюми и тоалетни продукти: • парфюми и тоалетни води • козметични препарати за поддържане на кожата или за гримиране • препарати за предпазване от слънцето и за получаване на слънчев загар • препарати за маникюр или педикюр • шампоани и лакове за коса, препарати за трайно къдрене и изправяне на косата • препарати за поддържане на хигиена на устната кухина или зъбите, вкл. прахове и пасти, за улесняване прилепването на зъбните протези • препарати, използвани преди, по време или след бръснене • дезодоранти за тяло и парфюмирани соли за баня • депилатори - производство на тоалетен и козметичен сапун - производство на етерични масла - 20.53 @bg
scope note: Z: - výrobu prostředků pro osobní hygienu a parfémů a toaletních vod • parfémů a toaletních vod • kosmetiky • ochranných a tónovacích přípravků na opalování • přípravků na manikúru a pedikúru • šamponů, laků na vlasy, přípravků pro trvalou ondulaci a tužidel a pomád na vlasy • přípravků pro ústní hygienu včetně dentálních fixačních přípravků • přípravků na holení, včetně přípravků používaných před holením a po holení • deodorantů a koupacích solí • depilačních přípravků - výrobu toaletních mýdel N: - výrobu přírodních esenciálních olejů (20.53) @cs
scope note: Diese Klasse umfasst: - Herstellung von Körperpflegemitteln und Duftstoffen • Parfüms und Eau de Toilette • Kosmetika • Sonnenschutz- und Bräunungsmittel • Hand- und Fußpflegemittel • Haarwaschmittel, Haarlacke, Dauerwell- und Entkrausungsmittel • Zahnputz- und Mundpflegemittel einschließlich Haftmittel für Zahnprothesen • zubereitete Rasiermittel, einschließlich Zubereitungen für den Gebrauch vor oder nach der Rasur • Deodorants und Badesalze • Enthaarungsmittel - Herstellung von Seifen zur Körperpflege Diese Klasse umfasst nicht: - Herstellung von natürlichen etherischen Ölen (s. 20.53) @de
scope note: This class includes: - manufacture of perfumes and toilet preparations: • perfumes and toilet water • beauty and make-up preparations • sunburn prevention and suntan preparations • manicure and pedicure preparations • shampoos, hair lacquers, waving and straightening preparations • dentifrices and preparations for oral hygiene, including denture fixative preparations • shaving preparations, including pre-shave and aftershave preparations • deodorants and bath salts • depilatories - manufacture of cosmetic soap This class excludes: - extraction and refining of natural essential oils, see 20.53 @en
scope note: Esta clase comprende: - la fabricación de perfumes y cosméticos: • perfumes y agua de tocador • productos de belleza y de maquillaje • productos para el bronceado y la prevención de las quemaduras de sol • preparados para manicura o pedicura • champús, lacas para el pelo, preparados para el rizado y el alisado • dentífricos y preparados para la higiene bucal, incluidos los preparados para la fijación de dentaduras postizas • preparados para el afeitado, incluidos los preparados para antes y después del afeitado • desodorantes y sales de baño • productos para la depilación - la fabricación de jabón cosmético Esta clase no comprende: - la extracción y refinado de aceites esenciales naturales (véase 20.53) @es
scope note: Cette classe comprend: - la fabrication de parfums et de produits pour la toilette: • parfums et eaux de toilette • produits de beauté ou de maquillage • préparations de protection solaire et pour le bronzage • préparations pour manucures et pédicures • shampooings, laques pour cheveux, préparations pour l’ondulation ou le défrisage des cheveux • dentifrices et produits pour l’hygiène buccale, y compris les préparations destinées à faciliter l’adhérence des dentiers • préparations pour le rasage, y compris les préparations pour le prérasage et l’après-rasage • désodorisants et sels pour le bain • dépilatoires - la fabrication de savon cosmétique Cette classe ne comprend pas: - l’extraction et le raffinage des huiles essentielles naturelles, voir 20.53 @fr
scope note: Ovaj razred uključuje: - proizvodnju parfema i toaletno-kozmetičkih preparata: • parfema i toaletne vode • preparata za uljepšavanje i šminkanje • preparata za sunčanje i zaštitu od sunca • preparata za manikuru i pedikuru • šampona, lakova za kosu, preparata za kovrčanje i ravnanje kose • zubnih pasta i preparata za oralnu higijenu, uključujući preparate za učvršćivanje zubala • preparata za brijanje, uključujući preparate za prije i poslije brijanja • dezodorana i soli za kupanje • depilanata - proizvodnju kozmetičkih sapuna Ovaj razred isključuje: - vađenje i rafiniranje prirodnih eteričnih ulja, vidi 20.53
scope note: Į šią klasę įeina: - kvepalų ir tualetinių priemonių gamyba: • kvepalų ir tualetinio vandens • kosmetikos ir makiažo preparatų • apsaugančių nuo saulės nudegimo preparatų ir įdegio preparatų • manikiūro ir pedikiūro preparatų, • šampūnų, plaukų lako, plaukų garbanojimo ar ištiesinimo preparatų • dantų ir burnos ertmės higienos preparatų, įskaitant dantų protezų įtvirtinimo preparatus • skutimosi preparatų, įskaitant prieš skutimąsi ir po skutimosi vartojamus preparatus • dezodorantų ir vonios druskų • plaukų pašalinimo priemonių (depiliatorių) - kosmetinio muilo gamyba Į šią klasę neįeina: - natūralių eterinių aliejų gavyba ir rafinavimas, žr. 20.53 @lt
scope note: Этот класс включает: - производство клеев и готовых клеящих составов, включая резиновый клей и готовые клеящие составы Этот класс исключает: - производство желатина и продукции на его основе, см. 20.59 @ru
scope note: Bu sınıf aşağıdakileri kapsamaktadır; - parfüm ve bakım malzemelerinin imalatı: • parfüm ve eau de toilet (losyon ve kolonya dahil), • güzellik ve makyaj malzemeleri, • güneş koruyucuları ve bronzlaştırıcı ürünler, • manikür ve pedikür malzemeleri, • şampuanlar, briyantinler (saç parlatıcılar), saç dalgalandırıcı ve düzleştirici malzemeler, • diş macunu veya tozu ve ağız temizliği için malzemeler(protez korunmasında kullanılan malzemeler dahil), • tıraş malzemeleri ( tıraş öncesinde ve tıraş sonrasında kullanılan malzemeler dahil), • deodorantlar ve banyo tuzları, • tüy dökücü malzemeler, • kozmetik sabun imalatı. Kapsam dışı olanlar; - doğal esansların çıkartılması ve rafine edilmesi, bkz. 20.53. @tr
preferred label: Производство на парфюми и тоалетни продукти @bg
preferred label: Výroba parfémů a toaletních přípravků @cs
preferred label: Fremstilling af parfume, hårshampoo, tandpasta mv. @da
preferred label: Herstellung von Körperpflegemitteln und Duftstoffen @de
preferred label: Παραγωγή αρωμάτων και παρασκευασμάτων καλλωπισμού @el
preferred label: Fabricación de perfumes y cosméticos @es
preferred label: Parfüümide ja tualetitarvete tootmine @et
preferred label: Hajuvesien ja hygieniatuotteiden valmistus @fi
preferred label: Fabrication de parfums et de produits pour la toilette @fr
preferred label: Testápolási cikk gyártása
preferred label: Fabbricazione di profumi e cosmetici @it
preferred label: Kvepalų ir tualeto priemonių gamyba @lt
preferred label: Smaržu un kosmētisko līdzekļu ražošana @lv
preferred label: Manifattura ta' fwejjaħ u preparazzjonijiet tat-twaletta @mt
preferred label: Vervaardiging van parfums en toiletartikelen @nl
preferred label: Produksjon av parfyme og toalettartikler @no
preferred label: Produkcja wyrobów kosmetycznych i toaletowych @pl
preferred label: Fabricação de perfumes, de cosméticos e de produtos de higiene @pt
preferred label: Fabricarea parfumurilor şi a produselor cosmetice (de toaletă) @ro
preferred label: Производство парфюмерных и косметических средств @ru
preferred label: Výroba parfumérskych a toaletných prípravkov @sk
preferred label: Proizvodnja parfumov in toaletnih sredstev @sl
preferred label: Tillverkning av parfymer och toalettartiklar @sv
preferred label: Parfüm, kozmetik ve bakım malzemelerinin imalatı @tr
broader: Manufacture of soap and detergents, cleaning and polishing preparations, perfumes and toilet preparations

Manufacture of other chemical products
type: Concept
notation: 20.5
status: valid
status modified: 2013-10-18
accepted date: 2013-10-18
in scheme: Statistical Classification of Economic Activities in the European Community, Rev. 2 (2008)
scope note: Производство на експлозиви и пиротехнически изделия, лепила, етерични масла и химически продукти, некласифицирани другаде, например фотографски химични материали (вкл. филми и светлочувствителна хартия), сложни диагностични препарати и други. @bg
scope note: Tato skupina zahrnuje výrobu výbušnin a pyrotechnických výrobků, klihů, esenciálních olejů a ostatních chemických výrobků, např. chemických materiálů pro fotografické účely (včetně filmů a citlivých papírů), složených diagnostických reagencií atd. @cs
scope note: Diese Gruppe umfasst die Herstellung von Sprengstoffen und pyrotechnischen Erzeugnissen, Leimen, etherischen Ölen und sonstigen chemischen Erzeugnissen, z. B. fotochemischen Erzeugnissen (einschließlich Filme und lichtempfindlichen Papiers), zusammengesetzte Diagnostikreagenzien usw. @de
scope note: This group includes the manufacture of explosives and pyrotechnic products, glues, essential oils and chemical products n.e.c., e.g. photographic chemical material (including film and sensitised paper), composite diagnostic preparations etc. @en
scope note: Este grupo comprende la fabricación de explosivos y productos pirotécnicos, colas, aceites esenciales y productos químicos diversos n.c.o.p., como el material fotográfico virgen y los preparados químicos para fotografía (incluidos las películas y el papel sensibilizado), los preparados compuestos para diagnóstico, etc. @es
scope note: Ce groupe comprend la fabrication d’explosifs et d’articles de pyrotechnie, de colles, d’huiles essentielles et de produits chimiques non classés ailleurs, comme les produits chimiques pour la photographie (y compris les films photographiques et les papiers sensibilisés), les réactifs composés de diagnostic, etc. @fr
scope note: Ova skupina uključuje proizvodnju eksplozivnih i pirotehničkih sredstava, ljepila, eteričnih ulja i ostalih kemijskih proizvoda koji se koriste pri izradi fotografija (uključujući filmove i papire osjetljive na svjetlo), želatine te kompozitne dijagnostike.
scope note: Į šią grupę įeina sprogiųjų ir pirotechnikos priemonių, klijų, eterinio aliejaus ir kitų, niekur kitur nepriskirtų, chemijos produktų, pvz., cheminių fotografavimo medžiagų, įskaitant juostas ir jautrintą popierių, sudėtinių diagnostinių preparatų ir kt., gamyba. @lt
scope note: Этот класс включает: - производство экстрактов из природных ароматических продуктов - производство смолистых веществ - производство ароматизированных смесей для производства духов или продуктов питания Этот класс исключает: - производство синтетических ароматических продуктов, см. 20.14 - производство парфюмерных и косметических средств, см. 20.42 @ru
scope note: Bu grup, patlayıcıların, piroteknik (havai fişekler vb.) ürünlerinin, yapıştırıcıların, uçucu yağların ve fotoğrafçılıkta kullanılan kimyasal malzemeler (film ve fotoğraf kağıdı da dahil), teşhis malzemeleri gibi başka yerde sınıflandırılmamış kimyasal maddelerin imalatını kapsamaktadır. @tr
preferred label: Производство на други химични продукти @bg
preferred label: Výroba ostatních chemických výrobků @cs
preferred label: Fremstilling af andre kemiske produkter @da
preferred label: Herstellung von sonstigen chemischen Erzeugnissen @de
preferred label: Παραγωγή άλλων χημικών προϊόντων @el
preferred label: Fabricación de otros productos químicos @es
preferred label: Muude keemiatoodete tootmine @et
preferred label: Muiden kemiallisten tuotteiden valmistus @fi
preferred label: Fabrication d'autres produits chimiques @fr
preferred label: Egyéb vegyi termék gyártása
preferred label: Fabbricazione di altri prodotti chimici @it
preferred label: Kitų cheminių medžiagų gamyba @lt
preferred label: Pārējo ķīmisko vielu ražošana @lv
preferred label: Manifattura ta' prodotti kimiċi oħra @mt
preferred label: Vervaardiging van andere chemische producten @nl
preferred label: Produksjon av andre kjemiske produkter @no
preferred label: Produkcja pozostałych wyrobów chemicznych @pl
preferred label: Fabricação de outros produtos químicos @pt
preferred label: Fabricarea altor produse chimice @ro
preferred label: Производство прочих химических продуктов @ru
preferred label: Výroba ostatných chemických prípravkov @sk
preferred label: Proizvodnja razstreliv, lepil, eteričnih olj in drugih kemičnih izdelkov @sl
preferred label: Tillverkning av andra kemiska produkter @sv
preferred label: Diğer kimyasal ürünlerin imalatı @tr
broader: Manufacture of chemicals and chemical products
narrower: Manufacture of explosives
narrower: Manufacture of glues
narrower: Manufacture of essential oils
narrower: Manufacture of other chemical products n.e.c.

Manufacture of explosives
type: Concept
notation: 20.51
status: valid
status modified: 2013-10-18
accepted date: 2013-10-18
in scheme: Statistical Classification of Economic Activities in the European Community, Rev. 2 (2008)
scope note: - производство на барути - производство на експлозиви и пиротехнически изделия, вкл. ударни и детониращи капсули, сигнални ракети и други - производство на кибрити @bg
scope note: Z: - výrobu střelného prachu - výrobu výbušnin/trhavin a pyrotechnických výrobků, nárazníkových zápalek, rozbušek a světlic ZT: - výrobu zápalek @cs
scope note: Diese Klasse umfasst: - Herstellung von Schießpulver - Herstellung von Sprengstoffen und pyrotechnischen Erzeugnissen, Sprengkapseln, Sprengzündern und Leuchtkugeln Diese Klasse umfasst ferner: - Herstellung von Streichhölzern @de
scope note: This class includes: - manufacture of propellant powders - manufacture of explosives and pyrotechnic products, including percussion caps, detonators, signalling flares etc. This class also includes: - manufacture of matches @en
scope note: Esta clase comprende: - la fabricación de pólvoras de proyección - la fabricación de explosivos y productos pirotécnicos, incluidos cebos y cápsulas fulminantes, detonadores, cohetes de señales, etc. Esta clase comprende también: - la fabricación de cerillas @es
scope note: Cette classe comprend: - la fabrication de poudres propulsives - la fabrication d’explosifs et d’articles de pyrotechnie, y compris les capsules, les détonateurs, les fusées de signalisation, etc. Cette classe comprend également: - la fabrication d’allumettes @fr
scope note: Ovaj razred uključuje: - proizvodnju propulzivnih prašaka - proizvodnju eksploziva i pirotehničkih sredstava, uključujući upozoravajuće kapsule, detonatore, signalne rakete itd. Ovaj razred također uključuje: - proizvodnju šibica
scope note: Į šią klasę įeina: - šovininio parako gamyba - sprogiųjų ir pirotechnikos priemonių, įskaitant smūginius sprogdiklius, detonatorius, signalines raketas ir kt., gamyba Į šią klasę įeina: - degtukų gamyba @lt
scope note: Этот класс включает: - производство фотографических пластин, фотопленки, бумаги для печати фотографий и прочих материалов для проявки фотографий - производство химических препаратов для использования в фотографии - производство желатина и продукции на его основе - производство различных химических продуктов: • пептонов, продуктов вторичной обработки пептонов, прочих белковых веществ и продуктов их вторичной обработки, не включенных в другие категории • химически модифицированных масел и жиров • материалов, используемых для окончательной обработки текстильных изделий и кожи • порошков и паст, используемые при пайке, пайке с твердым припоем или сварке • веществ, используемых в обработке металлов • готовых добавок для изготовления цемента • активированного угля, присадок для смазочных масел, готовых резиновых катализаторов и прочей химической продукции для использования в промышленности • антидетонаторных препаратов, антифриза • жидких минералов для использования при гидравлической трансмиссии • диагностических или лабораторных реагентов Этот класс также включает: - производство чернил и туши Этот класс исключает: - массовое производство продуктов с определенным химическим составом, см. 20.13, 20.14 - производство дистиллированной воды, 20.13 - производство прочих основных органических химических веществ, см. 20.14 - производство типографской краски, см. 20.30 - производство клеящих веществ на асфальтовой основе, см. 23.99 @ru
scope note: Bu sınıf aşağıdakileri kapsamaktadır; -itici tozların (barut vb.) imalatı, -patlayıcılar ve piroteknik (havai fişekler vb.) ürünlerin imalatı, fişek kapsülü, fünye, işaret fişekleri ve benzerleri dahil Ayrıca bu sınıf aşağıdakileri de kapsamaktadır; - kibrit imalatı. @tr
preferred label: Производство на експлозиви @bg
preferred label: Výroba výbušnin @cs
preferred label: Fremstilling af sprængstoffer @da
preferred label: Herstellung von pyrotechnischen Erzeugnissen @de
preferred label: Παραγωγή εκρηκτικών @el
preferred label: Fabricación de explosivos @es
preferred label: Lõhkeaine tootmine @et
preferred label: Räjähdysaineiden valmistus @fi
preferred label: Fabrication de produits explosifs @fr
preferred label: Robbanóanyag gyártása
preferred label: Fabbricazione di esplosivi @it
preferred label: Sprogiųjų medžiagų gamyba @lt
preferred label: Sprāgstvielu ražošana @lv
preferred label: Manifattura ta' splussivi @mt
preferred label: Vervaardiging van kruit en springstoffen @nl
preferred label: Produksjon av eksplosiver @no
preferred label: Produkcja materiałów wybuchowych @pl
preferred label: Fabricação de explosivos e artigos de pirotecnia @pt
preferred label: Fabricarea explozivilor @ro
preferred label: Производство взрывчатых веществ @ru
preferred label: Výroba výbušnín @sk
preferred label: Proizvodnja razstreliv @sl
preferred label: Sprängämnestillverkning @sv
preferred label: Patlayıcı madde imalatı @tr
broader: Manufacture of other chemical products

Manufacture of glues
type: Concept
notation: 20.52
status: valid
status modified: 2013-10-18
accepted date: 2013-10-18
in scheme: Statistical Classification of Economic Activities in the European Community, Rev. 2 (2008)
scope note: - производство лепила и други продукти за лепене, вкл. на каучукова или пластмасова основа - производство на желатини и техните производни - 20.59 @bg
scope note: Z: - výrobu klihů a připravených lepidel včetně lepidel na bázi kaučuku N: - výrobu želatiny a jejích derivátů (20.59) @cs
scope note: Diese Klasse umfasst: - Herstellung von Leimen und zubereiteten Klebstoffen, einschließlich Klebstoffen auf Gummibasis Diese Klasse umfasst nicht: - Herstellung von Gelatinen und ihren Derivaten (s. 20.59) @de
scope note: This class includes: - manufacture of glues and prepared adhesives, including rubber-based glues and adhesives This class excludes: - manufacture of gelatines and its derivates, see 20.59 @en
scope note: Esta clase comprende: - la fabricación de colas y adhesivos preparados, incluidos las colas y adhesivos a base de caucho Esta clase no comprende: - la fabricación de gelatinas y sus derivados (véase 20.59) @es
scope note: Cette classe comprend: - la fabrication de colles et d’adhésifs préparés, y compris les colles et les adhésifs à base de caoutchouc Cette classe ne comprend pas: - la fabrication de gélatines et de leurs dérivés, voir 20.59 @fr
scope note: Ovaj razred uključuje: - proizvodnju ljepila i ljepljivih pripravaka, uključujući ljepila i ljepljive pripravke na bazi kaučuka Ovaj razred isključuje: - proizvodnju želatine i njezinih derivata, vidi 20.59
scope note: Į šią klasę įeina: - klijų ir paruoštų lipdžių, įskaitant klijus ir lipdes gumos pagrindu, gamyba Į šią klasę neįeina: - želatinos ir jos darinių gamyba, žr. 20.59 @lt
scope note: Bu sınıf aşağıdakileri kapsamaktadır; - tutkal ve hazır yapıştırıcıların imalatı, (tutkal ve kauçuk bazlı yapıştırıcılar dahil), Kapsam dışı olanlar; - jelatin ve türevlerinin imalatı, bkz. 20.59. @tr
preferred label: Производство на лепила @bg
preferred label: Výroba klihů @cs
preferred label: Fremstilling af lim @da
preferred label: Herstellung von Klebstoffen @de
preferred label: Παραγωγή διαφόρων τύπων κόλλας @el
preferred label: Fabricación de colas @es
preferred label: Liimitootmine @et
preferred label: Liimojen valmistus @fi
preferred label: Fabrication de colles @fr
preferred label: Ragasztószergyártás
preferred label: Fabbricazione di colle @it
preferred label: Klijų gamyba @lt
preferred label: Līmju ražošana @lv
preferred label: Manifattura ta' kolol @mt
preferred label: Vervaardiging van lijm @nl
preferred label: Produksjon av lim @no
preferred label: Produkcja klejów @pl
preferred label: Fabricação de colas @pt
preferred label: Fabricarea cleiurilor @ro
preferred label: Производство клея @ru
preferred label: Výroba lepidiel @sk
preferred label: Proizvodnja sredstev za lepljenje @sl
preferred label: Tillverkning av lim @sv
preferred label: Tutkal imalatı @tr
broader: Manufacture of other chemical products

Manufacture of essential oils
type: Concept
notation: 20.53
status: valid
status modified: 2013-10-18
accepted date: 2013-10-18
in scheme: Statistical Classification of Economic Activities in the European Community, Rev. 2 (2008)
scope note: - производство на екстракти от естествени ароматни продукти - производство на резиноиди - производство на смеси от ароматизиращи субстанции за производството на парфюми или за хранително-вкусовата промишленост - производство на ароматични дестилирани води - производство на синтетични ароматни продукти - 20.14 - производство на парфюми и тоалетни продукти - 20.42 @bg
scope note: Z: - výrobu extraktů z přírodních aromatických látek - výrobu resinoid - výrobu aromatických látek pro výrobu parfémů a potravin N: - výrobu syntetických aromatických přípravků (20.14) - výrobu prostředků pro osobní hygienu a parfémů a toaletních vod (20.42) @cs
scope note: Diese Klasse umfasst: - Herstellung von Auszügen aus natürlichen Aromen - Herstellung von Resinoiden - Herstellung von Riechstoffmischungen für die Parfüm- und Lebensmittelherstellung Diese Klasse umfasst nicht: - Herstellung von synthetischen Aromen (s. 20.14) - Herstellung von Körperpflegemitteln und Duftstoffen (s. 20.42) @de
scope note: This class includes: - manufacture of extracts of natural aromatic products - manufacture of resinoids - manufacture of mixtures of odoriferous products for the manufacture of perfumes or food This class excludes: - manufacture of synthetic aromatic products, see 20.14 - manufacture of perfumes and toilet preparations, see 20.42 @en
scope note: Esta clase comprende: - la fabricación de extractos de productos aromáticos naturales - la fabricación de resinoides - la fabricación de mezclas de productos aromáticos para la elaboración de perfumes o alimentos Esta clase no comprende: - la fabricación de productos aromáticos sintéticos (véase 20.14) - la fabricación de perfumes y productos de belleza e higiene personal (véase 20.42) @es
scope note: Cette classe comprend: - la fabrication d’essences de produits aromatiques naturels - la fabrication de résinoïdes - la fabrication de compositions à base de produits odoriférants pour la parfumerie ou l’alimentation Cette classe ne comprend pas: - la fabrication de produits aromatiques synthétiques, voir 20.14 - la fabrication de parfums et de produits pour la toilette, voir 20.42 @fr
scope note: Ovaj razred uključuje: - proizvodnju ekstrakata na bazi prirodnih mirisnih proizvoda - proizvodnju rezinoida - proizvodnju mješavina mirisnih tvari za proizvodnju parfema ili hrane Ovaj razred isključuje: - proizvodnju sintetičkih mirisnih proizvoda, vidi 20.14 - proizvodnju parfema i toaletno-kozmetičkih preparata, vidi 20.42
scope note: Į šią klasę įeina: - natūralių aromatinių produktų ekstraktų gamyba - kvapiųjų dervų gamyba - kvepalų ar maisto produktų gamyboje naudojamų kvapiųjų medžiagų mišinių gamyba Į šią klasę neįeina: - sintetinių aromatinių produktų gamyba, žr. 20.14 - kvepalų ir tualetinių priemonių gamyba, žr. 20.42 @lt
scope note: Этот класс включает: - производство синтетических или искусственных ниток - производство синтетических или искусственных волокон, не расчесанных, комбинированных или не подготовленных для скручивания - производство синтетической или искусственной пряжи, включая высокопрочную пряжу - производство синтетических или искусственных лент Этот класс исключает: - скручивание синтетических или искусственных ниток, см. 13.10 - производство искусственной штапельной пряжи, см. 13.10 @ru
scope note: Bu sınıf aşağıdakileri kapsamaktadır; - doğal aromatik ürün özlerinin imalatı, - suni reçine imalatı, - parfümeri ya da gıda imalatı için güzel kokulu ürünlerin karışımlarının imalatı. Kapsam dışı olanlar; - sentetik aromatik ürünlerin imalatı, bkz. 20.14, - parfümeri ve bakım malzemeleri imalatı, bkz. 20.42. @tr
preferred label: Производство на етерични масла @bg
preferred label: Výroba vonných silic @cs
preferred label: Fremstilling af æteriske olier @da
preferred label: Herstellung von etherischen Ölen @de
preferred label: Παραγωγή αιθέριων ελαίων @el
preferred label: Fabricación de aceites esenciales @es
preferred label: Eeterlike õlide tootmine @et
preferred label: Eteeristen öljyjen valmistus @fi
preferred label: Fabrication d'huiles essentielles @fr
preferred label: Illóolajgyártás
preferred label: Fabbricazione di oli essenziali @it
preferred label: Eterinio aliejaus gamyba @lt
preferred label: Ēterisko eļļu ražošana @lv
preferred label: Manifattura ta' żjut essenzjali @mt
preferred label: Vervaardiging van etherische oliën @nl
preferred label: Produksjon av eteriske oljer @no
preferred label: Produkcja olejków eterycznych @pl
preferred label: Fabricação de óleos essenciais @pt
preferred label: Fabricarea uleiurilor esenţiale @ro
preferred label: Производство эфирных масел @ru
preferred label: Výroba éterických olejov @sk
preferred label: Proizvodnja eteričnih olj @sl
preferred label: Tillverkning av eteriska oljor @sv
preferred label: Uçucu yağların imalatı @tr
broader: Manufacture of other chemical products

Manufacture of other chemical products n.e.c.
type: Concept
notation: 20.59
status: valid
status modified: 2013-10-18
accepted date: 2013-10-18
in scheme: Statistical Classification of Economic Activities in the European Community, Rev. 2 (2008)
scope note: - производство на фотографски плаки и филми, светлочувствителна хартия, други светлочувствителни неекспонирани материали - производство на химически препарати за фотографски цели - производство на желатини и техните производни - производство на различни химични продукти: • пептони и техните производни, други протеинови вещества и техните производни, некласифицирани другаде • химически модифицирани масла и мазнини • препарати, използвани за облагородяване на текстил и кожи • прахове и пасти, за заваряване или спояване • препарати за декапиране • готови добавки за цименти • активен въглен, добавки за смазочни масла, препарати наречени “ускорители на вулканизацията”, катализатори и други химични продукти за промишлена употреба • антидетонаторни препарати, антифризи • течности за хидравлични предавки • сложни диагностични или лабораторни реактиви - производство на мастило за писане и туш за чертане - производство на определени химични съединения - 20.13, 20.14 - производство на дестилирани води - 20.13 - производство на други основни химични вещества - 20.14 - производство на печатарско мастило - 20.30 - производство на свързващи вещества на основата на асфалт - 23.99 @bg
scope note: Z: - výrobu citlivých fotografických desek, filmů, citlivých papírů a ostatních citlivých neexponovaných materiálů - výrobu chemických přípravků pro fotografické použití - výrobu želatiny a jejích derivátů - výrobu různých chemických výrobků: • peptonů, jejich derivátů, ostatních bílkovin a jejich derivátů j. n. • chemicky transformovaných olejů a tuků • výrobků pro apretování textilu a usní • prášků a past používaných na pájení nebo sváření • pomocných přípravků pro potahování kovů • přídavných přípravků do cementu • aktivního uhlí, přísad do mazacích olejů, urychlovačů vulkanizace, katalyzátorů a ostatních chemických výrobků pro použití v průmyslu • přípravků proti klepání motoru, přípravků proti zamrzání a odmrazovače • převodové kapaliny • složených diagnostických a laboratorních reagencií ZT: - výrobu inkoustu a tuše N: - výrobu chemických výrobků jako hromadných materiálů (20.13, 20.14) - výrobu destilované vody (20.13) - výrobu ostatních základních organických chemických látek a chemikálií (20.14) - výrobu tiskařských barev (20.30) - výrobu lepidel na bázi živice (23.99) @cs
scope note: Diese Klasse umfasst: - Herstellung von lichtempfindlichen fotografischen Platten, Filmen, lichtempfindlichem Papier und sonstigem lichtempfindlichem unbelichtetem Filmmaterial - Herstellung von zubereiteten chemischen Erzeugnissen für fotografische Zwecke - Herstellung von Gelatine und ihren Derivaten - Herstellung von verschiedenen chemischen Erzeugnissen: • Peptone, ihre Derivate, sonstige Eiweißstoffe und ihre Derivate a. n. g. • chemisch modifizierte Öle und Fette • Erzeugnisse für die Textil- und Lederappretur • Pulver und Pasten zum Löten und Schweißen • Zubereitungen zum Abbeizen von Metallen • zubereitete Additive für Zement • Aktivkohle, Additive für Schmieröle, Vulkanisationsbeschleuniger, Katalysatoren und sonstige chemische Erzeugnisse für industrielle Verwendung • zubereitete Antiklopfmittel, Frostschutzmittel • Hydraulikflüssigkeiten • Mehrstufenreagenzien für Diagnose- und Laborzwecke Diese Klasse umfasst ferner: - Herstellung von Tinte und Tusche Diese Klasse umfasst nicht: - Herstellung von chemischen Erzeugnissen als Massengut (s. 20.13, 20.14) - Herstellung von destilliertem Wasser (s. 20.13) - Herstellung von sonstigen organischen Grundstoffen und Chemikalien (s. 20.14) - Herstellung von Druckfarben (s. 20.30) - Herstellung von Klebstoffen auf Bitumenbasis (s. 23.99) @de
scope note: This class includes: - manufacture of photographic plates, films, sensitised paper and other sensitised unexposed materials - manufacture of chemical preparations for photographic uses - manufacture of gelatine and its derivatives - manufacture of various chemical products: • peptones, peptone derivatives, other protein substances and their derivatives n.e.c. • chemically modified oils and fats • materials used in the finishing of textiles and leather • powders and pastes used in soldering, brazing or welding • substances used to pickle metal • prepared additives for cements • activated carbon, lubricating oil additives, prepared rubber accelerators, catalysts and other chemical products for industrial use • anti-knock preparations, antifreeze preparations • liquids for hydraulic transmission • composite diagnostic or laboratory reagents This class also includes: - manufacture of writing and drawing ink This class excludes: - manufacture of chemically defined products in bulk, see 20.13, 20.14 - manufacture of distilled water, 20.13 - manufacture of other organic basic chemicals, see 20.14 - manufacture of printing ink, see 20.30 - manufacture of asphalt-based adhesives, see 23.99 @en
scope note: Esta clase comprende: - la fabricación de placas fotográficas, películas, papel sensibilizado y otros materiales sensibilizados sin impresionar - la fabricación de preparados químicos para usos fotográficos - la fabricación de gelatina y sus derivados - la fabricación de diversos productos químicos: • peptonas y sus derivados, otras materias proteicas y sus derivados n.c.o.p. • aceites y grasas modificadas químicamente • materiales utilizados en el acabado de productos textiles y cuero • pastas y polvos para soldar • preparados para el decapado de metales • aditivos preparados para cementos • carbón activado, aditivos para aceites lubricantes, aceleradores de vulcanización, catalizadores y otros productos químicos de uso industrial • preparados antidetonantes, anticongelantes • líquidos para transmisión hidráulica • reactivos compuestos para diagnósticos y laboratorios Esta clase comprende también: - la fabricación de tintas para escribir y dibujar Esta clase no comprende: - la fabricación de productos definidos químicamente en bruto (véanse 20.13 y 20.14) - la fabricación de agua destilada (véase 20.13) - la fabricación de productos básicos de química orgánica (véase 20.14) - la fabricación de tintas de imprenta (véase 20.30) - la fabricación de adhesivos a base de asfalto (véase 23.99) @es
scope note: Cette classe comprend: - la fabrication de plaques et de films photographiques, de papiers sensibilisés et d’autres matières sensibilisées, non impressionnées - la fabrication de préparations chimiques à usage photographique - la fabrication de gélatine et de leurs dérivés - la fabrication de produits chimiques divers: • peptones et leurs dérivés, autres matières protéiques et leurs dérivés, n.c.a. • huiles et graisses modifiées par des procédés chimiques • produits utilisés pour l’apprêt ou le finissage des textiles et du cuir • pâtes et poudres à souder ou à braser • préparations pour le décapage des métaux • additifs préparés pour ciments • charbons activés, additifs pour huiles lubrifiantes, préparations dites "accélérateurs de vulcanisation", catalyseurs et autres produits chimiques à usage industriel • préparations antidétonantes, préparations antigel • liquides pour transmissions hydrauliques • réactifs composés de diagnostic ou de laboratoire Cette classe comprend également: - la fabrication d’encres à écrire et à dessiner Cette classe ne comprend pas: - la fabrication de composés chimiquement définis en gros, voir 20.13 et 20.14 - la fabrication d’eau distillée, voir 20.13 - la fabrication d’autres produits chimiques organiques de base, voir 20.14 - la fabrication d’encres d’imprimerie, voir 20.30 - la production d’adhésifs à base d’asphalte, voir 23.99 @fr
scope note: Ovaj razred uključuje: - proizvodnju fotografskih ploča, filmova, papira osjetljivoga na svjetlo i drugih neekspozitiranih materijala - proizvodnju kemijskih preparata za fotografsku upotrebu - proizvodnju želatine i njezinih derivata - proizvodnju različitih kemijskih proizvoda: • peptona i peptonskih derivata, ostalih proteinskih tvari i njihovih derivata, d. n. • kemijski modificiranih ulja i masti • materijala upotrijebljenoga za dovršavanje tekstila i kože • prašaka i pasta za lemljenje, brušenje i zavarivanje • sredstava za čišćenje metala • pripremljenih aditiva za cement • aktivnog ugljena, aditiva ulja za podmazivanje, pripremljenih akceleratora za gumu, katalizatora i drugih kemijskih proizvoda za industrijsku upotrebu • antidetonatorskih preparata, antifriz-preparata • tekućina za hidraulični prijenos • složenih reagensa za dijagnostiku i laboratorije Ovaj razred također uključuje: - proizvodnju tinte za pisanje i crtanje Ovaj razred isključuje: - proizvodnju kemijski definiranih proizvoda u masi, vidi 20.13, 20.14 - proizvodnju destilirane vode, vidi 20.13 - proizvodnju ostalih osnovnih organskih kemikalija, vidi 20.14 - proizvodnju tiskarske tinte, vidi 20.30 - proizvodnju ljepila baziranih na asfaltu, vidi 23.99
scope note: Į šią klasę įeina: - fotografinių plokštelių, kino juostų, jautrinto popieriaus ir kitų jautrintų neeksponuotų medžiagų gamyba - fotografijoms naudojamų cheminių preparatų gamyba - želatinos ir jos darinių gamyba - įvairių cheminių medžiagų gamyba: • peptonų, peptono darinių, kitų, niekur kitur nepriskirtų, baltyminių junginių ir jų darinių • chemiškai modifikuotų aliejų ir riebalų • audinių ir odos apdailos medžiagų • lydymo, litavimo ar suvirinimo miltelių ir pastų • metalų ėsdinimo medžiagų • paruoštų cemento priedų • aktyvintų anglių, tepalinių alyvų priedų, paruoštų kaučiuko vulkanizavimo greitiklių, katalizatorių ir kitų pramoninių cheminių medžiagų • antidetonatorių, antifrizinių preparatų • hidraulinių pavarų skysčių • sudėtinių diagnostinių ar laboratorinių reagentų Į šią klasę taip pat įeina: - rašalo ir tušo gamyba Į šią klasę neįeina: - nesupakuotų chemiškai apibrėžtų produktų gamyba, žr. 20.13, 20.14 - distiliuoto vandens gamyba, žr. 20.13 - kitų organinių bazinių chemikalų gamyba, žr. 20.14 - spaustuvinių dažų gamyba, žr. 20.30 - bituminių rišiklių gamyba, žr. 23.99 @lt
scope note: Данный раздел включает производство основных фармацевтических продуктов и фармацевтических препаратов. Данный раздел включает также производство медицинских и растительных препаратов. @ru
scope note: Bu sınıf aşağıdakileri kapsamaktadır; - fotografik levhalar, filmler, hassaslaştırılmış kağıt ve diğer hassaslaştırılmış pozsuz (boş) malzemelerin imalatı, - fotoğrafçılıkta kullanmak için kimyasal malzemelerin imalatı, - jelatin ve türevlerinin imalatı, - muhtelif kimyasal ürünlerin imalatı; • peptonlar, pepton türevleri, diğer protein maddeleri ve başka yerde sınıflandırılmamış türevleri, • kimyasal olarak dönüştürülmüş bitkisel ve hayvansal yağlar, • tekstil ürünlerinin ve derinin tamamlanmasında kullanılan maddeler, • lehim, kaplama veya kaynak yaparken kullanılan tozlar ve macunlar, • metalleri temizlemek (dekupajı için) kullanılan maddeler, • çimentolar için hazırlanmış katkı maddeleri, • endüstriyel kullanım için aktifleştirilmiş karbon, yağlama yağı katkı maddeleri, hazır kauçuk gaz pedalları, katalizörler ve diğer kimyasal ürünler, • vuruntu önleyici malzemeler, antifriz ürünleri , • hidrolik sıvılar (yağlar), • kompozit teşhis veya laboratuar kimyasalları. Ayrıca bu sınıf aşağıdakileri de kapsamaktadır; - yazım ve çizim mürekkep imalatı. Kapsam dışı olanlar; - kimyasal ürünlerin ambalajsız olarak imalatı, bkz. 20.13, 20.14, - damıtılmış su (saf su) imalatı, bkz. 20.13, - diğer temel organik kimyasalların imalatı, bkz. 20.14, - matbaa mürekkebi imalatı, bkz. 20.30, - asfalt-bazlı yapıştırıcıların imalatı, bkz. 23.99. @tr
preferred label: Производство на други химични продукти, некласифицирани другаде @bg
preferred label: Výroba ostatních chemických výrobků j. n. @cs
preferred label: Fremstilling af andre kemiske produkter i.a.n. @da
preferred label: Herstellung von sonstigen chemischen Erzeugnissen a. n. g. @de
preferred label: Παραγωγή άλλων χημικών προϊόντων π.δ.κ.α. @el
preferred label: Fabricación de otros productos químicos n.c.o.p. @es
preferred label: Mujal liigitamata keemiatoodete tootmine @et
preferred label: Muualla luokittelematon kemiallisten tuotteiden valmistus @fi
preferred label: Fabrication d'autres produits chimiques n.c.a. @fr
preferred label: M.n.s. egyéb vegyi termék gyártása
preferred label: Fabbricazione di altri prodotti chimici n.c.a. @it
preferred label: Kitų, niekur kitur nepriskirtų, cheminių medžiagų gamyba @lt
preferred label: Citur neklasificētu ķīmisko vielu ražošana @lv
preferred label: Manifattura ta' prodotti oħra kimiċi n.e.c. @mt
preferred label: Vervaardiging van andere chemische producten, n.e.g. @nl
preferred label: Produksjon av kjemiske produkter ikke nevnt annet sted @no
preferred label: Produkcja pozostałych wyrobów chemicznych, gdzie indziej niesklasyfikowana @pl
preferred label: Fabricação de outros produtos químicos, n.e. @pt
preferred label: Fabricarea altor produse chimice n.c.a. @ro
preferred label: Производство прочих химических продуктов, не включенных в другие категории @ru
preferred label: Výroba ostatných chemických výrobkov i. n. @sk
preferred label: Proizvodnja drugih kemičnih izdelkov @sl
preferred label: Tillverkning av andra kemiska produkter @sv
preferred label: Başka yerde sınıflandırılmamış diğer kimyasal ürünlerin imalatı @tr
broader: Manufacture of other chemical products

Manufacture of man-made fibres
type: Concept
notation: 20.6
status: valid
status modified: 2013-10-18
accepted date: 2013-10-18
in scheme: Statistical Classification of Economic Activities in the European Community, Rev. 2 (2008)
preferred label: Производство на изкуствени и синтетични влакна @bg
preferred label: Výroba chemických vláken @cs
preferred label: Fremstilling af kemofibre @da
preferred label: Herstellung von Chemiefasern @de
preferred label: Παραγωγή συνθετικών ινών @el
preferred label: Fabricación de fibras artificiales y sintéticas @es
preferred label: Keemilise kiu tootmine @et
preferred label: Tekokuitujen valmistus @fi
preferred label: Fabrication de fibres artificielles ou synthétiques @fr
preferred label: Vegyi szál gyártása
preferred label: Fabbricazione di fibre sintetiche e artificiali @it
preferred label: Cheminių pluoštų gamyba @lt
preferred label: Sintētisko šķiedru ražošana @lv
preferred label: Manifattura ta' fibri magħmula mill-bniedem @mt
preferred label: Vervaardiging van synthetische en kunstmatige vezels @nl
preferred label: Produksjon av kunstfibrer @no
preferred label: Produkcja włókien chemicznych @pl
preferred label: Fabricação de fibras sintéticas ou artificiais @pt
preferred label: Fabricarea fibrelor sintetice şi artificiale @ro
preferred label: Производство искусственных волокон @ru
preferred label: Výroba umelých vlákien @sk
preferred label: Proizvodnja umetnih vlaken @sl
preferred label: Konstfibertillverkning @sv
preferred label: Suni veya sentetik elyaf imalatı @tr
broader: Manufacture of chemicals and chemical products
narrower: Manufacture of man-made fibres

Manufacture of man-made fibres
type: Concept
notation: 20.60
status: valid
status modified: 2013-10-18
accepted date: 2013-10-18
in scheme: Statistical Classification of Economic Activities in the European Community, Rev. 2 (2008)
scope note: - производство на изкуствени или синтетични щапелни влакна, необработени за предене - производство на изкуствени или синтетични прежди, вкл. с висока здравина - производство на изкуствени и синтетични монофиламенти или ленти - предене на изкуствени или синтетични влакна - 13.10 - производство на прежди от изкуствени или синтетични влакна - 13.10 @bg
scope note: Z: - výrobu syntetických nebo umělých vláken - výrobu syntetických nebo umělých střižových vláken, nemykaných ani nečesaných ani jinak upravených pro spřádání - výrobu syntetických nebo umělých filamentových přízí včetně vysoce pevných přízí - výrobu syntetických nebo umělých monofilů nebo pruhů N: - spřádání syntetických nebo umělých vláken (13.10) - výrobu přízí ze syntetických nebo umělých textilních vláken (13.10) @cs
scope note: Diese Klasse umfasst: - Herstellung von synthetischen oder künstlichen Filamenten - Herstellung von synthetischen oder künstlichen Stapelfasern, weder gekrempelt noch gekämmt oder anderweitig für die Spinnerei bearbeitet - Herstellung von synthetischen oder künstlichen Filamentgarnen einschließlich hochfesten Garnen - Herstellung von synthetischen oder künstlichen Monofilamenten oder Streifen Diese Klasse umfasst nicht: - Spinnen von synthetischen oder künstlichen Garnen (s. 13.10) - Herstellung von Garnen aus synthetischen oder künstlichen Spinnfasern (s. 13.10) @de
scope note: This class includes: - manufacture of synthetic or artificial filament tow - manufacture of synthetic or artificial staple fibres, not carded, combed or otherwise processed for spinning - manufacture of synthetic or artificial filament yarn, including high-tenacity yarn - manufacture of synthetic or artificial monofilament or strip This class excludes: - spinning of synthetic or artificial fibres, see 13.10 - manufacture of yarns made of man-made staple, see 13.10 @en
scope note: Esta clase comprende: - la fabricación de cables de filamentos artificiales o sintéticos - la fabricación de fibras sintéticas o artificiales discontinuas, sin cardar, peinar ni tratadas de cualquier otra forma para su hilado - la fabricación de hilos de filamentos sintéticos o artificiales, incluido el hilo de alta tenacidad - la fabricación de monofilamentos o tiras, sintéticos o artificiales Esta clase no comprende: - el hilado de fibras sintéticas o artificiales (véase 13.10) - la fabricación de hilos a base de fibras artificiales discontinuas (véase 13.10) @es
scope note: Cette classe comprend: - la fabrication de câbles de filaments synthétiques ou artificiels - la fabrication de fibres synthétiques ou artificielles discontinues, non cardées, ni peignées, ni autrement transformées pour la filature - la fabrication de fils de filaments synthétiques ou artificiels, y compris les fils à haute ténacité - la fabrication de monofilaments synthétiques ou artificiels et de lames en matières textiles synthétiques ou artificielles Cette classe ne comprend pas: - la filature de fils synthétiques ou artificiels, voir 13.10 - la fabrication de fils de fibres synthétiques ou artificielles, voir 13.10 @fr
scope note: Ovaj razred uključuje: - proizvodnju sintetičkih i umjetnih dugih (nesječenih) filamenata - proizvodnju sintetičkih i umjetnih sječenih vlakana, koja nisu grebenana, češljana ili drugačije obrađena za predenje - proizvodnju sintetičkih i umjetnih filament-prediva, uključujući vrlo čvrsta ojačana prediva - proizvodnju sintetičkih i umjetnih monofilamenata ili uskih vrpci Ovaj razred isključuje: - predenje sintetičkih i umjetnih vlakana, vidi 13.10 - proizvodnju prediva izrađenoga od umjetnih vlakana, vidi 13.10
scope note: Į šią klasę įeina: - sintetinių arba dirbtinių gijų gniūžčių gamyba - nekarštų, nešukuotų ar kitaip prieš verpiant neapdirbtų sintetinių ar dirbtinių kuokštelinių pluoštų gamyba - sintetinių ar dirbtinių gijinių siūlų, įskaitant sustiprintus verpalus, gamyba - sintetinių ar dirbtinių vienagijų siūlų ar juostelių gamyba Į šią klasę neįeina: - sintetinių ar dirbtinių pluoštų verpimas, žr. 13.10 - cheminio pluošto verpalų gamyba žr. 13.10 @lt
scope note: Этот класс включает: - производство медицинских фармакологических препаратов, используемых для производства медикаментов: антибиотиков, основных витаминов, салициловой и O-ацетилсалициловой кислот и т.д. - переработку крови Этот класс также включает: - производство химически чистого сахара - переработку желез и производство экстрактов из желез и т.д. @ru
scope note: Bu sınıf aşağıdakileri kapsamaktadır; - suni veya sentetik filaman elyafı (fitil elyafı)imalatı, - kardelenmemiş, taranmamış veya diğer bir deyişle bükmek, eğirmek için işlenmemiş sentetik veya suni filaman imalatı, - suni veya sentetik tek kat iplik imalatı, yüksek dayanırlıktaki iplikler dahil, - suni veya sentetik tekli filaman veya şerit imalatı Kapsam dışı olanlar; - suni veya sentetik elyafların eğirilmesi, bkz. 13.10, - suni veya sentetik devamlı liflerden dikiş ipliği imalatı, bkz. 13.10. @tr
preferred label: Производство на изкуствени и синтетични влакна @bg
preferred label: Výroba chemických vláken @cs
preferred label: Fremstilling af kemofibre @da
preferred label: Herstellung von Chemiefasern @de
preferred label: Παραγωγή συνθετικών ινών @el
preferred label: Fabricación de fibras artificiales y sintéticas @es
preferred label: Keemilise kiu tootmine @et
preferred label: Tekokuitujen valmistus @fi
preferred label: Fabrication de fibres artificielles ou synthétiques @fr
preferred label: Vegyi szál gyártása
preferred label: Fabbricazione di fibre sintetiche e artificiali @it
preferred label: Cheminių pluoštų gamyba @lt
preferred label: Sintētisko šķiedru ražošana @lv
preferred label: Manifattura ta' fibri magħmula mill-bniedem @mt
preferred label: Vervaardiging van synthetische en kunstmatige vezels @nl
preferred label: Produksjon av kunstfibrer @no
preferred label: Produkcja włókien chemicznych @pl
preferred label: Fabricação de fibras sintéticas ou artificiais @pt
preferred label: Fabricarea fibrelor sintetice şi artificiale @ro
preferred label: Производство искусственных волокон @ru
preferred label: Výroba umelých vlákien @sk
preferred label: Proizvodnja umetnih vlaken @sl
preferred label: Konstfibertillverkning @sv
preferred label: Suni veya sentetik elyaf imalatı @tr
broader: Manufacture of man-made fibres

Manufacture of basic pharmaceutical products and pharmaceutical preparations
type: Concept
notation: 21
status: valid
status modified: 2013-10-18
accepted date: 2013-10-18
in scheme: Statistical Classification of Economic Activities in the European Community, Rev. 2 (2008)
scope note: производство на лекарствени вещества и продукти. Тук се включва още и производството на лекарствени вещества както с химически, така и с растителен произход. @bg
scope note: Tento oddíl zahrnuje výrobu základních látek pro farmaceutické přípravky a výrobu farmaceutických přípravků. Zahrnuje také výrobu léčiv chemického nebo botanického původu. @cs
scope note: Diese Abteilung umfasst die Herstellung von pharmazeutischen Grundstoffen und pharmazeutischen Spezialitäten. Sie beinhaltet auch die Herstellung von Arzneimitteln chemischen und botanischen Ursprungs. @de
scope note: This division includes the manufacture of basic pharmaceutical products and pharmaceutical preparations. This also includes the manufacture of medicinal chemical and botanical products. @en
scope note: Esta división comprende la fabricación de productos farmacéuticos de base y preparados farmacéuticos. Se incluye en esta categoría la fabricación de productos químicos y botánicos de uso medicinal. @es
scope note: Cette division comprend la fabrication de produits pharmaceutiques de base et de préparations pharmaceutiques. Elle comprend également la fabrication de produits chimiques à usage médicinal et de produits d’herboristerie. Elle comprend également la fabrication de produits chimiques à usage médicinal et de produits d’herboristerie. @fr
scope note: Ovaj odjeljak uključuje proizvodnju osnovnih farmaceutskih proizvoda i preparata. Također je uključena proizvodnja kemijskih i biljnih proizvoda za medicinske svrhe.
scope note: Į šį skyrių įeina pagrindinių farmacijos produktų ir farmacinių preparatų gamyba. Čia taip pat įeina gydomųjų cheminių ir botanikos produktų gamyba. @lt
scope note: Bu bölüm, temel eczacılık ürünlerinin ve eczacılığa ilişkin malzemelerin imalatını kapsamaktadır. Bu bölüm ayrıca tıbbi kimyasalların ve botanik ürünlerinin imalatını da kapsamaktadır. @tr
preferred label: Производство на лекарствени вещества и продукти @bg
preferred label: Výroba základních farmaceutických výrobků a farmaceutických přípravků @cs
preferred label: Fremstilling af farmaceutiske råvarer og farmaceutiske præparater @da
preferred label: Herstellung von pharmazeutischen Erzeugnissen @de
preferred label: Παραγωγή βασικών φαρμακευτικών προϊόντων και φαρμακευτικών σκευασμάτων @el
preferred label: Fabricación de productos farmacéuticos @es
preferred label: Põhifarmaatsiatoodete ja ravimpreparaatide tootmine @et
preferred label: Lääkeaineiden ja lääkkeiden valmistus @fi
preferred label: Industrie pharmaceutique @fr
preferred label: Gyógyszergyártás
preferred label: Fabbricazione di prodotti farmaceutici di base e di preparati farmaceutici @it
preferred label: Pagrindinių vaistų pramonės gaminių ir farmacinių preparatų gamyba @lt
preferred label: Farmaceitisko pamatvielu un farmaceitisko preparātu ražošana @lv
preferred label: Manifattura ta' prodotti farmaċewtiċi bażiċi u sustanzi farmaċewtiċi @mt
preferred label: Vervaardiging van farmaceutische grondstoffen en producten @nl
preferred label: Produksjon av farmasøytiske råvarer og preparater @no
preferred label: Produkcja podstawowych substancji farmaceutycznych oraz leków i pozostałych wyrobów farmaceutycznych @pl
preferred label: Fabricação de produtos farmacêuticos de base e de preparações farmacêuticas @pt
preferred label: Fabricarea produselor farmaceutice de bază şi a preparatelor farmaceutice @ro
preferred label: Производство основных фармацевтических продуктов и препаратов @ru
preferred label: Výroba základných farmaceutických výrobkov a farmaceutických prípravkov @sk
preferred label: Proizvodnja farmacevtskih surovin in preparatov @sl
preferred label: Tillverkning av farmaceutiska basprodukter och läkemedel @sv
preferred label: Temel eczacılık ürünlerinin ve eczacılığa ilişkin malzemelerin imalatı @tr
broader: MANUFACTURING
narrower: Manufacture of basic pharmaceutical products
narrower: Manufacture of pharmaceutical preparations

Manufacture of basic pharmaceutical products
type: Concept
notation: 21.1
status: valid
status modified: 2013-10-18
accepted date: 2013-10-18
in scheme: Statistical Classification of Economic Activities in the European Community, Rev. 2 (2008)
scope note: Этот класс включает: - производство медикаментов: • иммунной сыворотки и т.д. • вакцин • различных медикаментов, включая гомеопатические препараты - производство химической контрацептивной продукции для наружного применения и гормональных контрацептивов - производство медицинских диагностических препаратов, включая тесты на беременность - производство диагностических препаратов для выявления радиоактивных веществ - производство биологических фармацевтических препаратов Этот класс также включает: - производство медицинских перевязочных материалов, таких как вата, марля, марлевые повязки, бандажи и т.д. - подготовку растительных продуктов (измельчение, сортировка, толчение) для изготовления фармацевтических препаратов Этот класс исключает: - производство травяных настоев (мяты, вербены, ромашки и т.д.), см. 10.83 - производство стоматологических наполнителей и цемента для зубоврачебных целей и протезирования зубов, см. 32.50 - производство цемента для восстановления костей, см. 32.50 - производство хирургической ткани, см. 32.50 - оптовую торговлю фармацевтическими препаратами, см. 46.46 - розничную торговлю фармацевтическими препаратами, см. 47.73 - исследование и разработку фармацевтических и растительных препаратов, см. 72.1 - упаковку фармацевтических препаратов, см. 82.92 @ru
preferred label: Производство на лекарствени вещества @bg
preferred label: Výroba základních farmaceutických výrobků @cs
preferred label: Fremstilling af farmaceutiske råvarer @da
preferred label: Herstellung von pharmazeutischen Grundstoffen @de
preferred label: Παραγωγή βασικών φαρμακευτικών προϊόντων @el
preferred label: Fabricación de productos farmacéuticos de base @es
preferred label: Põhifarmaatsiatoodete tootmine @et
preferred label: Lääkeaineiden valmistus @fi
preferred label: Fabrication de produits pharmaceutiques de base @fr
preferred label: Gyógyszeralapanyag-gyártás
preferred label: Fabbricazione di prodotti farmaceutici di base @it
preferred label: Pagrindinių vaistų pramonės gaminių gamyba @lt
preferred label: Farmaceitisko pamatvielu ražošana @lv
preferred label: Manifattura ta' prodotti farmaċewtiċi bażiċi @mt
preferred label: Vervaardiging van farmaceutische grondstoffen @nl
preferred label: Produksjon av farmasøytiske råvarer @no
preferred label: Produkcja podstawowych substancji farmaceutycznych @pl
preferred label: Fabricação de produtos farmacêuticos de base @pt
preferred label: Fabricarea produselor farmaceutice de bază @ro
preferred label: Производство основных фармацевтических продуктов @ru
preferred label: Výroba základných farmaceutických výrobkov @sk
preferred label: Proizvodnja farmacevtskih surovin @sl
preferred label: Tillverkning av farmaceutiska basprodukter @sv
preferred label: Temel eczacılık ürünleri imalatı @tr
broader: Manufacture of basic pharmaceutical products and pharmaceutical preparations
narrower: Manufacture of basic pharmaceutical products

Manufacture of basic pharmaceutical products
type: Concept
notation: 21.10
status: valid
status modified: 2013-10-18
accepted date: 2013-10-18
in scheme: Statistical Classification of Economic Activities in the European Community, Rev. 2 (2008)
scope note: - производство на лекарствени вещества: антибиотици, витамини, o-ацетилсалицилова киселина и други. Лекарствено вещество е всяко активно вещество (активна съставка), предназначено да бъде използвано като фармакологично активна съставна част на лекарствения продукт. - преработка на кръв - производство на химически чисти захари - преработка на жлези и производство на екстракти от жлези @bg
scope note: Z: - výrobu léčebně aktivních substancí používaných při výrobě farmaceutických přípravků: antibiotik, vitaminů, salicylové a O-acetylsalicylové kyseliny atd. - zpracování krve ZT: - výrobu chemicky čistých cukrů - zpracování žláz, výrobu extraktů ze žláz atd. @cs
scope note: Diese Klasse umfasst: - Herstellung aktiver Substanzen für die Herstellung pharmazeutischer Präparate: Antibiotika, Vitamine, Salicyl- und o-Acetylsalicylsäure usw. - Verarbeitung von Blut Diese Klasse umfasst ferner: - Herstellung von chemisch reinem Zucker - Verarbeitung von Drüsen, Herstellung von Drüsenauszügen usw. @de
scope note: This class includes: - manufacture of medicinal active substances to be used for their pharmacological properties in the manufacture of medicaments: antibiotics, basic vitamins, salicylic and O-acetylsalicylic acids etc. - processing of blood This class also includes: - manufacture of chemically pure sugars - processing of glands and manufacture of extracts of glands etc. @en
scope note: Esta clase comprende: - la producción de sustancias medicinales activas utilizadas por sus propiedades farmacológicas en la fabricación de preparados farmacéuticos: antibióticos, vitaminas básicas, ácidos salicílico y O-acetilsalicílico, etc. - el tratamiento de la sangre Esta clase comprende también: - la fabricación de azúcares químicamente puros - el procesado de glándulas y la fabricación de extractos glandulares, etc. @es
scope note: Cette classe comprend: - la production des principes actifs destinés à la fabrication de médicaments: antibiotiques, vitamines de base, acides salicylique et O-acétylsalicylique, etc. - la transformation du sang Cette classe comprend également: - la fabrication de sucres chimiquement purs - la transformation de glandes et la production d’extraits de glandes, etc. @fr
scope note: Ovaj razred uključuje: - proizvodnju medicinski aktivnih tvari koje se koriste zbog svojih farmakoloških svojstava u proizvodnji lijekova: antibiotika, osnovnih vitamina, salicilne i O-acetosalicilne kiseline itd. - obradu krvi Ovaj razred također uključuje: - proizvodnju kemijski čistoga šećera - preradu željeza i proizvodnju njihovih ekstrakata itd.
scope note: Į šią klasę įeina: - vaistinių aktyviųjų medžiagų, dėl jų farmakologinių savybių naudojamų antibiotikų, pagrindinių vitaminų, salicilio ir O - acetylsalicilio rūgšties ir kt. vaistų gamyboje, gamyba - kraujo perdirbimas Į šią klasę taip pat įeina: - chemiškai gryno cukraus gamyba - liaukų perdirbimas, liaukų ekstraktų ir kt., gamyba @lt
scope note: Данный раздел включает производство продукции из резины и пластика. Данный раздел включает сырьевые материалы, используемые в производстве. Однако это не означает, что в него включены все виды производства и материалы. @ru
scope note: Bu sınıf aşağıdakileri kapsamaktadır; - ilaçların imalatında farmakolojik özelliklerinden yararlanmak üzere tıbbi olarak etken maddelerin imalatı: antibiyotikler, temel vitaminler, salisilik ve O-asetil salisilik asitler, vb. - kanın işlenmesi. Ayrıca bu sınıf aşağıdakileri de kapsamaktadır; - kimyasal olarak saf şeker imalatı, - salgı bezlerinin işlenmesi ve salgı bezi ekstreleri ve benzerlerinin imalatı. @tr
preferred label: Производство на лекарствени вещества @bg
preferred label: Výroba základních farmaceutických výrobků @cs
preferred label: Fremstilling af farmaceutiske råvarer @da
preferred label: Herstellung von pharmazeutischen Grundstoffen @de
preferred label: Παραγωγή βασικών φαρμακευτικών προϊόντων @el
preferred label: Fabricación de productos farmacéuticos de base @es
preferred label: Põhifarmaatsiatoodete tootmine @et
preferred label: Lääkeaineiden valmistus @fi
preferred label: Fabrication de produits pharmaceutiques de base @fr
preferred label: Gyógyszeralapanyag-gyártás
preferred label: Fabbricazione di prodotti farmaceutici di base @it
preferred label: Pagrindinių vaistų pramonės gaminių gamyba @lt
preferred label: Farmaceitisko pamatvielu ražošana @lv
preferred label: Manifattura ta' prodotti farmaċewtiċi bażiċi @mt
preferred label: Vervaardiging van farmaceutische grondstoffen @nl
preferred label: Produksjon av farmasøytiske råvarer @no
preferred label: Produkcja podstawowych substancji farmaceutycznych @pl
preferred label: Fabricação de produtos farmacêuticos de base @pt
preferred label: Fabricarea produselor farmaceutice de bază @ro
preferred label: Производство основных фармацевтических продуктов @ru
preferred label: Výroba základných farmaceutických výrobkov @sk
preferred label: Proizvodnja farmacevtskih surovin @sl
preferred label: Tillverkning av farmaceutiska basprodukter @sv
preferred label: Temel eczacılık ürünleri imalatı @tr
broader: Manufacture of basic pharmaceutical products

Manufacture of pharmaceutical preparations
type: Concept
notation: 21.2
status: valid
status modified: 2013-10-18
accepted date: 2013-10-18
in scheme: Statistical Classification of Economic Activities in the European Community, Rev. 2 (2008)
scope note: Данная группа включает производство продукции из резины. @ru
preferred label: Производство на лекарствени продукти @bg
preferred label: Výroba farmaceutických přípravků @cs
preferred label: Fremstilling af farmaceutiske præparater @da
preferred label: Herstellung von pharmazeutischen Spezialitäten und sonstigen pharmazeutischen Erzeugnissen @de
preferred label: Παραγωγή φαρμακευτικών σκευασμάτων @el
preferred label: Fabricación de especialidades farmacéuticas @es
preferred label: Ravimpreparaatide tootmine @et
preferred label: Lääkkeiden ja muiden lääkevalmisteiden valmistus @fi
preferred label: Fabrication de préparations pharmaceutiques @fr
preferred label: Gyógyszerkészítmény gyártása
preferred label: Fabbricazione di preparati farmaceutici @it
preferred label: Farmacinių preparatų gamyba @lt
preferred label: Farmaceitisko preparātu ražošana @lv
preferred label: Manifattura ta' sustanzi farmaċewtiċi @mt
preferred label: Vervaardiging van farmaceutische producten @nl
preferred label: Produksjon av farmasøytiske preparater @no
preferred label: Produkcja leków i pozostałych wyrobów farmaceutycznych @pl
preferred label: Fabricação de preparações farmacêuticas @pt
preferred label: Fabricarea preparatelor farmaceutice @ro
preferred label: Производство фармацевтических препаратов @ru
preferred label: Výroba farmaceutických prípravkov @sk
preferred label: Proizvodnja farmacevtskih preparatov @sl
preferred label: Tillverkning av läkemedel @sv
preferred label: Eczacılığa ilişkin ilaçların imalatı @tr
broader: Manufacture of basic pharmaceutical products and pharmaceutical preparations
narrower: Manufacture of pharmaceutical preparations

Manufacture of pharmaceutical preparations
type: Concept
notation: 21.20
status: valid
status modified: 2013-10-18
accepted date: 2013-10-18
in scheme: Statistical Classification of Economic Activities in the European Community, Rev. 2 (2008)
scope note: - производство на лекарствени продукти: • антисеруми и други кръвни съставки • ваксини • разнообразни лекарствени продукти, вкл. хомеопатични - производство на противозачатъчни химични препарати на базата на хормони или спермициди - производство на ин витро диагностични медицински изделия, вкл. тестове за установяване на бременност - производство на радиоактивни диагностични субстанции за приложение in vivo - производство на лекарствени продукти от биотехнологичен произход - производство на тампони, марли, бинтове и превръзки, напоени с фармацевтични субстанции - обработка (смилане, стриване, раздробяване) на растителни суровини за производство на лекарствени продукти - производство на билков чай (мента, върбинка, лайка и други) - 10.83 - производство на зъболекарски цименти и други препарати за зъбни пломби - 32.50 - производство на цимент за възстановяване на кости - 32.50 - производство на хирургически стерилни покривки за операции - 32.50 - търговия на едро с фармацевтични стоки - 46.46 - търговия на дребно с лекарства и други фармацевтични стоки - 47.73 - научноизследователска и развойна дейност в областта на лекарствените продукти, вкл. лекарствени продукти от биотехнологичен произход - 72.1 - опаковане на фармацевтични препарати - 82.92 @bg
scope note: Z: - výrobu farmaceutických přípravků: • antisér a ostatních krevních derivátů • očkovacích látek • různých léčiv včetně homeopatických přípravků - výrobu chemických antikoncepčních přípravků pro vnější použití včetně hormonálních antikoncepčních přípravků - výrobu diagnostických zdravotnických prostředků včetně těhotenských testů - výrobu radioaktivních látek pro diagnostiku in vivo - výrobu biotechnických farmaceutických výrobků ZT: - výrobu vaty pro zdravotnické účely, gázy, obvazových prostředků atd. - úpravu (mletí, třídění) botanických produktů pro farmaceutické účely N: - výrobu bylinných čajů (z máty peprné, sporýše, heřmánku atd.) (10.83) - výrobu cementu pro zubní výplně (32.50) - výrobu cementu pro kostní rekonstrukce (32.50) - výrobu chirurgických roušek (32.50) - velkoobchod s farmaceutickými výrobky (46.46) - maloobchod s farmaceutickými výrobky (47.73) - výzkum a vývoj pro farmaceutické (a také biotechnické) výrobky (72.1) - balení farmaceutických výrobků (82.92) @cs
scope note: Diese Klasse umfasst: - Herstellung von pharmazeutischen Präparaten: • Antisera und sonstige Blutbestandteile • Impfstoffe • verschiedene Arzneiwaren, einschließlich homöopathischer Zubereitungen - Herstellung von chemischen Empfängnisverhütungsmitteln zur äußeren Anwendung und hormonaler Präparate zur Empfängnisverhütung - Herstellung von Zubereitungen für die medizinische Diagnostik einschließlich Schwangerschaftstests - Herstellung von radioaktiven Stoffen für die in-vivo-Diagnostik - Herstellung von biotechnischen pharmazeutischen Erzeugnissen Diese Klasse umfasst ferner: - Herstellung von medizinischer Watte, Gaze, Binden, Verbandszeug usw. - Aufbereitung botanischer Erzeugnisse (Mahlen, Sortieren) für pharmazeutische Zwecke Diese Klasse umfasst nicht: - Herstellung von Kräutertees (Pfefferminze, Eisenkraut, Kamille usw.) (s. 10.83) - Herstellung von Zahnfüllungen und Zahnzement (s. 32.50) - Herstellung von Knochenzement (s. 32.50) - Herstellung von chirurgischen Abdecktüchern (s. 32.50) - Großhandel mit pharmazeutischen Erzeugnissen (s. 46.46) - Einzelhandel mit pharmazeutischen Erzeugnissen (s. 47.73) - Forschung und Entwicklung für pharmazeutische (auch biotechnische) Erzeugnisse (s. 72.1) - Verpacken von pharmazeutischen Erzeugnissen (s. 82.92) @de
scope note: This class includes: - manufacture of medicaments: • antisera and other blood fractions • vaccines • diverse medicaments, including homeopathic preparations - manufacture of chemical contraceptive products for external use and hormonal contraceptive medicaments - manufacture of medical diagnostic preparations, including pregnancy tests - manufacture of radioactive in-vivo diagnostic substances - manufacture of biotech pharmaceuticals This class also includes: - manufacture of medical impregnated wadding, gauze, bandages, dressings etc. - preparation of botanical products (grinding, grading, milling) for pharmaceutical use This class excludes: - manufacture of herb infusions (mint, vervain, chamomile etc.), see 10.83 - manufacture of dental fillings and dental cement, see 32.50 - manufacture of bone reconstruction cements, see 32.50 - manufacture of surgical drapes, see 32.50 - wholesale of pharmaceuticals, see 46.46 - retail sale of pharmaceuticals, see 47.73 - research and development for pharmaceuticals and biotech pharmaceuticals, see 72.1 - packaging of pharmaceuticals, see 82.92 @en
scope note: Esta clase comprende: - la fabricación de medicamentos: • antisueros y otras fracciones sanguíneas • vacunas • medicamentos diversos, incluidos los preparados homeopáticos - la fabricación de preparados químicos contraceptivos de uso externo y medicamentos contraceptivos a base de hormonas - la fabricación de preparados para el diagnóstico médico, incluidas las pruebas de embarazo - la fabricación de sustancias radioactivas para el diagnóstico en vivo - la fabricación de productos farmacéuticos biotecnológicos Esta clase comprende también: - la fabricación de guatas, gasas, vendas, apósitos, etc. medicinales impregnados - la preparación de productos botánicos (trituración, cribado, molido) para uso farmacéutico Esta clase no comprende: - la elaboración de infusiones (menta, verbena, manzanilla, etc.) (véase 10.83) - la fabricación de productos de obturación dental y de cemento dental (véase 32.50) - la fabricación de cementos para la reconstrucción de huesos (véase 32.50) - la fabricación de sábanas quirúrgicas (véase 32.50) - el comercio al por mayor de productos farmacéuticos (véase 46.46) - el comercio al por menor de productos farmacéuticos (véase 47.73) - las actividades de investigación y desarrollo relativas a los productos farmacéuticos y los productos farmacéuticos biotecnológicos (véase 72.1) - el empaquetado de productos farmacéuticos (véase 82.92) @es
scope note: Cette classe comprend: - la fabrication de médicaments: • sérums thérapeutiques et autres constituants du sang • vaccins • médicaments divers, y compris les préparations homéopathiques - la fabrication de préparations chimiques contraceptives à usage externe et de médicaments contraceptifs à base d’hormones - la fabrication de préparations de diagnostic, y compris les tests de grossesse - la fabrication de substances radioactives de diagnostic in vivo - la fabrication de produits pharmaceutiques issus des biotechnologies Cette classe comprend également: - la fabrication d’ouates, de gazes et de bandes imprégnées à usage médical, de pansements, de catguts, etc. - la préparation de produits d’herboristerie (broyage, triage, mouture) à usage pharmaceutique Cette classe ne comprend pas: - la fabrication de tisanes à base de plantes (menthe, verveine, camomille, etc.), voir 10.83 - la fabrication de produits d’obturation dentaire et de ciments dentaires, voir 32.50 - la fabrication de ciments pour la réfection osseuse, voir 32.50 - la fabrication de rideaux chirurgicaux, voir 32.50 - le commerce de gros de produits pharmaceutiques, voir 46.46 - le commerce de détail de produits pharmaceutiques, voir 47.73 - les activités de recherche et développement de produits pharmaceutiques et de produits pharmaceutiques issus des biotechnologies, voir 72.1 - le conditionnement de produits pharmaceutiques, voir 82.92 @fr
scope note: Ovaj razred uključuje: - proizvodnju lijekova: • antiseruma i drugih frakcija krvi • cjepiva • raznih lijekova, uključujući homeopatske pripravke - proizvodnju kemijskih kontracepcijskih sredstava za vanjsku upotrebu i hormonalnih kontracepcijskih lijekova - proizvodnju medicinskih dijagnostičkih preparata, uključujući testove za trudnoću - proizvodnju biotehnoloških farmaceutikalija Ovaj razred također uključuje: - proizvodnju medicinske impregnirane vate, gaze, zavoja, obloga itd. - pripremu biljnih proizvoda (drobljenih, gradiranih, mljevenih) za farmaceutske potrebe Ovaj razred isključuje: - proizvodnju biljnih ekstrakata (metvice, sporiša, kamilice itd.), vidi 10.83 - proizvodnju zubarskih punila, proizvodnju stomatološkog cementa, vidi 32.50 - proizvodnju cementa za rekonstrukciju kosti, vidi 32.50 - proizvodnju kirurških plašteva, vidi 32.50 - trgovinu na veliko farmaceutskim proizvodima, vidi 46.46 - trgovinu na malo farmaceutskim proizvodima, vidi 47.73 - istraživanje i razvoj za potrebe farmaceutike i biotehnološke farmaceutike, vidi 72.1 - pakiranje farmaceutskih proizvoda, vidi 82.92
scope note: Į šią klasę įeina: - vaistų gamyba: • antiserumo ir kitų kraujo frakcijų • vakcinų • įvairių vaistų, įskaitant homeopatinius preparatus - išorinių cheminių kontraceptinių preparatų ir hormoninių kontraceptinių medikamentų gamyba - medicininių diagnostinių preparatų, įskaitant nėštumo testus, gamyba - radioaktyviųjų „in-vivo“ diagnostinių medžiagų gamyba - biotechnologinių vaistų gamyba Į šią klasę taip pat įeina: - medicininės įmirkytos vatos, marlės, tvarsčių, tvarsliavos ir kt., gamyba - farmacijos tikslams naudojamų botanikos produktų paruošimas (smulkinimas, rūšiavimas, malimas) Į šią klasę neįeina: - žolių užpilų gamyba (mėtos, verbenos, ramunėlių ir kt.), žr. 10.83 - dantų plombų gamyba, dantų cemento gamyba, žr. 32.50 - cemento kaulams atkurti gamyba, žr. 32.50 - chirurginių apklotų gamyba, žr. 32.50 - vaistų didmeninė prekyba, žr. 46.46 - vaistų mažmeninė prekyba, žr. 47.73 - vaistų ir biotechnologinių vaistų tyrinėjimas ir tobulinimas, žr. 72.1 - vaistų pakavimas, žr. 82.92 @lt
scope note: Этот класс включает: - производство шин и покрышек из резины для автотранспортных средств, оборудования, передвижной техники, воздушных судов, игрушек, мебели и т.д.: • пневматических шин • цельных шин или шин с обрезиненным ободом - производство камер для шин - производство съемных покрышек, откидных клапанов, выпуклых заготовок для возобновления протекторов покрышек и т.д. - восстановление протектора и капитальный ремонт шин Этот класс исключает: - производство материалов для ремонта камер для шин, см. 22.19 - ремонт шин и камер, их установку или замену, см. 45.20 @ru
scope note: Bu sınıf aşağıdakileri kapsamaktadır; - ilaçların imalatı: • antiserum (panzehir) ve diğer kan fraksiyonları, • aşılar, • çeşitli ilaçlar, benzeri ile tedavi olunan hastalığa ait olan preparatlar dahil. - harici kullanım için gebeliği önleyici kimyasal ürünlerin ve gebeliği önleyici hormonal ilaçların imalatı, - tıbbi teşhise yönelik malzemelerin imalatı, gebelik testleri de dahil, - canlılar için radyoaktif teşhise yönelik müstahzarların imalatı, - bio teknolojik eczacılıkla ilgili ürünlerin imalatı, Ayrıca bu sınıf aşağıdakileri de kapsamaktadır; - tıbbi olarak hazırlanmış pansuman pamuğu, gazlı bez, bandaj, sargı bezi ve benzerlerinin imalatı, - eczacılıkta kullanılmak üzere botanik ürünlerin hazırlanması (öğütülmesi ve sınıflandırılması). Kapsam dışı olanlar; - şifalı ot karışımlarının imalatı (nane, mine çiçeği, papatya vb.), bkz. 10.83, - dişçilikle ilgili dolgu malzemeleri imalatı, dişçilikle ilgili yapıştırıcı malzemeler imalatı, bkz. 32.50, - kemik dolgu malzemeleri (alçı) imalatı, bkz. 32.50, - cerrahi kumaşların imalatı, bkz. 32.50, - eczacılıkla ilgili ürünlerin toptan ticareti, bkz. 46.46, - eczacılıkla ilgili ürünlerin perakende ticareti, bkz. 47.73, - eczacılıkla ilgili ürünler ve biyo teknolojik eczacılıkla ilgili ürünler için araştırma ve geliştirme faaliyetleri, bkz. 72.1, - eczacılıkla ilgili ürünlerin paketlenmesi, bkz. 82.92. @tr
preferred label: Производство на лекарствени продукти @bg
preferred label: Výroba farmaceutických přípravků @cs
preferred label: Fremstilling af farmaceutiske præparater @da
preferred label: Herstellung von pharmazeutischen Spezialitäten und sonstigen pharmazeutischen Erzeugnissen @de
preferred label: Παραγωγή φαρμακευτικών σκευασμάτων @el
preferred label: Fabricación de especialidades farmacéuticas @es
preferred label: Ravimpreparaatide tootmine @et
preferred label: Lääkkeiden ja muiden lääkevalmisteiden valmistus @fi
preferred label: Fabrication de préparations pharmaceutiques @fr
preferred label: Gyógyszerkészítmény gyártása
preferred label: Fabbricazione di preparati farmaceutici @it
preferred label: Farmacinių preparatų gamyba @lt
preferred label: Farmaceitisko preparātu ražošana @lv
preferred label: Manifattura ta' sustanzi farmaċewtiċi @mt
preferred label: Vervaardiging van farmaceutische producten @nl
preferred label: Produksjon av farmasøytiske preparater @no
preferred label: Produkcja leków i pozostałych wyrobów farmaceutycznych @pl
preferred label: Fabricação de preparações farmacêuticas @pt
preferred label: Fabricarea preparatelor farmaceutice @ro
preferred label: Производство фармацевтических препаратов @ru
preferred label: Výroba farmaceutických prípravkov @sk
preferred label: Proizvodnja farmacevtskih preparatov @sl
preferred label: Tillverkning av läkemedel @sv
preferred label: Eczacılığa ilişkin ilaçların imalatı @tr
broader: Manufacture of pharmaceutical preparations

Manufacture of rubber and plastic products
type: Concept
notation: 22
status: valid
status modified: 2013-10-18
accepted date: 2013-10-18
in scheme: Statistical Classification of Economic Activities in the European Community, Rev. 2 (2008)
scope note: производство на изделия от каучук и пластмаси. Разделът се характеризира чрез суровините, които използва при производствените процеси. Това обаче не означава, че всички изделия, произведени от тези суровини, се класифицират тук. @bg
scope note: Tento oddíl zahrnuje výrobu pryžových a plastových výrobků. Třebaže je charakterizován surovinami používanými při výrobě, neznamená to, že zahrnuje výrobu všech výrobků vyrobených z těchto surovin. @cs
scope note: Diese Abteilung umfasst die Herstellung von Erzeugnissen aus Gummi und Kunststoffen. Diese Abteilung wird durch die eingesetzten Rohstoffe charakterisiert. Das bedeutet jedoch nicht, dass die Herstellung aller aus diesen Rohstoffen gefertigten Waren hier zugeordnet ist. @de
scope note: This division includes the manufacture of rubber and plastics products. This division is characterised by the raw materials used in the manufacturing process. However, this does not imply that the manufacture of all products made of these materials is classified here. @en
scope note: Esta división comprende la fabricación de productos de caucho y materias plásticas. Esta división se caracteriza por las materias primas utilizadas en el proceso de fabricación. No obstante, esto no significa que todos los productos fabricados con estos materiales se clasifiquen en esta división. @es
scope note: Cette division couvre la fabrication du caoutchouc et des plastiques. Cette division et se caractérise par les matières premières travaillées. Ceci qui ne veut pas dire que tous les produits en ces matières relèvent nécessairement de cette division. @fr
scope note: Ovaj odjeljak uključuje proizvodnju gumenih i plastičnih proizvoda, a karakterističan je po sirovinama kojima se koristi u proizvodnom procesu. Međutim to ne znači da svi proizvodi koji su izrađeni od tih materijala trebaju biti razvrstani unutar te djelatnosti.
scope note: Į šį skyrių įeina guminių ir plastikinių gaminių gamyba. Šis skyrius charakterizuojamas gamybos procese naudojamomis žaliavomis. Tačiau tai nereiškia, kad visi iš šių medžiagų pagaminti gaminiai yra klasifikuojami šiame skyriuje. @lt
scope note: Этот класс включает: - производство прочей продукции из природной или синтетической резины, не вулканизированной, вулканизированной резины или резины повышенной прочности: • резиновых пластин, листов, полос, валиков, профилей • камер для шин, труб и шлангов • резиновых конвейерных или трансмиссионных ремней • гигиенических резиновых изделий: контрацептивов, сосок, грелок и т.п. • одежды из эластика (цельной, без швов) • резиновых подметок и прочих резиновых частей для обуви • резиновых ниток и шнуров • резиновой пряжи и тканей • резиновых ободов, гарнитур и печати • резиновых покрытий • надувных резиновых матрасов • надувных шаров - производство щеток и кистей из резины - производство резиновых труб - производство расчесок и гребней из твердой резины, заколок для волос, бигуди и т.д. Этот класс также включает: - производство ремонтных материалов из резины - производство тканей пропитанных, окрашенных, покрытых или ламинированных резиной, где резина служит основным компонентом - производство матрасов из резины для водяных кроватей - производство плавательных шапочек и фартуков из резины - производство плавательных нырятельных костюмов из резины - производство резиновых сексуальных изделий Этот класс исключает: - производство волокон для кордовых покрышек, см. 13.96 - производство одежды из эластичного волокна, см. 14.14, 14.19 - производство резиновой обуви, см. 15.20 - производство клея и клеящих веществ на резиновой основе, см. 20.52 - производство выпуклых заготовок для протекторов, см. 22.11 - производство надувных плотов и лодок, см. 30.11, 30.12 - производство безобтяжных матрасов из пористой резины, см. 31.03 - производство спортивного инвентаря из резины, за исключением одежды, см. 32.30 - производство резиновых игр и игрушек (включая детские бассейны, надувные детские резиновые лодки, надувные плавательные круги в виде животные, мячи и т.п.), см. 32.40 - регенерацию резины, см. 38.32 @ru
scope note: Bu bölüm kauçuk ve plastik ürünlerin imalatını kapsamaktadır.Bu bölüm, imalat sürecinde kullanılan ham maddelere göre karakterize edilmektedir. Bununla beraber, bu alt kısım içinde zorunlu olarak yer alan maddelerin tüm ürünlerin imalatının bu bölümde sınıflandırılacağı anlamına gelmemektedir. @tr
preferred label: Производство на изделия от каучук и пластмаси @bg
preferred label: Výroba pryžových a plastových výrobků @cs
preferred label: Fremstilling af gummi- og plastprodukter @da
preferred label: Herstellung von Gummi- und Kunststoffwaren @de
preferred label: Κατασκευή προϊόντων από ελαστικό (καουτσούκ) και πλαστικές ύλες @el
preferred label: Fabricación de productos de caucho y plásticos @es
preferred label: Kummi- ja plasttoodete tootmine @et
preferred label: Kumi- ja muovituotteiden valmistus @fi
preferred label: Fabrication de produits en caoutchouc et en plastique @fr
preferred label: Gumi-, műanyag termék gyártása
preferred label: Fabbricazione di articoli in gomma e materie plastiche @it
preferred label: Guminių ir plastikinių gaminių gamyba @lt
preferred label: Gumijas un plastmasas izstrādājumu ražošana @lv
preferred label: Manifattura ta' prodotti tal-lasktu u tal-plastik @mt
preferred label: Vervaardiging van producten van rubber of kunststof @nl
preferred label: Produksjon av gummi- og plastprodukter @no
preferred label: Produkcja wyrobów z gumy i tworzyw sztucznych @pl
preferred label: Fabricação de artigos de borracha e de matérias plásticas @pt
preferred label: Fabricarea produselor din cauciuc şi mase plastice @ro
preferred label: Производство резиновых и пластмассовых изделий @ru
preferred label: Výroba výrobkov z gumy a plastu @sk
preferred label: Proizvodnja izdelkov iz gume in plastičnih mas @sl
preferred label: Tillverkning av gummi- och plastvaror @sv
preferred label: Kauçuk ve plastik ürünlerin imalatı @tr
broader: MANUFACTURING
narrower: Manufacture of rubber products
narrower: Manufacture of plastic products

Manufacture of rubber products
type: Concept
notation: 22.1
status: valid
status modified: 2013-10-18
accepted date: 2013-10-18
in scheme: Statistical Classification of Economic Activities in the European Community, Rev. 2 (2008)
scope note: Diese Gruppe umfasst die Herstellung von Gummiwaren. @de
scope note: This group includes the manufacture of rubber products. @en
scope note: Ce groupe comprend la fabrication des produits en caoutchouc. @fr
scope note: Ova skupina uključuje proizvodnju proizvoda od gume.
scope note: Į šią grupę įeina guminių gaminių gamyba. @lt
scope note: Данный группа включает переработку новых или повторно использованных пластических смол в промежуточную или готовую продукцию при использовании таких процессов, как формовка, штамповка, выдувание и отлив. В результате, пройдя весь производственный процесс, выход получает широкий ассортимент изделий. @ru
scope note: Bu grup kauçuk ürünlerin imalatını kapsamaktadır. @tr
preferred label: Производство на изделия от каучук @bg
preferred label: Výroba pryžových výrobků @cs
preferred label: Fremstilling af gummiprodukter @da
preferred label: Herstellung von Gummiwaren @de
preferred label: Κατασκευή προϊόντων από ελαστικό (καουτσούκ) @el
preferred label: Fabricación de productos de caucho @es
preferred label: Kummitoodete tootmine @et
preferred label: Kumituotteiden valmistus @fi
preferred label: Fabrication de produits en caoutchouc @fr
preferred label: Gumitermék gyártása
preferred label: Fabbricazione di articoli in gomma @it
preferred label: Guminių gaminių gamyba @lt
preferred label: Gumijas izstrādājumu ražošana @lv
preferred label: Manifattura ta' prodotti tal-lasktu @mt
preferred label: Vervaardiging van producten van rubber @nl
preferred label: Produksjon av gummiprodukter @no
preferred label: Produkcja wyrobów z gumy @pl
preferred label: Fabricação de artigos de borracha @pt
preferred label: Fabricarea articolelor din cauciuc @ro
preferred label: Производство резиновых изделий @ru
preferred label: Výroba výrobkov z gumy @sk
preferred label: Proizvodnja izdelkov iz gume @sl
preferred label: Tillverkning av gummivaror @sv
preferred label: Kauçuk ürünlerin imalatı @tr
broader: Manufacture of rubber and plastic products
narrower: Manufacture of rubber tyres and tubes; retreading and rebuilding of rubber tyres
narrower: Manufacture of other rubber products

Manufacture of rubber tyres and tubes; retreading and rebuilding of rubber tyres
type: Concept
notation: 22.11
status: valid
status modified: 2013-10-18
accepted date: 2013-10-18
in scheme: Statistical Classification of Economic Activities in the European Community, Rev. 2 (2008)
scope note: - производство на външни гуми за превозни средства, машини, съоръжения, самолети, играчки, мебели и други: • пневматични гуми • плътни или кухи (полуплътни) бандажи за пневматични гуми - производство на вътрешни гуми - производство на протектори за пневматични гуми, предпазни ленти, профили от невулканизиран каучук за поправка на гуми и други - регенериране на външни пневматични гуми - производство на материали за поправка от каучук, без профилите за поправка на пневматични гуми - 22.19 - ремонт, регулиране и балансиране, замяна и монтаж на вътрешни и външни гуми на автомобила - 45.20 @bg
scope note: Z: - výrobu pryžových pneumatik pro motorová vozidla, pojízdné stroje nebo zařízení, letadla, hračky, nábytek apod.: • hustitelných pneumatik • plných (komorových) obručí - výrobu duší do pneumatik - výrobu vyměnitelných běhounů pláště pneumatiky a ochranných vložek do ráfku pneumatik, profilů k protektorování pneumatik atd. - protektorování pneumatik N: - výrobu materiálů na opravy duší (22.19) - opravy, montáž a výměnu pneumatik a duší (45.20) @cs
scope note: Diese Klasse umfasst: - Herstellung von Gummireifen für Fahrzeuge, Geräte, fahrbare Anlagen, Flugzeuge, Spielwaren, Möbel u. Ä.: • Luftreifen • Vollgummi- und Hochelastikreifen - Herstellung von Luftschläuchen - Herstellung von auswechselbaren Reifenprofilen, Reifenklappen, Rohlaufprofilen zur Runderneuerung von Reifen usw. - Runderneuerung von Reifen Diese Klasse umfasst nicht: - Herstellung von Reparaturmaterial für Reifen und Schläuche (s. 22.19) - Reparatur, Montage und Wechseln von Reifen und Schläuchen (s. 45.20) @de
scope note: This class includes: - manufacture of rubber tyres for vehicles, equipment, mobile machinery, aircraft, toy, furniture and other uses: • pneumatic tyres • solid or cushion tyres - manufacture of inner tubes for tyres - manufacture of interchangeable tyre treads, tyre flaps, "camelback" strips for retreading tyres etc. - tyre rebuilding and retreading This class excludes: - manufacture of tube repair materials, see 22.19 - tyre and tube repair, fitting or replacement, see 45.20 @en
scope note: Esta clase comprende: - la fabricación de cubiertas de caucho para vehículos, aparatos, maquinaria móvil, aeronaves, juguetes, muebles y otros usos: • neumáticos • cubiertas macizas o huecas - la fabricación de cámaras de aire para ruedas - la fabricación de bandas de rodadura intercambiables, bandas de fondo de llanta, bandas de rodadura para el recauchutado de cubiertas, etc. - el recauchutado de neumáticos Esta clase no comprende: - la fabricación de materiales para la reparación de cámaras (véase 22.19) - la reparación, colocación o reposición de neumáticos y cámaras (véase 45.20) @es
scope note: Cette classe comprend: - la fabrication de pneumatiques en caoutchouc pour véhicules, équipements, machines mobiles, industrie aéronautique, jouets, meubles et autres utilisations: • pneumatiques • bandages pleins ou creux - la fabrication de chambres à air pour pneumatiques - la fabrication de bandes de roulement amovibles pour pneumatiques, de flaps, de profilés pour le rechapage des pneumatiques, etc. - le rechapage et le resculptage de pneumatiques Cette classe ne comprend pas: - la fabrication de matériaux de réparation en caoutchouc, voir 22.19 - la réparation, la pose ou le remplacement de pneumatiques et de chambres à air, voir 45.20 @fr
scope note: Ovaj razred uključuje: - proizvodnju vanjskih guma za vozila, opremu, pokretne strojeve, avione, igračke, namještaj i za druge svrhe: • pneumatskih guma • punih guma ili obruča - proizvodnju unutrašnjih guma - proizvodnju zamjenjivih dijelova za protektiranje vanjskih guma, profiliranih vrpca sa šarama za protektiranje - vanjskih guma itd. - protektiranje vanjskih guma Ovaj razred isključuje: - proizvodnju crijeva za popravak gume, vidi 22.19 - popravak guma i crijeva, podešavanje ili zamjenjivanje, vidi 45.20
scope note: Į šią klasę įeina: - transporto priemonių, įrenginių, kilnojamųjų mašinų, orlaivių, žaislų, baldų ir kt. guminių padangų gamyba: • pneumatinių padangų • pilnavidurių ar pusiau pneumatinių padangų - padangų kamerų gamyba - keičiamųjų guminių padangų protektorių, ratlankio juostų, protektorių juostų guminėms padangoms restauruoti ir kt., gamyba - guminių padangų restauravimas ir atnaujinimas Į šią klasę neįeina: - kamerų remonto medžiagų gamyba, žr. 22.19 - padangų ir kamerų remontas, uždėjimas ar pakeitimas, žr. 45.20 @lt
scope note: Этот класс включает: - производство заготовок из пластика: • пластиковых листов, блоков, пленок, монтажной пленки и прочих видов пленок (самоклеящейся и нет) - производство готовых продуктов из пластика: • пластиковых камер для шин, труб, шлангов и гарнитуры • целлофановой пленки Этот класс исключает: - производство пластика в первичных формах, см. 20.16 - производство изделий из синтетической или натуральной резины, см. 22.1 @ru
scope note: Bu sınıf aşağıdakileri kapsamaktadır; - araçlar, donanımlar, hareketli makineler, uçaklar, oyuncaklar, mobilyalar ve diğer kullanımlar için tekerlek lastiği imalatı: • pnömatik (havalı) lastikler, • sert veya yumuşak lastikler. - iç lastik imalatı, - değiştirilebilir dış lastik (lastik tabanı), lastik kolonları, lastiklerin kaplanması için `sırt geçirme` şeritleri ve benzerlerinin imalatı, - lastiğin yeniden işlenmesi ve sırt geçirilmesi. Kapsam dışı olanlar; - kauçuk ve lastik onarım malzemelerinin imalatı, bkz. 22.19, - lastik ve iç lastik tamiratı ve yerine monte edilmesi ya da değiştirilmesi, bkz. 45.20. @tr
preferred label: Производство на външни и вътрешни гуми; регенериране на пневматични гуми @bg
preferred label: Výroba pryžových plášťů a duší; protektorování pneumatik @cs
preferred label: Fremstilling af gummidæk og gummislanger; vulkanisering af dæk @da
preferred label: Herstellung und Runderneuerung von Bereifungen @de
preferred label: Κατασκευή επισώτρων (ελαστικά οχημάτων) και σωλήνων από καουτσούκ· αναγόμωση και ανακατασκευή επισώτρων (ελαστικά οχημάτων) από καουτσούκ @el
preferred label: Fabricación de neumáticos y cámaras de caucho; reconstrucción y recauchutado de neumáticos @es
preferred label: Kummirehvide ja sisekummide tootmine; kummirehvide protekteerimine ja taastamine @et
preferred label: Renkaiden valmistus ja uudelleenpinnoitus @fi
preferred label: Fabrication et rechapage de pneumatiques @fr
preferred label: Gumiabroncs, gumitömlő gyártása
preferred label: Fabbricazione di pneumatici e camere d'aria; rigenerazione e ricostruzione di pneumatici @it
preferred label: Guminių padangų ir kamerų gamyba; guminių padangų restauravimas ir atnaujinimas @lt
preferred label: Gumijas riepu un kameru ražošana; gumijas riepu protektoru atjaunošana @lv
preferred label: Manifattura ta' tajers u tubi tal-lasktu; riġenerazzjoni u rikostruzzjoni ta' tajers tal-lasktu @mt
preferred label: Vervaardiging van binnen- en buitenbanden van rubber; loopvlakvernieuwing @nl
preferred label: Produksjon av gummidekk og slanger til gummidekk, og regummiering og vulkanisering av gummidekk @no
preferred label: Produkcja opon i dętek z gumy; bieżnikowanie i regenerowanie opon z gumy @pl
preferred label: Fabricação de pneus e câmaras-de-ar; reconstrução de pneus @pt
preferred label: Fabricarea anvelopelor şi a camerelor de aer; reşaparea şi refacerea anvelopelor @ro
preferred label: Производство резиновых покрышек и камер; восстановление резиновых покрышек @ru
preferred label: Výroba gumených pneumatík a duší; protektorovanie a oprava pneumatík @sk
preferred label: Proizvodnja in obnavljanje gumijastih plaščev in zračnic za vozila @sl
preferred label: Tillverkning av däck och slangar; regummering @sv
preferred label: İç ve dış lastik imalatı; lastiğe sırt geçirilmesi ve yeniden işlenmesi @tr
broader: Manufacture of rubber products

Manufacture of other rubber products
type: Concept
notation: 22.19
status: valid
status modified: 2013-10-18
accepted date: 2013-10-18
in scheme: Statistical Classification of Economic Activities in the European Community, Rev. 2 (2008)
scope note: - производство на други изделия от естествен или синтетичен каучук, невулканизиран, вулканизиран или твърд: • плочи, листове, ленти, пръчки, профили • маркучи • трансмисионни ремъци и транспортни ленти • хигиенни и фармацевтични изделия: презервативи, биберони и други • облекло и допълнения за него, които не са "съединени" чрез шиене, а само слепени • ходила и части за обувки от каучук • нишки и въжета • прежди и платове с покритие от каучук • шайби, дискове, уплътнители и съединителни части (свръзки, колена, муфи) • гумени покрития за валци • надуваеми дюшеци • надуваеми балони - производство на четки от каучук - производство на мундщуци за лули от твърд каучук - производство на гребени, шноли, ролки за коса и подобни - производство на материали за поправка от каучук (без тези за пневматични гуми) - производство на текстилни платове, импрегнирани, промазани, покрити или ламинирани с каучук, чието съдържание е преобладаващо - производство водни матраци - производство - производство на платна за пневматични гуми от химични прежди с висока здравина - 13.96 - производство на облекло от еластични платове - 14.14, 14.19 - производство на обувки от каучук - 15.20 - производство на лепила на каучукова основа - 20.52 - профили от невулканизиран каучук за поправка на пневматични гуми - 22.11 - производство на надуваеми салове и лодки - 30.11, 30.12 - производство на необвити дюшеци от порест каучук - 31.03 - производство на спортни принадлежности от каучук - 32.30 - производство на игри и играчки от каучук, вкл. детски басейни, надуваеми лодки, топки и подобни играчки за деца - 32.40 - регенериране на каучук - 38.32 @bg
scope note: Z: - výrobu ostatních výrobků z přírodního nebo syntentického kaučuku vulkanizovaného, nevulkanizovaného nebo tvrzeného: • desek, fólií, pásů, tyčí a profilovaných tvarů • hadic, rour a trubic • pryžových dopravníkových pásů a hnacích řemenů • hygienických výrobků: prezervativů, dudlíků, ohřívacích lahví atd. • oděvů z pryže (pouze svařovaných nebo lepených, nikoli šitých) • pryžových podešví a jiných částí obuvi z pryže • pryžových nití a lan • pryžovaných přízí a tkanin • pryžových kroužků, tvarovek, těsnění • popryžovaných koleček, válečků atd. • nafukovacích matrací • nafukovacích balónků - výrobu kartáčů z pryže - výrobu náústků dýmek z tvrdé pryže - výrobu hřebenů, spon do vlasů, natáček na vlasy apod., z tvrdé pryže ZT: - výrobu pryžových materiálů na opravy (např. duší) - výrobu textilních vláken impregnovaných, potažených nebo laminovaných pryží, pokud pryž představuje hlavní součást výrobku - výrobu pryžových matrací do vodních postelí - výrobu koupacích čepic a zástěr z pryže - výrobu surfařských a potápěčských oděvů z pryže - výrobu erotických pomůcek z pryže N: - výrobu kordových tkanin pro pneumatiky (13.96) - výrobu oděvů z elastických materiálů (14) - výrobu pryžové obuvi (15.20) - výrobu klihů a lepidel na bázi kaučuku (20.52) - výrobu profilů k protektorování plášťů pneumatik (22.11) - výrobu nafukovacích člunů, vorů, raftů (30.11, 30.12) - výrobu matrací z nepotahované lehčené pryže (31.03) - výrobu pryžových sportovních potřeb kromě oděvů (32.30) - výrobu her a hraček z pryže (včetně bazénků pro děti, nafukovacích pryžových člunů pro děti, nafukovacích pryžových zvířat pro děti, míčů apod.) (32.40) - regeneraci pryže (38.32) @cs
scope note: Diese Klasse umfasst: - Herstellung von sonstigen Erzeugnissen aus nichtvulkanisiertem, vulkanisiertem oder gehärtetem natürlichem oder synthetischem Kautschuk: • Platten, Blätter, Streifen, Stäbe, Stangen und Profile • Schläuche und Rohre • Förderbänder und Treibriemen, aus Gummi • Hygieneartikel: Präservative, Sauger, Wärmflaschen usw. • Gummibekleidungsartikel, die lediglich geschweißt oder geklebt werden • Gummisohlen und andere Schuhteile aus Gummi • gummierte Fäden und Seile • gummierte Garne und Gewebe • Ringe, Armaturen und Dichtungen, aus Gummi • Walzenbezüge • Luftmatratzen • Luftballons - Herstellung von Gummibürsten - Herstellung von Pfeifenmundstücken aus Hartgummi - Herstellung von Kämmen, Haarnadeln, Haarwicklern und dergleichen, aus Hartgummi Diese Klasse umfasst ferner: - Herstellung von Reparaturmaterial aus Gummi - Herstellung von mit Gummi imprägnierten, beschichteten, überzogenen oder laminierten Spinnstoffen, wenn Gummi den Hauptbestandteil darstellt - Herstellung von Wasserbettmatratzen aus Gummi - Herstellung von Badkappen und Schürzen aus Gummi - Herstellung von Surf- und Tauchanzügen aus Gummi - Herstellung von Sexartikeln aus Gummi Diese Klasse umfasst nicht: - Herstellung von Reifencord (s. 13.96) - Herstellung von Bekleidung aus Elastikgeweben (s. 14.14, 14.19) - Herstellung von Gummischuhen (s. 15.20) - Herstellung von Leimen und Klebstoffen auf Gummibasis (s. 20.52) - Herstellung von Rohlaufprofilen zur Runderneuerung von Reifen (s. 22.11) - Herstellung von aufblasbaren Flößen und Booten (s. 30.11, 30.12) - Herstellung von nichtüberzogenen Schaumgummimatratzen (s. 31.03) - Herstellung von Sportzubehör aus Gummi (s. 32.30) - Herstellung von Spielen und Spielzeug aus Gummi (einschließlich Planschbecken für Kinder, aufblasbare Gummiboote für Kinder, aufblasbare Gummitiere, Bälle und dergleichen) (s. 32.40) - Rückgewinnung von Gummi (s. 38.32) @de
scope note: This class includes: - manufacture of other products of natural or synthetic rubber, unvulcanised, vulcanised or hardened: • rubber plates, sheets, strip, rods, profile shapes • tubes, pipes and hoses • rubber conveyor or transmission belts or belting • rubber hygienic articles: sheath contraceptives, teats, hot water bottles etc. • rubber articles of apparel (if only sealed together, not sewn) • rubber sole and other rubber parts of footwear • rubber thread and rope • rubberised yarn and fabrics • rubber rings, fittings and seals • rubber roller coverings • inflatable rubber mattresses • inflatable balloons - manufacture of rubber brushes - manufacture of hard rubber pipe stems - manufacture of hard rubber combs, hair pins, hair rollers, and similar This class also includes: - manufacture of rubber repair materials - manufacture of textile fabric impregnated, coated, covered or laminated with rubber, where rubber is the chief constituent - manufacture of rubber waterbed mattresses - manufacture of rubber bathing caps and aprons - manufacture of rubber wet suits and diving suits - manufacture of rubber sex articles This class excludes: - manufacture of tyre cord fabrics, see 13.96 - manufacture of apparel of elastic fabrics, see 14.14, 14.19 - manufacture of rubber footwear, see 15.20 - manufacture of glues and adhesives based on rubber, see 20.52 - manufacture of "camelback" strips, see 22.11 - manufacture of inflatable rafts and boats, see 30.11, 30.12 - manufacture of mattresses of uncovered cellular rubber, see 31.03 - manufacture of rubber sports requisites, except apparel, see 32.30 - manufacture of rubber games and toys (including children's wading pools, inflatable children rubber boats, inflatable rubber animals, balls and the like), see 32.40 - reclaiming of rubber, see 38.32 @en
scope note: Esta clase comprende: - la fabricación de otros productos de caucho natural o sintético sin vulcanizar, vulcanizados o endurecidos: • planchas, hojas, bandas, varillas, perfiles • tubos, conductos y mangueras • cintas transportadoras o de transmisión • artículos de caucho para usos higiénicos: preservativos, tetinas, bolsas de agua caliente, etc. • prendas de vestir de caucho (sólo cuando las piezas se unen por adhesión y no por costura) • suelas de caucho y otras partes de caucho del calzado • hilos y cuerdas de caucho • hilos y tejidos engomados • anillas, juntas y sellos de caucho • revestimientos de caucho para rodillos • colchones inflables de caucho • globos inflables - la fabricación de cepillos de caucho - la fabricación de cañones para pipas de caucho endurecido - la fabricación de peines, horquillas, rulos y productos similares de caucho endurecido Esta clase comprende también: - la fabricación de materiales para la reparación del caucho - la fabricación de tejidos impregnados, bañados, recubiertos o estratificados con caucho, en los casos en que éste constituye el componente principal - la fabricación de colchones de caucho para camas de agua - la fabricación de gorros de baño y delantales de caucho - la fabricación de trajes de buceo y baño de caucho - la fabricación de artículos sexuales de caucho Esta clase no comprende: - la fabricación de tejidos acordonados para neumático (véase 13.96) - la fabricación de prendas de vestir de tejidos elásticos (véanse 14.14 y 14.19) - la fabricación de calzado de caucho (véase 15.20) - la fabricación de colas y adhesivos a base de caucho (véase 20.52) - la fabricación de bandas de rodadura (véase 22.11) - la fabricación de balsas y botes neumáticos (véanse 30.11 y 30.12) - la fabricación de colchones de caucho celular no recubierto (véase 31.03) - la fabricación artículos de deporte de caucho, excepto prendas de vestir (véase 32.30) - la fabricación de juegos y juguetes de caucho (incluidas piscinas para niños, barc… @es
scope note: Cette classe comprend: - la fabrication d’autres articles en caoutchouc naturel ou synthétique, non vulcanisé, vulcanisé ou durci, tels que: • plaques, feuilles, bandes, baguettes et profilés • tubes et tuyaux • courroies transporteuses ou de transmission • articles d’hygiène: préservatifs, tétines, bouillottes, etc. • articles de vêtements en caoutchouc (simplement collés, non assemblés par couture) • semelles de chaussures en caoutchouc et autres parties de chaussures en caoutchouc • fils et cordes en caoutchouc • fils et tissus caoutchoutés • bagues, anneaux, joints, rondelles et accessoires • revêtements de cylindres • matelas pneumatiques • ballons gonflables - la fabrication de brosses en caoutchouc - la fabrication de tuyaux de pipe en caoutchouc dur - la fabrication de peignes, de barrettes, de bigoudis et d’articles similaires en caoutchouc dur Cette classe comprend également: - la fabrication de matériaux de réparation en caoutchouc - la fabrication de tissus imprégnés, enduits ou recouverts de caoutchouc ou stratifiés avec cette même matière, si le caoutchouc est l’élément principalement utilisé - la fabrication de matelas à eau en caoutchouc - la fabrication de bonnets de bain et de tabliers en caoutchouc - la fabrication de combinaisons humides et de combinaisons de plongée en caoutchouc - la fabrication d’objets sexuels en caoutchouc Cette classe ne comprend pas: - la fabrication de nappes tramées pour pneumatiques, voir 13.96 - la fabrication d’articles d’habillement en tissus élastiques, voir 14.14 et 14.19 - la fabrication de chaussures en caoutchouc, voir 15.20 - la fabrication de colles et d’adhésifs à base de caoutchouc, voir 20.52 - la fabrication de profilés, voir 22.11 - la fabrication de bateaux et de radeaux gonflables, voir 30.11 et 30.12 - la fabrication de matelas en caoutchouc alvéolaire non recouvert, voir 31.03 - la fabrication d’articles de sport en caoutchouc, à l’exception des vêtements, voir 32.30 - la fabrication de jeux et de jou… @fr
scope note: Ovaj razred uključuje: - proizvodnju ostalih proizvoda od prirodnog ili sintetičkog kaučuka, vulkanizirane ili nevulkanizirane ili tvrde gume: • gumenih ploča, folija, vrpca, šipki, profila • cijevi i crijeva • pogonskog ili transportnog remenja od gume • higijenskih predmeta od gume: prezervativa, izdajalica za mlijeko, termofora itd. • gumenih dijelova odjeće (samo ako su slijepljeni zajedno, ne šivani) • gumenih konaca i konopaca • gumiranih prediva i tkanine • gumenih prstenova, prirubnica i brtvila • gumenih prekrivača za kotače • madraca za napuhavanje od gume • balona na napuhavanje - proizvodnju gumenih četki - proizvodnju poklopaca na cjevovodima pare od tvrde gume - proizvodnju češalja, ukosnica, uvijača za kosu i sličnih predmeta Ovaj razred također uključuje: - proizvodnju gumenih materijala za popravak - proizvodnju impregniranih tekstilnih tkanina, prevučenih, prekrivenih ili laminiranih s gumom, ako je guma glavni sastojak - proizvodnju gumenih madraca za vodene krevete - proizvodnju gumenih kapa za kupanje i pregača - proizvodnju gumenih kostima za kupanje i ronilačkih odijela - proizvodnju gumenih seksi-predmeta Ovaj razred isključuje: - proizvodnju tekstilnoga korda za vanjske gume, vidi 13.96 - proizvodnju odjeće od elastičnih tkanina, vidi 14.14, 14.19 - proizvodnju gumene obuće, vidi 15.20 - proizvodnju ljepila i ljepljivih sredstava na bazi kaučuka, vidi 20.52 - proizvodnju profiliranih vrpca sa šarama, vidi 22.11 - proizvodnju čamaca i brodova na napuhavanje, vidi 30.11, 30.12 - proizvodnju nepresvučenog madraca od pjenaste gume, vidi 31.03 - proizvodnju sportskih rekvizita od gume, osim odjeće, vidi 32.30 - proizvodnju igara i igračaka od gume (uključujući dječje bazene, dječje brodove na napuhavanje, gumene životinje na napuhavanje, lopte i slično), vidi 32.40 - popravak probušenih guma, vidi 38.32
scope note: Į šią klasę įeina: - kitų natūralios ar sintetinės gumos nevulkanizuotų, vulkanizuotų ar kietintų gaminių gamyba: • guminių plokščių, lakštų, juostelių, strypų, profilių • vamzdžių, vamzdelių ir žarnų • guminių konvejerių juostų, pavarų diržų ar diržinių pavarų • guminių higienos gaminių: prezervatyvų tipo kontraceptinių priemonių, čiulptukų, karšto vandens pūslių ir kt. • guminių drabužių reikmenų (jei tik sujungti, o ne susiūti) • guminių padų ir kitų guminių avalynės dalių • guminių siūlų ir virvių • gumuotų verpalų ir audinių • guminių žiedų, movų ir sandariklių • guminių ritinėlių dangų • pripučiamųjų guminių čiužinių • pripučiamųjų balionų - guminių šepečių gamyba - pypkių kandiklių iš ebonito gamyba - ebonitinių šukų, plaukų segtukų, plaukų suktukų ir panašių gaminių gamyba Į šią klasę taip pat įeina: - guminių remonto medžiagų gamyba - guma įmirkytų, padengtų, aptrauktų ar laminuotų tekstilės gaminių, kai guma yra pagrindinė sudedamoji dalis, gamyba - guminių vandens lovų čiužinių gamyba - guminių maudymosi kepuraičių ir prijuosčių gamyba - guminių naro kostiumų ir skafandrų gamyba - guminių sekso reikmenų gamyba Į šią klasę neįeina: - padangų kordo audinių gamyba, žr. 13.96 - tampriųjų audinių drabužių gamyba, žr. 14.14, 14.19 - guminės avalynės gamyba, žr. 15.20 - klijinių ir lipniųjų medžiagų su gumos pagrindu gamyba, žr. 20.52 - protektorių juostų gamyba, žr. 22.11 - pripučiamųjų plaustų ir valčių gamyba, žr. 30.11, 30.12 - čiūžinių iš nedengtos akytosios gumos gamyba, žr. 31.03 - guminių sportinių reikmenų, išskyrus drabužius, gamyba, žr. 32.30 - guminių žaidimų ir žaislų, įskaitant negilius vaikų baseinus, pripučiamąsias vaikiškas gumines valtis, pripučiamuosius guminius gyvūnėlius, kamuolius ir pan., gamyba, žr. 32.40 - gumos regeneravimas, žr. 38.32 @lt
scope note: Этот класс включает: - производство пластиковых изделий для упаковки товаров: • пластиковых пакетов, мешков, емкостей, коробок, ящиков, бутылей, бутылок и т.д. Этот класс исключает: - производство багажных сумок и дамских сумочек из пластика, см. 15.12 @ru
scope note: Bu sınıf aşağıdakileri kapsamaktadır; - doğal veya sentetik kauçuk ürünleri imalatı, (vulkanize edilmemiş, vulkanize edilmiş veya sertleştirilmiş): • kauçuk tabakalar, levhalar, şeritler, çubuklar, profil şekiller, • borular, pipetler, hortumlar, • kauçuk taşıma veya kasnak bağları ya da kayışları, • kauçuk hijyenik ürünler: gebelik önleyici prezervatifler, emzikler, sıcak su torbaları, biberonlar vb., • giyim eşyalarının kauçuk parçaları, (dikişsiz olarak bir araya getirilenler) • kauçuk tabanlar ve ayakkabıların diğer kauçuk parçaları, • kauçuk iplik ve halat, • kauçukla kaplanmış iplik ve dokumalar • kauçuktan halka, bağlantı parçaları ve contalar, • kauçukla kaplanmış silindirik ürünler, • şişme kauçuk yataklar, • şişirilebilir kauçuk balonlar. - kauçuktan fırçaların imalatı, - sert kauçuktan pipo saplarının imalatı, - sert kauçuktan tarakların, saç iğnelerinin, bigudilerin ve benzerlerinin imalatı. Ayrıca bu sınıf aşağıdakileri de kapsamaktadır; - kauçuk tamir malzemeleri imalatı, - ana bileşenin kauçuk olduğu durumlarda, kauçuk ile kaplanmış, emdirilmiş ya da lamine edilmiş tekstil kumaşlarının imalatı, - kauçuktan su yatağı şiltelerinin imalatı, - kauçuktan bonelerin ve önlüklerin imalatı, - kauçuktan balık adam elbiselerinin ve dalgıç elbiselerinin imalatı, - kauçuktan seks eşyalarının imalatı. Kapsam dışı olanlar; - lastik kord bezi imalatı, bkz. 13.96, - elastik giyim eşyası kumaşlarının imalatı, bkz. 14.14, 14.19, - lastik ayakkabı imalatı, bkz. 15.20, - kauçuk bazlı tutkalların ve yapışkanların imalatı, bkz. 20.52, - `sırt geçirme` şeritleri imalatı, bkz. 22.11, - şişirilebilir sal ve botların imalatı, bkz. 30.11, 30.12, - kaplanmamış gözenekli kauçuktan yatakların imalatı, bkz. 31.03, - kauçuktan spor malzemeleri imalatı, (kıyafetler hariç), bkz. 32.30, - kauçuktan oyunların ve oyuncakların (çocuklar için küçük havuzlar, çocuklar için kauçuktan şişme botlar, kauçuktan şişme hayvanlar, toplar ve benzerleri dahil) imalatı, bkz. 32.40, - kauçuğun yeniden k… @tr
preferred label: Производство на други изделия от каучук @bg
preferred label: Výroba ostatních pryžových výrobků @cs
preferred label: Fremstilling af andre gummiprodukter @da
preferred label: Herstellung von sonstigen Gummiwaren @de
preferred label: Κατασκευή άλλων προϊόντων από ελαστικό (καουτσούκ) @el
preferred label: Fabricación de otros productos de caucho @es
preferred label: Muude kummitoodete tootmine @et
preferred label: Muiden kumituotteiden valmistus @fi
preferred label: Fabrication d'autres articles en caoutchouc @fr
preferred label: Egyéb gumitermék gyártása
preferred label: Fabbricazione di altri prodotti in gomma @it
preferred label: Kitų guminių gaminių gamyba @lt
preferred label: Citu gumijas izstrādājumu ražošana @lv
preferred label: Manifattura ta' prodotti oħra tal-lasktu @mt
preferred label: Vervaardiging van andere producten van rubber @nl
preferred label: Produksjon av gummiprodukter ellers @no
preferred label: Produkcja pozostałych wyrobów z gumy @pl
preferred label: Fabricação de outros produtos de borracha @pt
preferred label: Fabricarea altor produse din cauciuc @ro
preferred label: Производство прочих резиновых изделий @ru
preferred label: Výroba ostatných výrobkov z gumy @sk
preferred label: Proizvodnja drugih izdelkov iz gume @sl
preferred label: Annan gummivarutillverkning @sv
preferred label: Diğer kauçuk ürünleri imalatı @tr
broader: Manufacture of rubber products

Manufacture of plastic products
type: Concept
notation: 22.2
status: valid
status modified: 2013-10-18
accepted date: 2013-10-18
in scheme: Statistical Classification of Economic Activities in the European Community, Rev. 2 (2008)
scope note: преработване на нови или използвани (рециклирани) пластмаси в междинни или крайни продукти, като се използват следните процеси: формоване чрез пресоване (формоване чрез директно пресоване), екструдиране, леене под налягане (шприцоване), формоване чрез раздуване и леене. Посредством тези производствени процеси се получават много разнообразни продукти. @bg
scope note: Tato skupina zahrnuje zpracování primárních nebo již použitých (tzn. recyklovaných) umělých pryskyřic na polotovary nebo konečné výrobky výrobními postupy jako je tvarové lisování, vytlačování, vstřikování, vyfukování a lití. Ve většině případů výrobní postup zahrnuje výrobu široké palety výrobků. @cs
scope note: Diese Gruppe umfasst die Verarbeitung von neuen oder gebrauchten (d. h. rückgewonnenen) Kunststoffharzen zu Halbfertig- oder Fertigwaren durch Formpressen, Extrudieren, Spritzgießen, Blasformen und –gießen. In den meisten Fällen erlaubt das Fertigungsverfahren die Herstellung einer breiten Palette von Erzeugnissen. @de
scope note: This group comprises processing new or spent (i.e., recycled) plastics resins into intermediate or final products, using such processes as compression moulding; extrusion moulding; injection moulding; blow moulding; and casting. For most of these, the production process is such that a wide variety of products can be made. @en
scope note: Este grupo comprende la transformación de resinas de plástico nuevas o usadas (es decir, recicladas) en productos intermedios o finales, utilizando procesos tales como el moldeo por compresión, el moldeo por extrusión, el moldeo por inyección, el moldeo por soplado y el vaciado. En la mayoría de los casos el proceso de producción permite la elaboración de una amplia gama de productos. @es
scope note: Ce groupe comprend la transformation de résines synthétiques nouvelles ou réutilisées (recyclées) en produits intermédiaires ou finis en utilisant des processus tels que: moulage par compression, moulage par extrusion, moulage par injection, moulage par soufflage et fonderie. Dans la plupart des cas, les processus de production sont tels que les produits en résultant sont très diversifiés. @fr
scope note: Ova skupina uključuje preradu nove ili stare (tj. reciklirane) plastične smole u međuproizvode ili finalne proizvode, koristeći se procesima kao što su kompresijsko modeliranje; ekstruzijsko modeliranje, modeliranje ubrizgavanjem, modeliranje puhanjem i lijevanjem. Za većinu tih metoda proizvodni proces je takav da može poslužiti za proizvodnju najrazličitijih proizvoda.
scope note: Ši grupę sudaro naujų arba panaudotų (t.y. perdirbtų) plastikinių dervų perdirbimas į tarpinius arba galutinius produktus, naudojant tokius procesus, kaip presavimas, ekstruzinis štampavimas, liejamasis formavimas, formavimas išpūtimu ir liejimas. Daugumos jų gamybos procesas yra toks, kad gali būti gaminama daugybė skirtingų gaminių. @lt
scope note: Этот класс включает: - производство строительных пластиковых изделий: • пластиковых дверей, окон, рам, ставней, опалубков • емкостей • пластиковых покрытий, облицовок для стен и потолков в виде рулонов, плиток, пластин или прочих форм напольных покрытий и т.д. • пластиковых предметов гигиены, таких как ванны, душевые кабины, раковины, унитазы, водосливные бачки и т.д. - производство эластичных покрытий, таких как винил, линолеум - производство искусственного камня (например, обработанного мрамора) @ru
scope note: Bu grup, yeni ya da kullanılmış (örn. yeniden dönüştürülmüş) her hangi bir plastik maddenin işlenerek ara ürün ya da nihai ürün oluşturulmasını kapsamaktadır, kullanılan bu işlemlere örnek olarak basınç uygulayarak kalıplama; çekilerek kalıplama; içeri atılarak kalıplama; darbe ile kalıplama; ve kalıba dökme gösterilebilir. Bunların bir çoğu için üretim süreci öyle geniştir ki birçok değişik çeşit ürün meydana getirilebilir. @tr
preferred label: Производство на изделия от пластмаси @bg
preferred label: Výroba plastových výrobků @cs
preferred label: Fremstilling af plastprodukter @da
preferred label: Herstellung von Kunststoffwaren @de
preferred label: Κατασκευή πλαστικών προϊόντων @el
preferred label: Manufacture of plastics products @en
preferred label: Fabricación de productos de plástico @es
preferred label: Plasttoodete tootmine @et
preferred label: Muovituotteiden valmistus @fi
preferred label: Fabrication de produits en plastique @fr
preferred label: Műanyag termék gyártása
preferred label: Fabbricazione di articoli in materie plastiche @it
preferred label: Plastikinių gaminių gamyba @lt
preferred label: Plastmasas izstrādājumu ražošana @lv
preferred label: Manifattura ta' prodotti oħra tal-plastik @mt
preferred label: Vervaardiging van producten van kunststof @nl
preferred label: Produksjon av plastprodukter @no
preferred label: Produkcja wyrobów z tworzyw sztucznych @pl
preferred label: Fabricação de artigos de matérias plásticas @pt
preferred label: Fabricarea articolelor din material plastic @ro
preferred label: Производство пластмассовых изделий @ru
preferred label: Výroba plastových výrobkov @sk
preferred label: Proizvodnja plastičnih izdelkov @sl
preferred label: Plastvarutillverkning @sv
preferred label: Plastik ürünlerin imalatı @tr
broader: Manufacture of rubber and plastic products
narrower: Manufacture of plastic plates, sheets, tubes and profiles
narrower: Manufacture of plastic packing goods
narrower: Manufacture of builders’ ware of plastic
narrower: Manufacture of other plastic products

Manufacture of plastic plates, sheets, tubes and profiles
type: Concept
notation: 22.21
status: valid
status modified: 2013-10-18
accepted date: 2013-10-18
in scheme: Statistical Classification of Economic Activities in the European Community, Rev. 2 (2008)
scope note: - производство на междинни продукти от пластмаси: • плочи, листа, фолио, ленти, пластини и други (дори самозалепващи) - производство на готови продукти от пластмаси: • тръби, маркучи и съединителни части за тях (колена, муфи и други) - производство на целофан - производство на пластмаси в първични форми - 20.16 - производство на изделия от естествен или синтетичен каучук - 22.1 @bg
scope note: Z: - výrobu polotovarů z plastů: • desek, bloků, filmů, folií, pásů atd. (i samolepících) - výrobu konečných výrobků z plastů: • hadic a trubek, tvarovek, spojek, uzávěrů apod. - celofánových pásů a listů N: - výrobu plastů v primárních formách (20.16) - výrobu výrobků z přírodního nebo syntetického kaučuku (22.1) @cs
scope note: Diese Klasse umfasst: - Herstellung von Halbfertigerzeugnissen aus Kunststoffen: • Tafeln, Platten, Blöcke, Filme, Folien, Streifen usw. (auch selbstklebend) - Herstellung von Fertigerzeugnissen aus Kunststoffen: • Schläuche und Rohre, Form-, Verschluss- und Verbindungsstücke • Zellglasband oder -bögen Diese Klasse umfasst nicht: - Herstellung von Kunststoffen in Primärformen (s. 20.16) - Herstellung von Erzeugnissen aus synthetischem oder natürlichem Kautschuk (s. 22.1) @de
scope note: This class includes: - manufacture of semi-manufactures of plastic products: • plastic plates, sheets, blocks, film, foil, strip etc. (whether self-adhesive or not) - manufacture of finished plastic products: • plastic tubes, pipes and hoses; hose and pipe fittings • cellophane film or sheet This class excludes: - manufacture of plastics in primary forms, see 20.16 - manufacture of articles of synthetic or natural rubber, see 22.1 @en
scope note: Esta clase comprende: - la fabricación de productos semielaborados de materias plásticas: • placas, planchas, bloques, películas, láminas, bandas, etc. de plástico (autoadhesivo o no) - la fabricación de productos acabados de plástico: • tubos, conductos y mangueras de plástico, accesorios para tuberías y mangueras • película o lámina de celofán Esta clase no comprende: - la fabricación de plásticos en sus formas primarias (véase 20.16) - la fabricación de artículos de caucho sintético o natural (véase 22.1) @es
scope note: Cette classe comprend: - la fabrication de produits semi-finis en matières plastiques: • plaques, feuilles, blocs, pellicules, bandes, lames (que ces articles soient adhésifs ou non), etc. - la fabrication de produits finis en matières plastiques: • tubes, tuyaux et accessoires de tuyauterie en plastique • films ou feuilles de cellophane Cette classe ne comprend pas: - la fabrication de matières plastiques sous formes primaires, voir 20.16 - la fabrication d’articles en caoutchouc naturel ou synthétique, voir 22.1 @fr
scope note: Ovaj razred uključuje: - proizvodnju poluproizvoda od plastike: • plastičnih ploča, listova, blokova, folija, filmova, vrpca, traka itd. (samoljepljivih ili ne) - proizvodnju gotovih proizvoda od plastike: • plastičnih cijevi i crijeva te pribora za njihovo spajanje - celofanskih filmova i listova Ovaj razred isključuje: - proizvodnju plastike u primarnim oblicima, vidi 20.16 - proizvodnju predmeta od sintetičkog ili prirodnoga kaučuka, vidi 22.1
scope note: Į šią klasę įeina: - plastikinių pusgaminių gamyba: • plastikinių plokščių, lakštų, blokų, plėvelių, folijos, juostelių ir kt. (nesvarbu, savaime limpančių ar ne) - baigtų plastikinių gaminių gamyba: • plastikinių vamzdžių, vamzdelių ir žarnų bei žarnų ir vamzdžių jungiamųjų detalių - celofano plėvelių arba lakštų Į šią klasę neįeina - pirminių plastikų gamyba, žr. 20.16 - sintetinės ar natūralios gumos dirbinių gamyba, žr. 22.1 @lt
scope note: Этот класс включает: - производство столовых, кухонных и туалетных принадлежностей - производство различных изделий из пластика: • пластиковых головных уборов, изоляционного оснащения, частей осветительных приборов, офисных или школьных принадлежностей, предметов одежды (бесшовных), мебельной фурнитуры, статуэток, трансмиссионных и конвейерных ремней, самоклеющейся пленки, пластиковых задников для обуви, пластиковых держателей для сигарет и сигар, расчесок и бигуди, прочих мелких предметов из пластмассы и т.д. Этот класс исключает: - производство пластмассовых багажных сумок, см. 15.12 - производство пластиковой обуви, см. 15.20 - производство пластиковой мебели, см. 31.01, 31.02, 31.09 - производство безобтяжных матрасов из пористого пластика, см. 31.03 - производство пластиковых спортивных принадлежностей, см. 32.30 - производство пластиковых игр и игрушек, см. 32.40 - производство пластиковых медицинских и зубоврачебных принадлежностей, см. 32.50 - производство пластиковых офтальмологических принадлежностей, см. 32.50 - производство пластиковых касок и прочих защитных принадлежностей, см. 32.99 @ru
scope note: Bu sınıf aşağıdakileri kapsamaktadır; - plastikten yarı mamul ürünlerin imalatı: • plastik tabaka, levha, blok, film, folyo, şerit vb. (kendinden yapışkanlı olsun veya olmasın). - mamul plastik ürünlerin imalatı: • plastik tüpler, borular ve hortumlar; boru ve hortum bağlantı elemanları. - selefon film, şerit veya levha Kapsam dışı olanlar; - birincil formda plastik imalatı, bkz. 20.16, - sentetik veya doğal kauçuk ürünleri imalatı, bkz. 22.1. @tr
preferred label: Производство на листове, плочи, тръби и профили, от пластмаси @bg
preferred label: Výroba plastových desek, fólií, hadic, trubek a profilů @cs
preferred label: Fremstilling af plader, ark, rør og slanger samt profiler af plast @da
preferred label: Herstellung von Platten, Folien, Schläuchen und Profilen aus Kunststoffen @de
preferred label: Κατασκευή πλαστικών πλακών, φύλλων, σωλήνων και ειδών καθορισμένης μορφής @el
preferred label: Fabricación de placas, hojas, tubos y perfiles de plástico @es
preferred label: Plastplaatide, -lehtede, -torude ja -profiilide tootmine @et
preferred label: Muovilevyjen, -kalvojen, -putkien ja -profiilien valmistus @fi
preferred label: Fabrication de plaques, feuilles, tubes et profilés en matières plastiques @fr
preferred label: Műanyag lap, lemez, fólia, cső, profil gyártása
preferred label: Fabbricazione di lastre, fogli, tubi e profilati in materie plastiche @it
preferred label: Plastikinių plokščių, lakštų, vamzdžių ir profiliuočių gamyba @lt
preferred label: Plastmasas plātņu, lokšņu, cauruļu un profilu ražošana @lv
preferred label: Manifattura ta' platti, folji, tubi u profili tal-plastik @mt
preferred label: Vervaardiging van platen, vellen, buizen en profielen, van kunststof @nl
preferred label: Produksjon av halvfabrikater av plast @no
preferred label: Produkcja płyt, arkuszy, rur i kształtowników z tworzyw sztucznych @pl
preferred label: Fabricação de chapas, folhas, tubos e perfis de plástico @pt
preferred label: Fabricarea plăcilor, foliilor, tuburilor şi profilelor din material plastic @ro
preferred label: Производство пластмассовых листов, камер для шин и профилей @ru
preferred label: Výroba plastových dosiek, fólií, hadíc a profilov @sk
preferred label: Proizvodnja plošč, folij, cevi in profilov iz plastičnih mas @sl
preferred label: Tillverkning av plasthalvfabrikat @sv
preferred label: Plastik tabaka, levha, tüp ve profil imalatı @tr
broader: Manufacture of plastic products

Manufacture of plastic packing goods
type: Concept
notation: 22.22
status: valid
status modified: 2013-10-18
accepted date: 2013-10-18
in scheme: Statistical Classification of Economic Activities in the European Community, Rev. 2 (2008)
scope note: - производство на опаковки от пластмаси: • кутии, каси, щайги, торби, торбички, пликове (дори напечатани), бутилки, флакони, бидони и други подобни - производство на куфари, чанти и подобни изделия за пътуване от пластмаси - 15.12 @bg
scope note: Z: - výrobu plastových obalů: • pytlů, sáčků, beden, krabic, demižonů, lahví atd. N: - výrobu kufrů, kabelek apod. z plastů (15.12) @cs
scope note: Diese Klasse umfasst: - Herstellung von Verpackungsmitteln aus Kunststoffen: • Beutel, Säcke, Container, Kisten, Ballons, Flaschen usw. Diese Klasse umfasst nicht: - Herstellung von Koffern und Handtaschen aus Kunststoff (s. 15.12) @de
scope note: This class includes: - manufacture of plastic articles for the packing of goods: • plastic bags, sacks, containers, boxes, cases, carboys, bottles etc. This class excludes: - manufacture of luggage and handbags of plastic, see 15.12 @en
scope note: Esta clase comprende: - la fabricación de artículos de embalaje de materias plásticas: • bolsas, sacos, cajas, cajones, bombonas, botellas, etc. Esta clase no comprende: - la fabricación de artículos de viaje y bolsos de plástico (véase 15.12) @es
scope note: Cette classe comprend: - la fabrication d’articles d’emballage en matières plastiques: • sacs, sachets, conteneurs, boîtes, caisses, bonbonnes, bouteilles, etc. Cette classe ne comprend pas: - la fabrication d’articles de voyage et d’articles de maroquinerie en plastique, voir 15.12 @fr
scope note: Ovaj razred uključuje: - proizvodnju predmeta od plastike za pakiranje robe: • plastičnih vrećica, vreća, kutija, sanduka, balona, boca itd. Ovaj razred isključuje: - proizvodnju plastičnih kovčega i torba, vidi 15.12
scope note: Į šią klasę įeina: - plastikinių dirbinių prekėms pakuoti gamyba: • plastikinių krepšių, maišų, konteinerių, dėžių, skrynučių, didbutelių, butelių ir kt. Į šią klasę neįeina: - plastikinių lagaminų ir rankinių gamyba, žr. 15.12 @lt
scope note: Данный раздел включает производственные виды деятельности, относящиеся к выпуску изделий на минеральной основе. Данный раздел включает производство стекла и изделий из стекла (например, плоского стекла, полого стекла, стекловолокна, технического оснащения и т.д.), керамических изделий, напольных покрытий, кафеля, черепицы, терракотовых изделий, цемента и штукатурки от сырья до готовых изделий. Производство отделочного камня и прочей минеральной продукции также включено в данный раздел. @ru
scope note: Bu sınıf aşağıdakileri kapsamaktadır; - malların ambalajlanması için gerekli plastik malzemelerin imalatı: • plastik torbalar, çuvallar, sandıklar, kutular, kasalar, damacanalar, şişeler vb. Kapsam dışı olanlar; - plastik bavul ve el çantası imalatı, bkz. 15.12. @tr
preferred label: Производство на опаковки от пластмаси @bg
preferred label: Výroba plastových obalů @cs
preferred label: Fremstilling af plastemballage @da
preferred label: Herstellung von Verpackungsmitteln aus Kunststoffen @de
preferred label: Κατασκευή πλαστικών ειδών συσκευασίας @el
preferred label: Fabricación de envases y embalajes de plástico @es
preferred label: Plasttaara tootmine @et
preferred label: Muovipakkausten valmistus @fi
preferred label: Fabrication d'emballages en matières plastiques @fr
preferred label: Műanyag csomagolóeszköz gyártása
preferred label: Fabbricazione di imballaggi in materie plastiche @it
preferred label: Plastikinių pakuočių gamyba @lt
preferred label: Plastmasas iepakojuma ražošana @lv
preferred label: Manifattura ta' oġġetti ta' l-ippakkjar magħmula mill-plastik @mt
preferred label: Vervaardiging van verpakkingsmateriaal van kunststof @nl
preferred label: Produksjon av plastemballasje @no
preferred label: Produkcja opakowań z tworzyw sztucznych @pl
preferred label: Fabricação de embalagens de plástico @pt
preferred label: Fabricarea articolelor de ambalaj din material plastic @ro
preferred label: Производство пластиковых упаковок для товаров @ru
preferred label: Výroba plastových obalov @sk
preferred label: Proizvodnja embalaže iz plastičnih mas @sl
preferred label: Plastförpackningstillverkning @sv
preferred label: Plastik torba, çanta, poşet, çuval, kutu, damacana, şişe, makara vb. paketleme malzemelerinin imalatı @tr
broader: Manufacture of plastic products

Manufacture of builders’ ware of plastic
type: Concept
notation: 22.23
status: valid
status modified: 2013-10-18
accepted date: 2013-10-18
in scheme: Statistical Classification of Economic Activities in the European Community, Rev. 2 (2008)
scope note: - производство на дограма и изделия от пластмаси за строителството: • врати, прозорци и техните каси, капаци, щори, первази • резервоари и цистерни • пластмасови подови настилки и облицовки за стени и тавани, на роли, плочи или други форми • изделия със санитарно-хигиенно предназначение: вани, мивки, душове, бидета, тоалетни чинии, казанчета за тоалетни и други подобни изделия - производство на линолеум и подобни еластични подови настилки - производство на полимермрамор @bg
scope note: Z: - výrobu plastových výrobků pro stavebnictví: • dveří, oken, rámů, rolet, žaluzií, rolet, okenic a ochranných lišt • nádrží, cisteren, jímek, bazénů apod. • podlahových krytin, obkladů stěn a stropů v rolích nebo ve formě obkládaček, desek, tašek atd. • plastového sanitárního a hygienického vybavení, jako jsou koupací a sprchové vany, umyvadla, dřezy, záchodové mísy a bidety, splachovací nádrže atd. - výrobu pružných podlahových krytin, např. z vinylu, linolea atd. - výrobu umělého kamene (např. umělého mramoru) @cs
scope note: Diese Klasse umfasst: - Herstellung von Baubedarfsartikeln aus Kunststoffen: • Türen, Fenster, Rahmen, Rollläden, Jalousien und Randleisten • Sammelbehälter und Tanks • Bodenbeläge, Wand- oder Deckenverkleidungen in Rollen oder in Form von Fliesen oder Platten usw. • Bade- und Duschwannen, Wasch- und Spülbecken, WC- und Bidetbecken, Spülkästen usw., aus Kunststoff - Herstellung von elastischen Bodenbelägen, z. B. aus Vinyl, Linoleum usw. - Herstellung von Kunststein (z. B. Kunstmarmor) @de
scope note: This class includes: - manufacture of builders' plastics ware: • plastic doors, windows, frames, shutters, blinds, skirting boards • tanks, reservoirs • plastic floor, wall or ceiling coverings in rolls or in the form of tiles etc. • plastic sanitary ware like plastic baths, shower baths, washbasins, lavatory pans, flushing cisterns etc. - manufacture of resilient floor coverings, such as vinyl, linoleum etc. - manufacture of artificial stone (e.g. cultured marble) @en
scope note: Esta clase comprende: - la fabricación de productos de materias plásticas para la construcción: • puertas, ventanas, marcos, cierres, persianas y zócalos, de plástico • tanques, depósitos • revestimientos de plástico para suelos, paredes o techos en rollos o en forma de losetas, etc. • artículos de plástico de uso sanitario como bañeras, platos de ducha, lavabos, tazas de inodoro, cisternas, etc. - la fabricación de revestimientos de suelos resistentes, como vinilo, linóleo, etc. - la fabricación de piedra artificial (por ejemplo, mármol artificial) @es
scope note: Cette classe comprend: - la fabrication d’articles en matières plastiques pour la construction tels que: • portes, fenêtres et leurs cadres et chambranles, volets, stores, plinthes • cuves, foudres, réservoirs • revêtements de sols, de murs et de plafonds sous forme de rouleaux, de dalles, de carreaux, etc., en matières plastiques • articles en matières plastiques pour usages sanitaires ou hygiéniques, par exemple: baignoires, douches, lavabos, bidets, cuvettes d’aisance, réservoirs de chasse, etc. - la fabrication de revêtements de sols résistants, en vinyle ou en linoléum, etc. - la fabrication de pierre artificielle (par exemple: le marbre de culture) @fr
scope note: Ovaj razred uključuje: - proizvodnju proizvoda od plastike za građevinarstvo: • vrata, prozora, okvira, zaslona (tenda), rubnih letvica • tankova, rezervoara • podnih, zidnih, plafonskih obloga, u rolama ili u obliku pločica itd., od plastike • sanitarne robe od plastike kao što su kade, tuš-kade, umivaonici, zahodske školjke, vodokotlići itd. - proizvodnju savitljivih podnih prekrivača kao što su vinil, linoleum itd. - proizvodnju umjetnoga kamena (npr. kultiviranog mramora)
scope note: Į šią klasę įeina: - plastikinių statybos dirbinių gamyba: • plastikinių durų, langų, staktų, anginių, žaliuzių, grindjuosčių • bakų, rezervuarų • plastikinių grindų, sienų ar lubų dangų ritinių ar plytelių pavidalo ir kt. • plastikinių sanitarinių dirbinių, pvz., plastikinių vonių, dušų, praustuvių, unitazų, klozetų bakelių ir kt., gamyba - tampriųjų grindų dangų, tokių kaip viniplastis, linoleumas, gamyba - dirbtinio akmens (pvz., lieto marmuro) gamyba @lt
scope note: Данная группа включает производство всех видов стекла, изготовленных любыми способами и изделий из стекла. @ru
scope note: Bu sınıf aşağıdakileri kapsamaktadır; - plastik inşaat malzemesi imalatı: • plastik kapılar, pencereler, çerçeveler, panjurlar, güneşlikler, süpürgelikler (PVC`den olanlar dahil), • plastik tanklar, rezervuarlar (depolar), • rulo ya da karo vb. şekilde plastik zemin, duvar ya da tavan kaplamaları, • plastikten sıhhi ürünler: plastik banyolar, duşakabinler, lavabolar, klozetler (kapakları dahil), su fışkırtan sifonlar vb., - vinil, muşamba gibi esnek yer kaplamalarının imalatı. - plastik suni taş imalatı @tr
preferred label: Производство на дограма и други изделия от пластмаси за строителството @bg
preferred label: Výroba plastových výrobků pro stavebnictví @cs
preferred label: Fremstilling af bygningsartikler af plast @da
preferred label: Herstellung von Baubedarfsartikeln aus Kunststoffen @de
preferred label: Κατασκευή πλαστικών οικοδομικών υλικών @el
preferred label: Fabricación de productos de plástico para la construcción @es
preferred label: Plastist ehitustoodete tootmine @et
preferred label: Rakennusmuovien valmistus @fi
preferred label: Fabrication d'éléments en matières plastiques pour la construction @fr
preferred label: Műanyag építőanyag gyártása
preferred label: Fabbricazione di articoli in plastica per l'edilizia @it
preferred label: Plastikinių statybos dirbinių gamyba @lt
preferred label: Plastmasas būvelementu ražošana @lv
preferred label: Manifattura ta' oġġetti tal-plastik li jintużaw fil-bini @mt
preferred label: Vervaardiging van kunststofartikelen voor de bouw @nl
preferred label: Produksjon av byggevarer av plast @no
preferred label: Produkcja wyrobów z tworzyw sztucznych dla budownictwa @pl
preferred label: Fabricação de artigos de plástico para a construção @pt
preferred label: Fabricarea articolelor din material plastic pentru construcţii @ro
preferred label: Производство строительных пластиковых изделий @ru
preferred label: Výroba výrobkov z plastu pre stavebníctvo @sk
preferred label: Proizvodnja izdelkov iz plastičnih mas za gradbeništvo @sl
preferred label: Byggplastvarutillverkning @sv
preferred label: Plastik inşaat malzemesi imalatı @tr
broader: Manufacture of plastic products

Manufacture of other plastic products
type: Concept
notation: 22.29
status: valid
status modified: 2013-10-18
accepted date: 2013-10-18
in scheme: Statistical Classification of Economic Activities in the European Community, Rev. 2 (2008)
scope note: - производство на домакински, кухненски и тоалетни изделия, от пластмаси - производство на разнообразни изделия от пластмаси: • изолационни части и части за осветители и мебели, канцеларски и училищни изделия, облекло и допълнения за него, които не са "съединени" чрез шиене, а само слепени, статуетки и други предмети за украса, трансмисионни ремъци и транспортни ленти, самозалепващи се ленти, части за обувки, калъпи за обувки, цигарета и мундщуци, гребени, ролки за коса, дребни украшения и други - производство на куфари, чанти и подобни изделия за пътуване от пластмаси - 15.12 - производство на обувки от пластмаси - 15.20 - производство на мебели от пластмаси - 31.01, 31.02, 31.09 - производство на необвити дюшеци от порести пластмаси - 31.03 - производство на спортни принадлежности от пластмаси - 32.30 - производство на игри и играчки от пластмаси - 32.40 - производство на медицински и зъболекарски изделия от пластмаси - 32.50 - производство на офталмологични стоки от пластмаси - 32.50 - производство на предпазни каски и други лични предпазни средства от пластмаси - 32.99 @bg
scope note: Z: - výrobu nádobí a kuchyňského vybavení a toaletních potřeb z plastů - výrobu různých výrobků z plastů: • plastových pokrývek hlavy, izolačního příslušenství, příslušenství ke svítidlům, kancelářských a školních potřeb, oděvů (pouze svařovaných nebo lepených, nikoli šitých), plastového kování a příslušenství k nábytku, ozdobných předmětů (např. sošek), hnacích řemenů, dopravníkových pásů, samolepících plastových pásek, obuvnických kopyt, cigaretových a doutníkových špiček, hřebenů, natáček, dekoračních a zábavných předmětů atd. - pokovování plastových předmětů N: - výrobu cestovních kufrů a tašek z plastů (15.12) - výrobu plastové obuvi (15.20) - výrobu plastového nábytku (31.01, 31.02, 31.09) - výrobu matrací z nepotahovaného lehčeného plastu (31.03) - výrobu sportovních potřeb kromě sportovních oděvů z plastů (32.30) - výrobu hraček a her z plastů (32.40) - výrobu léčebných a dentálních pomůcek z plastů (32.50) - výrobu brýlí, kontaktních čoček, potřeb pro oční lékaře a optiky z plastů (32.50) - výrobu ochranných přileb a jiného vybavení pro osobní bezpečnost (32.99) @cs
scope note: Diese Klasse umfasst: - Herstellung von Geschirr und anderen Haushaltsartikeln sowie Toilettenartikeln aus Kunststoffen - Herstellung von verschiedenen Kunststoffwaren: • aus Kunststoff gefertigte Kopfbedeckungen, Isolierteile, Beleuchtungszubehör, Büro- und Schulbedarf, Bekleidungsartikel (die lediglich geschweißt oder geklebt wurden), Möbelbeschläge, Statuetten, Treibriemen, Förderbänder, selbstklebende Kunststoffbänder, Schuhleisten, Zigarren- und Zigarettenmundstücke, Kämme, Haarwickler, Dekorations- und Scherzartikel usw. Diese Klasse umfasst nicht: - Herstellung von Koffern und Taschen aus Kunststoff (s. 15.12) - Herstellung von Kunststoffschuhen (s. 15.20) - Herstellung von Kunststoffmöbeln (s. 31.01, 31.02, 31.09) - Herstellung von nichtüberzogenen Schaumstoffmatratzen (s. 31.03) - Herstellung von Sportzubehör aus Kunststoffen (s. 32.30) - Herstellung von Spielen und Spielzeug aus Kunststoffen (s. 32.40) - Herstellung von medizinischen und zahnmedizinischen Apparaten und Geräten aus Kunststoffen (s. 32.50) - Herstellung von Brillen, Haftschalen, Augenarzt- und Optikerbedarf aus Kunststoffen (s. 32.50) - Herstellung von Schutzhelmen und anderer persönlicher Sicherheitsausrüstung (s. 32.99) @de
scope note: This class includes: - manufacture of plastic tableware, kitchenware and toilet articles - manufacture of diverse plastic products: • plastic headgear, insulating fittings, parts of lighting fittings, office or school supplies, articles of apparel (if only sealed together, not sewn), fittings for furniture, statuettes, transmission and conveyer belts, self-adhesive tapes of plastic, plastic shoe lasts, plastic cigar and cigarette holders, combs, plastics hair curlers, plastics novelties, etc. This class excludes: - manufacture of plastic luggage, see 15.12 - manufacture of plastic footwear, see 15.20 - manufacture of plastic furniture, see 31.01, 31.02, 31.09 - manufacture of mattresses of uncovered cellular plastic, see 31.03 - manufacture of plastic sports requisites, see 32.30 - manufacture of plastic games and toys, see 32.40 - manufacture of plastic medical and dental appliances, see 32.50 - manufacture of plastic ophthalmic goods, see 32.50 - manufacture of plastics hard hats and other personal safety equipment of plastics, see 32.99 @en
scope note: Esta clase comprende: - la fabricación de servicios de mesa, utensilios de cocina y artículos de tocador, de plástico - la fabricación de productos de plástico diversos: • sombrerería, aislamientos, piezas para lámparas y accesorios de iluminación, artículos de escritorio y para uso escolar, prendas de vestir (sólo cuando las piezas se unen por adhesión y no por costura), guarniciones para muebles, estatuillas, cintas transportadoras y de transmisión, cintas de plástico autoadhesivas, hormas de zapato de plástico, boquillas de plástico para cigarrillos y puros, peines, rizadores de pelo, artículos promocionales y de regalo de plástico, etc. Esta clase no comprende: - la fabricación de artículos de viaje de plástico (véase 15.12) - la fabricación de calzado de plástico (véase 15.20) - la fabricación de mobiliario de plástico (véanse 31.01, 31.02 y 31.09) - la fabricación de colchones de plástico celular no recubierto (véase 31.03) - la fabricación de artículos de plástico para deporte (véase 32.30) - la fabricación de juegos y juguetes de plástico (véase 32.40) - la fabricación de accesorios de plástico para medicina, cirugía y odontología (véase 32.50) - la fabricación de artículos ópticos de plástico (véase 32.50) - la fabricación de cascos de plástico y otro equipo de seguridad de plástico (véase 32.99) @es
scope note: Cette classe comprend: - la fabrication de vaisselle et d’autres articles pour le service de la table ou de la cuisine et d’articles d’hygiène ou de toilette en matières plastiques - la fabrication de produits divers en matières plastiques: • coiffures, pièces isolantes, parties d’appareils d’éclairage, fournitures de bureau et fournitures scolaires, articles d’habillement (simplement collés, non assemblés par couture), garnitures pour meubles, statuettes, courroies transporteuses ou de transmission, bandes auto-adhésives en matière plastique, formes à chaussures en plastique, portes-cigares et porte-cigarettes en plastique, peignes, bigoudis, gadgets en plastique, etc. Cette classe ne comprend pas: - la fabrication d’articles de voyage en plastique, voir 15.12 - la fabrication de chaussures en plastique, voir 15.20 - la fabrication de meubles en matières plastiques, voir 31.01, 31.02 et 31.09 - la fabrication de matelas en matières plastiques alvéolaires non recouvertes, voir 31.03 - la fabrication d’articles de sport en matières plastiques, voir 32.30 - la fabrication de jeux et de jouets en matières plastiques, voir 32.40 - la fabrication d’articles à usages médicaux et dentaires en matières plastiques, voir 32.50 - la fabrication de produits ophtalmiques en matières plastiques, voir 32.50 - la fabrication de casques en plastique et d’autres équipements personnels de sécurité en matières plastiques, voir 32.99 @fr
scope note: Ovaj razred uključuje: - proizvodnju stolnog i kuhinjskog posuđa te predmeta za toaletnu upotrebu od plastike - proizvodnju raznovrsnih proizvoda od plastike: • plastičnih kaciga, izolacijskog pribora, dijelova pribora za rasvjetu, uredske i školske opreme, odjevnih predmeta (samo ako su slijepljeni zajedno, ne šivani), pribora za namještaj, figurica, prijenosnog i pogonskog remenja, samoljepljivih plastičnih vrpca, plastičnih zidnih tapeta, plastičnih postolarskih kalupa, plastičnih držača za cigare i cigarete, češljeva, uvijača za kosu, plastičnih noviteta itd. Ovaj razred isključuje: - proizvodnju putnih potrepština od plastike (kovčega i torba), vidi 15.12 - proizvodnju obuće od plastike, vidi 15.20 - proizvodnju namještaja od plastike, vidi 31.01, 31.02, 31.09 - proizvodnju nepresvučenih madraca od pjenaste plastike, vidi 31.03 - proizvodnju sportskih rekvizita od plastike, vidi 32.30 - proizvodnju igara i igračaka od plastike, vidi 32.40 - proizvodnju medicinskog i zubarskog pribora od plastike, vidi 32.50 - proizvodnju optičkih elemenata od plastike, vidi 32.50 - proizvodnju plastičnih kaciga i ostale osobne sigurnosne opreme od plastike, vidi 32.99
scope note: Į šią klasę įeina: - plastikinių valgomųjų reikmenų, virtuvės indų bei tualeto reikmenų gamyba - įvairios paskirties plastikinių dirbinių gamyba: • plastikinių galvos apdangalų, izoliacinių jungiamųjų detalių, apšvietimo įrangos detalių, įstaigų ar mokyklos reikmenų, drabužių reikmenų (jei tik sujungti, o ne susiūti), baldų jungiamųjų detalių, statulėlių, pavarų diržų, konvejerių juostų, lipniųjų plastikinių juostų, plastikinių batų kurpalių, plastikinių portsigarų cigarams ir cigaretėms, šukų, plastikinių plaukų suktukų, plastikinių smulkių pigių prekių ir kt. Į šią klasę neįeina: - plastikinių lagaminų gamyba, žr. 15.12 - plastikinės avalynės gamyba, žr. 15.20 - plastikinių baldų gamyba, žr. 31.01, 31.02, 31.09 - čiužinių iš nedengto akytojo plastiko gamyba, žr. 31.03 - plastikinių sporto reikmenų gamyba, žr. 32.30 - plastikinių žaidimų ir žaislų gamyba, žr. 32.40 - plastikinių medicinos ir odontologijos reikmenų gamyba, žr. 32.50 - plastikinių oftalmologijos prekių gamyba, žr. 32.50 - plastikinių apsauginių šalmų ir kitų plastikinių asmeninių saugos priemonių gamyba, žr. 32.99 @lt
scope note: Этот класс включает: - производство плоского стекла, включая армированное проволокой стекло, цветное или тонированное стекло @ru
scope note: Bu sınıf aşağıdakileri kapsamaktadır; - plastik sofra takımları, mutfak takımları ve tuvalet eşyalarının imalatı, - çeşitli plastik ürünlerin imalatı: • plastik başlık, izolasyon bağlantı parçaları, aydınlatma malzemelerinin plastik parçaları, plastikten büro ve okul gereçleri, plastik giyim eşyaları (dikişsiz olarak bir araya getirilenler), mobilyalar için plastik parçalar, plastikten biblo, taşıyıcı bantlar ve konveyör bantları, kendinden yapışan plastik manyetik bantlar, plastik duvar kağıtları, plastik ayakkabı topukları, plastikten sigara ağızlık ve tabakaları, plastik taraklar, plastik saç bigudileri, plastik tuhafiye eşyaları vb. Kapsam dışı olanlar; - plastik bavul ve benzeri bagaj eşyalarının imalatı, bkz. 15.12, - plastik ayakkabı imalatı, bkz. 15.20, - plastik mobilya imalatı, bkz. 31.01, 31.02, 31.09, - kaplanmamış gözenekli kauçuktan yatak imalatı, bkz. 31.03, - plastik spor malzemelerinin imalatı, bkz. 32.30, - plastik oyunlar ve oyuncakların imalatı, bkz. 32.40, - tıbbi, ve dişçilikle ilgili plastik uygulama ürünlerinin imalatı, bkz. 32.50, - göz sağlığında (oftalmoloji) kullanılan plastik maddelerin imalatı, bkz. 32.50, - plastikten yapılmış sert şapkalar ve diğer kişisel koruyucu donanımların imalatı, bkz. 32.99. @tr
preferred label: Производство на други изделия от пластмаси @bg
preferred label: Výroba ostatních plastových výrobků @cs
preferred label: Fremstilling af andre plastprodukter @da
preferred label: Herstellung von sonstigen Kunststoffwaren @de
preferred label: Κατασκευή άλλων πλαστικών προϊόντων @el
preferred label: Fabricación de otros productos de plástico @es
preferred label: Muude plasttoodete tootmine @et
preferred label: Muiden muovituotteiden valmistus @fi
preferred label: Fabrication d'autres articles en matières plastiques @fr
preferred label: Egyéb műanyag termék gyártása
preferred label: Fabbricazione di altri articoli in materie plastiche @it
preferred label: Kitų plastikinių gaminių gamyba @lt
preferred label: Citu plastmasas izstrādājumu ražošana @lv
preferred label: Manifattura ta' prodotti oħra ta' plastik @mt
preferred label: Vervaardiging van andere producten van kunststof @nl
preferred label: Produksjon av plastprodukter ellers @no
preferred label: Produkcja pozostałych wyrobów z tworzyw sztucznych @pl
preferred label: Fabricação de outros artigos de plástico @pt
preferred label: Fabricarea altor produse din material plastic @ro
preferred label: Производство прочих пластмассовых изделий @ru
preferred label: Výroba ostatných plastových výrobkov @sk
preferred label: Proizvodnja drugih izdelkov iz plastičnih mas @sl
preferred label: Annan plastvarutillverkning @sv
preferred label: Diğer plastik ürünlerin imalatı @tr
broader: Manufacture of plastic products

Manufacture of other non-metallic mineral products
type: Concept
notation: 23
status: valid
status modified: 2013-10-18
accepted date: 2013-10-18
in scheme: Statistical Classification of Economic Activities in the European Community, Rev. 2 (2008)
scope note: производствени икономически дейности, всяка от които преработва отделни вещества от минерален произход. Тук се включва производство на стъкло и изделия от стъкло (плоско стъкло, стъклени влакна, стъклени изделия за домакинска и техническа употреба), на керамични изделия (тухли, керемиди и други изделия от печена глина), на цимент и гипс - от суровините до крайните изделия. обработване на строителни и декоративни скални материали и производството на изделия от други неметални минерали. @bg
scope note: Tento oddíl zahrnuje výrobní činnosti, které se váží k jednomu (převažujícímu) materiálu nerostného původu. Oddíl zahrnuje výrobu skla a skleněných výrobků (např. ploché sklo, duté sklo, skleněná vlákna, výrobky z technického skla atd.), keramických výrobků, cihel a výrobků z pálené hlíny, cementu a sádry, a to v celé škále od surovin ke konečným výrobkům. Tento oddíl rovněž zahrnuje výrobu opracovaných a tvarovaných přírodních kamenů a ostatních výrobků z nerostných materiálů. @cs
scope note: Diese Abteilung umfasst die Herstellungstätigkeiten unter Verwendung eines einzigen Stoffs mineralischen Ursprungs. Sie umfasst die Herstellung von Glas und Erzeugnissen daraus (z. B. Flachglas, Hohlglas, Glasfasern, technische Glaswaren usw.), keramischen Erzeugnissen, Ziegeln und Erzeugnissen aus gebranntem Ton sowie Zement und Gips, und zwar von den Rohstoffen bis hin zu den Fertigwaren. Die Herstellung von be- und verarbeiteten Naturwerksteinen und Natursteinen und sonstigen Mineralerzeugnissen ist in diese Abteilung ebenfalls eingeordnet. @de
scope note: This division includes manufacturing activities related to a single substance of mineral origin. This division includes the manufacture of glass and glass products (e.g. flat glass, hollow glass, fibres, technical glassware etc.), ceramic products, tiles and baked clay products, and cement and plaster, from raw materials to finished articles. The manufacture of shaped and finished stone and other mineral products is also included in this division. @en
scope note: Esta división comprende las actividades de fabricación relacionadas con una única sustancia de origen mineral. La división comprende la fabricación de vidrio y productos de vidrio (p. ej., vidrio plano, vidrio hueco, fibras, artículos de vidrio de uso técnico, etc.), productos de cerámica, losetas y productos de arcilla cocida, y cemento y yeso, desde las materias primas hasta los artículos acabados. Esta división se completa con las actividades de corte y acabado de la piedra y otros productos minerales. @es
scope note: Cette division comprend différentes activités manufacturières relatives chacune à un même matériau d’origine minérale. Cette division comprend l’industrie du verre sous toutes ses formes (verre plat, verre creux, fibres, articles techniques, etc.), celle des produits céramiques, carreaux et matériaux en terre cuite, ainsi que les filières du ciment et du plâtre, de la matière première jusqu’aux articles finis. Enfin, le travail de la pierre et des autres produits minéraux figure aussi dans cette division. @fr
scope note: Ovaj odjeljak uključuje proizvodne djelatnosti koje se odnose na pojedinačnu supstanciju mineralnog podrijetla. Također uključuje proizvodnju stakla i proizvoda od stakla (npr. ravno staklo, šuplje staklo, vlakna, tehničku robu od stakla itd.), keramičkih proizvoda, pločica i proizvoda od pečene gline, cementa i žbuke, od sirovina do gotovih proizvoda. Proizvodnja oblikovanog i gotovoga kamena te ostalih mineralnih proizvoda također je uključena u ovaj odjeljak.
scope note: Į šį skyrių įeina apdirbamosios gamybos veiklos rūšys, susijusios su tos pačios kilmės mineralinėmis medžiagomis. Į šį skyrių įeina stiklo ir stiklo gaminių (pvz., plokščiasis stiklas, tuščiaviduris stiklas, stiklo pluoštai, techniniai stikliniai indai ir kt.), keramikos gaminių, čerpių ir degtojo molio dirbinių, cemento ir gipso, nuo žaliavų iki gatavų dirbinių, gamyba. Į šį skyrių taip pat įeina supjaustytų ir apdailintų akmenų bei kitų mineralinių produktų gamyba. @lt
scope note: Этот класс включает: - производство усиленного или многослойного плоского стекла - производство зеркал - производство многослойных изолирующих предметов из стекла @ru
scope note: Bu bölüm, mineral kaynaklı tek bir madde ile ilgili olan imalat faaliyetlerini kapsamaktadır. Bu bölüm, cam ve cam ürünleri (örn. düz cam, çukur camlar, elyaf, teknik cam eşya vb.), seramik ürünleri, tuğla, kiremit ve fırınlanmış kil ürünleri ile tutkal ve sıva ürünleri gibi ham maddelerden nihai ürünler imalatını da kapsamaktadır. Şekillendirilmiş ve kullanıma hazır hale getirilmiş taş ve diğer mineral ürünlerin imalatı da bu bölüme dahildir. @tr
preferred label: Производство на изделия от други неметални минерални суровини @bg
preferred label: Výroba ostatních nekovových minerálních výrobků @cs
preferred label: Fremstilling af andre ikke-metalholdige mineralske produkter @da
preferred label: Herstellung von Glas und Glaswaren, Keramik, Verarbeitung von Steinen und Erden @de
preferred label: Παραγωγή άλλων μη μεταλλικών ορυκτών προϊόντων @el
preferred label: Fabricación de otros productos minerales no metálicos @es
preferred label: Muude mittemetalsetest mineraalidest toodete tootmine @et
preferred label: Muiden ei-metallisten mineraalituotteiden valmistus @fi
preferred label: Fabrication d'autres produits minéraux non métalliques @fr
preferred label: Nemfém ásványi termék gyártása
preferred label: Fabbricazione di altri prodotti della lavorazione di minerali non metalliferi @it
preferred label: Kitų nemetalo mineralinių produktų gamyba @lt
preferred label: Nemetālisko minerālu izstrādājumu ražošana @lv
preferred label: Manifattura ta' prodotti oħra mhux metalliċi @mt
preferred label: Vervaardiging van andere niet-metaalhoudende minerale producten @nl
preferred label: Produksjon av andre ikke-metallholdige mineralprodukter @no
preferred label: Produkcja wyrobów z pozostałych mineralnych surowców niemetalicznych @pl
preferred label: Fabricação de outros produtos minerais não metálicos @pt
preferred label: Fabricarea altor produse din minerale nemetalice @ro
preferred label: Производство прочей неметаллической минеральной продукции @ru
preferred label: Výroba ostatných nekovových minerálnych výrobkov @sk
preferred label: Proizvodnja nekovinskih mineralnih izdelkov @sl
preferred label: Tillverkning av andra icke-metalliska mineraliska produkter @sv
preferred label: Diğer metalik olmayan mineral ürünlerin imalatı @tr
broader: MANUFACTURING
narrower: Manufacture of glass and glass products
narrower: Manufacture of refractory products
narrower: Manufacture of clay building materials
narrower: Manufacture of other porcelain and ceramic products
narrower: Manufacture of cement, lime and plaster
narrower: Manufacture of articles of concrete, cement and plaster
narrower: Cutting, shaping and finishing of stone
narrower: Manufacture of abrasive products and non-metallic mineral products n.e.c.

Manufacture of glass and glass products
type: Concept
notation: 23.1
status: valid
status modified: 2013-10-18
accepted date: 2013-10-18
in scheme: Statistical Classification of Economic Activities in the European Community, Rev. 2 (2008)
scope note: Тази група включва производство на стъкло и изделия от него в разнообразни форми, произведени чрез различни технологични процеси. @bg
scope note: Tato skupina zahrnuje sklo a skleněné výrobky v jakékoliv podobě vyráběné jakoukoliv metodou. @cs
scope note: Diese Gruppe umfasst Glas, in beliebigem Verfahren und jeglicher Form hergestellt, sowie Glaswaren @de
scope note: This group includes glass in all its forms, made by any process, and articles of glass. @en
scope note: Este grupo comprende la fabricación, por cualquier proceso, de vidrio en todas sus formas, y de artículos de vidrio. @es
scope note: Ce groupe comprend le verre sous toutes ses formes, quel que soit le procédé de fabrication et les articles verriers. @fr
scope note: Ova skupina uključuje staklo u svim oblicima, izrađeno bilo kojom vrstom proizvodnog procesa, kao i predmete od stakla.
scope note: Į šią grupę įeina visų formų, įvairiais būdais apdirbto stiklo bei stiklo dirbinių ir gaminių gamyba. @lt
scope note: Этот класс включает: - производство бутылок и прочих емкостей из стекла или хрусталя - производство стаканов, фужеров, рюмок, бокалов, чашек и прочих бытовых изделий из стекла или хрусталя Этот класс исключает: - производство стеклянных игрушек, см. 32.40 @ru
scope note: Bu grup, her hangi bir işlem yapılmış cam ve cam eşyalarının tüm biçimlerini kapsamaktadır. @tr
preferred label: Производство на стъкло и изделия от стъкло @bg
preferred label: Výroba skla a skleněných výrobků @cs
preferred label: Fremstilling af glas og glasprodukter @da
preferred label: Herstellung von Glas und Glaswaren @de
preferred label: Κατασκευή γυαλιού και προϊόντων από γυαλί @el
preferred label: Fabricación de vidrio y productos de vidrio @es
preferred label: Klaasi ja klaastoodete tootmine @et
preferred label: Lasin ja lasituotteiden valmistus @fi
preferred label: Fabrication de verre et d'articles en verre @fr
preferred label: Üveg, üvegtermék gyártása
preferred label: Fabbricazione di vetro e di prodotti in vetro @it
preferred label: Stiklo ir stiklo gaminių bei dirbinių gamyba @lt
preferred label: Stikla un stikla izstrādājumu ražošana @lv
preferred label: Manifattura ta' ħġieġ u prodotti tal-ħġieġ @mt
preferred label: Vervaardiging van glas en glaswerk @nl
preferred label: Produksjon av glass og glassprodukter @no
preferred label: Produkcja szkła i wyrobów ze szkła @pl
preferred label: Fabricação de vidro e artigos de vidro @pt
preferred label: Fabricarea sticlei şi a articolelor din sticlă @ro
preferred label: Производство стекла и изделий из стекла @ru
preferred label: Výroba skla a výrobkov zo skla @sk
preferred label: Proizvodnja stekla in steklenih izdelkov @sl
preferred label: Glas- och glasvarutillverkning @sv
preferred label: Cam ve cam ürünleri imalatı @tr
broader: Manufacture of other non-metallic mineral products
narrower: Manufacture of flat glass
narrower: Shaping and processing of flat glass
narrower: Manufacture of hollow glass
narrower: Manufacture of glass fibres
narrower: Manufacture and processing of other glass, including technical glassware

Manufacture of flat glass
type: Concept
notation: 23.11
status: valid
status modified: 2013-10-18
accepted date: 2013-10-18
in scheme: Statistical Classification of Economic Activities in the European Community, Rev. 2 (2008)
scope note: - производство на плоско стъкло, вкл. армирано, оцветено или матово @bg
scope note: Z: - výrobu plochého skla, včetně skla s drátěnou vložkou, barevného nebo tónovaného skla @cs
scope note: Diese Klasse umfasst: - Herstellung von Flachglas, auch mit Drahteinlagen verstärkt, gefärbt oder getönt @de
scope note: This class includes: - manufacture of flat glass, including wired, coloured or tinted flat glass @en
scope note: Esta clase comprende: - la fabricación de vidrio plano, incluido el vidrio armado, coloreado o tintado @es
scope note: Cette classe comprend: - la fabrication de verre plat, y compris le verre plat armé, coloré ou teinté @fr
scope note: Ovaj razred uključuje: - proizvodnju ravnog stakla, uključujući armirano, obojeno ili matirano ravno staklo
scope note: Į šią klasę įeina: - plokščiojo stiklo, įskaitant armuotąjį, spalvotąjį ar tamsintąjį, gamyba @lt
scope note: Этот класс включает: - производство стекловолокна, включая стекловату и прочие нетканые материалы Этот класс исключает: - производство тканых материалов из стекловолокна, см. 13.20 - производство оптоволоконных кабелей для передачи данных или прямой передачи изображений, см. 27.31 @ru
scope note: Bu sınıf aşağıdakileri kapsamaktadır; - düz cam imalatı, (telli, renkli veya boyalı düz cam dahil). @tr
preferred label: Производство на необработено плоско стъкло @bg
preferred label: Výroba plochého skla @cs
preferred label: Fremstilling af planglas @da
preferred label: Herstellung von Flachglas @de
preferred label: Κατασκευή επίπεδου γυαλιού @el
preferred label: Fabricación de vidrio plano @es
preferred label: Lehtklaasi tootmine @et
preferred label: Tasolasin valmistus @fi
preferred label: Fabrication de verre plat @fr
preferred label: Síküveg gyártás
preferred label: Fabbricazione di vetro piano @it
preferred label: Plokščiojo stiklo gamyba @lt
preferred label: Lokšņu stikla ražošana @lv
preferred label: Manifattura ta' ħġieġ ċatt @mt
preferred label: Vervaardiging van vlakglas @nl
preferred label: Produksjon av planglass @no
preferred label: Produkcja szkła płaskiego @pl
preferred label: Fabricação de vidro plano @pt
preferred label: Fabricarea sticlei plate @ro
preferred label: Производство листового стекла @ru
preferred label: Proizvodnja ravnega stekla @sl
preferred label: Framställning av planglas @sv
preferred label: Düz cam imalatı @tr
broader: Manufacture of glass and glass products

Shaping and processing of flat glass
type: Concept
notation: 23.12
status: valid
status modified: 2013-10-18
accepted date: 2013-10-18
in scheme: Statistical Classification of Economic Activities in the European Community, Rev. 2 (2008)
scope note: - производство на предпазно стъкло: закалено (темперирано) и формирано от залепени листа - производство на огледала от стъкло - производство на изолиращо многослоесто стъкло за сгради (стъклопакети) @bg
scope note: Z: - výrobu tvrzeného nebo vrstveného skla - výrobu skleněných zrcadel - výrobu izolačních skel (z několika tabulí skla) @cs
scope note: Diese Klasse umfasst: - Herstellung von gehärtetem oder Mehrschichtenglas - Herstellung von Glasspiegeln - Herstellung von mehrschichtigen Isolierverglasungen @de
scope note: This class includes: - manufacture of toughened or laminated flat glass - manufacture of glass mirrors - manufacture of multiple-walled insulating units of glass @en
scope note: Esta clase comprende: - la fabricación de vidrio plano endurecido o laminado - la fabricación de espejos de vidrio - la fabricación de aisladores de vidrio de varias capas @es
scope note: Cette classe comprend: - la fabrication de verre plat trempé ou formé de feuilles contre-collées - la fabrication de miroirs en verre - la fabrication de vitrages isolants à parois multiples @fr
scope note: Ovaj razred uključuje: - proizvodnju ojačanog ili laminiranoga ravnog stakla - proizvodnju ogledala - proizvodnju višeslojno izoliranih jedinica stakla
scope note: Į šią klasę įeina: - grūdintojo ar daugiasluoksnio plokščiojo stiklo gamyba - veidrodinio stiklo gamyba - stiklo blokų su sudėtinėmis izoliacinėmis pertvaromis gamyba @lt
scope note: Этот класс включает: - производство лабораторных, гигиенических или фармацевтических принадлежностей и оборудования - производство стекол для всех видов часов в т.ч. наручных часов, оптического стекла и оптических элементов, оптически не обработанных - производство стеклянных деталей, используемых для изготовления искусственных драгоценностей - производство изоляционных материалов и гарнитуры из стекла - производство плафонов для осветительных приборов - производство статуэток из стекла - производство перекрывного бруса и брусчатки из стекла - производство стеклянного штапика Этот класс исключает: - производство оптически обработанных оптических элементов, см. 26.70 - производство шприцов и прочего медицинского лабораторного оборудования, см. 32.50 @ru
scope note: Bu sınıf aşağıdakileri kapsamaktadır; - sertleştirilmiş emniyet camı ve temperli düz cam imalatı, - cam ayna imalatı, - çok katlı yalıtım camlarının imalatı. @tr
preferred label: Формуване и обработване на плоско стъкло @bg
preferred label: Tvarování a zpracování plochého skla @cs
preferred label: Formning og forarbejdning af planglas @da
preferred label: Veredlung und Bearbeitung von Flachglas @de
preferred label: Μορφοποίηση και κατεργασία επίπεδου γυαλιού @el
preferred label: Manipulado y transformación de vidrio plano @es
preferred label: Lehtklaasi vormimine ja töötlemine @et
preferred label: Tasolasin muotoilu ja muokkaus @fi
preferred label: Façonnage et transformation du verre plat @fr
preferred label: Síküveg továbbfeldolgozása
preferred label: Lavorazione e trasformazione del vetro piano @it
preferred label: Plokščiojo stiklo pjaustymas ir apdorojimas @lt
preferred label: Lokšņu stikla formēšana un apstrāde @lv
preferred label: Iffurmar u pproċessar ta' ħġieġ ċatt @mt
preferred label: Vormen en bewerken van vlakglas @nl
preferred label: Bearbeiding av planglass @no
preferred label: Kształtowanie i obróbka szkła płaskiego @pl
preferred label: Moldagem e transformação de vidro plano @pt
preferred label: Prelucrarea şi fasonarea sticlei plate @ro
preferred label: Формирование и обработка листового стекла @ru
preferred label: Tvarovanie a spracovanie plochého skla @sk
preferred label: Oblikovanje in obdelava ravnega stekla @sl
preferred label: Bearbetning av planglas @sv
preferred label: Düz camın şekillendirilmesi ve işlenmesi @tr
broader: Manufacture of glass and glass products

Manufacture of hollow glass
type: Concept
notation: 23.13
status: valid
status modified: 2013-10-18
accepted date: 2013-10-18
in scheme: Statistical Classification of Economic Activities in the European Community, Rev. 2 (2008)
scope note: - производство на бутилки, флакони, буркани, тубички и други съдове, за транспорт на стоки и опаковки, от стъкло или кристал - производство на чаши и други домакински изделия, от стъкло или кристал - производство на играчки от стъкло - 32.40 @bg
scope note: Z: - výrobu lahví a ostatních nádob ze skla nebo křišťálového skla - výrobu sklenic a ostatních výrobků převážně pro domácnost ze skla nebo křišťálového skla N: - výrobu skleněných hraček (32.40) @cs
scope note: Diese Klasse umfasst: - Herstellung von Flaschen und sonstigen Behältnissen aus Glas oder Kristall - Herstellung von Trinkgläsern und sonstigen Haushaltswaren aus Glas oder Kristall Diese Klasse umfasst nicht: - Herstellung von Spielzeug aus Glas (s. 32.40) @de
scope note: This class includes: - manufacture of bottles and other containers of glass or crystal - manufacture of drinking glasses and other domestic glass or crystal articles This class excludes: - manufacture of glass toys, see 32.40 @en
scope note: Esta clase comprende: - la fabricación de botellas y otros recipientes, de vidrio o de cristal - la fabricación de vasos y otros artículos para el hogar, de vidrio o de cristal Esta clase no comprende: - la fabricación de juguetes de vidrio (véase 32.40) @es
scope note: Cette classe comprend: - la fabrication de bouteilles et d’autres récipients en verre ou en cristal - la fabrication de verres à boire et d’autres articles en verre ou en cristal à usage domestique Cette classe ne comprend pas: - la fabrication de jouets en verre, voir 32.40 @fr
scope note: Ovaj razred uključuje: - proizvodnju boca i ostale ambalaže od stakla ili kristala - proizvodnju čaša za piće i ostalih predmeta za kućanstvo od običnog stakla ili kristala Ovaj razred isključuje: - proizvodnju igračaka od stakla, vidi 32.40
scope note: Į šią klasę įeina: - butelių ir kitų stiklinių ar krištolinių talpyklų gamyba - stiklinių geriamųjų taurių ir kitų buitinių stiklinių ar krištolinių dirbinių gamyba Į šią klasę neįeina: - stiklinių žaislų gamyba, žr. 32.40 @lt
scope note: Bu sınıf aşağıdakileri kapsamaktadır; - camdan veya kristalden şişe ve diğer muhafaza ürünlerinin imalatı, - cam bardaklar, ev içinde kullanılan diğer cam eşya veya kristal eşyaların imalatı. Kapsam dışı olanlar; - cam oyuncakların imalatı, bkz. 32.40. @tr
preferred label: Производство на опаковки и домакинско стъкло @bg
preferred label: Výroba dutého skla @cs
preferred label: Fremstilling af flasker, drikkeglas mv. @da
preferred label: Herstellung von Hohlglas @de
preferred label: Κατασκευή κοίλου γυαλιού @el
preferred label: Fabricación de vidrio hueco @es
preferred label: Klaasanumate tootmine @et
preferred label: Onton lasin valmistus @fi
preferred label: Fabrication de verre creux @fr
preferred label: Öblösüveggyártás
preferred label: Fabbricazione di vetro cavo @it
preferred label: Tuščiavidurio stiklo gamyba @lt
preferred label: Dobo stikla izstrādājumu ražošana @lv
preferred label: Manifattura ta' ħġieġ imħaffer @mt
preferred label: Vervaardiging van holglas @nl
preferred label: Produksjon av emballasje og husholdningsartikler av glass og krystall @no
preferred label: Produkcja szkła gospodarczego @pl
preferred label: Fabricação de vidro de embalagem e cristalaria (vidro oco) @pt
preferred label: Fabricarea articolelor din sticlă @ro
preferred label: Производство полых стеклянных изделий @ru
preferred label: Proizvodnja votlega stekla @sl
preferred label: Tillverkning av buteljer, glasförpackningar och husgeråd av glas @sv
preferred label: Çukur cam imalatı @tr
broader: Manufacture of glass and glass products

Manufacture of glass fibres
type: Concept
notation: 23.14
status: valid
status modified: 2013-10-18
accepted date: 2013-10-18
in scheme: Statistical Classification of Economic Activities in the European Community, Rev. 2 (2008)
scope note: - производство на стъклени влакна (вкл. стъклена вата) и нетъкани изделия от тези материали - производство на тъкани от стъклени влакна - 13.20 - производство на кабели от оптични влакна за пренос на данни или образ в реално време - 27.31 @bg
scope note: Z: - výrobu skleněných vláken včetně skelné vaty a netkaných výrobků ze skleněných vláken N: - výrobu tkanin ze skleněných vláken (13.20) - výrobu kabelů z optických vláken pro přenos dat a přímý přenos obrazu (27.31) @cs
scope note: Diese Klasse umfasst: - Herstellung von Glasfasern, einschließlich Glaswolle, und nichtgewebten Erzeugnissen daraus Diese Klasse umfasst nicht: - Herstellung von Geweben aus Glasfasern (s. 13.20) - Herstellung von Lichtleitfaserkabeln für die Datenübertragung und die Direktübertragung von Bildern (s. 27.31) @de
scope note: This class includes: - manufacture of glass fibres, including glass wool and non-woven products thereof This class excludes: - manufacture of woven fabrics of glass yarn, see 13.20 - manufacture of fibre optic cable for data transmission or live transmission of images, see 27.31 @en
scope note: Esta clase comprende: - la fabricación de fibra de vidrio, incluida la lana de vidrio y artículos sin tejer de esta fibra Esta clase no comprende: - la fabricación de tejidos a base de hilados de vidrio (véase 13.20) - la fabricación de cable de fibra óptica para la transmisión de datos y de imágenes en directo (véase 27.31) @es
scope note: Cette classe comprend: - la fabrication de fibres de verre, y compris la laine de verre et les produits non tissés en ces matières Cette classe ne comprend pas: - la fabrication de tissus en fils de verre, voir 13.20 - la fabrication de câbles de fibres optiques pour la transmission des données ou la transmission en direct d’images, voir 27.31 @fr
scope note: Ovaj razred uključuje: - proizvodnju staklenih vlakana, uključujući staklenu vunu i netkane proizvode od njih Ovaj razred isključuje: - proizvodnju tkanih tkanina od staklenih vlakana, vidi 13.20 - proizvodnju kablova od optičkih vlakana za prijenos podataka ili za prijenos slika ''uživo'', vidi 27.31
scope note: Į šią klasę įeina: - stiklo pluoštų, įskaitant stiklo vatą ir neaustinių gaminių iš jų gamyba Į šią klasę neįeina: - audinių iš stiklo siūlų gamyba, žr. 13.20 - skaidulinės optikos kabelių duomenims ar vaizdams tiesiogiai perduoti gamyba, žr. 27.31 @lt
scope note: Этот класс включает производство промежуточной продукции из природных не содержащих металл минералов, таких как, песок, гравий, галька или глина. Этот класс включает: - производство огнеупорного раствора, бетона и т.д. - производство огнеупорных керамических изделий: • теплоизоляционных керамических изделий из кремниевого порошка • огнеупорного кирпича, блоков и напольных покрытий и т.д. • реторт, тигелей, муфелей, форсунок, патрубков, трубок и т.д. Этот класс также включает: - производство огнеупорных изделий содержащих магнезит, доломит или хромит @ru
scope note: Bu sınıf aşağıdakileri kapsamaktadır; - cam elyafı imalatı (cam yünü ve bunlardan yapılmış dokuma dışı ürünler dahil). Kapsam dışı olanlar; - cam elyafından dokunmuş mensucatların imalatı, bkz. 13.20, - veri iletimi veya görüntülerin canlı olarak iletilmesi için fiber optik kabloların imalatı, bkz. 27.31. @tr
preferred label: Производство на стъклени влакна @bg
preferred label: Výroba skleněných vláken @cs
preferred label: Fremstilling af glasfiber @da
preferred label: Herstellung von Glasfasern und Waren daraus @de
preferred label: Κατασκευή ινών γυαλιού @el
preferred label: Fabricación de fibra de vidrio @es
preferred label: Klaaskiutootmine @et
preferred label: Lasikuitujen valmistus @fi
preferred label: Fabrication de fibres de verre @fr
preferred label: Üvegszálgyártás
preferred label: Fabbricazione di fibre di vetro @it
preferred label: Stiklo pluoštų gamyba @lt
preferred label: Stikla šķiedras ražošana @lv
preferred label: Manifattura ta' fibri tal-ħġieġ @mt
preferred label: Vervaardiging van glasvezels @nl
preferred label: Produksjon av glassfibrer @no
preferred label: Produkcja włókien szklanych @pl
preferred label: Fabricação de fibras de vidro @pt
preferred label: Fabricarea fibrelor din sticlă @ro
preferred label: Производство стекловолокна @ru
preferred label: Výroba sklenených vlákien @sk
preferred label: Proizvodnja steklenih vlaken @sl
preferred label: Tillverkning av glasfiber @sv
preferred label: Cam elyafı imalatı @tr
broader: Manufacture of glass and glass products

Manufacture and processing of other glass, including technical glassware
type: Concept
notation: 23.19
status: valid
status modified: 2013-10-18
accepted date: 2013-10-18
in scheme: Statistical Classification of Economic Activities in the European Community, Rev. 2 (2008)
scope note: - производство на стъклени лабораторни, хигиенни или фармацевтични изделия - производство на стъкло за часовници или очила, на оптично стъкло или оптични елементи, необработени оптически - производство на изделия, използвани в бижута имитация от стъкло - производство на електрически изолатори от стъкло - производство на отворени колби и тръби за електрически лампи от стъкло - производство на статуетки и други предмети за украса от стъкло - производство на павета от стъкло - производство на стъклени пръчки или тръби - производство на оптични елементи от стъкло, обработени оптически - 26.70 - производство на спринцовки и други медицински лабораторни изделия - 32.50 @bg
scope note: Z: - výrobu skleněných výrobků pro laboratoře a pro hygienické nebo farmaceutické účely - výrobu hodinových a hodinkových skel, optických skel a optických prvků, které nejsou opticky aktivní - výrobu skla k výrobě bižuterie - výrobu skleněných izolátorů a izolačního příslušenství - výrobu skleněných baněk žárovek a zářivek - výrobu skleněných figurek - výrobu skleněných výrobků pro stavebnictví, jako jsou obklady, dlažby, cihly, tašky apod. - výrobu skla v tyčích nebo trubkách N: - výrobu opticky aktivních optických prvků (26.70) - výrobu injekčních stříkaček a jiného zdravotnického laboratorního vybavení (32.50) - výrobu bižuterie (32.13) @cs
scope note: Diese Klasse umfasst: - Herstellung von Glaswaren für Laboratorien sowie hygienischen oder pharmazeutischen Bedarfsartikeln aus Glas - Herstellung von Uhrgläsern, optischem Glas und optisch nichtbearbeiteten optischen Bauteilen - Herstellung von Glas für Fantasieschmuck - Herstellung von Isolatoren und Isolierteilen aus Glas - Herstellung von Glaskolben und Glasrohren für Lampen - Herstellung von Glasfiguren - Herstellung von Glasbausteinen - Herstellung von Glas in Stangen oder Rohren Diese Klasse umfasst nicht: - Herstellung von optisch bearbeiteten optischen Bauteilen (s. 26.70) - Herstellung von Spritzen und anderer medizinischer Laborausrüstung (s. 32.50) @de
scope note: This class includes: - manufacture of laboratory, hygienic or pharmaceutical glassware - manufacture of clock or watch glasses, optical glass and optical elements not optically worked - manufacture of glassware used in imitation jewellery - manufacture of glass insulators and glass insulating fittings - manufacture of glass envelopes for lamps - manufacture of glass figurines - manufacture of glass paving blocks - manufacture of glass in rods or tubes This class excludes: - manufacture of optical elements optically worked, see 26.70 - manufacture of syringes and other medical laboratory equipment, see 32.50 @en
scope note: Esta clase comprende: - la fabricación de objetos de vidrio para laboratorio, higiene o farmacia - la fabricación de cristales para relojes, vidrio óptico y elementos de éste no trabajados ópticamente - la fabricación de artículos de vidrio empleados en bisutería - la fabricación de aisladores de vidrio y accesorios aislantes de vidrio - la fabricación de ampollas y envolturas de vidrio para lámparas - la fabricación de estatuillas de vidrio - la fabricación de baldosas de vidrio - la fabricación de vidrio en forma de varillas o tubos Esta clase no comprende: - la fabricación de elementos ópticos trabajados ópticamente (véase 26.70) - la fabricación de jeringas y otros materiales médicos de laboratorio (véase 32.50) @es
scope note: Cette classe comprend: - la fabrication de verrerie de laboratoire, d’hygiène ou de pharmacie - la fabrication de verres d’horlogerie et de verres analogues, de verres d’optique et d’éléments d’optique non travaillés optiquement - la fabrication de verrerie utilisée en bijouterie de fantaisie - la fabrication d’isolateurs et de pièces isolantes en verre - la fabrication d’enveloppes de verre pour lampes - la fabrication de figurines en verre - la fabrication de pavés de verre - la fabrication de verre en barres, baguettes ou tubes Cette classe ne comprend pas: - la fabrication d’éléments d’optique en verre travaillé optiquement, voir 26.70 - la fabrication de seringues et d’autres matériels de laboratoire d’analyses médicales, voir 32.50 @fr
scope note: Ovaj razred uključuje: - proizvodnju predmeta od stakla za laboratorijske, higijenske ili farmaceutske potrebe - proizvodnju stakla za ručne i ostale satove, optičkog stakla i optičkih elemenata koji nisu optički obrađeni - proizvodnju staklene robe koja se koristi u proizvodnji bižuterije - proizvodnju izolatora i izolatorskog pribora od stakla - proizvodnju staklenih kugli za svjetiljke - proizvodnju staklenih figurica - proizvodnju staklenih blokova za popločavanje - proizvodnju šipki i cijevi od stakla Ovaj razred isključuje: - proizvodnju optičkih elemenata, optički dorađenih, vidi 26.70 - proizvodnju štrcaljki za injekcije i ostale medicinsko-laboratorijske opreme, vidi 32.50
scope note: Į šią klasę įeina: - laboratorinių, higieninių ir farmacinių stiklinių gaminių gamyba - rankinių ir kitų laikrodžių stiklų, optinio stiklo ir optiškai neapdirbtų optinių elementų gamyba - stiklo dirbinių dirbtiniams juvelyriniams dirbiniams gamyba - stiklinių izoliatorių ir stiklinių izoliacinių jungiamųjų detalių gamyba - stiklinių gaubtų lempoms gamyba - stiklinių statulėlių gamyba - stiklinių grindinio trinkelių gamyba - stiklinių strypų ar vamzdžių gamyba Į šią klasę neįeina: - optiškai apdirbtų optinių elementų gamyba, žr. 26.70 - švirkštų ir kitos medicininės laboratorinės įrangos gamyba, žr. 32.50 @lt
scope note: Bu sınıf aşağıdakileri kapsamaktadır; - laboratuarlarda, hijyenik amaçlı veya eczalık da kullanılan cam eşyaların imalatı, - kol saati veya duvar saati camlarının, optik camların ve optik tarzda işlenmemiş olan optik eşyaların imalatı, - imitasyon ziynet eşyalarında kullanılan cam eşyaların imalatı, - cam izolasyon malzemelerinin ve cam izolasyon bağlantı parçalarının imalatı, - lambalar, kandiller, fenerler için cam muhafazaların imalatı, - camdan yapılan heykelciklerin imalatı, - camdan kaldırım bloklarının (tuğlalarının) imalatı, - camdan çubuk ve tüp imalatı. Kapsam dışı olanlar; - optik tarzda işlenmiş optik eşyaların imalatı, bkz. 26.70, - şırıngaların ve diğer tıbbi laboratuar malzemelerinin imalatı, bkz. 32.50. @tr
preferred label: Производство и обработване на други изделия от стъкло, вкл. за техническа употреба @bg
preferred label: Výroba a zpracování ostatního skla včetně technického @cs
preferred label: Fremstilling og bearbejdning af andet glas (herunder teknisk glas) @da
preferred label: Herstellung, Veredlung und Bearbeitung von sonstigem Glas einschließlich technischen Glaswaren @de
preferred label: Κατασκευή και κατεργασία άλλων ειδών γυαλιού, περιλαμβανομένου του γυαλιού για τεχνικές χρήσεις @el
preferred label: Fabricación y manipulado de otro vidrio, incluido el vidrio técnico @es
preferred label: Muu klaasi tootmine ja töötlemine, sh tehniline klaas @et
preferred label: Muu lasin valmistus ja muokkaus, mukaan lukien tekniset lasituotteet @fi
preferred label: Fabrication et façonnage d'autres articles en verre, y compris verre technique @fr
preferred label: Műszaki, egyéb üvegtermék gyártása
preferred label: Fabbricazione e lavorazione di altro vetro incluso il vetro per usi tecnici @it
preferred label: Kito stiklo, įskaitant skirto techninėms reikmėms, gamyba ir apdorojimas @lt
preferred label: Citu stikla izstrādājumu ražošana, ieskaitot tehniskā stikla izstrādājumus @lv
preferred label: Manifattura u ipproċessar ta' ħġieġ ieħor, inkluż oġġetti tal-ħġieġ tekniċi @mt
preferred label: Vervaardiging en bewerking van ander glas (inclusief technisch glaswerk) @nl
preferred label: Produksjon av teknisk glass og andre glassvarer @no
preferred label: Produkcja i obróbka pozostałego szkła, włączając szkło techniczne @pl
preferred label: Fabricação e transformação de outro vidro (incluindo vidro técnico) @pt
preferred label: Fabricarea de sticlărie tehnică @ro
preferred label: Производство и обработка прочих стеклянных изделий, включая технические @ru
preferred label: Výroba a spracovanie ostatného skla, vrátane technického skla @sk
preferred label: Proizvodnja in oblikovanje drugih vrst stekla ter tehničnih steklenih izdelkov @sl
preferred label: Tillverkning av andra glasvaror inklusive tekniska glasvaror @sv
preferred label: Diğer camların imalatı ve işlenmesi (teknik amaçlı cam eşyalar dahil) @tr
broader: Manufacture of glass and glass products

Manufacture of refractory products
type: Concept
notation: 23.2
status: valid
status modified: 2013-10-18
accepted date: 2013-10-18
in scheme: Statistical Classification of Economic Activities in the European Community, Rev. 2 (2008)
scope note: Этот класс включает: - производство неогнеупорных керамических изделий или настенной плитки, мозаики и т.д. - производство неогнеупорных керамических тротуарных плит и брусчатки Этот класс исключает: - производство искусственного камня (например, обработанного мрамора), см. 22.23 - производство огнеупорных керамических продуктов, см. 23.20 - производство керамического кирпича, напольных покрытий и кровельных материалов, см. 23.32 @ru
preferred label: Производство на огнеупорни изделия @bg
preferred label: Výroba žáruvzdorných výrobků @cs
preferred label: Fremstilling af ildfaste produkter @da
preferred label: Herstellung von feuerfesten keramischen Werkstoffen und Waren @de
preferred label: Παραγωγή πυρίμαχων προϊόντων @el
preferred label: Fabricación de productos cerámicos refractarios @es
preferred label: Tulekindlate toodete tootmine @et
preferred label: Tulenkestävien keraamisten tuotteiden valmistus @fi
preferred label: Fabrication de produits réfractaires @fr
preferred label: Tűzálló termék gyártása
preferred label: Fabbricazione di prodotti refrattari @it
preferred label: Ugniai atsparių gaminių gamyba @lt
preferred label: Ugunsizturīgo nemetālisko minerālu izstrādājumu ražošana @lv
preferred label: Manifattura ta' prodotti rifrattorji @mt
preferred label: Vervaardiging van vuurvaste producten @nl
preferred label: Produksjon av ildfaste produkter @no
preferred label: Produkcja wyrobów ogniotrwałych @pl
preferred label: Fabricação de produtos cerâmicos refractários @pt
preferred label: Fabricarea de produse refractare @ro
preferred label: Производство огнеупорных изделий @ru
preferred label: Výroba žiaruvzdorných výrobkov @sk
preferred label: Proizvodnja ognjevzdržne keramike @sl
preferred label: Tillverkning av eldfasta produkter @sv
preferred label: Ateşe dayanıklı ürünlerin imalatı @tr
broader: Manufacture of other non-metallic mineral products
narrower: Manufacture of refractory products

Manufacture of refractory products
type: Concept
notation: 23.20
status: valid
status modified: 2013-10-18
accepted date: 2013-10-18
in scheme: Statistical Classification of Economic Activities in the European Community, Rev. 2 (2008)
scope note: Производство на междинни продукти от неметални минерали: пясък, чакъл, скални материали или глина. - производство на огнеупорни цименти, строителни разтвори, бетони и други подобни строителни смеси - производство на огнеупорни керамични изделия: • изделия за топлоизолация от инфузорна или аналогична силикатна пръст • огнеупорни керамични тухли, плочи, плочки • тигели, реторти, тръби, муфели и други - производство на огнеупорни изделия, съдържащи магнезит, доломит или хромит @bg
scope note: Tato třída zahrnuje výrobu polotovarů z nekovových nerostů dobývaných v dolech a lomech, jako jsou písky, štěrkopísky, kameny nebo jíly. Z: - výrobu žáruvzdorných malt, betonů atd. - výrobu žáruvzdorných keramických výrobků: • tepelně izolačních keramických výrobků z křemičitých fosilních materiálů • žáruvzdorných cihel, dlažeb, obkladů, tašek, tvarovek atd. • žáruvzdorných keramických retort, kelímků, muflí, trysek, trubic atd. ZT: - výrobu žáruvzdorných výrobků obsahujících magnezit, dolomit nebo chromit @cs
scope note: Diese Klasse umfasst die Herstellung von Halbfertigwaren aus in Bergwerken oder Steinbrüchen gewonnenen nichtmetallischen Mineralen wie Sand, Kies, Steine oder Ton. Diese Klasse umfasst: - Herstellung von feuerfesten Mörteln, Feuerbeton usw. - Herstellung von feuerfesten keramischen Erzeugnissen: • wärmeisolierende keramische Waren aus kieselsäurehaltigen fossilen Materialien • feuerfeste Steine, Platten, Fliesen usw. • feuerfeste keramische Retorten, Schmelztiegel, Muffeln, Ausgüsse, Rohre usw. Diese Klasse umfasst ferner: - Herstellung von feuerfesten Waren, die Magnesit, Dolomit oder Chromit enthalten @de
scope note: This class includes the manufacture of intermediate products from mined or quarried non-metallic minerals, such as sand, gravel, stone or clay. This class includes: - manufacture of refractory mortars, concretes etc. - manufacture of refractory ceramic goods: • heat-insulating ceramic goods of siliceous fossil meals • refractory bricks, blocks and tiles etc. • retorts, crucibles, muffles, nozzles, tubes, pipes etc. This class also includes: - manufacture of refractory articles containing magnesite, dolomite or chromite @en
scope note: Esta clase comprende la fabricación de productos intermedios a partir de minerales no metálicos, como arena, grava, piedra o arcilla. Esta clase comprende: - la fabricación de morteros, hormigones, etc., refractarios - la fabricación de productos cerámicos refractarios: • productos cerámicos para aislamiento térmico fabricados con harinas fósiles silíceas • ladrillos, bloques, tejas, etc. refractarios • retortas, crisoles, muflas, boquillas, tubos, tuberías, etc. Esta clase comprende también: - la fabricación de artículos refractarios que contienen magnesita, dolomita o cromita @es
scope note: Cette classe comprend la fabrication de produits intermédiaires obtenus à partir de minerais non métalliques extraits de mines ou de carrières, tels que le sable, le gravier, la pierre ou l’argile. Cette classe comprend: - la fabrication de mortiers, de bétons, etc., réfractaires - la fabrication d’articles céramiques réfractaires: • articles céramiques calorifuges en farines siliceuses fossiles • tuiles, briques et dalles réfractaires, etc. • cornues, creusets, moufles, busettes, tubes, tuyaux, etc. Cette classe comprend également: - la fabrication d’articles réfractaires contenant de la magnésite, de la dolomie ou de la chromite @fr
scope note: Ovaj razred uključuje međuproizvode od nemetalnih minerala, dobivenih vađenjem kao što su pijesak, šljunak, kamen ili glina. Ovaj razred uključuje: - proizvodnju vatrostalne žbuke, betona itd. - proizvodnju vatrostalne keramičke robe: • termoizolacijskih keramičkih proizvoda od silicijskoga fosilnog brašna • vatrostalne opeke, blokova i crepova itd. • retorta, lončića, lonaca prigušivača, štrcala, cijevi, slavina itd. Ovaj razred također uključuje: - proizvodnju vatrostalnih predmeta koji sadrže magnezit, dolomit ili kromit
scope note: Į šią klasę įeina tarpinių produktų iš nemetalinių mineralinių iškasenų, tokių kaip, smėlis, žvyras, akmenys arba molis, gamyba. Į šią klasę įeina: - ugniai atsparių statybinių skiedinių, betono ir kt., gamyba - ugniai atsparių keraminių gaminių gamyba: • keraminių dirbinių iš termoizoliacinio silicingo diatomito • ugniai atsparių plytų, blokų, plytelių ir kt. • retortų, tiglių, mufelių, tūtų (antgalių), vamzdelių, vamzdžių ir kt. Į šią klasę taip pat įeina: - ugniai atsparių magnezito, dolomito ar chromito turinčių dirbinių gamyba @lt
scope note: Этот класс включает: - производство строительных неогнеупорных материалов из глины: • керамической плитки, черепицы, колпаков над дымовой трубой, труб, изолирующих материалов и т.д. - производство напольной плитки из терракоты Этот класс исключает: - производство огнеупорных керамических продуктов, см. 23.20 - производство неструктурных неогнеупорных керамических продуктов, см. 23.4 @ru
scope note: Bu sınıf madencilik ve taş ocakçılığındaki metalik olmayan ürünlerden ara mamul ürünlerin imalatını kapsamaktadır. Bu sınıf aşağıdakileri kapsamaktadır; - ateşe dayanıklı çamur, harç, beton vb. imalatı, - ateşe dayanıklı seramik ürünlerin imalatı: • silisli süzme topraktan (kiselgur) ısı-yalıtımlı seramik ürünler, • ateşe dayanıklı briketler, bloklar, tuğlalar vb. • ateşe dayanıklı seramik imbikler, potalar (döküm potaları), mufllar (mufl ocağı), püskürtme tüpleri, tüpler, borular vb. Ayrıca bu sınıf aşağıdakileri de kapsamaktadır; - magnezit, dolamit (beyaz mermer) ya da kromit içeren ateşe dayanıklı ürünlerin imalatı. @tr
preferred label: Производство на огнеупорни изделия @bg
preferred label: Výroba žáruvzdorných výrobků @cs
preferred label: Fremstilling af ildfaste produkter @da
preferred label: Herstellung von feuerfesten keramischen Werkstoffen und Waren @de
preferred label: Παραγωγή πυρίμαχων προϊόντων @el
preferred label: Fabricación de productos cerámicos refractarios @es
preferred label: Tulekindlate toodete tootmine @et
preferred label: Tulenkestävien keraamisten tuotteiden valmistus @fi
preferred label: Fabrication de produits réfractaires @fr
preferred label: Tűzálló termék gyártása
preferred label: Fabbricazione di prodotti refrattari @it
preferred label: Ugniai atsparių gaminių gamyba @lt
preferred label: Ugunsizturīgo nemetālisko minerālu izstrādājumu ražošana @lv
preferred label: Manifattura ta' prodotti rifrattorji @mt
preferred label: Vervaardiging van vuurvaste producten @nl
preferred label: Produksjon av ildfaste produkter @no
preferred label: Produkcja wyrobów ogniotrwałych @pl
preferred label: Fabricação de produtos cerâmicos refractários @pt
preferred label: Fabricarea de produse refractare @ro
preferred label: Производство огнеупорных изделий @ru
preferred label: Výroba žiaruvzdorných výrobkov @sk
preferred label: Proizvodnja ognjevzdržne keramike @sl
preferred label: Tillverkning av eldfasta produkter @sv
preferred label: Ateşe dayanıklı ürünlerin imalatı @tr
broader: Manufacture of refractory products

Manufacture of clay building materials
type: Concept
notation: 23.3
status: valid
status modified: 2013-10-18
accepted date: 2013-10-18
in scheme: Statistical Classification of Economic Activities in the European Community, Rev. 2 (2008)
scope note: Diese Gruppe umfasst die Herstellung von Baustoffen aus Ton. @de
scope note: Данная группа включает производство готовых изделий из ископаемых, не содержащих металла, минералов, таких как, песок, гравий, галька или глина. @ru
preferred label: Производство на керамични изделия за строителството @bg
preferred label: Výroba stavebních výrobků z jílovitých materiálů @cs
preferred label: Fremstilling af byggematerialer af ler @da
preferred label: Herstellung von keramischen Baumaterialien @de
preferred label: Παραγωγή δομικών υλικών από άργιλο @el
preferred label: Fabricación de productos cerámicos para la construcción @es
preferred label: Savist ehitusmaterjalide tootmine @et
preferred label: Keraamisten rakennusaineiden valmistus @fi
preferred label: Fabrication de matériaux de construction en terre cuite @fr
preferred label: Kerámia, agyag építőanyag gyártása
preferred label: Fabbricazione di materiali da costruzione in terracotta @it
preferred label: Statybinių medžiagų iš molio gamyba @lt
preferred label: Keramikas būvmateriālu ražošana @lv
preferred label: Manifattura ta' materjal tal-bini tat-tafal @mt
preferred label: Vervaardiging van producten voor de bouw, van klei @nl
preferred label: Produksjon av byggevarer av brent leire @no
preferred label: Produkcja ceramicznych materiałów budowlanych @pl
preferred label: Fabricação de produtos de barro para a construção @pt
preferred label: Fabricarea materialelelor de construcţii din argilă @ro
preferred label: Производство строительных материалов из глины @ru
preferred label: Výroba stavebného materiálu z hliny @sk
preferred label: Proizvodnja neognjevzdržne gradbene keramike @sl
preferred label: Tillverkning av byggmaterial av lergods @sv
preferred label: Kilden inşaat malzemeleri imalatı @tr
broader: Manufacture of other non-metallic mineral products
narrower: Manufacture of ceramic tiles and flags
narrower: Manufacture of bricks, tiles and construction products, in baked clay

Manufacture of ceramic tiles and flags
type: Concept
notation: 23.31
status: valid
status modified: 2013-10-18
accepted date: 2013-10-18
in scheme: Statistical Classification of Economic Activities in the European Community, Rev. 2 (2008)
scope note: - производство на неогнеупорни керамични плочки за камини или облицоване, за мозайка и други - производство на неогнеупорни керамични плочки за подови настилки - производство на полимермрамор - 22.23 - производство на огнеупорни керамични изделия - 23.20 - производство на тухли и керемиди от печена глина - 23.32 @bg
scope note: Z: - výrobu nežáruvzdorných keramických obkládaček a kachlí, mozaikových kostek atd. - výrobu nežáruvzdorných keramických dlaždic a dlažebních kostek N: - výrobu umělého kamene (např. umělého mramoru) (22.23) - výrobu žáruvzdorných keramických výrobků (23.20) - výrobu keramických cihel a střešních krytin (23.32) @cs
scope note: Diese Klasse umfasst: - Herstellung von nichtfeuerfesten keramischen Wandfliesen und -platten, Würfeln für Mosaike usw. - Herstellung von nichtfeuerfesten keramischen Bodenfliesen und -platten Diese Klasse umfasst nicht: - Herstellung von Kunststein (z. B. Kunstmarmor) (s. 22.23) - Herstellung von feuerfesten keramischen Erzeugnissen (s. 23.20) - Herstellung von keramischen Mauer- und Dachziegeln (s. 23.32) @de
scope note: This class includes: - manufacture of non-refractory ceramic hearth or wall tiles, mosaic cubes etc. - manufacture of non-refractory ceramic flags and paving This class excludes: - manufacture of artificial stone (e.g. cultured marble), see 22.23 - manufacture of refractory ceramic products, see 23.20 - manufacture of ceramic bricks and roofing tiles, see 23.32 @en
scope note: Esta clase comprende: - la fabricación de azulejos para paredes y chimeneas, cubos y dados para mosaicos, etc., cerámicos no refractarios - la fabricación de baldosas y adoquines cerámicos no refractarios Esta clase no comprende: - la fabricación de piedra artificial (p. ej., mármol artificial) (véase 22.23) - la fabricación de productos cerámicos refractarios (véase 23.20) - la fabricación de ladrillos y tejas cerámicos (véase 23.32) @es
scope note: Cette classe comprend: - la fabrication de carreaux pour le revêtement des murs et des cheminées, d’abacules, etc., en céramique non réfractaire - la fabrication de carreaux et de dalles de pavement en céramique non réfractaire Cette classe ne comprend pas: - la fabrication de pierre artificielle (par exemple: le marbre de culture), voir 22.23 - la fabrication de produits céramiques réfractaires, voir 23.20 - la fabrication de briques et tuiles en céramique, voir 23.32 @fr
scope note: Ovaj razred uključuje: - proizvodnju nevatrostalnih keramičkih zidnih pločica, mozaičkih pločica itd. - proizvodnju nevatrostalnih keramičkih podnih ploča i pločica Ovaj razred isključuje: - proizvodnju umjetnoga kamena (npr. uzgojenog mramora), vidi 22.23 - proizvodnju vatrostalnih keramičkih proizvoda, vidi 23.20 - proizvodnju keramičke opeke i krovnih crepova, vidi 23.32
scope note: Į šią klasę įeina: - ugniai neatsparių keraminių židinių koklių ar sieninių plytelių, mozaikinių kubelių ir kt., gamyba - ugniai neatsparių keraminių grindinio plokščių ir dangų gamyba Į šią klasę neįeina: - dirbtinio akmens (pvz., lieto marmuro) gamyba, žr. 22.23 - ugniai atsparių keraminių gaminių gamyba, žr. 23.20 - keraminių plytelių ir čerpių gamyba, žr. 23.32 @lt
scope note: Этот класс включает: - производство керамической столовой посуды и прочих бытовых или туалетных изделий - производство статуэток и прочих декоративных керамических изделий Этот класс исключает: - производство искусственных драгоценностей, см. 32.13 - производство керамических игрушек, см. 32.40 @ru
scope note: Bu sınıf aşağıdakileri kapsamaktadır; - ateşe dayanıklı olmayan seramik yer karoların ya da duvar fayanslarının ve karolarının, mozaik küplerin vb.lerinin imalatı, - ateşe dayanıklı olmayan seramik döşemelerin ve seramik kaldırım taşlarının imalatı. Kapsam dışı olanlar; - suni taşların imalatı (örn. suni mermerler), bkz. 22.23, - ateşe dayanıklı olan seramik ürünlerin imalatı, bkz. 23.20. • seramik tuğlalar ve kiremitlerin imalatı, bkz. 23.32. @tr
preferred label: Производство на керамични плочки @bg
preferred label: Výroba keramických obkladaček a dlaždic @cs
preferred label: Fremstilling af keramiske teglsten og gulvfliser @da
preferred label: Herstellung von keramischen Wand- und Bodenfliesen und -platten @de
preferred label: Κατασκευή κεραμικών πλακιδίων και πλακών @el
preferred label: Fabricación de azulejos y baldosas de cerámica @es
preferred label: Keraamiliste kivide ja plaatide tootmine @et
preferred label: Keraamisten tiilien ja laattojen valmistus @fi
preferred label: Fabrication de carreaux en céramique @fr
preferred label: Kerámiacsempe, -lap gyártása
preferred label: Fabbricazione di piastrelle in ceramica per pavimenti e rivestimenti @it
preferred label: Keraminių apdailos ir šaligatvio plytelių gamyba @lt
preferred label: Keramikas flīžu un plākšņu ražošana @lv
preferred label: Manifattura ta' madum u ċangaturi taċ-ċeramika @mt
preferred label: Vervaardiging van keramische tegels en plavuizen @nl
preferred label: Produksjon av keramiske vegg- og gulvfliser @no
preferred label: Produkcja ceramicznych kafli i płytek @pl
preferred label: Fabricação de azulejos, ladrilhos, mosaicos e placas de cerâmica @pt
preferred label: Fabricarea plăcilor şi dalelor din ceramică @ro
preferred label: Производство керамических покрытий и плит @ru
preferred label: Výroba keramických obkladačiek a dlaždíc @sk
preferred label: Proizvodnja keramičnih ploščic in oblog @sl
preferred label: Tillverkning av keramiska golv- och väggplattor @sv
preferred label: Seramikten karo ve kaldırım taşları imalatı @tr
broader: Manufacture of clay building materials

Manufacture of bricks, tiles and construction products, in baked clay
type: Concept
notation: 23.32
status: valid
status modified: 2013-10-18
accepted date: 2013-10-18
in scheme: Statistical Classification of Economic Activities in the European Community, Rev. 2 (2008)
scope note: - производство на неогнеупорни строителни изделия от печена глина: • тухли, керемиди, елементи за комини, тръби и съединителни части за тях - производство на блокчета за подови настилки от печена глина - производство на огнеупорни керамични изделия - 23.20 - производство на други порцеланови и керамични изделия - 23.4 @bg
scope note: Z: - výrobu nežáruvzdorných stavebních materiálů z jílovitých materiálů: • cihel, hurdisků, stropních tvarovek, střešních krytin, kouřovodů, rour, trubek atd. - výrobu podlahových tvarovek z pálené hlíny N: - výrobu žáruvzdorných keramických výrobků (23.20) - výrobu nežáruvzdorných keramických výrobků nepoužívaných na stavební konstrukce (23.4) @cs
scope note: Diese Klasse umfasst: - Herstellung von nichtfeuerfesten keramischen Baumaterialien: • Mauerziegel, Hourdis, Deckenziegel, Dachziegel, Schornsteinaufsätze, Rohre, Rohrleitungen usw. - Herstellung von Bodenplatten aus gebranntem Ton Diese Klasse umfasst nicht: - Herstellung von feuerfesten keramischen Erzeugnissen (s. 23.20) - Herstellung von nichttragenden nichtfeuerfesten keramischen Erzeugnissen (s. 23.4) @de
scope note: This class includes: - manufacture of structural non-refractory clay building materials: • manufacture of ceramic bricks, roofing tiles, chimney pots, pipes, conduits etc. - manufacture of flooring blocks in baked clay This class excludes: - manufacture of refractory ceramic products, see 23.20 - manufacture of non-structural non-refractory ceramic products, see 23.4 @en
scope note: Esta clase comprende: - la fabricación de materiales estructurales para la construcción no refractarios de arcilla: • la fabricación de ladrillos, tejas, sombreretes de chimenea, tuberías, conducciones, etc. - la fabricación de revestimientos de suelos de arcilla cocida Esta clase no comprende: - la fabricación de productos cerámicos refractarios (véase 23.20) - la fabricación de productos cerámicos no refractarios no estructurales (véase 23.4) @es
scope note: Cette classe comprend: - la fabrication de matériaux de construction en terre cuite non réfractaire: • briques, tuiles, éléments de cheminée, tubes, tuyaux, etc., en céramique - la fabrication de hourdis en terre cuite Cette classe ne comprend pas: - la fabrication de produits céramiques réfractaires, voir 23.20 - la fabrication de produits céramiques non réfractaires ne servant pas pour la construction, voir 23.4 @fr
scope note: Ovaj razred uključuje: - proizvodnju građevinskih nevatrostalnih materijala od gline: • proizvodnju keramičke opeke, krovnih crepova, kapa za dimnjake, cijevi, žljebnjaka itd. - proizvodnju podnih ploča od pečene gline Ovaj razred isključuje: - proizvodnju vatrostalnih keramičkih proizvoda, vidi 23.20 - proizvodnju negrađevinskih nevatrostalnih keramičkih proizvoda, vidi 23.4
scope note: Į šią klasę įeina: - ugniai neatsparių statybinių dirbinių iš molio gamyba: • keraminių plytų, stogo čerpių, dūmtakio gaubtų, vamzdžių, vandentakių ir kt. gamyba - degto molio grindų blokų gamyba Į šią klasę neįeina: - ugniai atsparių keraminių gaminių gamyba, žr. 23.20 - ugniai neatsparių nestatybinių keraminių gaminių gamyba, žr. 23.4 @lt
scope note: Этот класс включает: - производство керамического гигиенического сантехнического оборудования, например, раковин, ванн, биде, унитазов и т.д. - производство прочих керамических приспособлений Этот класс исключает: - производство огнеупорных керамических продуктов, см. 23.20 - производство керамических строительных материалов, см. 23.3 @ru
scope note: Bu sınıf aşağıdakileri kapsamaktadır; - ateşe dayanıklı olmayan kilden inşaat malzemesi imalatı: • seramik tuğlaların, kiremitlerin, baca tuğlalarının, borular, olukların vb.lerinin imalatı. - pişmiş kilden döşemelik blokların imalatı. Kapsam dışı olanlar; - ateşe dayanıklı seramik ürünleri imalatı, bkz. 23.20, - inşaat malzemesi ve ateşe dayanıklı olmayan seramikten ürünlerin imalatı, bkz. 23.4. @tr
preferred label: Производство на тухли, керемиди и други изделия от печена глина за строителството @bg
preferred label: Výroba pálených zdicích materiálů, tašek, dlaždic a podobných výrobků @cs
preferred label: Fremstilling af mursten, teglsten og byggematerialer af brændt ler @da
preferred label: Herstellung von Ziegeln und sonstiger Baukeramik @de
preferred label: Κατασκευή τούβλων, πλακιδίων και λοιπών δομικών προϊόντων από οπτή γη @el
preferred label: Fabricación de ladrillos, tejas y productos de tierras cocidas para la construcción @es
preferred label: Põletatud savist telliste, kivide ja muude ehitustoodete tootmine @et
preferred label: Poltettujen tiilien ja muun rakennuskeramiikan valmistus @fi
preferred label: Fabrication de briques, tuiles et produits de construction, en terre cuite @fr
preferred label: Égetett agyag építőanyag gyártása
preferred label: Fabbricazione di mattoni, tegole ed altri prodotti per l'edilizia in terracotta @it
preferred label: Degto molio plytų, plytelių ir statybinių dirbinių gamyba @lt
preferred label: Māla ķieģeļu, flīžu un citu apdedzināto būvmateriālu ražošana @lv
preferred label: Manifattura ta' briks, madum u prodotti tal-kostruzzjoni, magħmula mit-tafal moħmi @mt
preferred label: Vervaardiging van bakstenen, tegels en producten voor de bouw, van gebakken klei @nl
preferred label: Produksjon av murstein, teglstein og andre byggevarer av brent leire @no
preferred label: Produkcja cegieł, dachówek i materiałów budowlanych, z wypalanej gliny @pl
preferred label: Fabricação de tijolos, telhas e de outros produtos de barro para a construção @pt
preferred label: Fabricarea cărămizilor, ţiglelor şi altor produse pentru construcţii, din argilă arsă @ro
preferred label: Производство кирпича, черепицы и прочих строительных изделий из обожженной глины @ru
preferred label: Výroba tehál, obkladačiek a stavebných výrobkov z pálenej hliny @sk
preferred label: Proizvodnja strešnikov, opeke in drugih gradbenih izdelkov iz žgane gline @sl
preferred label: Tillverkning av murtegel, takpannor och andra byggvaror av tegel @sv
preferred label: Fırınlanmış kilden tuğla, karo ve inşaat malzemeleri imalatı @tr
broader: Manufacture of clay building materials

Manufacture of other porcelain and ceramic products
type: Concept
notation: 23.4
status: valid
status modified: 2013-10-18
accepted date: 2013-10-18
in scheme: Statistical Classification of Economic Activities in the European Community, Rev. 2 (2008)
scope note: Тази група включва производство на готови продукти от неметални минерали, такива като пясък, чакъл, скални материали или глина. @bg
scope note: Tato třída zahrnuje výrobu konečných výrobků vyráběných z nekovových nerostů dobývaných v dolech a lomech, jako písků, štěrkopísků, kamenů nebo jílů. @cs
scope note: Diese Gruppe umfasst die Herstellung von Fertigwaren aus in Bergwerken oder Steinbrüchen gewonnenen nichtmetallischen Mineralen wie Sand, Kies, Steine oder Ton. @de
scope note: This group includes the manufacture of final products from mined or quarried non-metallic minerals, such as sand, gravel, stone or clay. @en
scope note: Este grupo comprende la fabricación de productos finales a partir de minerales no metálicos, como arena, grava, piedra o arcilla. @es
scope note: Ce groupe comprend la fabrication de produits finis obtenus à partir de minerais non métalliques extraits de mines ou de carrières, tels que le sable, le gravier, la pierre ou l’argile. @fr
scope note: Ova skupina uključuje proizvodnju finalnih proizvoda koji se dobivaju vađenjem nemetalnih minerala kao što su pijesak, šljunak ili glina.
scope note: Į šią grupę įeina galutinių produktų iš nemetalinių mineralinių iškasenų, tokių kaip smėlis, žvyras, akmenys arba molis, gamyba. @lt
scope note: Этот класс включает: - производство электрической изоляционной керамической арматуры Этот класс исключает: - производство огнеупорных керамических продуктов, см. 23.20 @ru
scope note: Bu sınıf madencilik ve taş ocakçılığındaki metalik olmayan ürünlerden nihai ürünlerin imalatını kapsamaktadır. @tr
preferred label: Производство на други порцеланови и керамични изделия @bg
preferred label: Výroba ostatních porcelánových a keramických výrobků @cs
preferred label: Fremstilling af andre porcelænsvarer og keramiske produkter @da
preferred label: Herstellung von sonstigen Porzellan- und keramischen Erzeugnissen @de
preferred label: Κατασκευή άλλων προϊόντων πορσελάνης και κεραμικής @el
preferred label: Fabricación de otros productos cerámicos @es
preferred label: Muude portselan- ja keraamikatoodete tootmine @et
preferred label: Muiden posliini- ja keramiikkatuotteiden valmistus @fi
preferred label: Fabrication d'autres produits en céramique et en porcelaine @fr
preferred label: Porcelán, kerámiatermék gyártása
preferred label: Fabbricazione di altri prodotti in porcellana e in ceramica @it
preferred label: Kitų porcelianinių ir keraminių gaminių bei dirbinių gamyba @lt
preferred label: Citu porcelāna un keramikas izstrādājumu ražošana @lv
preferred label: Manifattura ta' prodotti oħra tal-porċellana u ċ-ċeramika @mt
preferred label: Vervaardiging van andere keramische producten @nl
preferred label: Produksjon av andre porselensprodukter og keramiske produkter @no
preferred label: Produkcja pozostałych wyrobów z porcelany i ceramiki @pl
preferred label: Fabricação de outros produtos de porcelana e cerâmicos @pt
preferred label: Fabricarea altor articole din ceramică şi porţelan @ro
preferred label: Производство прочих фарфоровых и керамических изделий @ru
preferred label: Výroba ostatných porcelánových a keramických výrobkov @sk
preferred label: Proizvodnja drugih izdelkov iz keramike in porcelana @sl
preferred label: Tillverkning av andra porslinsprodukter och keramiska produkter @sv
preferred label: Diğer porselen ve seramik ürünlerin imalatı @tr
broader: Manufacture of other non-metallic mineral products
narrower: Manufacture of ceramic household and ornamental articles
narrower: Manufacture of ceramic sanitary fixtures
narrower: Manufacture of ceramic insulators and insulating fittings
narrower: Manufacture of other technical ceramic products
narrower: Manufacture of other ceramic products

Manufacture of ceramic household and ornamental articles
type: Concept
notation: 23.41
status: valid
status modified: 2013-10-18
accepted date: 2013-10-18
in scheme: Statistical Classification of Economic Activities in the European Community, Rev. 2 (2008)
scope note: - производство на съдове и прибори за сервиране и други домакински или тоалетни изделия, от порцелан и други керамични материали - производство на статуетки и други предмети за украса от порцелан и други керамични материали - производство на бижута имитация - 32.13 - производство на играчки от керамика - 32.40 @bg
scope note: Z: - výrobu nádobí, jiných potřeb převážně pro domácnost a toaletních potřeb z keramiky - výrobu sošek a jiných ozdobných předmětů z keramiky N: - výrobu bižuterie (32.13) - výrobu keramických hraček (32.40) @cs
scope note: Diese Klasse umfasst: - Herstellung von Geschirr und anderen Haushaltsartikeln sowie Toilettenartikeln aus Keramik - Herstellung von Statuetten und anderen Ziergegenständen aus Keramik Diese Klasse umfasst nicht: - Herstellung von Fantasieschmuck (s. 32.13) - Herstellung von Spielzeug aus Keramik (s. 32.40) @de
scope note: This class includes: - manufacture of ceramic tableware and other domestic or toilet articles - manufacture of statuettes and other ornamental ceramic articles This class excludes: - manufacture of imitation jewellery, see 32.13 - manufacture of ceramic toys, see 32.40 @en
scope note: Esta clase comprende: - la fabricación de vajillas y otros artículos cerámicos de uso doméstico o de tocador - la fabricación de estatuillas y otros artículos cerámicos de ornamentación Esta clase no comprende: - la fabricación de bisutería (véase 32.13) - la fabricación de juguetes de cerámica (véase 32.40) @es
scope note: Cette classe comprend: - la fabrication de vaisselle et d’autres articles de ménage ou d’économie domestique ainsi que d’articles d’hygiène ou de toilette, en céramique - la fabrication de statuettes et d’autres objets d’ornementation en céramique Cette classe ne comprend pas: - la fabrication de bijouterie de fantaisie, voir 32.13 - la fabrication de jouets en céramique, voir 32.40 @fr
scope note: Ovaj razred uključuje: - proizvodnju keramičkoga stolnog posuđa i keramičkih proizvoda za druge potrebe u kućanstvu i u toaletne svrhe - proizvodnju figura i drugih ukrasnih keramičkih predmeta Ovaj razred isključuje: - proizvodnju imitacije nakita, vidi 32.13 - proizvodnju keramičkih igračaka, vidi 32.40
scope note: Į šią klasę įeina: - keraminių valgomųjų reikmenų ir kitų buities ar tualeto reikmenų gamyba - statulėlių ir kitų keraminių puošybos dirbinių gamyba Į šią klasę neįeina: - dirbtinės bižuterijos gamyba, žr. 32.13 - keraminių žaislų gamyba, žr. 32.40 @lt
scope note: Этот класс включает: - производство керамических и ферритовых магнитов - производство керамических лабораторных, химических и промышленных изделий Этот класс исключает: - производство искусственного камня (например, обработанного мрамора), см. 22.23 - производство огнеупорных керамических продуктов, см. 23.20 - производство керамических строительных материалов, см. 23.3 @ru
scope note: Bu sınıf aşağıdakileri kapsamaktadır; - seramik sofra takımları ve diğer ev veya tuvalet eşyalarının imalatı, - heykelciklerin, bibloların ve diğer dekoratif amaçlı seramik eşyaların imalatı. Kapsam dışı olanlar; - imitasyon (taklit) ziynet eşyaları imalatı, bkz. 32.13, - seramik oyuncak imalatı, bkz. 32.40. @tr
preferred label: Производство на домакински порцелан, декоративни изделия от порцелан и други керамични материали @bg
preferred label: Výroba keramických a porcelánových výrobků převážně pro domácnost a ozdobných předmětů @cs
preferred label: Fremstilling af keramiske husholdningsartikler og pyntegenstande @da
preferred label: Herstellung von keramischen Haushaltswaren und Ziergegenständen @de
preferred label: Κατασκευή κεραμικών ειδών οικιακής χρήσης και κεραμικών διακοσμητικών ειδών @el
preferred label: Fabricación de artículos cerámicos de uso doméstico y ornamental @es
preferred label: Kodu- ja ehiskeraamika tootmine @et
preferred label: Keraamisten talous- ja koriste-esineiden valmistus @fi
preferred label: Fabrication d'articles céramiques à usage domestique ou ornemental @fr
preferred label: Háztartási kerámia gyártása
preferred label: Fabbricazione di prodotti in ceramica per usi domestici e ornamentali @it
preferred label: Keraminių buities ir puošybos gaminių bei dirbinių gamyba @lt
preferred label: Sadzīves un dekoratīvo keramikas izstrādājumu ražošana @lv
preferred label: Manifattura ta'oġġetti tad-dar u tat-tiżjin magħmula miċ-ċeramika @mt
preferred label: Vervaardiging van huishoudelijk en sieraardewerk @nl
preferred label: Produksjon av keramiske husholdningsartikler og dekorasjonsgjenstander @no
preferred label: Produkcja ceramicznych wyrobów stołowych i ozdobnych @pl
preferred label: Fabricação de artigos cerâmicos de uso doméstico e ornamental @pt
preferred label: Fabricarea articolelor ceramice pentru uz gospodăresc şi ornamental @ro
preferred label: Производство керамических бытовых и декоративных изделий @ru
preferred label: Výroba domácich a dekoratívnych keramických predmetov @sk
preferred label: Proizvodnja gospodinjske in okrasne keramike @sl
preferred label: Tillverkning av keramiska hushålls- och prydnadsartiklar @sv
preferred label: Seramik ev ve süs eşyası imalatı @tr
broader: Manufacture of other porcelain and ceramic products

Manufacture of ceramic sanitary fixtures
type: Concept
notation: 23.42
status: valid
status modified: 2013-10-18
accepted date: 2013-10-18
in scheme: Statistical Classification of Economic Activities in the European Community, Rev. 2 (2008)
scope note: - производство на санитарна керамика - например мивки, вани, бидета, тоалетни казанчета и други - производство на фиксирани приспособления със санитарно предназначение - производство на мебели от керамика - производство на огнеупорни керамични изделия - 23.20 - производство на керамични изделия за строителството - 23.3 @bg
scope note: Z: - výrobu sanitární keramiky, např. koupacích van, sprchových koutů, umyvadel, bidetů, záchodových mís atd. - výrobu ostatní sanitární keramiky N: - výrobu žáruvzdorných keramických výrobků (23.20) - výrobu keramických stavebních materiálů (23.3) @cs
scope note: Diese Klasse umfasst: - Herstellung von Sanitärkeramik, z. B. Badewannen, Duschen, Waschbecken, Bidets, Klosettschüsseln usw. - Herstellung sonstiger Sanitärkeramik Diese Klasse umfasst nicht: - Herstellung von feuerfesten keramischen Erzeugnissen (s. 23.20) - Herstellung von Baukeramik (s. 23.3) @de
scope note: This class includes: - manufacture of ceramic sanitary fixtures, e.g. sinks, baths, bidets, water closet pans etc. - manufacture of other ceramic fixtures This class excludes: - manufacture of refractory ceramic goods, see 23.20 - manufacture of ceramic building materials, see 23.3 @en
scope note: Esta clase comprende: - la fabricación de aparatos sanitarios cerámicos, como lavabos, bañeras, bidés, inodoros, etc. - la fabricación de otros aparatos cerámicos Esta clase no comprende: - la fabricación de productos cerámicos refractarios (véase 23.20) - la fabricación de materiales de construcción cerámicos (véase 23.3) @es
scope note: Cette classe comprend: - la fabrication d’appareils sanitaires en céramique, par exemple: éviers, baignoires, bidets, cuvettes d’aisance, etc. - la fabrication d’autres d’appareils en céramique Cette classe ne comprend pas: - la fabrication de produits céramiques réfractaires, voir 23.20 - la fabrication de matériaux de construction en céramique, voir 23.3 @fr
scope note: Ovaj razred uključuje: - proizvodnju sanitarne keramike za ugradnju, npr. umivaonika, kada, bidea, zahodskih školjki itd. - proizvodnju keramičkog namještaja Ovaj razred isključuje: - proizvodnju vatrostalnih keramičkih proizvoda, vidi 23.20 - proizvodnju keramičkih građevinskih proizvoda, vidi 23.3
scope note: Į šią klasę įeina: - keraminės sanitarinės įrangos, pvz., kriauklių, vonių, bidė, tualeto vandens bakelių ir kt., gamyba - kitų keraminių tvirtiklių gamyba Į šią klasę neįeina: - ugniai atsparių keraminių gaminių gamyba, žr. 23.20 - keraminių statybinių medžiagų gamyba, žr. 23.3 @lt
scope note: Этот класс включает: - производство керамических чайников, кувшинов и аналогичных изделий, используемых для транспортировки или упаковывания товаров - производство прочих керамических продуктов, не включенных в другие категории Этот класс исключает: - производство керамического гигиенического сантехнического оборудования, см. 23.42 - производство искусственных зубов, см. 32.50 @ru
scope note: Bu sınıf aşağıdakileri kapsamaktadır; - seramik sıhhi ürünlerin imalatı, lavabo, banyo küveti, klozet vb., - diğer seramik ürünlerin imalatı. Kapsam dışı olanlar; - ateşe dayanıklı seramik ürünlerin imalatı, bkz. 23.20, - seramik inşaat malzemelerinin imalatı, bkz. 23.3. @tr
preferred label: Производство на санитарна керамика @bg
preferred label: Výroba keramických sanitárních výrobků @cs
preferred label: Fremstilling af keramiske sanitetsartikler @da
preferred label: Herstellung von Sanitärkeramik @de
preferred label: Κατασκευή κεραμικών ειδών υγιεινής @el
preferred label: Fabricación de aparatos sanitarios cerámicos @es
preferred label: Keraamiliste sanitaarseadmete tootmine @et
preferred label: Keraamisten saniteettikalusteiden valmistus @fi
preferred label: Fabrication d'appareils sanitaires en céramique @fr
preferred label: Egészségügyi kerámia gyártása
preferred label: Fabbricazione di articoli sanitari in ceramica @it
preferred label: Keraminių santechnikos gaminių ir dirbinių gamyba @lt
preferred label: Saninārtehnisko keramikas izstrādājumu ražošana @lv
preferred label: Manifattura ta' tagħmir sanitarju taċ-ċeramika @mt
preferred label: Vervaardiging van sanitair aardewerk @nl
preferred label: Produksjon av sanitærutstyr av keramisk materiale @no
preferred label: Produkcja ceramicznych wyrobów sanitarnych @pl
preferred label: Fabricação de artigos cerâmicos para usos sanitários @pt
preferred label: Fabricarea de obiecte sanitare din ceramică @ro
preferred label: Производство керамического гигиенического сантехнического оборудования @ru
preferred label: Výroba keramického sanitárneho vybavenia @sk
preferred label: Proizvodnja sanitarne keramike @sl
preferred label: Tillverkning av keramiska sanitetsartiklar @sv
preferred label: Seramikten yapılan sıhhi ürünlerin imalatı @tr
broader: Manufacture of other porcelain and ceramic products

Manufacture of ceramic insulators and insulating fittings
type: Concept
notation: 23.43
status: valid
status modified: 2013-10-18
accepted date: 2013-10-18
in scheme: Statistical Classification of Economic Activities in the European Community, Rev. 2 (2008)
scope note: - производство на керамични електрически изолатори и керамични изолационни части - производство на огнеупорни керамични изделия - 23.20 @bg
scope note: Z: - výrobu elektrických izolátorů a izolačního příslušenství z keramiky N: - výrobu žáruvzdorných keramických výrobků (23.20) @cs
scope note: Diese Klasse umfasst: - Herstellung von elektrischen Isolatoren und Isolierteilen aus Keramik Diese Klasse umfasst nicht: - Herstellung von feuerfesten keramischen Erzeugnissen (s. 23.20) @de
scope note: This class includes: - manufacture of electrical insulators and insulating fittings of ceramics This class excludes: - manufacture of refractory ceramic goods, see 23.20 @en
scope note: Esta clase comprende: - la fabricación de aisladores eléctricos y piezas aislantes de material cerámico Esta clase no comprende: - la fabricación de productos cerámicos refractarios (véase 23.20) @es
scope note: Cette classe comprend: - la fabrication d’isolateurs pour l’électricité et de pièces isolantes en céramique Cette classe ne comprend pas: - la fabrication de produits céramiques réfractaires, voir 23.20 @fr
scope note: Ovaj razred uključuje: - proizvodnju keramičkih električnih izolatora i keramičkoga izolacijskog pribora Ovaj razred isključuje: - proizvodnju vatrostalnih keramičkih proizvoda, vidi 23.20
scope note: Į šią klasę įeina: - keraminių elektros izoliatorių ir izoliacinių jungiamųjų detalių gamyba Į šią klasę neįeina: - ugniai atsparių keraminių gaminių gamyba, žr. 23.20 @lt
scope note: Bu sınıf aşağıdakileri kapsamaktadır; - seramikten elektrik yalıtım malzemelerinin ve bağlantı parçalarının imalatı. Kapsam dışı olanlar; - ateşe dayanıklı seramik ürünlerin imalatı, bkz. 23.20. @tr
preferred label: Производство на керамични изолатори @bg
preferred label: Výroba keramických izolátorů a izolačního příslušenství @cs
preferred label: Fremstilling af keramiske isolatorer og isoleringsdele @da
preferred label: Herstellung von Isolatoren und Isolierteilen aus Keramik @de
preferred label: Κατασκευή κεραμικών μονωτών και κεραμικών μονωτικών εξαρτημάτων @el
preferred label: Fabricación de aisladores y piezas aislantes de material cerámico @es
preferred label: Keraamiliste isolaatorite ja isolatsioonielementide tootmine @et
preferred label: Keraamisten eristystuotteiden valmistus @fi
preferred label: Fabrication d'isolateurs et pièces isolantes en céramique @fr
preferred label: Kerámia szigetelő gyártása
preferred label: Fabbricazione di isolatori e di pezzi isolanti in ceramica @it
preferred label: Keraminių izoliatorių ir keraminių izoliacinių detalių gamyba @lt
preferred label: Keramikas izolatoru un izolācijas armatūras ražošana @lv
preferred label: Manifattura ta' iżolaturi u tagħmir iżolatur taċ-ċeramika @mt
preferred label: Vervaardiging van isolatoren en isolatiemateriaal, van keramische stoffen @nl
preferred label: Produksjon av isolatorer og isoleringsdeler av keramisk materiale @no
preferred label: Produkcja ceramicznych izolatorów i osłon izolacyjnych @pl
preferred label: Fabricação de isoladores e peças isolantes em cerâmica @pt
preferred label: Fabricarea izolatorilor şi pieselor izolante din ceramică @ro
preferred label: Производство керамических изоляционных материалов и гарнитуры @ru
preferred label: Výroba keramických izolátorov a izolačných doplnkov @sk
preferred label: Proizvodnja izolatorjev in izolacijskih elementov iz keramike @sl
preferred label: Tillverkning av keramiska isolatorer o.d. @sv
preferred label: Seramik izolatörlerin ve izolasyon bağlantı parçalarının imalatı @tr
broader: Manufacture of other porcelain and ceramic products

Manufacture of other technical ceramic products
type: Concept
notation: 23.44
status: valid
status modified: 2013-10-18
accepted date: 2013-10-18
in scheme: Statistical Classification of Economic Activities in the European Community, Rev. 2 (2008)
scope note: - производство на керамични постоянни магнити (ферити) - производство на керамични изделия за лабораторна, химическа или техническа употреба - производство на полимермрамор - 22.23 - производство на огнеупорни керамични изделия - 23.20 - производство на керамични изделия за строителството - 23.3 @bg
scope note: Z: - výrobu feritových (keramických) magnetů - výrobu keramických výrobků pro laboratoře, chemické a průmyslové účely N: - výrobu umělého kamene (např. umělého mramoru) (22.23) - výrobu žáruvzdorných keramických výrobků (23.20) - výrobu keramických stavebních materiálů (23.3) @cs
scope note: Diese Klasse umfasst: - Herstellung von Ferritmagneten - Herstellung von keramischen Erzeugnissen für Laboratorien, chemische und industrielle Zwecke Diese Klasse umfasst nicht: - Herstellung von Kunststein (z. B. Kunstmarmor) (s. 22.23) - Herstellung von feuerfesten keramischen Erzeugnissen (s. 23.20) - Herstellung von Baukeramik (s. 23.3) @de
scope note: This class includes: - manufacture of ceramic and ferrite magnets - manufacture of ceramic laboratory, chemical and industrial products This class excludes: - manufacture of artificial stone (e.g. cultured marble), see 22.23 - manufacture of refractory ceramic goods, see 23.20 - manufacture of ceramic building materials, see 23.3 @en
scope note: Esta clase comprende: - la fabricación de imanes de cerámica y ferrita - la fabricación de productos de cerámica para usos de laboratorio, químicos e industriales Esta clase no comprende: - la fabricación de piedra artificial (p. ej., mármol artificial) (véase 22.23) - la fabricación de productos cerámicos refractarios (véase 23.20) - la fabricación de materiales de construcción cerámicos (véase 23.3) @es
scope note: Cette classe comprend: - la fabrication d’aimants ferrites et d’aimants céramiques - la fabrication de produits céramiques pour usages chimiques ou industriels Cette classe ne comprend pas: - la fabrication de pierre artificielle (par exemple: le marbre de culture), voir 22.23 - la fabrication de produits céramiques réfractaires, voir 23.20 - la fabrication de matériaux de construction en céramique, voir 23.3 @fr
scope note: Ovaj razred uključuje: - proizvodnju keramičkih i feritnih magneta - proizvodnju keramičkih proizvoda za laboratorijske, kemijske i industrijske svrhe Ovaj razred isključuje: - proizvodnju umjetnoga kamena (npr. uzgojenog mramora), vidi 22.23 - proizvodnju vatrostalnih keramičkih proizvoda, vidi 23.20 - proizvodnju keramičkih građevinskih proizvoda, vidi 23.3
scope note: Į šią klasę įeina: - keraminių ir feritinių magnetų gamyba - keraminių laboratorinių, chemijos reikmėms skirtų ir pramoninių gaminių ir dirbinių gamyba Į šią klasę neįeina: - dirbtinio akmens (pvz., lieto marmuro), gamyba, žr. 22.23 - ugniai atsparių keraminių gaminių gamyba, žr. 23.20 - keraminių statybinių medžiagų gamyba, žr. 23.3 @lt
scope note: Этот класс включает: - производство клинкерного и гидравлического цемента, включая портландцемент, глиноземный, шлаковый и суперфосфатный цемент Этот класс исключает: - производство огнеупорного раствора, бетона и т.д., см. 23.20 - производство готовых и сухих строительных растворов и бетона, см. 23.63, 23.64 - производство изделий из цемента, см. 23.69 - производство цемента, используемого в стоматологии, см. 32.50 @ru
scope note: Bu sınıf aşağıdakileri kapsamaktadır; - seramik ve ferrit mıknatıs imalatı, - seramikten laboratuar ürünlerinin, kimyasal ve endüstriyel ürünlerin imalatı. Kapsam dışı olanlar; - suni taşların imalatı (örn. suni mermerler), bkz. 22.23, - ateşe dayanıklı seramik ürünlerin imalatı, bkz. 23.20, - seramik inşaat malzemelerin imalatı, bkz. 23.3. @tr
preferred label: Производство на друга техническа керамика @bg
preferred label: Výroba ostatních technických keramických výrobků @cs
preferred label: Fremstilling af andre keramiske produkter til teknisk brug @da
preferred label: Herstellung von keramischen Erzeugnissen für sonstige technische Zwecke @de
preferred label: Κατασκευή άλλων κεραμικών προϊόντων για τεχνικές χρήσεις @el
preferred label: Fabricación de otros productos cerámicos de uso técnico @es
preferred label: Muu tehnilise keraamika tootmine @et
preferred label: Muiden teknisten keraamisten tuotteiden valmistus @fi
preferred label: Fabrication d'autres produits céramiques à usage technique @fr
preferred label: Műszaki kerámia gyártása
preferred label: Fabbricazione di altri prodotti in ceramica per uso tecnico e industriale @it
preferred label: Kitų techninės paskirties keraminių gaminių ir dirbinių gamyba @lt
preferred label: Citu tehnisko keramikas izstrādājumu ražošana @lv
preferred label: Manifattura ta' prodotti oħra tekniċi taċ-ċeramika @mt
preferred label: Vervaardiging van ander technisch aardewerk @nl
preferred label: Produksjon av andre keramiske produkter for teknisk bruk @no
preferred label: Produkcja pozostałych ceramicznych wyrobów technicznych @pl
preferred label: Fabricação de outros produtos em cerâmica para usos técnicos @pt
preferred label: Fabricarea altor produse tehnice din ceramică @ro
preferred label: Производство прочих технических керамических изделий @ru
preferred label: Výroba ostatných technických keramických výrobkov @sk
preferred label: Proizvodnja druge tehnične keramike @sl
preferred label: Tillverkning av andra tekniska keramiska produkter @sv
preferred label: Diğer teknik seramik ürünlerin imalatı @tr
broader: Manufacture of other porcelain and ceramic products

Manufacture of other ceramic products
type: Concept
notation: 23.49
status: valid
status modified: 2013-10-18
accepted date: 2013-10-18
in scheme: Statistical Classification of Economic Activities in the European Community, Rev. 2 (2008)
scope note: - производство на керамични саксии, делви, съдове за селското стопанство, транспорт или за опаковки - производство на керамични изделия, некласифицирани другаде - производство на санитарна керамика - 23.42 - производство на изкуствени зъби - 32.50 @bg
scope note: Z: - výrobu keramických nádob používaných k přepravě nebo balení zboží - výrobu keramických výrobků j. n. N: - výrobu sanitární keramiky (23.42) - výrobu umělého chrupu (32.50) @cs
scope note: Diese Klasse umfasst: - Herstellung von keramischen Krügen und ähnlichen Behältnissen für Transport- oder Verpackungszwecke - Herstellung von keramischen Erzeugnissen a. n. g. Diese Klasse umfasst nicht: - Herstellung von Sanitärkeramik (s. 23.42) - Herstellung von künstlichen Zähnen (s. 32.50) @de
scope note: This class includes: - manufacture of ceramic pots, jars and similar articles of a kind used for conveyance or packing of goods - manufacture of ceramic products n.e.c. This class excludes: - manufacture of ceramic sanitary fixtures, see 23.42 - manufacture of artificial teeth, see 32.50 @en
scope note: Esta clase comprende: - la fabricación de potes, tarros y otros artículos similares del tipo empleado para el transporte o empaquetado de bienes - la fabricación de productos cerámicos n.c.o.p. Esta clase no comprende: - la fabricación de aparatos sanitarios cerámicos (véase 23.42) - la fabricación de piezas dentales artificiales (véase 32.50) @es
scope note: Cette classe comprend: - la fabrication de cruchons et de récipients similaires de transport ou d’emballage, en céramique - la fabrication de produits céramiques non classés ailleurs Cette classe ne comprend pas: - la fabrication d’appareils sanitaires en céramique, voir 23.42 - la production de dents artificielles, voir 32.50 @fr
scope note: Ovaj razred uključuje: - proizvodnju keramičkih lonaca, posuda i sl. proizvoda za pakiranje i prijevoz - proizvodnju proizvoda od keramike d. n. Ovaj razred isključuje: - proizvodnju sanitarne keramike za ugradnju, vidi 23.42 - proizvodnju umjetnih zubi, vidi 32.50
scope note: Į šią klasę įeina: - prekėms gabenti ar pakuoti naudojamų keraminių puodų, puodynių ir panašių dirbinių gamyba - kitur nepriskirtų keraminių gaminių ir dirbinių gamyba Į šią klasę neįeina: - keraminės sanitarinės įrangos gamyba, žr. 23.42 - dirbtinių dantų gamyba, žr. 32.50 @lt
scope note: Этот класс включает: - производство негашеной, гашеной и гидравлической извести - производство штукатурки из обожженного гипса или кальцинированного сульфата Этот класс также включает: - производство кальцинированного доломита Этот класс исключает: - производство изделий из штукатурки, см. 23.62, 23.69 @ru
scope note: Bu sınıf aşağıdakileri kapsamaktadır; - malların taşınması ya da ambalajlanması için kullanılan seramik çömleklerin, kavanozların ve çeşitli benzer ürünlerin imalatı, - başka yerde sınıflandırılmamış seramik ürünlerin imalatı. Kapsam dışı olanlar; - seramik sıhhi ürünlerin imalatı, bkz. 23.42, - suni diş imalatı, bkz. 32.50. @tr
preferred label: Производство на други керамични изделия, некласифицирани другаде @bg
preferred label: Výroba ostatních keramických výrobků @cs
preferred label: Fremstilling af andre keramiske produkter @da
preferred label: Herstellung von sonstigen keramischen Erzeugnissen @de
preferred label: Παραγωγή άλλων προϊόντων κεραμικής @el
preferred label: Fabricación de otros productos cerámicos @es
preferred label: Muu keraamika tootmine @et
preferred label: Muiden keramiikkatuotteiden valmistus @fi
preferred label: Fabrication d'autres produits céramiques @fr
preferred label: Egyéb kerámiatermék gyártása
preferred label: Fabbricazione di altri prodotti in ceramica @it
preferred label: Kitų keraminių gaminių ir dirbinių gamyba @lt
preferred label: Cita veida keramikas izstrādājumu ražošana @lv
preferred label: Manifattura ta' prodotti oħra taċ-ċeramika @mt
preferred label: Vervaardiging van andere keramische producten @nl
preferred label: Produksjon av andre keramiske produkter @no
preferred label: Produkcja pozostałych wyrobów z ceramiki @pl
preferred label: Fabricação de outros produtos cerâmicos @pt
preferred label: Fabricarea altor produse ceramice n.c.a. @ro
preferred label: Производство прочих керамических изделий @ru
preferred label: Výroba ostatných keramických výrobkov @sk
preferred label: Proizvodnja drugih keramičnih izdelkov @sl
preferred label: Framställning av andra keramiska produkter @sv
preferred label: Başka yerde sınıflandırılmamış diğer seramik ürünlerin imalatı @tr
broader: Manufacture of other porcelain and ceramic products

Manufacture of cement, lime and plaster
type: Concept
notation: 23.5
status: valid
status modified: 2013-10-18
accepted date: 2013-10-18
in scheme: Statistical Classification of Economic Activities in the European Community, Rev. 2 (2008)
preferred label: Производство на цимент, вар и гипс @bg
preferred label: Výroba cementu, vápna a sádry @cs
preferred label: Fremstilling af cement, kalk og gips @da
preferred label: Herstellung von Zement, Kalk und gebranntem Gips @de
preferred label: Παραγωγή τσιμέντου, ασβέστη και γύψου @el
preferred label: Fabricación de cemento, cal y yeso @es
preferred label: Tsemendi-, lubja- ja kipsitootmine @et
preferred label: Sementin, kalkin ja kipsin valmistus @fi
preferred label: Fabrication de ciment, chaux et plâtre @fr
preferred label: Cement-, mész-, gipszgyártás
preferred label: Produzione di cemento, calce e gesso @it
preferred label: Cemento, kalkių ir gipso gamyba @lt
preferred label: Cementa, kaļķa un ģipša ražošana @lv
preferred label: Manifattura ta' siment, ġir u ġibs @mt
preferred label: Vervaardiging van cement, kalk en gips @nl
preferred label: Produksjon av sement, kalk og gips @no
preferred label: Produkcja cementu, wapna i gipsu @pl
preferred label: Fabricação de cimento, cal e gesso @pt
preferred label: Fabricarea cimentului, varului şi ipsosului @ro
preferred label: Производство цемента, извести и штукатурки @ru
preferred label: Výroba cementu, vápna a sadry @sk
preferred label: Proizvodnja cementa, apna, mavca @sl
preferred label: Tillverkning av cement, kalk och gips @sv
preferred label: Çimento, kireç ve alçı imalatı @tr
broader: Manufacture of other non-metallic mineral products
narrower: Manufacture of cement
narrower: Manufacture of lime and plaster

Manufacture of cement
type: Concept
notation: 23.51
status: valid
status modified: 2013-10-18
accepted date: 2013-10-18
in scheme: Statistical Classification of Economic Activities in the European Community, Rev. 2 (2008)
scope note: - производство на несмлян цимент "клинкер" и хидравличен цимент, вкл. портландцимент, алуминиев, шлаков и суперфосфатен цимент - производство на огнеупорни цименти, строителни разтвори, бетони и други подобни строителни смеси - 23.20 - производство на готови беmонови смеси и неогнеупорни строителни разтвори -23.63, 23.64 - производство на изделия от цимент - 23.69 - производство на зъболекарски цимент - 32.50 @bg
scope note: Z: - výrobu slínku a cementu hydraulického, včetně cementu portlandského, hlinitanového, struskového a superfosfátového N: - výrobu žáruvzdorných malt, betonů atd. (23.20) - výrobu transportních betonů a maltových směsí (23.63) - práškových malt (23.64) - výrobu cementových výrobků (23.65, 23.69) - výrobu cementů používaných v zubním lékařství (32.50) @cs
scope note: Diese Klasse umfasst: - Herstellung von Klinker und hydraulischen Zementen einschließlich Portlandzement, Tonerdeschmelzzement, Hüttenzement und Superphosphatzement Diese Klasse umfasst nicht: - Herstellung von feuerfesten Mörteln, Feuerbeton usw. (s. 23.20) - Herstellung von Transportbeton und -mörtel (s. 23.63, 23.64) - Herstellung von Erzeugnissen aus Zement (s. 23.69) - Herstellung von Dentalzementen (s. 32.50) @de
scope note: This class includes: - manufacture of clinkers and hydraulic cements, including Portland, aluminous cement, slag cement and superphosphate cements This class excludes: - manufacture of refractory mortars, concrete etc., see 23.20 - manufacture of ready-mixed and dry-mix concrete and mortars, see 23.63, 23.64 - manufacture of articles of cement, see 23.69 - manufacture of cements used in dentistry, see 32.50 @en
scope note: Esta clase comprende: - la fabricación de clinker y cementos hidráulicos, incluidos el portland, el cemento aluminoso, el cemento de escorias y los superfosfatos Esta clase no comprende: - la fabricación de morteros, hormigones, etc., refractarios (véase 23.20) - la fabricación de mezclas preparadas y secas para hormigón y mortero (véanse 23.63 y 23.64) - la fabricación de artículos de cemento (véase 23.69) - la fabricación de cementos empleados en odontología (véase 32.50) @es
scope note: Cette classe comprend: - la fabrication de ciments dits "clinkers" et de ciments hydrauliques, y compris les ciments Portland, les ciments alumineux, les ciments de laitier et les ciments surphosphatés Cette classe ne comprend pas: - la fabrication de mortiers, de bétons, etc., réfractaires, voir 23.20 - la fabrication de bétons et de mortiers prêts à l’emploi, voir 23.63 et 23.64 - la fabrication d’ouvrages en ciment, voir 23.69 - la fabrication de ciments d’obturation dentaire, voir 32.50 @fr
scope note: Ovaj razred uključuje: - proizvodnju klinkera i hidrauličkog cementa, uključujući portland-cement, aluminijski cement, cement od šljake i superfosfatni cement Ovaj razred isključuje: - proizvodnju vatrostalne žbuke, betona itd., vidi 23.20 - proizvodnju gotove i suhe betonske smjese i žbuke, vidi 23.63, 23.64 - proizvodnju proizvoda od cementa, vidi 23.69 - proizvodnju cementa koji se koristi u zubarstvu, vidi 32.50
scope note: Į šią klasę įeina: - klinkerių ir hidraulinio cemento, įskaitant portlandcementį, aliuminatinį cementą, šlakinį cementą ir superfosfatinį cementą, gamyba Į šią klasę neįeina: - ugniai atsparaus statybinio skiedinio, betono ir kt., gamyba, žr. 23.20 - prekinio betono, sausojo betono mišinio ir statybinių skiedinių gamyba, žr. 23.63, 23.64 - cemento dirbinių gamyba, žr. 23.69 - odontologijoje naudojamo cemento gamyba, žr. 32.50 @lt
scope note: Этот класс включает: - производство заводского бетона, цемента или изделий из искусственного камня для использования в строительных целях: • напольных покрытий, плиток для мощения, плит, панелей, труб, столбов и т.д. - производство готовых конструкций из цемента, бетона или искусственного камня для строительства или гражданского строительства @ru
scope note: Bu sınıf aşağıdakileri kapsamaktadır; - klinker ve suya dayanıklı çimento imalatı; portland, alüminyumlu çimento (boksit çimentosu), cüruf çimento ve süper fosfat çimentolar dahil. Kapsam dışı olanlar; - ateşe dayanıklı harç, beton vb. imalatı, bkz. 23.20, - hazır karışım ve kuru karışım çimentoların ve harçların imalatı, bkz. 23.63, 23.64, - çimentodan yapılmış ürünlerin imalatı, bkz. 23.69, - dişçilikte kullanılan çimentoların imalatı, bkz. 32.50. @tr
preferred label: Производство на цимент @bg
preferred label: Výroba cementu @cs
preferred label: Fremstilling af cement @da
preferred label: Herstellung von Zement @de
preferred label: Παραγωγή τσιμέντου @el
preferred label: Fabricación de cemento @es
preferred label: Tsemenditootmine @et
preferred label: Sementin valmistus @fi
preferred label: Fabrication de ciment @fr
preferred label: Cementgyártás
preferred label: Produzione di cemento @it
preferred label: Cemento gamyba @lt
preferred label: Cementa ražošana @lv
preferred label: Manifattura ta' siment @mt
preferred label: Vervaardiging van cement @nl
preferred label: Produksjon av sement @no
preferred label: Produkcja cementu @pl
preferred label: Fabricação de cimento @pt
preferred label: Fabricarea cimentului @ro
preferred label: Производство цемента @ru
preferred label: Proizvodnja cementa @sl
preferred label: Tillverkning av cement @sv
preferred label: Çimento imalatı @tr
broader: Manufacture of cement, lime and plaster

Manufacture of lime and plaster
type: Concept
notation: 23.52
status: valid
status modified: 2013-10-18
accepted date: 2013-10-18
in scheme: Statistical Classification of Economic Activities in the European Community, Rev. 2 (2008)
scope note: - производство на негасена, гасена и хидратна вар - производство на гипс - производство на калциниран доломит - производство на изделия от гипс - 23.62, 23.69 @bg
scope note: Z: - výrobu hašeného, nehašeného a hydraulického vápna - výrobu sádry z páleného sádrovce nebo páleného sulfátu ZT: - výrobu z páleného dolomitu N: - výrobu sádrových výrobků (23.62, 23.69) @cs
scope note: Diese Klasse umfasst: - Herstellung von gelöschtem und ungelöschtem sowie hydraulischem Kalk - Herstellung von Gips aus gebranntem Gipsstein oder gebranntem Sulfat Diese Klasse umfasst ferner: - Herstellung von gebranntem Dolomit Diese Klasse umfasst nicht: - Herstellung von Erzeugnissen aus Gips (s. 23.62, 23.69) @de
scope note: This class includes: - manufacture of quicklime, slaked lime and hydraulic lime - manufacture of plasters of calcined gypsum or calcined sulphate This class also includes: - manufacture of calcined dolomite This class excludes: - manufacture of articles of plaster, see 23.62, 23.69 @en
scope note: Esta clase comprende: - la fabricación de cal viva, cal apagada y cal hidráulica - la fabricación de yesos para enlucir a partir de yeso calcinado y sulfato calcinado Esta clase comprende también: - la fabricación de dolomita calcinada Esta clase no comprende: - la fabricación de artículos de yeso (véanse 23.62 y 23.69) @es
scope note: Cette classe comprend: - la fabrication de chaux vive, chaux éteinte et chaux hydraulique - la fabrication de plâtre Cette classe comprend également: - la production de dolomite calcinée Cette classe ne comprend pas: - la fabrication d’ouvrages en plâtre, voir 23.62 et 23.69 @fr
scope note: Ovaj razred uključuje: - proizvodnju negašenog, gašenog i hidrauličkog vapna - proizvodnju gipsa od pečene sadre ili pečenog sulfata Ovaj razred također uključuje: - proizvodnju pečenog dolomita Ovaj razred isključuje: - proizvodnju proizvoda od gipsa, vidi 23.62, 23.69
scope note: Į šią klasę įeina: - negesintų, gesintų ir hidraulinių kalkių gamyba - tinko gamyba iš pusvandenio gipso ar pusvandenio sulfato Į šią klasę taip pat įeina: - degtojo dolomito gamyba Į šią klasę neįeina: - gipso dirbinių gamyba, žr. 23.62, 23.69 @lt
scope note: Этот класс включает: - производство изделий из строительного гипса для использования в строительных целях: • щитов, листов, панелей и т.д. @ru
scope note: Bu sınıf aşağıdakileri kapsamaktadır; - sönmemiş kireç, sönmüş kireç ve suya dayanıklı kireç imalatı, - sönmüş alçı taşından ya da sönmüş sülfattan alçı imalatı. Ayrıca bu sınıf aşağıdakileri de kapsamaktadır; - sönmüş dolamit (beyaz mermer) imalatı. Kapsam dışı olanlar; - alçı ürünleri imalatı, bkz. 23.62, 23.69. @tr
preferred label: Производство на вар и гипс @bg
preferred label: Výroba vápna a sádry @cs
preferred label: Fremstilling af kalk og gips @da
preferred label: Herstellung von Kalk und gebranntem Gips @de
preferred label: Παραγωγή ασβέστη και γύψου @el
preferred label: Fabricación de cal y yeso @es
preferred label: Lubja- ja kipsitootmine @et
preferred label: Kalkin ja kipsin valmistus @fi
preferred label: Fabrication de chaux et plâtre @fr
preferred label: Mész-, gipszgyártás
preferred label: Produzione di calce e gesso @it
preferred label: Kalkių ir gipso gamyba @lt
preferred label: Kaļķa un ģipša ražošana @lv
preferred label: Manifattura ta' ġir u ġibs @mt
preferred label: Vervaardiging van kalk en gips @nl
preferred label: Produksjon av kalk og gips @no
preferred label: Produkcja wapna i gipsu @pl
preferred label: Fabricação de cal e gesso @pt
preferred label: Fabricarea varului şi ipsosului @ro
preferred label: Производство извести и строительного гипса @ru
preferred label: Výroba vápna a sadry @sk
preferred label: Proizvodnja apna in mavca @sl
preferred label: Tillverkning av kalk och gips @sv
preferred label: Kireç ve alçı imalatı @tr
broader: Manufacture of cement, lime and plaster

Manufacture of articles of concrete, cement and plaster
type: Concept
notation: 23.6
status: valid
status modified: 2013-10-18
accepted date: 2013-10-18
in scheme: Statistical Classification of Economic Activities in the European Community, Rev. 2 (2008)
scope note: Этот класс включает: - производство готовых и сухих строительных растворов и бетона Этот класс исключает: - производство огнеупорных видов цемента, см. 23.20 @ru
preferred label: Производство на изделия от бетон, гипс и цимент @bg
preferred label: Výroba betonových, cementových a sádrových výrobků @cs
preferred label: Fremstilling af produkter af beton, cement og gips @da
preferred label: Herstellung von Erzeugnissen aus Beton, Zement und Gips @de
preferred label: Κατασκευή προϊόντων από σκυρόδεμα, τσιμέντο και γύψο @el
preferred label: Fabricación de elementos de hormigón, cemento y yeso @es
preferred label: Betoon-, tsement- ja kipstoodete tootmine @et
preferred label: Betoni-, kipsi- ja sementtituotteiden valmistus @fi
preferred label: Fabrication d'ouvrages en béton, en ciment ou en plâtre @fr
preferred label: Beton-, gipsz-, cementtermék gyártása
preferred label: Fabbricazione di prodotti in calcestruzzo, cemento e gesso @it
preferred label: Betono, cemento ir gipso gaminių bei dirbinių gamyba @lt
preferred label: Betona, cementa un ģipša izstrādājumu ražošana @lv
preferred label: Manifattura ta' oġġetti tal-konkos, siment u ġibs @mt
preferred label: Vervaardiging van artikelen van beton, cement en gips @nl
preferred label: Produksjon av betong-, sement- og gipsprodukter @no
preferred label: Produkcja wyrobów z betonu, cementu i gipsu @pl
preferred label: Fabricação de produtos de betão, cimento e gesso @pt
preferred label: Fabricarea articolelor din beton, ciment şi ipsos @ro
preferred label: Производство изделий из бетона, цемента и строительного гипса @ru
preferred label: Výroba betónových výrobkov, cementu a sadry @sk
preferred label: Proizvodnja izdelkov iz betona, cementa, mavca @sl
preferred label: Tillverkning av varor av betong, cement och gips @sv
preferred label: Beton, çimento ve alçıdan yapılmış eşyaların imalatı @tr
broader: Manufacture of other non-metallic mineral products
narrower: Manufacture of concrete products for construction purposes
narrower: Manufacture of plaster products for construction purposes
narrower: Manufacture of ready-mixed concrete
narrower: Manufacture of mortars
narrower: Manufacture of fibre cement
narrower: Manufacture of other articles of concrete, plaster and cement

Manufacture of concrete products for construction purposes
type: Concept
notation: 23.61
status: valid
status modified: 2013-10-18
accepted date: 2013-10-18
in scheme: Statistical Classification of Economic Activities in the European Community, Rev. 2 (2008)
scope note: - производство на изделия от бетон, цимент или изкуствен камък за строителството: • плочи, тухли, тръби, стълбове, керемиди и други - производство на сглобяеми строителни елементи (панели) за сгради или строителни съоръжения от цимент, бетон или изкуствен камък @bg
scope note: Z: - výrobu prefabrikovaných stavebních prvků z betonu, cementu nebo umělých kamenů pro stavebnictví: • panelů, cihel, dlaždic, dlažebních kostek, tašek, desek, trubek, sloupů atd. - výrobu prefabrikovaných stavebních dílců pro budovy nebo inženýrská díla z betonu, cementu nebo umělého kamene @cs
scope note: Diese Klasse umfasst: - Herstellung von Waren aus Betonfertigteilen, Zement oder Kunststein für Bauzwecke: • Platten, Mauersteine, Tafeln, Dielen, Rohre, Pfosten usw. - Herstellung von vorgefertigten Bauelementen aus Beton, Zement oder Kunststein @de
scope note: This class includes: - manufacture of precast concrete, cement or artificial stone articles for use in construction: • tiles, flagstones, bricks, boards, sheets, panels, pipes, posts etc. - manufacture of prefabricated structural components for building or civil engineering of cement, concrete or artificial stone @en
scope note: Esta clase comprende: - la fabricación de elementos premoldeados de hormigón, cemento o piedra artificial para la construcción: • baldosas, losas, ladrillos, planchas, paneles, tuberías, postes, etc. - la fabricación de elementos estructurales prefabricados para la construcción de hormigón, cemento o piedra artificial @es
scope note: Cette classe comprend: - la fabrication d’ouvrages préfabriqués en béton, en ciment ou en pierre artificielle utilisés en construction: • tuiles, carreaux, dalles, briques, plaques, panneaux, tuyaux, piliers, etc. - la fabrication d’éléments préfabriqués en béton, en ciment ou en pierre artificielle pour le bâtiment et le génie civil @fr
scope note: Ovaj razred uključuje: - proizvodnju oblikovanih proizvoda od betona, cementa ili umjetnoga kamena, za upotrebu u građevinarstvu: • crepova, ploča za popločavanje, cigli, greda, panela, cijevi, stupova itd. - proizvodnju montažnih građevinskih elemenata za visokogradnju ili niskogradnju, od cementa, betona ili umjetnoga kamena
scope note: Į šią klasę įeina: - statyboje naudojamų gamyklinio betono, cemento ar dirbtinio akmens dirbinių gamyba: • plytelių, šaligatvio ir grindinio plytelių, plokščių, lakštų, skydų, vamzdžių, stulpų ir kt. - cemento, betono ar dirbtinio akmens pastatų ar inžinerinių statinių surenkamųjų konstrukcinių elementų gamyba @lt
scope note: Этот класс включает: - производство растворов в порошкообразном виде Этот класс исключает: - производство огнеупорных видов раствора, см. 23.20 - производство сухого бетона и раствора, см. 23.63 @ru
scope note: Bu sınıf aşağıdakileri kapsamaktadır; - inşaatta kullanmak üzere önceden kalıba dökülmüş beton, çimento ya da suni taş mamullerinin imalatı: • karo, büyük ve yassı döşeme taşı, tuğla, briket,levha, panel, pano, direkler, kazıklar ve benzeri ürünler, - çimento, beton ya da suni taştan bina ya da bina dışı inşaat amaçlı prefabrik temel yapısal elemanların imalatı. @tr
preferred label: Производство на изделия от бетон за строителството @bg
preferred label: Výroba betonových výrobků pro stavební účely @cs
preferred label: Fremstilling af byggematerialer af beton @da
preferred label: Herstellung von Erzeugnissen aus Beton, Zement und Kalksandstein für den Bau @de
preferred label: Κατασκευή δομικών προϊόντων από σκυρόδεμα @el
preferred label: Fabricación de elementos de hormigón para la construcción @es
preferred label: Betoonist ehitustoodete tootmine @et
preferred label: Betonituotteiden valmistus rakennustarkoituksiin @fi
preferred label: Fabrication d'éléments en béton pour la construction @fr
preferred label: Építési betontermék gyártása
preferred label: Fabbricazione di prodotti in calcestruzzo per l'edilizia @it
preferred label: Betono gaminių, skirtų statybinėms reikmėms, gamyba @lt
preferred label: Būvniecībai paredzēto betona izstrādājumu ražošana @lv
preferred label: Manifattura ta' prodotti tal-konkos għall-għanijiet tal-kostruzzjoni @mt
preferred label: Vervaardiging van artikelen van beton voor de bouw @nl
preferred label: Produksjon av betongprodukter for bygge- og anleggsvirksomhet @no
preferred label: Produkcja wyrobów budowlanych z betonu @pl
preferred label: Fabricação de produtos de betão para a construção @pt
preferred label: Fabricarea produselor din beton pentru construcţii @ro
preferred label: Производство строительных изделий из бетона @ru
preferred label: Výroba betónových výrobkov na stavebné účely @sk
preferred label: Proizvodnja betonskih izdelkov za gradbeništvo @sl
preferred label: Tillverkning av betongvaror för byggändamål @sv
preferred label: İnşaat amaçlı beton ürünlerin imalatı @tr
broader: Manufacture of articles of concrete, cement and plaster

Manufacture of plaster products for construction purposes
type: Concept
notation: 23.62
status: valid
status modified: 2013-10-18
accepted date: 2013-10-18
in scheme: Statistical Classification of Economic Activities in the European Community, Rev. 2 (2008)
scope note: - производство на изделия от гипс или от смеси на базата на гипс за строителството: • плоскости, плочи, пана, плочки и подобни изделия @bg
scope note: Z: - výrobu sádrových výrobků pro stavební účely: • panelů, dlaždic, desek atd. @cs
scope note: Diese Klasse umfasst: - Herstellung von Waren aus Gips für Bauzwecke: • Platten, Tafeln, Dielen usw. @de
scope note: This class includes: - manufacture of plaster articles for use in construction: • boards, sheets, panels etc. @en
scope note: Esta clase comprende: - la fabricación de elementos de yeso y escayola para la construcción: • planchas, placas, paneles, etc. @es
scope note: Cette classe comprend: - la fabrication d’ouvrages en plâtre utilisés en construction: • plaques, panneaux, etc. @fr
scope note: Ovaj razred uključuje: - proizvodnju predmeta od gipsa za upotrebu u građevinarstvu: • blokova, ploča, panela itd.
scope note: Į šią klasę įeina: - statybinių gipso dirbinių gamyba: • plokščių, lakštų, skydų ir kt. @lt
scope note: Этот класс включает: - производство строительных материалов из растительного сырья (древесной шерсти, соломы, тростника, камыша), смешанного с цементом, гипсом или другими минеральными связующими материалами - производство изделий из асбестоцемента и волокнистого цемента с волокнами целлюлозы или аналогичных материалов: • гофрированных листов (шифера), прочих листов, панелей, черепицы, труб, трубок, резервуаров, чанов, моек, раковин, сосудов, мебели, оконных коробок и т.п. @ru
scope note: Bu sınıf aşağıdakileri kapsamaktadır; - inşaatta kullanıma yönelik alçı ürünleri imalatı; • levhalar, panolar, paneller vb.. @tr
preferred label: Производство на изделия от гипс за строителството @bg
preferred label: Výroba sádrových výrobků pro stavební účely @cs
preferred label: Fremstilling af byggematerialer af gips @da
preferred label: Herstellung von Gipserzeugnissen für den Bau @de
preferred label: Κατασκευή δομικών προϊόντων από γύψο @el
preferred label: Fabricación de elementos de yeso para la construcción @es
preferred label: Kipsist ehitustoodete tootmine @et
preferred label: Kipsituotteiden valmistus rakennustarkoituksiin @fi
preferred label: Fabrication d'éléments en plâtre pour la construction @fr
preferred label: Építési gipsztermék gyártása
preferred label: Fabbricazione di prodotti in gesso per l'edilizia @it
preferred label: Gipso gaminių, naudojamų statybinėms reikmėms, gamyba @lt
preferred label: Būvniecībai paredzēto ģipša izstrādājumu ražošana @lv
preferred label: Manifattura ta' prodotti tal-ġibs għall-għanijiet tal-kostruzzjoni @mt
preferred label: Vervaardiging van artikelen van gips voor de bouw @nl
preferred label: Produksjon av gipsprodukter for bygge- og anleggsvirksomhet @no
preferred label: Produkcja wyrobów budowlanych z gipsu @pl
preferred label: Fabricação de produtos de gesso para a construção @pt
preferred label: Fabricarea produselor din ipsos pentru construcţii @ro
preferred label: Производство изделий из гипса для строительных целей @ru
preferred label: Výroba sadrových výrobkov na stavebné účely @sk
preferred label: Proizvodnja izdelkov iz mavca za gradbeništvo @sl
preferred label: Tillverkning av gipsvaror för byggändamål @sv
preferred label: İnşaat amaçlı alçı ürünlerinin imalatı @tr
broader: Manufacture of articles of concrete, cement and plaster

Manufacture of ready-mixed concrete
type: Concept
notation: 23.63
status: valid
status modified: 2013-10-18
accepted date: 2013-10-18
in scheme: Statistical Classification of Economic Activities in the European Community, Rev. 2 (2008)
scope note: - производство на готови за изливане бетонови смеси и неогнеупорни строителни разтвори - производство на огнеупорни цименти и бетони - 23.20 @bg
scope note: Z: - výrobu transportních betonů a malt, betonových a maltových směsí N: - výrobu žáruvzdorných betonů (23.20) @cs
scope note: Diese Klasse umfasst: - Herstellung von Transportbeton und -mörtel Diese Klasse umfasst nicht: - Herstellung von Feuerbeton (s. 23.20) @de
scope note: This class includes: - manufacture of ready-mix and dry-mix concrete and mortars This class excludes: - manufacture of refractory cements, see 23.20 @en
scope note: Esta clase comprende: - la fabricación de mezclas preparadas y secas para hormigón y mortero Esta clase no comprende: - la fabricación de cementos refractarios (véase 23.20) @es
scope note: Cette classe comprend: - la fabrication de bétons et de mortiers prêts à l’emploi Cette classe ne comprend pas: - la fabrication de ciments réfractaires, voir 23.20 @fr
scope note: Ovaj razred uključuje: - proizvodnju gotove i suhe betonske smjese i žbuke Ovaj razred isključuje: - proizvodnju vatrostalnog cementa, vidi 23.20
scope note: Į šią klasę įeina: - prekinio betono ir sausojo betono mišinio ir statybinių skiedinių gamyba Į šią klasę neįeina: - ugniai atsparaus cemento gamyba, žr. 23.20 @lt
scope note: Этот класс включает: - производство прочих изделий из бетона, строительного гипса, цемента или искусственного камня: • скульптур, фурнитуры, барельефов, ваз, цветочных горшков и т.д. @ru
scope note: Bu sınıf aşağıdakileri kapsamaktadır; - hazır ve kuru karma beton ve harç imalatı. Kapsam dışı olanlar; - ateşe dayanıklı çimento imalatı, bkz. 23.20. @tr
preferred label: Производство на готови бетонови смеси @bg
preferred label: Výroba betonu připraveného k lití @cs
preferred label: Fremstilling af færdigblandet beton @da
preferred label: Herstellung von Frischbeton (Transportbeton) @de
preferred label: Κατασκευή έτοιμου σκυροδέματος @el
preferred label: Fabricación de hormigón fresco @es
preferred label: Valmis betoonisegu tootmine @et
preferred label: Valmisbetonin valmistus @fi
preferred label: Fabrication de béton prêt à l'emploi @fr
preferred label: Előre kevert beton gyártása
preferred label: Fabbricazione di calcestruzzo pronto per l'uso @it
preferred label: Prekinio betono mišinio gamyba @lt
preferred label: Gatavo betona maisījumu ražošana @lv
preferred label: Manifattura ta' konkos mħawwad għal-lest @mt
preferred label: Vervaardiging van stortklare beton @nl
preferred label: Produksjon av ferdigblandet betong @no
preferred label: Produkcja masy betonowej prefabrykowanej @pl
preferred label: Fabricação de betão pronto @pt
preferred label: Fabricarea betonului @ro
preferred label: Производство готового бетона @ru
preferred label: Výroba transportného betónu @sk
preferred label: Proizvodnja sveže betonske mešanice @sl
preferred label: Tillverkning av fabriksblandad betong @sv
preferred label: Hazır karma beton imalatı @tr
broader: Manufacture of articles of concrete, cement and plaster

Manufacture of mortars
type: Concept
notation: 23.64
status: valid
status modified: 2013-10-18
accepted date: 2013-10-18
in scheme: Statistical Classification of Economic Activities in the European Community, Rev. 2 (2008)
scope note: - производство на неогнеупорни сухи строителни смеси - производство на огнеупорни строителни разтвори - 23.20 - производство на готови за изливане бетонови смеси - 23.63 @bg
scope note: Z: - výrobu práškových malt N: - výrobu žáruvzdorné malty (23.20) - výrobu transportních malt a maltových směsí (23.63) @cs
scope note: Diese Klasse umfasst: - Herstellung von Mörtel in Pulverform Diese Klasse umfasst nicht: - Herstellung von feuerfestem Mörtel (s. 23.20) - Herstellung von Transportbeton und -mörtel (s. 23.63) @de
scope note: This class includes: - manufacture of powdered mortars This class excludes: - manufacture of refractory mortars, see 23.20 - manufacture of dry-mixed concrete and mortars, see 23.63 @en
scope note: Esta clase comprende: - la fabricación de morteros en polvo Esta clase no comprende: - la fabricación de morteros refractarios (véase 23.20) - la fabricación de mezclas secas para hormigón y mortero (véase 23.63) @es
scope note: Cette classe comprend: - la fabrication de mortiers en poudre Cette classe ne comprend pas: - la fabrication de mortiers réfractaires, voir 23.20 - la fabrication de bétons et de mortiers prêts à l’emploi, voir 23.63 @fr
scope note: Ovaj razred uključuje: - proizvodnju žbuke u prahu Ovaj razred isključuje: - proizvodnju vatrostalne žbuke, vidi 23.20 - proizvodnju suho miješanog betona i žbuke, vidi 23.63
scope note: Į šią klasę įeina: - statybinių skiedinių miltelių gamyba Į šią klasę neįeina: - ugniai atsparių statybinių skiedinių gamyba, žr. 23.20 - sausojo betono mišinio ir statybinių skiedinių gamyba, žr. 23.63 @lt
scope note: Bu sınıf aşağıdakileri kapsamaktadır; - toz harç imalatı. Kapsam dışı olanlar; - ateşe dayanıklı harç imalatı, bkz. 23.20. - kuru betonların ve harçların imalatı, bkz. 23.63. @tr
preferred label: Производство на неогнеупорни строителни разтвори @bg
preferred label: Výroba malt @cs
preferred label: Fremstilling af mørtel @da
preferred label: Herstellung von Mörtel und anderem Beton (Trockenbeton) @de
preferred label: Κατασκευή κονιαμάτων @el
preferred label: Fabricación de mortero @es
preferred label: Mörditootmine @et
preferred label: Muurauslaastin valmistus @fi
preferred label: Fabrication de mortiers et bétons secs @fr
preferred label: Habarcsgyártás
preferred label: Fabbricazione di malta @it
preferred label: Statybinių skiedinių gamyba @lt
preferred label: Javu ražošana @lv
preferred label: Manifattura ta' taħlit ta' ġir jew siment, ramel u ilma @mt
preferred label: Vervaardiging van mortel @nl
preferred label: Produksjon av mørtel @no
preferred label: Produkcja zaprawy murarskiej @pl
preferred label: Fabricação de argamassas @pt
preferred label: Fabricarea mortarului @ro
preferred label: Производство растворов @ru
preferred label: Výroba malty @sk
preferred label: Proizvodnja malte @sl
preferred label: Tillverkning av murbruk @sv
preferred label: Toz harç imalatı @tr
broader: Manufacture of articles of concrete, cement and plaster

Manufacture of fibre cement
type: Concept
notation: 23.65
status: valid
status modified: 2013-10-18
accepted date: 2013-10-18
in scheme: Statistical Classification of Economic Activities in the European Community, Rev. 2 (2008)
scope note: - производство на строителни материали от растителни суровини (талаш, слама, тръстика, камъш), агломерирани с цимент, гипс или други минерални свързващи вещества - производство на изделия от азбестоцимент, целулозен цимент (фиброцимент): • плочи, гофрирани плоскости, плочки, пана, керемиди, облицовки, тръби и съединителни части за тях, мебели, басейни, саксии за цветя, рамки за прозорци и други @bg
scope note: Z: - výrobu stavebních materiálů obsahujících rostlinné části (dřevitou vlnu, slámu, rákos, sítinu apod.) spojovaných cementem, sádrou nebo jinými minerálními pojivy - výrobu výrobků z azbestocementu, celulózového vláknocementu nebo podobných materiálů: • vlnitých desek, jiných desek a panelů, obkladů, dlažeb, tvarovek, trubek, nádrží, žlabů, koryt, výlevek, nádob, nábytku, okenních rámů atd. @cs
scope note: Diese Klasse umfasst: - Herstellung von mit Zement, Gips oder anderen mineralischen Bindemitteln vermischten Baumaterialien aus pflanzlichen Stoffen (Holzwolle, Stroh, Schilfrohr, Binsen) - Herstellung von Waren aus Asbestzement, Cellulosezement oder dergleichen: • Wellplatten, andere Platten, Tafeln, Fliesen, Rohre, Becken, Tröge, Schalen, Ausgüsse, Gefäße, Möbel, Fensterrahmen usw. @de
scope note: This class includes: - manufacture of building materials of vegetable substances (wood wool, straw, reeds, rushes) agglomerated with cement, plaster or other mineral binder - manufacture of articles of asbestos-cement or cellulose fibre-cement or the like: • corrugated sheets, other sheets, panels, tiles, tubes, pipes, reservoirs, troughs, basins, sinks, jars, furniture, window frames etc. @en
scope note: Esta clase comprende: - la fabricación de materiales de construcción de materias vegetales (lana de madera, paja, cañas, juncos) aglomerados con cemento, yeso u otros aglutinantes minerales - la fabricación de artículos de asbestocemento o fibrocemento de celulosa y similares: • placas onduladas, otras placas, paneles, tejas, tubos, tuberías, depósitos, abrevaderos, lavabos, fregaderos, jarras, mobiliario, marcos de ventana, etc. @es
scope note: Cette classe comprend: - la fabrication de matériaux de construction en substances végétales (laine de bois, paille, roseaux, joncs) agglomérés avec du ciment, du plâtre ou d’autres liants minéraux - la fabrication d’ouvrages en amiante-ciment: • plaques ondulées ou autres, panneaux, carreaux, tuiles, tuyaux, gaines, réservoirs, auges, bassins, éviers, cruchons, meubles, cadres de fenêtres, etc. @fr
scope note: Ovaj razred uključuje: - proizvodnju građevnog materijala od biljnih tvari (drvene vune, slame, trstike, sitka) aglomeriranih cementom, gipsom, (sadrom) ili drugim mineralnim vezivima - proizvodnju proizvoda od azbestnog cementa i celuloznog fibrocementa te sličnoga: • valovitih i drugih ploča, panela, crepova, cijevi, rezervoara, propusta, bazena, slivnika, posuda, namještaja, okvira za prozore itd.
scope note: Į šią klasę įeina: - statybinių medžiagų gamyba iš augalinių medžiagų (medienos vatos, šiaudų, nendrių, meldų) aglomeruotų cementu, gipsu ar kitomis mineralinėmis rišamosiomis medžiagomis - asbestcemenčio arba celiuliozės fibrocemenčio ar panašių medžiagų gaminių gamyba: • gofruotųjų lakštų, kitokių lakštų, plokščių, plytelių, vamzdžių, vamzdelių, talpyklų, latakų, dubenų, kriauklių, ąsočių, baldų, langų staktų ir kt. @lt
scope note: Этот класс включает: - резку, формовку и обработку камня для использования в строительных целях, на кладбищах, автодорогах, для покрытия крыш и т.д. - производство каменной мебели Этот класс исключает: - виды деятельности, выполняемые операторами карьеров, например, добычу необработанного крупнорезанного камня, см. 08.11 - производство жерновов, абразивного камня и подобных изделий, см. 23.9 @ru
scope note: Bu sınıf aşağıdakileri kapsamaktadır; - çimento, alçı veya diğer mineral yapıştırıcılar ile bir araya getirilmiş bitkisel maddelerden (odun yünü, saman, kamış, sazlar) yapı malzemeleri imalatı, - asbestli çimento veya selüloz lifli çimento ya da benzerlerinden ürünlerin imalatı; • oluklu levha, diğer levhalar, panolar, karolar, tüpler, borular, sarnıçlar, oluklar, leğenler, lavabolar, kavanozlar, mobilyalar, pencere çerçeveleri vb.. @tr
preferred label: Производство на влакнесто-циментови изделия @bg
preferred label: Výroba vláknocementových výrobků @cs
preferred label: Fremstilling af fibercement @da
preferred label: Herstellung von Faserzementwaren @de
preferred label: Κατασκευή ινοτσιμέντου @el
preferred label: Fabricación de fibrocemento @es
preferred label: Kiudtsemendi tootmine @et
preferred label: Kuitusementin valmistus @fi
preferred label: Fabrication d'ouvrages en fibre ciment @fr
preferred label: Szálerősítésű cement gyártása
preferred label: Fabbricazione di prodotti in fibrocemento @it
preferred label: Fibrolito gamyba @lt
preferred label: Šķiedru cementa izstrādājumu ražošana @lv
preferred label: Manifattura ta' fibra tas-siment @mt
preferred label: Vervaardiging van producten van vezelcement @nl
preferred label: Produksjon av fibersement @no
preferred label: Produkcja cementu wzmocnionego włóknem @pl
preferred label: Fabricação de produtos de fibrocimento @pt
preferred label: Fabricarea produselor din azbociment @ro
preferred label: Производство волокнистого цемента @ru
preferred label: Výroba cementových vlákien @sk
preferred label: Proizvodnja izdelkov iz vlaknatega cementa @sl
preferred label: Tillverkning av fibercementvaror @sv
preferred label: Lif ve çimento karışımlı ürünlerin imalatı @tr
broader: Manufacture of articles of concrete, cement and plaster

Manufacture of other articles of concrete, plaster and cement
type: Concept
notation: 23.69
status: valid
status modified: 2013-10-18
accepted date: 2013-10-18
in scheme: Statistical Classification of Economic Activities in the European Community, Rev. 2 (2008)
scope note: - производство на други изделия от бетон, гипс, цимент или изкуствен камък: • статуи, мебели, архитектурни декоративни елементи, вази, саксии за цветя и други @bg
scope note: Z: - výrobu ostatních výrobků z betonu, sádry, cementu nebo umělých kamenů: • sošek, nábytku, nízkého a vysokého reliéfu, váz, květináčů atd. @cs
scope note: Diese Klasse umfasst: - Herstellung von sonstigen Erzeugnissen aus Beton, Gips, Zement oder Kunststein: • Figuren, Möbel, Flach- und Hochreliefs, Vasen, Blumentöpfe usw. @de
scope note: This class includes: - manufacture of other articles of concrete, plaster, cement or artificial stone: • statuary, furniture, bas- and haut-reliefs, vases, flowerpots etc. @en
scope note: Esta clase comprende: - la fabricación de otros productos de hormigón, yeso, cemento y piedra artificial: • estatuas, mobiliario, altorrelieves y bajorrelieves, jarrones, jardineras, etc. @es
scope note: Cette classe comprend: - la fabrication d’autres ouvrages en béton, en ciment, en plâtre ou en pierre artificielle: • statues, meubles, bas-reliefs, hauts-reliefs, vases, pots de fleurs, etc. @fr
scope note: Ovaj razred uključuje: - proizvodnju ostalih proizvoda od betona, gipsa, cementa ili umjetnoga kamena: • kipova, namještaja, udubljenih i ispupčenih reljefa, vaza, lonaca za cvijeće itd.
scope note: Į šią klasę įeina: - kitų betono, gipso, cemento ar dirbtinio akmens gaminių bei dirbinių gamyba: • skulptūrų, baldų, bareljefų, horeljefų, vazų, gėlių vazonų ir kt. @lt
scope note: Данная группа включает производство прочих неметаллических минеральных изделий. @ru
scope note: Bu sınıf aşağıdakileri kapsamaktadır; - beton, alçı, çimento ya da suni taştan diğer ürünlerin imalatı: • heykel, mobilya, alçak ve yüksek kabartmalar, vazolar, çiçek saksıları vb. @tr
preferred label: Производство на други изделия от бетон, гипс и цимент @bg
preferred label: Výroba ostatních betonových, cementových a sádrových výrobků @cs
preferred label: Fremstilling af andre beton-, gips- og cementprodukter @da
preferred label: Herstellung von sonstigen Erzeugnissen aus Beton, Zement und Gips a. n. g. @de
preferred label: Κατασκευή άλλων προϊόντων από σκυρόδεμα, γύψο και τσιμέντο @el
preferred label: Fabricación de otros productos de hormigón, yeso y cemento @es
preferred label: Muude betoon-, kips- ja tsementtoodete tootmine @et
preferred label: Muiden betoni-, kipsi- ja sementtituotteiden valmistus @fi
preferred label: Fabrication d'autres ouvrages en béton, en ciment ou en plâtre @fr
preferred label: Egyéb beton-, gipsz-, cementtermék gyártása
preferred label: Fabbricazione di altri prodotti in calcestruzzo, gesso e cemento @it
preferred label: Kitų betono, gipso ir cemento gaminių bei dirbinių gamyba @lt
preferred label: Citu betona, ģipša un cementa izstrādājumu ražošana @lv
preferred label: Manifattura ta' oġġetti oħra tal-konkos, ġibs u siment @mt
preferred label: Vervaardiging van andere artikelen van beton, gips en cement @nl
preferred label: Produksjon av betong-, sement- og gipsprodukter ellers @no
preferred label: Produkcja pozostałych wyrobów z betonu, gipsu i cementu @pl
preferred label: Fabricação de outros produtos de betão, gesso e cimento @pt
preferred label: Fabricarea altor articole din beton, ciment şi ipsos @ro
preferred label: Производство прочих изделий из бетона, строительного гипса и цемента @ru
preferred label: Výroba ostatných výrobkov z betónu, sadry a cementu @sk
preferred label: Proizvodnja drugih izdelkov iz betona, cementa, mavca @sl
preferred label: Tillverkning av andra varor av betong, cement och gips @sv
preferred label: Beton, alçı ve çimentodan yapılmış diğer ürünlerin imalatı @tr
broader: Manufacture of articles of concrete, cement and plaster

Cutting, shaping and finishing of stone
type: Concept
notation: 23.7
status: valid
status modified: 2013-10-18
accepted date: 2013-10-18
in scheme: Statistical Classification of Economic Activities in the European Community, Rev. 2 (2008)
scope note: Этот класс включает: - производство жерновов, точильных или полирующих камней и природных или искусственных абразивных материалов, включая шлифовальные материалы на мягкой основе (например, наждачная бумага) @ru
preferred label: Рязане, профилиране и обработване на строителни и декоративни скални материали @bg
preferred label: Řezání, tvarování a konečná úprava kamenů @cs
preferred label: Tilhugning, tilskæring og færdigbearbejdning af sten @da
preferred label: Be- und Verarbeitung von Naturwerksteinen und Natursteinen a. n. g. @de
preferred label: Κοπή, μορφοποίηση και τελική επεξεργασία λίθων @el
preferred label: Corte, tallado y acabado de la piedra @es
preferred label: Kivilõikamine, -vormimine ja -viimistlus @et
preferred label: Kiven leikkaaminen, muotoilu ja viimeistely @fi
preferred label: Taille, façonnage et finissage de pierres @fr
preferred label: Kőmegmunkálás
preferred label: Taglio, modellatura e finitura di pietre @it
preferred label: Akmens pjaustymas, tašymas ir apdailinimas @lt
preferred label: Būvakmeņu un dekoratīvo akmeņu zāģēšana, apdare un apstrāde @lv
preferred label: Qtugħ, iffurmar u rfinar ta' ġebel @mt
preferred label: Houwen, bewerken en afwerken van natuursteen @nl
preferred label: Hogging og bearbeiding av monument- og bygningsstein @no
preferred label: Cięcie, formowanie i wykańczanie kamienia @pl
preferred label: Serragem, corte e acabamento de pedra @pt
preferred label: Tăierea, fasonarea şi finisarea pietrei @ro
preferred label: Резка, обработка и отделка камня @ru
preferred label: Rezanie, tvarovanie a konečná úprava kameňa @sk
preferred label: Obdelava naravnega kamna @sl
preferred label: Huggning, formning och slutlig bearbetning av sten @sv
preferred label: Taş ve mermerin kesilmesi, şekil verilmesi ve kullanılabilir hale getirilmesi @tr
broader: Manufacture of other non-metallic mineral products
narrower: Cutting, shaping and finishing of stone

Cutting, shaping and finishing of stone
type: Concept
notation: 23.70
status: valid
status modified: 2013-10-18
accepted date: 2013-10-18
in scheme: Statistical Classification of Economic Activities in the European Community, Rev. 2 (2008)
scope note: - рязане, профилиране и обработване на скални материали, използвани в строителството и пътните работи, за надгробни паметници, настилки и за други цели - производство на мебели от декоративни камъни - добив, грубо обработване и нарязване на строителни и декоративни скални материали - 08.11 - производство на мелнични камъни, камъни за точене и подобни абразивни изделия - 23.9 @bg
scope note: Z: - opracování a zpracování přírodních kamenů pro použití ve stavebnictví např. jako střešní krytiny, při úpravě silnic, na hřbitovech atd. - výrobu kamenného nábytku N: - činnosti prováděné v lomech, např. hrubé otesávání a řezání bloků kamene (08.11) - výrobu mlýnských kamenů, brusných výrobků apod. (23.9) @cs
scope note: Diese Klasse umfasst: - Be- und Verarbeitung von Natursteinen für die Verwendung beim Bau, für Dacheindeckungen, auf Friedhöfen usw. - Herstellung von Steinmöbeln Diese Klasse umfasst nicht: - in Steinbrüchen ausgeführte Arbeiten, z. B. roh behauenen von Steinen (s. 08.11) - Herstellung von sonstigen Erzeugnissen aus nichtmetallischen Mineralien (s. 23.9) @de
scope note: This class includes: - cutting, shaping and finishing of stone for use in construction, in cemeteries, on roads, as roofing etc. - manufacture of stone furniture This class excludes: - activities carried out by operators of quarries, e.g. production of rough cut stone, see 08.11 - production of millstones, abrasive stones and similar products, see 23.9 @en
scope note: Esta clase comprende: - el corte, tallado y acabado de la piedra para su empleo en la construcción, cementerios, carreteras, tejados, etc. - la fabricación de muebles de piedra Esta clase no comprende: - las actividades realizadas por los trabajadores de canteras, por ejemplo la producción de piedra cortada en bruto (véase 08.11) - la producción de piedras para moler, piedras abrasivas y productos similares (véase 23.9) @es
scope note: Cette classe comprend: - la taille, le façonnage et le finissage de la pierre destinée à la construction de bâtiments, de monuments funéraires ou de routes, à la couverture des toitures, etc. - la fabrication de mobilier en pierre Cette classe ne comprend pas: - les activités des carriers, par exemple: la production de pierres de taille, voir 08.11 - la production de meules, de pierres abrasives et d’articles similaires, voir 23.9 @fr
scope note: Ovaj razred uključuje: - rezanje, oblikovanje i obradu kamena za upotrebu u građevinarstvu, za groblja, ceste, pokrivanje krovova itd. - proizvodnju namještaja od kamena Ovaj razred isključuje: - djelatnosti koje izvode radnici u kamenolomima, npr. proizvodnja grubo obrađenoga kamena, vidi 08.11 - proizvodnju mlinskih kamena, brusnih kamena i sličnih proizvoda, vidi 23.9
scope note: Į šią klasę įeina: - akmens, naudojamo statyboje, kapinėse, keliams tiesti, stogo dangai ir kt., pjaustymas, tašymas ir apdaila - akmeninių baldų gamyba Į šią klasę neįeina: - karjerų darbininkų vykdoma veikla, pvz., rupiojo pjovimo akmens gamyba, žr. 08.11 - girnų, abrazyvinių akmenų ir panašių dirbinių gamyba, žr. 23.9 @lt
scope note: Этот класс включает: - производство фрикционных материалов и необработанных изделий на основе минеральных веществ или целлюлозы - производство минеральных изоляционных материалов: • шлаковаты и подобной минеральной ваты; слоистого вермикулита, вспученной глины и подобных изолирующих тепломатериалов или звукоизолирующих материалов - производство изделий из различных минеральных веществ: • обработанной слюды и изделий из слюды, торфа, графита (кроме электрических изделий) и т.д. - производство изделий из асфальта или подобных материалов, например, угольного асфальтового пека, клеящих веществ на основе асфальта и т.д. - производство угольных и графитных волокон и изделий (за исключением электродов и электрических компонентов) - производство искусственного корунда Этот класс исключает: - производство стекловолокна и нетканых продуктов из стекловаты, см. 23.14 - производство графитных электродов, см. 27.90 - производство угольных или графитных прокладок, см. 28.29 @ru
scope note: Bu sınıf aşağıdakileri kapsamaktadır; - inşaatta, kabristanlarda, yollarda, çatı yapımında kullanılmak üzere taş ve mermerin kesilmesi, şekil verilmesi ve kullanılabilir hale getirilmesi, - taş mobilyaların imalatı. Kapsam dışı olanlar; - taşocağında yapılan faaliyetler, örn. kaba yontulmuş taş üretimi, bkz. 08.11, - değirmen taşları, zımpara taşları ve benzeri ürünlerin üretilmesi, bkz. 23.9. @tr
preferred label: Рязане, профилиране и обработване на строителни и декоративни скални материали @bg
preferred label: Řezání, tvarování a konečná úprava kamenů @cs
preferred label: Tilhugning, tilskæring og færdigbearbejdning af sten @da
preferred label: Be- und Verarbeitung von Naturwerksteinen und Natursteinen a. n. g. @de
preferred label: Κοπή, μορφοποίηση και τελική επεξεργασία λίθων @el
preferred label: Corte, tallado y acabado de la piedra @es
preferred label: Kivilõikamine, -vormimine ja -viimistlus @et
preferred label: Kiven leikkaaminen, muotoilu ja viimeistely @fi
preferred label: Taille, façonnage et finissage de pierres @fr
preferred label: Kőmegmunkálás
preferred label: Taglio, modellatura e finitura di pietre @it
preferred label: Akmens pjaustymas, tašymas ir apdailinimas @lt
preferred label: Būvakmeņu un dekoratīvo akmeņu zāģēšana, apdare un apstrāde @lv
preferred label: Qtugħ, iffurmar u rfinar ta' ġebel @mt
preferred label: Houwen, bewerken en afwerken van natuursteen @nl
preferred label: Hogging og bearbeiding av monument- og bygningsstein @no
preferred label: Cięcie, formowanie i wykańczanie kamienia @pl
preferred label: Serragem, corte e acabamento de pedra @pt
preferred label: Tăierea, fasonarea şi finisarea pietrei @ro
preferred label: Резка, обработка и отделка камня @ru
preferred label: Rezanie, tvarovanie a konečná úprava kameňa @sk
preferred label: Obdelava naravnega kamna @sl
preferred label: Huggning, formning och slutlig bearbetning av sten @sv
preferred label: Taş ve mermerin kesilmesi, şekil verilmesi ve kullanılabilir hale getirilmesi @tr
broader: Cutting, shaping and finishing of stone

Manufacture of abrasive products and non-metallic mineral products n.e.c.
type: Concept
notation: 23.9
status: valid
status modified: 2013-10-18
accepted date: 2013-10-18
in scheme: Statistical Classification of Economic Activities in the European Community, Rev. 2 (2008)
scope note: Тази група включва производство на изделия от други неметални минерали. @bg
scope note: Diese Gruppe umfasst die Herstellung von sonstigen Erzeugnissen aus nichtmetallischen Mineralien. @de
scope note: This group includes the manufacture of other non-metallic mineral products. @en
scope note: Este grupo comprende la fabricación de productos minerales no metálicos diversos. @es
scope note: Ce groupe comprend le travail d’autres produits minéraux non métalliques. @fr
scope note: Ova skupina uključuje proizvodnju brusnih proizvoda i nemetalnih proizvoda.
scope note: Į šia grupę įeina kitų nemetalinių mineralinių gaminių gamyba. @lt
scope note: Данный раздел включает производство чугуна и переработку черных и цветных металлов, в том числе чушкового чугуна и передельного лома, включая электрометаллургическое производство. Данный раздел также включает производство сплавов металлов и суперсплавов с добавлением химических элементов к чистым металлам. Слитки и прочие первичные формы и полуфабрикаты подвергаются следующим операциям: покрытию, прокатке, волочению, экструзии, штамповке для получения листовой стали, полос, прутков, труб, проволоки, а также стали жидкой для отливки готовых изделий. @ru
scope note: Bu grup, metalik olmayan diğer mineral ürünlerin imalatını kapsamaktadır. @tr
preferred label: Производство на изделия от други неметални минерали @bg
preferred label: Výroba brusiv a ostatních nekovových minerálních výrobků j. n. @cs
preferred label: Fremstilling af slibemidler og ikke-metalholdige mineralske produkter i.a.n. @da
preferred label: Herstellung von Schleifkörpern und Schleifmitteln auf Unterlage sowie sonstigen Erzeugnissen aus nichtmetallischen Mineralien a. n. g. @de
preferred label: Παραγωγή λειαντικών προϊόντων και μη μεταλλικών ορυκτών προϊόντων π.δ.κ.α. @el
preferred label: Fabricación de productos abrasivos y productos minerales no metálicos n.c.o.p. @es
preferred label: Mujal liigitamata abrasiivtoodete ja mittemetalsetest mineraalidest toodete tootmine @et
preferred label: Hiontatuotteiden ja muualla luokittelemattomien ei-metallisten mineraalituotteiden valmistus @fi
preferred label: Fabrication de produits abrasifs et de produits minéraux non métalliques n.c.a. @fr
preferred label: Egyéb csiszolótermék és nemfém ásványi termék gyártása m.n.s.
preferred label: Fabbricazione di prodotti abrasivi e di minerali non metalliferi n.c.a. @it
preferred label: Abrazyvinių gaminių ir niekur kitur nepriskirtų nemetalo mineralinių produktų gamyba @lt
preferred label: Abrazīvo izstrādājumu un citur neklasificētu nemetālisko minerālu izstrādājumu ražošana @lv
preferred label: Manifattura ta' prodotti li joborxu u prodotti minerali mhux metalliċi n.e.c. @mt
preferred label: Vervaardiging van andere schuurmiddelen en niet-metaalhoudende minerale producten n.e.g. @nl
preferred label: Produksjon av ikke-metallholdige mineralprodukter ikke nevnt annet sted @no
preferred label: Produkcja wyrobów ściernych i wyrobów z mineralnych surowców niemetalicznych, gdzie indziej niesklasyfikowana @pl
preferred label: Fabricação de produtos abrasivos e produtos minerais não metálicos, n.e. @pt
preferred label: Fabricarea produselor abrazive şi a altor produse din minerale nemetalice n.c.a. @ro
preferred label: Производство абразивных изделий и прочей неметаллической минеральной продукции, не включенной в другие категории @ru
preferred label: Výroba brúsnych výrobkov a nekovových minerálnych výrobkov i.n, @sk
preferred label: Proizvodnja brusilnih sredstev in drugih nekovinskih mineralnih izdelkov @sl
preferred label: Tillverkning av slipmedel och övriga icke-metalliska mineraliska produkter @sv
preferred label: Aşındırıcı ürünlerin ve başka yerde sınıflandırılmamış metalik olmayan mineral ürünlerin imalatı @tr
broader: Manufacture of other non-metallic mineral products
narrower: Production of abrasive products
narrower: Manufacture of other non-metallic mineral products n.e.c.

Production of abrasive products
type: Concept
notation: 23.91
status: valid
status modified: 2013-10-18
accepted date: 2013-10-18
in scheme: Statistical Classification of Economic Activities in the European Community, Rev. 2 (2008)
scope note: - мелнични камъни, камъни за точене или полиране, абразивни дискове, естествени или изкуствени абразиви, нанесени върху подложка, вкл. абразивни изделия върху мека основа (например шкурка) @bg
scope note: Z: - výrobu mlýnských kamenů, ostřících a lešticích kamenů, přírodních nebo umělých brusných výrobků na podkladu včetně na měkkém podkladu (např. brusný papír) @cs
scope note: Diese Klasse umfasst: - Herstellung von Mühl-, Schleif- und Poliersteinen sowie von natürlichen oder künstlichen Schleifmitteln auf Unterlage, auch auf weicher Unterlage (z. B. Schleifpapier) @de
scope note: This class includes: - manufacture of millstones, sharpening or polishing stones and natural or artificial abrasive products on a support, including abrasive products on a soft base (e.g. sandpaper) @en
scope note: Esta clase comprende: - la producción de piedras para moler, afilar o pulir y productos abrasivos naturales o artificiales sobre un soporte, incluidos los productos abrasivos sobre base blanda (p. ej., papel de lija) @es
scope note: Cette classe comprend: - la production de meules, de pierres à aiguiser ou à polir et d’abrasifs naturels ou artificiels appliqués sur support, y compris les produits abrasifs appliqués sur support souple (par exemple: papier de verre) @fr
scope note: Ovaj razred uključuje: - proizvodnju mlinskih kamena, kamena za brušenje ili poliranje i prirodnih ili umjetnih abrazivnih proizvoda, uključujući abrazivne proizvode na mekoj podlozi (npr. brusni papir)
scope note: Į šią klasę įeina: - girnų, galandimo ar poliravimo akmenų ir gamtinių ar dirbtinių abrazyvinių gaminių su laikikliais, įskaitant abrazyvinius su minkštu pagrindu, pvz., švitrinis popierius, gamyba @lt
scope note: Данная группа включает такие виды деятельности, как прямое обогащение железной руды, отливку железных чушек и прочих твердых форм, конверсацию железных чушек в сталь, производство ферросплавов и стальных изделий. @ru
scope note: Bu sınıf aşağıdakileri kapsamaktadır; - yumuşak zeminli aşındırıcı ürünler (örneğin zımpara kağıdı) dahil, değirmen taşları, bileyi veya parlatma taşları ve doğal ya da suni aşındırıcı ürünlerin imalatı. @tr
preferred label: Производство на абразивни изделия @bg
preferred label: Výroba brusiv @cs
preferred label: Fremstilling af slibemidler @da
preferred label: Herstellung von Schleifkörpern und Schleifmitteln auf Unterlage @de
preferred label: Παραγωγή λειαντικών προϊόντων @el
preferred label: Fabricación de productos abrasivos @es
preferred label: Abrasiivtoodete tootmine @et
preferred label: Hiontatuotteiden valmistus @fi
preferred label: Fabrication de produits abrasifs @fr
preferred label: Csiszolótermék gyártása
preferred label: Fabbricazione di prodotti abrasivi @it
preferred label: Abrazyvinių gaminių gamyba @lt
preferred label: Abrazīvo izstrādājumu ražošana @lv
preferred label: Produzzjoni ta' prodotti li joborxu @mt
preferred label: Vervaardiging van schuur-, slijp- en polijstmiddelen @nl
preferred label: Produksjon av slipestoffer @no
preferred label: Produkcja wyrobów ściernych @pl
preferred label: Fabricação de produtos abrasivos @pt
preferred label: Fabricarea de produse abrazive @ro
preferred label: Производство абразивных изделий @ru
preferred label: Výroba brúsnych výrobkov @sk
preferred label: Proizvodnja brusilnih sredstev @sl
preferred label: Slipmedelstillverkning @sv
preferred label: Aşındırıcı ürünlerin imalatı @tr
broader: Manufacture of abrasive products and non-metallic mineral products n.e.c.

Manufacture of other non-metallic mineral products n.e.c.
type: Concept
notation: 23.99
status: valid
status modified: 2013-10-18
accepted date: 2013-10-18
in scheme: Statistical Classification of Economic Activities in the European Community, Rev. 2 (2008)
scope note: - производство на прежди и тъкани, облекло, шапки, обувки, хартия, филц и други от неметални минерали - производство на гарнитури за спирачки и други триещи се гарнитури, немонтирани, на базата на азбест или други минерални вещества или целулоза - производство на минерални материали за изолация: • шлакови вати, азбестови вати и подобни минерални вати; експандиран вермикулит, експандирани глини и подобни топло- и звукоизолационни или звукопоглъщащи материали - производство на изделия от разнообразни неметални минерали: • обработена слюда и изделия от слюда, торф или графит (различни от използваните в електротехниката) и други - производство на изделия от асфалт или подобни материали, например свързващи вещества на основата на асфалт, битум, каменовъглен катран, смола и други - въглеродни и графитни влакна, изделия от графит или друг въглерод за употреба, различна от тази в електротехниката, с изключение на електроди - производство на изкуствен корунд - производство на стъклена вата и нетъкани изделия от нея - 23.14 - производство на графитни електроди - 27.90 - производство на графитни уплътнители - 28.29 @bg
scope note: Z: - výrobu třecího materiálu (obložení) bez podložky na bázi minerálních látek nebo buničiny - výrobu minerálních izolačních materiálů: • struskové vlny, skalní vlny a podobných minerálních vln; vermikulitu, rozpínavé hlíny a podobných materiálů pro účely tepelné nebo zvukové izolace - výrobu výrobků z různých minerálních materiálů: • zpracované slídy a výrobků ze slídy, předmětů z rašeliny (kromě briket) a výrobků z grafitu (kromě elektrotechnických výrobků) atd. - výrobu výrobků z asfaltu nebo podobných materiálů, např. lepidel na bázi živice, černouhelného dehtu atd. - výrobu výrobků z uhlíkových a grafitových vláken (kromě elektrod a použití v elektrotechnice) - výrobu umělého korundu N: - výrobu skelné vaty a netkaných výrobků ze skelné vaty (23.14) - výrobu grafitových elektrod (27.90) - výrobu briket z rašeliny (19.20) - výrobu těsnění z uhlíku nebo grafitu (28.29) @cs
scope note: Diese Klasse umfasst: - Herstellung von Reibungsbelägen, nicht montiert, auf der Grundlage von mineralischen Stoffen oder Zellstoff - Herstellung von mineralischen Isoliermaterialien: • Hüttenwolle, Steinwolle und ähnliche mineralische Wolle; geblähter Vermiculit, geblähter Ton und ähnliche Stoffe zu Wärme-, Kälte- oder Schallschutzzwecken - Herstellung von Waren aus verschiedenen mineralischen Stoffen: • bearbeiteter Glimmer und Glimmerwaren, Torfwaren (ohne Torfbriketts) und Grafitwaren (ohne Elektroartikel) usw. - Herstellung von Waren aus Asphalt oder aus ähnlichen Stoffen, z. B. Klebstoffen auf Bitumenbasis, Steinkohlenteer usw. - Herstellung von Erzeugnissen aus Kohlenstoff- und Graphitfasern (außer Elektroden und für elektrische Anwendungen) - Herstellung von künstlichem Korund Diese Klasse umfasst nicht: - Herstellung von Glaswolle und nichtgewebten Erzeugnissen daraus (s. 23.14) - Herstellung von Grafitelektroden (s. 27.90) - Herstellung von Kohle- oder Grafitdichtungen (s. 28.29) @de
scope note: This class includes: - manufacture of friction material and unmounted articles thereof with a base of mineral substances or of cellulose - manufacture of mineral insulating materials: • slag wool, rock wool and similar mineral wools; exfoliated vermiculite, expanded clays and similar heat-insulating, sound-insulating or sound-absorbing materials - manufacture of articles of diverse mineral substances: • worked mica and articles of mica, of peat, of graphite (other than electrical articles) etc. - manufacture of articles of asphalt or similar material, e.g. asphalt-based adhesives, coal tar pitch etc. - manufacture of carbon and graphite fibres and products (except electrodes and electrical applications) - manufacture of artificial corundum This class excludes: - manufacture of glass wool and non-woven glass wool products, see 23.14 - manufacture of graphite electrodes, see 27.90 - manufacture of carbon or graphite gaskets, see 28.29 @en
scope note: Esta clase comprende: - la fabricación de materiales de fricción y artículos sin montar similares con una base de sustancias minerales o de celulosa - la fabricación de materiales minerales aislantes: • lana de escorias, de roca y lanas minerales similares, vermiculita exfoliada, arcillas dilatadas y materiales similares para aislamiento térmico y acústico - la fabricación de artículos de sustancias minerales diversas: • mica trabajada y productos de mica, turba, grafito (excepto artículos eléctricos), etc. - la fabricación de artículos de asfalto y de materiales similares, como, por ejemplo, adhesivos a base de asfalto, brea de alquitrán de hulla, etc. - la fabricación de fibras y productos de carbono y grafito (excepto electrodos y aplicaciones eléctricas) - la fabricación de corindón artificial Esta clase no comprende: - la fabricación de lana de vidrio y productos no tejidos a base de lana de vidrio (véase 23.14) - la fabricación de electrodos de grafito (véase 27.90) - la fabricación de juntas de carbono o grafito (véase 28.29) @es
scope note: Cette classe comprend: - la fabrication de garnitures de friction et de pièces non montées pour ces garnitures à base de substances minérales ou de cellulose - la fabrication de matières minérales isolantes: • laines de laitier, de scories, de roche et laines minérales similaires; vermiculite expansée, argiles expansées et matières minérales similaires à usage d’isolants thermiques ou sonores ou pour l’absorption du son - la fabrication d’articles en substances minérales diverses: • mica travaillé et ouvrages en mica, tourbe, graphite (autres que les articles électriques), etc. - la fabrication d’articles en asphalte ou en matières similaires, par exemple: adhésifs à base d’asphalte, de houille - la fabrication de fibres de carbone et de graphites et de produits constitués de ces fibres (à l’exception des électrodes et des applications électriques) - la production de corindon artificiel Cette classe ne comprend pas: - la fabrication de laine de verre et de produits non tissés en cette matière, voir 23.14 - la fabrication d’électrodes en graphite, voir 27.90 - la fabrication de joints d’étanchéité en carbone ou en graphite, voir 28.29 @fr
scope note: Ovaj razred uključuje: - proizvodnju frikcijskih materijala i njihovih nemontiranih proizvoda, na podlozi mineralne tvari ili celuloze - proizvodnju mineralnoga izolacijskog materijala: • vune od šljake, kamene vune i sličnih mineralnih vuna, listića liskuna, ekspandirane gline i sličnih izolatora topline i zvuka ili materijala koji apsorbiraju zvuk - proizvodnju predmeta od različitih mineralnih tvari: • obrađenog liskuna, proizvoda od liskuna, treseta, grafita (osim elektromaterijala) itd. - proizvodnju proizvoda od asfalta ili sličnog materijala npr., asfaltno bazirana bruslia, katranskog treseta itd. - proizvodnju karbonskih i grafitnih vlakana i proizvoda (osim elektroda i električnih aplikacija) - proizvodnju umjetnog korunda Ovaj razred isključuje: - proizvodnju staklene vune i netkanih proizvoda od staklene vune, vidi 23.14 - proizvodnju grafitnih elektroda, vidi 27.90 - proizvodnju karbonskih ili grafitnih brtvila, vidi 28.29
scope note: Į šią klasę įeina: - su mineralinių medžiagų ar celiuliozės pagrindu frikcinių medžiagų ir nesumontuotų jų dirbinių gamyba - mineralinių izoliacinių medžiagų gamyba: • šlako vatos, akmens vatos ir panašios mineralinės vatos; pūstojo vermikulito, keramzito bei kitų šilumą ir garsą izoliuojančių ar garsą sugeriančių medžiagų - gaminių iš įvairių mineralinių medžiagų gamyba: • apdirbto žėručio bei gaminių iš žėručio, durpių, grafito (išskyrus elektros prekes) ir kt. - gaminių iš bitumo ar panašios medžiagos, pvz., bituminių rišiklių, akmens anglių pikio ir kt., gamyba - anglies ir grafito pluoštų ir gaminių, išskyrus elektrodus ir elektrinius taikmenis, gamyba - dirbtinio korundo gamyba Į šią klasę neįeina: - stiklo vatos ir neaustinių stiklo vatos gaminių gamyba, žr. 23.14 - grafitinių elektrodų gamyba, žr. 27.90 - anglies ar grafito tarpiklių gamyba, žr. 28.29 @lt
scope note: Этот класс включает: - работу доменных печей, конвертеров стали и прокатного стана - производство железных чушек, болванок и чушек зеркального чугуна, блоков или прочих первичных форм - производство ферросплавов - производство железосодержащих изделий прямым восстановлением железных и прочих пористых железосодержащих изделий - производство чистого железа путем электролиза или в результате прочих химических процессов - переплавку железных или стальных чушек или болванок - производство гранулированного железа и железного порошка - производство стальных чушек или прочих первичных форм - производство изделий-полуфабрикатов из стали - производство горячекатаных и холоднокатаных плоскокатаных изделий из стали - производство горячекатаных прутьев из стали - производство горячекатаных полых изделий из стали - производство стальных пакетированных листов и изделий с открытыми сварными швами - производство железнодорожных материалов (сборных рельс) из стали Этот класс исключает: - холодное волочение, см. 24.31 @ru
scope note: Bu sınıf aşağıdakileri kapsamaktadır; - mineral maddeler ya da selüloz esaslı sürtünme balatası ve bunların monte edilmemiş parçalarının imalatı, - mineral yalıtım maddeleri imalatı: • cüruf yünleri, madeni yünler ve benzer mineral yünler; pulları soyulmuş magnezyum mikaları, genleştirilmiş killer ve benzer ısı-yalıtım, ses-yalıtım ya da ses emen materyaller. - çeşitli mineral maddelerden ürünlerin imalatı: • işlenmiş mika ve mikadan ürünler, turbadan ürünler, grafitten ürünler (elektrikli ürünler hariç) vb. - asfalt veya benzeri malzemelerden ürünlerin imalatı, örn. asfalt bazlı yapıştırıcılar, kömür katranı zifti vb., - karbon ve grafit elyaf ve ürünleri imalatı (elektrotlar ve elektrikli uygulamalar hariç). - suni zımpara (korendon) imalatı Kapsam dışı olanlar; - cam yünlerinin ve dokunmamış cam yününden yapılan ürünlerin imalatı, bkz. 23.14, - grafit elektrot imalatı, bkz. 27.90. - karbon veya grafit contaların imalatı, bkz. 28.29. @tr
preferred label: Производство на изделия от други неметални минерали, некласифицирани другаде @bg
preferred label: Výroba ostatních nekovových minerálních výrobků j. n. @cs
preferred label: Fremstilling af andre ikke-metalholdige mineralske produkter i.a.n. @da
preferred label: Herstellung von sonstigen Erzeugnissen aus nichtmetallischen Mineralien a. n. g. @de
preferred label: Παραγωγή άλλων μη μεταλλικών ορυκτών προϊόντων π.δ.κ.α. @el
preferred label: Fabricación de otros productos minerales no metálicos n.c.o.p. @es
preferred label: Mujal liigitamata muude mittemetalsetest mineraalidest toodete tootmine @et
preferred label: Muualla luokittelemattomien ei-metallisten mineraalituotteiden valmistus @fi
preferred label: Fabrication d'autres produits minéraux non métalliques n.c.a. @fr
preferred label: M.n.s.egyéb nemfém ásványi termék gyártása
preferred label: Fabbricazione di altri prodotti in minerali non metalliferi n.c.a. @it
preferred label: Kitų, niekur kitur nepriskirtų, nemetalo mineralinių produktų gamyba @lt
preferred label: Citur neklasificētu nemetālisko minerālu izstrādājumu ražošana @lv
preferred label: Manifattura ta' prodotti oħra mhux metalliċi n.e.c. @mt
preferred label: Vervaardiging van andere niet-metaalhoudende minerale producten, n.e.g. @nl
preferred label: Produksjon av ikke-metallholdige mineralprodukter ikke nevnt annet sted @no
preferred label: Produkcja wyrobów z pozostałych mineralnych surowców niemetalicznych, gdzie indziej niesklasyfikowana @pl
preferred label: Fabricação de outros produtos minerais não metálicos, n.e. @pt
preferred label: Fabricarea altor produse din minerale nemetalice, n.c.a. @ro
preferred label: Производство прочей неметаллической минеральной продукции, не включенной в другие категории @ru
preferred label: Výroba ostatných nekovových minerálnych výrobkov, i. n. @sk
preferred label: Proizvodnja drugih nekovinskih mineralnih izdelkov @sl
preferred label: Tillverkning av övriga icke-metalliska mineraliska produkter @sv
preferred label: Başka yerde sınıflandırılmamış metalik olmayan diğer mineral ürünlerin imalatı @tr
broader: Manufacture of abrasive products and non-metallic mineral products n.e.c.

Manufacture of basic metals
type: Concept
notation: 24
status: valid
status modified: 2013-10-18
accepted date: 2013-10-18
in scheme: Statistical Classification of Economic Activities in the European Community, Rev. 2 (2008)
scope note: дейности по топене и/или рафиниране на черни и цветни метали от руди, чугун или скрап, като се използват електрометалургична и други металургични технологии на преработка. Разделът включва и производството на метални сплави и огнеустойчиви (специални) сплави чрез въвеждане в чистия метал на други химични елементи. Резултатът от леенето и рафинирането, обикновено под формата на слитък, се използва в дейности валцуване, изтегляне и пресуване за получаване на продукти като дебели и тънки листове, ленти, пръти, валцдрат, тел или тръби и кухи профили, а в разтопено състояние - за получаване на отливки и други метални продукти. @bg
scope note: Tento oddíl zahrnuje činnosti jako tavení a čištění (rafinace) železných a neželezných kovů při jejich výrobě z rud, surových kovů nebo kovového odpadu při elektrometalurgických nebo jiných metalurgických procesech. Tento oddíl zahrnuje také výrobu slitin kovů a superslitin přidáváním jiných chemických prvků do čistých kovů. Ingoty, předvalky a jiné výstupy tavby a čištění se dále zpracovávají válcováním, tažením a protlačováním za účelem výroby pásů, plechů, tyčí, drátů, trubek nebo dutých profilů. Lze též vyrábět kovové odlitky a jiné výrobky ze základních kovů. @cs
scope note: Diese Abteilung umfasst die Tätigkeiten des Schmelzens und Legierens von Eisenmetallen und NE-Metallen aus Erz, Roheisen oder Schrott mit elektrometallurgischen und anderen metallurgischen Verfahren. Diese Abteilung umfasst ferner die Herstellung von Metalllegierungen und Superlegierungen durch Zugabe anderer chemischer Elemente zu reinen Metallen. Die nach dem Schmelzen und Legieren in der Regel in Blockform zur Verfügung stehenden Erzeugnisse werden durch Walz-, Zieh- und Extrusionsverfahren zu Platten, Blech, Bandstahl, Stabstahl, Stangen, Draht, Rohren oder Hohlprofilen bzw. in geschmolzener Form zu Gusserzeugnissen und anderen Grundmetallerzeugnissen verarbeitet. @de
scope note: This division includes the activities of smelting and/or refining ferrous and non-ferrous metals from ore, pig or scrap, using electrometallurgic and other process metallurgic techniques. This division also includes the manufacture of metal alloys and super-alloys by introducing other chemical elements to pure metals. The output of smelting and refining, usually in ingot form, is used in rolling, drawing and extruding operations to make products such as plate, sheet, strip, bars, rods, wire or tubes, pipes and hollow profiles, and in molten form to make castings and other basic metal products. @en
scope note: Esta división comprende las actividades de fundición o refinado de metales férreos y no férreos a partir del mineral, lingote o chatarra mediante técnicas electrometalúrgicas y otras técnicas metalúrgicas de tratamiento. Esta división comprende también la fabricación de aleaciones y superaleaciones metálicas introduciendo otros elementos químicos en los metales puros. El resultado de la fundición y refinado, normalmente en forma de lingotes, se utiliza en las operaciones de laminación, estirado y extrusión para fabricar chapas, flejes, barras, varillas, alambre o tubos, tuberías y perfiles huecos, y en forma licuada para hacer piezas fundidas y otros productos metálicos básicos. @es
scope note: Cette division comprend les activités de fonte et de raffinage de métaux ferreux et non ferreux à partir de minerais, de fonte brute ou de ferraille, en utilisant des procédés électrométallurgiques et autres techniques métallurgiques. Cette division comprend également la fabrication des alliages et superalliages de métaux en intégrant d’autres éléments chimiques aux métaux purs. Le résultat de la fonte et du raffinage, généralement sous forme de lingots, est utilisé dans les opérations de laminage, d’étirage et d’extrusion pour fabriquer des plaques, des feuilles, des bandes, des barres, des tiges ou du fil ou des tubes, tuyaux, profilés creux et, sous forme fondue, pour fabriquer des pièces et autres produits de base en métal. @fr
scope note: Ovaj odjeljak uključuje djelatnosti taljenja i/ili rafiniranja željeznih i neželjeznih metala iz rude, komada ili otpadaka, koristeći se elektrometalurškom ili drugom metalurškom tehnikom prerade. Ovaj odjeljak također pokriva proizvodnju metalnih legura i ojačanih legura uvodeći ostale kemijske elemente u čiste metale. Output taljenja i rafiniranja metala obično je u obliku ingota, a koristi se u postupcima valjanja, vučenja i prevlačenja kako bi se izradili limovi, vrpce, šipke, motke ili žice ili u rastaljenom obliku kako bi se izradili odljevci i ostali osnovni metalni proizvodi.
scope note: Į šį skyrių įeina geležies ir spalvotųjų metalų lydymas ir (arba) rafinavimas iš rūdų, luitų ar metalo laužo, naudojant elektrometalurgijos ir kitas metalurgijos technologijas. Į šį skyrių taip pat įeina metalo lydinių ir kaitrai atsparių lydinių, gaunamų maišant grynus metalus su kitais cheminiais elementais, gamyba. Lydymo ir rafinavimo produkcija, dažniausiai luitų pavidalo, yra naudojama tokių produktų, kaip plokščių, lakštų, juostų, įvairių strypų, vielos ar vamzdžių ir vamzdelių, tuščiavidurių profilių gamybai valcavimo, tempimo ir išspaudimo būdu, taip pat liejinių gamybai liejimo būdu ir kitų pagrindinių metalų gaminių gamybai. @lt
scope note: Bu bölüm elektro metalürjik ve diğer metalürjik teknikleri kullanarak, maden, demir külçesi, hurdadan elde edilen demir içeren ve demir içermeyen metallerin eritilmesi ve/veya ayrıştırılması faaliyetlerini kapsamaktadır. Bu kısım aynı zamanda diğer kimyevi elementlerin saf metallere dönüştürülmesi ile metal alaşımların ve süper alaşım imalatını da kapsamaktadır. Eritme ve ayrıştırma işlemleri sonucunda elde edilen çıktı genellikle ingot (kütük) halinde olup, levha, şerit, çubuk, bar veya tel yapmak amacıyla haddeleme, haddeden çekme ve kalıptan çekme işlemlerinde kullanılırken, erimiş halde olan çıktı ise dökümler ile diğer ana metal ürünleri yapmak için kullanılır. @tr
preferred label: Производство на основни метали @bg
preferred label: Výroba základních kovů @cs
preferred label: Fremstilling af metal @da
preferred label: Metallerzeugung und -bearbeitung @de
preferred label: Παραγωγή βασικών μετάλλων @el
preferred label: Metalurgia; fabricación de productos de hierro, acero y ferroaleaciones @es
preferred label: Metallitootmine @et
preferred label: Metallien jalostus @fi
preferred label: Métallurgie @fr
preferred label: Fémalapanyag gyártása
preferred label: Attività metallurgiche @it
preferred label: Pagrindinių metalų gamyba @lt
preferred label: Metālu ražošana @lv
preferred label: Manifattura ta' metalli bażiċi @mt
preferred label: Vervaardiging van metalen in primaire vorm @nl
preferred label: Produksjon av metaller @no
preferred label: Produkcja metali @pl
preferred label: Indústrias metalúrgicas de base @pt
preferred label: Industria metalurgică @ro
preferred label: Металлургическая промышленность @ru
preferred label: Výroba a spracovanie kovov @sk
preferred label: Proizvodnja kovin @sl
preferred label: Stål- och metallframställning @sv
preferred label: Ana metal sanayii @tr
broader: MANUFACTURING
narrower: Manufacture of basic iron and steel and of ferro-alloys
narrower: Manufacture of tubes, pipes, hollow profiles and related fittings, of steel
narrower: Manufacture of other products of first processing of steel
narrower: Manufacture of basic precious and other non-ferrous metals
narrower: Casting of metals

Manufacture of basic iron and steel and of ferro-alloys
type: Concept
notation: 24.1
status: valid
status modified: 2013-10-18
accepted date: 2013-10-18
in scheme: Statistical Classification of Economic Activities in the European Community, Rev. 2 (2008)
scope note: пряка преработка на металните руди; производство на чугун във вид на отливки, слитъци или други първични форми; преработка на чугуна в стомана; производство на феросплави и стоманени продукти. @bg
scope note: Tato skupina zahrnuje mj. přímou redukci železné rudy, výrobu surového železa v tavené nebo pevné podobě, oxidaci surového železa na ocel, výrobu feroslitin a výrobu výrobků z oceli. @cs
scope note: Diese Gruppe umfasst u. A. die Direktreduktion von Eisenerz, Herstellung von Roheisen in flüssiger oder fester Form, Umwandlung von Roheisen in Stahl, Herstellung von Ferrolegierungen und Herstellung von Stahlerzeugnissen. @de
scope note: This group includes activities such as direct reduction of iron ore, production of pig iron in molten or solid form, conversion of pig iron into steel, manufacture of ferroalloys and manufacture of steel products. @en
scope note: Este grupo comprende actividades como la reducción directa de mineral de hierro, la fabricación de lingotes de hierro en forma licuada o sólida; la transformación de lingotes de hierro en acero, la fabricación de ferroaleaciones y la fabricación de productos de acero. @es
scope note: Ce groupe comprend des activités telles que la réduction directe du minerai de fer, la production de fontes brutes sous forme fondue ou sous forme solide, la conversion de fontes brutes en acier, la fabrication de ferroalliages et la fabrication de produits en acier. @fr
scope note: Ova skupina uključuje djelatnosti kao što su direktna redukcija željezne rude, proizvodnja sirovog željeza u rastopljenom ili čvrstom obliku, proizvodnja čelika od sirovog željeza i proizvodnja ferolegura.
scope note: Į šią grupę įeina veiklos rūšys, tokios kaip geležies rūdų tiesioginis redukavimas, išlydyto ar kieto perdirbamojo ketaus gamyba; perdirbamojo ketaus perdirbimas į plieną; ferolydinių ir plieno gaminių gamyba. @lt
scope note: Этот класс включает: - производство цельнотянутых труб и труб с поперечным и не поперечным сечением и заготовок с поперечным сечением для дальнейшей обработки способом горячей прокатки, горячим прессованием или прочими способами, включающими горячую обработку для изготовления полуфабрикатов, таких как, горячекатаный прут, чушки или непрерывное литье - производство определенного и не определенного размера цельнотянутых труб из горячекатаных или горячепрессованных заготовок путем дальнейшей обработки холоднокатаным или холоднотянутым способом труб с поперечным сечением и холоднотянутым способом только для труб не с поперечным сечением и полых профилей - производство сварных труб с наружным диаметром свыше 406,4 мм или менее, произведенным холодным способом из плоских горячекатаных изделий и сваренными в длину или по спирали - производство сварных труб с наружным диаметром 406,4 мм или менее с поперечным сечением, способом непрерывного литья или горячей формовки или плоских холоднокатаных изделий и сваренными в длину или по спирали и с не поперечным сечением горячей или холодной формовкой из горячекатаных или холоднокатаных полос, сваренными в длину - производство сварных труб с внешним диаметром 406,4 мм или менее, из катаных, горячей или холодной формовкой полос и сваренными в длину для дальнейшей обработки холоднокатаным способом или способом холодной формовки в виде труб с не поперечным сечением - производство стального плоского фланца и фланцев с хомутами путем обработки плоских горячекатаных изделий из стали - производство гарнитуры для стыковой сварки, такой как коленчатый патрубок и путем штамповки горячекатаных бесшовных труб из стали - трубы с резьбой и прочие трубы или гарнитура из стали Этот класс исключает: - производство бесшовных труб из стали, отлитых с помощью центробежной силы, см. 24.52 @ru
scope note: Bu grup, demir cevherinin doğrudan indirgenmesi, ergimiş veya katı formda pik demir imalatı, pik demirin çeliğe dönüştürülmesi, demir alaşımlarının imalatı gibi faaliyetleri kapsamaktadır. @tr
preferred label: Производство на чугун, стомана и феросплави @bg
preferred label: Výroba surového železa, oceli a feroslitin @cs
preferred label: Fremstilling af råjern og råstål samt jernlegeringer @da
preferred label: Erzeugung von Roheisen, Stahl und Ferrolegierungen @de
preferred label: Παραγωγή βασικού σιδήρου και χάλυβα και σιδηροκραμάτων @el
preferred label: Fabricación de productos básicos de hierro, acero y ferroaleaciones @es
preferred label: Raua, terase ja ferrosulamite tootmine @et
preferred label: Raudan, teräksen ja rautaseosten valmistus @fi
preferred label: Sidérurgie @fr
preferred label: Vas-, acél-, vasötvözet-alapanyag gyártása
preferred label: Attività siderurgiche @it
preferred label: Tomo ketaus ir plieno bei ferolydinių gamyba @lt
preferred label: Čuguna, tērauda un dzelzs sakausējumu ražošana @lv
preferred label: Manifattura ta' ħadid u azzar bażiċi u ta' ligi tal-ħadid @mt
preferred label: Vervaardiging van ijzer en staal en van ferrolegeringen @nl
preferred label: Produksjon av jern og stål, samt ferrolegeringer @no
preferred label: Produkcja surówki żelazostopów, żeliwa i stali oraz wyrobów hutniczych @pl
preferred label: Siderurgia e fabricação de ferro-ligas @pt
preferred label: Producţia de metale feroase sub forme primare şi de feroaliaje @ro
preferred label: Производство чугуна, стали и ферросплавов @ru
preferred label: Výroba surového železa a ocele a ferozliatin @sk
preferred label: Proizvodnja surovega železa, jekla, ferozlitin @sl
preferred label: Framställning av järn och stål samt ferrolegeringar @sv
preferred label: Ana demir ve çelik ürünleri ile demir alaşımları imalatı @tr
broader: Manufacture of basic metals
narrower: Manufacture of basic iron and steel and of ferro-alloys

Manufacture of basic iron and steel and of ferro-alloys
type: Concept
notation: 24.10
status: valid
status modified: 2013-10-18
accepted date: 2013-10-18
in scheme: Statistical Classification of Economic Activities in the European Community, Rev. 2 (2008)
scope note: - експлоатация на доменни пещи, конвертори за стомана и валцовъчни станове - производство на чугун във вид на отливки, блокове или други първични форми - производство на феросплави - производство на железни продукти, получени чрез пряка редукция на желязна руда и други порести железни продукти - производство на желязо с минимална чистота 99,94 % тегловно, получено чрез електролиза или други химични процеси - претопяване на чугунен или стоманен скрап - производство на гранули и прахове от чугун - производство на стомана на блокове или други първични форми - производство на полуготови продукти от стомана - производство на горещо или студеновалцувани плоски продукти от стомана - производство на горещовалцувани валцдрат и пръти от стомана - производство на горещовалцувани профили от стомана - производство на шпунтови профили и заварени отворени профили, от стомана - производство на елементи за релсов път от стомана - студено изтегляне на пръти- 24.31 @bg
scope note: Z: - činnost vysokých pecí, konvertorů, válcoven a úpraven - výrobu surového železa a zrcadlovin v houskách, blocích nebo jiných základních formách - výrobu feroslitin - výrobu výrobků ze železné rudy a jiného houbovitého železa přímou redukcí z železné rudy - výrobu ryzího železa elektrolýzou a jinými chemickými postupy - přetavení bloků kovového odpadu ze železa nebo oceli - výrobu granulovaného a práškového železa - výrobu oceli v ingotech nebo jiných základních formách - výrobu předvalků z oceli - výrobu plochých výrobků z oceli válcovaných za tepla nebo za studena - výrobu tyčí a prutů z oceli válcovaných za tepla - výrobu otevřených profilů z oceli válcovaných za tepla - výrobu štětovnic z oceli a ocelových svařovaných otevřených profilů - výrobu materiálů pro železniční svršky (nesmontovaných kolejnic) z oceli N: - tažení tyčí za studena (24.31) @cs
scope note: Diese Klasse umfasst: - Betrieb von Hochöfen, Konvertern, Walz- und Fertigwalzstraßen - Herstellung von Roheisen und Spiegeleisen als Masseln, Blöcke oder andere Roherzeugnisse - Herstellung von Ferrolegierungen - Herstellung von Eisenerzeugnissen und anderem Eisenschwamm durch Direktreduktion aus Eisenerzen - Herstellung von hoch reinem Eisen durch Elektrolyse und andere chemische Verfahren - Einschmelzen von Schrottblöcken aus Eisen oder Stahl - Herstellung von Eisenkörnern und Eisenpuder - Herstellung von Stahl in Blöcken und anderen Rohformen - Herstellung von Halbzeug aus Stahl - Herstellung von warm oder kalt flachgewalzten Erzeugnissen aus Stahl - Herstellung von warm gewalzten Stäben und Walzdraht aus Stahl - Herstellung von warm gewalzten offenen Profilen aus Stahl - Herstellung von Spundwanderzeugnissen aus Stahl und von durch Schweißen hergestellten offenen Profilen aus Stahl - Herstellung von Gleisbauerzeugnissen (nicht zusammengefügte Schienen) aus Stahl Diese Klasse umfasst nicht: - Kaltziehen von Stäben (s. 24.31) @de
scope note: This class includes: - operation of blast furnaces, steel converters, rolling and finishing mills - production of pig iron and spiegeleisen in pigs, blocks or other primary forms - production of ferro-alloys - production of ferrous products by direct reduction of iron and other spongy ferrous products - production of iron of exceptional purity by electrolysis or other chemical processes - remelting of scrap ingots of iron or steel - production of granular iron and iron powder - production of steel in ingots or other primary forms - production of semi-finished products of steel - manufacture of hot-rolled and cold-rolled flat-rolled products of steel - manufacture of hot-rolled bars and rods of steel - manufacture of hot-rolled open sections of steel - manufacture of sheet piling of steel and welded open sections of steel - manufacture of railway track materials (unassembled rails) of steel This class excludes: - cold drawing of bars, see 24.31 @en
scope note: Esta clase comprende: - la explotación de altos hornos, convertidores de acero, talleres de laminado y de acabado - la producción de lingotes de hierro y fundición especular en lingotes, bloques u otras formas primarias - la producción de ferroaleaciones - la producción de productos férreos por reducción directa de hierro y otros productos férreos porosos; la producción de hierro de una pureza excepcional por electrólisis y otros procesos químicos - la refundición en lingotes de desechos de hierro o acero - la producción de hierro granulado y polvo de hierro - la producción de acero en lingotes y otras formas primarias - la producción de productos semielaborados de acero - la fabricación de productos laminados en caliente o en frío de acero - la fabricación de barras y varillas de acero laminadas en caliente - la fabricación de angulares y perfiles de acero laminados en caliente - la fabricación de tablestacas y de perfiles y angulares soldados de acero - la fabricación de materiales de acero para vías férreas (raíles sin ensamblar) Esta clase no comprende: - el estirado en frío de barras (véase 24.31) @es
scope note: Cette classe comprend: - l’exploitation de hauts fourneaux, de convertisseurs de la fonte en acier, d’ateliers de laminage et de finissage - la production de fontes brutes et de fontes spiegel en gueuses, saumons ou autres - la production de ferroalliages - la production de produits ferreux obtenus par réduction directe des minerais de fer et autres produits ferreux spongieux - la production de fer d’une exceptionnelle pureté par électrolyse et autres procédés chimiques - la production de déchets lingotés en fer ou en acier - la production de grenailles et de poudres de fer - la production d’acier en lingots ou autres formes primaires - la production de demi-produits en acier - la fabrication de produits laminés plats en acier obtenus par laminage à chaud et à froid - la fabrication de barres en acier obtenues par laminage à chaud - la fabrication de profilés ouverts en acier obtenus par laminage à chaud - la production de palplanches en acier et de profilés ouverts obtenus par soudage - la fabrication d’éléments de construction de voies ferrées (rails non assemblés) en acier Cette classe ne comprend pas: - l’étirage à froid de barres, voir 24.31 @fr
scope note: Ovaj razred uključuje: - proizvodnju visokih pećih, konvertera od čelika i valjaonica - proizvodnju sirovog željeza i zrcalnoga željeza u komadima, blokovima ili drugim primarnim oblicima - proizvodnju ferolegura - proizvodnju čeličnih proizvoda izravnom redukcijom željeza te ostalih spužvastih proizvoda od željeza - proizvodnju željeza iznimne čistoće dobivenog elektrolizom ili nekim drugim kemijskim procesom - taljenje mljevenog ingota od željeza i čelika - proizvodnju željeza u granulama i u prahu - proizvodnju ingota od čelika ili ostalih primarnih oblika - proizvodnju polugotovih proizvoda od čelika - proizvodnju toplo, hladno i ravno valjanih proizvoda od čelika - proizvodnju toplo valjanih šipki i motki od čelika - proizvodnju toplo valjanih otvorenih profila čelika - proizvodnju piling ploča od čelika te zavarenih otvorenih profila od čelika - proizvodnju proizvoda od čelika za izgradnju kolosijeka (nesastavljenih šina) Ovaj razred isključuje: - hladno vučenje žica, vidi 24.31
scope note: Į šią klasę įeina: - prapūtimo krosnių, plieno konverterių, valcavimo ir apdailos įmonių veikla - ketaus ir veidrodinio ketaus luitų, blokų ar kitų pirminių formų pavidalo gamyba - ferolydinių gamyba - geležies gaminių, tiesiogiai redukuojant geležį arba kitus akytosios geležies produktus, gamyba - ypatingai grynos geležies gamyba elektrolizės ar kitokio cheminio proceso būdu - geležies ar plieno laužo liejinių perlydymas - granuliuotosios geležies ir geležies miltelių gamyba - plieno luitų arba kitų pirminių formų gamyba - plieno pusgaminių gamyba - plieno plokščiųjų karštojo ir šaltojo valcavimo produktų gamyba - plieno karštojo valcavimo juostų ir strypų gamyba - plieno karštojo valcavimo atvirųjų profilinių gaminių gamyba - plieno spauslenčių (įlaidinių sienelių) ir suvirintų atvirųjų profilinių gaminių gamyba - geležinkelio kelio plieno reikmenų (nesumontuotų bėgių) gamyba Į šią klasę neįeina: - strypų šaltasis tempimas, žr. 24.31 @lt
scope note: Данная группа включает производство прочих стальных изделий холодным способом обработки. @ru
scope note: Bu sınıf aşağıdakileri kapsamaktadır; - maden eritme ocakları, çelik fırınları, haddehane makineleri ve bitirme haddelerinin işletilmesi, - külçe, blok veya diğer birincil formlardaki dökme demir (pik demir) ve aynalı demir (spiegeleisen) üretimi, - demir alaşımlarının imalatı, - demirin ve diğer sünger demir ürünlerinin doğrudan indirgenmesi yoluyla demir çelik ürünlerinin imal edilmesi; elektroliz veya diğer kimyasal süreçler uygulanarak istisnai saflıkta demir üretilmesi, - demir ya da çelik hurdaların yeniden eritilmesi, - demir granül ve demir tozu üretilmesi - kütük veya diğer birincil formlarda çelik üretilmesi, - çelikten yarı mamuller üretilmesi, - çelikten sıcak veya soğuk çekilmiş yassı hadde ürünleri, - çelikten sıcak haddelenmiş bar ve çubukların üretilmesi, - çelikten sıcak haddelenmiş açık profil üretilmesi, - çelikten ve kaynaklı çelikten açık profillerin üretimi, - demiryolu ray hattı malzemelerinin üretimi (birleştirilmemiş raylar). Kapsam dışı olanlar; - barların soğuk çekilmesi, bkz. 24.31, @tr
preferred label: Производство на чугун, стомана и феросплави @bg
preferred label: Výroba surového železa, oceli a feroslitin @cs
preferred label: Fremstilling af råjern og råstål samt jernlegeringer @da
preferred label: Erzeugung von Roheisen, Stahl und Ferrolegierungen @de
preferred label: Παραγωγή βασικού σιδήρου και χάλυβα και σιδηροκραμάτων @el
preferred label: Fabricación de productos básicos de hierro, acero y ferroaleaciones @es
preferred label: Raua, terase ja ferrosulamite tootmine @et
preferred label: Raudan, teräksen ja rautaseosten valmistus @fi
preferred label: Sidérurgie @fr
preferred label: Vas-, acél-, vasötvözet-alapanyag gyártása
preferred label: Attività siderurgiche @it
preferred label: Tomo ketaus ir plieno bei ferolydinių gamyba @lt
preferred label: Čuguna, tērauda un dzelzs sakausējumu ražošana @lv
preferred label: Manifattura ta' ħadid u azzar bażiċi u ta' ligi tal-ħadid @mt
preferred label: Vervaardiging van ijzer en staal en van ferrolegeringen @nl
preferred label: Produksjon av jern og stål, samt ferrolegeringer @no
preferred label: Produkcja surówki żelazostopów, żeliwa i stali oraz wyrobów hutniczych @pl
preferred label: Siderurgia e fabricação de ferro-ligas @pt
preferred label: Producţia de metale feroase sub forme primare şi de feroaliaje @ro
preferred label: Производство чугуна, стали и ферросплавов @ru
preferred label: Výroba surového železa a ocele a ferozliatin @sk
preferred label: Proizvodnja surovega železa, jekla, ferozlitin @sl
preferred label: Framställning av järn och stål samt ferrolegeringar @sv
preferred label: Ana demir ve çelik ürünleri ile demir alaşımları imalatı @tr
broader: Manufacture of basic iron and steel and of ferro-alloys

Manufacture of tubes, pipes, hollow profiles and related fittings, of steel
type: Concept
notation: 24.2
status: valid
status modified: 2013-10-18
accepted date: 2013-10-18
in scheme: Statistical Classification of Economic Activities in the European Community, Rev. 2 (2008)
scope note: Этот класс включает: - производство стального прута и целиковой заготовки прямоугольного сечения путем холодной вытяжки, измельчения или вращения Этот класс исключает: - изготовление проволоки, см. 24.34 @ru
preferred label: Производство на тръби, кухи профили и фитинги за тях от стомана @bg
preferred label: Výroba ocelových trub, trubek, dutých profilů a souvisejících potrubních tvarovek @cs
preferred label: Fremstilling af rør og hule profiler og tilhørende fittings af stål @da
preferred label: Herstellung von Stahlrohren, Rohrform-, Rohrverschluss- und Rohrverbindungsstücken aus Stahl @de
preferred label: Κατασκευή χαλύβδινων σωλήνων, αγωγών, κοίλων ειδών με καθορισμένη μορφή και συναφών εξαρτημάτων @el
preferred label: Fabricación de tubos, tuberías, perfiles huecos y sus accesorios, de acero @es
preferred label: Terastorude, -õõnesprofiilide jms -toruliitmike tootmine @et
preferred label: Putkien, profiiliputkien ja niihin liittyvien tarvikkeiden valmistus teräksestä @fi
preferred label: Fabrication de tubes, tuyaux, profilés creux et accessoires correspondants en acier @fr
preferred label: Acélcsőgyártás
preferred label: Fabbricazione di tubi, condotti, profilati cavi e relative guarnizioni in acciaio @it
preferred label: Plieninių vamzdžių, vamzdelių, tuščiavidurių profilių ir susijusių jungiamųjų detalių gamyba @lt
preferred label: Tērauda cauruļu, dobu profilu un to savienojumu ražošana @lv
preferred label: Manifattura ta' tubi, pajpijiet, profili vojta u tagħmir relatat, ta' l-azzar @mt
preferred label: Vervaardiging van buizen, pijpen, holle profielen en fittings daarvoor, van staal @nl
preferred label: Produksjon av andre rør og rørdeler av stål @no
preferred label: Produkcja rur, przewodów, kształtowników zamkniętych i łączników, ze stali @pl
preferred label: Fabricação de tubos, condutas, perfis ocos e respectivos acessórios, de aço @pt
preferred label: Producţia de tuburi, ţevi, profile tubulare şi accesorii pentru acestea, din oţel @ro
preferred label: Производство труб, трубопроводов, профилей, фитингов из стали @ru
preferred label: Výroba rúr, rúrok, dutých profilov a súvisiaceho príslušenstva z ocele @sk
preferred label: Proizvodnja jeklenih cevi, votlih profilov in fitingov @sl
preferred label: Tillverkning av rör, ledningar, ihåliga profiler och tillbehör av stål @sv
preferred label: Çelikten tüpler, borular, içi boş profiller ve benzeri bağlantı parçalarının imalatı @tr
broader: Manufacture of basic metals
narrower: Manufacture of tubes, pipes, hollow profiles and related fittings, of steel

Manufacture of tubes, pipes, hollow profiles and related fittings, of steel
type: Concept
notation: 24.20
status: valid
status modified: 2013-10-18
accepted date: 2013-10-18
in scheme: Statistical Classification of Economic Activities in the European Community, Rev. 2 (2008)
scope note: - производство на безшевни тръби с кръгло или друго напречно сечение и на заготовки с кръгло напречно сечение за допълнителна преработка чрез горещо валцуване или горещо пресуване или посредством друга гореща преработка в междинни продукти, които могат да бъдат пръти или заготовки за пръти, получени чрез горещо валцуване или непрекъснато леене - производство на прецизни и обикновени безшевни тръби от горещовалцувани или горещопресувани заготовки чрез последваща преработка чрез студено изтегляне или студено валцуване на тръби с кръгло напречно сечение, а за тръби с некръгло напречно сечение и кухи профили - единствено чрез студено изтегляне - производство на надлъжно или спираловидно заварени тръби с външен диаметър > 406.4 мм, студеноформувани от горещовалцувани плоски продукти - производство на надлъжно или спираловидно заварени тръби с външен диаметър <= 406.4 мм, с кръгло напречно сечение, чрез непрекъснато студено- или горещо формуване на горещо- или студеновалцувани плоски продукти и на кухи профили с некръгло напречно сечение, чрез горещо- или студено формуване на надлъжно заварени, горещо- или студеновалцувана лента - производство на заварени прецизни тръби с външен диаметър <= 406.4 мм, чрез горещо- или студено формуване на горещо- или студеновалцувани ленти и надлъжно заварени, доставени така както са заварени или допълнително преработени чрез студено валцуване или студено изтегляне, а за тръби с некръгло напречно сечение - само чрез студено формуване - производство на плоски фланци и фланци с ковани пръстени чрез преработка на горещовалцувани плоски продукти от стомана - производство на фитинги за челно заваряване, като колена и редуциращи съединителни елементи, чрез коване на горещовалцувани безшевни тръби от стомана - производство на стоманени фитинги с резба и други видове - производство на безшевни тръби от стомана, получени чрез центробежно леене - 24.52 @bg
scope note: Z: - výrobu bezešvých trub a trubek s kruhovým nebo jiným průřezem a výlisků s kruhovým průřezem (určených k dalšímu zpracování) válcováním za tepla, protlačováním za tepla nebo jiným zpracováním předvýrobků za tepla, jako jsou za tepla válcované nebo plynule odlévané předvalky nebo sochory - výrobu přesných a jiných bezešvých trub a trubek ze za tepla válcovaných nebo ze za tepla protlačovaných výlisků dalším zpracováním: tažením za studena a válcováním za studena trubek kruhového průřezu nebo tažením za studena trubek jiného než kruhového průřezu a dutých profilů - výrobu svařovaných trub a trubek o vnějším průměru nad 406,4 mm tvarováním za studena válcovaných plochých produktů za tepla a svařovaných podél podélné osy nebo spirály - výrobu svařovaných trub a trubek svařovaných podél podélné osy nebo spirály s kruhovým průřezem o vnějším průměru 406,4 mm nebo méně plynulým tvarováním za tepla nebo za studena ze za tepla nebo za studena válcovaných plochých výrobků a výrobu svařovaných trub a trubek podle podélné osy s jiným než kruhovým průřezem tvarováním za tepla nebo za studena z pásů válcovaných za tepla nebo za studena - výrobu svařovaných přesných trub a trubek o vnějším průměru 406,4 mm a menším tvarováním za tepla nebo za studena pásů válcovaných za tepla nebo za studena a svařováním podél podélné osy, které mohou být dále zpracovány: tažením, válcováním nebo tvarováním za studena trubek s jiným než kruhovým průřezem - výrobu plochých a krkových přírub zpracováním za tepla válcovaných plochých ocelových výrobků - výrobu příslušenství pro svařování na tupo (jako jsou kolena a redukce), vyráběných kováním ze za tepla válcovaných bezešvých ocelových trubek - příslušenství z oceli pro trubky a trouby ozávitované i bez závitů N: - výrobu bezešvých ocelových trubek vyráběných odstředivým odléváním (24.52) @cs
scope note: Diese Klasse umfasst: - Herstellung von nahtlosen Rohren mit kreisförmigem oder anderem Querschnitt sowie von Knüppelrohlingen mit kreisförmigem Querschnitt zur Weiterverarbeitung durch Warmwalzen, Warmstrangpressen oder andere Warmverarbeitung eines Halbzeugs, etwa von warm gewalzten oder stranggegossenen Stäben oder Knüppeln - Herstellung von nahtlosen Präzisionsrohren und anderen nahtlosen Rohren aus warm gewalzten oder stranggepressten Knüppelrohlingen durch Kaltziehen oder Kaltwalzen von Rohren mit kreisförmigem Querschnitt bzw. von Rohren mit nichtkreisförmigem Querschnitt nur durch Kaltziehen - Herstellung von geschweißten Rohren mit kreisförmigem Querschnitt und einem Außendurchmesser von mehr als 406,4 mm, aus warm gewalzten Flacherzeugnissen kalt geformt und entlang der Längsachse oder einer Spirale geschweißt - Herstellung von geschweißten Rohren mit kreisförmigem Querschnitt und einem Außendurchmesser von 406,4 mm oder weniger durch kontinuierliches Kalt- oder Warmformen aus warm gewalzten Flacherzeugnissen und Schweißen entlang der Längsachse oder einer Spirale sowie von offenen Profilen mit nichtkreisförmigem Querschnitt durch Kalt- oder Warmformen aus Warm- oder Kaltband und Schweißen in entlang der Längsachse - Herstellung von geschweißten Präzisionsrohren mit einem Außendurchmesser von 406,4 mm oder weniger durch Warm- oder Kaltformen von Warm- oder Kaltband und Schweißen entlang der Längsachse, auch weiterverarbeitet, sowie durch Kaltziehen, -walzen oder -formen im Fall von Rohren mit nichtkreisförmigem Querschnitt - Herstellung von Form-, Verbindungs- und Verschlussstücke zum Stumpfschweißen durch Verarbeiten von warm gewalzten Flacherzeugnissen aus Stahl - Herstellung von Rohrformstücken, Rohrverschlussstücken und Rohrverbindungsstücken zum Stumpfschweißen durch Schmieden von warm gewalzten, nahtlosen Stahlrohren - mit Gewinde versehene oder andere Rohre, Rohrform-, Rohrverschluss- und Rohrverbindungsstücke, aus Stahl Diese Klasse umfasst nicht: … @de
scope note: This class includes: - manufacture of seamless tubes and pipes of circular or non-circular cross section and of blanks of circular cross section, for further processing, by hot rolling, hot extrusion or by other hot processes of an intermediate product which can be a bar or a billet obtained by hot rolling or continuous casting - manufacture of precision and non-precision seamless tubes and pipes from hot rolled or hot extruded blanks by further processing, by cold-drawing or cold-rolling of tubes and pipes of circular cross section and by cold drawing only for tubes and pipes of non circular cross section and hollow profiles - manufacture of welded tubes and pipes of an external diameter exceeding 406,4 mm, cold formed from hot rolled flat products and longitudinally or spirally welded - manufacture of welded tubes and pipes of an external diameter of 406,4 mm or less of circular cross section by continuous cold or hot forming of hot or cold rolled flat products and longitudinally or spirally welded and of non-circular cross section by hot or cold forming into shape from hot or cold rolled strip longitudinally welded - manufacture of welded precision tubes and pipes of an external diameter of 406,4 mm or less by hot or cold forming of hot or cold rolled strip and longitudinally welded delivered as welded or further processed, by cold drawing or cold rolling or cold formed into shape for tube and pipe of non-circular cross section - manufacture of flat flanges and flanges with forged collars by processing of hot rolled flat products of steel - manufacture of butt-welding fittings, such as elbows and reductions, by forging of hot rolled seamless tubes of steel - threaded and other tube or pipe fittings of steel This class excludes - manufacture of seamless tubes and pipes of steel by centrifugally casting, see 24.52 @en
scope note: Esta clase comprende: - la fabricación de tubos y tuberías sin soldadura de sección transversal circular o no circular y de piezas de fundición de sección transversal circular, para su tratamiento posterior, mediante laminación en caliente, extrusión en caliente u otros procesos en caliente de productos intermedios que pueden consistir en barras o tochos obtenidos mediante laminación en caliente o colada continua - la fabricación de tubos y tuberías sin soldadura de precisión y de no precisión a partir de piezas laminadas o extrusionadas en caliente mediante el estirado o la laminación en frío de tubos y tuberías de sección transversal circular, y el estirado en frío únicamente para los tubos y tuberías de sección transversal no circular y perfiles huecos - la fabricación de tubos y tuberías soldados de un diámetro externo superior a 406,4 mm, conformados en frío a partir de productos planos laminados en caliente y soldados longitudinalmente o en espiral - la fabricación de tubos y tuberías soldados de un diámetro externo de 406,4 mm o menos de sección transversal circular mediante conformación continua en frío o caliente de productos planos laminados en frío o en caliente y soldados longitudinalmente o en espiral, y de sección transversal no circular, mediante conformación en caliente o en frío a partir de bandas laminadas en caliente o en frío y soldadas longitudinalmente - la fabricación de tubos y tuberías soldados de precisión, de un diámetro externo de 406,4 mm o menos, mediante conformación en caliente o en frío de bandas laminadas en caliente o en frío y soldadas longitudinalmente, simplemente soldados o tratados mediante estirado, laminado o conformación en frío de tubos y tuberías de sección transversal no circular - la fabricación de bridas y bridas planas con collares forjados mediante el tratamiento de productos planos de acero laminados en caliente - la fabricación de juntas de soldadura, como codos y reducciones, mediante la forja de tubos de acero si… @es
scope note: Cette classe comprend: - la fabrication de tubes et tuyaux sans soudure de section circulaire ou autre et d’ébauches de section circulaire, destinées à un traitement ultérieur, par laminage à chaud, extrusion à chaud ou toute autre transformation à chaud d’un produit intermédiaire, qui peut être une barre ou une billette, obtenu par laminage à chaud ou par la coulée continue - la fabrication de tubes et tuyaux sans soudure, de précision ou autres, à partir d’ébauches laminées à chaud ou extrudées à chaud par une transformation ultérieure, par étirage à froid ou laminage à froid de tubes et tuyaux de section circulaire et par étirage à froid uniquement de tubes et tuyaux de section non circulaire et de profilés creux - la fabrication de tubes et tuyaux d’un diamètre extérieur supérieur à 406,4 mm, soudés par formage à froid à partir de produits plats laminés à chaud et soudés longitudinalement ou en spirale - la fabrication de tubes et tuyaux d’un diamètre extérieur inférieur ou égal à 406,4 mm de section circulaire soudés par formage continu à chaud ou à froid de produits plats laminés à froid ou à chaud et soudés longitudinalement ou en spirale et de section autre que circulaire par formage à froid ou à chaud mis en forme à partir de bandes laminées à froid ou à chaud soudés longitudinalement - la fabrication de tubes et tuyaux de précision soudés d’un diamètre extérieur inférieur ou égal à 406,4 mm par formage à froid ou à chaud de bandes laminées à froid ou à chaud et soudés longitudinalement livrés après avoir été soudés ou destinés à une transformation ultérieure, par étirage à froid ou laminage à froid ou mis en forme à froid pour des tubes et tuyaux de section autre que circulaire - la fabrication de brides plates ou à collerette forgée par transformation de produits plats laminés à chaud en acier - la fabrication d’accessoires à souder bout à bout en acier, tels que coudes et manchons, par forgeage de tubes sans soudure en acier obtenus par laminage à chaud … @fr
scope note: Ovaj razred uključuje: - proizvodnju bešavnih cijevi s cirkularnim ili necirkularnim križnim profilom te praznih cirkularnih križnih profila za daljnju obradu toplim oblikovanjem, vrućom ekstruzijom ili nekim drugim vrućim postupkom za intermedijarni proizvod koji se može dobiti toplim oblikovanjem ili stalnim lijevanjem - proizvodnju bešavnih cijevi toplim valjanjem, toplim protiskivanjem ili toplim izvlačenjem ili hladnim izvlačenjem i hladnim valjanjem cirkularnih križnih praznih profila - proizvodnju zavarenih cijevi, vanjskog promjera većeg od 406.4 mm, hladnim izvlačenjem i hladnim valjanjem - proizvodnju zavarenih cijevi, vanjskog promjera manje ili jednako 406.4 mm cirkularnih križnih profila izvlačenjem i hladnim valjanjem, proizvodnju longitudinalno zavarenih cijevi hladnim ili toplim oblikovanjem i zavarivanjem, odnosno nakon oblikovanja toplom redukcijom ili hladnim vučenjem - proizvodnju zavarenih cijevi vanjskog promjera manjeg ili jednako 406.4 mm toplim ili hladnim oblikovanjem te longitudinalno zavarenih i isporučenih za daljnju proizvodnju, hladnim izvlačenjem i hladnim valjanjem longitudinalno zavarenih i isporučenih kao zavareni proizvod ili dostavljenih za daljnju proizvodnju, hladnim izvlačenjem i hladnim valjanjem oblikovanih u cijevi za necirkularni profil - proizvodnju plosnatih prirubnica i prirubnica s kovanim obručem od čelika - proizvodnju pribora za cijevi kao što koljena i nastavci, toplim valjanjem bešavnih cijevi od čelika - proizvodnju navojnica i ostalih cijevi ili pribora za cijevi od čelika Ovaj razred isključuje: - proizvodnju bešavnih cijevi od centrifugalno lijevanog čelika, vidi 24.52
scope note: Į šią klasę įeina: - besiūlių apskritojo ar neapskritojo skerspjūvio vamzdžių ir vamzdelių ir apskritojo skerspjūvio ruošinių gamyba tolesniam perdirbimui karštai valcuojant, karštai presuojant ar kitaip karštai apdirbant tarpinius gaminius, kuriais gali būti strypai ar ruošiniai, gauti karštojo valcavimo ar tolydžiojo liejimo būdu - precizinių ir neprecizinių besiūlių vamzdžių ir vamzdelių gamyba iš karštojo valcavimo ar karštosios ekstruzijos ruošinių toliau apdirbant apskritojo skerspjūvio vamzdžius ir vamzdelius šaltojo tempimo ar šaltojo valcavimo būdu, o neapskritojo skerspjūvio vamzdžius ir vamzdelius bei tuščiavidurius profilius tik šaltojo tempimo būdu - suvirintųjų vamzdžių ir vamzdelių, kurių išorinis skersmuo didesnis kaip 406,4 mm, gamyba šaltai formuojant iš karštojo valcavimo plokščiųjų ir išilgai ar spirale suvirintų gaminių - suvirintųjų apskritojo skerspjūvio vamzdžių ir vamzdelių, kurių išorinis skersmuo ne didesnis kaip 406,4 mm, gamyba tolydžiai šaltai ar karštai formuojant karštai ar šaltai valcuotus, išilgai ar spirale suvirintus plokščiuosius gaminius ir suvirintųjų neapskritojo skerspjūvio vamzdžių ir vamzdelių gamyba karštai ar šaltai formuojant į profilius iš karštai ar šaltai valcuotų išilgai suvirintų juostų - suvirintųjų precizinių vamzdžių ir vamzdelių, kurių išorinis skersmuo ne didesnis kaip 406,4 mm, gamyba karštai ar šaltai formuojant karštai ar šaltai valcuotas ir išilgai suvirintas juostas, pateiktas kaip suvirintas ar toliau apdirbtas šaltojo tempimo ar šaltojo valcavimo būdu, ar šaltai formuotus neapskritojo skerspjūvio vamzdžių ir vamzdelių ruošinius - plokščiųjų jungių ir jungių su karštai štampuotais antbriauniais gamyba apdorojant karštai valcuotus plokščiuosius plieno gaminius - sandūrinio kontaktinio suvirinimo jungiamųjų detalių, tokių kaip alkūnės ir apspaudai, gamyba iš karštai valcuotų besiūlių plieno vamzdžių karštojo štampavimo būdu - srieginių ir kitokių plieninių jungiamųjų detalių vamzdžiams ar vamzdeliams gamyba… @lt
scope note: Этот класс включает: - производство покрытых или непокрытых плоскостальных катаных винтовых или прямых изделий с шириной менее чем 600 мм, путем холодной вторичной прокатки из плоских горячекатаных изделий или стального прута @ru
scope note: Bu sınıf aşağıdakileri kapsamaktadır; - sıcak haddeleme veya sürekli döküm yoluyla elde edilen bar veya çubuk şeklinde olabilen bir ara ürünün daha ileri işlemler için sıcak haddeleme, sıcak ekstrüzyon veya diğer sıcak işleme yöntemleriyle dikişsiz boru, dairesel veya dairesel olmayan kesitli içi boş boru veya profil olarak imalatı, - dairesel kesitli tüp ve boruların ileri işlemlerle, soğuk çekilmesiyle veya soğuk haddelenmesiyle ve dairesel kesitli olmayan tüpler, borular ve içi boş profillerin sadece soğuk çekilmesiyle sıcak haddelenmiş veya sıcak ekstrüzyonlanmış hassas ve hassas olmayan dikişsiz tüp ve boruların imalatı, - sıcak haddelenmiş ve boyuna veya spiral olarak kaynak yapılmış olan yassı ürünlerden soğuk olarak şekillendirilen, dış çapı 406,4 mm.`yi aşan kaynaklı borular ve tüplerin imalatı, - sıcak veya soğuk haddelenmiş, boyuna veya spiral kaynaklı yassı ürünlerin sürekli soğuk veya sıcak kalıplanmasıyla dairesel kesitli olan ve sıcak veya soğuk haddelenmiş, boyuna kaynaklı şeritlerden sıcak veya soğuk kalıplanmasıyla şekillendirilen dairesel kesitli olmayan dış çapı 406,4 mm ve daha az olan kaynaklanmış tüp ve boruların imalatı, - soğuk çekmeyle veya soğuk haddelemeyle ya da soğuk kalıplamayla dairesel olmayan kesitli tüpler ve borular için şekillendirilmiş, kaynaklanmış veya daha ileri bir işleme tabi tutulmuş olarak dağıtılan boyuna kaynaklanmış ve sıcak veya soğuk haddelenmiş şeritlerin sıcak veya soğuk kalıplanmasıyla, dış çapı 406,4 mm veya daha az olan kaynaklanmış hassas tüplerin ve boruların imalatı, - sıcak haddelenmiş yassı çelik ürünlerin işlenmesi ile yassı flanşların ve döküm halkalı flanşların imalatı, - sıcak haddelenmiş dikişsiz çelik boruların dövülmesiyle, dirsekler ve küçültülmüş parçalar gibi, dirsekli bağlantı parçalarının imalatı, - çelikten yivli veya diğer tüp veya boru bağlantı parçaları. Kapsam dışı olanlar; - savurma döküm yöntemiyle dikişsiz çelik boruların ve tüplerin imalatı, bkz. 24.52. @tr
preferred label: Производство на тръби, кухи профили и фитинги за тях от стомана @bg
preferred label: Výroba ocelových trub, trubek, dutých profilů a souvisejících potrubních tvarovek @cs
preferred label: Fremstilling af rør og hule profiler og tilhørende fittings af stål @da
preferred label: Herstellung von Stahlrohren, Rohrform-, Rohrverschluss- und Rohrverbindungsstücken aus Stahl @de
preferred label: Κατασκευή χαλύβδινων σωλήνων, αγωγών, κοίλων ειδών με καθορισμένη μορφή και συναφών εξαρτημάτων @el
preferred label: Fabricación de tubos, tuberías, perfiles huecos y sus accesorios, de acero @es
preferred label: Terastorude, -õõnesprofiilide jms -toruliitmike tootmine @et
preferred label: Putkien, profiiliputkien ja niihin liittyvien tarvikkeiden valmistus teräksestä @fi
preferred label: Fabrication de tubes, tuyaux, profilés creux et accessoires correspondants en acier @fr
preferred label: Acélcsőgyártás
preferred label: Fabbricazione di tubi, condotti, profilati cavi e relative guarnizioni in acciaio @it
preferred label: Plieninių vamzdžių, vamzdelių, tuščiavidurių profilių ir susijusių jungiamųjų detalių gamyba @lt
preferred label: Tērauda cauruļu, dobu profilu un to savienojumu ražošana @lv
preferred label: Manifattura ta' tubi, pajpijiet, profili vojta u tagħmir relatat, ta' l-azzar @mt
preferred label: Vervaardiging van buizen, pijpen, holle profielen en fittings daarvoor, van staal @nl
preferred label: Produksjon av andre rør og rørdeler av stål @no
preferred label: Produkcja rur, przewodów, kształtowników zamkniętych i łączników, ze stali @pl
preferred label: Fabricação de tubos, condutas, perfis ocos e respectivos acessórios de aço @pt
preferred label: Producţia de tuburi, ţevi, profile tubulare şi accesorii pentru acestea, din oţel @ro
preferred label: Производство труб, трубопроводов, профилей, фитингов из стали @ru
preferred label: Výroba rúr, rúrok, dutých profilov a súvisiaceho príslušenstva z ocele @sk
preferred label: Proizvodnja jeklenih cevi, votlih profilov in fitingov @sl
preferred label: Tillverkning av rör, ledningar, ihåliga profiler och tillbehör av stål @sv
preferred label: Çelikten tüpler, borular, içi boş profiller ve benzeri bağlantı parçalarının imalatı @tr
broader: Manufacture of tubes, pipes, hollow profiles and related fittings, of steel

Manufacture of other products of first processing of steel
type: Concept
notation: 24.3
status: valid
status modified: 2013-10-18
accepted date: 2013-10-18
in scheme: Statistical Classification of Economic Activities in the European Community, Rev. 2 (2008)
scope note: Tato skupina zahrnuje výrobu ostatních výrobků z oceli zpracováním za studena. @cs
scope note: Diese Gruppe umfasst die Herstellung von anderen Erzeugnissen durch Kaltverarbeitung von Stahl. @de
scope note: This group includes manufacturing other products by cold processing of steel. @en
scope note: Este grupo comprende la fabricación de otros productos mediante el procesado en frío del acero. @es
scope note: Ce groupe comprend la fabrication d’autres produits en acier par traitement à froid. @fr
scope note: Ova skupina uključuje proizvodnju ostalih proizvoda hladnim oblikovanjem čelika.
scope note: Į šią grupę įeina kitų plieninių šaltojo apdirbimo gaminių gamyba @lt
scope note: Этот класс включает: - производство открытых секций в процессе холодной формовки на вальцах или методом фальцовки на прессе из плоскокатаных изделий из стали - производство формованных или фальцованных рифленых листов и сэндвич - панелей из стали холодным методом @ru
scope note: Bu grup, çeliğin soğuk işlenmesiyle diğer ürünlerin imal edilmesini kapsamaktadır. @tr
preferred label: Производство на други продукти при първичната преработка на стомана @bg
preferred label: Výroba ostatních výrobků získaných jednostupňovým zpracováním oceli @cs
preferred label: Fremstilling af andre produkter af den primære forarbejdning af stål @da
preferred label: Sonstige erste Bearbeitung von Eisen und Stahl @de
preferred label: Κατασκευή άλλων προϊόντων πρωτογενούς επεξεργασίας χάλυβα @el
preferred label: Fabricación de otros productos de primera transformación del acero @es
preferred label: Muude terase esmatöötlustoodete tootmine @et
preferred label: Muu teräksen jalostus @fi
preferred label: Fabrication d'autres produits de première transformation de l'acier @fr
preferred label: Egyéb kohászati termék gyártása acélból
preferred label: Fabbricazione di altri prodotti della prima trasformazione dell'acciaio @it
preferred label: Kitų plieno pirminio apdirbimo gaminių gamyba @lt
preferred label: Tērauda pirmapstrādes izstrādājumu ražošana @lv
preferred label: Manifattura ta' prodotti oħra ta' l-ewwel ipproċessar ta' l-azzar @mt
preferred label: Vervaardiging van andere producten van de eerste verwerking van staal @nl
preferred label: Annen bearbeiding av jern og stål @no
preferred label: Produkcja pozostałych wyrobów ze stali poddanych wstępnej obróbce @pl
preferred label: Outras actividades da primeira transformação do ferro e do aço @pt
preferred label: Fabricarea altor produse prin prelucrarea primară a oţelului @ro
preferred label: Производство прочих стальных изделий путем первичной обработки @ru
preferred label: Výroba ostatných výrobkov prvotného spracovania ocele @sk
preferred label: Druga primarna predelave železa in jekla @sl
preferred label: Annan primärbearbetning av stål @sv
preferred label: Çeliğin ilk işlenmesinde elde edilen diğer ürünlerin imalatı @tr
broader: Manufacture of basic metals
narrower: Cold drawing of bars
narrower: Cold rolling of narrow strip
narrower: Cold forming or folding
narrower: Cold drawing of wire

Cold drawing of bars
type: Concept
notation: 24.31
status: valid
status modified: 2013-10-18
accepted date: 2013-10-18
in scheme: Statistical Classification of Economic Activities in the European Community, Rev. 2 (2008)
scope note: - производство на стоманени пръти и профили, получени чрез студено изтегляне, обстъргване или струговане - изтегляне на тел - 24.34 @bg
scope note: Z: - výrobu tyčové oceli a plných ocelových profilů tažením za studena, broušením nebo soustružením N: - tažení drátu (24.34) @cs
scope note: Diese Klasse umfasst: - Herstellung von Stabstahl und Vollprofilen aus Stahl durch Kaltziehen, Schleifen oder Drehen Diese Klasse umfasst nicht: - Ziehen von Draht (s. 24.34) @de
scope note: This class includes: - manufacture of steel bars and solid sections of steel by cold drawing, grinding or turning This class excludes: - drawing of wire, see 24.34 @en
scope note: Esta clase comprende: - la fabricación de barras y perfiles sólidos de acero mediante estirado en frío, esmerilado o torneado Esta clase no comprende: - el trefilado (véase 24.34) @es
scope note: Cette classe comprend: - la fabrication de barres ou de profilés de section pleine en acier par étirage à froid, rectification ou tournage Cette classe ne comprend pas: - le tréfilage à froid, voir 24.34 @fr
scope note: Ovaj razred uključuje: - proizvodnju šipki ili profila od čelika hladnim vučenjem, brušenjem ili ljuštenjem Ovaj razred isključuje: - vučenje žica, vidi 24.34
scope note: Į šią klasę įeina: - plieninių strypų ir ištisinio skerspjūvio profilių gamyba šaltojo tempimo, šlifavimo ar tekinimo būdu Į šią klasę neįeina: - vielos tempimas žr. 24.34 @lt
scope note: Этот класс включает: - производство стальной проволоки методом холодной вытяжки из тонких стальных прутов Этот класс исключает: - вытяжку стального прута и целиковых заготовок, см. 24.31 - производство изделий из проволоки, см. 25.93 @ru
scope note: Bu sınıf aşağıdakileri kapsamaktadır; - soğuk çekme, taşlama veya tornalama yoluyla çelik bar ve dolu kesitli çelik profil imalatı Kapsam dışı olanlar; - tel çekme, bkz. 24.34. @tr
preferred label: Студено изтегляне на пръти @bg
preferred label: Tažení tyčí za studena @cs
preferred label: Fremstilling af stænger ved koldtrækning @da
preferred label: Herstellung von Blankstahl @de
preferred label: Ψυχρή επεκτατική ολκή ράβδων @el
preferred label: Estirado en frío @es
preferred label: Külmtõmbamine lattideks @et
preferred label: Raudan ja teräksen kylmävetäminen @fi
preferred label: Étirage à froid de barres @fr
preferred label: Hidegen húzott acélrúd gyártása
preferred label: Stiratura a freddo di barre @it
preferred label: Šaltasis strypų tempimas @lt
preferred label: Aukstā vilkšana @lv
preferred label: Ġbid ta' vireg bil-kiesaħ @mt
preferred label: Koudtrekken van staven @nl
preferred label: Kaldtrekking av stenger og profiler @no
preferred label: Produkcja prętów ciągnionych na zimno @pl
preferred label: Estiragem a frio de barras @pt
preferred label: Tragere la rece a barelor @ro
preferred label: Холодное волочение @ru
preferred label: Ťahanie tyčí za studena @sk
preferred label: Hladno vlečenje profilov @sl
preferred label: Tillverkning av kalldragen stålstång @sv
preferred label: Barların soğuk çekilmesi @tr
broader: Manufacture of other products of first processing of steel

Cold rolling of narrow strip
type: Concept
notation: 24.32
status: valid
status modified: 2013-10-18
accepted date: 2013-10-18
in scheme: Statistical Classification of Economic Activities in the European Community, Rev. 2 (2008)
scope note: - производство на плосковалцувани продукти от стомана със или без покритие, навити или не, с широчина по-малка от 600 мм, получени чрез повторно студено валцуване на горещовалцувани плоски продукти или на стоманени пръти @bg
scope note: Z: - výrobu ploché povlakované i nepovlakované válcované oceli v tyčích nebo ve svitcích o šířce menší než 600 mm převálcováním za studena plochých ocelových profilů válcovaných za tepla nebo tyčové oceli @cs
scope note: Diese Klasse umfasst: - Herstellung von Flacherzeugnissen aus Stahl in Rollen oder Tafeln mit einer Breite von weniger als 600 mm, mit oder ohne Überzug, durch erneutes Kaltwalzen von warm gewalzten Flacherzeugnissen oder von Stabstahl @de
scope note: This class includes: - manufacture of coated or uncoated flat rolled steel products in coils or in straight lengths of a width less than 600 mm by cold re-rolling of hot-rolled flat products or of steel rod @en
scope note: Esta clase comprende: - la fabricación de productos planos, recubiertos o no, de acero laminado en rollos o en tiras (de grosor inferior a 600 milímetros), mediante el relaminado en frío de productos planos laminados en caliente o de varillas de acero @es
scope note: Cette classe comprend: - la fabrication de produits laminés plats en acier, nus ou revêtus, enroulés ou non, d’une largeur n’excédant pas 600 mm, obtenus par relaminage à froid de produits plats laminés à chaud ou de fil d’acier @fr
scope note: Ovaj razred uključuje: - proizvodnju ravno valjanih presvučenih ili nepresvučenih proizvoda od čelika u namotima ili ravnih užih od 600 mm, ponovnim hladnim valjanjem toplo valjanih ravnih proizvoda ili od čeličnih šipki
scope note: Į šią klasę įeina: - dengtų ar nedengtų plieninių plokščiojo valcavimo gaminių, susuktų į ritinius, ar siauresnių kaip 600 mm pločio plokščių gamyba karštojo valcavimo plokščiuosius gaminius perdirbus šaltojo valcavimo būdu @lt
scope note: Bu sınıf aşağıdakileri kapsamaktadır; - sıcak haddelenmiş yassı ürünlerin veya çelik çubukların soğuk olarak tekrar haddelenmesi yoluyla kangal veya düz olarak 600 mm`den daha az genişliğe sahip kaplanmış veya kaplanmamış, yassı olarak haddelenmiş çelik ürünlerin imalatı. @tr
preferred label: Студено валцуване на тесни ленти @bg
preferred label: Válcování ocelových úzkých pásů za studena @cs
preferred label: Fremstilling af stålbånd ved koldvalsning @da
preferred label: Herstellung von Kaltband mit einer Breite von weniger als 600 mm @de
preferred label: Ψυχρή έλαση στενών φύλλων @el
preferred label: Laminación en frío @es
preferred label: Külmvaltsimine kitsasteks ribadeks @et
preferred label: Rainan kylmävalssaus @fi
preferred label: Laminage à froid de feuillards @fr
preferred label: Hidegen hengerelt keskeny acélszalag gyártása
preferred label: Laminazione a freddo di nastri @it
preferred label: Šaltasis siaurų juostų valcavimas @lt
preferred label: Šauru slokšņu aukstā velmēšana @lv
preferred label: Ġbid ta' vireg dojoq bil-kiesaħ @mt
preferred label: Koudwalsen van bandstaal @nl
preferred label: Kaldvalsing av bånd @no
preferred label: Produkcja wyrobów płaskich walcowanych na zimno @pl
preferred label: Laminagem a frio de arco ou banda @pt
preferred label: Laminare la rece a benzilor înguste @ro
preferred label: Холодная прокатка лент и узких полос @ru
preferred label: Valcovanie pásov za studena @sk
preferred label: Hladno valjanje traku @sl
preferred label: Tillverkning av kallvalsade stålband @sv
preferred label: Dar şeritlerin soğuk haddelenmesi @tr
broader: Manufacture of other products of first processing of steel

Cold forming or folding
type: Concept
notation: 24.33
status: valid
status modified: 2013-10-18
accepted date: 2013-10-18
in scheme: Statistical Classification of Economic Activities in the European Community, Rev. 2 (2008)
scope note: - производство на отворени профили, получени от плосковалцувани продукти от стомана, чрез непрекъснато студено формуване на валцовъчен стан или огъване на преса - производство на студеноформувани или студеноогънати оребрени листове (рифелни ламарини) и "сандвич" панели @bg
scope note: Z: - výrobu otevřených profilů z ploché válcované oceli tvarováním za studena na válcovacích stolicích nebo ohýbáním na lisech - výrobu žebrovaných plechů a sendvičových panelů tvarováním a ohýbáním za studena @cs
scope note: Diese Klasse umfasst: - Herstellung von Profilen durch Kaltumformung in einem Walzwerk oder durch Biegen von Flachstahl in einer Presse - Herstellung von kalt hergestellten, profilierten Blechen und Sandwich-Platten @de
scope note: This class includes: - manufacture of open sections by progressive cold forming on a roll mill or folding on a press of flat-rolled products of steel - manufacture of cold-formed or cold-folded, ribbed sheets and sandwich panels @en
scope note: Esta clase comprende: - la fabricación de perfiles o chapas perfiladas, por conformación en un tren de laminación o mediante plegado en una prensa, de productos planos de acero laminados - la fabricación de planchas acanaladas y paneles laminados mediante laminación en frío por conformación con plegado @es
scope note: Cette classe comprend: - la fabrication de profilés ouverts par déformation progressive à froid sur machines à galets ou pliage sur presse plieuse de produits laminés plats en acier - la fabrication de produits formés ou pliés à froid, de tôles nervurées et de panneaux-sandwichs @fr
scope note: Ovaj razred uključuje: - proizvodnju otvorenih profila, postupnim oblikovanjem na valjcima ili savijanjem na prešama plosnatih proizvoda od čelika - proizvodnju hladno oblikovanih ili hladno savijenih, nabranih listova i sendvič-panela
scope note: Į šią klasę įeina: - atvirųjų profilių gamyba iš plokščiųjų valcuotųjų plieninių gaminių, laipsniškai šaltai formuojant staklėmis ar lankstant presais - briaunotųjų lakštų ir daugiasluoksnių plokščių gamyba šaltojo formavimo arba šaltojo lankstymo būdu @lt
scope note: Этот класс включает: - производство основных ценных металлов: • производство и очищение обработанных или не обработанных ценных металлов: золота, серебра, платины и т.п. из руды и самородков - производство драгоценных металлических сплавов - производство полуобработанных изделий из драгоценных металлов - покрытие неблагородных металлов серебром - покрытие неблагородных металлов или серебра золотом - покрытие золота, серебра или основных металлов платиной или металлами платиновой группы Этот класс также включает: - производство проволоки из данных металлов методом вытяжки - производство фольги из драгоценных металлов Этот класс исключает: - отливку металлов, не содержащих железа, см. 24.53, 24.54 - производство драгоценностей из драгоценных металлов, см. 32.12 @ru
scope note: Bu sınıf aşağıdakileri kapsamaktadır; - yassı haddelenmiş çelik ürünlerin silindirli mikserde kademeli olarak soğuk şekillendirilmesi veya presle katlanması ile elde edilen açık profil imalatı. - soğuk biçimlendirilmiş veya soğuk katlanmış oluklu levhaların ve sandviç panellerin imalatı. @tr
preferred label: Студено формуване или прегъване на продукти от стомана @bg
preferred label: Tváření ocelových profilů za studena @cs
preferred label: Koldbehandling @da
preferred label: Herstellung von Kaltprofilen @de
preferred label: Ψυχρή μορφοποίηση ή δίπλωση μορφοράβδων @el
preferred label: Producción de perfiles en frío por conformación con plegado @es
preferred label: Külmvormimine ja -painutamine @et
preferred label: Kylmämuovaus tai kylmätaitto @fi
preferred label: Profilage à froid par formage ou pliage @fr
preferred label: Hidegen hajlított acélidom gyártása
preferred label: Profilatura mediante formatura o piegatura a freddo @it
preferred label: Šaltasis formavimas ar lankstymas @lt
preferred label: Aukstā formēšana vai locīšana @lv
preferred label: Iffurmar jew tagħwiġ ta' taqsimiet bil-kiesaħ @mt
preferred label: Koudvervormen of koudfelsen @nl
preferred label: Kaldvalsing og pressing av profilerte plater og profiler @no
preferred label: Produkcja wyrobów formowanych na zimno @pl
preferred label: Perfilagem a frio @pt
preferred label: Producţia de profile obţinute la rece @ro
preferred label: Холодная формовка или фальцовка @ru
preferred label: Tvarovanie alebo skladanie za studena @sk
preferred label: Hladno oblikovanje profilov in pregibanje @sl
preferred label: Tillverkning av andra kallformade produkter av stål @sv
preferred label: Soğuk şekillendirme veya katlama @tr
broader: Manufacture of other products of first processing of steel

Cold drawing of wire
type: Concept
notation: 24.34
status: valid
status modified: 2013-10-18
accepted date: 2013-10-18
in scheme: Statistical Classification of Economic Activities in the European Community, Rev. 2 (2008)
scope note: - производство на стоманен тел, чрез студено изтегляне на валцдрат - изтегляне на стоманени пръти и профили - 24.31 - производство на изделия от тел - 25.93 @bg
scope note: Z: - výrobu drátu z ocelové tyče tažením za studena N: - výrobu tyčí a plných ocelových profilů tažením (24.31) - další zpracování a úpravu drátu (25.93) @cs
scope note: Diese Klasse umfasst: - Herstellung Stahldraht durch Kaltziehen Diese Klasse umfasst nicht: - Ziehen von Stangen und Vollprofilen aus Stahl (s. 24.31) - Herstellung von Verarbeitungserzeugnissen aus Draht (s. 25.93) @de
scope note: This class includes: - manufacture of drawn steel wire, by cold drawing of steel wire rod This class excludes: - drawing of bars and solid sections of steel, see 24.31 - manufacture of derived wire products, see 25.93 @en
scope note: Esta clase comprende: - la fabricación de alambre de acero mediante estirado en frío de varillas de acero Esta clase no comprende: - el estirado de barras y perfiles sólidos de acero (véase 24.31) - la fabricación de productos de alambre (véase 25.93). @es
scope note: Cette classe comprend: - la fabrication de fils d’acier par étirage à froid du fil machine Cette classe ne comprend pas: - l’étirage à froid de barres et de profilés de section pleine en acier, voir 24.31 - la fabrication d’articles dérivés en fils métalliques, voir 25.93 @fr
scope note: Ovaj razred uključuje: - proizvodnju vučenih čeličnih žica, hladnim vučenjem čeličnih šipk Ovaj razred isključuje: - vučenje šipki i krutih dijelova čelika, vidi 24.31 - proizvodnju izvučenih proizvoda od žice, vidi 25.93
scope note: Į šią klasę įeina: - plieninės temptosios vielos gamyba, šaltai tempiant plieninius vielos strypus Į šią klasę neįeina: - plieninių strypų ar ištisinio skerspjūvio profilių gamyba, žr. 24.31 - vielinių gaminių gamyba, žr. 25.93 @lt
scope note: Этот класс включает: - производство алюминия из глинозема/окиси алюминия - производство алюминия путем электролитического рафинирования из отходов алюминия и лома - производство сплавов алюминия - производство сырьевого алюминия Этот класс также включает: - производство проволоки из данных металлов методом вытяжки - производство окиси алюминия - производство фольги из алюминия - производство алюминиевой фольги из алюминия как первичного компонента Этот класс исключает: - отливку металлов, не содержащих железа, см. 24.53, 24.54 @ru
scope note: Bu sınıf aşağıdakileri kapsamaktadır; - çelik tel çubukların soğuk çekilmesi yöntemiyle çekilmiş çelik tel imalatı. Kapsam dışı olanlar; - barların ve dolu çelik profillerin çekilmesi, bkz. 24.31, - soğuk çekilmiş tellerden türetilmiş ürünlerin imalatı, bkz. 25.93. @tr
preferred label: Студено изтегляне на тел @bg
preferred label: Tažení ocelového drátu za studena @cs
preferred label: Fremstilling af tråd ved koldtrækning @da
preferred label: Herstellung von kaltgezogenem Draht @de
preferred label: Ψυχρή επεκτατική ολκή συρμάτων @el
preferred label: Trefilado en frío @es
preferred label: Traadi külmtõmbamine @et
preferred label: Teräslangan veto @fi
preferred label: Tréfilage à froid @fr
preferred label: Hidegen húzott acélhuzal gyártása
preferred label: Trafilatura a freddo @it
preferred label: Šaltasis vielos tempimas @lt
preferred label: Stiepļu vilkšana @lv
preferred label: Ġbid ta' wajer bil-kiesaħ @mt
preferred label: Koudtrekken van draad @nl
preferred label: Kaldtrekking av tråd @no
preferred label: Produkcja drutu @pl
preferred label: Trefilagem a frio @pt
preferred label: Trefilarea firelor la rece @ro
preferred label: Производство проволоки путем холодного вытягивания @ru
preferred label: Ťahanie drôtov za studena @sk
preferred label: Hladno vlečenje žice @sl
preferred label: Tillverkning av kalldragen ståltråd @sv
preferred label: Tellerin soğuk çekilmesi @tr
broader: Manufacture of other products of first processing of steel

Manufacture of basic precious and other non-ferrous metals
type: Concept
notation: 24.4
status: valid
status modified: 2013-10-18
accepted date: 2013-10-18
in scheme: Statistical Classification of Economic Activities in the European Community, Rev. 2 (2008)
scope note: Этот класс включает: - производство свинца, цинка и олова из руды - производство свинца, цинка и олова путем электролитического рафинирования отходов и лома свинца, цинка, олова - производство сплавов свинца, цинка и олова - производство сырьевой продукции (полуфабрикатов) из свинца, цинка и олова Этот класс также включает: - производство проволоки из данных металлов методом вытяжки - производство жестяной фольги Этот класс исключает: - отливку металлов, не содержащих железа, см. 24.53, 24.54 @ru
preferred label: Производство на основни благородни и други цветни метали @bg
preferred label: Výroba a hutní zpracování drahých a jiných neželezných kovů @cs
preferred label: Fremstilling af ædelmetaller og andre ikke-jernholdige metaller @da
preferred label: Erzeugung und erste Bearbeitung von NE-Metallen @de
preferred label: Παραγωγή βασικών πολύτιμων μετάλλων και άλλων μη σιδηρούχων μετάλλων @el
preferred label: Producción de metales preciosos y de otros metales no férreos @es
preferred label: Vääris- ja muude mitteraudmetallide tootmine @et
preferred label: Jalometallien ja muiden värimetallien valmistus @fi
preferred label: Production de métaux précieux et d'autres métaux non ferreux @fr
preferred label: Nem vas fém alapanyag gyártása
preferred label: Produzione di metalli di base preziosi e di altri non ferrosi @it
preferred label: Pagrindinių tauriųjų ir kitų spalvotųjų metalų gamyba @lt
preferred label: Cēlmetālu un citu krāsaino metālu ražošana @lv
preferred label: Manifattura ta'metalli prezzjużi bażiċi u metalli oħra mhux tal-ħadid bażiċi @mt
preferred label: Productie van edele metalen en van andere non-ferrometalen @nl
preferred label: Produksjon av ikke-jernholdige metaller @no
preferred label: Produkcja metali szlachetnych i pozostałych metali nieżelaznych @pl
preferred label: Obtenção e primeira transformação de metais preciosos e outros metais não ferrosos @pt
preferred label: Producţia metalelor preţioase şi a altor metale neferoase @ro
preferred label: Производство основных благородных и цветных металлов @ru
preferred label: Výroba drahých a ostatných neželezných kovov @sk
preferred label: Proizvodnja plemenitih in drugih neželeznih kovin @sl
preferred label: Framställning av andra metaller än järn @sv
preferred label: Değerli ana metaller ve diğer demir dışı metallerin imalatı @tr
broader: Manufacture of basic metals
narrower: Precious metals production
narrower: Aluminium production
narrower: Lead, zinc and tin production
narrower: Copper production
narrower: Other non-ferrous metal production
narrower: Processing of nuclear fuel

Precious metals production
type: Concept
notation: 24.41
status: valid
status modified: 2013-10-18
accepted date: 2013-10-18
in scheme: Statistical Classification of Economic Activities in the European Community, Rev. 2 (2008)
scope note: - производство на благородни метали: • производство и пречистване на недеформируеми и деформируеми благородни метали - сребро, злато, платина и други, от руди или скрап - производство на сплави на благородни метали - производство на полуготови продукти от благородни метали - производство на сребро, валцувано върху неблагородни метали - производство на злато, валцувано върху сребро или неблагородни метали - производство на платина и метали от групата на платината, валцувани върху злато, сребро или неблагородни метали - производство на тел от тези метали чрез изтегляне - производство на ламинати с фолио от благородни метали - леене на цветни метали - 24.53, 24.54 - производство на бижутерийни изделия от благородни метали - 32.12 @bg
scope note: Z: - výrobu drahých kovů: • výrobu a čištění kovů (dále zpracovávaných i nezpracovávaných) jako je zlato, stříbro, platina atd. z rudy nebo kovového odpadu - výrobu slitin drahých kovů - výrobu hutních předvýrobků z drahých kovů - plátování základních kovů stříbrem - plátování základních kovů nebo stříbra zlatem - plátování základních kovů, stříbra nebo zlata platinou a kovy ze skupiny platiny ZT: - výrobu taženého drátu z těchto kovů - výrobu laminovaných folií z drahých kovů N: - odlévání neželezných kovů (24.53, 24.54) - výrobu šperků z drahých kovů (32.12) @cs
scope note: Diese Klasse umfasst: - Herstellung von Edelmetallen: • Erzeugung der Edelmetalle: Gold, Silber, Platin usw. aus Erz oder Schrott - Herstellung von Edelmetalllegierungen - Herstellung von Edelmetallhalbzeug - Herstellung von Silberplattierungen auf unedlen Metallen - Herstellung von Goldplattierungen auf unedlen Metallen oder Silber - Herstellung von Platinplattierungen und Plattierungen mit Metallen der Platingruppe auf Gold, Silber oder unedlen Metallen Diese Klasse umfasst ferner: - Herstellung von gezogenem Draht aus diesen Metallen - Herstellung von laminierten Edelmetallfolien Diese Klasse umfasst nicht: - Gießen von NE-Metallen (s. 24.53, 24.54) - Herstellung von Schmuck aus Edelmetallen (s. 32.12) @de
scope note: This class includes: - production of basic precious metals: • production and refining of unwrought or wrought precious metals: gold, silver, platinum etc. from ore and scrap - production of precious metal alloys - production of precious metal semi-products - production of silver rolled onto base metals - production of gold rolled onto base metals or silver - production of platinum and platinum group metals rolled onto gold, silver or base metals This class also includes: - manufacture of wire of these metals by drawing - manufacture of precious metal foil laminates This class excludes: - casting of non-ferrous metals, see 24.53, 24.54 - manufacture of precious metal jewellery, see 32.12 @en
scope note: Esta clase comprende: - la producción de metales preciosos: • la producción y refinado de metales preciosos forjados o no: oro, plata, platino, etc. a partir de mineral o chatarra - la producción de aleaciones de metales preciosos - la producción de semielaborados de metales preciosos - la producción de chapados de plata sobre metales comunes - la producción de chapados de oro sobre metales comunes o plata - la producción de chapados de platino y de metales del grupo del platino sobre oro, plata o metales comunes Esta clase comprende también: - el trefilado de estos metales mediante estirado - la fabricación de laminados de metales preciosos Esta clase no comprende: - la fundición de metales no férreos (véase 24.53, 24.54) - la fabricación de joyas de metales preciosos (véase 32.12) @es
scope note: Cette classe comprend: - la production de métaux précieux: • la production et l’affinage des métaux précieux bruts ou ouvrés tels que or, argent, platine, etc., à partir de minerais ou de déchets - la production d’alliages de métaux précieux - la production de demi-produits en métaux précieux - la production de plaqués et doublés d’argent sur métaux communs - la production de plaqués et doublés d’or sur métaux communs ou sur argent - la production de plaqués et doublés de platine et de métaux du groupe du platine sur or, argent ou métaux communs Cette classe comprend également: - la fabrication de fils à partir de ces métaux par étirage - la fabrication de stratifiés métalliques à base de métaux précieux Cette classe ne comprend pas: - la fonderie de métaux non ferreux, voir 24.53 et 24.54 - la fabrication de bijoux en métaux précieux, voir 32.12 @fr
scope note: Ovaj razred uključuje: - proizvodnju plemenitih metala: • proizvodnju i rafiniranje neobrađenih plemenitih metala: zlata, srebra, platine itd. od kovina i otpada - proizvodnju legura od plemenitih metala - proizvodnju poluproizvoda od plemenitih metala - posrebrivanje običnih metala - pozlaćivanje običnih metala ili srebra - platiniranje zlata, srebra ili običnih metala Ovaj razred također uključuje: - proizvodnju žice od tih metala vučenjem - proizvodnju pločastih listića od plemenitih metala Ovaj razred isključuje: - lijevanje lakih i obojenih metala, vidi 24.53, 24.54 - proizvodnju nakita od plemenitih metala, vidi 32.12
scope note: Į šią klasę įeina: - pagrindinių tauriųjų metalų gamyba: • neapdorotų arba apdorotų tauriųjų metalų (aukso, sidabro, platinos ir kt.) gamyba ir rafinavimas iš rūdos ir metalo laužo - tauriųjų metalų lydinių gamyba - tauriųjų metalų pusgaminių gamyba - ant netauriųjų metalų užvalcuoto sidabro gamyba - ant netauriųjų metalų ar sidabro užvalcuoto aukso gamyba - ant aukso, sidabro ar netauriųjų metalų užvalcuotos platinos ar platinos grupės metalų gamyba Į šią klasę tai pat įeina: - šių metalų vielos gamyba tempimo būdu - tauriųjų metalų folijos lakštų gamyba Į šią klasę neįeina: - spalvotųjų metalų liejimas, žr. 24.53, 24.54 - tauriųjų metalų juvelyrinių dirbinių gamyba, žr. 32.12 @lt
scope note: Этот класс включает: - производство меди из руды - производство меди из отходов путем электролитического рафинирования из отходов меди и лома - производство сплавов меди - производство плавкой проволоки - производство сырьевой меди Этот класс также включает: - производство проволоки из данных металлов методом вытяжки Этот класс исключает: - отливку металлов, не содержащих железа, см. 24.53, 24.54 @ru
scope note: Bu sınıf aşağıdakileri kapsamaktadır; - değerli ana metallerin üretimi: • işlenmiş veya işlenmemiş değerli metallerin üretilmesi ve rafine edilmesi: cevher veya hurdadan altın, gümüş, platin vb., - değerli metal alaşımların üretimi, - yarı işlenmiş değerli metal üretimi, - ana metallerin gümüşle kaplanması, - ana metallerin veya gümüşün altınla kaplanması, - ana metallerin gümüşün veya altının platin veya platin grubuna ait metallerle kaplanması, Ayrıca bu sınıf aşağıdakileri de kapsamaktadır; - çekme yöntemiyle bu metallerden tel imalatı, - değerli metallerden folyo ve varak imalatı. Kapsam dışı olanlar; - demir dışı metallerin dökümü, bkz. 24.53, 24.54, - değerli metal mücevherat imalatı, bkz. 32.12. @tr
preferred label: Производство на благородни метали @bg
preferred label: Výroba a hutní zpracování drahých kovů @cs
preferred label: Fremstilling af ædelmetaller @da
preferred label: Erzeugung und erste Bearbeitung von Edelmetallen @de
preferred label: Παραγωγή πολύτιμων μετάλλων @el
preferred label: Producción de metales preciosos @es
preferred label: Väärismetallitootmine @et
preferred label: Jalometallien valmistus @fi
preferred label: Production de métaux précieux @fr
preferred label: Nemesfémgyártás
preferred label: Produzione di metalli preziosi @it
preferred label: Tauriųjų metalų gamyba @lt
preferred label: Cēlmetālu ražošana @lv
preferred label: Produzzjoni ta' metalli prezzjużi @mt
preferred label: Productie van edelmetalen @nl
preferred label: Produksjon av edelmetaller @no
preferred label: Produkcja metali szlachetnych @pl
preferred label: Obtenção e primeira transformação de metais preciosos @pt
preferred label: Producţia metalelor preţioase @ro
preferred label: Производство благородных (драгоценных) металлов @ru
preferred label: Výroba drahých kovov @sk
preferred label: Proizvodnja plemenitih kovin @sl
preferred label: Framställning av ädla metaller @sv
preferred label: Değerli metal üretimi @tr
broader: Manufacture of basic precious and other non-ferrous metals

Aluminium production
type: Concept
notation: 24.42
status: valid
status modified: 2013-10-18
accepted date: 2013-10-18
in scheme: Statistical Classification of Economic Activities in the European Community, Rev. 2 (2008)
scope note: - производство на алуминий от алуминиев оксид - производство на алуминий чрез електролитно пречистване на алуминиеви отпадъци и скрап - производство на алуминиеви сплави - производство на полуготови продукти от алуминий - производство на алуминиев тел чрез изтегляне - производство на алуминиев оксид - производство на алуминиево фолио за опаковане - производство на ламинати с алуминиево фолио, като алуминиевото фолио е първичен компонент (служи за основа) - леене на цветни метали - 24.53, 24.54 @bg
scope note: Z: - výrobu hliníku z oxidu hlinitého - výrobu hliníku z elektrolyticky čištěného hliníkového šrotu a odpadu - výrobu hliníkových slitin - výrobu hutních předvýrobků z hliníku ZT: - výrobu taženého drátu z hliníku - výrobu oxidu hlinitého (aluminy) - výrobu hliníkové balicí folie (alobalu) - výrobu laminovaných folií s převahou hliníku (hliníkové folie) N: - odlévání neželezných kovů (24.53, 24.54) @cs
scope note: Diese Klasse umfasst: - Erzeugung von Aluminium aus Aluminiumoxid (Tonerde) - Erzeugung von Aluminium und Aluminiumlegierungen durch elektrolytische Raffination von Reststoffen und Schrott - Herstellung von Aluminiumlegierungen - Herstellung von Aluminiumhalbzeug Diese Klasse umfasst ferner: - Herstellung von gezogenem Draht aus diesen Metallen - Erzeugung von Aluminiumoxid (Tonerde) - Herstellung von Aluminiumfolie - Herstellung von laminierten Aluminiumfolien mit Aluminium als Hauptbestandteil Diese Klasse umfasst nicht: - Gießen von NE-Metallen (s. 24.53, 24.54) @de
scope note: This class includes: - production of aluminium from alumina - production of aluminium from electrolytic refining of aluminium waste and scrap - production of aluminium alloys - semi-manufacturing of aluminium This class also includes: - manufacture of wire of these metals by drawing - production of aluminium oxide (alumina) - production of aluminium wrapping foil - manufacture of aluminium foil laminates made from aluminium foil as primary component This class excludes: - casting of non-ferrous metals, see 24.53, 24.54 @en
scope note: Esta clase comprende: - la producción de aluminio a partir de alúmina - la producción de aluminio mediante refinado electrolítico de los desechos y chatarra de aluminio - la producción de aleaciones de aluminio - la primera transformación del aluminio Esta clase comprende también: - el trefilado de estos metales mediante estirado - la producción de óxido de aluminio (alúmina) - la producción de papel de aluminio para envolver - la fabricación de laminados de aluminio a partir de papel de aluminio como componente primario Esta clase no comprende: - la fundición de metales no férreos (véase 24.53, 24.54) @es
scope note: Cette classe comprend également: - la fabrication de fils à partir de ces métaux par étirage - la production d’oxyde d’aluminium (alumine) - la production de feuilles d’emballage en aluminium - la fabrication de stratifiés métalliques à base d’aluminium si la feuille d’aluminium est le composant principal Cette classe ne comprend pas: - la fonderie de métaux non ferreux, voir 24.53 et 24.54 @fr
scope note: Ovaj razred uključuje: - proizvodnju aluminija od glinice - proizvodnju aluminija elektrolizom aluminijskih otpadaka i ostataka - proizvodnju aluminijskih legura - primarnu preradu aluminija Ovaj razred također uključuje: - proizvodnju žice od tih metala vučenjem - proizvodnju aluminijeva oksida (glinice) - proizvodnju aluminijskih folija za zamatanje - proizvodnju laminata od aluminijske folije u kojima je aluminijska folija glavni sastojak Ovaj razred isključuje: - lijevanje lakih i obojenih metala, vidi 24.53, 24.54
scope note: Į šią klasę įeina: - aliuminio gamyba iš aliuminio oksido - aliuminio gamyba elektrolitiniu būdu, rafinuojant aliuminio atliekas ir laužą - aliuminio lydinių gamyba - aliuminio pusgaminių gamyba Į šią klasę taip pat įeina: - vielos iš šių metalų gamyba tempimo būdu - aliuminio oksido (aliumino) gamyba - vyniojamosios aliuminio folijos gamyba - aliuminio folijos lakštų gamyba iš aliuminio folijos kaip pirminio komponento Į šią klasę neįeina: - spalvotųjų metalų liejimas, žr. 24.53, 24.54 @lt
scope note: Этот класс включает: - производство хрома, марганца, никеля и т.д. из руды или оксидов - производство хрома, марганца, никеля и т.д. из отходов путем электролитического рафинирования и очистки хрома, марганца, никеля и т.д. - производство сплавов из хрома, марганца, никеля и т.д. - производство сырьевой продукции из хрома, марганца, никеля и т.д. - производство парных деталей из никеля Этот класс также включает: - производство проволоки из данных металлов методом вытяжки Этот класс исключает: - отливку металлов, не содержащих железа, см. 24.53, 24.54 @ru
scope note: Bu sınıf aşağıdakileri kapsamaktadır; - alüminadan (alüminyum oksitten) alüminyum üretimi, - alüminyum döküntü ve hurdaların elektrolitik rafinesinden alüminyum üretimi, - alüminyum alaşımlarının üretimi, - yarı mamul alüminyum imalatı. Ayrıca bu sınıf aşağıdakileri de kapsamaktadır; - bu metallerden çekme yoluyla tel imalatı, - alüminyum oksit (alümin) üretimi, - alüminyum ambalaj folyosu üretimi - temel bileşiği alüminyum folyo olan alüminyum lamine folyo imalatı. Kapsam dışı olanlar; - demir dışı metallerin dökümü, bkz. 24.53, 24.54. @tr
preferred label: Производство на алуминий @bg
preferred label: Výroba a hutní zpracování hliníku @cs
preferred label: Fremstilling af aluminium @da
preferred label: Erzeugung und erste Bearbeitung von Aluminium @de
preferred label: Παραγωγή αλουμινίου (αργιλίου) @el
preferred label: Producción de aluminio @es
preferred label: Alumiiniumitootmine @et
preferred label: Alumiinin valmistus @fi
preferred label: Métallurgie de l'aluminium @fr
preferred label: Alumíniumgyártás
preferred label: Produzione di alluminio @it
preferred label: Aliuminio gamyba @lt
preferred label: Alumīnija ražošana @lv
preferred label: Produzzjoni ta' aluminju @mt
preferred label: Productie van aluminium @nl
preferred label: Produksjon av aluminium @no
preferred label: Produkcja aluminium @pl
preferred label: Obtenção e primeira transformação de alumínio @pt
preferred label: Metalurgia aluminiului @ro
preferred label: Производство алюминия @ru
preferred label: Výroba hliníka @sk
preferred label: Proizvodnja aluminija @sl
preferred label: Framställning av aluminium @sv
preferred label: Alüminyum üretilmesi @tr
broader: Manufacture of basic precious and other non-ferrous metals

Lead, zinc and tin production
type: Concept
notation: 24.43
status: valid
status modified: 2013-10-18
accepted date: 2013-10-18
in scheme: Statistical Classification of Economic Activities in the European Community, Rev. 2 (2008)
scope note: - производство на олово, цинк и калай от руди - производство на олово, цинк и калай чрез електролитно пречистване на оловни, цинкови и калаени отпадъци и скрап - производство на оловни, цинкови и калаени сплави - производство на полуготови продукти от олово, цинк и калай - производство на тел от тези метали чрез изтегляне - производство на калаено фолио - леене на цветни метали - 24.53, 24.54 @bg
scope note: Z: - výrobu olova, zinku a cínu z rud - výrobu olova, zinku a cínu z elektrolyticky čištěného olověného, zinkového a cínového odpadu a šrotu - výrobu slitin olova, zinku a cínu - výrobu hutních předvýrobků z olova, zinku a cínu ZT: - výrobu taženého drátu z těchto kovů - výrobu cínové folie N: - odlévání neželezných kovů (24.53, 24.54) @cs
scope note: Diese Klasse umfasst: - Erzeugung von Blei, Zink und Zinn aus Erzen - Erzeugung von Blei, Zink und Zinn durch elektrolytische Raffination von Reststoffen und Schrott - Herstellung von Blei-, Zink- und Zinnlegierungen - Herstellung von Halbzeug aus Blei, Zink und Zinn Diese Klasse umfasst ferner: - Herstellung von gezogenem Draht aus diesen Metallen - Herstellung von Zinnfolie Diese Klasse umfasst nicht: - Gießen von NE-Metallen (s. 24.53, 24.54) @de
scope note: This class includes: - production of lead, zinc and tin from ores - production of lead, zinc and tin from electrolytic refining of lead, zinc and tin waste and scrap - production of lead, zinc and tin alloys - semi-manufacturing of lead, zinc and tin This class also includes: - manufacture of wire of these metals by drawing - production of tin foil This class excludes: - casting of non-ferrous metals, see 24.53, 24.54 @en
scope note: Esta clase comprende: - la producción de cinc, plomo y estaño a partir de minerales - la producción de cinc, plomo y estaño mediante refinado electrolítico de los desechos y chatarra de cinc, plomo y estaño - la producción de aleaciones de cinc, plomo y estaño - la primera transformación del cinc, el plomo y el estaño Esta clase comprende también: - el trefilado de estos metales mediante estirado - la producción de hojalata Esta clase no comprende: - la fundición de metales no férreos (véase 24.53, 24.54) @es
scope note: Cette classe comprend: - la production de plomb, de zinc ou d’étain à partir de minerais - la production de plomb, de zinc ou d’étain par affinage électrolytique de déchets et de débris de plomb, de zinc ou d’étain - la production d’alliages de plomb, de zinc ou d’étain - la fabrication de demi-produits en plomb, en zinc ou en étain Cette classe comprend également: - la fabrication de fils à partir de ces métaux par étirage - la production de feuilles d’étain Cette classe ne comprend pas: - la fonderie de métaux non ferreux, voir 24.53 et 24.54 @fr
scope note: Ovaj razred uključuje: - proizvodnju olova, cinka i kositra od rude - proizvodnju olova, cinka i kositra elektrolizom otpadaka i ostataka od olova, cinka i kositra - proizvodnju olovih, cinkovih i kositrenih legura - primarnu preradu olova, cinka i kositra Ovaj razred također uključuje: - proizvodnju žica od tih metala vučenjem - proizvodnju kositrenih listova Ovaj razred isključuje: - lijevanje lakih i obojenih metala, vidi 24.53, 24.54
scope note: Į šią klasę įeina: - švino, cinko ir alavo gamyba iš rūdų - švino, cinko ir alavo gamyba elektrolitiniu būdu, rafinuojant švino, cinko ir alavo atliekas bei laužą - švino, cinko ir alavo lydinių gamyba - švino, cinko ir alavo pusgaminių gamyba Į šia klasę taip pat įeina: - vielos iš šių metalų gamyba tempimo būdu - alavo folijos gamyba Į šią klasę neįeina: - spalvotųjų metalų liejimas, žr. 24.53, 24.54 @lt
scope note: Этот класс включает: - производство урана из уранита или других урансодержащих руд - плавку и очищение урана @ru
scope note: Bu sınıf aşağıdakileri kapsamaktadır; - cevherlerden kurşun, çinko ve kalay üretimi, - kurşun, çinko ve kalay hurda ve döküntülerinin elektrolitik rafinesinden kurşun, çinko ve kalay üretimi, - kurşun, çinko ve kalay alaşımları üretimi, - yarı işlenmiş kurşun, çinko ve kalay imalatı. Ayrıca bu sınıf aşağıdakileri de kapsamaktadır; - bu metallerden çekme yoluyla tel imalatı, - kalay folyo üretimi. Kapsam dışı olanlar; - demir dışı metallerin dökümü, bkz. 24.53, 24.54. @tr
preferred label: Производство на олово, цинк, калай @bg
preferred label: Výroba a hutní zpracování olova, zinku a cínu @cs
preferred label: Fremstilling af bly, zink og tin @da
preferred label: Erzeugung und erste Bearbeitung von Blei, Zink und Zinn @de
preferred label: Παραγωγή μολύβδου, ψευδαργύρου και κασσιτέρου @el
preferred label: Producción de plomo, zinc y estaño @es
preferred label: Plii-, tsingi- ja tinatootmine @et
preferred label: Lyijyn, sinkin ja tinan valmistus @fi
preferred label: Métallurgie du plomb, du zinc ou de l'étain @fr
preferred label: Ólom, cink, ón gyártása
preferred label: Produzione di piombo, zinco e stagno @it
preferred label: Švino, cinko ir alavo gamyba @lt
preferred label: Svina, cinka un alvas ražošana @lv
preferred label: Produzzjoni ta' ċomb, żingu u landa @mt
preferred label: Productie van lood, zink en tin @nl
preferred label: Produksjon av bly, sink og tinn @no
preferred label: Produkcja ołowiu, cynku i cyny @pl
preferred label: Obtenção e primeira transformação de chumbo, zinco e estanho @pt
preferred label: Producţia plumbului, zincului şi cositorului @ro
preferred label: Производство свинца, цинка и олова @ru
preferred label: Výroba olova, zinku a cínu @sk
preferred label: Proizvodnja svinca, cinka in kositra @sl
preferred label: Framställning av bly, zink och tenn @sv
preferred label: Kurşun, çinko ve kalay üretimi @tr
broader: Manufacture of basic precious and other non-ferrous metals

Copper production
type: Concept
notation: 24.44
status: valid
status modified: 2013-10-18
accepted date: 2013-10-18
in scheme: Statistical Classification of Economic Activities in the European Community, Rev. 2 (2008)
scope note: - производство на мед от руди - производството на мед чрез електролитно пречистване на медни отпадъци и скрап - производство на медни сплави - производство на леснотопими медни ленти и тел (за бушони и предпазители) - производство на полуготови продукти от мед - производство на меден тел чрез изтегляне - леене на цветни метали - 24.53, 24.54 @bg
scope note: Z: - výrobu mědi z rud - výrobu mědi z elektrolyticky čištěného měděného šrotu a odpadu - výrobu měděných slitin - výrobu tavných drátů a pásků - výrobu hutních předvýrobků z mědi ZT: - výrobu taženého drátu z mědi N: - odlévání neželezných kovů (24.53, 24.54) @cs
scope note: Diese Klasse umfasst: - Erzeugung von Kupfer aus Erzen - Erzeugung von Kupfer durch elektrolytische Raffination von Reststoffen und Schrott - Herstellung von Kupferlegierungen - Herstellung von Schmelzdraht und Schmelzstreifen - Herstellung von Kupferhalbzeug Diese Klasse umfasst ferner: - Herstellung von gezogenem Draht aus diesen Metallen Diese Klasse umfasst nicht: - Gießen von NE-Metallen (s. 24.53, 24.54) @de
scope note: This class includes: - production of copper from ores - production of copper from electrolytic refining of copper waste and scrap - production of copper alloys - manufacture of fuse wire or strip - semi-manufacturing of copper This class also includes: - manufacture of wire of these metals by drawing This class excludes: - casting of non-ferrous metals, see 24.53, 24.54 @en
scope note: Esta clase comprende: - la producción de cobre a partir de minerales - la producción de cobre a partir del refinado electrolítico de los desechos y chatarra de cobre - la producción de aleaciones de cobre - la fabricación de hilo y lámina para fundir - la primera transformación del cobre Esta clase comprende también: - el trefilado de estos metales mediante estirado Esta clase no comprende: - la fundición de metales no férreos (véase 24.53, 24.54) @es
scope note: Cette classe comprend: - la production de cuivre à partir de minerai - la production de cuivre par affinage électrolytique de déchets et de débris de cuivre - la production d’alliages de cuivre - la fabrication de fils ou de lames fusibles - la fabrication de demi-produits en cuivre Cette classe comprend également: - la fabrication de fils à partir de ces métaux par étirage Cette classe ne comprend pas: - la fonderie de métaux non ferreux, voir 24.53 et 24.54 @fr
scope note: Ovaj razred uključuje: - proizvodnju bakra od rude - proizvodnju bakra elektrolizom otpadaka i ostataka od olova, cinka i kositra - proizvodnju bakrenih legura - proizvodnju žica, vrpca i traka za osigurače - primarnu preradu bakra Ovaj razred također uključuje: - proizvodnju žica od tih metala vučenjem Ovaj razred isključuje: - lijevanje lakih i obojenih metala, vidi 24.53, 24.54
scope note: Į šią klasę įeina: - vario gamyba iš rūdų - vario gamyba elektrolitiniu būdu, rafinuojant vario atliekas ir laužą - vario lydinių gamyba - lydžiosios vielos ar strypų gamyba - vario pusgaminių gamyba Į šią klasę taip pat įeina: - vielos iš šių metalų gamyba tempimo būdu Į šią klasę neįeina: - spalvotųjų metalų liejimas, žr. 24.53, 24.54 @lt
scope note: Данная группа включает производство полуобработанных и прочих изделий в процессе отливки. Этот класс исключает: - производство готовых литых продуктов, таких как: • котлы и радиаторы, см. 25.21 • бытовых литых изделий, см. 25.99 @ru
scope note: Bu sınıf aşağıdakileri kapsamaktadır; - cevherlerden bakır üretimi, - bakır hurda ve döküntülerinin elektrolitik rafinesinden bakır üretilmesi, - bakır alaşımları üretimi, - sigorta teli veya şerit imalatı, - yarı mamul bakır imalatı. Ayrıca bu sınıf aşağıdakileri de kapsamaktadır; - bu metallerden çekme yoluyla tel imalatı. Kapsam dışı olanlar; - demir dışı metallerin dökümü, bkz. 24.53, 24.54. @tr
preferred label: Производство на мед @bg
preferred label: Výroba a hutní zpracování mědi @cs
preferred label: Fremstilling af kobber @da
preferred label: Erzeugung und erste Bearbeitung von Kupfer @de
preferred label: Παραγωγή χαλκού @el
preferred label: Producción de cobre @es
preferred label: Vasetootmine @et
preferred label: Kuparin valmistus @fi
preferred label: Métallurgie du cuivre @fr
preferred label: Rézgyártás
preferred label: Produzione di rame @it
preferred label: Vario gamyba @lt
preferred label: Vara ražošana @lv
preferred label: Produzzjoni ta' ram @mt
preferred label: Productie van koper @nl
preferred label: Produksjon av kobber @no
preferred label: Produkcja miedzi @pl
preferred label: Obtenção e primeira transformação de cobre @pt
preferred label: Metalurgia cuprului @ro
preferred label: Производство меди @ru
preferred label: Výroba medi @sk
preferred label: Proizvodnja bakra @sl
preferred label: Framställning av koppar @sv
preferred label: Bakır üretilmesi @tr
broader: Manufacture of basic precious and other non-ferrous metals

Other non-ferrous metal production
type: Concept
notation: 24.45
status: valid
status modified: 2013-10-18
accepted date: 2013-10-18
in scheme: Statistical Classification of Economic Activities in the European Community, Rev. 2 (2008)
scope note: - производство на хром, манган, никел и други цветни метали от руди или оксиди - производство на хром, манган, никел и други цветни метали чрез електролитно и алуминотермично пречистване на отпадъци и скрап от тези метали - производство на сплави на тези метали - производство на полуготови продукти oт тези метали - производство на никелов камък - производство на тел от тези метали чрез изтегляне - леене на цветни метали - 24.53, 24.54 @bg
scope note: Z: - výrobu chromu, manganu, niklu atd. z rud nebo oxidů - výrobu chromu, manganu, niklu atd. z elektrolyticky a aluminotermicky čištěného odpadu a šrotu - výrobu chromových, manganových, niklových a jiných slitin - výrobu hutních předvýrobků z chromu, manganu, niklu atd. - výrobu niklových kamínků (lechů) ZT: - výrobu taženého drátu z těchto kovů N: - odlévání neželezných kovů (24.53, 24.54) @cs
scope note: Diese Klasse umfasst: - Erzeugung von Chrom, Mangan, Nickel usw. aus Erzen oder Oxiden - Erzeugung von Chrom, Mangan, Nickel usw. durch elektrolytische und aluminothermische Raffination von Reststoffen und Schrott - Herstellung von Chrom-, Mangan-, Nickel- und anderen Legierungen - Herstellung von Halbzeug aus Chrom, Mangan, Nickel usw. - Herstellung von Nickelmatte Diese Klasse umfasst ferner: - Herstellung von gezogenem Draht aus diesen Metallen Diese Klasse umfasst nicht: - Gießen von NE-Metallen (s. 24.53, 24.54) @de
scope note: This class includes: - production of chrome, manganese, nickel etc. from ores or oxides - production of chrome, manganese, nickel etc. from electrolytic and aluminothermic refining of chrome, manganese, nickel etc., waste and scrap - production of alloys of chrome, manganese, nickel etc. - semi-manufacturing of chrome, manganese, nickel etc. - production of mattes of nickel This class also includes: - manufacture of wire of these metals by drawing This class excludes: - casting of non-ferrous metals, see 24.53, 24.54 @en
scope note: Esta clase comprende: - la producción de cromo, manganeso, níquel, etc., a partir de minerales u óxidos - la producción de cromo, manganeso, níquel, etc., a partir del refinado electrolítico y aluminotérmico de los desechos y chatarras de estos metales - la producción de aleaciones de cromo, manganeso, níquel, etc. - la primera transformación del cromo, el manganeso, el níquel, etc. - la producción de matas de níquel Esta clase comprende también: - el trefilado de estos metales mediante estirado Esta clase no comprende: - la fundición de metales no férreos (véase 24.53, 24.54) @es
scope note: Cette classe comprend: - la production de chrome, de manganèse, de nickel, etc., à partir de minerais ou d’oxydes - la production de chrome, de manganèse, de nickel, etc., par affinage électrolytique et aluminothermique de déchets et de débris de chrome, de manganèse, de nickel, etc. - la production d’alliages de chrome, de manganèse, de nickel, etc. - la fabrication de demi-produits en chrome, en manganèse, en nickel, etc. - la production de mattes de nickel Cette classe comprend également: - la fabrication de fils à partir de ces métaux par étirage Cette classe ne comprend pas: - la fonderie de métaux non ferreux, voir 24.53 et 24.54 @fr
scope note: Ovaj razred uključuje: - proizvodnju kroma, mangana, nikla itd. od ruda ili oksida - proizvodnju kroma, mangana, nikla itd. elektrolizom i alumotermijskim rafiniranjem otpadaka i ostataka od kroma, mangana, nikla itd. - proizvodnju legura od kroma, mangana, nikla itd. - primarnu preradu kroma, mangana, nikla itd. - proizvodnju niklova kamenca Ovaj razred također uključuje: - proizvodnju žice od tih metala vučenjem Ovaj razred isključuje: - lijevanje lakih i obojenih metala, vidi 24.53, 24.54
scope note: Į šią klasę įeina: - chromo, mangano, nikelio ir kt. gamyba iš rūdų ar oksidų - chromo, mangano, nikelio ir kt. gamyba elektrolitiniu ir aliuminoterminiu būdu, rafinuojant chromo, mangano, nikelio ir kt. atliekas ir laužą - chromo, mangano, nikelio ir kt. lydinių gamyba - chromo, mangano, nikelio ir kt. pusgaminių gamyba - nikelio šteino gamyb Į šią klasę įeina: - vielos iš šių metalų gamyba tempimo būdu Į šią klasę neįeina: - spalvotųjų metalų liejimas, žr. 24.53, 24.54 @lt
scope note: Данный класс включает все виды деятельности чугунолитейного производства. Этот класс включает: - отливку полуобработанных железных изделий - отливку изделий из серого чугуна - отливку сфероидальных изделий из серого чугуна - отливку изделий из ковкого чугуна - производство труб, полых профилей и гарнитуры из ковкого чугуна @ru
scope note: Bu sınıf aşağıdakileri kapsamaktadır; - maden cevherlerinden veya oksitlerden krom, manganez, nikel vb. üretimi, - krom, manganez, nikel vb. ürünlerin hurda ve döküntülerinin elektrolitik ve alümino termik rafinesinden krom, manganez, nikel vb. üretimi, - krom, manganez, nikel vb. maden alaşımlarının imalatı, - yarı-mamul krom, manganez, nikel vb. ürünlerin imalatı, - nikel matları üretimi. Ayrıca bu sınıf aşağıdakileri de kapsamaktadır; - bu metallerden çekme yoluyla tel imalatı. Kapsam dışı olanlar; - demir dışı metallerin dökümü, bkz. 24.53, 24.54. @tr
preferred label: Производство на други цветни метали @bg
preferred label: Výroba a hutní zpracování ostatních neželezných kovů @cs
preferred label: Anden fremstilling af ikke-jernholdige metaller @da
preferred label: Erzeugung und erste Bearbeitung von sonstigen NE-Metallen @de
preferred label: Παραγωγή άλλων μη σιδηρούχων μετάλλων @el
preferred label: Producción de otros metales no férreos @es
preferred label: Muude mitteraudmetallide tootmine @et
preferred label: Muiden värimetallien valmistus @fi
preferred label: Métallurgie des autres métaux non ferreux @fr
preferred label: Egyéb nem vas fém gyártása
preferred label: Produzione di altri metalli non ferrosi @it
preferred label: Kitų spalvotųjų metalų gamyba @lt
preferred label: Citu krāsaino metālu ražošana @lv
preferred label: Produzzjoni ta' metall ieħor mhux tal-ħadid @mt
preferred label: Productie van andere non-ferrometalen @nl
preferred label: Produksjon av ikke-jernholdige metaller ellers @no
preferred label: Produkcja pozostałych metali nieżelaznych @pl
preferred label: Obtenção e primeira transformação de metais não ferrosos, n.e. @pt
preferred label: Producţia altor metale neferoase @ro
preferred label: Производство прочих цветных металлов @ru
preferred label: Výroba ostatných neželezných kovov @sk
preferred label: Proizvodnja drugih neželeznih kovin @sl
preferred label: Framställning av andra metaller @sv
preferred label: Demir dışı diğer metallerin üretimi @tr
broader: Manufacture of basic precious and other non-ferrous metals

Processing of nuclear fuel
type: Concept
notation: 24.46
status: valid
status modified: 2013-10-18
accepted date: 2013-10-18
in scheme: Statistical Classification of Economic Activities in the European Community, Rev. 2 (2008)
scope note: - производство на уран от уранинит или от други руди - топене и рафиниране на уран @bg
scope note: Z: - výrobu uranu ze smolince nebo jiných rud - tavení a čištění uranu @cs
scope note: Diese Klasse umfasst: - Herstellung von metallischem Uran aus Pechblende oder anderen Erzen - Schmelzen und Raffinieren von Uran @de
scope note: This class includes: - production of uranium metal from pitchblende or other ores - smelting and refining of uranium @en
scope note: Esta clase comprende : - la fabricación de metal de uranio a partir de pechblenda u otros minerales - la fundición y el refinado de uranio @es
scope note: Cette classe comprend: - la production d’uranium métal à partir de la pechblende ou d’autres minerais - la fonte et le raffinage de l’uranium @fr
scope note: Ovaj razred uključuje: - proizvodnju metala urana iz uranova smolinca ili drugih ruda - taljenje i rafiniranje urana
scope note: Į šią klasę įeina: - metalinio urano gamyba iš uranito arba iš kitų rūdų - urano lydymas ir rafinavimas @lt
scope note: Этот класс включает виды деятельности сталелитейного завода. Этот класс включает: - отливку полуобработанных стальных изделий - отливку изделий из стали - производство бесшовных труб из стали, отлитых с помощью центробежной силы - производство труб и гарнитуры из литой стали @ru
scope note: Bu sınıf aşağıdakileri kapsamaktadır; - uranyum ve radyumlu maden cevherlerinden veya diğer cevherlerden metalik uranyum üretimi, - uranyumun ergitilmesi ve rafine edilmesi. @tr
preferred label: Преработка на ядрено гориво @bg
preferred label: Zpracování jaderného paliva @cs
preferred label: Oparbejdning af nukleart brændsel @da
preferred label: Aufbereitung von Kernbrennstoffen @de
preferred label: Επεξεργασία πυρηνικών καυσίμων @el
preferred label: Procesamiento de combustibles nucleares @es
preferred label: Tuumkütuse töötlemine @et
preferred label: Ydinpolttoaineen valmistus @fi
preferred label: Élaboration et transformation de matières nucléaires @fr
preferred label: Nukleáris fűtőanyag gyártása
preferred label: Trattamento dei combustibili nucleari @it
preferred label: Branduolinio kuro perdirbimas @lt
preferred label: Kodoldegvielas ražošana @lv
preferred label: Ipproċessar ta' fjuwil nukleari @mt
preferred label: Bewerking van splijt- en kweekstoffen @nl
preferred label: Produksjon av kjernebrensel @no
preferred label: Wytwarzanie paliw jądrowych @pl
preferred label: Tratamento de combustível nuclear @pt
preferred label: Prelucrarea combustibililor nucleari @ro
preferred label: Переработка ядерного топлива @ru
preferred label: Výroba jadrového paliva @sk
preferred label: Proizvodnja jedrskega goriva @sl
preferred label: Tillverkning av kärnbränsle @sv
preferred label: Nükleer yakıtların işlenmesi @tr
broader: Manufacture of basic precious and other non-ferrous metals

Casting of metals
type: Concept
notation: 24.5
status: valid
status modified: 2013-10-18
accepted date: 2013-10-18
in scheme: Statistical Classification of Economic Activities in the European Community, Rev. 2 (2008)
scope note: Тази група включва производство на лети полуготови продукти и различни отливки. - производство на готови лети продукти: • котли за централно отопление и радиатори с неелектрическо загряване - 25.21 • лети домакински изделия - 25.99 @bg
scope note: Tato skupina zahrnuje výrobu předvýrobků a různých odlitků odléváním. Tato skupina nezahrnuje: - výrobu hotových odlitků jako: • topných kotlů a topných těles (radiátorů) (25.21) • odlitků pro použití převážně v domácnosti (25.99) @cs
scope note: Diese Gruppe umfasst die Herstellung von Halbzeug und verschiedenen Gussstücken mit einem Gussverfahren. Diese Gruppe umfasst nicht: - die Herstellung von fertig gestellten Erzeugnissen wie: • Heizkessel und Heizkörper (s. 25.21) • gegossene Haushaltsartikel (s. 25.99) @de
scope note: This group includes the manufacture of semi-finished products and various castings by a casting process. This group excludes: - manufacture of finished cast products such as: • boilers and radiators, see 25.21 • cast household items, see 25.99 @en
scope note: Este grupo comprende la fabricación de productos semielaborados y fundiciones diversas mediante procesos de fundición. Este grupo no comprende: - la fabricación de productos de fundición acabados, como: • calderas y radiadores (véase 25.21) • artículos de fundición para el hogar (véase 25.99) @es
scope note: Ce groupe comprend la fabrication de pièces ou de demi-produits divers par un procédé de coulée. Ce groupe ne comprend pas: - la fonderie de produits finis, tels que: • radiateurs et chaudières, voir 25.21 • articles ménagers en fonte, voir 25.99 @fr
scope note: Ova skupina uključuje proizvodnju polugotovih proizvoda i raznih odljevaka dobivenih procesom taljenja. Ova skupina isključuje: - proizvodnju gotovih oblikovanih proizvoda kao što su: • kotlovi i radijatori, vidi 25.21 • lijevani predmeti za kućanstvo, vidi 25.99
scope note: Į šią grupę įeina pusgaminių ir įvairių liejinių gamyba liejimo būdu. Į šią grupę neįeina: - gamyba gatavų lietinių gaminių, tokių kaip: • katilai ir radiatoriai, žr. 25.21 • namų ūkio lietiniai dirbiniai, žr. 25.99 @lt
scope note: Этот класс включает: - отливку полуобработанных изделий из алюминия, магния, титана, цинка и т.д. - отливку изделий из легких металлов @ru
scope note: Bu grup, yarı işlenmiş ürünlerin ve çeşitli döküm mamullerinin dökümle imalatını kapsamaktadır. Kapsam dışı olanlar; - aşağıdakiler gibi nihai döküm ürünlerin imalatı: • kazanlar (boyler) ve radyatörler, bkz. 25.21, • dökümden ev eşyaları , bkz. 25.99. @tr
preferred label: Леене на метали @bg
preferred label: Slévárenství @cs
preferred label: Støbning af metalprodukter @da
preferred label: Gießereien @de
preferred label: Χύτευση μετάλλων @el
preferred label: Fundición de metales @es
preferred label: Metallivalu @et
preferred label: Metallien valu @fi
preferred label: Fonderie @fr
preferred label: Fémöntés
preferred label: Attività di fonderie @it
preferred label: Metalų liejinių gamyba @lt
preferred label: Metālu liešana @lv
preferred label: Tidwib ta' metalli @mt
preferred label: Gieten van metalen @nl
preferred label: Støping av metaller @no
preferred label: Odlewnictwo metali @pl
preferred label: Fundição de metais ferrosos e não ferrosos @pt
preferred label: Turnarea metalelor @ro
preferred label: Литье металлов @ru
preferred label: Odlievanie kovov @sk
preferred label: Livarstvo @sl
preferred label: Gjutning av metall @sv
preferred label: Metal döküm sanayii @tr
broader: Manufacture of basic metals
narrower: Casting of iron
narrower: Casting of steel
narrower: Casting of light metals
narrower: Casting of other non-ferrous metals

Casting of iron
type: Concept
notation: 24.51
status: valid
status modified: 2013-10-18
accepted date: 2013-10-18
in scheme: Statistical Classification of Economic Activities in the European Community, Rev. 2 (2008)
scope note: - леене на полуготови продукти от чугун - леене на отливки от сив (нековък) чугун - леене на отливки от сферографитен чугун - леене на отливки от ковък чугун - производство на тръби, кухи профили и фитинги, от чугун @bg
scope note: Tato třída zahrnuje činnosti sléváren železa. Z: - odlévání železných předvýrobků - odlévání odlitků ze šedých litin - odlévání surového železa s lupínkovým nebo kuličkovým grafitem - odlévání temperované (kujné) litiny - výrobu trub, trubek, dutých profilů a tvarovek (fitinků) z litiny železa @cs
scope note: Diese Klasse umfasst die Tätigkeiten von Eisengießereien. Diese Klasse umfasst: - Guss von Werkstücken aus Eisen - Guss von Produkten aus Grauguss - Guss von Produkten aus Eisenguss mit Kugelgrafit - Guss von Produkten aus Temperguss - Herstellung von Rohren und Hohlprofilen sowie von Rohrform-, Rohrverschluss- und Rohrverbindungsstücken aus Gusseisen @de
scope note: This class includes activities of iron foundries. This class includes: - casting of semi-finished iron products - casting of grey iron castings - casting of spheroidal graphite iron castings - casting of malleable cast-iron products - manufacture of tubes, pipes and hollow profiles and of tube or pipe fittings of cast-iron @en
scope note: Esta clase comprende las actividades de las fundiciones de hierro. Esta clase comprende: - la fundición de productos semielaborados de hierro - la fundición de piezas de moldeo de hierro - la fundición de piezas de moldeo esferoidales de grafito - la fundición de productos maleables de hierro fundido - la fabricación de tubos, tuberías y perfiles huecos, y de accesorios para tubos y tuberías de hierro fundido @es
scope note: Cette classe comprend les activités des fonderies de fonte. Cette classe comprend: - la fonderie de demi-produits en fonte - la fonderie de pièces en fonte grise - la fonderie de pièces en fonte à graphite sphéroïdal - la fonderie de produits en fonte malléable - la fabrication de tubes, tuyaux, profilés creux et accessoires correspondants en fonte @fr
scope note: Ovaj razred uključuje djelatnosti ljevaonica željeza. Ovaj razred uključuje: - lijevanje polugotovih proizvoda od željeza - lijevanje odljevaka od sivoga lijeva - lijevanje odljevaka od nodularnoga lijeva s kuglastim ili nodularnim grafitom - lijevanje odljevaka od temperiranoga (kovkastog) lijeva - proizvodnju cijevi i šupljih profila te pribora od lijevanog željeza
scope note: Į šią klasę įeina geležies liejyklų veikla. Į šią klasę įeina: - geležies pusgaminių liejimas - liejinių gamyba iš pilkojo ketaus - liejinių gamyba iš stipriojo ketaus - liejinių gamyba iš kaliojo ketaus - vamzdžių, vamzdelių ir tuščiavidurių profilių gamyba ir vamzdžių ar vamzdelių jungiamųjų detalių gamyba iš ketaus @lt
scope note: Этот класс включает: - отливку изделий из тяжелых металлов - отливку изделий из ценных металлов - отливку металлов, не содержащих железа, под давлением @ru
scope note: Bu sınıf demir dökümhanelerinin faaliyetlerini kapsamaktadır. Bu sınıf aşağıdakileri kapsamaktadır; - yarı mamul demir ürünlerin dökümü, - gri demir dökümü, - küresel grafit demir dökümü, - dövülebilir dökme demir ürünleri dökümü, - tüpler, borular ve içi bos profiller ile dökme demirden tüp ve borular ile bunlara ait bağlantı parçalarının imalatı. @tr
preferred label: Леене на чугун @bg
preferred label: Odlévání železa @cs
preferred label: Støbning af jernprodukter @da
preferred label: Eisengießereien @de
preferred label: Χύτευση σιδήρου @el
preferred label: Fundición de hierro @es
preferred label: Malmivalu @et
preferred label: Raudan valu @fi
preferred label: Fonderie de fonte @fr
preferred label: Vasöntés
preferred label: Fusione di ghisa @it
preferred label: Geležies liejinių gamyba @lt
preferred label: Čuguna liešana @lv
preferred label: Tidwib ta' ħadid @mt
preferred label: Gieten van ijzer @nl
preferred label: Støping av jern @no
preferred label: Odlewnictwo żeliwa @pl
preferred label: Fundição de ferro fundido @pt
preferred label: Turnarea fontei @ro
preferred label: Литье чугуна @ru
preferred label: Odlievanie železa @sk
preferred label: Litje železa @sl
preferred label: Gjutning av järn @sv
preferred label: Demir döküm @tr
broader: Casting of metals

Casting of steel
type: Concept
notation: 24.52
status: valid
status modified: 2013-10-18
accepted date: 2013-10-18
in scheme: Statistical Classification of Economic Activities in the European Community, Rev. 2 (2008)
scope note: Този клас включва дейността на стоманолеярните. - леене на полуготови продукти от стомана - леене на отливки от стомана - производство на безшевни тръби от стомана, получени чрез центробежно леене - производство на фитинги от стомана за отливки @bg
scope note: Tato třída zahrnuje činnosti sléváren oceli. Z: - odlévání ocelových předvýrobků - odlévání odlitků z oceli - výrobu bezešvých ocelových trubek odstředivým odléváním - výrobu tvarovek (fitinků) z litiny oceli @cs
scope note: Diese Klasse umfasst die Tätigkeiten von Stahlgießereien. Diese Klasse umfasst: - Guss von Halbzeug aus Stahl - Guss von Werkstücken aus Stahl - Herstellung von nahtlosen Stahlrohren im Schleudergussverfahren - Herstellung von Rohrform-, Rohrverschluss- und Rohrverbindungsstücken aus Gussstahl @de
scope note: This class includes activities of steel foundries. This class includes: - casting of semi-finished steel products - casting of steel castings - manufacture of seamless tubes and pipes of steel by centrifugal casting - manufacture of tube or pipe fittings of cast-steel @en
scope note: Esta clase comprende las actividades de las fundiciones de acero. Esta clase comprende: - la fundición de productos semielaborados de acero - la fundición de piezas de moldeo de acero - la fabricación de tubos y tuberías sin soldadura de acero mediante fundición centrífuga - la fabricación de accesorios para tubos y tuberías de acero fundido @es
scope note: Cette classe comprend les activités des fonderies d’acier. Cette classe comprend: - la fonderie de demi-produits en acier - la fonderie de pièces en acier - la fabrication de tubes et tuyaux en acier sans soudure coulés par centrifugation - la fabrication d’accessoires de tuyauterie en fonte d’acier @fr
scope note: Ovaj razred uključuje djelatnosti ljevaonica čelika. Ovaj razred uključuje: - lijevanje polugotovih proizvoda od čelika - lijevanje odljevaka od čelika - proizvodnju bešavnih cijevi centrifugalnim lijevanjem čelika - proizvodnju cijevi i pribora od lijevanog željeza
scope note: Į šią klasę įeina plieno liejyklų veikla. Į šią klasę įeina: - plieno pusgaminių liejimas - plieno liejinių gamyba - plieninių besiūlių vamzdžių ir vamzdelių gamyba išcentriškojo liejimo būdu - vamzdžių ar vamzdelių jungiamųjų detalių gamyba iš plieno @lt
scope note: Данный раздел включает производство изделий из «чистых металлов - без примесей» (таких как, запасные части, контейнеры и устройства), обычно стационарных, таких как радиоприборы, передающие устройства, как описано в разделах 26-30, которые включают производство сплавов указанных металлов (иногда с прочими материалами) и более сложных соединений, исключительно для электрических, электронных или оптических приборов. Производство оружия и боеприпасов также включено в данный раздел. Этот раздел исключает: - специализированный ремонт и технический уход и содержание, см. 33.1 - специализированную установку выпущенных изделий, включенных в данный раздел и используемых в строительстве, таких как отопительные котлы центрального отопления, см. 43.22 @ru
scope note: Bu sınıf çelik dökümhanelerinin faaliyetlerini kapsamaktadır. Bu sınıf aşağıdakileri kapsamaktadır; - yarı mamul çelik ürünlerin dökümü, - dökme çelik dökümü, - dikişsiz çelik boru ve boru bağlantılarının santrifüjlü dökme yöntemi ile üretimi. - dökme çelik tüp veya boru bağlantılarının imalatı. @tr
preferred label: Леене на стомана @bg
preferred label: Odlévání oceli @cs
preferred label: Støbning af stålprodukter @da
preferred label: Stahlgießereien @de
preferred label: Χύτευση χάλυβα @el
preferred label: Fundición de acero @es
preferred label: Terasevalu @et
preferred label: Teräksen valu @fi
preferred label: Fonderie d'acier @fr
preferred label: Acélöntés
preferred label: Fusione di acciaio @it
preferred label: Plieno liejinių gamyba @lt
preferred label: Tērauda liešana @lv
preferred label: Tidwib ta' azzar @mt
preferred label: Gieten van staal @nl
preferred label: Støping av stål @no
preferred label: Odlewnictwo staliwa @pl
preferred label: Fundição de aço @pt
preferred label: Turnarea oţelului @ro
preferred label: Литье стали @ru
preferred label: Odlievanie ocele @sk
preferred label: Litje jekla @sl
preferred label: Gjutning av stål @sv
preferred label: Çelik dökümü @tr
broader: Casting of metals

Casting of light metals
type: Concept
notation: 24.53
status: valid
status modified: 2013-10-18
accepted date: 2013-10-18
in scheme: Statistical Classification of Economic Activities in the European Community, Rev. 2 (2008)
scope note: - леене на полуготови продукти от алуминий, магнезий, титан, цинк и други - леене на отливки от леки метали @bg
scope note: Z: - odlévání předvýrobků z hliníku, hořčíku, titanu, zinku atd. - odlévání odlitků z lehkých kovů @cs
scope note: Diese Klasse umfasst: - Guss von Halbzeug aus Aluminium, Magnesium, Titan, Zink usw. - Guss von Werkstücken aus Leichmetallen @de
scope note: This class includes: - casting of semi-finished products of aluminium, magnesium, titanium, zinc etc. - casting of light metal castings @en
scope note: Esta clase comprende: - la fundición de productos semielaborados de aluminio, magnesio, titanio, cinc, etc. - la fundición de piezas de moldeo de metales ligeros @es
scope note: Cette classe comprend: - la fonderie de demi-produits en aluminium, magnésium, titane, zinc, etc. - la fonderie de pièces en métaux légers @fr
scope note: Ovaj razred uključuje: - lijevanje polugotovih proizvoda od aluminija, magnezija, titana, cinka itd. - lijevanje odljevaka od lakih metala
scope note: Į šią klasę įeina: - aliuminio, magnio, titano, cinko ir kt. pusgaminių liejimas - lengvųjų metalų liejinių gamyba @lt
scope note: Данная группа включает производство строительных металлических изделий (таких как, металлические строительные конструкции). @ru
scope note: Bu sınıf aşağıdakileri kapsamaktadır; - alüminyum, magnezyum, titanyum, çinko v.s.`den yarı mamul ürünlerin dökümü, - dökme hafif metallerin dökümü. @tr
preferred label: Леене на леки метали @bg
preferred label: Odlévání lehkých kovů @cs
preferred label: Støbning af letmetalprodukter @da
preferred label: Leichtmetallgießereien @de
preferred label: Χύτευση ελαφρών μετάλλων @el
preferred label: Fundición de metales ligeros @es
preferred label: Kergmetallide valu @et
preferred label: Kevytmetallien valu @fi
preferred label: Fonderie de métaux légers @fr
preferred label: Könnyűfémöntés
preferred label: Fusione di metalli leggeri @it
preferred label: Lengvųjų metalų liejinių gamyba @lt
preferred label: Vieglo metālu liešana @lv
preferred label: Tidwib ta' metalli ħfief @mt
preferred label: Gieten van lichte metalen @nl
preferred label: Støping av lettmetaller @no
preferred label: Odlewnictwo metali lekkich @pl
preferred label: Fundição de metais leves @pt
preferred label: Turnarea metalelor neferoase uşoare @ro
preferred label: Литье легких металлов @ru
preferred label: Odlievanie ľahkých kovov @sk
preferred label: Litje lahkih kovin @sl
preferred label: Gjutning av lättmetall @sv
preferred label: Hafif metallerin dökümü @tr
broader: Casting of metals

Casting of other non-ferrous metals
type: Concept
notation: 24.54
status: valid
status modified: 2013-10-18
accepted date: 2013-10-18
in scheme: Statistical Classification of Economic Activities in the European Community, Rev. 2 (2008)
scope note: - леене на отливки от тежки метали - леене на отливки от благородни метали - кокилно леене на отливки от цветни метали @bg
scope note: Z: - odlévání odlitků z barevných kovů - odlévání odlitků z drahých kovů - výrobu odlitků z neželezných kovů litím pod tlakem @cs
scope note: Diese Klasse umfasst: - Guss von Werkstücken aus Buntmetall - Guss von Werkstücken aus Edelmetall - Druckguss von Werkstücken aus NE-Metallen @de
scope note: This class includes: - casting of heavy metal castings - casting of precious metal castings - die-casting of non-ferrous metal castings @en
scope note: Esta clase comprende: - la fundición de piezas de moldeo metálicas pesadas - la fundición de piezas de moldeo de metales preciosos - la fundición a presión de piezas de moldeo de metales no férreos @es
scope note: Cette classe comprend: - la fonderie de pièces en métaux lourds - la fonderie de pièces en métaux précieux - le moulage sous pression d’autres métaux non ferreux @fr
scope note: Ovaj razred uključuje: - lijevanje odljevaka od teških metala - lijevanje odljevaka od plemenitih metala - lijevanje matrica (unikata) od odljevaka obojenih metala
scope note: Į šią klasę įeina: - sunkiųjų metalų liejinių gamyba - tauriųjų metalų liejinių gamyba - spalvotųjų metalų liejinių liejimas slėgimo būdu @lt
scope note: Этот класс включает: - производство металлической рамки или строительных каркасов и конструкций (вышек, опор, балок, мостов и т.д.) - производство промышленных металлических конструкций (конструкций для доменных печей, подъема и установки оборудования и т.д.) - производство изготовленных заводским способом металлических строительных конструкций: • временных жилых строений, выставочных секций и т.д. Этот класс исключает: - производство деталей морских или энергетических котлов, см. 25.30 - производство смонтированных креплений для железнодорожных путей, см. 25.99 - производство секций для судов, см. 30.11 @ru
scope note: Bu sınıf aşağıdakileri kapsamaktadır; - dökme ağır metallerin dökümü, - dökme değerli metallerin dökümü, - demir dışı metallerin basınçlı dökümü. @tr
preferred label: Леене на други метали @bg
preferred label: Odlévání ostatních neželezných kovů @cs
preferred label: Støbning af andre ikke-jernholdige metalprodukter @da
preferred label: Buntmetallgießereien @de
preferred label: Χύτευση άλλων μη σιδηρούχων μετάλλων @el
preferred label: Fundición de otros metales no férreos @es
preferred label: Muude mitteraudmetallide valu @et
preferred label: Muiden värimetallien valu @fi
preferred label: Fonderie d'autres métaux non ferreux @fr
preferred label: Egyéb nem vas fém öntése
preferred label: Fusione di altri metalli non ferrosi @it
preferred label: Kitų spalvotųjų metalų liejinių gamyba @lt
preferred label: Citu krāsaino metālu liešana @lv
preferred label: Tidwib ta' metalli oħra mhux tal-ħadid @mt
preferred label: Gieten van andere non-ferrometalen @nl
preferred label: Støping av andre ikke-jernholdige metaller @no
preferred label: Odlewnictwo pozostałych metali nieżelaznych @pl
preferred label: Fundição de metais não ferrosos, n.e. @pt
preferred label: Turnarea altor metale neferoase @ro
preferred label: Литье других цветных металлов @ru
preferred label: Odlievanie ostatných neželezných kovov @sk
preferred label: Litje drugih neželeznih kovin @sl
preferred label: Gjutning av andra metaller @sv
preferred label: Diğer demir dışı metallerin dökümü @tr
broader: Casting of metals

Manufacture of fabricated metal products, except machinery and equipment
type: Concept
notation: 25
status: valid
status modified: 2013-10-18
accepted date: 2013-10-18
in scheme: Statistical Classification of Economic Activities in the European Community, Rev. 2 (2008)
scope note: производство на метални изделия (части, котли, резервоари и други контейнери, метални конструкции), обикновено неподвижни. Производството на метални изделия, окомплектовани (и/или с други материали) в по-комплексни единици - машини или оборудване (които ако не са електрически, електронни или оптични), е обхванато в раздели от 26 до 30. Този раздел включва още производство на въоръжение и боеприпаси. - специализиран ремонт и поддържане - 33.1 - инсталиране в сгради на метални изделия (например на котли за централно отопление и други) - 43.22 @bg
scope note: Tento oddíl zahrnuje výrobu „čistě“ kovových výrobků (jako jsou nádrže, zásobníky, konstrukce), které mají zpravidla statickou funkci. Následující oddíly 26-30 oproti tomu zahrnují výrobu nebo montáž (popř. sestavování) takových výrobků (tyto výrobky mohou obsahovat kromě kovu i jiné materiály), pro jejichž činnost jsou zapotřebí pohyblivé části a součásti, pokud se nejedná o prvky čistě elektrické, elektronické nebo optické (nebo pracují na elektrickém, elektronickém nebo optickém principu). Oddíl 25 dále zahrnuje výrobu zbraní a střeliva. Tento oddíl nezahrnuje: - odborné opravy a údržbu kovodělných výrobků vyráběných v tomto oddílu (33.1) - odbornou instalaci zařízení, jejichž výroba patří do tohoto oddílu (např. kotlů ústředního topení), v budovách (43.22) @cs
scope note: Diese Abteilung umfasst die Herstellung "reiner" Metallerzeugnisse (wie Bauelemente, Behälter und Konstruktionen), die in der Regel statisch und unbeweglich sind. Demgegenüber umfassen die Abteilungen 26-30 Kombinationen bzw. Montagen solcher Metallerzeugnisse (mitunter mit anderen Materialien) zu komplexeren Einheiten, die bewegliche Teile umfassen, sofern es sich nicht um rein elektrische, elektronische oder optische handelt. Diese Abteilung umfasst ferner die Herstellung von Waffen und Munition. Diese Abteilung umfasst nicht: - spezialisierte Wartung und Reparatur (s. 33.1) - spezialisierte Installation von in dieser Abteilung hergestellten Waren in Gebäuden, z. B von Zentralheizungskesseln (s. 43.22) @de
scope note: This division includes the manufacture of "pure" metal products (such as parts, containers and structures), usually with a static, immovable function, as opposed to the following divisions 26-30, which cover the manufacture of combinations or assemblies of such metal products (sometimes with other materials) into more complex units that, unless they are purely electrical, electronic or optical, work with moving parts. The manufacture of weapons and ammunition is also included in this division. This division excludes: - specialised repair and maintenance activities, see 33.1 - specialised installation of manufactured goods produced in this division in buildings, such as central heating boilers, see 43.22 @en
scope note: Esta división comprende la fabricación de productos metálicos «puros» (como partes, contenedores y estructuras), habitualmente con una función estática e inmóvil, mientras que las divisiones 26 a 30 comprenden la fabricación de combinaciones o ensamblajes de dichos productos metálicos (en ocasiones con otros materiales) en unidades más complejas que, excepto las puramente eléctricas, electrónicas u ópticas, funcionan con partes móviles. La fabricación de armas y municiones se incluye asimismo en esta división. Esta división no comprende: - las actividades especializadas de reparación y mantenimiento (véase 33.1) - la instalación especializada en edificios de bienes cuya fabricación se clasifica en esta división, como calderas de calefacción central (véase 43.22) @es
scope note: Cette division traite de la fabrication de produits en "pur" métal (tels que pièces, conteneurs et structures), habituellement avec une fonction statique, inamovible, par opposition aux divisions 26-30, qui concernent des combinaisons ou assemblages de tels produits en métal (parfois avec d’autres matériaux) en unités plus complexes qui, à moins qu’elles ne soient purement électriques, électroniques ou optiques, fonctionnent avec des pièces mobiles. La fabrication d’armes et de munitions relève également de cette division. Cette division ne comprend pas: - les activités d’entretien et de réparation spécialisée, voir groupe 33.1 - l’installation spécialisée de machines et d’autres produits manufacturés dans des bâtiments (p.ex. chaudières pour le chauffage central), voir 43.22 @fr
scope note: Ovaj odjeljak uključuje proizvodnju "čistih" metalnih proizvoda (kao što su metalni dijelovi, kontejneri i konstrukcije), obično onih sa statičnom, nepokretnom funkcijom, za razliku od onih u odjeljcima 26 - 30, koji se bave kombinacijom i sastavljanjem takvih metalnih proizvoda (katkad s ostalim materijalima) u složenije jedinice koje, ako nisu u potpunosti električne, elektroničke ili optičke, rade s pokretnim dijelovima. Proizvodnja oružja i municije također je uključena u ovaj odjeljak. Ovaj odjeljak isključuje: - specijalizirane djelatnosti popravaka i održavanja, vidi skupinu 33.1 - specijalizirano instaliranje proizvedenih dobara iz ovog odjeljka u zgradama kao što su kotlovi za centralno grijanje, vidi 43.22
scope note: Į šį skyrių įeina „grynųjų“ metalų gaminių, tokių kaip dalys, konteineriai ir konstrukcijos, dažniausiai atliekančioms statines nejudamąsias funkcijas, gamyba, priešingai negu 26 - 30 skyriuose klasifikuojama gamyba, į kurią įeina tokių metalinių gaminių sujungimas ar montavimas (kartais su kitokios prigimties medžiagomis) į daug sudėtingesnius agregatus su judamosiomis dalimis, išskyrus tuos atvejus, kai jie yra išimtinai elektriniai, elektroniniai ar optiniai. Ginklų ir šaudmenų gamyba taip pat įeina į šį skyrių. Į šį skyrių neįeina: - specializuotojo remonto ir techninės priežiūros veikla, žr. 33.1 grupėje - specializuotas pramoninių gaminių bei dirbinių, tokių kaip centrinio šildymo katilai, pagamintų šiame skyriuje, įrengimas pastatuose, žr. 43.22 @lt
scope note: Этот класс включает: - производство металлических дверей, окон и рам, ставен и ворот - производство металлических составляющих для сборки половых покрытий @ru
scope note: Bu bölüm, genellikle statik, sabit bir işleve sahip `saf` metal ürünlerin (parçalar, muhafaza kapları (fıçı, varil vb.), yapılar gibi) imalatını ve takip eden 26 ile 30 arasındaki bölümlerin tersine, hareketli parçalarla çalışan, tamamıyla elektrikli, elektronik veya optik olmayan bu gibi ürünlerin (bazen diğer materyallerle) daha karmaşık birimlere dönüştürülmesine yönelik bağlantı veya montaj ürünlerinin imalatını kapsamaktadır. Silah ve cephane imalatı da bu bölüme dahildir. Kapsam dışı olanlar; - uzmanlaşmış bakım ve onarım faaliyetleri, bkz. grup 33.1, - bu bölümde üretilmiş malların binalara kurulumu (örn. merkezi ısıtma kazanlarının kurulumu), bkz. 43.22. @tr
preferred label: Производство на метални изделия, без машини и оборудване @bg
preferred label: Výroba kovových konstrukcí a kovodělných výrobků, kromě strojů a zařízení @cs
preferred label: Jern- og metalvareindustri, undtagen maskiner og udstyr @da
preferred label: Herstellung von Metallerzeugnissen @de
preferred label: Κατασκευή μεταλλικών προϊόντων, με εξαίρεση τα μηχανήματα και τα είδη εξοπλισμού @el
preferred label: Fabricación de productos metálicos, excepto maquinaria y equipo @es
preferred label: Metalltoodete tootmine, v.a masinad ja seadmed @et
preferred label: Metallituotteiden valmistus (pl. koneet ja laitteet) @fi
preferred label: Fabrication de produits métalliques, à l’exception des machines et des équipements @fr
preferred label: Fémfeldolgozási termék gyártása
preferred label: Fabbricazione di prodotti in metallo, esclusi macchinari e attrezzature @it
preferred label: Metalo gaminių, išskyrus mašinas ir įrenginius, gamyba @lt
preferred label: Gatavo metālizstrādājumu ražošana, izņemot mašīnas un iekārtas @lv
preferred label: Manifattura ta' prodotti tal-metall iffabbrikat, għajr magni u tagħmir @mt
preferred label: Vervaardiging van producten van metaal, exclusief machines en apparaten @nl
preferred label: Produksjon av metallvarer, unntatt maskiner og utstyr @no
preferred label: Produkcja metalowych wyrobów gotowych, z wyłączeniem maszyn i urządzeń @pl
preferred label: Fabricação de produtos metálicos, excepto máquinas e equipamentos @pt
preferred label: Industria construcţiilor metalice şi a produselor din metal, exclusiv maşini, utilaje şi instalaţii @ro
preferred label: Производство готовых металлических изделий, кроме машин и оборудования @ru
preferred label: Výroba kovových konštrukcií, okrem strojov a zariadení @sk
preferred label: Proizvodnja kovinskih izdelkov, razen strojev in naprav @sl
preferred label: Tillverkning av metallvaror utom maskiner och apparater @sv
preferred label: Makine ve teçhizat hariç, fabrikasyon metal ürünleri imalatı @tr
broader: MANUFACTURING
narrower: Manufacture of structural metal products
narrower: Manufacture of tanks, reservoirs and containers of metal
narrower: Manufacture of steam generators, except central heating hot water boilers
narrower: Manufacture of weapons and ammunition
narrower: Forging, pressing, stamping and roll-forming of metal; powder metallurgy
narrower: Treatment and coating of metals; machining
narrower: Manufacture of cutlery, tools and general hardware
narrower: Manufacture of other fabricated metal products

Manufacture of structural metal products
type: Concept
notation: 25.1
status: valid
status modified: 2013-10-18
accepted date: 2013-10-18
in scheme: Statistical Classification of Economic Activities in the European Community, Rev. 2 (2008)
scope note: Tato skupina zahrnuje výrobu konstrukčních výrobků a jejich dílů (např. nosných konstrukcí nebo rámů) z kovu. @cs
scope note: Diese Gruppe umfasst die Herstellung von Konstruktionen und Konstruktionsteilen (z. B. Tragwerken), aus Metall. @de
scope note: This group includes the manufacture of structural metal products (such as metal frameworks or parts for construction). @en
scope note: Este grupo comprende la fabricación de elementos metálicos para la construcción (como estructuras o piezas metálicas para la construcción). @es
scope note: Ce groupe comprend la fabrication d’éléments en métal pour la construction (tels que des cadres métalliques et des éléments de construction). @fr
scope note: Ova skupina uključuje proizvodnju metalnih konstrukcija (kao što su metalni kosturi ili dijelovi konstrukcija).
scope note: Į šią grupę įeina konstrukcinių metalo gaminių, tokių kaip metaliniai karkasai ar metalinės konstrukcijų dalys, gamyba. @lt
scope note: Данная группа включает производство баков, радиаторов центрального отопления и нагревательных/паровых котлов. @ru
scope note: Bu grup, metal yapı malzemelerinin imal edilmesini kapsamaktadır. (örneğin inşaat için metal iskeletler ya da parçalar). @tr
preferred label: Производство на метални изделия за строителството @bg
preferred label: Výroba konstrukčních kovových výrobků @cs
preferred label: Fremstilling af metalkonstruktioner @da
preferred label: Stahl- und Leichtmetallbau @de
preferred label: Κατασκευή δομικών μεταλλικών προϊόντων @el
preferred label: Fabricación de elementos metálicos para la construcción @es
preferred label: Metallkonstruktsioonide tootmine @et
preferred label: Metallirakenteiden valmistus @fi
preferred label: Fabrication d'éléments en métal pour la construction @fr
preferred label: Fémszerkezet, -épületelem gyártása
preferred label: Fabbricazione di elementi da costruzione in metallo @it
preferred label: Konstrukcinių metalo gaminių gamyba @lt
preferred label: Metāla konstrukciju ražošana @lv
preferred label: Manifattura ta' prodotti strutturali tal-metall @mt
preferred label: Vervaardiging van metalen constructiewerken @nl
preferred label: Produksjon av metallkonstruksjoner @no
preferred label: Produkcja metalowych elementów konstrukcyjnych @pl
preferred label: Fabricação de elementos de construção em metal @pt
preferred label: Fabricarea de construcţii metalice @ro
preferred label: Производство строительных металлических конструкций и изделий @ru
preferred label: Výroba kovových konštrukcií @sk
preferred label: Proizvodnja gradbenih kovinskih izdelkov @sl
preferred label: Byggnadsmetallvarutillverkning @sv
preferred label: Metal yapı malzemeleri imalatı @tr
broader: Manufacture of fabricated metal products, except machinery and equipment
narrower: Manufacture of metal structures and parts of structures
narrower: Manufacture of doors and windows of metal

Manufacture of metal structures and parts of structures
type: Concept
notation: 25.11
status: valid
status modified: 2013-10-18
accepted date: 2013-10-18
in scheme: Statistical Classification of Economic Activities in the European Community, Rev. 2 (2008)
scope note: - производство на скелета, метални конструкции и части от тях (кули, стълбове, ферми, мостове и други) за строителството - производство на метални конструкции за производствено оборудване (за високи пещи, за подемни и други съоръжения) - производство на сглобяеми постройки от метал: • модулни елементи за изложби, халета и други - производство на части за котли за плавателни средства или за електроцентрали - 25.30 - производство на сглобени неподвижни съоръжения за релсов път - 25.99 - производство на метални конструкции за плавателни съдове и плаващи съоръжения- 30.11 @bg
scope note: Z: - výrobu kovových nosných konstrukcí pro použití ve stavebnictví a jejich dílů (např. věží, pilířů, příhradových konstrukcí, mostů) - výrobu kovových konstrukcí pro využití v průmyslu (konstrukcí pro vysoké pece, zdvihací a manipulační zařízení atd.) - výrobu prefabrikovaných budov převážně z kovu (stavebních buněk, kabin atd.) N: - výrobu částí lodních kotlů a kotlů pro elektrárny (25.30) - výrobu montovaných součástí pro železniční svršky (25.99) - stavbu částí lodí (30.11) @cs
scope note: Diese Klasse umfasst: - Herstellung von Metallskeletten und Gerüsten für den Bau (Türme, Masten, Fachwerk, Brücken usw.) und von Teilen davon - Herstellung von Metallskeletten für Industrie und Gewerbe (Tragwerke für Hochöfen, Hebe- und Fördervorrichtungen usw.) - Herstellung von vorgefertigten Metallgebäuden: • Bauhütten, Ausstellungsbauelemente usw. Diese Klasse umfasst nicht: - Herstellung von Dampfkesseln für Schiffe und Kraftwerke (s. 25.30) - Herstellung von montiertem Gleismaterial (s. 25.99) - Herstellung von Schiffssegmenten (s. 30.11) @de
scope note: This class includes: - manufacture of metal frameworks or skeletons for construction and parts thereof (towers, masts, trusses, bridges etc.) - manufacture of industrial frameworks in metal (frameworks for blast furnaces, lifting and handling equipment etc.) - manufacture of prefabricated buildings mainly of metal: • site huts, modular exhibition elements etc. This class excludes: - manufacture of parts for marine or power boilers, see 25.30 - manufacture of assembled railway track fixtures, see 25.99 - manufacture of sections of ships, see 30.11 @en
scope note: Esta clase comprende: - la fabricación de estructuras o armazones metálicos para la construcción y de sus partes (torres, mástiles, armaduras, puentes, etc.) - la fabricación de estructuras industriales de metal (armazones para altos hornos y para equipos de elevación y manipulación de mercancías, etc.) - la fabricación de edificios metálicos prefabricados: • barracas de obras, elementos modulares para exposiciones, etc. Esta clase no comprende: - la fabricación de piezas para calderas navales y calderas para la producción de energía (véase 25.30) - la fabricación de piezas y accesorios ensamblados para vías de ferrocarril (véase 25.99) - la fabricación de elementos de estructura para barcos (véase 30.11) @es
scope note: Cette classe comprend: - la fabrication de cadres métalliques ou d’ossatures pour la construction et leurs éléments (tours, mâts, armatures, ponts, etc.) - la fabrication de cadres métalliques pour équipements industriels (cadres pour hauts fourneaux, matériels de manutention, etc.) - la fabrication de constructions préfabriquées principalement en métaux: • baraques de chantier, éléments modulaires pour expositions, etc. Cette classe ne comprend pas: - la fabrication de pièces destinées aux chaudières de navires ou de centrales électriques, voir 25.30 - la construction d’équipements de voies ferrées assemblés, voir 25.99 - la fabrication d’éléments de structure pour navires et bateaux, voir 30.11 @fr
scope note: Ovaj razred uključuje: - proizvodnju metalnih skela i kostura za građevinarstvo i njihovih dijelova (tornjeva, stupova, trasa, mostova itd.) - proizvodnju industrijskih metalnih konstrukcija (konstrukcija za visoke peći, dizala i opreme za rukovanje itd.) - proizvodnju montažnih zgrada pretežno od metala: • baraka na gradilištu, elemenata za izložbene dvorane itd. Ovaj razred isključuje: - proizvodnju dijelova za brodske ili druge kotlove, vidi 25.30 - proizvodnju pričvršćivača za sastavljanje željezničke tračnice, vidi 25.99 - proizvodnju elemenata za brodove, vidi 30.11
scope note: Į šią klasę įeina: - statybinių metalinių karkasų ar griaučių (bokštų, stiebų, santvarų, tiltų ir kt.) bei jų dalių gamyba - pramoninių metalinių karkasų (aukštakrosnėms, kėlimo ir krovimo įrenginiams ir kt.) gamyba - surenkamųjų, daugiausia metalinių, pastatų gamyba: • statybvietės namelių, parodų modulinių elementų ir kt. Į šią klasę neįeina: - laivų ar energijos gamybos katilų dalių gamyba, žr. 25.30 - surenkamų geležinkelio kelio tvirtinimo detalių gamyba, žr. 25.99 - laivų sekcijų gamyba, žr. 30.11 @lt
scope note: Этот класс исключает: - производство электрических печей и водонагревателей, см. 27.51 @ru
scope note: Bu sınıf aşağıdakileri kapsamaktadır; - inşaat ve inşaatın parçaları için metal çatıların ya da iskeletlerin imalatı (kuleler, direkler, destekler, köprüler vb.) - metal endüstriyel iskeletlerin imalatı (yüksek fırınlar, kaldırma teçhizatları, taşıma ekipmanları vb. için iskeletler) - çoğunluğu metalden prefabrik binaların imalatı: • inşaat şantiyeleri, modüler sergi elemanları vb. Kapsam dışı olanlar; - gemi veya enerji kazanları için parçaların imalatı, bkz. 25.30, - monte edilmiş demiryolu hatlarına ait tertibatların imalatı, bkz. 25.99, - gemi kısımlarının imalatı, bkz. 30.11. @tr
preferred label: Производство на метални конструкции и части от тях @bg
preferred label: Výroba kovových konstrukcí a jejich dílů @cs
preferred label: Fremstilling af metalkonstruktioner og dele heraf @da
preferred label: Herstellung von Metallkonstruktionen @de
preferred label: Κατασκευή μεταλλικών σκελετών και μερών μεταλλικών σκελετών @el
preferred label: Fabricación de estructuras metálicas y sus componentes @es
preferred label: Metallkonstruktsioonide ja nende osade tootmine @et
preferred label: Metallirakenteiden ja niiden osien valmistus @fi
preferred label: Fabrication de structures métalliques et de parties de structures @fr
preferred label: Fémszerkezet gyártása
preferred label: Fabbricazione di strutture metalliche e di parti di strutture @it
preferred label: Metalo konstrukcijų ir jų dalių gamyba @lt
preferred label: Metāla konstrukciju un to sastāvdaļu ražošana @lv
preferred label: Manifattura ta' strutturi u partijiet ta' strutturi tal-metall @mt
preferred label: Vervaardiging van metalen constructiewerken en delen daarvan @nl
preferred label: Produksjon av metallkonstruksjoner og deler @no
preferred label: Produkcja konstrukcji metalowych i ich części @pl
preferred label: Fabricação de estruturas de construção metálicas @pt
preferred label: Fabricarea de construcţii metalice şi părţi componente ale structurilor metalice @ro
preferred label: Производство строительных металлических конструкций и изделий @ru
preferred label: Výroba kovových konštrukcií a ich častí @sk
preferred label: Proizvodnja kovinskih konstrukcij in njihovih delov @sl
preferred label: Tillverkning av metallstommar och delar därav @sv
preferred label: Metal yapı ve yapı parçaları imalatı @tr
broader: Manufacture of structural metal products

Manufacture of doors and windows of metal
type: Concept
notation: 25.12
status: valid
status modified: 2013-10-18
accepted date: 2013-10-18
in scheme: Statistical Classification of Economic Activities in the European Community, Rev. 2 (2008)
scope note: - производство на врати, прозорци и техните каси, ролетки и щори, от стомана или алуминий - метални преградни стени @bg
scope note: Z: - výrobu kovových vrat, dveří, oken a jejich rámů a bednění - výrobu příček ukotvených v podlaze @cs
scope note: Diese Klasse umfasst: - Herstellung von Metalltoren, -türen, -fenstern und deren Rahmen und Verkleidungen - am Fußboden zu befestigende Trennwände aus Metall @de
scope note: This class includes: - manufacture of metal doors, windows and their frames, shutters and gates - metal room partitions for floor attachment @en
scope note: Esta clase comprende: - la fabricación de puertas, ventanas y sus marcos, cierres, portales, etc. metálicos - tabiques metálicos para su instalación sobre suelos @es
scope note: Cette classe comprend: - la fabrication de portes et de fenêtres métalliques, d’huisseries métalliques, de rideaux métalliques de fermeture et de portails métalliques - la fabrication de séparations métalliques de pièces destinées à être rivées au sol @fr
scope note: Ovaj razred uključuje: - proizvodnju metalnih vrata, prozora i njihovih okvira, žaluzina i kapija - proizvodnju metalnih sobnih pregrada za podno pričvršćivanje
scope note: Į šią klasę įeina: - metalinių durų, langų ir jų staktų, anginių ir vartų gamyba - prie grindų tvirtinamų metalinių kambario pertvarų gamyba @lt
scope note: Этот класс включает: - производство металлических резервуаров, баков и прочих подобных емкостей для хранения или использования в производстве - производство металлических емкостей для сжатого или жидкого газа Этот класс исключает: - производство металлических бочек и бочонков, ящиков для упаковки товаров, банок, ведер, коробок и т.д. обычно используемых для перевозки и упаковки изделий, вместимостью не более 300 литров, см. 25.91, 25.92 - производство контейнеров для транспортировки, см. 29.20 - производство танков (бронированных военных автотранспортных средств), см. 30.40 @ru
scope note: Bu sınıf aşağıdakileri kapsamaktadır; - metal kapıların, çelik kapıların, pencerelerin ve çerçevelerin, panjurların ve bahçe kapılarının imalatı, - ek mekanlar için metalden oda bölmeleri @tr
preferred label: Производство на метална дограма @bg
preferred label: Výroba kovových dveří a oken @cs
preferred label: Fremstilling af døre og vinduer af metal @da
preferred label: Herstellung von Ausbauelementen aus Metall @de
preferred label: Κατασκευή μεταλλικών πορτών και παραθύρων @el
preferred label: Fabricación de carpintería metálica @es
preferred label: Metalluste ja -akende tootmine @et
preferred label: Metalliovien ja -ikkunoiden valmistus @fi
preferred label: Fabrication de portes et fenêtres en métal @fr
preferred label: Fémépületelem gyártása
preferred label: Fabbricazione di porte e finestre in metallo @it
preferred label: Metalinių durų ir langų gamyba @lt
preferred label: Metāla durvju un logu ražošana @lv
preferred label: Manifattura ta' bibien u twieqi tal-metall @mt
preferred label: Vervaardiging van metalen deuren en vensters @nl
preferred label: Produksjon av dører og vinduer av metall @no
preferred label: Produkcja metalowych elementów stolarki budowlanej @pl
preferred label: Fabricação de portas e janelas metálicas @pt
preferred label: Fabricarea de uşi şi ferestre din metal @ro
preferred label: Производство металлических дверей и окон @ru
preferred label: Výroba kovových dverí a okien @sk
preferred label: Proizvodnja kovinskega stavbnega pohištva @sl
preferred label: Tillverkning av dörrar och fönster av metall @sv
preferred label: Metal kapı ve pencere imalatı @tr
broader: Manufacture of structural metal products

Manufacture of tanks, reservoirs and containers of metal
type: Concept
notation: 25.2
status: valid
status modified: 2013-10-18
accepted date: 2013-10-18
in scheme: Statistical Classification of Economic Activities in the European Community, Rev. 2 (2008)
scope note: Diese Gruppe umfasst die Herstellung von Heizkörpern und -kesseln für Zentralheizungen sowie von Tanks. @de
scope note: This group includes the manufacture of tanks, central heating radiators and boilers. @en
scope note: Este grupo comprende la fabricación de cisternas, calderas y radiadores para calefacción central. @es
scope note: Ce groupe comprend la fabrication de réservoirs, de radiateurs et de chaudières pour le chauffage central. @fr
scope note: Ova skupina uključuje proizvodnju cisterni, kotlova za centralno grijanje i radijatora.
scope note: Į šią grupę įeina cisternų, centrinio šildymo radiatorių ir katilų gamyba. @lt
scope note: Данная группа включает производство паровых генераторов. @ru
scope note: Bu grup tankların, merkezi ısıtma radyatörlerinin ve kazanlarının (boyler) imalatını kapsamaktadır. @tr
preferred label: Производство на котли за централно отопление и радиатори с неелектрическо загряване; производство на цистерни, резервоари и контейнери от метал @bg
preferred label: Výroba kovových nádrží, zásobníků a podobných nádob @cs
preferred label: Fremstilling af tanke og beholdere af metal @da
preferred label: Herstellung von Metalltanks und -behältern; Herstellung von Heizkörpern und -kesseln für Zentralheizungen @de
preferred label: Κατασκευή μεταλλικών ντεπόζιτων, δεξαμενών και δοχείων @el
preferred label: Fabricación de cisternas, grandes depósitos y contenedores de metal @es
preferred label: Metallpaakide, -reservuaaride ja -mahutite tootmine @et
preferred label: Metallisäiliöiden ja -altaiden yms. valmistus @fi
preferred label: Fabrication de réservoirs, citernes et conteneurs métalliques @fr
preferred label: Fűtési kazán, radiátor, fémtartály gyártása
preferred label: Fabbricazione di cisterne, serbatoi e contenitori in metallo @it
preferred label: Metalinių cisternų, rezervuarų ir talpyklų gamyba @lt
preferred label: Metāla cisternu, rezervuāru un tilpņu ražošana @lv
preferred label: Manifattura ta' tankijiet, reservoirs u kontenituri tal-metal @mt
preferred label: Vervaardiging van tanks, reservoirs en bergingsmiddelen, van metaal @nl
preferred label: Produksjon av tanker, cisterner og andre beholdere av metall @no
preferred label: Produkcja zbiorników, cystern i pojemników metalowych @pl
preferred label: Fabricação de reservatórios e recipientes metálicos @pt
preferred label: Producţia de rezervoare, cisterne şi containere metalice; producţia de radiatoare şi cazane pentru încălzire centrală @ro
preferred label: Производство металлических цистерн, резервуаров и контейнеров @ru
preferred label: Výroba nádrží, zásobníkov a kontajnerov z kovu @sk
preferred label: Proizvodnja kotlov za centralno ogrevanje, kovinskih rezervoarjev in cistern @sl
preferred label: Tillverkning av cisterner, tankar, kar och andra behållare av metall @sv
preferred label: Metal tank, rezervuar ve muhafaza kapları imalatı @tr
broader: Manufacture of fabricated metal products, except machinery and equipment
narrower: Manufacture of central heating radiators and boilers
narrower: Manufacture of other tanks, reservoirs and containers of metal

Manufacture of central heating radiators and boilers
type: Concept
notation: 25.21
status: valid
status modified: 2013-10-18
accepted date: 2013-10-18
in scheme: Statistical Classification of Economic Activities in the European Community, Rev. 2 (2008)
scope note: - производство на котли за централно отопление и радиатори с неелектрическо загряване - производство на електрически фурни и бойлери - 27.51 @bg
scope note: N: - výrobu elektrických ploten, kamen a ohřívačů vody (27.51) @cs
scope note: Diese Klasse umfasst nicht: - Herstellung von elektrischen Herden und Warmwasserbereitern (s. 27.51) @de
scope note: This class excludes: - manufacture of electrical ovens and water heaters, see 27.51 @en
scope note: Esta clase no comprende: - la fabricación de hornos eléctricos y calentadores de agua (véase 27.51) @es
scope note: Cette classe ne comprend pas: - la fabrication de fours électriques et de chauffe-eau, voir 27.51 @fr
scope note: Ovaj razred isključuje: - proizvodnju električnih pećnica i grijača vode, vidi 27.51
scope note: Į šią klasę neįeina: - elektrinių krosnių ir vandens šildytuvų gamyba, žr. 27.51 @lt
scope note: Этот класс включает: - производство паровых или прочих парогенераторов - производство вспомогательного оборудования для его использования с паровыми парогенераторами: • конденсаторов, подогревателей, пароперегревателей, паровых коллекторов и аккумуляторов - производство ядерных реакторов, за исключением изотопных сепараторов - производство деталей морских или энергетических котлов Этот класс также включает: - постройку системы трубопроводных линий, включающую дальнейшую обработку труб для соединения напорных труб или линий трубопровода с разработкой и установкой Этот класс исключает: - производство радиаторов и котлов центрального отопления, см. 25.21 - производство котлотурбинных установок, см. 28.11 - производство сепараторов изотопов, см. 28.99 @ru
scope note: Kapsam dışı olanlar; - elektrikli fırınlar ve su ısıtıcıları imalatı, bkz. 27.51. @tr
preferred label: Производство на котли за централно отопление и радиатори с неелектрическо загряване @bg
preferred label: Výroba radiátorů a kotlů k ústřednímu topení @cs
preferred label: Fremstilling af radiatorer og kedler til centralvarmeanlæg @da
preferred label: Herstellung von Heizkörpern und –kesseln für Zentralheizungen @de
preferred label: Κατασκευή σωμάτων και λεβήτων κεντρικής θέρμανσης @el
preferred label: Fabricación de radiadores y calderas para calefacción central @es
preferred label: Keskkütteradiaatorite ja -kuumaveekatelde tootmine @et
preferred label: Keskuslämmityspatterien ja kuumavesivaraajien valmistus @fi
preferred label: Fabrication de radiateurs et de chaudières pour le chauffage central @fr
preferred label: Központi fűtési kazán, radiátor gyártása
preferred label: Fabbricazione di radiatori e contenitori in metallo per caldaie per il riscaldamento centrale @it
preferred label: Centrinio šildymo radiatorių ir katilų gamyba @lt
preferred label: Centrālapkures radiatoru un katlu ražošana @lv
preferred label: Manifattura ta' radjaturi u bojlers tat-tisħin ċentrali @mt
preferred label: Vervaardiging van radiatoren en ketels voor centrale verwarming @nl
preferred label: Produksjon av radiatorer og kjeler til sentralvarmeanlegg @no
preferred label: Produkcja grzejników i kotłów centralnego ogrzewania @pl
preferred label: Fabricação de caldeiras e radiadores para aquecimento central @pt
preferred label: Producţia de radiatoare şi cazane pentru încălzire centrală @ro
preferred label: Производство радиаторов и котлов центрального отопления @ru
preferred label: Výroba radiátorov ústredného kúrenia a bojlerov @sk
preferred label: Proizvodnja radiatorjev in kotlov za centralno ogrevanje @sl
preferred label: Tillverkning av radiatorer och pannor för centraluppvärmning @sv
preferred label: Merkezi ısıtma radyatörleri (elektrikli radyatörler hariç), sıcak su kazanları (boyler) ve kombi imalatı @tr
broader: Manufacture of tanks, reservoirs and containers of metal

Manufacture of other tanks, reservoirs and containers of metal
type: Concept
notation: 25.29
status: valid
status modified: 2013-10-18
accepted date: 2013-10-18
in scheme: Statistical Classification of Economic Activities in the European Community, Rev. 2 (2008)
scope note: - производство на резервоари, цистерни, вани и подобни контейнери, обикновено инсталирани неподвижно, използвани за складиране или за производствена употреба - производство на метални съдове за сгъстени или втечнени газове - производство на варели и подобни съдове с вместимост, непревишаваща 300 л, обикновено използвани за пакетиране или превоз на стоки - 25.91; 25.92 - производство на карго контейнери - 29.20 @bg
scope note: Z: - výrobu zásobníků, nádrží a podobných kovových nádob instalovaných obvykle jako zařízení pro skladování nebo pro průmyslové účely - výrobu kovových nádob pro stlačený nebo zkapalněný plyn N: - výrobu kovových nádob obvykle užívaných k přepravě a balení výrobků (jako jsou např. sudy, kýble, plechovky, krabice) nepřesahujících objem 300 l (25.91, 25.92) - výrobu dopravních kontejnerů (29.20) @cs
scope note: Diese Klasse umfasst: - Herstellung von Sammelbehältern, Tanks und ähnlichen Metallbehältern von der üblicherweise zum Zweck der Lagerung sowie Herstellung von Waren installierten Art - Herstellung von Metallbehältern für komprimierte oder verflüssigte Gase Diese Klasse umfasst nicht: - Herstellung von Metallbehältern von der üblicherweise zum Tragen und zur Verpackung von Gütern verwendeten Art, mit einem Fassungsvermögen von 300 l oder weniger (s. 25.91, 25.92) - Herstellung von Transportbehältern (s. 29.20) - Herstellung von Panzern (gepanzerten Kampfwagen) (s. 30.40) @de
scope note: This class includes: - manufacture of reservoirs, tanks and similar containers of metal, of types normally installed as fixtures for storage or manufacturing use - manufacture of metal containers for compressed or liquefied gas This class excludes: - manufacture of metal casks, drums, cans, pails, boxes etc. of a kind normally used for carrying and packing of goods, of a capacity not exceeding 300 litres, see 25.91, 25.92 - manufacture of transport containers, see 29.20 - manufacture of tanks (armoured military vehicles), see 30.40 @en
scope note: Esta clase comprende: - la fabricación de grandes depósitos, cisternas y contenedores similares de metal, del tipo que se instala normalmente para el almacenamiento y la industria - la fabricación de recipientes metálicos para gases comprimidos o licuados Esta clase no comprende: - la fabricación de toneles, bidones, botes, cubos, cajas, etc. del tipo empleado normalmente para el transporte o envasado de productos de capacidad no superior a 300 litros (véase 25.91, 25.92) - la fabricación de contenedores de transporte (véase 29.20) - la fabricación de tanques (vehículos militares blindados) (véase 30.40) @es
scope note: Cette classe comprend: - la fabrication de réservoirs, de citernes et de récipients similaires, en métal, qui font généralement partie du matériel fixe de stockage ou de fabrication - la fabrication de récipients métalliques pour gaz comprimés ou liquéfiés Cette classe ne comprend pas: - la fabrication de fûts, de tambours, de bidons, de seaux, de boîtes, etc., en métal des types couramment utilisés pour le transport ou l’emballage de marchandises, d'une contenance ne dépassant pas 300 litres, voir 25.91 et 25.92 - la fabrication de conteneurs de transport, voir 29.20 - la fabrication de véhicules blindés de l’armée, voir 30.40 @fr
scope note: Ovaj razred uključuje: - proizvodnju rezervoara, cisterni i sličnih posuda od metala koje se uobičajeno instaliraju kao pričvršćivači za skladištenje ili upotrebu u proizvodnji - proizvodnju metalnih posuda za komprimirane ili tekuće plinove Ovaj razred isključuje: - proizvodnju metalnih bačava, buradi, kanta, vedara, kutija itd. koje se uobičajeno koriste za nošenje ili pakiranje robe (neovisno o veličini), vidi 25.91, 25.92 - proizvodnju kontejnera za prijevoz, vidi 29.20 - proizvodnju tenkova (oružana vojna vozila), vidi 30.40
scope note: Į šią klasę įeina: - metalinių rezervuarų, cisternų ir panašių talpyklų, nejudamai įrengiamų laikyti medžiagas ar gamybos reikmėms, gamyba - metalinių talpyklų suslėgtosioms ar suskystintosioms dujoms gamyba Į šią klasę neįeina: - metalinių statinaičių, statinių, skardinių, kibirų, dėžių ir kt., paprastai naudojamų prekėms gabenti arba įpakuoti, kurių talpa neviršija 300 litrų, gamyba, žr. 25.91, 25.92 - transporto konteinerių gamyba, žr. 29.20 - tankų (šarvuotų karinių mašinų) gamyba, žr. 30.40 @lt
scope note: Bu sınıf aşağıdakileri kapsamaktadır; - genellikle depolamada veya imalatta kullanmak amacıyla sabit olarak kurulmuş metal rezervuar, tank ve benzer muhafazaların imalatı, - sıkıştırılmış veya sıvılaştırılmış gazlar için metal büyük muhafaza kapları (kapasitesi >=300 litre) imalatı. Kapsam dışı olanlar; - genellikle eşyaların taşınması ve paketlenmesi için kullanılan . metal varil, fıçı, teneke kutu, kova, kutu vb. imalatı (kapasitesi 300 litreyi aşmayan), bkz. 25.91, 25.92. - taşıma konteynerlerinin imalatı, bkz. 29.20. - tankların (zırhlı askeri araçların) imalatı, bkz. 30.40. @tr
preferred label: Производство на цистерни, резервоари и контейнери от метал @bg
preferred label: Výroba ostatních kovových nádrží, zásobníků a podobných nádob @cs
preferred label: Fremstilling af andre tanke og beholdere af metal @da
preferred label: Herstellung von Sammelbehältern, Tanks u. ä. Behältern aus Metall @de
preferred label: Κατασκευή άλλων μεταλλικών ντεπόζιτων, δεξαμενών και δοχείων @el
preferred label: Fabricación de otras cisternas, grandes depósitos y contenedores de metal @es
preferred label: Muude metallpaakide, -reservuaaride ja -mahutite tootmine @et
preferred label: Muiden metallisäiliöiden ja -altaiden yms. valmistus @fi
preferred label: Fabrication d'autres réservoirs, citernes et conteneurs métalliques @fr
preferred label: Fémtartály gyártása
preferred label: Fabbricazione di altre cisterne, serbatoi e contenitori in metallo @it
preferred label: Kitų metalinių cisternų, rezervuarų ir talpyklų gamyba @lt
preferred label: Metāla cisternu, rezervuāru un tilpņu ražošana @lv
preferred label: Manifattura ta' tankijiet, ġibjuni u kontenituri tal-metall oħra @mt
preferred label: Vervaardiging van andere tanks, reservoirs en bergingsmiddelen, van metaal @nl
preferred label: Produksjon av andre tanker, cisterner og beholdere av metall @no
preferred label: Produkcja pozostałych zbiorników, cystern i pojemników metalowych @pl
preferred label: Fabricação de outros reservatórios e recipientes metálicos @pt
preferred label: Producţia de rezervoare, cisterne şi containere metalice @ro
preferred label: Производство прочих металлических цистерн, резервуаров и контейнеров @ru
preferred label: Výroba ostatných nádrží, zásobníkov a kontajnerov z kovu @sk
preferred label: Proizvodnja drugih kovinskih rezervoarjev in cistern @sl
preferred label: Tillverkning av andra cisterner, tankar, kar och andra behållare av metall @sv
preferred label: Metalden diğer tank, rezervuar ve büyük muhafaza kapları (kapasitesi >=300 litre) imalatı @tr
broader: Manufacture of tanks, reservoirs and containers of metal

Manufacture of steam generators, except central heating hot water boilers
type: Concept
notation: 25.3
status: valid
status modified: 2013-10-18
accepted date: 2013-10-18
in scheme: Statistical Classification of Economic Activities in the European Community, Rev. 2 (2008)
scope note: Diese Gruppe umfasst die Herstellung von Dampfkesseln. @de
scope note: This group includes the manufacture of steam generators. @en
scope note: Este grupo comprende la fabricación de generadores de vapor. @es
scope note: Ce groupe comprend la fabrication de générateurs de vapeur. @fr
scope note: Ova skupina uključuje proizvodnju parnih generatora.
scope note: Į šią grupę įeina garo generatorių gamyba. @lt
scope note: Этот класс включает: - производство тяжелого оружия (артиллерии, передвижных пушек, ракетных пусковых установок, торпедных установок, тяжелых пулеметов) - производство стрелкового оружия (револьверов, дробовиков, легких пулеметов) - производство воздушных или газовых ружей и пистолетов - производство военных боеприпасов Этот класс также включает: - производство охотничьих, спортивных или защитных видов огнестрельного оружия и боеприпасов - производство взрывных устройств, таких как, бомбы, мины и торпеды Этот класс исключает: - производство взрывных устройств, детонаторов или сигнальных ракет, см. 20.51 - производство сабель, рапир, шашек, штыков и т.д., см. 25.71 - производство бронированных автотранспортных средств для транспортировки денег и драгоценностей, см. 29.10 - производство космических кораблей, см. 30.30 - производство танков и прочих боевых автотранспортных средств, см. 30.40 @ru
scope note: Bu grup, buhar jeneratörlerinin imalatını kapsamaktadır. @tr
preferred label: Производство на парни котли, без котли за централно отопление @bg
preferred label: Výroba parních kotlů, kromě kotlů pro ústřední topení @cs
preferred label: Fremstilling af dampkedler undtagen centralvarmekedler @da
preferred label: Herstellung von Dampfkesseln (ohne Zentralheizungskessel) @de
preferred label: Κατασκευή ατμογεννητριών, με εξαίρεση τους λέβητες ζεστού νερού για την κεντρική θέρμανση @el
preferred label: Fabricación de generadores de vapor, excepto calderas para calefacción central @es
preferred label: Aurukatelde tootmine, v.a keskkütte-kuumaveekatlad @et
preferred label: Höyrykattiloiden valmistus (pl. keskuslämmityslaitteet) @fi
preferred label: Fabrication de générateurs de vapeur, à l'exception des chaudières pour le chauffage central @fr
preferred label: Gőzkazán gyártása
preferred label: Fabbricazione di generatori di vapore, esclusi i contenitori in metallo per caldaie per il riscaldamento centrale ad acqua calda @it
preferred label: Garo generatorių, išskyrus centrinio šildymo karšto vandens katilus, gamyba @lt
preferred label: Tvaika ģeneratoru ražošana, izņemot centrālapkures karstā ūdens katlus @lv
preferred label: Manifattura ta' ġeneraturi tal-fwar, għajr bojlers tal-misħun tat-tisħin ċentrali @mt
preferred label: Vervaardiging van stoomketels, exclusief warmwaterketels voor centrale verwarming @nl
preferred label: Produksjon av dampkjeler, unntatt kjeler til sentralvarmeanlegg @no
preferred label: Produkcja wytwornic pary, z wyłączeniem kotłów do centralnego ogrzewania gorącą wodą @pl
preferred label: Fabricação de geradores de vapor (excepto caldeiras para aquecimento central) @pt
preferred label: Producţia generatoarelor de aburi (cu excepţia cazanelor pentru încălzire centrală) @ro
preferred label: Производство паровых котлов, кроме котлов центрального отопления @ru
preferred label: Výroba parných kotlov, okrem kotlov ústredného kúrenia @sk
preferred label: Proizvodnja parnih kotlov, razen kotlov za centralno ogrevanje @sl
preferred label: Tillverkning av ånggeneratorer utom varmvattenpannor för centraluppvärmning @sv
preferred label: Buhar jeneratörü imalatı (merkezi ısıtma sıcak su kazanları hariç) @tr
broader: Manufacture of fabricated metal products, except machinery and equipment
narrower: Manufacture of steam generators, except central heating hot water boilers

Manufacture of steam generators, except central heating hot water boilers
type: Concept
notation: 25.30
status: valid
status modified: 2013-10-18
accepted date: 2013-10-18
in scheme: Statistical Classification of Economic Activities in the European Community, Rev. 2 (2008)
scope note: - производство на парни котли за едновременно получаване на гореща вода и пара с ниско налягане; на котли “с прегрята вода” - производство на спомагателни устройства за парни котли: • кондензатори, икономайзери, прегреватели, паросъбиратели и акумулатори на пара, устройства за почистване от сажди и за рекуперация на газове - производство на ядрени реактори (съвкупности от съоръжения и устройства, намиращи се в границите на биологичната защита), без машини и апарати за изотопно разделяне - производство на части за котли за плавателни средства или за електроцентрали - проектантски и строителни работи по изграждане на прилежащата тръбна мрежа под налягане - котли за централно отопление и радиатори с неелектрическо загряване - 25.21 - производство на турбинни парогенератори - 28.11 - производство на машини и апарати за изотопно разделяне - 28.99 @bg
scope note: Z: - výrobu parních kotlů (parních generátorů) - výrobu pomocných zařízení k parním generátorům (kondenzátorů, předehřívačů, přehřívačů, sběračů páry, akumulátorů) - výrobu jaderných reaktorů a jejich částí, kromě separátorů izotopů - výrobu lodních kotlů a kotlů pro elektrárny a jejich částí ZT: - výrobu potrubních sítí, která zahrnuje další úpravu trubek na tlakové potrubí (včetně projekčních a stavebních prací s tím spojených) N: - výrobu topných těles (radiátorů) a kotlů pro ústřední topení (25.21) - výrobu zařízení parních turbín (28.11) - výrobu separátorů izotopů (28.99) @cs
scope note: Diese Klasse umfasst: - Herstellung von Dampfkesseln (Dampferzeugern) - Herstellung von Hilfsapparaten für Dampfkessel: • Kondensatoren, Vorwärmer, Überhitzer, Dampfsammler und Druckspeicher - Herstellung von Kernreaktoren, außer Isotopentrennern - Herstellung von Teilen für Dampfkesseln für Schiffe und Kraftwerke Diese Klasse umfasst ferner: - Herstellung von Rohrnetzen einschließlich Weiterverarbeitung von Rohren hauptsächlich zu Druckrohren oder Druckrohrnetzen sowie damit verbundene Entwurfs- und Konstruktionsarbeiten Diese Klasse umfasst nicht: - Herstellung von Heizkörpern und –kesseln für Zentralheizungen (s. 25.21) - Herstellung von Dampfturbinenanlagen (s. 28.11) - Herstellung von Isotopentrennern (s. 28.99) @de
scope note: This class includes: - manufacture of steam or other vapour generators - manufacture of auxiliary plant for use with steam generators: • condensers, economisers, superheaters, steam collectors and accumulators - manufacture of nuclear reactors, except isotope separators - manufacture of parts for marine or power boilers This class also includes: - pipe system construction comprising further processing of tubes generally to make pressure pipes or pipe systems together with the associated design and construction work This class excludes: - manufacture of central heating hot-water boilers and radiators, see 25.21 - manufacture of boiler-turbine sets, see 28.11 - manufacture of isotope separators, see 28.99 @en
scope note: Esta clase comprende: - la fabricación de generadores de vapor de agua y otros generadores de vapor - la fabricación de aparatos auxiliares para generadores de vapor: • condensadores, economizadores, recalentadores y acumuladores de vapor - la fabricación de reactores nucleares, excepto separadores de isótopos - la fabricación de piezas para calderas navales y calderas para la producción de energía Esta clase comprende también: - la construcción de sistemas de tuberías, incluido el procesamiento de tubos destinados principalmente a la fabricación de tubos o sistemas de canalización a presión, conjuntamente con su diseño y construcción Esta clase no comprende: - la fabricación de calderas y radiadores de agua caliente para la calefacción central (véase 25.21) - la fabricación de conjuntos de caldera y turbina (véase 28.11) - la fabricación de separadores de isótopos (véase 28.99) @es
scope note: Cette classe comprend: - la fabrication de générateurs produisant de la vapeur d’eau ou d’autres types de vapeur - la fabrication d’appareils auxiliaires pour générateurs de vapeur: • condensateurs, économiseurs, surchauffeurs, collecteurs et accumulateurs de vapeur - la fabrication de réacteurs nucléaires, à l’exception des séparateurs d’isotopes - la fabrication de pièces destinées aux chaudières de navires ou de centrales électriques Cette classe comprend également: - la construction de réseaux de tuyauterie comprenant un traitement complémentaire des tubes de manière à réaliser principalement des conduites ou des réseaux sous pression, ainsi que les travaux annexes de conception et d’installation Cette classe ne comprend pas: - la fabrication de chaudières et de radiateurs de chauffage central, voir 25.21 - la fabrication d’ensembles turbine-chaudière, voir 28.11 - la fabrication de séparateurs d’isotopes, voir 28.99 @fr
scope note: Ovaj razred uključuje: - proizvodnju parnih kotlova i drugih generatora pare - proizvodnju pomoćnih uređaja za proizvodnju pare: • kondenzatora, ekonomajzera, pregrijača, skupljača i akumulatora pare - proizvodnju nuklearnih reaktora, osim separatora izotopa - proizvodnju dijelova za brodske ili druge kotlove Ovaj razred također uključuje: - proizvodnju sustava cijevi koji se uključuje u proces rada generatora, ponajviše da osigura pritisak u cijevima ili u sustavu cijevi, zajedno s pridruženim sustavom konstrukcije generatora Ovaj razred isključuje: - proizvodnju kotlova za centralno grijanje toplom vodom, vidi 25.21 - proizvodnju setova za kotlove turbina, vidi 28.11 - proizvodnju separatora izotopa, vidi 28.99
scope note: Į šią klasę įeina: - vandens ar kitų garų generatorių gamyba - naudojamų kartu su garo generatoriais pagalbinių įrenginių gamyba: • kondensatorių, ekonomaizerių, garo perkaitintuvų, garo rinktuvų ir akumuliatorių - branduolinių reaktorių, išskyrus izotopų skirtuvus, gamyba - laivų ar energijos gamybos garo katilų dalių gamyba Į šią klasę taip pat įeina: - vamzdžių sistemų įrengimas, įskaitant paskesnį vamzdžių apdorojimą, dažniausiai siekiant padaryti slėginius vamzdynus arba jų sistemas, kartu su susijusiais projektavimo ir įrengimo darbais Į šią klasę neįeina: - centrinio šildymo karšto vandens katilų ir radiatorių gamyba, žr. 25.21 - katilų turbinų blokų gamyba, žr. 28.11 - izotopų skirtuvų gamyba, žr. 28.99 @lt
scope note: Данная группа включает основные виды деятельности при обработке металлов, такие как, ковка или прессование, которые обычно осуществляются на контрактной основе. @ru
scope note: Bu sınıf aşağıdakileri kapsamaktadır; - su buharı veya diğer buhar jeneratörlerinin imalatı, - buhar jeneratörleriyle beraber kullanmak için yardımcı ünitelerin imalatı: • kondansatör, ekonomizör, kızdırıcı, buhar toplayıcı ve buhar akümülatörleri. - nükleer reaktör imalatı, izotop ayırıcılar hariç, - gemi veya enerji kazanları (boyler) için parçaların imalatı, Ayrıca bu sınıf aşağıdakileri de kapsamaktadır; - ilgili dizayn ve inşaat işiyle beraber genellikle basınç boruları veya boru sistemlerini yapmak için boruların daha ileri düzeyde işlemini kapsayan boru sistemi inşaası. Kapsam dışı olanlar; - merkezi ısıtma sıcak su kazanlarının (boyler) ve radyatörlerinin imalatı, bkz. 25.21, - kazan (boyler) türbin setlerinin imalatı, bkz. 28.11, - izotop ayırıcıların imalatı, bkz. 28.99. @tr
preferred label: Производство на парни котли, без котли за централно отопление @bg
preferred label: Výroba parních kotlů, kromě kotlů pro ústřední topení @cs
preferred label: Fremstilling af dampkedler undtagen centralvarmekedler @da
preferred label: Herstellung von Dampfkesseln (ohne Zentralheizungskessel) @de
preferred label: Κατασκευή ατμογεννητριών, με εξαίρεση τους λέβητες ζεστού νερού για την κεντρική θέρμανση @el
preferred label: Fabricación de generadores de vapor, excepto calderas para calefacción central @es
preferred label: Aurukatelde tootmine, v.a keskkütte-kuumaveekatlad @et
preferred label: Höyrykattiloiden valmistus (pl. keskuslämmityslaitteet) @fi
preferred label: Fabrication de générateurs de vapeur, à l'exception des chaudières pour le chauffage central @fr
preferred label: Gőzkazán gyártása
preferred label: Fabbricazione di generatori di vapore, esclusi i contenitori in metallo per caldaie per il riscaldamento centrale ad acqua calda @it
preferred label: Garo generatorių, išskyrus centrinio šildymo karšto vandens katilus, gamyba @lt
preferred label: Tvaika ģeneratoru ražošana, izņemot centrālapkures karstā ūdens katlus @lv
preferred label: Manifattura ta' ġeneraturi tal-fwar, għajr bojlers tal-misħun tat-tisħin ċentrali @mt
preferred label: Vervaardiging van stoomketels, exclusief warmwaterketels voor centrale verwarming @nl
preferred label: Produksjon av dampkjeler, unntatt kjeler til sentralvarmeanlegg @no
preferred label: Produkcja wytwornic pary, z wyłączeniem kotłów do centralnego ogrzewania gorącą wodą @pl
preferred label: Fabricação de geradores de vapor (excepto caldeiras para aquecimento central) @pt
preferred label: Producţia generatoarelor de aburi (cu excepţia cazanelor pentru încălzire centrală) @ro
preferred label: Производство паровых котлов, кроме котлов центрального отопления @ru
preferred label: Výroba parných kotlov, okrem kotlov ústredného kúrenia @sk
preferred label: Proizvodnja parnih kotlov, razen kotlov za centralno ogrevanje @sl
preferred label: Tillverkning av ånggeneratorer utom varmvattenpannor för centraluppvärmning @sv
preferred label: Buhar jeneratörü imalatı, merkezi ısıtma sıcak su kazanları hariç @tr
broader: Manufacture of steam generators, except central heating hot water boilers

Manufacture of weapons and ammunition
type: Concept
notation: 25.4
status: valid
status modified: 2013-10-18
accepted date: 2013-10-18
in scheme: Statistical Classification of Economic Activities in the European Community, Rev. 2 (2008)
scope note: Этот класс включает: ковку, прессование, штамповку и профилирование листового металла роликами, профилировку листового металла на роликовой листогибочной машине - порошковую металлургию: производство металлических изделий из металлического порошка методом горячей обработки (агломерации) или под давлением Этот класс исключает: - производство металлического порошка, см. 24.1, 24.4 @ru
preferred label: Производство на въоръжение и боеприпаси @bg
preferred label: Výroba zbraní a střeliva @cs
preferred label: Fremstilling af våben og ammunition @da
preferred label: Herstellung von Waffen und Munition @de
preferred label: Κατασκευή όπλων και πυρομαχικών @el
preferred label: Fabricación de armas y municiones @es
preferred label: Relva- ja laskemoonatootmine @et
preferred label: Aseiden ja ammusten valmistus @fi
preferred label: Fabrication d'armes et de munitions @fr
preferred label: Fegyver-, lőszergyártás
preferred label: Fabbricazione di armi e munizioni @it
preferred label: Ginklų ir šaudmenų gamyba @lt
preferred label: Ieroču un munīcijas ražošana @lv
preferred label: Manifattura ta' armi u munizzjon @mt
preferred label: Vervaardiging van wapens en munitie @nl
preferred label: Produksjon av våpen og ammunisjon @no
preferred label: Produkcja broni i amunicji @pl
preferred label: Fabricação de armas e munições @pt
preferred label: Fabricarea armamentului şi muniţiei @ro
preferred label: Производство оружия и боеприпасов @ru
preferred label: Výroba zbraní a munície @sk
preferred label: Proizvodnja orožja in streliva @sl
preferred label: Tillverkning av vapen och ammunition @sv
preferred label: Silah ve mühimmat (cephane) imalatı @tr
broader: Manufacture of fabricated metal products, except machinery and equipment
narrower: Manufacture of weapons and ammunition

Manufacture of weapons and ammunition
type: Concept
notation: 25.40
status: valid
status modified: 2013-10-18
accepted date: 2013-10-18
in scheme: Statistical Classification of Economic Activities in the European Community, Rev. 2 (2008)
scope note: - производство на тежко въоръжение (артилерийско, самоходни оръдия, реактивни гранатомети, торпедни тръби, тежки картечници) - производство на стрелково оръжие (револвери, пушки, леки картечници) - производство на въздушни и газови пушки и пистолети - производство на боеприпаси - производство на огнестрелни оръжия и боеприпаси за лов, спорт и лична защита - производство на взривни средства - бомби, мини и торпеда - производство на капсули, детонатори или сигнални ракети - 20.51 - производство на саби, мечове, щикове, копия и други хладни оръжия - 25.71 - производство на бронирани автомобили за превоз на пари или ценности - 29.10 - производство на космически ракети носители - 30.30 - производство на танкове и други бойни бронирани транспортни машини - 30.40 @bg
scope note: Z: - výrobu těžkých zbraní (děl a dělostřeleckého materiálu, děl na samohybných lafetách, raketometů, torpédových rour, těžkých kulometných zbraní) - výrobu ručních zbraní (pistolí a revolverů, brokovnic, lehkých kulometných zbraní) - výrobu vzduchových a plynových děl a pistolí - výrobu bojového střeliva ZT: - výrobu loveckých, sportovních nebo obranných střelných zbraní a střeliva - výrobu výbušných zařízení jako jsou bomby, miny a torpéda N: - výrobu nárazových zápalek (kapslí), rozbušek a světlic (20.51) - výrobu mačet, mečů, bajonetů atd. (25.71) - výrobu pancéřovaných vozidel pro přepravu peněz a cenin (29.10) - výrobu kosmických dopravních prostředků (30.30) - výrobu tanků a ostatních bojových vozidel (30.40) - výrobu mezikontinentálních balistických střel (ICBM) (30.30) @cs
scope note: Diese Klasse umfasst: - Herstellung von schweren Waffen (Artillerie, Geschütze auf Selbstfahrlafetten, Raketenwerfer, Torpedorohre, schwere Maschinengewehre) - Herstellung von Handwaffen (Pistolen und Revolver, Schrotflinten, leichte Maschinengewehre) - Herstellung von Luftdruck- oder Gasdruckgewehren und -pistolen - Herstellung von Kampfmunition Diese Klasse umfasst ferner: - Herstellung von Jagd-, Sport- oder Schutzfeuerwaffen und Munition - Herstellung von Sprengkörpern wie Bomben, Minen und Torpedos Diese Klasse umfasst nicht: - Herstellung von Sprengkapseln, Sprengzündern und Leuchtkugeln (s. 20.51) - Herstellung von Buschmessern, Schwertern, Bajonetten usw. (s. 25.71) - Herstellung von gepanzerten Fahrzeugen für Geld- oder Werttransporte (s. 29.10) - Herstellung von Raumfahrzeugen (s. 30.30) - Herstellung von Panzern und sonstigen Kampffahrzeugen (s. 30.40) @de
scope note: This class includes: - manufacture of heavy weapons (artillery, mobile guns, rocket launchers, torpedo tubes, heavy machine guns) - manufacture of small arms (revolvers, shotguns, light machine guns) - manufacture of air or gas guns and pistols - manufacture of war ammunition This class also includes: - manufacture of hunting, sporting or protective firearms and ammunition - manufacture of explosive devices such as bombs, mines and torpedoes This class excludes: - manufacture of percussion caps, detonators or signalling flares, see 20.51 - manufacture of cutlasses, swords, bayonets etc., see 25.71 - manufacture of armoured vehicles for the transport of banknotes or valuables, see 29.10 - manufacture of space vehicles, see 30.30 - manufacture of tanks and other fighting vehicles, see 30.40 @en
scope note: Esta clase comprende: - la fabricación de armas pesadas (artillería, cañones móviles, lanzacohetes, tubos lanzatorpedos, ametralladoras pesadas) - la fabricación de armas ligeras (revólveres, fusiles, ametralladoras ligeras) - la fabricación de pistolas de gas o aire comprimido - la fabricación de municiones de guerra Esta clase comprende también: - la fabricación de armas de fuego y municiones para la práctica deportiva o la defensa personal - la fabricación de dispositivos explosivos como bombas, minas y torpedos Esta clase no comprende: - la fabricación de cebos y cápsulas fulminantes, detonadores y cohetes de señales (véase 20.51) - la fabricación de machetes, espadas, bayonetas, etc. (véase 25.71) - la fabricación de vehículos blindados para el transporte de billetes de banco u objetos de valor (véase 29.10) - la fabricación de vehículos espaciales (véase 30.30) - la fabricación de carros de combate y de otros vehículos de combate (véase 30.40) @es
scope note: Cette classe comprend: - la fabrication d’armes lourdes (pièces d’artillerie, lance-missiles, lance-torpilles, fusils mitrailleurs, etc.) - la fabrication d’armes légères (revolvers, carabines, pistolets mitrailleurs, etc.) - la fabrication de carabines et pistolets à air comprimé ou à gaz - la fabrication de munitions de guerre Cette classe comprend également: - la fabrication d’armes de chasse, de tir sportif et de défense ainsi que de leurs munitions - la fabrication d’engins explosifs tels que bombes, mines et torpilles Cette classe ne comprend pas: - la fabrication d’amorces et de capsules fulminantes, de détonateurs et de fusées de signalisation, voir 20.51 - la fabrication d’épées, de sabres, de baïonnettes, etc., voir 25.71 - la fabrication de véhicules blindés pour le transport de billets de banque ou d’autres objets de valeur, voir 29.10 - la fabrication de véhicules spatiaux, voir 30.30 - la fabrication de chars et d’autres véhicules de combat, voir 30.40 @fr
scope note: Ovaj razred uključuje: - proizvodnju teškog oružja (artiljerije, mobilnog oružja, lansirnih raketa, torpednih cijevi, teških strojnica) - proizvodnju malog oružja (revolvera, pušaka, lakih strojnica) - proizvodnju zračnih ili plinskih revolvera i pištolja - proizvodnju ratnog streljiva Ovaj razred također uključuje: - proizvodnju vatrenog oružja i streljiva za potrebe lova, sporta ili radi zaštite - proizvodnju eksplozivnih naprava kao što su bombe, mine i torpeda Ovaj razred isključuje: - proizvodnju udarnih kapsula, detonatora i signalnih lampi, vidi 20.51 - proizvodnju sablji, mačeva, bajuneta itd., vidi 25.71 - proizvodnju oružanih vozila za prijevoza novčanica ili vrijednih predmeta, vidi 29.10 - proizvodnju svemirskih letjelica, vidi 30.30 - proizvodnju tenkova i ostalih vozila koja se koriste u borbi, vidi 30.40
scope note: Į šią klasę įeina: - sunkiųjų ginklų (artilerijos pabūklų, judriųjų patrankų, raketų leidimo įrenginių, torpedinių aparatų, sunkiųjų kulkosvaidžių) gamyba - smulkių ginklų (revolverių, šautuvų, lengvųjų kulkosvaidžių) gamyba - orinių ar dujinių šautuvų ir pistoletų - karo šaudmenų gamyba Į šią klasę taip pat įeina: - medžioklinių, sportinių ar savigynos šaunamųjų ginklų ir šaudmenų gamyba - sprogmenų, tokių kaip bombos, minos ir torpedos, gamyba Į šią klasę neįeina: - smūginių sprogdiklių, detonatorių ar signalinių raketų gamyba, žr. 20.51 - špagų, kalavijų, durtuvų ir kt., gamyba, žr. 25.71 - šarvuotųjų automobilių banknotams ar vertybėms vežti gamyba, žr. 29.10 - kosminių laivų gamyba, žr. 30.30 - tankų ir kitų kovinių mašinų gamyba, žr. 30.40 @lt
scope note: Данная группа включает в основном деятельность по обработке металлов, такую как, металлизация/нанесение металла, гравировка, сверление, полировка, сварка и т.д., которая обычно выполняются за вознаграждение или на контрактной основе. @ru
scope note: Bu sınıf aşağıdakileri kapsamaktadır; - ağır silah imalatı (büyük toplar, savaş araçları, füze atarlar, torpil kovanları, ağır makineli tüfekler), - küçük silahların imalatı (revolver, av tüfeği, hafif makineli tüfekler), - havalı veya gazlı tüfeklerin ve tabancaların imalatı, - savaş mühimmatının imalatı. Ayrıca bu sınıf aşağıdakileri de kapsamaktadır; - avcılık, spor veya savunma amaçlı ateşli silah ve cephane imalatı, - bomba, mayın ve torpido gibi patlayıcı tertibatların imalatı. Kapsam dışı olanlar; - patlayıcı kapsül, fünye veya işaret (uyarı) fişeği imalatı, bkz. 20.51, - pala, kılıç, süngü vb. imalatı, bkz. 25.71, - paraların veya değerli kıymetlerin taşınması için zırhlı araç imalatı, bkz. 29.10, - uzay araçlarının imalatı, bkz. 30.30, - tankların ve diğer savaş araçlarının imalatı, bkz. 30.40. @tr
preferred label: Производство на въоръжение и боеприпаси @bg
preferred label: Výroba zbraní a střeliva @cs
preferred label: Fremstilling af våben og ammunition @da
preferred label: Herstellung von Waffen und Munition @de
preferred label: Κατασκευή όπλων και πυρομαχικών @el
preferred label: Fabricación de armas y municiones @es
preferred label: Relva- ja laskemoonatootmine @et
preferred label: Aseiden ja ammusten valmistus @fi
preferred label: Fabrication d'armes et de munitions @fr
preferred label: Fegyver-, lőszergyártás
preferred label: Fabbricazione di armi e munizioni @it
preferred label: Ginklų ir šaudmenų gamyba @lt
preferred label: Ieroču un munīcijas ražošana @lv
preferred label: Manifattura ta' armi u munizzjon @mt
preferred label: Vervaardiging van wapens en munitie @nl
preferred label: Produksjon av våpen og ammunisjon @no
preferred label: Produkcja broni i amunicji @pl
preferred label: Fabricação de armas e munições @pt
preferred label: Fabricarea armamentului şi muniţiei @ro
preferred label: Производство оружия и боеприпасов @ru
preferred label: Výroba zbraní a munície @sk
preferred label: Proizvodnja orožja in streliva @sl
preferred label: Tillverkning av vapen och ammunition @sv
preferred label: Silah ve mühimmat (cephane) imalatı @tr
broader: Manufacture of weapons and ammunition

Forging, pressing, stamping and roll-forming of metal; powder metallurgy
type: Concept
notation: 25.5
status: valid
status modified: 2013-10-18
accepted date: 2013-10-18
in scheme: Statistical Classification of Economic Activities in the European Community, Rev. 2 (2008)
scope note: основни дейности по обработка на металите, като коване или пресоване, които обикновено се осъществяват срещу заплащане (по договор или еднократно). @bg
scope note: Tato skupina zahrnuje činnosti opracování kovů jako kování nebo lisování, které jsou obvykle prováděné na základě smlouvy nebo dohody. @cs
scope note: Diese Gruppe umfasst allgemeine Tätigkeiten der Metallbearbeitung wie Schmieden oder Pressen, die üblicherweise im Lohnauftrag ausgeführt werden. @de
scope note: This group includes general activities for the treatment of metal, such as forging or pressing, which are typically carried out on a fee or contract basis. @en
scope note: Este grupo comprende actividades generales para el tratamiento de metales, como la forja y la estampación, que se realizan habitualmente por cuenta de terceros. @es
scope note: Ce groupe comprend les activités générales de travail du métal, telles que le forgeage ou l’emboutissage, généralement réalisées pour le compte de tiers. @fr
scope note: Ova skupina uključuje osnovne djelatnosti za obradu metala kao što su kovanje ili prešanje, koje se obavljaju uz naplatu ili na osnovi ugovora.
scope note: Į šią grupę įeina nespecializuotos metalo apdirbimo veiklos rūšys, tokios kaip kalimas ar presavimas, kurios paprastai vykdomos už atlygį ar pagal sutartį. @lt
scope note: Этот класс включает: - нанесение покрытий на металлы, анодирование металлов и т.п. - термическую обработку металлов - удаление заусенцев, пескоструйную обработку/очистку, обработку деталей во вращающемся барабане, очистку поверхности металлов - окрашивание, гравирование металлов - нанесение неметаллических покрытий: • нанесение пластмассовых покрытий, эмалирование, лакирование и т.п. - шлифовальную обработку металлов Этот класс исключает: - кузнечную обработку, см. 01.62 - нанесение оттисков на металл, см. 18.12 - металлическое покрытие пластиковых поверхностей, см. 22.29 - вальцовку драгоценных металлов на основные металлы или прочие металлы, см. 24.41, 24.42, 24.43, 24.44 - моментальную гравировку, см. 95.29 @ru
scope note: Bu grup, tipik olarak bir ücret ya da sözleşmeye dayalı olarak metallerin dövülmesi veya preslenmesi gibi metallerin işlenmesi için yapılan genel faaliyetleri kapsamaktadır. @tr
preferred label: Коване, щамповане и валцуване на метал; прахова металургия @bg
preferred label: Kování, lisování, ražení, válcování a protlačování kovů; prášková metalurgie @cs
preferred label: Smedning, presning, sænksmedning og valsning af metal; pulvermetallurgi @da
preferred label: Herstellung von Schmiede-, Press-, Zieh- und Stanzteilen, gewalzten Ringen und pulvermetallurgischen Erzeugnissen @de
preferred label: Σφυρηλάτηση, κοίλανση, ανισόπαχη τύπωση και μορφοποίηση μετάλλων με έλαση· κονιομεταλλουργία @el
preferred label: Forja, estampación y embutición de metales; metalurgia de polvos @es
preferred label: Metalli sepistamine, pressimine, stantsimine ja rullvaltsimine; pulbermetallurgia @et
preferred label: Metallin takominen, puristaminen, meistäminen ja valssaus; jauhemetallurgia @fi
preferred label: Forge, emboutissage, estampage; métallurgie des poudres @fr
preferred label: Fémalakítás, porkohászat
preferred label: Fucinatura, imbutitura, stampaggio e profilatura dei metalli; metallurgia delle polveri @it
preferred label: Metalo kalimas, presavimas, štampavimas ir profiliavimas; miltelių metalurgija @lt
preferred label: Metāla kalšana, presēšana, štancēšana un velmēšana; pulvermetalurģija @lv
preferred label: Funderija, pressa, ttimbrar u rrumblar ta' metall; metallurġija tat-trab @mt
preferred label: Smeden, persen, stampen en profielwalsen van metaal; poedermetallurgie @nl
preferred label: Smiing, stansing og valsing av metall, og pulvermetallurgi @no
preferred label: Kucie, prasowanie, wytłaczanie i walcowanie metali; metalurgia proszków @pl
preferred label: Fabricação de produtos forjados, estampados e laminados; metalurgia dos pós @pt
preferred label: Fabricarea produselor metalice obţinute prin deformare plastică; metalurgia pulberilor @ro
preferred label: Ковка, прессование, штамповка, профилирование листового металла роликами и профилировка листового металла на роликовой листогибочной машине; порошковая металлургия @ru
preferred label: Kovanie, lisovanie, razenie a valcovanie kovov; prášková metalurgia @sk
preferred label: Kovanje, stiskanje, vtiskovanje in valjanje kovin; prašna metalurgija @sl
preferred label: Smidning, pressning, prägling och valsning av metall; pulvermetallurgi @sv
preferred label: Metallerin dövülmesi, preslenmesi, baskılanması ve yuvarlanması; toz metalürjisi @tr
broader: Manufacture of fabricated metal products, except machinery and equipment
narrower: Forging, pressing, stamping and roll-forming of metal; powder metallurgy

Forging, pressing, stamping and roll-forming of metal; powder metallurgy
type: Concept
notation: 25.50
status: valid
status modified: 2013-10-18
accepted date: 2013-10-18
in scheme: Statistical Classification of Economic Activities in the European Community, Rev. 2 (2008)
scope note: - коване, пресуване, щамповане и валцуване на метал- прахова металургия: производство на метални изделия от метален прах чрез обработка под налягане или топлинна обработка (синтероване) - производство на метален прах - 24.1, 24.2 @bg
scope note: Z: - výrobu výkovků, výlisků, vývalků, protlačků apod. - práškovou metalurgii: výrobu předmětů z kovových prášků lisováním a slinováním (spékáním) N: - výrobu kovového prášku (24.1, 24.4) @cs
scope note: Diese Klasse umfasst: - Herstellung von Schmiede-, Press-, Zieh- und Stanzteilen - Pulvermetallurgie: Herstellung von Teile aus Metallpulver unter Druck und durch Wärmebehandlung (Sinterung) Diese Klasse umfasst nicht: - Erzeugung von Metallpulver (s. 24.1, 24.4) @de
scope note: This class includes: - forging, pressing, stamping and roll-forming of metal - powder metallurgy: production of metal objects directly from metal powders by heat treatment (sintering) or under pressure This class excludes: - production of metal powder, see 24.1, 24.4 @en
scope note: Esta clase comprende: - la forja, estampación, embutición y laminación de metales - los trabajos de pulvimetalurgia: fabricación de objetos elaborados a base de polvos metálicos por tratamiento térmico (sinterización) o compresión Esta clase no comprende: - la producción de polvo metálico (véanse 24.1 y 24.2) @es
scope note: Cette classe comprend: - le forgeage, l’emboutissage, l’estampage et le profilage des métaux - la métallurgie des poudres: production d’objets métalliques directement à partir de poudres de métaux par traitement thermique (frittage) ou compression Cette classe ne comprend pas: - la production de poudres métalliques, voir 24.1 et 24.4 @fr
scope note: Ovaj razred uključuje: - kovanje, prešanje, štampanje i valjanje metala - metalurgiju praha; proizvodnju predmeta od metala neposredno od metalnoga praha toplinskom obradom (sinterizacijom) ili prešanjem Ovaj razred isključuje: - proizvodnju metalnog praha, vidi 24.1, 24.2
scope note: Į šią klasę įeina: - metalo kalimas, presavimas, štampavimas ir ritininis profiliavimas - miltelių metalurgija: metalo dirbinių gamyba iš miltelių, juos apdorojant termiškai (sukepinant) ar presuojant Į šią klasę neįeina: - metalo miltelių gamyba, žr. 24.1, 24.2 @lt
scope note: Этот класс включает: - сверление, токарную обработку, изготовление металлического порошка, эродирование, выравнивание, полировку, проделывание отверстий, сглаживание поверхности, нарезку, заточку, полировку, сварку, стыковку и т.д. обработанных металлических поверхностей - нанесение изображения на металлические поверхности лазерным лучом Этот класс исключает: - кузнечную обработку, см. 01.62 @ru
scope note: Bu sınıf aşağıdakileri kapsamaktadır; - metalin dövülmesi, preslenmesi, baskılanması ve yuvarlanması, - toz metalürjisi: ısıl işlem (sinterleme) veya basınç altında metal tozlardan doğrudan metal nesnelerin üretilmesi. Kapsam dışı olanlar; - metal tozu üretimi, bkz. 24.1, 24.2. @tr
preferred label: Коване, щамповане и валцуване на метал; прахова металургия @bg
preferred label: Kování, lisování, ražení, válcování a protlačování kovů; prášková metalurgie @cs
preferred label: Smedning, presning, sænksmedning og valsning af metal; pulvermetallurgi @da
preferred label: Herstellung von Schmiede-, Press-, Zieh- und Stanzteilen, gewalzten Ringen und pulvermetallurgischen Erzeugnissen @de
preferred label: Σφυρηλάτηση, κοίλανση, ανισόπαχη τύπωση και μορφοποίηση μετάλλων με έλαση· κονιομεταλλουργία @el
preferred label: Forja, estampación y embutición de metales; metalurgia de polvos @es
preferred label: Metalli sepistamine, pressimine, stantsimine ja rullvaltsimine; pulbermetallurgia @et
preferred label: Metallin takominen, puristaminen, meistäminen ja valssaus; jauhemetallurgia @fi
preferred label: Forge, emboutissage, estampage; métallurgie des poudres @fr
preferred label: Fémalakítás, porkohászat
preferred label: Fucinatura, imbutitura, stampaggio e profilatura dei metalli; metallurgia delle polveri @it
preferred label: Metalo kalimas, presavimas, štampavimas ir profiliavimas; miltelių metalurgija @lt
preferred label: Metāla kalšana, presēšana, štancēšana un velmēšana; pulvermetalurģija @lv
preferred label: Funderija, pressa, ttimbrar u rrumblar ta' metall; metallurġija tat-trab @mt
preferred label: Smeden, persen, stampen en profielwalsen van metaal; poedermetallurgie @nl
preferred label: Smiing, stansing og valsing av metall, og pulvermetallurgi @no
preferred label: Kucie, prasowanie, wytłaczanie i walcowanie metali; metalurgia proszków @pl
preferred label: Fabricação de produtos forjados, estampados e laminados; metalurgia dos pós @pt
preferred label: Fabricarea produselor metalice obţinute prin deformare plastică; metalurgia pulberilor @ro
preferred label: Ковка, прессование, штамповка, профилирование листового металла роликами и профилировка листового металла на роликовой листогибочной машине; порошковая металлургия @ru
preferred label: Kovanie, lisovanie, razenie a valcovanie kovov; prášková metalurgia @sk
preferred label: Kovanje, stiskanje, vtiskovanje in valjanje kovin; prašna metalurgija @sl
preferred label: Smidning, pressning, prägling och valsning av metall; pulvermetallurgi @sv
preferred label: Metallerin dövülmesi, preslenmesi, baskılanması ve yuvarlanması; toz metalürjisi @tr
broader: Forging, pressing, stamping and roll-forming of metal; powder metallurgy

Treatment and coating of metals; machining
type: Concept
notation: 25.6
status: valid
status modified: 2013-10-18
accepted date: 2013-10-18
in scheme: Statistical Classification of Economic Activities in the European Community, Rev. 2 (2008)
scope note: основни дейности по обработка на металите, като нанасяне на покритие, гравиране, струговане, полиране, запояване и други, които обикновено се осъществяват срещу заплащане (по договор или еднократно). @bg
scope note: Tato skupina zahrnuje činnosti týkající se opracování kovů (kovových polotovarů) jako je plátování, potahování, gravírování, vrtání, leštění, svařování atd., které jsou obvykle prováděné na základě smlouvy nebo dohody. @cs
scope note: Diese Gruppe umfasst allgemeine Tätigkeiten der Metallbearbeitung wie Plattieren, Beschichten, Gravieren, Bohren, Polieren, Schweißen usw., die üblicherweise im Lohnauftrag ausgeführt werden. @de
scope note: This group includes general activities for the treatment of metal, such as plating, coating, engraving, boring, polishing, welding etc., which are typically carried out on a fee or contract basis. @en
scope note: Este grupo comprende actividades generales para el tratamiento de metales, como el chapado, el revestimiento, el grabado, la perforación, el pulido, la soldadura, etc., que se realizan habitualmente por cuenta de terceros. @es
scope note: Ce groupe comprend les activités générales de travail du métal, telles que le placage, le revêtement, la gravure, le perçage, le polissage, la soudure, etc., généralement réalisées pour le compte de tiers. @fr
scope note: Ova skupina uključuje osnovne djelatnosti obrade metala kao što su prevlačenje, graviranje, bušenje, poliranje, zavarivanje itd., koje se obično obavljaju uz naplatu ili na osnovi ugovora.
scope note: Į šia grupę įeina nespecializuotos metalo apdirbimo veiklos rūšys, tokios kaip metalizavimas, dengimas, graviravimas, ištekinimas, poliravimas, suvirinimas, kurios paprastai vykdomos už atlygį ar pagal darbo sutartį. @lt
scope note: Данная группа включает производство столовых приборов, металлических ручных инструментов и металлических изделий общего назначения. @ru
scope note: Bu grup, madenle kaplama, astarlama, oyma, delme, parlatma, kaynak yapma gibi tipik olarak bir ücret veya sözleşmeye dayalı olarak metallerin işlenmesi için yapılan genel faaliyetleri kapsamaktadır. @tr
preferred label: Друго металообработване @bg
preferred label: Povrchová úprava a zušlechťování kovů; obrábění @cs
preferred label: Overfladebehandling af metal; maskinforarbejdning @da
preferred label: Oberflächenveredlung und Wärmebehandlung; Mechanik a. n. g. @de
preferred label: Κατεργασία και επικάλυψη μετάλλων· μεταλλοτεχνία @el
preferred label: Tratamiento y revestimiento de metales; ingeniería mecánica por cuenta de terceros @es
preferred label: Metallitöötlus ja metallpindade katmine; mehaaniline metallitöötlus @et
preferred label: Metallien käsittely, päällystäminen ja työstö @fi
preferred label: Traitement et revêtement des métaux; usinage @fr
preferred label: Fém felületkezelése, megmunkálása
preferred label: Trattamento e rivestimento dei metalli; lavori di meccanica generale @it
preferred label: Metalų apdorojimas ir dengimas; mechaninis apdirbimas @lt
preferred label: Metālu mehāniskā apstrāde; virsmas apstrāde un pārklāšana @lv
preferred label: Trattament u kisi ta' metalli; ħidma bil-magni @mt
preferred label: Oppervlaktebehandeling van metalen; verspanend bewerken van metalen @nl
preferred label: Overflatebehandling og bearbeiding av metaller @no
preferred label: Obróbka metali i nakładanie powłok na metale; obróbka mechaniczna elementów metalowych @pl
preferred label: Tratamento e revestimento de metais; actividades de mecânica geral @pt
preferred label: Tratarea şi acoperirea metalelor; operaţiuni de mecanică generală pe bază de plată sau contract @ro
preferred label: Обработка металлов и нанесение покрытий на металлы; основные технологические процессы машиностроения @ru
preferred label: Opracovanie a povrchová úprava kovov; obrábanie @sk
preferred label: Površinska obdelava in prekrivanje kovin; mehanska obdelava kovin @sl
preferred label: Beläggning och överdragning av metall; metallegoarbeten @sv
preferred label: Metallerin işlenmesi ve kaplanması; makinede işleme @tr
broader: Manufacture of fabricated metal products, except machinery and equipment
narrower: Treatment and coating of metals
narrower: Machining

Treatment and coating of metals
type: Concept
notation: 25.61
status: valid
status modified: 2013-10-18
accepted date: 2013-10-18
in scheme: Statistical Classification of Economic Activities in the European Community, Rev. 2 (2008)
scope note: - нанасяне на метално покритие върху метал, анодиране и други - термично обработване на метал - почистване на мустаците, пясъкоструйно почистване, почистване във въртящи се барабани и друго почистване на метал - боядисване и гравиране на метал - нанасяне на неметално покритие върху метал: • пластифициране, емайлиране, лакиране и други - закаляване на метал - подковаване на коне - 01.62 - печатане директно върху метал - 18.12 - нанасяне на метално покритие върху пластмаси - 22.29 - валцуване на благородни метали върху неблагородни или други метали - 24.41, 24.42, 24.43, 24.44 @bg
scope note: Z: - plátování, eloxování apod. kovů - tepelné opracování kovů - odstraňování otřepů, pískování, bubnové omílání nebo leštění, otryskávání a jiné čištění kovů - barvení a gravírování kovů - potahování kovů nekovovými povlaky: potahování plasty, smaltování, lakování atd. - glazování kovů a leštění kotoučem N: - činnosti podkovářů (01.62) - potisk kovů (18.12) - potahování plastů kovy (22.29) - plátování kovů drahými kovy (24.41, 24.42, 24.43, 24.44) @cs
scope note: Diese Klasse umfasst: - Plattieren, Eloxieren usw. von Metall - Wärmebehandlung von Metall - Entgraten, Sandstrahlen, Kugelpolitur und Reinigen von Metallen - Färben und Gravieren von Metall - nichtmetallisches Beschichten von Metallen • Plastifizieren, Emaillieren, Lackieren usw. - Härten und Schwabbeln von Metall Diese Klasse umfasst nicht: - Hufschmiedetätigkeiten (s. 01.62) - Bedrucken von Metall (s. 18.12) - Beschichten von Kunststoffen mit Metall (s. 22.29) - Plattierungen mit Edelmetallen auf unedlen Metallen und anderen Metallen (s. 24.41, 24.42, 24.43, 24.44) - Gravieren als Sofortservice (s. 95.29) @de
scope note: This class includes: - plating, anodising etc. of metals - heat treatment of metals - deburring, sandblasting, tumbling, cleaning of metals - colouring, engraving of metals - non-metallic coating of metals: • plasticising, enamelling, lacquering etc. - hardening, buffing of metals This class excludes: - activities of farriers, see 01.62 - printing onto metals, see 18.12 - metal coating of plastics, see 22.29 - rolling precious metals onto base metals or other metals, see 24.41, 24.42, 24.43, 24.44 - "while-you-wait" engraving services, see 95.29 @en
scope note: Esta clase comprende: - el chapado, la anodización, etc., de metales - el tratamiento térmico de metales - el desbarbado, la limpieza por chorro de arena, la limpieza en tambor giratorio, la limpieza de metales - la coloración y el grabado de los metales - el revestimiento no metálico de metales: • plastificación, esmaltado, lacado, etc. - el endurecimiento y el pulido de metales Esta clase no comprende: - las actividades de herraje (véase 01.62) - la impresión sobre metales (véase 18.12) - el revestimiento de metálico de plásticos (véase 22.29) - el chapado de metales preciosos sobre metales comunes u otros metales (véanse 24.41, 24.42, 24.43, 24.44) @es
scope note: Cette classe comprend: - le placage, le traitement anodique, etc., des métaux - le traitement thermique des métaux - l’ébarbage, le décapage au jet de sable, le dessablage au tonneau, le nettoyage des métaux - la teinture et la gravure des métaux - le revêtement non métallique des métaux: • plastifiage, émaillage, laquage, etc. - le durcissement, le bufflage des métaux Cette classe ne comprend pas: - les activités des maréchaux-ferrants, voir 01.62 - l’impression sur métal, voir 18.12 - le revêtement métallique des plastiques, voir 22.29 - le laminage de métaux précieux sur des métaux de base ou autres métaux, voir 24.41, 24.42, 24.43 et 24.44 - les services de gravure "minute", voir 95.29 @fr
scope note: Ovaj razred uključuje: - prevlačenje metala, galvanizaciju itd. - toplinsku obradu metala - skidanje, pjeskarenje, poliranje ''tumbanjem'', čišćenje metala - bojenje, i graviranje metala - prevlačenje nemetalima: • plastificiranje, emajliranje, lakiranje itd. - kaljenje, poliranje metala kožom Ovaj razred isključuje: - djelatnosti potkivanja, vidi 01.62 - tiskanje na metalu, vidi 18.12 - prevlačenje plastike metalom, vidi 22.29 - valjanje plemenitih metala osnovnih ili ostalih metala, vidi 24.41, 24.42, 24.43, 24.44
scope note: Į šią klasę įeina: - metalų metalizavimas, anodavimas ir kt. - šiluminis (terminis) metalų apdorojimas - metalų išlajų šalinimas, smėliasrautis valymas, būgninis šlifavimas ir valymas - metalų spalvinimas, graviravimas ant metalo - metalų dengimas nemetalais: • plastiku, emaliu, laku ir kt. - metalų grūdinimas, poliravimas Į šią klasę neįeina: - kalvių veikla, žr. 01.62 - spausdinimas ant metalo, žr. 18.12 - plastikų dengimas metalais, žr. 22.29 - tauriųjų metalų valcavimas ant pagrindinių ar kitokių metalų, žr. 24.41, 24.42, 24.43, 24.44 @lt
scope note: Этот класс включает: - производство бытовых столовых изделий, таких как ножи, вилки, ложки и т.д. - производство прочих столовых и бытовых принадлежностей: • тесаков и топоров • опасных и безопасных лезвий • ножниц и заколок для волос - производство сабель, рапир, штыков и т.д. Этот класс исключает: - производство глубокой (чайников, котелков и т.д.), столовой (блюд, чашек и т.д.) или мелкой (тарелок, блюдец, поддонников и т.д.) посуды, см. 25.99 - производство столовых приборов из драгоценных металлов, см. 32.12 @ru
scope note: Bu sınıf aşağıdakileri kapsamaktadır; - metallerin kaplanması, anotlanması vb., - metallerin ısıl işlemleri, - metallerin çapaklardan arındırılması, kum püskürtülerek soyulması, yuvarlayarak cilalanması, temizlenmesi, - metallerin renklendirilmesi, oyulması, - metallerin metal kullanılmaksızın kaplanması; • metallerin plastik kaplanması, emayelenmesi, verniklenmesi vb. - metallerin sertleştirilmesi, yumuşak bir şeyle perdahlanması. Kapsam dışı olanlar; - nalbant faaliyetleri, bkz. 01.62, - metal üzerine baskı yapılması, bkz. 18.12, - plastiklerin metal ile kaplanması, bkz. 22.29, - ana metaller veya diğer metallerin değerli metallerle kaplanması, bkz. 24.41, 24.42, 24.43, 24.44. @tr
preferred label: Повърхностно обработване и нанасяне на покритие върху метал @bg
preferred label: Povrchová úprava a zušlechťování kovů @cs
preferred label: Overfladebehandling af metal @da
preferred label: Oberflächenveredlung und Wärmebehandlung @de
preferred label: Κατεργασία και επικάλυψη μετάλλων @el
preferred label: Tratamiento y revestimiento de metales @es
preferred label: Metallitöötlus ja metallpindade katmine @et
preferred label: Metallien käsittely ja päällystäminen @fi
preferred label: Traitement et revêtement des métaux @fr
preferred label: Fémfelület-kezelés
preferred label: Trattamento e rivestimento dei metalli @it
preferred label: Metalų apdorojimas ir dengimas @lt
preferred label: Metāla virsmas apstrāde un pārklāšana @lv
preferred label: Trattament u kisi ta' metalli @mt
preferred label: Oppervlaktebehandeling van metalen @nl
preferred label: Overflatebehandling av metaller @no
preferred label: Obróbka metali i nakładanie powłok na metale @pl
preferred label: Tratamento e revestimento de metais @pt
preferred label: Tratarea şi acoperirea metalelor @ro
preferred label: Обработка металлов и нанесение покрытий на металлы @ru
preferred label: Opracovanie a povrchová úprava kovov @sk
preferred label: Površinska obdelava in prekrivanje kovin @sl
preferred label: Beläggning och överdragning av metall @sv
preferred label: Metallerin işlenmesi ve kaplanması @tr
broader: Treatment and coating of metals; machining

Machining
type: Concept
notation: 25.62
status: valid
status modified: 2013-10-18
accepted date: 2013-10-18
in scheme: Statistical Classification of Economic Activities in the European Community, Rev. 2 (2008)
scope note: - пробиване, струговане, фрезоване, ерозиране, шлифоване, прошиване, изравняване, нарязване, заостряне, полиране, запояване, снаждане и друго обработване на метал и метални части - рязане и надписване на метал с лазер - подковаване на коне - 01.62 - услуги "Докато чакаш" по гравиране на метал - 95.25 @bg
scope note: Z: - vrtání, soustružení, frézování, erodování, hoblování, lapování, protahování, ohýbání, řezání, broušení, ostření, leštění, sváření, obrážení atd. kovových obrobků - řezání a popisování kovů laserovými paprsky N: - činnosti podkovářů (01.62) - gravírování jako službu poskytovanou na počkání (95.25) @cs
scope note: Diese Klasse umfasst: - Bohren, Drehen, Fräsen, Erodieren, Hobeln, Läppen, Räumen, Richten, Sägen, Schleifen, Schärfen, Schweißen, Stoßen usw. von metallischen Werkstücken - Schneiden und Beschriften von Metall durch Laserstrahlen Diese Klasse umfasst nicht: - Hufschmiedetätigkeiten (s. 01.62) @de
scope note: This class includes: - boring, turning, milling, eroding, planing, lapping, broaching, levelling, sawing, grinding, sharpening, polishing, welding, splicing etc. of metalwork pieces - cutting of and writing on metals by means of laser beams This class excludes: - activities of farriers, see 01.62 @en
scope note: Esta clase comprende: - la perforación, el torneado, el fresado, la corrosión, el desbastado, la pulimentación, el punzado, el nivelado, el aserrado, el esmerilado, el afilado, el pulido, la soldadura, el empalme, etc., de piezas metálicas trabajadas - el corte de metales y la escritura sobre metal mediante rayos láser Esta clase no comprende: - las actividades de herraje (véase 01.62) - los servicios rápidos de grabado (véase 95.25) @es
scope note: Cette classe comprend: - le perçage, le tournage, le fraisage, l’arasage, le rabotage, le rodage, le brochage, le dressage, le sciage, le meulage, l’affûtage, le polissage, le soudage, le mortaisage, etc., de pièces métalliques - le découpage et l’écriture sur des métaux au moyen de faisceaux laser Cette classe ne comprend pas: - les activités des maréchaux-ferrants, voir 01.62 @fr
scope note: Ovaj razred uključuje: - bušenje, glodanje, savijanje, struganje, ravnanje, poliranje, probadanje, poravnavanje, piljenje, brušenje, oštrenje, zavarivanje, sječenje, rezanje itd. metalnih predmeta - rezanje i upisivanje na metale laserskim zrakama Ovaj razred isključuje: - djelatnosti potkivanja, vidi 01.62 - usluge brzoga graviranja, vidi 95.29
scope note: Į šią klasę įeina: - atskirų metalo dirbinių gręžimas, tekinimas, frezavimas, ėsdinimas, drožimas, plokščiasis pritrynimas, skylių pramušimas, lyginimas, perpjovimas, plokščiasis šlifavimas, galandimas, poliravimas, suvirinimas, sujungimas ir kt. - metalų pjaustymas ir rašymas ant metalo lazerio spinduliuotės priemonėmis Į šią klasę neįeina: - kalvių veikla, žr. 01.62 - skubus graviravimo paslaugų teikimas, žr. 95.25 @lt
scope note: Этот класс включает: - производство навесных замков, врезных замков, ключей, шарниров и крючков, а также замков для мебели, автотранспортных средств, окон и т.д. @ru
scope note: Bu sınıf aşağıdakileri kapsamaktadır; - metal parçaların delinmesi, tornalanması, frezelenmesi, aşındırılması, rendelenmesi, parlatılması, oluk açılması, düzenlenmesi, testerelenmesi, perdahlanması, bilenmesi, kaynak yapılması, birleştirilmesi vb., - lazer ışınlarının kullanılması yoluyla metallerin kesilmesi veya üzerlerinin yazılması. Kapsam dışı olanlar; - nalbant faaliyetleri, bkz. 01.62, - anlık verilen oymacılık hizmetleri, bkz. 95.25. @tr
preferred label: Механично обработване на метал @bg
preferred label: Obrábění @cs
preferred label: Maskinforarbejdning @da
preferred label: Mechanik a. n. g. @de
preferred label: Μεταλλοτεχνία @el
preferred label: Ingeniería mecánica por cuenta de terceros @es
preferred label: Mehaaniline metallitöötlus @et
preferred label: Metallien työstö @fi
preferred label: Usinage @fr
preferred label: Fémmegmunkálás
preferred label: Lavori di meccanica generale @it
preferred label: Mechaninis apdirbimas @lt
preferred label: Mehāniskā apstrāde @lv
preferred label: Ħidma bil-magni @mt
preferred label: Verspanend bewerken van metalen @nl
preferred label: Bearbeiding av metaller @no
preferred label: Obróbka mechaniczna elementów metalowych @pl
preferred label: Actividades de mecânica geral @pt
preferred label: Operaţiuni de mecanică generală @ro
preferred label: Основные технологические процессы машиностроения @ru
preferred label: Obrábanie @sk
preferred label: Mehanska obdelava kovin @sl
preferred label: Metallegoarbeten @sv
preferred label: Metallerin makinede işlenmesi ve şekil verilmesi @tr
broader: Treatment and coating of metals; machining

Manufacture of cutlery, tools and general hardware
type: Concept
notation: 25.7
status: valid
status modified: 2013-10-18
accepted date: 2013-10-18
in scheme: Statistical Classification of Economic Activities in the European Community, Rev. 2 (2008)
scope note: Tato skupina zahrnuje výrobu nožířských výrobků, nástrojů, zámků, kování a jiných železářských výrobků z obecných kovů. @cs
scope note: Diese Gruppe umfasst die Herstellung von Schneidwaren, Werkzeugen, Schlössern und Beschlägen aus unedlen Metallen. @de
scope note: This group includes the manufacture of cutlery; metal hand tools and general hardware. @en
scope note: Este grupo comprende la fabricación de artículos de cuchillería y cubertería, herramientas y ferretería. @es
scope note: Ce groupe comprend la fabrication de coutellerie, d’outillage métallique et de quincaillerie. @fr
scope note: Ova skupina uključuje proizvodnju sječiva, metalnih ručnih alata te brava i okova.
scope note: Į šią grupę įeina valgomųjų įrankių, kitų metalinių įrankių ir bendrųjų metalo dirbinių gamyba. @lt
scope note: Этот класс включает: - производство ножей и прочих режущих предметов для техники или механических устройств - производство ручных инструментов, таких как, плоскогубцы, отвертки и т.д. - производство механических ручных сельскохозяйственных инструментов - производство пил и пилящих приспособлений, включая лезвия для циркулярных пил и бензопил - производство запасных частей для механических и ручных электрических инструментов или механических станков: дрелей, перфораторов, фрез и т.д. - производство прессовых штампов и пресс-форм - производство кузнечных инструментов: молотов, наковален и т.д. - производство отливочных форм (за исключением литейного оборудования) - производство тисков, зажимных устройств и приспособлений Этот класс исключает: - производство ручных электрических инструментов, см. 28.24 - производство литейного оборудования, см. 28.91 @ru
scope note: Bu grup, çatal-bıçak takımının, metal el aletlerinin ve genel hırdavat malzemelerinin imalatını kapsamaktadır. @tr
preferred label: Производство на кухненски прибори, инструменти и железария @bg
preferred label: Výroba nožířských výrobků, nástrojů a železářských výrobků @cs
preferred label: Fremstilling af bestik, skære- og klipperedskaber, håndværktøj og diverse metalprodukter @da
preferred label: Herstellung von Schneidwaren, Werkzeugen, Schlössern und Beschlägen aus unedlen Metallen @de
preferred label: Κατασκευή μαχαιροπήρουνων, εργαλείων και σιδηρικών @el
preferred label: Fabricación de artículos de cuchillería y cubertería, herramientas y ferretería @es
preferred label: Lõike- ja tööriistade ning rauakaupade tootmine @et
preferred label: Ruokailu- ja leikkuuvälineiden yms. sekä työkalujen ja rautatavaran valmistus @fi
preferred label: Fabrication de coutellerie, d'outillage et de quincaillerie @fr
preferred label: Evőeszköz, szerszám, általános fémáru gyártása
preferred label: Fabbricazione di articoli di coltelleria, utensili e oggetti di ferramenta @it
preferred label: Valgomųjų įrankių, kitų įrankių ir bendrųjų metalo dirbinių gamyba @lt
preferred label: Galda piederumu, darbarīku un metāla izstrādājumu ražošana @lv
preferred label: Manifattura ta' pożati, għodod u oġġetti ta' ferramenta @mt
preferred label: Vervaardiging van scharen, messen, bestekken, gereedschap en ijzerwaren @nl
preferred label: Produksjon av kjøkkenredskaper, skjære- og klipperedskaper, håndverktøy og andre jernvarer @no
preferred label: Produkcja wyrobów nożowniczych, sztućców, narzędzi i wyrobów metalowych ogólnego przeznaczenia @pl
preferred label: Fabricação de cutelaria, ferramentas e ferragens @pt
preferred label: Producţia de unelte şi articole de fierărie @ro
preferred label: Производство столовых приборов, ручных металлических инструментов и металлических изделий общего назначения @ru
preferred label: Výroba nožiarskych výrobkov, náradia a železiarskeho tovaru @sk
preferred label: Proizvodnja jedilnega pribora, ključavnic, okovja, orodja @sl
preferred label: Tillverkning av bestick, verktyg och andra järnhandelsvaror @sv
preferred label: Çatal-bıçak takımı ve diğer kesici aletler ile el aletleri ve genel hırdavat malzemeleri imalatı @tr
broader: Manufacture of fabricated metal products, except machinery and equipment
narrower: Manufacture of cutlery
narrower: Manufacture of locks and hinges
narrower: Manufacture of tools

Manufacture of cutlery
type: Concept
notation: 25.71
status: valid
status modified: 2013-10-18
accepted date: 2013-10-18
in scheme: Statistical Classification of Economic Activities in the European Community, Rev. 2 (2008)
scope note: - производство на кухненски прибори за хранене (вилици, лъжици, ножове и други) - производство на други ножарски изделия: • сатъри и секири • бръсначи, самобръсначки и техните ножчета • ножици, градинарски ножици, ножове за разрязване на хартия или за отваряне на писма, острилки, инструменти за маникюр или педикюр и други- производство на саби, мечове, щикове, копия и други хладни оръжия - производство на домакински съдове и изделия, от неблагородни метали- 25.99 - производство на кухненски прибори и ножарски изделия, от благородни метали - 32.12 @bg
scope note: Z: - výrobu kuchyňských a jídelních příborů (jako jsou nože, vidličky, lžíce atd.) - výrobu jiných nožířských výrobků: • řeznických nožů a sekáčků • břitev a žiletek • nůžek, strojků na stříhaní vlasů - výrobu mačet, mečů, bajonetů atd. N: - výrobu kuchyňského nádobí (hrnců, kotlů apod.) a stolního nádobí (mís, táců, talířů apod.) (25.99) - výrobu příborů z drahých kovů (32.12) @cs
scope note: Diese Klasse umfasst: - Herstellung von Haushaltsbesteck und -schneidwaren wie Messer, Gabeln, Löffel usw. - Herstellung von anderen Schneidwaren und Bestecken: • Hackmesser und Küchenbeile • Rasiermesser und -klingen • Scheren, Haarschneide- und -scherapparate - Herstellung von Buschmessern, Schwertern, Bajonetten usw. Diese Klasse umfasst nicht: - Herstellung von Kochgeschirr (Töpfe, Kessel) und Tafelgeschirr (Schüsseln, Platten, Teller usw.) (s. 25.99) - Herstellung von Besteck aus Edelmetallen (s. 32.12) @de
scope note: This class includes: - manufacture of domestic cutlery such as knives, forks, spoons etc. - manufacture of other articles of cutlery: • cleavers and choppers • razors and razor blades • scissors and hair clippers - manufacture of cutlasses, swords, bayonets etc. This class excludes: - manufacture of hollowware (pots, kettles etc.), dinnerware (bowls, platters etc.) or flatware (plates, saucers etc.), see 25.99 - manufacture of cutlery of precious metal, see 32.12 @en
scope note: Esta clase comprende: - la fabricación de artículos de cuchillería y cubertería de uso doméstico, como cuchillos, tenedores, cucharas, etc. - la fabricación de otros artículos de cuchillería: • destrales y cuchillos de carnicero • navajas y cuchillas de afeitar • tijeras y máquinas de cortar el pelo - la fabricación de machetes, espadas, bayonetas, etc. Esta clase no comprende: - la fabricación de baterías de cocina (cacerolas, teteras, etc.), o vajillas (ensaladeras, fuentes, platos, etc.) (véase 25.99) - la fabricación de cuberterías de metales preciosos (véase 32.12) @es
scope note: Cette classe comprend: - la fabrication de coutellerie domestique: couteaux, fourchettes, cuillères, etc. - la fabrication d’autres articles de coutellerie: • fendoirs et couperets • rasoirs et lames pour rasoirs • ciseaux et tondeuses à cheveux - la fabrication de sabres, d’épées, de baïonnettes, etc. Cette classe ne comprend pas: - la fabrication de bols (pots, bouilloires, etc.), de vaisselle de table (saladiers, plats, etc.) ou de vaisselle plate (plateaux, soucoupes, etc.), voir 25.99 - la fabrication d’articles de coutellerie en métaux précieux, voir 32.12 @fr
scope note: Ovaj razred uključuje: - proizvodnju pribora za jelo kao što su noževi, vilice, žlice itd. - proizvodnju različitih proizvoda za rezanje i sječenje: • sjekirica i strojeva za sjeckanje • britvi i žileta • škara i aparata za šišanje - proizvodnju sablji, mačeva, bajuneta itd. Ovaj razred isključuje: - proizvodnju šupljih predmeta (lonaca, kotlića itd.), predmeta za ručak (zdjela, pladnjeva itd.) ili ravnih predmeta (tanjura, tanjurića itd.), vidi 25.99 - proizvodnju pribora za rezanje i posuđa od plemenitih metala, vidi 32.12
scope note: Į šią klasę įeina: - namų stalo įrankių, tokių kaip, peiliai, šakutės, šaukštai ir kt., gamyba - kitų pjaunamųjų reikmenų gamyba: • mėsos kapoklių ir mėsmalių • skustuvų ir skustuvų peiliukų • žirklių ir plaukų kirpimo mašinėlių - špagų, kardų, rapyrų ir kt., gamyba Į šią klasę neįeina: - gilių (puodelių, virdulių ir kt.), pietų (dubenėlių, pusdubenių ir kt.) ar plokščių (lėkščių, lėkštučių) indų gamyba, žr. 25.99 - valgomųjų įrankių iš tauriųjų metalų gamyba, žr. 32.12 @lt
scope note: Данная группа включает производство различных металлических изделий, таких как, жестяные банки и ведра; гвозди, болты, гайки и муфты; металлические приспособления бытового назначения; винты и якоря для плавающих судов; составляющие для сборки рельсовых путей и т.п. бытового и промышленного назначения. @ru
scope note: Bu sınıf aşağıdakileri kapsamaktadır; - bıçak, çatal, kaşık vb. gibi sofra takımlarının imalatı - diğer kesici aletlerin imalatı: •satırlar ve baltalar •usturalar ve tıraş bıçakları •makaslar ve elektriksiz saç kesme makineleri, - pala, kılıç, kasatura vb. imalatı. Kapsam dışı olanlar; -metal çukur yemek takımları (kadehler, tencereler vb.), yemek takımları (kaseler, servis tabakları vb.) veya sofra takımları (tabaklar, fincan tabakları vb.), imalatı, bkz. 25.99, - değerli metallerden çatal-bıçak takımı imalatı, bkz. 32.12. @tr
preferred label: Производство на кухненски прибори и ножарски изделия @bg
preferred label: Výroba nožířských výrobků @cs
preferred label: Fremstilling af bestik, skære- og klipperedskaber @da
preferred label: Herstellung von Schneidwaren und Bestecken aus unedlen Metallen @de
preferred label: Κατασκευή μαχαιροπήρουνων @el
preferred label: Fabricación de artículos de cuchillería y cubertería @es
preferred label: Lõike- ja söögiriistade tootmine @et
preferred label: Ruokailu- ja leikkuuvälineiden yms. valmistus @fi
preferred label: Fabrication de coutellerie @fr
preferred label: Evőeszköz gyártása
preferred label: Fabbricazione di articoli di coltelleria e posateria @it
preferred label: Valgomųjų ir kitų pjovimo įrankių gamyba @lt
preferred label: Galda piederumu ražošana @lv
preferred label: Manifattura ta' pożati @mt
preferred label: Vervaardiging van scharen, messen, bestekken, enz. @nl
preferred label: Produksjon av kjøkkenredskaper og skjære- og klipperedskaper @no
preferred label: Produkcja wyrobów nożowniczych i sztućców @pl
preferred label: Fabricação de cutelaria @pt
preferred label: Fabricarea produselor de tăiat @ro
preferred label: Производство столовых приборов @ru
preferred label: Výroba nožiarskych výrobkov @sk
preferred label: Proizvodnja rezil in jedilnega pribora @sl
preferred label: Tillverkning av bestick @sv
preferred label: Çatal-bıçak takımları ve diğer kesici aletlerin imalatı @tr
broader: Manufacture of cutlery, tools and general hardware

Manufacture of locks and hinges
type: Concept
notation: 25.72
status: valid
status modified: 2013-10-18
accepted date: 2013-10-18
in scheme: Statistical Classification of Economic Activities in the European Community, Rev. 2 (2008)
scope note: - производство на катинари, ключалки, брави, ключове, резета, обков и подобни изделия за сгради, мебели, превозни средства @bg
scope note: Z: - výrobu visacích, vložkových a jiných zámků, bezpečnostních zástrček, závěsů, klíčů, kování a podobných výrobků z obecných kovů na dveře budov, nábytku, vozidel atd. @cs
scope note: Diese Klasse umfasst: - Herstellung von Vorhängeschlössern, Schlössern, Sicherheitsriegeln, Verschlüssen mit Schloss, Schlüsseln sowie Beschlägen und ähnlichen Waren aus unedlen Metallen für Türen von Gebäuden, Möbeln, Fahrzeugen usw. @de
scope note: This class includes: - manufacture of padlocks, locks, keys, hinges and the like, hardware for buildings, furniture, vehicles etc. @en
scope note: Esta clase comprende: - la fabricación de candados, cerraduras, llaves, bisagras y otros artículos similares de ferretería para edificios, muebles, vehículos, etc. @es
scope note: Cette classe comprend: - la fabrication de serrures, de cadenas, de verrous, de clés, de charnières et d’articles similaires de serrurerie pour le bâtiment, l’ameublement, les véhicules, etc. @fr
scope note: Ovaj razred uključuje: - proizvodnju lokota, brava, okova, ključeva i dr., za zgrade, namještaj, vozila itd.
scope note: Į šią klasę įeina: - pakabinamųjų ar įleidžiamųjų spynų, raktų, vyrių ir panašių metalo dirbinių pastatams, baldams, transporto priemonėms ir kt., gamyba @lt
scope note: Этот класс включает: - производство ведер, банок, бочек, емкостей, коробок Этот класс исключает: - производство цистерн и резервуаров, см. 25.2 @ru
scope note: Bu sınıf aşağıdakileri kapsamaktadır; - asma kilitler, kilitler, anahtarlar, menteşeler ve benzerleri ile binalar, mobilyalar, taşıtlar vb. için hırdavat ürünleri imalatı. @tr
preferred label: Производство на строителен и мебелен обков @bg
preferred label: Výroba zámků a kování @cs
preferred label: Fremstilling af låse og hængsler @da
preferred label: Herstellung von Schlössern und Beschlägen aus unedlen Metallen @de
preferred label: Κατασκευή κλειδαριών και μεντεσέδων @el
preferred label: Fabricación de cerraduras y herrajes @es
preferred label: Lukkude ja hingede tootmine @et
preferred label: Lukkojen ja saranoiden valmistus @fi
preferred label: Fabrication de serrures et de ferrures @fr
preferred label: Lakat-, zárgyártás
preferred label: Fabbricazione di serrature e cerniere @it
preferred label: Spynų ir vyrių gamyba @lt
preferred label: Slēdzeņu un eņģu ražošana @lv
preferred label: Manifattura ta' serraturi u ċappetti @mt
preferred label: Vervaardiging van hang- en sluitwerk @nl
preferred label: Produksjon av låser og beslag @no
preferred label: Produkcja zamków i zawiasów @pl
preferred label: Fabricação de fechaduras, dobradiças e outras ferragens @pt
preferred label: Fabricarea articolelor de feronerie @ro
preferred label: Производство замков, петель и шарниров @ru
preferred label: Výroba zámkov a pántov @sk
preferred label: Proizvodnja ključavnic, okovja @sl
preferred label: Tillverkning av lås och gångjärn @sv
preferred label: Kilit ve menteşe imalatı @tr
broader: Manufacture of cutlery, tools and general hardware

Manufacture of tools
type: Concept
notation: 25.73
status: valid
status modified: 2013-10-18
accepted date: 2013-10-18
in scheme: Statistical Classification of Economic Activities in the European Community, Rev. 2 (2008)
scope note: - производство на ножове и режещи остриета за машини или механични уреди - производство на инструменти за ръчна работа като клещи, гаечни ключове, отвертки, менгемета и други подобни - производство на селскостопански сечива и инструменти за ръчна работа - производство на триони и листове за тях, вкл. верижни и циркулярни триони - производство на сменяеми инструменти за инструменти за ръчна работа, механични или не, или за обработващи машини (например за щанцоване, нарязване на резби, пробиване, фрезоване, струговане) - производство на щампи - производство на ковашки инструменти: чукове, наковални и други - производство на формовъчни каси и леярски форми (без кокили) - производство на менгемета, затегателни приспособления - производство на преносими инструменти с вграден двигател - 28.24 - производство на кокили - 28.91 @bg
scope note: Z: - výrobu nožů a čepelí pro stroje nebo pro strojní zařízení - výrobu ručních nástrojů jako kleští, šroubováků atd. - výrobu zemědělského ručního nářadí a nástrojů - výrobu pilových listů, včetně řetězů, pásů a kotoučů k řetězovým a kotoučovým pilám - výrobu vyměnitelných částí nástrojů (s pohonem i bez pohonu) nebo obráběcích strojů: vrtáků, raznic, důlčíků, průtažníků, frézovacích, soustružnických, závitových nožů atd. - výrobu lisovacích nástrojů - výrobu kovářských nástrojů např. kovadlin - výrobu formovacích rámů a forem (kromě kokil) - výrobu svěráků a svorek N: - výrobu ručních nástrojů s pohonem (28.24) - výrobu kokil (28.91) @cs
scope note: Diese Klasse umfasst: - Herstellung von Messern und Schneidklingen für Maschinen oder mechanische Geräte - Herstellung von Handwerkzeugen wie Kneifzangen, Schraubendreher usw. - Herstellung von handgeführten landwirtschaftlichen Werkzeugen ohne Motorantrieb - Herstellung von Sägen und Sägeblättern einschließlich Kreissägeblätter und Sägeketten - Herstellung von auswechselbaren Werkzeugen zur Verwendung in auch handgeführten Werkzeugen mit Motorantrieb oder in Werkzeugmaschinen: Bohr-, Stanz-, Zieh-, Fräs-, Dreh-, Reib- und Senk-, Räum-, Gewinde-, Verzahnwerkzeuge usw. - Herstellung von Presswerkzeugen - Herstellung von Schmiedewerkzeugen: Schmieden, Ambosse usw. - Herstellung von Formkästen und Formen (außer Blockformen) - Herstellung von Schraubstöcken und Schraubzwingen Diese Klasse umfasst nicht: - Herstellung von handgeführten Werkzeugen mit Motorantrieb (s. 28.24) - Herstellung von Blockformen (s. 28.91) @de
scope note: This class includes: - manufacture of knives and cutting blades for machines or for mechanical appliances - manufacture of hand tools such as pliers, screwdrivers etc. - manufacture of non-power-driven agricultural hand tools - manufacture of saws and saw blades, including circular saw blades and chainsaw blades - manufacture of interchangeable tools for hand tools, whether or not power-operated, or for machine tools: drills, punches, milling cutters etc. - manufacture of press tools - manufacture of blacksmiths' tools: forges, anvils etc. - manufacture of moulding boxes and moulds (except ingot moulds) - manufacture of vices, clamps This class excludes: - manufacture of power-driven hand tools, see 28.24 - manufacture of ingot moulds, see 28.91 @en
scope note: Esta clase comprende: - la fabricación de cuchillas y hojas cortantes para máquinas y aparatos mecánicos - la fabricación de herramientas manuales, como alicates, destornilladores, etc. - la fabricación de herramientas agrícolas manuales no eléctricas - la fabricación de sierras y hojas de sierra, incluidas las hojas de sierras circulares y de sierras de cadena - la fabricación de útiles intercambiables para herramientas de mano, eléctricas o no, y para máquinas herramientas: brocas, punzones, fresas, etc. - la fabricación de herramientas de herrero: forjas, yunques, etc. - la fabricación de troqueles de estampación - la fabricación de cajas y moldes de fundición (excepto lingoteras) - la fabricación de tornillos de banco, abrazaderas Esta clase no comprende: - la fabricación de herramientas manuales eléctricas (véase 28.24) - la fabricación de lingoteras (véase 28.91) @es
scope note: Cette classe comprend: - la fabrication de couteaux et de lames tranchantes pour machines ou pour appareils mécaniques - la fabrication d’outils à main tels que pinces, tournevis, etc. - la fabrication d’outillage portatif agricole mécanique - la fabrication de scies et de lames de scies, y compris les lames de scies circulaires et de scies à chaîne - la fabrication d’outils interchangeables pour outillage à main, mécaniques ou non, ou pour machines-outils: forets, poinçons, matrices, fraises, etc. - la fabrication d’outils de presse - la fabrication d’outils de forgeron: forges, enclumes, etc. - la fabrication de châssis de fonderie et de moules (à l’exclusion des lingotières) - la fabrication d’étaux, de serre-joints Cette classe ne comprend pas: - la fabrication d’outils à main à moteur, voir 28.24 - la fabrication des lingotières, voir 28.91 @fr
scope note: Ovaj razred uključuje: - proizvodnju noževa i listova sjekača za strojeve ili za medicinske naprave - proizvodnju ručnog alata kao što su kliješta, odvijači itd. - proizvodnju neelektričnoga poljoprivrednoga ručnog alata - proizvodnju pila i metalnih listova za pile, uključujući kružne i lančane pile - proizvodnju zamjenjivog alata za ručni alat bez obzira na to je li električni ili nije te za strojni alat: bušilica, svrdla, odvijača, nareznica za navoj itd. - proizvodnju alatnih preša - proizvodnju kovačkog alata: čekića, nakovnja itd. - proizvodnju oblikovanih kutija i kalupa (osim oblikovanih metalnih blokova) - proizvodnju škripaca, stezaljki Ovaj razred isključuje: - proizvodnju ručnog alata na električni pogon, vidi 28.24 - proizvodnju oblikovanih metalnih blokova, vidi 28.91
scope note: Į šią klasę įeina: - mašinų ar mechaninių prietaisų peilių ir pjovimo geležčių gamyba - rankinių įrankių, tokių kaip replės, atsuktuvai ir kt., gamyba - rankinių nevariklinių žemės ūkio įrankių gamyba - pjūklų ir pjūklų geležčių, įskaitant diskinių ir grandininių pjūklų geležtes, gamyba - rankinių įrankių su varikliu ar be variklio ir staklių keičiamųjų įrankių: gręžtuvų, skylmušių, štampų, frezavimo pjoviklių gamyba - presavimo įrankių gamyba - kalvystės įrankių: žaizdrų, priekalų ir kt., gamyba - formadėžių ir liejimo formų, išskyrus luitadėžes, gamyba - spaustuvų, veržtuvų gamyba Į šią klasę neįeina: - rankinių variklinių įrankių gamyba, žr. 28.24 - luitadėžių gamyba, žr. 28.91 @lt
scope note: Этот класс включает: - производство консервных банок для пищевых продуктов, туб, коробок, ящиков - производство металлических крышек и других изделий для укупоривания @ru
scope note: Bu sınıf aşağıdakileri kapsamaktadır; - makineler veya mekanik cihazlar için bıçaklar ve kesici bıçak ağızlarının imalatı, - pense, tornavida vb. gibi el aletlerinin imalatı, - motor gücü kullanılmayan tarımsal el aletlerinin imalatı, - dairesel testere ve zincir testere bıçakları (ağızları) dahil, testere ve testere bıçakları imalatı, - motor gücüyle çalışsın ya da çalışmasın el aletleri veya takım tezgahları için birbiriyle değiştirilebilir aletlerin imalatı: matkap uçları, zımbalar (zımba uçları), freze bıçakları vb., - pres takımları - demirci aletlerinin imalatı: demirci ocağı, örs vb. - kalıp kutuları ve kalıp imalatı (külçe kalıpları hariç), - mengeneler, kıskaçlar imalatı. Kapsam dışı olanlar; - motorlu el aletleri imalatı, bkz. 28.24, - külçe (ingot) kalıpları imalatı, bkz. 28.91. @tr
preferred label: Производство на сечива и инструменти за ръчна работа @bg
preferred label: Výroba nástrojů a nářadí @cs
preferred label: Fremstilling af håndværktøj @da
preferred label: Herstellung von Werkzeugen @de
preferred label: Κατασκευή εργαλείων @el
preferred label: Fabricación de herramientas @es
preferred label: Tööriistade tootmine @et
preferred label: Työkalujen valmistus @fi
preferred label: Fabrication d'outillage @fr
preferred label: Szerszámgyártás
preferred label: Fabbricazione di utensileria @it
preferred label: Kitų įrankių gamyba @lt
preferred label: Darbarīku ražošana @lv
preferred label: Manifattura ta' għodod @mt
preferred label: Vervaardiging van gereedschap @nl
preferred label: Produksjon av håndverktøy @no
preferred label: Produkcja narzędzi @pl
preferred label: Fabricação de ferramentas @pt
preferred label: Fabricarea uneltelor @ro
preferred label: Производство инструментов @ru
preferred label: Výroba náradia @sk
preferred label: Proizvodnja orodja @sl
preferred label: Tillverkning av verktyg och redskap @sv
preferred label: El aletleri, takım tezgahları uçları, testere ağızları vb. imalatı @tr
broader: Manufacture of cutlery, tools and general hardware

Manufacture of other fabricated metal products
type: Concept
notation: 25.9
status: valid
status modified: 2013-10-18
accepted date: 2013-10-18
in scheme: Statistical Classification of Economic Activities in the European Community, Rev. 2 (2008)
scope note: производство на разнообразни метални изделия - варели и консервни кутии; гвоздеи, болтове и гайки; метални домакински и канцеларски изделия; гребни винтове и котви; сглобени неподвижни съоръжения за релсов път и други. @bg
scope note: Tato skupina zahrnuje výrobu různých druhů kovodělných výrobků pro nejrůznější použití, jako jsou plechovky a vědra; hřebíky, šrouby a matice; domácí potřeby z kovu; kovové součástky; lodní šrouby a kotvy; montované součásti pro železniční svršky atd. @cs
scope note: Diese Gruppe umfasst die Herstellung einer Vielzahl von Metallerzeugnissen für die verschiedensten Anwendungen im Haushalt und im kommerziellen Bereich, wie Dosen und Eimer; Nägel, Bolzen und Muttern; Hausrat aus Metall; Vorrichtungen aus Metall; Schiffsschrauben und Anker; montiertes Gleismaterial usw. @de
scope note: This group includes the manufacture of a variety of metal products, such as cans and buckets; nails, bolts and nuts; metal household articles; metal fixtures; ships propellers and anchors; assembled railway track fixtures etc. for a variety of household and industrial uses. @en
scope note: Este grupo comprende la fabricación de productos metálicos diversos, como botes y baldes; puntas, pernos y tuercas; artículos metálicos para el hogar; accesorios metálicos; hélices y anclas de barco; piezas y accesorios ensamblados para vías de ferrocarril, etc. para diversos usos domésticos e industriales. @es
scope note: Ce groupe comprend la fabrication d’un ensemble de produits métalliques, tels que des bidons et des tonneaux, clous, boulons et écrous, articles métalliques à usage domestique, accessoires métalliques, hélices et ancres de bateaux, équipements de voies ferrées assemblés etc., pour différents usages domestiques et industriels. @fr
scope note: Ova skupina uključuje proizvodnju različitih metalnih proizvoda kao što su konzerve i vjedra; čavli, vijci, metalni predmeti za kućanstvo, metalni pričvršćivači, brodski propeleri i sidra, pričvršćivači za sastavljanje željezničke tračnice itd., za najrazličitiju upotrebu u kućanstvu i u industriji.
scope note: Į šią grupę įeina įvairiausių metalo gaminių, tokių kaip skardinės ir kibirai; vinys, varžtai ir sraigtai; metaliniai namų apyvokos reikmenys; metaliniai tvirtikliai; laivų sraigtai ir inkarai; surenkamos geležinkelio kelio tvirtinimo detalės ir kt., skirtų namų ūkiams ir pramoniniam naudojimui, gamyba. @lt
scope note: Этот класс включает: - производство металлических кабелей, тросов, канатов и т.п. изделий - производство неизолированного металлического кабеля и изолированного кабеля, не предназначенного для электромонтажных работ - производство изолированного провода с сердечником - производство изделий, изготавливаемых из проволоки: колючей проволоки, проволоки для изготовления заграждающей сетки, грилей, сеток, тканевой основы и т.д. - изолированные электроды для электросварки - производство гвоздей и булавок - производство пружин (за исключением пружин для наручных часов): • пластинчатых, винтовых, стержневых пружин кружения • крепежных приспособлений для пружин - производство цепей, за исключением приводных цепей Этот класс исключает: - производство часов и пружин для часовых механизмов, см. 26.52 - производство электрического кабеля, см. 27.32 - производство приводных цепей, см. 28.15 @ru
scope note: Bu grup, evsel ve endüstriyel kullanıma yönelik teneke kutular ve kovalar; çiviler, cıvatalar ve cıvata somunları; metal ev eşyaları; metal sabit eşyalar; gemi pervaneleri ve çapaları; birleştirilmiş demiryolu ray donanımları vb. gibi çeşitli metal ürünlerin imalatını kapsamaktadır. @tr
preferred label: Производство на други метални изделия @bg
preferred label: Výroba ostatních kovodělných výrobků @cs
preferred label: Fremstilling af andre færdige metalprodukter @da
preferred label: Herstellung von sonstigen Metallwaren @de
preferred label: Κατασκευή άλλων μεταλλικών προϊόντων @el
preferred label: Fabricación de otros productos metálicos @es
preferred label: Muude metalltoodete tootmine @et
preferred label: Muu metallituotteiden valmistus @fi
preferred label: Fabrication d'autres ouvrages en métaux @fr
preferred label: Egyéb fémfeldolgozási termék gyártása
preferred label: Fabbricazione di altri prodotti in metallo @it
preferred label: Kitų metalo gaminių gamyba @lt
preferred label: Pārējo gatavo metālizstrādājumu ražošana @lv
preferred label: Manifattura ta' prodotti oħra tal-metall iffabrikat @mt
preferred label: Vervaardiging van andere producten van metaal @nl
preferred label: Produksjon av andre metallvarer @no
preferred label: Produkcja pozostałych gotowych wyrobów metalowych @pl
preferred label: Fabricação de outros produtos metálicos @pt
preferred label: Fabricarea altor produse prelucrate din metal @ro
preferred label: Производство прочих готовых металлических изделий @ru
preferred label: Výroba ostatných kovových výrobkov @sk
preferred label: Proizvodnja drugih kovinskih izdelkov @sl
preferred label: Annan metallvarutillverkning @sv
preferred label: Diğer fabrikasyon metal ürünlerin imalatı @tr
broader: Manufacture of fabricated metal products, except machinery and equipment
narrower: Manufacture of steel drums and similar containers
narrower: Manufacture of light metal packaging
narrower: Manufacture of wire products, chain and springs
narrower: Manufacture of fasteners and screw machine products
narrower: Manufacture of other fabricated metal products n.e.c.

Manufacture of steel drums and similar containers
type: Concept
notation: 25.91
status: valid
status modified: 2013-10-18
accepted date: 2013-10-18
in scheme: Statistical Classification of Economic Activities in the European Community, Rev. 2 (2008)
scope note: - производство на варели, бидони, кофи, кутии и подобни съдове от стомана - производство на цистерни, резервоари и контейнери - 25.2 @bg
scope note: Z: - výrobu sudů, věder, kbelíků, krabic, plechovek N: - výrobu zásobníků a nádrží (25.2) @cs
scope note: Diese Klasse umfasst: - Eimer, Büchsen, Trommeln, Kübel, Kisten Diese Klasse umfasst nicht: - Herstellung von Tanks und Sammelbehältern (s. 25.2) @de
scope note: This class includes: - manufacture of pails, cans, drums, buckets, boxes This class excludes: - manufacture of tanks and reservoirs, see 25.2 @en
scope note: Esta clase comprende: - la fabricación de cubos, botes, bidones, baldes, cajas Esta clase no comprende: - la fabricación de cisternas y depósitos (véase 25.2) @es
scope note: Cette classe comprend: - la fabrication de seaux, de bidons, de tonneaux, de boîtes Cette classe ne comprend pas: - la fabrication de réservoirs et de citernes, voir 25.2 @fr
scope note: Ovaj razred uključuje: - proizvodnju vedara, limenki, bačava, kutija Ovaj razred isključuje: - proizvodnju cisterni i rezervoara, vidi 25.2
scope note: Į šią klasę įeina: - kibirų, skardinių, statinių, kaušų ir dėžių gamyba Į šią klasę neįeina: - cisternų ir rezervuarų gamyba, žr. 25.2 @lt
scope note: Этот класс включает: - производство заклепок и подобной продукции без резьбы - производство изделий, изготавливаемых на винторезном станке - производство болтов, винтов, гаек, муфт и прочей продукции с резьбой @ru
scope note: Bu sınıf aşağıdakileri kapsamaktadır; - kovalar, teneke kutular, variller, fıçılar ve kutuların imalatı. Kapsam dışı olanlar; - tankların ve rezervuarların imalatı, bkz. 25.2. @tr
preferred label: Производство на варели и подобни съдове от стомана @bg
preferred label: Výroba ocelových sudů a podobných nádob @cs
preferred label: Fremstilling af metaltønder og lignende beholdere @da
preferred label: Herstellung von Fässern, Trommeln, Dosen, Eimern u. ä. Behältern aus Metall @de
preferred label: Κατασκευή χαλύβδινων βαρελιών και παρόμοιων δοχείων @el
preferred label: Fabricación de bidones y toneles de hierro o acero @es
preferred label: Terasvaatide jms mahutite tootmine @et
preferred label: Metallipakkausten ja -astioiden valmistus @fi
preferred label: Fabrication de fûts et emballages métalliques similaires @fr
preferred label: Acél tárolóeszköz gyártása
preferred label: Fabbricazione di bidoni in acciaio e di contenitori analoghi @it
preferred label: Plieninių statinių ir panašių talpyklų gamyba @lt
preferred label: Cilindrisku metāla trauku un konteineru ražošana @lv
preferred label: Manifattura ta' tankijiet ta' l-azzar u kontenituri simili @mt
preferred label: Vervaardiging van stalen vaten en dergelijke @nl
preferred label: Produksjon av stålfat og lignende beholdere av jern og stål @no
preferred label: Produkcja pojemników metalowych @pl
preferred label: Fabricação de embalagens metálicas pesadas @pt
preferred label: Fabricarea de recipienţi, containere şi alte produse similare din oţel @ro
preferred label: Производство металлических бочек и аналогичных емкостей @ru
preferred label: Výroba oceľových zásobníkov a podobných kontajnerov @sk
preferred label: Proizvodnja jeklenih bobnov, sodov in podobnih posod @sl
preferred label: Tillverkning av stålfat o.d. behållare @sv
preferred label: Çelik varil ve benzer muhafazaların imalatı @tr
broader: Manufacture of other fabricated metal products

Manufacture of light metal packaging
type: Concept
notation: 25.92
status: valid
status modified: 2013-10-18
accepted date: 2013-10-18
in scheme: Statistical Classification of Economic Activities in the European Community, Rev. 2 (2008)
scope note: - производство на консервни кутии за хранителни продукти и напитки, гъвкави и твърди туби и други подобни - производство на запушалки, капачки, пломби и други приспособления за затваряне @bg
scope note: Z: - výrobu plechovek na potraviny, tub a krabic - výrobu kovových uzávěrů @cs
scope note: Diese Klasse umfasst: - Herstellung von Dosen und Kannen für Nahrungsmittel, Tuben und Schachteln - Herstellung von Metallverschlüssen @de
scope note: This class includes: - manufacture of tins and cans for food products, collapsible tubes and boxes - manufacture of metallic closures @en
scope note: Esta clase comprende: - la fabricación de latas de conservas, tubos y estuches ligeros - la fabricación de cierres metálicos @es
scope note: Cette classe comprend: - la fabrication de boîtes pour conserves alimentaires ainsi que de tubes et d’étuis souples - la fabrication d’articles métalliques de bouchage et de surbouchage @fr
scope note: Ovaj razred uključuje: - proizvodnju limenki i konzervi za prehrambene proizvode, sklopive tube i kutije - proizvodnju metalnih čepova
scope note: Į šią klasę įeina: - maisto produktų skardinių ir konservų dėžučių, lanksčiųjų tūtelių ir sulankstomųjų dėžučių gamyba - metalinių dangtelių gamyba @lt
scope note: Этот класс включает: - производство металлических изделий бытового назначения: • мелкой плоской посуды: тарелок, блюдец и т.д. • глубокой посуды: чайников, котлов и т.д. • столовой посуды: чашек, поддонов и т.д. • соусниц, сковородок и прочих не электрических столовых и кухонных приспособлений • мелких кухонных ручных принадлежностей и аксессуаров • металлических чистящих щеток - производство строительных компонентов из цинка: водосточных желобов, ванн, раковин, умывальников, покрытий для крыш и т.п. - производство изделий из металла офисного назначения, за исключением мебели - производство сейфов, армированных/бронированных дверей и т.д. - производство различных предметов из металла: • винтов и лопастей для плавающих судов • якорей • колоколов • комплектующих для укладки рельсовых путей • застежек, пряжек, крючков • металлических лестниц • металлических знаков, включая дорожные знаки - производство упаковочной фольги и изделий из нее - производство металлических постоянных магнитов - производство вакуумных металлических емкостей и бутылок - производство металлических эмблем, значков, кокард и прочих воинских знаков отличия - производство металлических бигуди, металлических ручек для зонтов и расчесок Этот класс исключает: - производство рапир, штыков, см. 25.71 - производство тележек для покупок, см. 30.99 - производство металлической мебели, см. 31.01, 31.02, 31.09 - производство спортивных товаров, см. 32.30 - производство игр и игрушек, см. 32.40 @ru
scope note: Bu sınıf aşağıdakileri kapsamaktadır; - gıda ürünleri için konserve kutuları ve teneke kutular ile diş macunu, krem gibi kapaklı tüpler ve katlanabilir kutular imalatı, - metalik kapakların imalatı. @tr
preferred label: Производство на леки опаковки от метал @bg
preferred label: Výroba drobných kovových obalů @cs
preferred label: Fremstilling af letmetalemballage @da
preferred label: Herstellung von Verpackungen und Verschlüssen aus Eisen, Stahl und NE-Metall @de
preferred label: Κατασκευή ελαφρών μεταλλικών ειδών συσκευασίας @el
preferred label: Fabricación de envases y embalajes metálicos ligeros @es
preferred label: Kergmetalltaara tootmine @et
preferred label: Kevytmetallipakkausten valmistus @fi
preferred label: Fabrication d'emballages métalliques légers @fr
preferred label: Könnyűfém csomagolóeszköz gyártása
preferred label: Fabbricazione di imballaggi leggeri in metallo @it
preferred label: Lengvųjų metalų taros gamyba @lt
preferred label: Vieglā metāla iepakojuma ražošana @lv
preferred label: Manifattura ta' materjal ħafif għall-ippakkjar @mt
preferred label: Vervaardiging van verpakkingsmiddelen van licht metaal @nl
preferred label: Produksjon av emballasje av lettmetall @no
preferred label: Produkcja opakowań z metali lekkich @pl
preferred label: Fabricação de embalagens metálicas ligeiras @pt
preferred label: Fabricarea ambalajelor uşoare din metal @ro
preferred label: Производство упаковочного материала из легких металлов @ru
preferred label: Výroba obalov z ľahkých kovov @sk
preferred label: Proizvodnja lahke kovinske embalaže @sl
preferred label: Tillverkning av lättmetallförpackningar @sv
preferred label: Hafif metalden paketleme malzemeleri imalatı @tr
broader: Manufacture of other fabricated metal products

Manufacture of wire products, chain and springs
type: Concept
notation: 25.93
status: valid
status modified: 2013-10-18
accepted date: 2013-10-18
in scheme: Statistical Classification of Economic Activities in the European Community, Rev. 2 (2008)
scope note: - производство на метални кабели, въжета, сплитки - производство на кабели без електрическа изолация или на кабели с изолация, които не могат да бъдат използвани като проводници на електрическа енергия - производство на тръбен тел, обмазан или със сърцевина - производство на изделия от тел: бодлива тел, телена мрежа, решетки, метални платна - електроди за електродъгово заваряване - производство на гвоздеи, кабари и щифтове - производство на пружини, без пружини за часовници: • листови ресори, винтови пружини, торсионни прътови пружини • листове за ресори - производство на вериги със заварени звена, с напречно усилени звена, вериги за сняг, без верижни предавки - производство на пружини за часовници - 26.52 - производство на електрически проводници и кабели - 27.32 - производство на верижни предавки - 28.15 @bg
scope note: Z: - výrobu lanek, kabelů, lan, spletených pásků a podobných výrobků z kovu - výrobu izolovaných i neizolovaných kovových kabelů nevhodných pro vedení elektřiny - výrobu potaženého nebo plněného drátu - výrobu výrobků z drátu: ostnatého drátu, drátu na oplocení, mříží, pletiv, tkanin atd. - výrobu potažených elektrod pro svařování elektrickým obloukem - výrobu hřebíků - výrobu per a pružin (mimo hodinových a hodinkových per a pružin): • listových per, šroubových pružin, torzních pružin • listů pružnice - výrobu řetězů kromě řetězů pro přenos hnací síly N: - výrobu hodinových a hodinkových per a pružin (26.52) - výrobu drátu nebo kabelů pro vedení elektřiny (27.32) - výrobu řetězů pro přenos hnací síly (28.15) @cs
scope note: Diese Klasse umfasst: - Herstellung von Litzen, Kabeln, Seilen, geflochtenen Bändern und ähnlichen Erzeugnissen aus Metall - Herstellung von unisolierten Metallkabeln oder isolierten, als Stromleiter ungeeigneten Kabeln - Herstellung von umhülltem oder gefülltem Draht - Herstellung von Erzeugnissen aus Draht: Stacheldraht, Draht für Einzäunungen, Gitter, Geflechte, Gewebe usw. - beschichtete Elektroden für das Lichtbogenschweißen - Herstellung von Nägeln und Stiften - Herstellung von Federn (außer Uhrfedern): • Blattfedern, Schraubenfedern, Drehstabfedern • Federblätter - Herstellung von Ketten außer Kraftübertragungsketten Diese Klasse umfasst nicht: - Herstellung von Uhrfedern (s. 26.52) - Herstellung von Kabeln und Leitungen zur Stromübertragung (s. 27.32) - Herstellung von Kraftübertragungsketten (s. 28.15) @de
scope note: This class includes: - manufacture of metal cable, plaited bands and similar articles - manufacture of uninsulated metal cable or insulated cable not capable of being used as a conductor of electricity - manufacture of coated or cored wire - manufacture of articles made of wire: barbed wire, wire fencing, grill, netting, cloth etc. - coated electrodes for electric arc-welding - manufacture of nails and pins - manufacture of springs (except watch springs): • leaf springs, helical springs, torsion bar springs • leaves for springs - manufacture of chain, except power transmission chain This class excludes: - manufacture of clock or watch springs, see 26.52 - manufacture of wire and cable for electricity transmission, see 27.32 - manufacture of power transmission chain, see 28.15 @en
scope note: Esta clase comprende: - la fabricación de cables metálicos, trenzas metálicas y artículos similares - la fabricación de cables de metal sin aislar o de cables aislados no utilizables como conductores de electricidad - la fabricación de alambre forrado o con núcleo - la fabricación de artículos de alambre: alambre de espino, vallas, enrejados, mallas, telas metálicas, etc. - electrodos recubiertos para soldadura de arco eléctrica - la fabricación de clavos y alfileres - la fabricación de muelles (excepto muelles de reloj): • ballestas, muelles helicoidales, barras de torsión • hojas para ballestas - la fabricación de cadenas, salvo cadenas de transmisión Esta clase no comprende: - la fabricación de muelles de reloj (véase 26.52) - la fabricación de hilos y cables para transmisión de energía eléctrica (véase 27.32) - la fabricación de cadenas de transmisión (véase 28.15) @es
scope note: Cette classe comprend: - la fabrication de câbles métalliques, de tresses métalliques et d’articles similaires - la fabrication de câbles métalliques non isolés ou de câbles isolés qui ne peuvent pas être utilisés comme conducteurs pour l’électricité - la fabrication de fil enrobé ou fourré - la fabrication d’articles en fils métalliques: ronces artificielles, clôtures, grillages, treillis, toiles métalliques, etc. - la fabrication d’électrodes enrobées pour le soudage à l’arc électrique - la fabrication de clous et de punaises - la fabrication de ressorts (à l’exception des ressorts d’horlogerie): • ressorts à lames, ressorts hélicoïdaux, barres de torsion • lames de ressorts - la fabrication de chaînes, à l’exception des chaînes pour la transmission de l’énergie Cette classe ne comprend pas: - la fabrication de ressorts d’horlogerie, voir 26.52 - la fabrication de fils et de câbles pour le transport de l’électricité, voir 27.32 - la fabrication de chaînes pour la transmission de l’énergie, voir 28.15 @fr
scope note: Ovaj razred uključuje: - proizvodnju metalnih kabela, upletenih žica i sličnih predmeta - proizvodnju neizoliranih metalnih kablova ili izoliranih kabela koji se ne mogu upotrijebiti kao vodiči električne energije - proizvodnju presvučene i punjene žice - proizvodnju predmeta od žice: bodljikave žice, žičane ograde, rešetke, mreže, pletiva itd. - presvučene elektrode za elektrolučno zavarivanje - proizvodnju čavala i klinaca - proizvodnju opruga (osim opruga za satove): • opruga na pero, spiralnih, s okretnom polugom • pera za opruge - proizvodnju lanaca, osim električnih transmisijskih lanaca Ovaj razred isključuje: - proizvodnju opruga za satove i ure, vidi, 26.52 - proizvodnju žica i kablova za prijenos električne energije, vidi 27.32 - proizvodnju električnih transmisijskih lanaca, vidi 28.15
scope note: Į šią klasę įeina: - metalinių lynų, pintų juostų ir panašių dirbinių gamyba - neizoliuotųjų metalinių lynų ar izoliuotųjų lynų, kurių negalima panaudoti kaip srovės laidininkų, gamyba - padengtos vielos ar laido su šerdimi gamyba - vielinių dirbinių: spygliuotosios vielos, vielinių aptvarų, grotelių, tinklų, vielinio audinio ir kt., gamyba - dengtų suvirinimo elektros lanku elektrodų gamyba - vinių ir smeigtukų gamyba - spyruoklių gamyba, išskyrus laikrodžių spyruokles: • sąvarinių spyruoklių, sraigtinių spyruoklių, juostinių (linginių) spyruoklių • spyruoklių atramų - grandinių, išskyrus pavarų grandines, gamyba Į šią klasę neįeina: - įvairių laikrodžių spyruoklių gamyba, žr. 26.52 - elektros perdavimo laidų ir kabelių gamyba, žr. 27.32 - pavarų grandinių gamyba, žr. 28.15 @lt
scope note: Данный раздел включает производство компьютеров, компьютерного периферийного оборудования, коммуникационного оборудования и подобных видов электронной продукции, а также производство составляющих и запасных частей для данной продукции. Производственные процессы данного раздела включают разработку, дизайн и использование интегрирующих схем и приспособлений, относящихся к узко специализированным высоким миниатюризированным технологиям. Данный раздел также включает производство электронных приборов для потребителей, измерительного, тестирующего и авиационного, иррадиационного, электромедицинского и электротерапевтического оборудования, оптических приборов и оборудования и оборудования для исследования магнитной и оптической среды. @ru
scope note: Bu sınıf aşağıdakileri kapsamaktadır; - metal kablo, örme halat ve benzeri ürünlerin imalatı, - elektrik iletkeni olarak kullanılmayan izole edilmiş veya edilmemiş metal halat imalatı, - kaplanmış veya nüveli teller, - telden yapılan ürünlerin imalatı: dikenli tel, telden çit, ızgara, file, giysi vb. - elektrik ark kaynağı için kaplanmış elektrotlar - çivi ve iğne imalatı, - yay imalatı (saat yayları hariç): •düz yaylar, helezoni yaylar, torsiyon (burulma) yayları, •yaylar için yapraklar. - zincir imalatı (güç aktarım zincirleri hariç), Kapsam dışı olanlar; - duvar veya kol saati yayları imalatı, bkz. 26.52, - elektrik iletimi için tel ve kablo imalatı, bkz. 27.32, - güç aktarım zincirleri imalatı, bkz. 28.15. @tr
preferred label: Производство на изделия от тел, вериги и пружини @bg
preferred label: Výroba drátěných výrobků, řetězů a pružin @cs
preferred label: Fremstilling af trådvarer, kæder og fjedre @da
preferred label: Herstellung von Drahtwaren, Ketten und Federn @de
preferred label: Κατασκευή ειδών από σύρμα, αλυσίδων και ελατηρίων @el
preferred label: Fabricación de productos de alambre, cadenas y muelles @es
preferred label: Traaditoodete, kettide ja vedrude tootmine @et
preferred label: Metallilankatuotteiden, ketjujen ja jousien valmistus @fi
preferred label: Fabrication d'articles en fils métalliques, de chaînes et de ressorts @fr
preferred label: Huzaltermék gyártása
preferred label: Fabbricazione di prodotti fabbricati con fili metallici, di catene e molle @it
preferred label: Vielos gaminių, grandinių ir spyruoklių gamyba @lt
preferred label: Stiepļu izstrādājumu, ķēžu un atsperu ražošana @lv
preferred label: Manifattura ta' prodotti tal-wajer, katina u molol @mt
preferred label: Vervaardiging van artikelen van draad en van kettingen en veren @nl
preferred label: Produksjon av varer av metalltråd, kjetting og fjærer @no
preferred label: Produkcja wyrobów z drutu, łańcuchów i sprężyn @pl
preferred label: Fabricação de produtos de arame, correntes e molas metálicas @pt
preferred label: Fabricarea articolelor din fire metalice; fabricarea de lanţuri şi arcuri @ro
preferred label: Производство изделий из проволоки, цепей и пружин @ru
preferred label: Výroba drôtených výrobkov, reťazí a pružín @sk
preferred label: Proizvodnja izdelkov iz žice, verig in vzmeti @sl
preferred label: Tillverkning av metalltrådvaror, kedjor och fjädrar @sv
preferred label: Tel ürünleri, zincirler ve yayların imalatı @tr
broader: Manufacture of other fabricated metal products

Manufacture of fasteners and screw machine products
type: Concept
notation: 25.94
status: valid
status modified: 2013-10-18
accepted date: 2013-10-18
in scheme: Statistical Classification of Economic Activities in the European Community, Rev. 2 (2008)
scope note: - производство на шайби, нитове, щифтове, шпонки и подобни изделия без резба - производство на винтове за метал, които имат глава с прав шлиц - производство на винтове, болтове, гайки и други изделия с резба @bg
scope note: Z: - výrobu nýtů, podložek a podobných výrobků bez závitů - výrobu výrobků s použitím závitnice - výrobu šroubů, matic a podobných výrobků se závity @cs
scope note: Diese Klasse umfasst: - Herstellung von Nieten, Unterlegscheiben und ähnlichen Waren ohne Gewinde - Herstellung von Waren mit Gewinde - Herstellung von Bolzen, Schrauben und Muttern und ähnlichen Erzeugnissen mit Gewinde @de
scope note: This class includes: - manufacture of rivets, washers and similar non-threaded products - manufacture of screw machine products - manufacture of bolts, screws, nuts and similar threaded products @en
scope note: Esta clase comprende: - la fabricación de remaches, arandelas y otros productos no roscados similares - la fabricación de artículos de tornillería - la fabricación de pernos, tornillos, tuercas y productos roscados similares @es
scope note: Cette classe comprend: - la fabrication de rivets, de rondelles et d’autres produits non filetés similaires - la fabrication d’articles de visserie - la fabrication de boulons, vis, écrous et d’autres produits filetés similaires @fr
scope note: Ovaj razred uključuje: - proizvodnju zateznih klinova i zakovica te sličnih proizvoda bez navoja - proizvodnju vijčanih strojnih proizvoda - proizvodnju vijaka, svornjaka, matica i sličnih proizvoda s navojem
scope note: Į šią klasę įeina: - kniedžių, poveržlių ir panašių nesrieginių gaminių gamyba - srieginių mašinų gaminių gamyba - varžtų, veržlių, sraigtų ir panašių srieginių gaminių gamyba @lt
scope note: Bu sınıf aşağıdakileri kapsamaktadır; - perçin çivilerinin, rondela, pul ve benzeri diş açılmamış ürünlerin imalatı, - vida makinesi ürünlerinin imalatı: - cıvataların, vidaların, vida somunlarının ve benzer dişli (vidalı) ürünlerin imalatı. @tr
preferred label: Производство на свързващи елементи @bg
preferred label: Výroba spojovacích materiálů a spojovacích výrobků se závity @cs
preferred label: Fremstilling af lukkeanordninger, bolte, skruer og møtrikker @da
preferred label: Herstellung von Schrauben und Nieten @de
preferred label: Κατασκευή συνδετήρων και προϊόντων κοχλιομηχανών @el
preferred label: Fabricación de pernos y productos de tornillería @es
preferred label: Kinnituselementide ja keermestatud toodete tootmine @et
preferred label: Kiinnittimien ja ruuvituotteiden valmistus @fi
preferred label: Fabrication de vis et de boulons @fr
preferred label: Kötőelem, csavar gyártása
preferred label: Fabbricazione di articoli di bulloneria @it
preferred label: Tvirtinimo detalių ir sriegimo mašinų gaminių gamyba @lt
preferred label: Spaiļu un skrūvju stiprinājumu izstrādājumu ražošana @lv
preferred label: Manifattura ta' ganċijiet u prodotti tal-magni li jinvitaw @mt
preferred label: Vervaardiging van bouten, schroeven en moeren @nl
preferred label: Produksjon av bolter og skruer @no
preferred label: Produkcja złączy i śrub @pl
preferred label: Fabricação de rebites, parafusos e porcas @pt
preferred label: Fabricarea de şuruburi, buloane şi alte articole filetate; fabricarea de nituri şi şaibe @ro
preferred label: Производство крепежных изделий @ru
preferred label: Výroba upínadiel, strojných skrutiek @sk
preferred label: Proizvodnja vijačnega materiala, vezi @sl
preferred label: Tillverkning av nitar och skruvar @sv
preferred label: Bağlantı malzemelerinin ve vida makinesi ürünlerinin imalatı @tr
broader: Manufacture of other fabricated metal products

Manufacture of other fabricated metal products n.e.c.
type: Concept
notation: 25.99
status: valid
status modified: 2013-10-18
accepted date: 2013-10-18
in scheme: Statistical Classification of Economic Activities in the European Community, Rev. 2 (2008)
scope note: - производство на метални домакински изделия или домашни потреби: • плоски - чинии, чинийки за чаши • метални съдове - котлета, тенджери • сервизи за хранене (купи, подноси и други) • тигани и други неелектрически кухненски съдове • малки кухненски уреди за ръчна работа - мелнички, рендета, месомелачки, белачки за зеленчуци и плодове • стоманена вълна за почистване - производство на строителни елементи от цинк: водосточни тръби, вани, мивки, легени и други подобни - производство на метални офис изделия, без мебели - производство на огнеупорни каси, касетки за съхранение, блиндирани врати и други - производство на други разнообразни изделия от неблагородни метали: • производство на гребни винтове и техните лопатки • котви • камбани • сглобени неподвижни съоръжения за релсов път • закопчалки, катарами, телени копчета • метални стълби • метални указателни табели, вкл. пътни знаци - производство на торби от метално фолио - производство на постоянни магнити и метални изделия, предназначени да станат постоянни магнити след намагнитване - производство на метални термоси и други изотермични съдове, чиято изолация се осигурява чрез вакуум - производство на различни метални знаци, вкл. военни отличителни знаци - производство на метални ролки за коса, гребени, метални дръжки и спици за чадъри - производство на саби, мечове, щикове, копия и други хладни оръжия - 25.71 - производство на колички за пазаруване - 30.99 - производство на метални мебели - 31.01, 31.02, 31.09 - производство на спортни стоки - 32.30 - производство на игри и детски играчки - 32.40 @bg
scope note: Z: - výrobu domácích potřeb z kovu: • plochého nádobí: talířů, podšálků atd. • kuchyňského nádobí: hrnců, kotlů, konvic atd. • stolního nádobí: mis, táců atd. • pánví a jiného neelektrického stolního nebo kuchyňského nádobí • drobných neelektrických kuchyňských nástrojů a příslušenství • kovových drátěnek - výrobu výrobků používaných ve stavebnictví ze zinku, mědi, železa nebo oceli: okapů, hřebenových plechů, koupacích van, umyvadel, dřezů apod. - výrobu kancelářského zboží z kovu (kromě nábytku) - výrobu bezpečnostních skříní, kazet, pancéřových dveří atd. - výrobu různých kovových výrobků: • lodních šroubů, vrtulí a lopatek • kotev • zvonů a gongů • montovaných součástí pro železniční svršky • spon, přezek, háčků • kovových žebříků • štítků, včetně orientačních tabulí (svislé dopravní značení), z kovu - výrobu foliových tašek - výrobu trvalých magnetů z kovu - výrobu termolahví a konvic (s vakuovou izolací) z kovu - výrobu kovových odznaků, řádů, medailí a vojenských epolet - výrobu kovových natáček do vlasů, držadel a koster deštníků, hřebenů - výrobu kovového závaží pro vzpírání N: - výrobu mačet, mečů, bajonetů atd. (25.71) - výrobu nákupních vozíků (30.99) - výrobu kovového nábytku (31.01, 31.02, 31.09) - výrobu sportovních potřeb (32.30) - výrobu her a hraček (32.40) @cs
scope note: Diese Klasse umfasst: - Herstellung von Haushaltsartikeln aus Metall: • flaches Geschirr: Teller, Untertassen usw. • Hohlgeschirr: Töpfe, Kessel usw. • Tafelgeschirr: Schüsseln, Platten usw. • Kochtöpfe, Bratpfannen und anderes nichtelektrisches Tisch- oder Kochgeschirr • nichtelektrische, handgeführte Kleingeräte und Zubehörteile für die Küche • Scheuerschwämme aus Metall - Herstellung von Bauelementen aus Zink: Regenrinnen, Firstbleche, Badewannen, Spül- und Waschbecken und ähnliche Waren - Herstellung von Büroartikeln aus Metall (ohne Möbel) - Herstellung von Panzerschränken, Kassetten, Panzertüren usw. - Herstellung von verschiedenen Metallwaren: • Schiffsschrauben und Flügel dafür • Anker • Glocken • montiertes Gleismaterial • Verschlüsse, Schnallen, Haken • Metallleitern • Schilder, einschließlich Straßenschilder, aus Metall - Herstellung von Folienbeuteln - Herstellung von Dauermagneten aus Metall - Herstellung von Thermoskannen und –flaschen (mit Vakuumisolierung) aus Metall - Herstellung von Orden und Ehrenzeichen sowie militärischen Rangabzeichen, aus Metall - Herstellung von Haarwicklern, Schirmgriffen und -gestellen sowie Kämmen, aus Metall Diese Klasse umfasst nicht: - Herstellung von Buschmessern, Schwertern, Bajonetten usw. (s. 25.71) - Herstellung von Einkaufswagen (s. 30.99) - Herstellung von Metallmöbeln (s. 31.01, 31.02, 31.09) - Herstellung von Sportartikeln (s. 32.30) - Herstellung von Spielwaren (s. 32.40) @de
scope note: This class includes: - manufacture of metal household articles: • flatware: plates, saucers etc. • hollowware: pots, kettles etc. • dinnerware: bowls, platters etc. • saucepans, frying pans and other non-electrical utensils for use at the table or in the kitchen • small hand-operated kitchen appliances and accessories • metal scouring pads - manufacture of building components of zinc: gutters, roof capping, baths, sinks, washbasins and similar articles - manufacture of metal goods for office use, except furniture - manufacture of safes, strongboxes, armoured doors etc. - manufacture of various metal articles: • ship propellers and blades thereof • anchors • bells • assembled railway track fixtures • clasps, buckles, hooks • metal ladder • metal signs, including road signs - manufacture of foil bags - manufacture of permanent metallic magnets - manufacture of metal vacuum jugs and bottles - manufacture of metal badges and metal military insignia - manufacture of metal hair curlers, metal umbrella handles and frames, combs This class excludes: - manufacture of swords, bayonets, see 25.71 - manufacture of shopping carts, see 30.99 - manufacture of metal furniture, see 31.01, 31.02, 31.09 - manufacture of sports goods, see 32.30 - manufacture of games and toys, see 32.40 @en
scope note: Esta clase comprende: - la fabricación de artículos metálicos para el hogar: • vajillas: fuentes, platos, etc. • baterías de cocina: cacerolas, recipientes para hervir agua, etc. • servicios de mesa: ensaladeras, bandejas, etc. • cacerolas, sartenes y otros utensilios no eléctricos de mesa o de cocina • pequeños aparatos y accesorios manuales de cocina • estropajos metálicos - la fabricación de elementos estructurales de cinc: canalones, caballetes para tejados, bañeras, fregaderos, lavabos y artículos similares - la fabricación de artículos metálicos de oficina, excepto mobiliario - la fabricación de armarios blindados, cajas fuertes, puertas blindadas, etc. - la fabricación de utensilios de metal diversos: • hélices de barco y palas para hélices • anclas • campanas • accesorios ensamblados para vías de ferrocarril • cierres, hebillas, ganchos • escaleras metálicas de mano • letreros metálicos, incluidas señales de tráfico - la fabricación de bolsas de papel de aluminio o de otros metales - la fabricación de imanes metálicos permanentes - la fabricación de jarras y botellas metálicas de vacío - la fabricación de distintivos e insignias militares metálicos - la fabricación de rulos y bigudíes, mangos y varillas de paraguas y peines de metal Esta clase no comprende: - la fabricación de espadas, bayonetas, etc. (véase 25.71) - la fabricación de carros de la compra (véase 30.99) - la fabricación de mobiliario metálico (véanse 31.01, 31.02 y 31.09) - la fabricación de artículos de deporte (véase 32.30) - la fabricación de juegos y juguetes (véase 32.40) @es
scope note: Cette classe comprend: - la fabrication d’articles métalliques à usage domestique: • vaisselle plate: plateaux, soucoupes, etc. • bols: pots, bouilloires, etc. • vaisselle de table: saladiers, plats, etc. • casseroles, poêles à frire et autres ustensiles non électriques pour la table et la cuisine • petits appareils et accessoires de cuisine pour utilisation à la main • pailles de fer - la fabrication d’éléments pour la construction (gouttières, faîtage) et de baignoires, d’éviers, de bassines et d’articles similaires, en zinc - la fabrication d’articles métalliques pour le bureau, à l’exception du mobilier - la fabrication de coffres-forts, de portes blindées, etc. - la fabrication de divers articles en métal: • hélices de bateau et leurs pales • ancres • cloches • équipements de voies ferrées assemblés • fermoirs, boucles, crochets • échelle métallique • signaux métalliques, y compris panneaux de signalisation routière - la fabrication de sachets en feuilles d’aluminium - la fabrication d’aimants métalliques installés en permanence - la fabrication de bouteilles isolantes en métal - la fabrication d’insignes et de médailles militaires en métal - la fabrication de bigoudis en métal, de manches et de montures de parapluies, de peignes Cette classe ne comprend pas: - la fabrication de sabres, de baïonnettes, etc., voir 25.71 - la fabrication de chariots de magasin, voir 30.99 - la fabrication de meubles en métal, voir 31.01, 31.02 et 31.09 - la fabrication d’articles de sport, voir 32.30 - la fabrication de jeux et de jouets, voir 32.40 @fr
scope note: Ovaj razred uključuje: - proizvodnju metalnih predmeta za kućanstvo: • ravnih proizvoda: tanjura, tanjurića itd. • šupljih proizvoda: lonaca, kotlića itd. • proizvoda za ručak: zdjela, pladnjeva itd. • lonaca za pirjanje, tavica za pečenje i drugoga neelektričnog posuđa za upotrebu kod stola ili u kuhinji • male kuhinjske sprave i pribor na ručni pogon • metalnih podložaka za ribeže - proizvodnju ugradbenih elemenata od cinka: krovnih žljebova, pokrova, kada, sudopera, tuš-kabina i sličnih predmeta - proizvodnju metalne robe za uredsku upotrebu, osim namještaja - proizvodnju sefova, ormara i kasa, armiranih vrata itd. - proizvodnju različitih metalnih predmeta: • brodskih propelera i njihovih oštrica • sidara • zvona • pričvršćivača za sastavljanje željezničkih tračnica • spona, kopči, kuka • metalnih ljestvi • metalnih znakova, uključujući prometne znakove - proizvodnju metalnih vrećica - proizvodnju trajnih metalnih magneta - proizvodnju metalnih vakumiranih vrčeva i boca - proizvodnju metalnih značaka i vojnih metalnih simbola - proizvodnju metalnih uvijača za kosu, metalnih držača za kišobran i okvira, češljeva Ovaj razred isključuje: - proizvodnju mačeva i bajuneta, vidi 25.71 - proizvodnju kolica za kupnju, vidi 30.99 - proizvodnju metalnog namještaja, vidi 31.01, 31.02, 31.09 - proizvodnju sportske robe, vidi 32.30 - proizvodnju igara i igračaka, vidi 32.40
scope note: Į šią klasę įeina: - metalinių namų apyvokos reikmenų gamyba: • plokščių indų: lėkščių, lėkštučių ir kt. • gilių indų: puodelių, virdulių ir kt. • pietų indų: dubenėlių, pusdubenių ir kt. • kaistuvų (puodų), keptuvių ir kitų neelektrinių virtuvės ar stalo reikmenų • mažų rankinių virtuvinių prietaisų ir reikmenų • metalinės šveitimo kempinės - statybinių cinko elementų: nutekamųjų stogo vamzdžių (stoglatakių), stogo dangų, vonių, kriauklių, praustuvių ir panašų gaminių gamyba - metalinių įstaigos reikmenų, išskyrus baldus, gamyba - seifų, nedegamųjų spintų, šarvuotųjų durų ir kt., gamyba - įvairių metalo gaminių gamyba: • laivų sraigtų ir jų menčių • inkarų • varpų • surenkamų geležinkelio kelio tvirtinimo detalių gamyba • ąselių, sagčių, kabliukų • metalinių kopėčių • metalinių ženklų, įskaitant kelio ženklus - folijos maišelių gamyba - nuolatinių metalinių magnetų gamyba - metalinių vakuuminių ąsočių ir butelių gamyba - metalinių ženklelių, emblemų ir karinių pasižymėjimo ženklų gamyba - metalinių plaukų suktukų, metalinių skėčio rankenų ir rėmų, šukų gamyba Į šią klasę neįeina: - kardų, rapyrų gamyba, žr. 25.71 - prekių vežimėlių gamyba, žr. 30.99 - metalinių baldų gamyba, žr. 31.01, 31.02, 31.09 - sporto reikmenų gamyba, žr. 32.30 - žaidimų ir žaislų gamyba, žr. 32.40 @lt
scope note: Данный класс включает производство полупроводников и прочих компонентов для электронных приборов. Этот класс включает: - производство электронных конденсаторов - производство электронных резисторов - производство микропроцессоров - производство электронных трубок - производство электронных соединителей - производство пустых печатных схемных плат - производство интегральных/интегрирующих микросхем (аналоговых, цифровых или смешанных) - производство диодов, транзисторов и относящихся к ним дискретных устройств - производство индукторов (в т.ч. магнитных сердечников, катушек индуктивности, трансформаторов) и прочих электронных компонентов - производство электронных кристаллов и составляющих - производство соленоидов, переключателей и преобразователей для электронных приборов - производство полупроводниковых пластин, полупроводников, готовых и полуготовых - производство дисплеев и комплектующих (плазменных, полимерных, жидкокристаллических) - производство светодиодов (LED) Этот класс также включает: - производство кабелей для принтера, монитора, USB портов, соединителей и т.д. Этот класс исключает: - производство смарт-карт, см. 18.12 - производство компьютерных и телевизионных дисплеев, см. 26.20, 26.40 - производство модемов (несущего оборудования), см. 26.30 - производство рентгеновских трубок и подобных иррадиационных приборов, см. 26.60 - производство оптического оборудования, см. 26.70 - производство подобных комплектующих для электрооборудования, см. раздел 27 - производство флуоресцентных резисторов, см. 27.11 - производство электрических реле/переключателей, см. 27.12 - производство электропроводки, см. 27.33 - производство остального оборудования, классифицированного в прочих разделах, включающих описание оборудования @ru
scope note: Bu sınıf aşağıdakileri kapsamaktadır; - metal ev eşyaların imalatı: • düz tabaklar: tabaklar, fincan tabakları vb., • çukur takımlar: kupalar, demlikler, çaydanlıklar vb., • yemek takımları: kaseler, düz tabaklar vb., • tencereler, tavalar ve diğer masada ya da mutfakta kullanılan ve elektrikli olmayan mutfak aletleri, • el gücüyle çalıştırılan mutfak aletleri ve aksesuarları, • metal bulaşık telleri, - çinkodan yapı elemanlarının imalatı: Çatı olukları, çatı kaplamaları, küvetler, lavabolar, yıkama leğenleri ve benzer eşyalar - bürolarda kullanılmak üzere metal eşyaların imalatı (mobilyalar hariç), - kasaların, zırhlı kasaların, zırhlı kapıların vb. imalatı, - metalden yapılmış çeşitli eşyaların imalatı: • gemi pervaneleri ve bunlara ait kanatlar, • çapalar, • çanlar, • monte edilmiş demiryolu hatlarına ait tertibatlar, • tokalar, kopçalar, çengeller, olta iğneleri • metal merdivenler, • yol işaretleri dahil metal işaretler. - metal folyo çantaların (kutuların) imalatı, - kalıcı metalik mıknatısların imalatı, - metal sürahiler ve şişelerin imalatı, - metal rozetlerin ve rütbelerin imalatı, - metal saç bigudileri, metal şemsiye kulpları ve iskeletleri ile metal tarak imalatı. Kapsam dışı olanlar; - kılıçların, süngülerin, kasaturaların imalatı, bkz. 25.71, - alışveriş arabalarının imalatı, bkz. 30.99, - metal mobilya imalatı, bkz. 31.01, 31.02, 31.09, - spor malzemelerinin imalatı, bkz. 32.30, - oyunların ve oyuncakların imalatı, bkz. 32.40. @tr
preferred label: Производство на други метални изделия, некласифицирани другаде @bg
preferred label: Výroba ostatních kovodělných výrobků j. n. @cs
preferred label: Fremstilling af andre færdige metalprodukter i.a.n. @da
preferred label: Herstellung von sonstigen Metallwaren a. n. g. @de
preferred label: Κατασκευή άλλων μεταλλικών προϊόντων π.δ.κ.α. @el
preferred label: Fabricación de otros productos metálicos n.c.o.p. @es
preferred label: Mujal liigitamata metalltoodete tootmine @et
preferred label: Muiden metallituotteiden valmistus @fi
preferred label: Fabrication d'autres produits métalliques n.c.a. @fr
preferred label: M.n.s.egyéb fémfeldolgozási termék gyártása
preferred label: Fabbricazione di altri prodotti in metallo n.c.a. @it
preferred label: Kitų, niekur kitur nepriskirtų, metalo gaminių gamyba @lt
preferred label: Citur neklasificētu gatavo metālizstrādājumu ražošana @lv
preferred label: Manifattura ta' prodotti oħra tal-metall iffabbrikat n.e.c. @mt
preferred label: Vervaardiging van andere producten van metaal, n.e.g. @nl
preferred label: Produksjon av metallvarer ikke nevnt annet sted @no
preferred label: Produkcja pozostałych gotowych wyrobów metalowych, gdzie indziej niesklasyfikowana @pl
preferred label: Fabricação de outros produtos metálicos, n.e. @pt
preferred label: Fabricarea altor articole din metal n.c.a. @ro
preferred label: Производство прочих готовых металлических изделий, не включенных в другие категории @ru
preferred label: Výroba ostatných kovových výrobkov i. n. @sk
preferred label: Proizvodnja drugje nerazvrščenih kovinskih izdelkov @sl
preferred label: Diverse övrig metallvarutillverkning @sv
preferred label: Başka yerde sınıflandırılmamış diğer fabrikasyon metal ürünlerin imalatı @tr
broader: Manufacture of other fabricated metal products

Manufacture of computer, electronic and optical products
type: Concept
notation: 26
status: valid
status modified: 2013-10-18
accepted date: 2013-10-18
in scheme: Statistical Classification of Economic Activities in the European Community, Rev. 2 (2008)
scope note: производство на компютри, периферни устройства, далекосъобщителна техника и подобни електронни продукти, както и производството на елементи за тези продукти. Характерна особеност на производственият процес в този раздел е прилагането на силно специализирани миниатюризирани технологии, както и проектирането и използването на интегрални схеми. производството на битова електроника; уреди и апарати за измерване, проверка, изпитване и навигация; излъчващи електромедицински и терапевтични апарати; оптични уреди и апарати; магнитни и оптични носители. @bg
scope note: Tento oddíl zahrnuje výrobu počítačů, periferních zařízení, telekomunikačních přístrojů a podobných elektronických výrobků včetně jejich komponentů a dílů. Charakteristickým znakem výrobních procesů zařazených do tohoto oddílu je navrhování a používání integrovaných obvodů a vysoce specializovaných miniaturních technologií. Tento oddíl zahrnuje také výrobu přístrojů spotřební elektroniky; meřicích, testovacích, kontrolních, navigačních, řídicích, ozařovacích, elektroléčebných, elektroterapeutických a optických přístrojů a zařízení a také výrobu magnetických a optických médií (nosičů dat). @cs
scope note: Diese Abteilung umfasst die Herstellung von Computern, peripheren Geräten, Telekommunikationsgeräten und ähnlichen elektronischen Erzeugnissen sowie von entsprechenden Produktkomponenten. Charakteristisches Merkmal der in diese Abteilung eingeordneten Herstellungsprozesse ist der Entwurf und die Anwendung von integrierten Schaltungen sowie die Anwendung hoch spezialisierter Miniaturisierungstechnologien. Diese Abteilung umfasst auch die Herstellung von Geräten der Unterhaltungselektronik, Mess-, Kontroll-, Navigations- und Steuerungsinstrumenten, Bestrahlungs- und Elektrotherapiegeräten, elektromedizinischen Geräten, optischen Instrumenten und Geräten sowie magnetischen und optischen Datenträgern. @de
scope note: This division includes the manufacture of computers, computer peripherals, communications equipment, and similar electronic products, as well as the manufacture of components for such products. Production processes of this division are characterised by the design and use of integrated circuits and the application of highly specialised miniaturisation technologies. The division also contains the manufacture of consumer electronics, measuring, testing and navigating equipment, irradiation, electromedical and electrotherapeutic equipment, optical instruments and equipment, and the manufacture of magnetic and optical media. @en
scope note: Esta división comprende la fabricación de ordenadores, periféricos, equipos de comunicación y productos electrónicos similares, así como la fabricación de componentes para tales productos. Los procesos de producción de esta división se caracterizan por el diseño y el uso de circuitos integrados y la aplicación de tecnologías de miniaturización altamente especializadas. La división comprende asimismo la fabricación de productos de electrónica de consumo, equipos de medida, verificación y navegación, dispositivos de radiación, electromédicos y electroterapéuticos, e instrumentos y equipos ópticos, así como la fabricación de soportes magnéticos y ópticos. @es
scope note: Cette division couvre la fabrication d’ordinateurs, d’équipements informatiques périphériques, d’équipements de communication et de produits électroniques similaires, ainsi que la fabrication de composants pour ces produits. Les processus de production dans cette division se caractérisent par la conception et l’utilisation de circuits intégrés et l’application de technologies de miniaturisation extrêmement spécialisées. Cette division comprend également la fabrication de produits électroniques grand public, d’instruments de mesure de contrôle et de navigation, d’équipements d’irradiation médicale, d’équipements électromédicaux et électrothérapeutiques, d’équipements et d’instruments optiques, ainsi que la fabrication de supports magnétiques et optiques. @fr
scope note: Ovaj odjeljak uključuje proizvodnju računala, periferne i komunikacijske računalne opreme te sličnih elektroničkih proizvoda, kao i proizvodnju komponenata za te proizvode. Proizvodni proces ovog odjeljka karakterizira izgled i upotreba integriranog sklopa te primjena visoko specijalizirane i minijaturizirane tehnologije. Ovaj odjeljak također uključuje proizvodnju elektronike za potrošače i mjerače, opreme za testiranje, upravljanje i kontrolne opreme, opreme za zračenje, elektromedicinske i elektroterapeutske opreme, optičkih instrumenata i opreme te proizvodnju magnetskih i optičkih medija.
scope note: Į šį skyrių įeina kompiuterių, jų išorinių įtaisų, ryšių įrangos ir panašių elektroninių gaminių gamyba, taip pat šių gaminių komponentų gamyba. Šio skyriaus gamybos procesai yra apibūdinami integrinių grandynų kūrimu ir naudojimu bei labai specializuotos miniatūrizacijos technologijų taikymu. Skyrius taip pat apima buitinės elektroninės aparatūros, matavimo, bandymų, navigacijos ir kontrolės įrangos, švitinimo, elektrinės medicinos ir elektrinės terapijos įrangos bei optinių prietaisų ir aparatų, taip pat magnetinių ir optinių laikmenų gamybą. @lt
scope note: Этот класс включает: - производство электронных панелей загрузки - производство компонентов загрузки для печатных схемных плат - производство интерфейсных карт/плат (в т.ч. звуковых, видео, управляющих и сетевых модемов) Этот класс исключает: - производство смарт-карт, см. 18.12 - производство пустых печатных схемных плат, см. 26.11 @ru
scope note: Bu bölüm, bilgisayarların, bilgisayar çevre birimlerinin, iletişim teçhizatının ve benzer elektronik ürünler ile bu tür ürünlerin parçalarının imalatını kapsamaktadır. Bu bölümdeki üretim süreci, entegre devrelerin tasarımı, kullanımı ve ileri derecede özel küçültme teknolojileriyle tanımlanmaktadır. Bu bölüm ayrıca, tüketici elektroniklerinin, ölçme, test etme, idare ve kontrol teçhizatının, ışın , elektromedikal ve elektroterapötik cihazların, optik aletlerin ve teçhizatların imalatı ile manyetik ve optik medyanın imalatını kapsamaktadır. @tr
preferred label: Производство на компютърна и комуникационна техника, електронни и оптични продукти @bg
preferred label: Výroba počítačů a elektronických a optických přístrojů a zařízení @cs
preferred label: Fremstilling af computere, elektroniske og optiske produkter @da
preferred label: Herstellung von Datenverarbeitungsgeräten, elektronischen und optischen Erzeugnissen @de
preferred label: Κατασκευή ηλεκτρονικών υπολογιστών, ηλεκτρονικών και οπτικών προϊόντων @el
preferred label: Fabricación de productos informáticos, electrónicos y ópticos @es
preferred label: Arvutite, elektroonika- ja optikaseadmete tootmine @et
preferred label: Tietokoneiden sekä elektronisten ja optisten tuotteiden valmistus @fi
preferred label: Fabrication de produits informatiques, électroniques et optiques @fr
preferred label: Számítógép, elektronikai, optikai termék gyártása
preferred label: Fabbricazione di computer e prodotti di elettronica e ottica @it
preferred label: Kompiuterinių, elektroninių ir optinių gaminių gamyba @lt
preferred label: Datoru, elektronisko un optisko iekārtu ražošana @lv
preferred label: Manifattura ta' prodotti tal-kompjuter, elettroniċi u ottiċi @mt
preferred label: Vervaardiging van informaticaproducten en van elektronische en optische producten @nl
preferred label: Produksjon av datamaskiner og elektroniske og optiske produkter @no
preferred label: Produkcja komputerów, wyrobów elektronicznych i optycznych @pl
preferred label: Fabricação de equipamentos informáticos, equipamentos para comunicação, produtos electrónicos e ópticos @pt
preferred label: Fabricarea calculatoarelor şi a produselor electronice şi optice @ro
preferred label: Производство компьютеров, электронной и оптической продукции @ru
preferred label: Výroba počítačových, elektronických a optických výrobkov @sk
preferred label: Proizvodnja računalnikov, elektronskih in optičnih izdelkov @sl
preferred label: Tillverkning av datorer, elektronikvaror och optik @sv
preferred label: Bilgisayarların, elektronik ve optik ürünlerin imalatı @tr
broader: MANUFACTURING
narrower: Manufacture of electronic components and boards
narrower: Manufacture of computers and peripheral equipment
narrower: Manufacture of communication equipment
narrower: Manufacture of consumer electronics
narrower: Manufacture of instruments and appliances for measuring, testing and navigation; watches and clocks
narrower: Manufacture of irradiation, electromedical and electrotherapeutic equipment
narrower: Manufacture of optical instruments and photographic equipment
narrower: Manufacture of magnetic and optical media

Manufacture of electronic components and boards
type: Concept
notation: 26.1
status: valid
status modified: 2013-10-18
accepted date: 2013-10-18
in scheme: Statistical Classification of Economic Activities in the European Community, Rev. 2 (2008)
preferred label: Производство на електронни елементи и печатни платки @bg
preferred label: Výroba elektronických součástek a desek @cs
preferred label: Fremstilling af elektroniske komponenter og plader @da
preferred label: Herstellung von elektronischen Bauelementen und Leiterplatten @de
preferred label: Κατασκευή ηλεκτρονικών εξαρτημάτων και πλακετών @el
preferred label: Fabricación de componentes electrónicos y circuitos impresos ensamblados @es
preferred label: Elektronkomponentide ja trükkplaatide tootmine @et
preferred label: Elektronisten komponenttien ja piirilevyjen valmistus @fi
preferred label: Fabrication de composants et cartes électroniques @fr
preferred label: Elektronikai alkatrész, áramköri kártya gyártása
preferred label: Fabbricazione di componenti elettronici e schede elettroniche @it
preferred label: Elektroninių komponentų ir plokščių gamyba @lt
preferred label: Elektronisko komponentu un plašu ražošana @lv
preferred label: Manifattura ta' komponenti elettroniċi u bordijiet @mt
preferred label: Vervaardiging van elektronische onderdelen en printplaten @nl
preferred label: Produksjon av elektroniske komponenter og kretskort @no
preferred label: Produkcja elektronicznych elementów i obwodów drukowanych @pl
preferred label: Fabricação de componentes electrónicos e placas @pt
preferred label: Fabricarea componentelor electronice @ro
preferred label: Производство электронных деталей и плат @ru
preferred label: Výroba elektronických komponentov a dosiek @sk
preferred label: Proizvodnja elektronskih komponent in plošč @sl
preferred label: Tillverkning av elektroniska komponenter och kretskort @sv
preferred label: Elektronik bileşenlerin ve devre kartlarının imalatı @tr
broader: Manufacture of computer, electronic and optical products
narrower: Manufacture of electronic components
narrower: Manufacture of loaded electronic boards

Manufacture of electronic components
type: Concept
notation: 26.11
status: valid
status modified: 2013-10-18
accepted date: 2013-10-18
in scheme: Statistical Classification of Economic Activities in the European Community, Rev. 2 (2008)
scope note: - производство на електронни кондензатори - производство на електронни резистори - производство на микропроцесори - производство на електронни тръби - производство на електронни съединители - производство на голи печатни платки - производство на интегрални схеми (аналогови, цифрови или хибридни) - производство на диоди, транзистори и свързаните дискретни елементи (схеми) - производство на индуктори (например дросели, бобини, трансформатори) с електронни елементи - производство на електронни кристали и монтирани пиезоелектрически кристали - производство на индукционни бобини, прекъсвачи и преобразуватели, за приложение в електрониката - производство на чипове и полупроводникови шайби (wafers), завършени или полузавършени - производство на елементи за дисплеи -плазма, полимери, течнокристални индикатори (LCD) - производство на светодиоди (LED) - производство на кабели за печатащи устройства и монитори, кабели с универсална серийна шина (USB), съединители и други - печатане на карти, съдържащи електронни интегрални схеми („smart“ карти) - 18.12 - производство на компютърни и телевизионни монитори - 26.20, 26.40 - производство на модеми, преносни устройства - 26.30 - производство на апарати, използващи бета- , гама излъчвания , X- (рентгенови) лъчи или други излъчвания и техните тръби - 26.60 - производство на оптични уреди и елементи - 26.70 - производство на подобни устройства с приложение в електротехниката - раздел 27 - производство на луминесцентни баластни съпротивления - 27.11 - производство на електрически релета - 27.12 - производство на електроинсталационни изделия -27.33 @bg
scope note: Tato třída zahrnuje výrobu polovodičových komponentů a ostatních součástek a dílů pro elektronické přístroje. Z: - výrobu elektronických kondenzátorů - výrobu elektronických odporů - výrobu mikroprocesorů - výrobu elektronek - výrobu elektronických konektorů - výrobu čistých desek plošných spojů (tištěných spojů) - výrobu integrovaných elektronických obvodů (analogových, digitálních nebo hybridních) - výrobu diod, tranzistorů a podobných součástek - výrobu induktorů (např. tlumivek, cívek, transformátorů) a podobných elektronických součástek - výrobu elektronických krystalů a krystalových skupin - výrobu elektromagnetů, přepínačů, spínačů a snímačů pro elektronické využití - výrobu polovodičových krystalových destiček nebo plátků jako hotových výrobků nebo polotovarů - výrobu komponentů pro displeje (plazma, polymer, LCD) - výrobu světelných diod (LED) - výrobu svazků kabelů z optických vláken s přípojkami ZT: - výrobu svazků kabelů k tiskárnám, monitorům, USB kabelů, včetně přípojek atd. N: - tisk čipových karet (18.12) - výrobu počítačových monitorů nebo televizních obrazovek (26.20, 26.40) - výrobu modemů (přenosových zařízení) (26.30) - výrobu ozařovacích přístrojů a trubic (26.60) - výrobu optických přístrojů a zařízení (26.70) - výrobu podobných součástek a zařízení pro elektrické přístroje (27) - výrobu předřadných přístrojů pro zářivky (27.11) - výrobu elektrických relé (27.12) - výrobu elektroinstalačního materiálu (27.33) - výrobu kompletních přístrojů (dle zařazení příslušných přístrojů) @cs
scope note: Diese Klasse umfasst die Herstellung von Halbleiterbauelementen und sonstigen Bauelementen für elektronische Anwendungen. Diese Klasse umfasst: - Herstellung von elektronischen Kondensatoren - Herstellung von elektronischen Widerständen - Herstellung von Mikroprozessoren - Herstellung von Elektronenröhren - Herstellung von elektronischen Anschlüssen - Herstellung von unbestückten Leiterplatten - Herstellung von integrierten elektronischen Schaltungen (analog, digital oder hybrid) - Herstellung von Dioden, Transistoren und ähnlichen diskreten Bauelementen - Herstellung von Induktoren (z. B. Drossel, Drosselspulen, Transformatoren), für elektronische Anwendungen - Herstellung von elektronischen Kristallen und Kristallgruppen - Herstellung von Elektromagneten, Schaltern und Umformern für elektronische Anwendungen - Herstellung von Rohhalbleitern oder Wafers als Fertig- oder Halbfertigerzeugnisse - Herstellung von Anzeigebauelementen (Plasma, Polymer, LCD) - Herstellung von Leuchtdioden (LED) Diese Klasse umfasst ferner: - Herstellung von Drucker-, Monitor-, USB-Kabeln, Anschlüssen usw. Diese Klasse umfasst nicht: - Drucken von Chipkarten (s. 18.12) - Herstellung von Computer- oder Fernsehbildschirmen (s. 26.20, 26.40) - Herstellung von Modems (Übertragungsgeräte) (s. 26.30) - Herstellung von Röntgenröhren und ähnlichen Bestrahlungsgeräten (s. 26.60) - Herstellung von optischen Instrumenten und Geräten (s. 26.70) - Herstellung von ähnlichen Geräten für elektrotechnische Anwendungen (s. Abteilung 27) - Herstellung von Vorschaltgeräten für Leuchtstofflampen (s. 27.11) - Herstellung von elektrischen Relais (s. 27.12) - Herstellung von elektrischem Installationsmaterial (s. 27.33) - Die Herstellung von vollständigen Geräten wird an der jeweiligen Stelle der Klassifikation klassifiziert. @de
scope note: This class includes the manufacture of semi-conductors and other components for electronic applications. This class includes: - manufacture of capacitors, electronic - manufacture of resistors, electronic - manufacture of microprocessors - manufacture of electron tubes - manufacture of electronic connectors - manufacture of bare printed circuit boards - manufacture of integrated circuits (analog, digital or hybrid) - manufacture of diodes, transistors and related discrete devices - manufacture of inductors (e.g. chokes, coils, transformers), electronic component type - manufacture of electronic crystals and crystal assemblies - manufacture of solenoids, switches and transducers for electronic applications - manufacture of dice or wafers, semi-conductor, finished or semi-finished - manufacture of display components (plasma, polymer, LCD) - manufacture of light emitting diodes (LED) This class also includes: - manufacture of printer cables, monitor cables, USB cables, connectors etc. This class excludes: - printing of smart cards, see 18.12 - manufacture of computer and television displays, see 26.20, 26.40 - manufacture of modems (carrier equipment), see 26.30 - manufacture of X-ray tubes and similar irradiation devices, see 26.60 - manufacture of optical equipment and instruments, see 26.70 - manufacture of similar devices for electrical applications, see division 27 - manufacture of fluorescent ballasts, see 27.11 - manufacture of electrical relays, see 27.12 - manufacture of electrical wiring devices, see 27.33 - manufacture of complete equipment is classified elsewhere based on complete equipment classification @en
scope note: Esta clase comprende la fabricación de semiconductores y otros componentes para aplicaciones electrónicas. Esta clase comprende: - la fabricación de capacitadores electrónicos - la fabricación de resistencias electrónicas - la fabricación de microprocesadores - la fabricación de tubos electrónicos - la fabricación de conectores electrónicos - la fabricación de placas para circuitos impresos sin componentes ensamblados - la fabricación de circuitos integrados (analógicos, digitales o híbridos) - la fabricación de diodos, transistores y otros dispositivos discretos - la fabricación de inductores (p. ej., limitadores de potencia, bobinas, transformadores), considerados como componentes electrónicos - la fabricación de cristales electrónicos y ensamblajes de cristal - la fabricación de solenoides, interruptores y transductores para aparatos electrónicos - la fabricación de microplaquetas u obleas, semiconductores, acabados o semielaborados - la fabricación de componentes de pantallas de visualización (plasma, polímeros, LCD) - la fabricación de diodos emisores de luz (LED) Esta clase comprende también: - la fabricación de cables de impresora y monitor, cables USB, conectores, etc. Esta clase no comprende: - la impresión de tarjetas inteligentes (véase 18.12) - la fabricación de pantallas de ordenador y de televisión (véanse 26.20 y 26.40) - la fabricación de módems (equipo portador) (véase 26.30) - la fabricación de tubos de rayos X y dispositivos de radiación similares (véase 26.60) - la fabricación de equipos e instrumentos ópticos (véase 26.70) - la fabricación de dispositivos similares para aparatos eléctricos (véase división 27) - la fabricación de balastros fluorescentes (véase 27.11) - la fabricación de relés eléctricos (véase 27.12) - la fabricación de dispositivos de cableado eléctrico (véase 27.33) - la fabricación de equipos completos se clasifica en otras clases, en función de la clasificación del equipo completo en cuestión @es
scope note: Cette classe comprend la fabrication de semi-conducteurs et d’autres composants électroniques. Cette classe comprend: - la fabrication de condensateurs électroniques - la fabrication de résistances électroniques - la fabrication de microprocesseurs - la fabrication de tubes électroniques - la fabrication de pièces de connexion électroniques - la fabrication de circuits imprimés nus - la fabrication de circuits intégrés (analogiques, numériques ou hybrides) - la fabrication de diodes, de transistors et de dispositifs discrets similaires - la fabrication d’inducteurs, de type composant électronique (par exemple: bobines d’étranglement, serpentins, transformateurs) - la fabrication de cristaux électroniques et d’assemblages de cristaux - la fabrication de solénoïdes, d’interrupteurs et de transducteurs pour applications électroniques - la fabrication de dés ou de tranches, semi-conducteurs, finis ou semi-finis - la fabrication de composants pour dispositifs d’affichage (plasma, polymère, LCD) - la fabrication de diodes émettrices de lumière (light emitting diodes – LED) Cette classe comprend également: - la fabrication de câbles pour imprimantes, de moniteurs, de câbles USB, de pièces de connexion, etc. Cette classe ne comprend pas: - l’impression de cartes à puce, voir 18.12 - la fabrication d’écrans d’ordinateurs ou de télévision, voir 26.20 et 26.40 - la fabrication de modems (équipement porteur), voir 26.30 - la fabrication de tubes à rayons X et d’appareils d’irradiation similaires, voir 26.60 - la fabrication d’instruments et d’équipements d’optique, voir 26.70 - la fabrication d’appareils similaires pour des applications électriques, voir division 27 - la fabrication de ballasts fluorescents, voir 27.11 - la fabrication de relais électriques, voir 27.12 - la fabrication de matériel d’installation électrique, voir 27.33 - la fabrication d’équipements complets est classée ailleurs, en fonction de la classification de l’équipement complet @fr
scope note: Ovaj razred uključuje proizvodnju poluvodiča i ostalih komponenata za elektroničku uporabu. Ovaj razred uključuje: - proizvodnju elektroničkih kondenzatora - proizvodnju elektroničkih otpornika - proizvodnju mikroprocesora - proizvodnju elektroničkih cijevi - proizvodnju elektroničkih konektora - proizvodnju integriranih krugova (analognih, digitalnih ili hibridnih) - proizvodnju dioda, tranzistora i posebnih srodnih uređaja - proizvodnju induktora (npr."čoka", spirala, transformatora), različitih elektroničkih komponenata - proizvodnju elektroničkih kristala i kristalnih sklopova - proizvodnju zavojnica, prekidača i mjernih pretvarača za elektroničku uporabu - proizvodnju tankih kockica i pločica te poluvodiča, gotovih ili polugotovih - proizvodnju komponenti zaslona (plazma, polimer, LCD) - proizvodnju dioda sa svjetlosnom emisijom (LED-dioda) Ovaj razred također uključuje: - proizvodnju kablova za printere, monitore, USB-kablove, konektore itd Ovaj razred isključuje: - tiskanje pametnih kartica, vidi 18.12 - proizvodnju računalnih i televizijskih zaslona, vidi 26.20, 26.40 - proizvodnju modema (noseće opreme), vidi 26.30 - proizvodnju rentgentskih cijevi i sličnih uređaja za zračenje, vidi 26.60 - proizvodnju optičke opreme i instrumenata, vidi 26.70 - proizvodnju sličnih uređaja za elektroničku uporabu, vidi odjeljak 27 - proizvodnju fluorescentnih balasta, vidi 27.11 - proizvodnju električnih releja, vidi 27.12 - proizvodnju električnih žičanih uređaja, vidi 27.33 - proizvodnja kompletne opreme razvrstana je drugdje na osnovi razvrstanosti kompletne opreme
scope note: Į šią klasę įeina puslaidininkių ir kitokių elektroninės paskirties komponentų gamyba. Į šią klasę įeina: - elektronikoje naudojamų kondensatorių gamyba - elektronikoje naudojamų rezistorių gamyba - mikroprocesorių gamyba - elektroninių vamzdžių gamyba - elektroninių jungčių gamyba - tuščiųjų spausdintinių plokščių gamyba - integrinių grandynų (analoginių, skaitmeninių ar hibridinių) gamyba - diodų, tranzistorių ir susijusių diskrečiųjų įtaisų gamyba - elektroninių komponentų tipo induktyvumo ričių (pvz., droselių, ričių, transformatorių) gamyba - elektroninių kristalų ir kristalų rinkinių gamyba - elektroninės paskirties solenoidų, jungiklių ir keitlių gamyba - užbaigtų arba pusiau užbaigtų puslaidininkių, lustų ir plokštelių gamyba - vaizduoklių komponentų (plazminių, polimerinių, skystakristalių) gamyba - šviesos diodų (LED) gamyba Į šią klasę taip pat įeina: - spausdintuvų kabelių, monitorių kabelių, universaliųjų nuosekliųjų magistralių (USB) kabelių, jungčių ir kt. gamyba Į šią klasę neįeina: - intelektinių kortelių spausdinimas, žr. 18.12 - kompiuterių ir televizorių vaizduoklių gamyba, žr. 26.20, 26.40 - modemų (nešliadažnės įrangos) gamyba, žr. 26.30 - rentgeno vamzdžių ir panašių švitinimo įtaisų gamyba, žr. 26.60 - optinės įrangos ir prietaisų gamyba, žr. 26.70 - elektrinės paskirties panašių įtaisų gamyba, žr. 27 skyrių - liuminescencinių įtaisų balastų gamyba, žr. 27.11 - elektrinių relių gamyba, žr. 27.12 - elektros instaliacijos įtaisų gamyba, žr. 27.33 - sukomplektuotos įrangos gamyba yra klasifikuojama kitoje vietoje, priklausomai nuo sukomplektuotos įrangos klasifikacijos @lt
scope note: Данный класс включает производство и/или сборку электронных комплектующих для компьютеров, таких как, центральные процессоры, настольные компьютеры, портативные компьютеры и их обслуживание; а также компьютерное периферийное оборудование, такое как, сохраняющие/запоминающие устройства и входные/выходные устройства (принтеры, мониторы, клавиатуры). Компьютеры могут быть аналоговые, цифровые или гибридные. Цифровые компьютеры, как самая общепринятая версия, являются оборудованием, которое выполняют следующие операции: (1) сохранение программ обработки данных или прочих программ и данных, (2) могут быть свободно запрограммированными согласно требованиям пользователя, (3) выполнять арифметические вычисления, выбранные пользователем и (4) выполнять, без вмешательства оператора программы, которые требуют, чтобы компьютер модифицировал свои действия и самостоятельно принимал решения на протяжении всего процесса. Аналоговые компьютеры могут осуществлять математические действия и осуществлять аналоговый контроль и элементы программирования. Этот класс включает: - производство настольных компьютеров - производство портативных компьютеров - производство центральных блоков для обработки данных компьютеров - производство переносных компьютеров (в т.ч. PDA) - производство дисководов, флэш-устройств и прочих записывающих/сохраняющих устройств - производство оптических дисководов (таких как, CD-RW, CD-ROM, DVD-ROM, DVD-RW) - производство принтеров - производство мониторов - производство клавиатур - производство всех типов мышек, джойстиков/рычагов управления и принадлежностей для трекбол-мышек - производство специализированных вычислительных компьютерных терминалов - производство компьютерных серверов - производство сканеров, включая устройства для считывания штриховых кодов - производство считывающих устройств для смарт-карт - производство шлемов и касок для виртуальных игр - производство компьютерных проекторов (видео излучателей) Этот класс также включает: - производство компьют… @ru
scope note: Bu sınıf, elektronik uygulamalar için yarı iletkenlerin ve diğer bileşenlerin imalatını kapsamaktadır. Bu sınıf aşağıdakileri kapsamaktadır; -elektronik kondansatörlerin imalatı, - elektronik dirençlerin imalatı, - mikro işlemcilerin imalatı, - elektron tüpleri imalatı, - elektronik konnektörlerin imalatı, - çıplak baskılı devre kartları imalatı, - entegre devre imalatı (analog, dijital veya hibrit), - diyotlar, transistörler ve ilgili devre cihazlarının imalatı, - elektronik bileşen tipli indüktörlerin imalatı (örn. jikleler, bobinler, transformatörler), - elektronik kristallerin ve kristal takımların imalatı, - elektronik uygulamalar için solenoidlerin, anahtarların ve güç dönüştürücülerin imalatı, - yarı iletken, tamamlanmış veya yarı tamamlanmış küplerin veya üzerinde çok kısımlı elektronik devre bulunan silikon parçaların imalatı, - elektronik göstergelerin imalatı (plazma, polimer, LCD), - ışık yayan diyotların (LED) imalatı, Ayrıca bu sınıf aşağıdakileri de kapsamaktadır; - yazıcı kabloları, monitör kabloları, USB kabloları, bağlayıcılar vb. imalatı. Kapsam dışı olanlar; - akıllı kartların basımı, bkz. 18.12, - bilgisayar ve televizyon ekranlarının imalatı, bkz. 26.20, 26.40, - harici modem imalatı, bkz. 26.30, - X-ray tüpleri ve benzer ışın cihazlarının imalatı, bkz. 26.60, - optik teçhizat ve aletlerinin imalatı, bkz. 26.70, - elektrikli uygulamalar için benzer cihazların imalatı, bkz. bölüm 27, - floresan balastları imalatı, bkz. 27.11, - elektrikli röle imalatı, bkz. 27.12, - elektrik kablolama gereçleri imalatı, bkz. 27.33, - tamamlanmış teçhizat imalatı, başka bir yerde sınıflandırılmaktadır. @tr
preferred label: Производство на електронни елементи @bg
preferred label: Výroba elektronických součástek @cs
preferred label: Fremstilling af elektroniske komponenter @da
preferred label: Herstellung von elektronischen Bauelementen @de
preferred label: Κατασκευή ηλεκτρονικών εξαρτημάτων @el
preferred label: Fabricación de componentes electrónicos @es
preferred label: Elektronkomponentide tootmine @et
preferred label: Elektronisten komponenttien valmistus @fi
preferred label: Fabrication de composants électroniques @fr
preferred label: Elektronikai alkatrész gyártása
preferred label: Fabbricazione di componenti elettronici @it
preferred label: Elektroninių komponentų gamyba @lt
preferred label: Elektronisko komponentu ražošana @lv
preferred label: Manifattura ta' komponenti elettroniċi @mt
preferred label: Vervaardiging van elektronische onderdelen @nl
preferred label: Produksjon av elektroniske komponenter @no
preferred label: Produkcja elementów elektronicznych @pl
preferred label: Fabricação de componentes electrónicos @pt
preferred label: Fabricarea subansamblurilor electronice (module) @ro
preferred label: Производство электронных деталей @ru
preferred label: Výroba elektronických komponentov @sk
preferred label: Proizvodnja elektronskih komponent @sl
preferred label: Tillverkning av elektroniska komponenter @sv
preferred label: Elektronik bileşenlerin imalatı @tr
broader: Manufacture of electronic components and boards

Manufacture of loaded electronic boards
type: Concept
notation: 26.12
status: valid
status modified: 2013-10-18
accepted date: 2013-10-18
in scheme: Statistical Classification of Economic Activities in the European Community, Rev. 2 (2008)
scope note: - производство на монтирани печатни платки - окомплектоване на печатни платки - производство на интерфейсни карти (например звукови, видео-, регулиращи, мрежови, модеми) - печатане на карти, съдържащи електронни интегрални схеми ("smart" карти) - 18.12 - производство на голи печатни платки - 26.11 @bg
scope note: Z: - výrobu osazených desek plošných spojů - osazování komponentů na desky plošných spojů - výrobu karet připojení (např. videokaret, zvukových, grafických, kontrolních, síťových a modemových karet) - interních/externích počítačových modemů N: - tisk čipových karet (18.12) - výrobu čistých desek plošných spojů (26.11) @cs
scope note: Diese Klasse umfasst: - Herstellung von bestückten Leiterplatten - Bestücken von Leiterplatten mit Bauelementen - Herstellung von Schnittstellenkarten (z. B. Sound-, Grafik-, Kontroller-, Netzwerk- und Modemkarten) Diese Klasse umfasst nicht: - Drucken von Chipkarten (s. 18.12) - Herstellung von unbestückten Leiterplatten (s. 26.11) @de
scope note: This class includes: - manufacture of loaded printed circuit boards - loading of components onto printed circuit boards - manufacture of interface cards (e.g. sound, video, controllers, network, modems) This class excludes: - printing of smart cards, see 18.12 - manufacture of bare printed circuit boards, see 26.11 @en
scope note: Esta clase comprende: - la fabricación de placas de circuitos impresos con componentes ensamblados - el ensamblaje de componentes en placas de circuitos impresos - la fabricación de tarjetas de interfaz (p. ej. sonido, vídeo, controladores, red, módems) Esta clase no comprende: - la impresión de tarjetas inteligentes (véase 18.12) - la fabricación de placas de circuitos impresos sin componentes ensamblados (véase 26.11) @es
scope note: Cette classe comprend: - la fabrication de circuits imprimés - le montage de composants sur des circuits imprimés - la fabrication de cartes d’interface (par exemple: son, vidéo, contrôleurs, réseau, modem) Cette classe ne comprend pas: - l’impression de cartes à puce, voir 18.12 - la fabrication de circuits imprimés nus, voir 26.11 @fr
scope note: Ovaj razred uključuje: - proizvodnju punjenih pločica tiskanih krugova - punjenje komponenata na pločicu tiskanih krugova - proizvodnju sučelja kartica (npr. zvuka, videa, upravljača, modema) Ovaj razred isključuje: - tiskanje pametnih kartica, vidi 18.12 - proizvodnju praznih pločica tiskanih krugova, vidi 26.11
scope note: Į šią klasę įeina: - sumontuotų spausdintinių plokščių gamyba - komponentų įmontavimas į spausdintines plokštes - sietuvo plokščių (pvz., garso, vaizdo, valdiklių, tinklo, modemų) gamyba Į šią klasę neįeina: - intelektinių kortelių spausdinimas, žr. 18.12 - tuščiųjų spausdintinių plokščių gamyba, žr. 26.11 @lt
scope note: Bu sınıf aşağıdakileri kapsamaktadır; - yüklü baskılı devre kartları imalatı, - baskılı devre kartlarının üzerine parçaların yüklenmesi. - ara yüz kartları imalatı (örn. ses, görüntü (video), denetleyiciler, ağ (network), modem kartı) Kapsam dışı olanlar; - akıllı kartların basımı, bkz. 18.12. - çıplak baskılı devre kartları imalatı, bkz. 26.11. @tr
preferred label: Производство на монтирани печатни платки @bg
preferred label: Výroba osazených elektronických desek @cs
preferred label: Fremstilling af printplader o.l. @da
preferred label: Herstellung von bestückten Leiterplatten @de
preferred label: Κατασκευή έμφορτων ηλεκτρονικών πλακετών @el
preferred label: Fabricación de circuitos impresos ensamblados @es
preferred label: Trükkplaatide tootmine @et
preferred label: Kalustettujen piirilevyjen valmistus @fi
preferred label: Fabrication de cartes électroniques assemblées @fr
preferred label: Elektronikai áramköri kártya gyártása
preferred label: Fabbricazione di schede elettroniche integrate @it
preferred label: Sumontuotų elektroninių plokščių gamyba @lt
preferred label: Elektronisko plašu ražošana @lv
preferred label: Manifattura ta' bordijiet elettroniċi illowdjati @mt
preferred label: Vervaardiging van elektronische printplaten @nl
preferred label: Produksjon av kretskort @no
preferred label: Produkcja elektronicznych obwodów drukowanych @pl
preferred label: Fabricação de placas de circuitos electrónicos @pt
preferred label: Fabricarea altor componente electronice @ro
preferred label: Производство электронных панелей загрузки @ru
preferred label: Výroba montovaných elektronických dosiek @sk
preferred label: Proizvodnja elektronskih plošč @sl
preferred label: Tillverkning av kretskort @sv
preferred label: Yüklü elektronik kart imalatı @tr
broader: Manufacture of electronic components and boards

Manufacture of computers and peripheral equipment
type: Concept
notation: 26.2
status: valid
status modified: 2013-10-18
accepted date: 2013-10-18
in scheme: Statistical Classification of Economic Activities in the European Community, Rev. 2 (2008)
scope note: Данный класс включает производство телефонов и оборудования для передачи данных, используемых для передачи сигналов электронным способом через проводную связь или беспроводную связь, такую как радио и теле трансляцию и беспроводное оборудование для передачи данных. Этот класс включает: - производство коммутационного оборудования - производство беспроводных телефонов - производство оборудования частной телефонной станции с выходом в общую сеть (PBX) - производство телефонов и факсов, включая автоответчики - производство оборудования для передачи данных, такого как мосты, маршрутизаторы, межсетевые шлюзы - производство передающих и принимающих антенн - производство оборудования для кабельного телевидения - производство пейджеров - производство сотовых телефонов - производство мобильного оборудования для передачи данных - производство трансляционного оборудования для радио и телестудий, включая телекамеры - производство модемов, несущих конструкций - производство противовзломных и противопожарных систем, посылающих сигналы на диспетчерский пульт - производство радио и телепередатчиков - производство коммуникационных приборов, принимающих инфракрасные сигналы связи (в т.ч. дистанционное управление) Этот класс исключает: - производство электронных компонентов и комплектующих, используемых для компьютеров и периферийного компьютерного оборудования, см. 26.1 - производство компонентов загрузки для печатных схемных плат, см. 26.12 - производство компьютеров и компьютерного периферийного оборудования, см. 26.20 - производство аудио и видео техники для широкого круга потребителей, см. 26.40 - производство приборов глобальной (спутниковой) системы местоопределения, см. 26.51 - производство электронных табло, см. 27.90 - производство светофоров, см. 27.90 @ru
preferred label: Производство на компютърна техника @bg
preferred label: Výroba počítačů a periferních zařízení @cs
preferred label: Fremstilling af computere og ydre enheder @da
preferred label: Herstellung von Datenverarbeitungsgeräten und peripheren Geräten @de
preferred label: Κατασκευή ηλεκτρονικών υπολογιστών και περιφερειακού εξοπλισμού @el
preferred label: Fabricación de ordenadores y equipos periféricos @es
preferred label: Arvutite ja arvuti välisseadmete tootmine @et
preferred label: Tietokoneiden ja niiden oheislaitteiden valmistus @fi
preferred label: Fabrication d'ordinateurs et d'équipements périphériques @fr
preferred label: Számítógép, perifériás egység gyártása
preferred label: Fabbricazione di computer e unità periferiche @it
preferred label: Kompiuterių ir išorinės įrangos gamyba @lt
preferred label: Datoru un perifēro iekārtu ražošana @lv
preferred label: Manifattura ta' kompjuters u tagħmir periferali @mt
preferred label: Vervaardiging van computers en randapparatuur @nl
preferred label: Produksjon av datamaskiner og tilleggsutstyr @no
preferred label: Produkcja komputerów i urządzeń peryferyjnych @pl
preferred label: Fabricação de computadores e de equipamento periférico @pt
preferred label: Fabricarea calculatoarelor şi a echipamentelor periferice @ro
preferred label: Производство компьютеров и периферийного оборудования @ru
preferred label: Výroba počítačov a periférnych zariadení @sk
preferred label: Proizvodnja računalnikov in perifernih naprav @sl
preferred label: Tillverkning av datorer och kringutrustning @sv
preferred label: Bilgisayar ve bilgisayar çevre birimleri imalatı @tr
broader: Manufacture of computer, electronic and optical products
narrower: Manufacture of computers and peripheral equipment

Manufacture of computers and peripheral equipment
type: Concept
notation: 26.20
status: valid
status modified: 2013-10-18
accepted date: 2013-10-18
in scheme: Statistical Classification of Economic Activities in the European Community, Rev. 2 (2008)
scope note: производство и/или сглобяване на компютърна техника като универсални (големи), настолни, преносими компютри (лаптопи) и компютри, доставящи информация (сървъри). Тук се отнасят и периферните устройства като запаметяващи устройства и входни/изходни устройства (печатащи устройства, монитори, клавиатури). Компютрите могат да бъдат аналогови, цифрови или хибридни. Цифровите компютри са най-разпространеният модел. Те са устройства, които извършват следните действия: 1) съхраняват обработващите програми или програмите и информацията (данните), които са необходими за незабавното изпълнение на програмата; 2) могат да бъдат свободно програмирани, съгласно изискванията на потребителя; 3) извършват аритметични изчисления, определени от потребителя и 4) изпълняват, без човешка намеса, обработващи програми, които докато тече обработката, изискват промяна на изпълнението на програмата на базата на логическо решение. Аналоговите компютри са способни да моделират математически модели и съдържат поне аналогово (моделиращо) управление и програмни елементи. - производство на настолни компютри - производство на преносими компютри (лаптопи) - производство на универсални (големи) компютри - производство на микрокомпютри (например персонални цифрови помощници/джобен компютър - PDA) - производство на преносима памет, лентови, дискови и други запаметяващи устройства - производство на оптични дискови запаметяващи устройства (например CD-RW, CD-ROM, DVD-ROM, DVD-RW) - производство на печатащи устройства - производство на монитори - производство на клавиатури - производство на всички видове „мишки“, лостчета за игра (джойстик) и сферични манипулатори за дисплей (трекбол) - производство на терминали, специално предназначени за компютри - производство на компютри, доставящи информация (сървъри) - производство на скенери, вкл. сканиращи устройства за четене на щрихкод - производство на устройства за четене на карти, съдържащи електронни интегрални схеми („smart“ карти) - производство на шлемове з… @bg
scope note: Tato třída zahrnuje výrobu nebo sestavování počítačů, např. sálových (mainframes), stolních, přenosných (laptopů), počítačových serverů a účelových počítačových terminálů; výrobu počítačových periferních zařízení, např. pamětí pro uložení dat, přístrojů pro vstup a výstup dat (tiskárny, monitory, klávesnice). Počítače mohou být analogové, digitální nebo hybridní. Nejčastější jsou digitální počítače, které se vyznačují těmito znaky: 1) mohou zpracovatelský program nebo programy a data potřebná pro bezprostřední provádění programu ukládat do paměti, 2) lze je programovat s přihlédnutím k požadavkům uživatele, 3) provádějí uživatelem stanovené matematické výpočty a 4) samostatně provádějí zpracovatelský program, při jehož provádění je třeba aplikovat logické operace; analogové počítače jsou schopné simulovat matematické modely a jako minimální konfiguraci obsahují analogové řídicí a programovací prvky. Z: - výrobu stolních počítačů - výrobu laptopů - výrobu sálových počítačů (mainframe) - výrobu ručních počítačů (např. PDA) - výrobu magnetických diskových jednotek, flashových pamětí a jiných paměťových médií - výrobu optických paměťových disků (např. CD-RW, CD-ROM, DVD-ROM, DVD-RW) - výrobu tiskáren - výrobu monitorů - výrobu klávesnic - výrobu myší, pákových a kuličkových ovladačů (joysticků a trackballů) - výrobu počítačových účelových terminálů - výrobu počítačových serverů - výrobu skenerů včetně skenerů čárových kódů - výrobu čteček čipových karet - výrobu přileb pro virtuální realitu - výrobu počítačových projektorů (videoprojektorů) ZT: - výrobu počítačových terminálů jako peněžních automatů (ATM) nebo pokladních terminálů POS („Point-of-Sale“), neprovozovaných mechanicky - výrobu multifunkčních kancelářských přístrojů provádějících dvě nebo více následujících operací: tisk, skenování, kopírování, faxování N: - rozmnožování nahraných nosičů (počítačová media, zvuk, obraz atd.) (18.20) - výrobu elektronických komponentů, součástek a dílů pro počítače a periferní … @cs
scope note: Diese Klasse umfasst die Herstellung und/oder den Zusammenbau von Datenverarbeitungsgeräten, beispielsweise Mainframe-Computern, Desktop-Computern, Laptops und Servern sowie von peripheren Geräten, z. B. Datenspeichern sowie Ein- und Ausgabegeräten (Drucker, Monitore, Tastaturen). Datenverarbeitungsgeräte können in analoger, digitaler oder hybrider Funktionsweise hergestellt werden. Die am häufigsten vorkommenden digitalen Datenverarbeitungsgeräte weisen die nachfolgenden Merkmale auf: (1) Sie können das Verarbeitungsprogramm/die Programme und die für die unmittelbare Ausführung des Programms erforderlichen Daten speichern; (2) sie können unter Berücksichtigung der Nutzeranforderungen programmiert werden; (3) sie führen die vom Nutzer festgelegten arithmetischen Berechnungen aus und (4) sie führen selbstständig ein Verarbeitungsprogramm aus, bei dessen Ausführung logische Operationen anzuwenden sind. Analoge Datenverarbeitungsgeräte sind in der Lage, mathematische Modelle zu simulieren und enthalten als Mindestkonfiguration analoge Steuer- und Programmierelemente. Diese Klasse umfasst: - Herstellung von Desktop-Computern - Herstellung von Laptop-Computern - Herstellung von Mainframe-Computern - Herstellung von Handcomputern (z. B. PDA) - Herstellung von Magnetplatteneinheiten, Flash-Speichern und anderen Speichermedien - Herstellung optischer CD- und DV-Laufwerke (CD-RW, CD-ROM, DVD-ROM, DVD-RW) - Herstellung von Druckern - Herstellung von Bildschirmen - Herstellung von Tastaturen - Herstellung von Mäusen, Joysticks und Trackballs - Herstellung von Terminals für einen bestimmten Zweck - Herstellung von Servern - Herstellung von Scannern einschließlich Strichcodescanner - Herstellung von Chipkartenlesern - Herstellung von „Virtual Reality"-Helmen - Herstellung von Projektoren (Videobeamer) Diese Klasse umfasst ferner: - Herstellung von Computerterminals wie Geldautomaten oder nichtmechanisch betriebene POS-("Point-of-Sale")Terminals - Herstellung von Multifunktionsbü… @de
scope note: This class includes the manufacture and/or assembly of electronic computers, such as mainframes, desktop computers, laptops and computer servers; and computer peripheral equipment, such as storage devices and input/output devices (printers, monitors, keyboards). Computers can be analog, digital, or hybrid. Digital computers, the most common type, are devices that do all of the following: (1) store the processing program or programs and the data immediately necessary for the execution of the program, (2) can be freely programmed in accordance with the requirements of the user, (3) perform arithmetical computations specified by the user and (4) execute, without human intervention, a processing program that requires the computer to modify its execution by logical decision during the processing run. Analog computers are capable of simulating mathematical models and comprise at least analog control and programming elements. This class includes: - manufacture of desktop computers - manufacture of laptop computers - manufacture of main frame computers - manufacture of hand-held computers (e.g. PDA) - manufacture of magnetic disk drives, flash drives and other storage devices - manufacture of optical (e.g. CD-RW, CD-ROM, DVD-ROM, DVD-RW) disk drives - manufacture of printers - manufacture of monitors - manufacture of keyboards - manufacture of all types of mice, joysticks, and trackball accessories - manufacture of dedicated computer terminals - manufacture of computer servers - manufacture of scanners, including bar code scanners - manufacture of smart card readers - manufacture of virtual reality helmets - manufacture of computer projectors (video beamers) This class also includes: - manufacture of computer terminals, like automatic teller machines (ATM's), point-of-sale (POS) terminals, not mechanically operated - manufacture of multi-function office equipment performing two or more of following functions: printing, scanning, copying, faxing This class excludes: - reprod… @en
scope note: Esta clase comprende la fabricación y el montaje de ordenadores, como unidades centrales (mainframes), ordenadores de sobremesa, ordenadores portátiles y servidores informáticos, así como de periféricos, como los dispositivos de almacenamiento y de entrada y salida (impresoras, monitores, teclados). Los ordenadores pueden ser analógicos, digitales o híbridos. Los digitales, que constituyen el tipo más común, son dispositivos que realizan la totalidad de las siguientes tareas: (1) almacenan el programa o programas de procesamiento y los datos necesarios para la ejecución del programa; (2) pueden programarse libremente con arreglo a los requisitos del usuario; (3) realizan las operaciones aritméticas especificadas por el usuario; y (4) ejecutan, sin intervención humana, un programa de procesamiento que requiere que el ordenador modifique su ejecución mediante decisiones lógicas durante la operación de procesamiento. Los ordenadores analógicos son capaces de simular modelos matemáticos y constan, al menos, de un control analógico y elementos de programación. Esta clase comprende: - la fabricación de ordenadores de sobremesa - la fabricación de ordenadores portátiles - la fabricación de ordenadores centrales (mainframes) - la fabricación de ordenadores de mano (p. ej., PDA) - la fabricación de unidades de disco magnéticas, unidades de memoria flash y otros dispositivos de almacenamiento - la fabricación de unidades de disco ópticas (p. ej., CD-RW, CD-ROM, DVD-ROM, DVD-RW) - la fabricación de impresoras - la fabricación de monitores - la fabricación de teclados - la fabricación de todo tipo de ratones, joysticks y accesorios trackball - la fabricación de terminales informáticos especializados - la fabricación de servidores informáticos - la fabricación de escáneres, incluidos los lectores de códigos de barras - la fabricación de lectores de tarjetas inteligentes - la fabricación de cascos de realidad virtual - la fabricación de proyectores informáticos (proyectores de ví… @es
scope note: Cette classe comprend la fabrication et/ou l’assemblage d’ordinateurs, tels que des gros systèmes, des ordinateurs de bureau, des ordinateurs portables et des serveurs, ainsi que des équipements informatiques périphériques, tels que systèmes de stockage et unités d’entrée et de sortie (imprimantes, écrans, claviers). Les ordinateurs peuvent être analogiques, numériques ou hybrides. Les ordinateurs numériques, les plus courants, sont des appareils capables de réaliser l’ensemble des opérations suivantes: 1) enregistrer le ou les programmes de traitement et les données immédiatement nécessaires pour l’exécution de ce ou de ces programmes; 2) être librement programmés conformément aux besoins de l’utilisateur; 3) résoudre les opérations arithmétiques conformément aux instructions de l’utilisateur et; 4) exécuter, sans aucune intervention humaine, un programme de traitement imposant à l’ordinateur de modifier son exécution par une décision logique durant le processus. Les ordinateurs analogiques sont capables de simuler des modèles mathématiques et comprennent au moins des éléments de contrôle analogique et de programmation. Cette classe comprend: - la fabrication d’ordinateurs de bureau - la fabrication d’ordinateurs portables - la fabrication de gros systèmes - la fabrication d’ordinateurs de poche (par exemple: les assistants personnels) - la fabrication de lecteurs de disques magnétiques, de lecteurs flash et d’autres systèmes de stockage - la fabrication de lecteurs de disques optiques (par exemple: CD-RW, CD-ROM, DVD-ROM, DVD-RW) - la fabrication d’imprimantes - la fabrication d’écrans - la fabrication de claviers - la fabrication de tous types de souris, de manettes et de boules roulantes et leurs accessoires - la fabrication de terminaux informatiques spécialisés - la fabrication de serveurs - la fabrication de scanneurs, y compris les lecteurs de codes à barres - la fabrication de lecteurs de cartes à puce - la fabrication de casques de réalité virtuelle - la f… @fr
scope note: Ovaj razred uključuje proizvodnju i/ili sklapanje elektroničkih računala kao što su glavno računalo (centralna jedinica), stolno računalo, prijenosno računalo (laptop) i računalni server (poslužitelj) te računalne periferne opreme kao što su uređaji za pohranu podataka i ulazni/izlazni uređaji (pisači, monitori, tipkovnice). Računala mogu biti analogna, digitalna ili hibridna. Digitalna računala, kao najčešća vrsta, su uređaji koji rade sljedeće: (1) pohranjuju programe obrade ili programe i podatke nužne za izvršenje programa; (2) mogu se slobodno programirati ovisno o zahtjevima korisnika; (3) izvode aritmetička izračunavanja specificirana po korisniku; i (4) izvode bez upletanja čovjeka, obrade programa koji zahtijevaju od računala da modificiraju njegovo izvršenje logičkom odlukom, za vrijeme trajanja procesa. Analogna računala sposobna su istodobno izvoditi matematičke module i uključivati najmanje jednu analognu kontrolu i programske elemente. Ovaj razred uključuje: - proizvodnju stolnih računala - proizvodnju prijenosnih računala - proizvodnju glavnog računala (centralne jedinice) - proizvodnju dlanovnika (npr. PDA) - proizvodnju magnetskih diskovnih pogona, memorijskih štapića (flash drive uređaji) i ostalih uređaja za pohranu podataka - proizvodnju optičkih diskovnih pogona ( CD-RW, CD-ROM, DVD-ROM, DVD-RW) - proizvodnju pisača - proizvodnju monitora - proizvodnju tipkovnica - proizvodnju svih vrsta miševa, palica za igru (joysticks) i pomičnih kuglica (trackball) - proizvodnju računalnih terminala za posebne namjene - proizvodnju računalnih poslužitelja - proizvodnju skenera, uključujući čitače linijskih kodova - proizvodnju čitača pametnih kartica - proizvodnju kaciga za virtualnu stvarnost - proizvodnju računalnih projektora (videoprojektora) Ovaj razred također uključuje: - proizvodnju računalnih terminala kao što su bankomati; uređaja namijenjenih elektroničkom plaćanju roba i usluga na prodajnim mjetima (POS terminali), mehanički neupravljanih - proiz…
scope note: Į šią klasę įeina elektroninių kompiuterių, tokių kaip didieji, staliniai, nešiojamieji (skreitiniai) kompiuteriai ir kompiuterių serveriai, taip pat kompiuterių išorinės įrangos, tokios kaip atminties ir įvesties / išvesties įtaisai (spausdintuvai, monitoriai, klaviatūros), gamyba ir (ar) surinkimas. Kompiuteriai gali būti analoginiai, skaitmeniniai arba kombinuoti. Skaitmeniniai kompiuteriai, labiausiai įprasto tipo, yra įtaisai, galintys: 1) išlaikyti atmintyje apdorojamą programą (-as) bei jai apdoroti reikalingus duomenis; 2) būti laisvai programuojami pagal vartotojo reikalavimus; 3) atlikti vartotojo nurodytus aritmetinius veiksmus; ir 4) be žmogaus įsikišimo vykdyti apdorojimo programą, kuri reikalauja, kad apdorojimo metu kompiuteris pagal loginius sprendimus keistų savo darbą. Analoginiai kompiuteriai gali imituoti matematinius modelius ir mažiausiai turėti analoginius valdymo ir programavimo elementus. Į šią klasę įeina: - stalinių kompiuterių gamyba - nešiojamųjų (skreitinių) kompiuterių gamyba - centrinių kompiuterių gamyba - delninių kompiuterių (pvz., asmeninių skaitmeninių pagalbiklių - PDA) gamyba - magnetinių diskinių kaupiklių, atmintukų ir kitų atminties įtaisų gamyba - optinių diskinių kaupiklių (pvz., CD - RW, CD - ROM, DVD -ROM, DVD - RW) gamyba - spausdintuvų gamyba - monitorių gamyba - klaviatūrų gamyba - visų tipų pelių, vairasvirčių ir rutulinių manipuliatorių pagalbinių reikmenų gamyba - specializuotų kompiuterinių galinių įtaisų gamyba - kompiuterių serverių gamyba - skaitytuvų, įskaitant brūkšninių kodų skaitytuvus, gamyba - intelektinių kortelių skaitlių gamyba - virtualios tikrovės šalmų gamyba - kompiuterinių vaizdo projektorių gamyba Į šią klasę taip pat įeina: - nemechaniškai valdomų kompiuterinių galinių įtaisų, tokių kaip bankomatai, kasos aparatų galiniai įtaisai, gamyba - daugiafunkcinės biuro įrangos, atliekančios dvi ar kelias funkcijas (spausdinimo, nuskaitymo, kopijavimo, faksogramų siuntimo) gamyba Į šią klasę neįeina: - į… @lt
scope note: Bu sınıf, elektronik bilgisayarların, örneğin ana bilgisayarların, masa üstü bilgisayarlarının, dizüstü bilgisayarların, bilgisayar sunucularının ve bellek cihazları, girdi/çıktı cihazları (yazıcılar, monitörler, klavyeler) gibi bilgisayar çevre donanımlarının imalatını ve/veya montajını kapsamaktadır. Bilgisayarlar, analog, dijital, ya da hibrit olabilir. Dijital bilgisayarlar, en yaygın tipi, aşağıdakilerin tamamını gerçekleştiren cihazlardır: (1) çalışan program ya da programları ve programın uygulanması için gerekli olan verileri barındıran; (2) kullanıcıların ihtiyaçlarına, gereksinimlerine uygun olarak serbestçe programlanabilen; (3) kullanıcılar tarafından belirlenen aritmetik hesaplamaları yapan ve (4) insan müdahalesi olmaksızın, işlem devam ederken mantıksal bir karar ile uygulamayı modifiye etmek için bu bilgisayarı gerekli kılan bir süreç programını çalıştıran aletlerdir. Analog bilgisayarlar, matematiksel modelleri uygulama kapasitesine sahiptirler ve en azından analog kontrol ve programlama elemanlarından oluşurlar. Bu sınıf aşağıdakileri kapsamaktadır; - masaüstü bilgisayarları imalatı, - dizüstü bilgisayarları imalatı, - ana bilgisayarların imalatı, - cep veya avuç içi bilgisayarları imalatı (örn. PDA), - manyetik disk sürücüler, harici sürücüler ve diğer bellek depolama cihazları imalatı, - optik disk sürücülerin (örn. CD-RW, CD-ROM, DVD-ROM, DVD-RW) imalatı, - yazıcı imalatı, - monitör imalatı, - klavye imalatı, - her çeşitte fare (mouse), joystik ve iztopu aksesuarları imalatı, - tesis edilmiş bilgisayar terminalleri (depoları) imalatı, - bilgisayar sunucuları imalatı, - barkotlu tarayıcılar dahil tarayıcı imalatı, - akıllı kart okuyucuları imalatı, - sanal gerçeklik sağlayan kasklar imalatı, - bilgisayar projektörleri imalatı (video projektörleri). Ayrıca bu sınıf aşağıdakileri de kapsamaktadır; - mekanik olarak çalışmayan otomatik vezne makineleri (ATM`lerin), satış noktası terminalleri (POS) gibi bilgisayar terminallerinin imalatı, - çıktı alma… @tr
preferred label: Производство на компютърна техника @bg
preferred label: Výroba počítačů a periferních zařízení @cs
preferred label: Fremstilling af computere og ydre enheder @da
preferred label: Herstellung von Datenverarbeitungsgeräten und peripheren Geräten @de
preferred label: Κατασκευή ηλεκτρονικών υπολογιστών και περιφερειακού εξοπλισμού @el
preferred label: Fabricación de ordenadores y equipos periféricos @es
preferred label: Arvutite ja arvuti välisseadmete tootmine @et
preferred label: Tietokoneiden ja niiden oheislaitteiden valmistus @fi
preferred label: Fabrication d'ordinateurs et d'équipements périphériques @fr
preferred label: Számítógép, perifériás egység gyártása
preferred label: Fabbricazione di computer e unità periferiche @it
preferred label: Kompiuterių ir išorinės įrangos gamyba @lt
preferred label: Datoru un perifēro iekārtu ražošana @lv
preferred label: Manifattura ta' kompjuters u tagħmir periferali @mt
preferred label: Vervaardiging van computers en randapparatuur @nl
preferred label: Produksjon av datamaskiner og tilleggsutstyr @no
preferred label: Produkcja komputerów i urządzeń peryferyjnych @pl
preferred label: Fabricação de computadores e de equipamento periférico @pt
preferred label: Fabricarea calculatoarelor şi a echipamentelor periferice @ro
preferred label: Производство компьютеров и периферийного оборудования @ru
preferred label: Výroba počítačov a periférnych zariadení @sk
preferred label: Proizvodnja računalnikov in perifernih naprav @sl
preferred label: Tillverkning av datorer och kringutrustning @sv
preferred label: Bilgisayar ve bilgisayar çevre birimleri imalatı @tr
broader: Manufacture of computers and peripheral equipment

Manufacture of communication equipment
type: Concept
notation: 26.3
status: valid
status modified: 2013-10-18
accepted date: 2013-10-18
in scheme: Statistical Classification of Economic Activities in the European Community, Rev. 2 (2008)
scope note: Данный класс включает производство электронного аудио и видео оборудования для домашнего пользования, усилителей для установки в автомобилях, для систем публичных выступлений и музыкальных инструментов. Этот класс включает: - производство видеозаписывающих и видеовоспроизводящих устройств - производство телевизоров - производство телевизионных мониторов и дисплеев - производство магнитофонов и других звукозаписывающих устройств - производство стерео оборудования - производство радиоприемников - производство акустических систем - производство видеокамер для домашнего пользования - производство музыкальных автоматов - производство усилителей для музыкальных инструментов и систем публичных выступлений - производство микрофонов - производство CD и DVD плееров - производство систем караоке - производство наушников (в т.ч. радио, стерео, компьютерных) - производство пультов управления для видеоигр Этот класс исключает: - воспроизведение записанных материалов (компьютерные, видео-, звуко- и прочие записи), см. 18,2 - производство компьютерного периферийного оборудования и мониторов, см. 26.20 - производство автоответчиков, см. 26.30 - производство пейджингового оборудования, см. 26.30 - производство дистанционного оборудования (радио и инфракрасного), см. 26.30 - производство трансляционного оборудования для студий такого как, оборудования для воспроизводства, антенн для передачи и получения изображения, видеокамер для профессионального использования, см. 26.30 - производство антенн, см. 26.30 - производство цифровых камер, см. 26.70 - производство электронных игр с фиксированным (не сменным) программным обеспечением, см. 32.40 @ru
preferred label: Производство на радио-, телевизионна и далекосъобщителна техника @bg
preferred label: Výroba komunikačních zařízení @cs
preferred label: Fremstilling af kommunikationsudstyr @da
preferred label: Herstellung von Geräten und Einrichtungen der Telekommunikationstechnik @de
preferred label: Κατασκευή εξοπλισμού επικοινωνίας @el
preferred label: Fabricación de equipos de telecomunicaciones @es
preferred label: Sideseadmete tootmine @et
preferred label: Viestintälaitteiden valmistus @fi
preferred label: Fabrication d'équipements de communication @fr
preferred label: Híradástechnikai berendezés gyártása
preferred label: Fabbricazione di apparecchiature per le comunicazioni @it
preferred label: Ryšių įrangos gamyba @lt
preferred label: Sakaru iekārtu ražošana @lv
preferred label: Manifattura ta' tagħmir għall-komunikazzjoni @mt
preferred label: Vervaardiging van communicatieapparatuur @nl
preferred label: Produksjon av kommunikasjonsutstyr @no
preferred label: Produkcja sprzętu (tele)komunikacyjnego @pl
preferred label: Fabricação de aparelhos e de equipamentos para comunicações @pt
preferred label: Fabricarea echipamentelor de comunicaţii @ro
preferred label: Производство коммуникационного оборудования @ru
preferred label: Výroba komunikačných zariadení @sk
preferred label: Proizvodnja komunikacijskih naprav @sl
preferred label: Tillverkning av kommunikationsutrustning @sv
preferred label: İletişim ekipmanlarının imalatı @tr
broader: Manufacture of computer, electronic and optical products
narrower: Manufacture of communication equipment

Manufacture of communication equipment
type: Concept
notation: 26.30
status: valid
status modified: 2013-10-18
accepted date: 2013-10-18
in scheme: Statistical Classification of Economic Activities in the European Community, Rev. 2 (2008)
scope note: Производство на телефонна и далекосъобщителна техника. С тази техника посредством електронен сигнал се пренасят данни по мрежата или по въздуха (например съоръжения за радио- и телевизионно разпръскване и безжични далекосъобщителни устройства). - производство на учрежденски телефонни централи - производство на безжични телефони - производство на (самостоятелни) телефонни централи (PBX) - производство на телепишещи (телекси) и телекопиращи (факс) устройства, вкл. автоматични телефонни секретари - производство на далекосъобщителна техника за пренос на данни, като устройства за свързване на локални мрежи (от еднакъв тип), устройства за оптимална маршрутизация и междумрежови преходи - производство на предавателни и приемателни антени - производство на кабелни системи за телевизионни сигнали - производство на носими приемници за системи за повикване, оповестяване или издирване на хора (пейджъри) - производство на телефони за клетъчни мрежи (мобилни телефони) - производство на съоръжения за мобилни далекосъобщителни мрежи - производство на оборудване за студиа за разпространение на радио- и телевизонни програми като апарати за възпроизвеждане, предавателни и приемателни антени, телевизионни камери - производство на модеми, преносни устройства - производство на сигнални системи за защита срещу кражби или пожар, които изпращат сигнал до пулт за управление - производство на излъчващи радио- и телевизионни предаватели - производство на апарати за управление от разстояние (дистанционни), с радиовълни или с инфрачервени лъчи - производство на електронни елементи и блокове, използвани в съобщителните съоръжения, вкл. вътрешни/външни компютърни модеми - 26.1 - производство на монтирани печатни платки - 26.12 - производство на компютри и периферни устройства - 26.20 - производство на битова аудио- и видеотехника - 26.40 - производство на приемателни апарати за глобално позициониране чрез сателит – GPS-система - 26.51 - производство на електронни информационни табла - 27.90 - произ… @bg
scope note: Tato třída zahrnuje výrobu telefonních a datových telekomunikačních zařízení pro přenos signálů kabelem nebo vzdušnou cestou, např. rozhlasové a televizní vysílací přístroje a bezdrátová komunikační zařízení. Z: - výrobu centrálních kancelářských ústředen - výrobu bezdrátových telefonních přístrojů - výrobu soukromých pobočkových ústředen (PBX) - výrobu telefonních a faxových přístrojů, včetně telefonních záznamníků - výrobu zařízení pro přenos dat, např. můstky, směrovače, portály - výrobu vysílacích a přijímacích antén - výrobu přístrojů pro kabelovou televizi - výrobu stránkovačů - výrobu mobilních telefonů - výrobu mobilních komunikačních zařízení - výrobu rozhlasových a televizních studií a vysílacích zařízení, včetně komerčních televizních kamer a videokamer - výrobu modemů (přenosových zařízení) - výrobu bezpečnostního nebo signalizačního zařízení proti krádeži nebo ohni, u nichž je přenášen signál do kontrolní stanice - výrobu rozhlasových nebo televizních vysílacích přístrojů - výrobu komunikačních přístrojů používajících infračervený signál (např. dálkové ovládání) - výrobu telekomunikačních přístrojů pro družice N: - výrobu elektronických součástek a dílů pro komunikační přístroje a zařízení včetně interních/externích počítačových modemů (26.1) - výrobu osazených desek plošných spojů (26.12) - interních/externích počítačových modemů (26.12) - výrobu počítačů a periferních zařízení (26.20) - výrobu spotřebních audio a video přístrojů (26.40) - výrobu systému globální navigace (GPS) (26.51) výrobu elektronických světelných výsledkových tabulí (indikačních panelů) (27.90) - výrobu dopravních světelných signálů (27.90) @cs
scope note: Diese Klasse umfasst die Herstellung von Telefon- und Datenkommunikationsgeräten mit einer kabelgestützten oder kabellosen Signalübertragung wie Geräte für Hörfunk- und Fernsehsendeeinrichtungen und für die leitungslose Kommunikation. Diese Klasse umfasst: - Herstellung von Telefonvermittlungseinrichtungen - Herstellung von schnurlosen Telefongeräten - Hersteller von Nebenstellenanlagen (PBX-Anlagen) - Herstellung von Telefon- und Faxgeräten, einschließlich Anrufbeantworter - Herstellung von Datenübertragungseinrichtungen wie Router, Brücken und Gateways - Herstellung von Sende- und Empfangsantennen - Herstellung von Kabel-TV-Geräten - Herstellung von Funkrufempfängern - Herstellung von Mobiltelefonen - Herstellung von mobilen Telekommunikationsgeräten - Herstellung von Studio- und Sendegeräten für den Hör- und Fernsehfunk, einschließlich Fernsehkameras - Herstellung von Modems (Übertragungsgeräte) - Herstellung von Einbruchs- oder Diebstahlalarmgeräten und Feuermeldern, bei denen ein Signal an die Kontrollstation übertragen wird - Herstellung von Rundfunk- und Fernsehsendegeräten - Herstellung von Infrarot-Kommunikationsgeräten (z. B. Fernbedienungsgeräte) Diese Klasse umfasst nicht: - Herstellung von elektronischen Bauelementen und Unterbaugruppen für Kommunikationsgeräte, darunter interne/externe Computer-Modems (s. 26.1) - Herstellung von bestückten Leiterplatten (s. 26.12) - Herstellung von Datenverarbeitungsgeräten und peripheren Geräten (s. 26.20) - Herstellung von Geräten der Unterhaltungselektronik (s. 26.40) - Herstellung von GPS-Geräten (s. 26.51) - Herstellung von elektronischen Anzeigetafeln (s. 27.90) - Herstellung von Ampelanlagen (s. 27.90) @de
scope note: This class includes the manufacture of telephone and data communications equipment used to move signals electronically over wires or through the air such as radio and television broadcast and wireless communications equipment. This class includes: - manufacture of central office switching equipment - manufacture of cordless telephones - manufacture of private branch exchange (PBX) equipment - manufacture of telephone and facsimile equipment, including telephone answering machines - manufacture of data communications equipment, such as bridges, routers, and gateways - manufacture of transmitting and receiving antenna - manufacture of cable television equipment - manufacture of pagers - manufacture of cellular phones - manufacture of mobile communication equipment - manufacture of radio and television studio and broadcasting equipment, including television cameras - manufacture of modems, carrier equipment - manufacture of burglar and fire alarm systems, sending signals to a control station - manufacture of radio and television transmitters - manufacture of communication devices using infrared signal (e.g. remote controls) This class excludes: - manufacture of electronic components and subassemblies used in communications equipment, including internal/external computer modems, see 26.1 - manufacture of loaded electronic boards, see 26.12 - manufacture of computers and computer peripheral equipment, see 26.20 - manufacture of consumer audio and video equipment, see 26.40 - manufacture of GPS devices, see 26.51 - manufacture of electronic scoreboards, see 27.90 - manufacture of traffic lights, see 27.90 @en
scope note: Esta clase comprende la fabricación de equipos telefónicos y de transmisión de datos utilizados para transmitir señales electrónicamente a través de cables, o a través del aire como en el caso de los equipos de emisión de radio y televisión y de comunicación inalámbrica. Esta clase comprende: - la fabricación de equipos de conmutación de centrales telefónicas - la fabricación de teléfonos inalámbricos - la fabricación de equipos para centralitas privadas conectadas a la red pública (PBX) - la fabricación de equipos telefónicos y de fax, incluidos los contestadores automáticos - la fabricación de equipos de transmisión de datos, como puentes (bridges), enrutadores (routers) y puntos de acceso (gateways) - la fabricación de antenas de transmisión y recepción - la fabricación de equipos de televisión por cable - la fabricación de localizadores (buscapersonas) - la fabricación de teléfonos móviles - la fabricación de equipos de comunicación portátiles - la fabricación de equipos de emisión y para estudios de radio y televisión, incluidas las cámaras de televisión - la fabricación de módems, equipos portadores - la fabricación de sistemas de alarma antirrobo y antiincendios, que emiten señales a una central de control - la fabricación de transmisores de radio y televisión - la fabricación de dispositivos de comunicación que utilizan señales infrarrojas (p. ej., mandos a distancia) Esta clase no comprende: - la fabricación de componentes y subensamblajes electrónicos utilizados en equipos de comunicaciones, incluidos los módems informáticos internos y externos (véase 26.1) - la fabricación de circuitos impresos ensamblados (véase 26.12) - la fabricación de ordenadores y periféricos (véase 26.20) - la fabricación de equipos de audio y vídeo de consumo (véase 26.40) - la fabricación de dispositivos GPS (véase 26.51) - la fabricación de marcadores electrónicos (véase 27.90) - la fabricación de semáforos (véase 27.90) @es
scope note: Cette classe comprend la fabrication d’équipements téléphoniques et de communication des données utilisés pour transmettre électroniquement des signaux par les fils ou par les airs tels que les émissions de radio ou de télévision et les équipements de communication sans fil. Cette classe comprend: - la fabrication d’équipements de commutation de central - la fabrication de téléphones sans fil - la fabrication d’équipements d’autocommutateur privé - la fabrication d’équipements téléphoniques ou de télécopieurs, y compris les répondeurs téléphoniques - la fabrication d’équipements de communication de données tels que routeurs, ponts et passerelles - la fabrication d’antennes de transmission et de réception - la fabrication d’équipements pour la télévision par câble - la fabrication de téléavertisseurs - la fabrication de téléphones portables - la fabrication d’équipements de communication mobile - la fabrication d’équipements d’enregistrement en studio et de diffusion d’émissions de radio et de télévision, y compris les caméras de télévision - la fabrication de modems, équipement porteur - la fabrication de systèmes de détection d’effraction et d’incendie, transmettant des signaux à une station de contrôle - la fabrication de transmetteurs de radio et de télévision - la fabrication d’appareils de communication utilisant les signaux infrarouges (par exemple: les commandes à distance) Cette classe ne comprend pas: - la fabrication de composants électroniques et de sous-assemblages utilisés dans les équipements de communication, y compris les modems informatiques internes ou externes, voir 26.1 - la fabrication de cartes électroniques assemblées, voir 26.12 - la fabrication d’ordinateurs et d’équipements périphériques, voir 26.20 - la fabrication d’équipements audio et vidéo grand public, voir 26.40 - la fabrication d’appareils GPS, voir 26.51 - la fabrication de tableaux d’affichage électroniques, voir 27.90 - la fabrication de feux de signalisation, voir 27.90 @fr
scope note: Ovaj razred uključuje proizvodnju uređaja za prijenos podataka putem telefona ili računala, a koriste se za elektronički prijenos signala putem žica ili zrakom, primjerice radijsko i televizijsko emitiranje te za proizvodnju opreme za bežični prijenos podataka. Ovaj razred uključuje: - proizvodnju uređaja za prespajanje telefonskih centrala - proizvodnju bežičnih telefona - proizvodnju uređaja za izgradnju glavne centrale (PBX) - proizvodnju telefonske i telefaksne opreme, uključujući automatsku telefonsku sekretaricu - proizvodnju uređaja za prijenos podataka kao što su premosnici, usmjernici, pristupnici - proizvodnju antena za odašiljanje i primanje signala - proizvodnju televizijskih kablova - proizvodnju dojavljivača ("pagers") - proizvodnju mobilnih telefona - proizvodnju opreme za mobilnu komunikaciju - proizvodnju opreme za radijski studio i emitiranje, uključujući televizijske kamere - proizvodnju modema i opreme za prijenos podataka - proizvodnju unutrašnjih/vanjskih računalnih modema - proizvodnju alarmnih sistema za slučaj pljačke ili požara, slanje signala kontrolnoj stanici - proizvodnju radijskih i televizijskih odašiljača - proizvodnju infracrvenih priključaka (npr. za daljinsko upravljanje) Ovaj razred isključuje: - proizvodnju elektroničkih komponenata i podsklopova koji se koriste u prijenosnim uređajima, uključujući unutarnje/vanjske računalne modeme (PC-tipa) vidi 26.1 - proizvodnju učitanih elektroničkih ploča, vidi 26.12 - proizvodnju računala i periferne računalne opreme, vidi 26.20 - proizvodnju audio i videoopreme namijenjene potrošačima, vidi 26.40 - proizvodnju GPS-uređaja, vidi 26.51 - proizvodnju elektroničkih semafora (npr. onih na kojima se bilježe rezultati na utakmicama), vidi 27.90 - proizvodnju prometnih semafora, vidi 27.90
scope note: Į šią klasę įeina telefono ryšio ir duomenų perdavimo įrangos, naudojamos perduoti signalus elektroniniu būdu laidais arba oru, tokios kaip radijo ir televizijos transliavimo ir belaidžio ryšio įranga, gamyba. Į šią klasę įeina: - telefono stoties perjungimo įrangos gamyba - belaidžių telefonų gamyba - privačiųjų automatinių telefono stočių įrangos gamyba - telefono ir fakso įrangos, įskaitant telefono atsakiklius, gamyba - duomenų perdavimo įrangos, tokios kaip sąsajos tiltai, maršruto parinktuvai, tinklų sietuvai, gamyba - perdavimo ir priėmimo antenų gamyba - kabelinės televizijos įrangos gamyba - radijo ieškų gamyba - korinio ryšio telefonų gamyba - judriojo ryšio įrangos gamyba - radijo ir televizijos studijų bei transliavimo įrangos, įskaitant televizijos kameras, gamyba - modemų, nešliadažnės įrangos gamyba - įsilaužimo ir gaisro signalizacijos sistemų, perduodančių signalus į valdymo stotį, gamyba - radijo ir televizijos siųstuvų gamyba - ryšio įtaisų, naudojančių infraraudonuosius signalus (pvz., nuotolinio valdymo įtaisų), gamyba Į šią klasę neįeina: - elektroninių komponentų ir pablokių, naudojamų ryšių įrangoje, įskaitant vidinius ir išorinius kompiuterių modemus, gamyba, žr. 26.1 grupę - sumontuotų elektroninių plokščių gamyba, žr. 26.12 - kompiuterių ir kompiuterių išorinės įrangos gamyba, žr. 26.20 - buitinės garso ir vaizdo įrangos gamyba, žr. 26.40 - pasaulinės vietos nustatymo sistemos įtaisų gamyba, žr. 26.51 - elektroninių švieslenčių gamyba, žr. 27.90 - šviesoforų gamyba, žr. 27.90 @lt
scope note: Данная группа включает производство измерительного, тестирующего и навигационного оборудования для различных промышленных и непромышленных целей, включая контролирующие по времени измерительные устройства, такие как наручные часы, прочие виды часов и подобные устройства. @ru
scope note: Bu sınıf, elektronik olarak kablolar üzerinden veya radyo ve televizyon yayını ve kablosuz iletişim donanımı gibi hava aracılığı ile sinyal taşımada kullanılan telefon ve veri iletişim donanımlarının imalatını içermektedir. Bu sınıf aşağıdakileri kapsamaktadır; - Merkezi iletişim santral donanımları imalatı, - kablosuz telefon imalatı, - özel sayısal veya analog telefon santrallerinin imalatı, - telesekreter imalatı da dahil telefon ve faks teçhizatlarının imalatı, - ağ geçitleri, köprüleri ve yönlendiricileri gibi veri iletim donanımlarının imalatı, - yayın alıcı ve verici anten imalatı, - kablolu televizyon donanımlarının imalatı, - çağrı cihazları imalatı, - cep telefonları imalatı, - mobil iletişim donanımları imalatı, - radyo ve televizyon stüdyoları ve yayın teçhizatları imalatı (ticari televizyon kameraları dahil), - harici modemler, ,taşıyıcı ekipmanların imalatı, - kontrol istasyonlarına sinyal gönderen hırsız ve yangın alarm sistemleri imalatı, - radyo ve televizyon vericilerinin imalatı, - kızıl ötesi (enfraruj) sinyal kullanan iletişim cihazlarının imalatı (örn. uzaktan kumanda cihazları). Kapsam dışı olanlar; -iletişim donanımlarında kullanılan elektronik parçalar ve montaj parçalarının imalatı (dahili ve harici bilgisayar modem kartları dahil), bkz. 26.1, - yüklü elektronik kart imalatı, bkz. 26.12, - bilgisayarların ve bilgisayar çevre donanımlarının imalatı, bkz. 26.20, - tüketiciler için ses ve görüntü donanımı imalatı, bkz. 26.40, - Global Konumlandırma Sistemi (GPS) cihazlarının imalatı, bkz. 26.51, - elektronik sayı levhaları (skorbord) imalatı, bkz. 27.90, - trafik ışıklarının imalatı, bkz. 27.90. @tr
preferred label: Производство на радио-, телевизионна и далекосъобщителна техника @bg
preferred label: Výroba komunikačních zařízení @cs
preferred label: Fremstilling af kommunikationsudstyr @da
preferred label: Herstellung von Geräten und Einrichtungen der Telekommunikationstechnik @de
preferred label: Κατασκευή εξοπλισμού επικοινωνίας· @el
preferred label: Fabricación de equipos de telecomunicaciones @es
preferred label: Sideseadmete tootmine @et
preferred label: Viestintälaitteiden valmistus @fi
preferred label: Fabrication d'équipements de communication @fr
preferred label: Híradástechnikai berendezés gyártása
preferred label: Fabbricazione di apparecchiature per le comunicazioni @it
preferred label: Ryšių įrangos gamyba @lt
preferred label: Sakaru iekārtu ražošana @lv
preferred label: Manifattura ta' tagħmir għal komunikazzjoni @mt
preferred label: Vervaardiging van communicatieapparatuur @nl
preferred label: Produksjon av kommunikasjonsutstyr @no
preferred label: Produkcja sprzętu (tele)komunikacyjnego @pl
preferred label: Fabricação de aparelhos e de equipamentos para comunicações @pt
preferred label: Fabricarea echipamentelor de comunicaţii @ro
preferred label: Производство коммуникационного оборудования @ru
preferred label: Výroba komunikačných zariadení @sk
preferred label: Proizvodnja komunikacijskih naprav @sl
preferred label: Tillverkning av kommunikationsutrustning @sv
preferred label: İletişim ekipmanlarının imalatı @tr
broader: Manufacture of communication equipment

Manufacture of consumer electronics
type: Concept
notation: 26.4
status: valid
status modified: 2013-10-18
accepted date: 2013-10-18
in scheme: Statistical Classification of Economic Activities in the European Community, Rev. 2 (2008)
scope note: Данный класс включает производство поисковых, детекционных, навигационных, дистанционных, аэронавигационных и подводных навигационных приборов; приборов для осуществления автоматического контроля и управления, таких как, нагреватели, воздушные кондиционеры, охладительные установки и приборы; инструментов и устройств для измерения, отображения, показа, записи, передачи и контроля температуры, влажности, давления, очистки, сгорания, течения, уровня, вязкости, плотности, кислотности, концентрации и ротации; счетчиков (подсчета), водомеров и счетных устройств; инструментов для измерения и испытательных характеристик электроснабжения; инструментов и приборов для проведения лабораторного анализа химических или физических компонентов или образцов в твердом, жидком, газообразном или смешанном состоянии; прочих инструментов для измерения и тестирования и запасных частей к ним. Производство неэлектрического тестирующего и навигационного оборудования (за исключением простых механических инструментов) также включено в данный класс. Этот класс включает: - производство оборудования для авиационных двигателей - производство приборов контроля над выбросом автомобильных выхлопных газов - производство метеорологического оборудования - производство приборов для тестирования и проверки физических свойств - производство полиграфного оборудования - производство оборудования для выявления и мониторинга радиационного излучения - производство метрологического оборудования - производство стеклянных и биметаллических термометров для измерения температуры жидкостей (за исключением медицинских) - производство приборов для измерения влажности - производство приборов для контроля гидронических пределов - производство приборов для контроля пламени - производство спектрометров - производство пневматических измерительных приборов - производство бытовых измерителей (например, водомеров, газомеров, счетчиков электроэнергии) - производство водомеров и счетных устройств - производство счетных приборов -… @ru
preferred label: Производство на битова електроника @bg
preferred label: Výroba spotřební elektroniky @cs
preferred label: Fremstilling af elektronik til husholdninger @da
preferred label: Herstellung von Geräten der Unterhaltungselektronik @de
preferred label: Κατασκευή ηλεκτρονικών ειδών ευρείας κατανάλωσης @el
preferred label: Fabricación de productos electrónicos de consumo @es
preferred label: Tarbeelektroonika tootmine @et
preferred label: Viihde-elektroniikan valmistus @fi
preferred label: Fabrication de produits électroniques grand public @fr
preferred label: Elektronikus fogyasztási cikk gyártása
preferred label: Fabbricazione di prodotti di elettronica di consumo @it
preferred label: Vartotojiškos elektroninės įrangos gamyba @lt
preferred label: Sadzīves elektronisko iekārtu ražošana @lv
preferred label: Manifattura ta' elettronika ta' konsum @mt
preferred label: Vervaardiging van consumentenelektronica @nl
preferred label: Produksjon av elektronikk til husholdningsbruk @no
preferred label: Produkcja elektronicznego sprzętu powszechnego użytku @pl
preferred label: Fabricação de receptores de rádio e de televisão e bens de consumo similares @pt
preferred label: Fabricarea produselor electronice de larg consum @ro
preferred label: Производство приборов бытовой электроники @ru
preferred label: Výroba spotrebnej elektroniky @sk
preferred label: Proizvodnja elektronskih naprav za široko rabo @sl
preferred label: Tillverkning av hemelektronik @sv
preferred label: Tüketici elektroniği ürünlerinin imalatı @tr
broader: Manufacture of computer, electronic and optical products
narrower: Manufacture of consumer electronics

Manufacture of consumer electronics
type: Concept
notation: 26.40
status: valid
status modified: 2013-10-18
accepted date: 2013-10-18
in scheme: Statistical Classification of Economic Activities in the European Community, Rev. 2 (2008)
scope note: Производство на битова аудио- и видеотехника, озвучителни уредби и усилватели за музикалните инструменти. - производство на записващи апарати за видеокасети и на апарати, които правят запис-копие - производство на телевизионни приемници - производство на телевизионни монитори и дисплеи - производство на звукозаписни и презаписващи апарати - производство на стерео уредби - производство на радиоприемници - производство на високоговорителни уредби - производство на непрофесионални видеокамери - производство на многодискови устройства с автоматична смяна на дисковете (джубокс) - производство на усилватели за музикални инструменти и озвучителни уредби - производство на микрофони - производство на възпроизвеждащи апарати за компактдискове (CD) и цифрови дискове ( DVD) - производство на уредби за забавление, при които хората изпълняват песни под акомпанимента на записана музика (караоке) - производство на слушалки (например за радио, компютър, стерео) - производство на видеоигри (използвани с телевизионен приемник или с вграден екран) - възпроизвеждане на записани носители (аудио-, видео-, компютърни и други) - 18.2 - производство на монитори и периферни устройства за компютри - 26.20 - производство на автоматични телефонни секретари - 26.30 - производство на носими приемници за системи за повикване, оповестяване или издирване на хора (пейджъри) - 26.30 - производство на апарати за управление от разстояние (дистанционни) с радиовълни или с инфрачервени лъчи - 26.30 - производство на оборудване за студиа за разпространение на радио- и телевизонни програми като апарати за възпроизвеждане, предавателни и приемателни антени, телевизионни камери - 26.30 - производство на антени - 26.30 - производство на цифрови фотоапарати - 26.70 - производство на електронни игри с постоянен (несменяем) софтуер - 32.40 @bg
scope note: Tato třída zahrnuje výrobu elektronických audio- a videopřístrojů pro domácí zábavu, pro motorová vozidla, pro místní rozhlas a výrobu zesilovačů hudebních nástrojů. Z: - výrobu videorekordérů a reprodukčních přístrojů - výrobu televizorů - výrobu televizních obrazovek a displejů - výrobu zvukových záznamů a reprodukčních systémů - výrobu gramofonů, magnetofonů atd. - výrobu stereo zařízení - výrobu rozhlasových přijímačů - výrobu reproduktorových soustav - výrobu videokamer domácího typu - výrobu hudebních automatů (jukeboxů) - výrobu zesilovačů pro hudební nástroje a systémů pro místní rozhlas - výrobu mikrofonů - výrobu přehrávačů CD a DVD - výrobu přístrojů na karaoke - výrobu sluchátek (např. radiových, stereo, k počítači) - výrobu videoher (konzolí pro videohry) N: - reprodukci nahraných médií (počítačová media, zvuk, obraz atd.) (18.20) - výrobu periferních zařízení k počítačům a počítačových monitorů (26.20) - výrobu telefonních záznamníků (26.30) - výrobu stránkovačů (26.30) - výrobu přístrojů dálkového ovládání (s radiovou nebo infračervenou technikou) (26.30) - výrobu zařízení rozhlasových a televizních studií, např. vysílací zařízení, vysílací a přijímací antény, komerční videokamery (26.30) - výrobu antén (26.30) - výrobu digitálních kamer (26.70) - výrobu elektronických her s pevně instalovaným (nevyměnitelným) softwarem (32.40) @cs
scope note: Diese Klasse umfasst die Herstellung von elektronischen Audio- und Videogeräten für den Haushalt und für Fahrzeuge, von Rundspruchsystemen und Verstärkergeräten für Musikinstrumente. Diese Klasse umfasst: - Herstellung von Videorecordern und Vervielfältigungsgeräten - Herstellung von Fernsehempfangsgeräten - Herstellung von Fernsehbildschirmen und -anzeigen - Herstellung von Tonaufnahmegeräten und -vervielfältigungssystemen - Herstellung von Stereoanlagen - Herstellung von Rundfunkempfangsgeräten - Herstellung von Lautsprechersystemen - Herstellung von Amateur-Videokameras - Herstellung von Musikboxen - Herstellung von Verstärkern für Musikinstrumente und Rundspruchsysteme - Herstellung von Mikrofonen - Herstellung von CD- und DVD-Abspielgeräten - Herstellung von Karaokegeräten - Herstellung von Kopfhörern (z. B. Radio-, Stereo- oder Computerkopfhörer) - Herstellung von Videospielgeräten Diese Klasse umfasst nicht: - Vervielfältigung von bespielten Ton-, Bild und Datenträgern (s. 18.2) - Herstellung von Computer-Peripheriegeräten und -Bildschirmen (s. 26.20) - Herstellung von Telefonanrufbeantwortern (s. 26.30) - Herstellung von Funkrufgeräten (s. 26.30) - Herstellung von Fernbedienungsgeräten mit Funk- und Infrarottechnik (s. 26.30) - Herstellung von Studio-Sendegeräten, wie Wiedergabegeräte, Sende- und Empfangsantennen, kommerzielle Videokameras (s. 26.30) - Herstellung von Antennen (s. 26.30) - Herstellung von Digitalkameras (s. 26.70) - Herstellung von elektronischen Spielen mit fest installierter (nicht austauschbarer) Software (s. 32.40) @de
scope note: This class includes the manufacture of electronic audio and video equipment for home entertainment, motor vehicle, public address systems and musical instrument amplification. This class includes: - manufacture of video cassette recorders and duplicating equipment - manufacture of televisions - manufacture of television monitors and displays - manufacture of audio recording and duplicating systems - manufacture of stereo equipment - manufacture of radio receivers - manufacture of speaker systems - manufacture of household-type video cameras - manufacture of jukeboxes - manufacture of amplifiers for musical instruments and public address systems - manufacture of microphones - manufacture of CD and DVD players - manufacture of karaoke machines - manufacture of headphones (e.g. radio, stereo, computer) - manufacture of video game consoles This class excludes: - reproduction of recorded media (computer media, sound, video, etc.), see 18.2 - manufacture of computer peripheral devices and computer monitors, see 26.20 - manufacture of telephone answering machines, see 26.30 - manufacture of paging equipment, see 26.30 - manufacture of remote control devices (radio and infrared), see 26.30 - manufacture of broadcast studio equipment such as reproduction equipment, transmitting and receiving antennas, commercial video cameras, see 26.30 - manufacture of antennas, see 26.30 - manufacture of digital cameras, see 26.70 - manufacture of electronic games with fixed (non-replaceable) software, see 32.40 @en
scope note: Esta clase comprende la fabricación de equipos electrónicos de audio y vídeo para el ocio doméstico, los vehículos de motor, los sistemas de megafonía y la amplificación de instrumentos musicales. Esta clase comprende: - la fabricación de aparatos de grabación y duplicación de cintas de vídeo - la fabricación de televisiones - la fabricación de monitores y pantallas de televisión - la fabricación de sistemas de grabación y duplicación de sonido - la fabricación de equipos estereofónicos - la fabricación de receptores de radio - la fabricación de sistemas de altavoces - la fabricación de videocámaras de uso doméstico - la fabricación de máquinas de discos (jukeboxes) - la fabricación de amplificadores para instrumentos musicales y sistemas de megafonía - la fabricación de micrófonos -la fabricación de reproductores de CD y de DVD - la fabricación de equipos de karaoke - la fabricación de auriculares (p. ej., para radio, equipos estereofónicos, ordenador) - la fabricación de consolas de videojuegos Esta clase no comprende: - la reproducción de soportes grabados (soportes informáticos, de sonido, de vídeo, etc.) (véase 18.20) - la fabricación de dispositivos periféricos informáticos y monitores de ordenador (véase 26.20) - la fabricación de contestadores telefónicos automáticos (véase 26.30) - la fabricación de localizadores (véase 26.30) - la fabricación de mandos a distancia (radio e infrarrojos) (véase 26.30) - la fabricación de equipos para estudios de radiodifusión, como dispositivos de reproducción, antenas de transmisión y recepción, videocámaras de uso profesional (véase 26.30) - la fabricación de antenas (véase 26.30) - la fabricación de cámaras digitales (véase 26.70) - la fabricación de juegos electrónicos con software preinstalado (no reemplazable) (véase 32.40) @es
scope note: Cette classe comprend la fabrication d’équipements électroniques audio et vidéo destinés aux loisirs domestiques, aux véhicules automobiles, aux systèmes d’information du public et à l’amplification des instruments de musique. Cette classe comprend: - la fabrication de magnétoscopes et d’équipements de reproduction - la fabrication de téléviseurs - la fabrication de moniteurs et d’écrans de télévision - la fabrication de systèmes d’enregistrement et de reproduction audio - la fabrication d’équipements stéréo - la fabrication de récepteurs radio - la fabrication de systèmes d’amplification du son - la fabrication de caméscopes destinés à un usage domestique - la fabrication de juke-boxes - la fabrication de matériel d’amplification des instruments de musique et de systèmes d’information du public - la fabrication de microphones - la fabrication de lecteurs CD et DVD - la fabrication de machines à karaoké - la fabrication d’écouteurs (par exemple: radio, stéréo, ordinateur) - la fabrication de consoles de jeux vidéo Cette classe ne comprend pas: - la reproduction de supports enregistrés (données informatiques, son, vidéo, etc.), voir 18.2 - la fabrication d’équipements informatiques périphériques et d’écrans d’ordinateurs, voir 26.20 - la fabrication de répondeurs téléphoniques, voir 26.30 - la fabrication d’équipements destinés aux services de téléavertissement, voir 26.30 - la fabrication d’appareils de radiotélécommande (radio et infrarouge), voir 26.30 - la fabrication d’équipements d’enregistrement en studio, tels que des appareils de reproduction, des antennes de transmission et de réception, des caméras vidéo destinées à un usage commercial, voir 26.30 - la fabrication d’antennes, voir 26.30 - la fabrication d’appareils photos numériques, voir 26.70 - la fabrication de jeux électroniques contenant des logiciels fixes (inamovibles), voir 32.40 @fr
scope note: Ovaj razred uključuje proizvodnju elektroničke audio i video opreme za kućnu zabavu, motornih vozila, sustava javnih adresa i pojačala za glazbene instrumente. Ovaj razred uključuje: - proizvodnju videouređaja i opreme za umnožavanje - proizvodnju televizora - proizvodnju televizijskih monitora i zaslona (displeja) - proizvodnju audiorekordera i sustava za umnožavanje - proizvodnju stereoopreme - proizvodnju radioprijamnika - proizvodnju sustava zvučnika - proizvodnju kućnih videokamera - proizvodnju glazbenih automata - proizvodnju pojačala za glazbene instrumente i sustava javnih adresa - proizvodnju mikrofona - proizvodnju CD i DVD-uređaja - proizvodnju karaoke-uređaja - proizvodnju naglavnih slušalica (npr. radio, stereo, računala) - proizvodnju konzola za videoigre Ovaj razred isključuje: - umnožavanje snimljenih zapisa (računalnih medija, zvuka, videa, itd.), vidi 18.2 - proizvodnju računalnih perifernih uređaja i računalnih monitora, vidi 26.20 - proizvodnju telefonskih sekretarica, vidi 26.30 - proizvodnju sprava za označavanje stranica brojevima, opreme za dojavljivače (''pagers''), vidi 26.30 - proizvodnju uređaja za daljinsko upravljanje (radijsko i infracrveno), vidi 26.30 - proizvodnju opreme za studijsko emitiranje kao što su oprema za snimanje, antene za odašiljanje i primanje - komercijalne videokamere, vidi 26.30 - proizvodnju antena, vidi 26.30 - proizvodnju digitalnih kamera, vidi 26.70 - proizvodnju elektroničkih igrica s fiksnim (nezamjenjivim) softverom, vidi 32.40
scope note: Į šią klasę įeina elektroninės vaizdo ir garso įrangos, skirtos laisvalaikiui namuose, variklinėms transporto priemonėms, įgarsinimo sistemoms ir muzikos instrumentų garsui stiprinti, gamyba. Į šią klasę įeina: - kasetinių vaizdo magnetofonų ir dauginimo įrangos gamyba - televizorių gamyba - televizorių monitorių ir vaizduoklių gamyba - garso įrašymo ir įrašų dauginimo sistemų gamyba - stereofoninės įrangos gamyba - radijo imtuvų gamyba - garsiakalbių sistemų gamyba - buitinių vaizdo kamerų gamyba - muzikinių automatų gamyba - muzikos instrumentų ir įgarsinimo sistemų stiprintuvų gamyba - mikrofonų gamyba - kompaktinių diskų (CD) ir skaitmeninių vaizdo diskų (DVD) leistuvų gamyba - karaoke aparatų gamyba - ausinių (pvz., radijo, stereo ir kompiuterinių) gamyba - vaizdo žaidimų pultų gamyba Į šią klasę neįeina: - įrašytų laikmenų (kompiuterinių garso, vaizdo, laikmenų ir kt.) tiražavimas, žr. 18.2 - kompiuterių išorinių įtaisų ir kompiuterių monitorių gamyba, žr. 26.20 - telefono atsakiklių gamyba, žr. 26.30 - radijo ieškos įrangos gamyba, žr. 26.30 - nuotolinio valdymo įtaisų (radijo ir infraraudonųjų) gamyba, žr. 26.30 - transliavimo studijų įrangos, pvz., tiražavimo įrangos, perdavimo ir priėmimo antenų ir profesionaliųjų vaizdo kamerų, gamyba žr. 26.30 - antenų gamyba, žr. 26.30 - skaitmeninių fotoaparatų gamyba, žr. 26.70 - elektroninių žaidimų su pastovia (nepakeičiama) programine įranga gamyba, žr. 32.40 @lt
scope note: Данный класс включает производство наручных часов, часов и устройств синхронизации и запасных частей для них. Этот класс включает: - производство наручных часов и часов всех видов, включая контрольную панель - производство часовых корпусов, в т.ч. из ценных металлов - производство оборудования для счета времени, измерения, записи и прочих устройств для отображения интервала времени: • паркоматов • табельных часов • измерителей времени и прочих данных • хронометров - производство реле времени и прочих разблокирующих устройств с часовыми механизмами или синхронизаторами: • замков с часовым механизмом - производство компонентов для часов и наручных часов: • ходовой части для всех видов часов и для наручных часов • пружин, драгоценных камней, циферблатов, ручек, пластин, мостов и других частей • часовых корпусов из любых материалов Этот класс исключает: - производство неметаллических браслетов для наручных часов (например, из ткани, кожи, пластика), см. 15.12 - производство ценных металлических браслетов для наручных часов, см. 32.12 - производство недрагоценных металлических браслетов для наручных часов, см. 32.13 @ru
scope note: Bu sınıf, ev eğlence sistemleri, motorlu taşıtlar, havaalanı, alışveriş merkezi v.b. yerlerdeki hoparlör sistemleri ve müzik aletleri ses yükselticileri için elektronik müzik ve görüntü donanımlarının imalatını içermektedir. Bu sınıf aşağıdakileri kapsamaktadır; - video kaset kayıt cihazları ve çoğaltma donanımları imalatı, - televizyon imalatı, - televizyon ekranları ve görüntü panelleri imalatı, - ses kaydetme ve çoğaltma sistemleri imalatı, - stereo teçhizatları imalatı, - radyo imalatı, - hoparlör sistemleri imalatı, - ev tipi video kamera imalatı, - parayla çalışan otomatik plakçalar imalatı, - müzik enstrümanları ve havaalanı, alışveriş merkezi v.b. yerlerdeki hoparlör sistemleri için ses yükselticisi imalatı, - mikrofon imalatı, - CD ve DVD çalar imalatı, - karaoke makineleri imalatı, - kulaklıklar (örn. radyo, stereo, bilgisayar) imalatı, - video oyun konsolları imalatı. Kapsam dışı olanlar; - kayıtlı medyanın çoğaltılması (bilgisayar medyası, ses, video, vb), bkz. 18.2, - bilgisayar çevre donanımları ve bilgisayar monitörleri imalatı, bkz. 26.20, - telesekreter imalatı, bkz. 26.30, - çağrı cihazı imalatı, bkz. 26.30, - uzaktan kumanda aletleri (radyo ve kızılötesi (enfraruj) imalatı, bkz. 26.30, - çoğaltma teçhizatları, yayın alıcı ve verici antenler, ticari video kameraları gibi stüdyo yayın teçhizatları imalatı, bkz. 26.30, - anten imalatı, bkz. 26.30, - dijital kamera imalatı, bkz. 26.70, - sabit (değiştirilemez) yazılımlı elektronik oyun imalatı, bkz. 32.40. @tr
preferred label: Производство на битова електроника @bg
preferred label: Výroba spotřební elektroniky @cs
preferred label: Fremstilling af elektronik til husholdninger @da
preferred label: Herstellung von Geräten der Unterhaltungselektronik @de
preferred label: Κατασκευή ηλεκτρονικών ειδών ευρείας κατανάλωσης @el
preferred label: Fabricación de productos electrónicos de consumo @es
preferred label: Tarbeelektroonika tootmine @et
preferred label: Viihde-elektroniikan valmistus @fi
preferred label: Fabrication de produits électroniques grand public @fr
preferred label: Elektronikus fogyasztási cikk gyártása
preferred label: Fabbricazione di prodotti di elettronica di consumo @it
preferred label: Vartotojiškos elektroninės įrangos gamyba @lt
preferred label: Sadzīves elektronisko iekārtu ražošana @lv
preferred label: Manifattura ta' elettronika ta' konsum @mt
preferred label: Vervaardiging van consumentenelektronica @nl
preferred label: Produksjon av elektronikk til husholdningsbruk @no
preferred label: Produkcja elektronicznego sprzętu powszechnego użytku @pl
preferred label: Fabricação de receptores de rádio e de televisão e bens de consumo similares @pt
preferred label: Fabricarea produselor electronice de larg consum @ro
preferred label: Производство приборов бытовой электроники @ru
preferred label: Výroba spotrebnej elektroniky @sk
preferred label: Proizvodnja elektronskih naprav za široko rabo @sl
preferred label: Tillverkning av hemelektronik @sv
preferred label: Tüketici elektroniği ürünlerinin imalatı @tr
broader: Manufacture of consumer electronics

Manufacture of instruments and appliances for measuring, testing and navigation; watches and clocks
type: Concept
notation: 26.5
status: valid
status modified: 2013-10-18
accepted date: 2013-10-18
in scheme: Statistical Classification of Economic Activities in the European Community, Rev. 2 (2008)
scope note: Tato skupina zahrnuje výrobu meřicích, zkušebních a navigačních přístrojů pro různé účely, průmyslového i neprůmyslového využití, včetně časoměrných přístrojů, např. hodiny, hodinky a podobná zařízení. @cs
scope note: Diese Gruppe umfasst die Herstellung von Mess-, Kontroll-, Navigations- und Steuerungsinstrumenten und -vorrichtungen für verschiedene industrielle und nichtindustrielle Anwendungszwecke, darunter Zeitmessgeräte wie Uhren und andere Vorrichtungen. @de
scope note: This group includes the manufacture of measuring, testing and navigating equipment for various industrial and non-industrial purposes, including time-based measuring devices such as watches and clocks and related devices. @en
scope note: Este grupo comprende la fabricación de equipos de medida, verificación y navegación para diversos fines industriales y no industriales, incluidos los dispositivos de medición en función del tiempo como relojes y aparatos afines. @es
scope note: Ce groupe comprend la fabrication d’instruments de mesure, de contrôle et de navigation pour divers usages industriels et non industriels, y compris les appareils de mesure du temps, tels que les montres et horloges et les appareils similaires. @fr
scope note: Ova skupina uključuje proizvodnju opreme za mjerenje, ispitivanje, navigaciju i kontrolu u različitim industrijskim i neindustrijskim procesima, uključujući uređaje koji se temelje na mjerenju vremena kao što su satovi i pripadajući uređaji.
scope note: Į šią grupę įeina pramonėje ir kitose srityse naudojamų matavimo, tikrinimo, bandymo, navigacijos ir valdymo prietaisų arba aparatų, įskaitant laiko matuoklius, tokius kaip laikrodžiai, rankiniai laikrodžiai ir susiję įtaisai, gamyba. @lt
scope note: Bu grup, kol saatleri, masa saatleri ve benzer aletler gibi zaman bazlı ölçüm aletleri de dahil, sanayi amaçlı olsun ya da olmasın çeşitli ölçme, test ve seyrüsefer cihazlarının imalatını içermektedir. @tr
preferred label: Производство на уреди и апарати за измерване, изпитване и навигация; производство на часовници @bg
preferred label: Výroba měřicích, zkušebních a navigačních přístrojů; výroba časoměrných přístrojů @cs
preferred label: Fremstilling af udstyr til måling, afprøvning, navigation og kontrol; ure @da
preferred label: Herstellung von Mess-, Kontroll-, Navigations- u. ä. Instrumenten und Vorrichtungen; Herstellung von Uhren @de
preferred label: Κατασκευή οργάνων και συσκευών μέτρησης, δοκιμών και πλοήγησης· κατασκευή ρολογιών @el
preferred label: Fabricación de instrumentos y aparatos de medida, verificación y navegación; fabricación de relojes @es
preferred label: Mõõte-, katse- ja navigatsiooniseadmete tootmine; ajanäitajate tootmine @et
preferred label: Mittaus-, testaus- ja navigointivälineiden ja -laitteiden valmistus; kellot @fi
preferred label: Fabrication d'instruments et d'appareils de mesure, d'essai et de navigation; horlogerie @fr
preferred label: Műszer-, óragyártás
preferred label: Fabbricazione di strumenti e apparecchi di misurazione, prova e navigazione; orologi @it
preferred label: Matavimo, bandymo, navigacinės ir kontrolės įrangos gamyba; įvairių tipų laikrodžių gamyba @lt
preferred label: Mērīšanas, pārbaudes, izmēģināšanas un navigācijas instrumentu un aparātu ražošana; pulksteņu ražošana @lv
preferred label: Manifattura ta' strumenti u għodod għall-kejl, ittestjar, navigar; arloġġi ta' l-idejn u arloġġi oħra @mt
preferred label: Vervaardiging van meet-, controle- en navigatie-instrumenten en -apparatuur; vervaardiging van uurwerken @nl
preferred label: Produksjon av måle-, kontroll- og navigasjonsinstrumenter, og klokker og ur @no
preferred label: Produkcja instrumentów i przyrządów pomiarowych, kontrolnych i nawigacyjnych; produkcja zegarków i zegarów @pl
preferred label: Fabricação de instrumentos e aparelhos de medição, verificação e navegação; relógios e material de relojoarias @pt
preferred label: Fabricarea de echipamente de măsură, verificare, control şi navigaţie; producţia de ceasuri @ro
preferred label: Производство инструментов и приборов для измерения, тестирования и навигации; наручных часов и прочих видов часов @ru
preferred label: Výroba nástrojov a zariadení na meranie, testovanie a navigovanie; hodín a hodiniek @sk
preferred label: Proizvodnja merilnih, preizkuševalnih, navigacijskih instrumentov in naprav; proizvodnja ur @sl
preferred label: Tillverkning av instrument och apparater för mätning, provning och navigering samt ur @sv
preferred label: Ölçme, test ve seyrüsefer amaçlı alet ve cihazlar ile saat imalatı @tr
broader: Manufacture of computer, electronic and optical products
narrower: Manufacture of instruments and appliances for measuring, testing and navigation
narrower: Manufacture of watches and clocks

Manufacture of instruments and appliances for measuring, testing and navigation
type: Concept
notation: 26.51
status: valid
status modified: 2013-10-18
accepted date: 2013-10-18
in scheme: Statistical Classification of Economic Activities in the European Community, Rev. 2 (2008)
scope note: Производство на търсачи, детектори и други уреди и апарати за навигация и насочване и на системи за въздухоплаване и мореплаване; уреди за автоматично управление, термостати и терморегулатори за отоплителни, климатични или хладилни инсталации и битови уреди; уреди и устройства за измерване, показване, регистриране и регулиране на температура, влажност, налягане, вакуум, горене, поток, ниво, вискозитет, плътност, киселинност, концентрация и въртене; уреди за измерване на разход и други броячи; уреди и апарати за измерване и проверка на електрически характеристики и импулси; уреди, апарати и контролно-измервателна апаратура за лабораторен анализ на химичен или физичен състав или концентрация на проби от твърди, течни, газообразни или съставни материали; други средства за измерване и изпитване и техните съставни части. Включено е и производството на неелектрически уреди и апарати за измерване, проверка, изпитване, навигация и управление (без обикновените механични инструменти). - производство на бордни уреди за въздухоплавателни средства - производство на технически средства за проверка на отработени газове от моторни превозни средства - производство на уреди за метеорологията - производство на уреди и апарати за изпитване и проверка на физични характеристики - производство на машини на истината (детектори на лъжата) - производство на апаратура за откриване и отчитане на радиационния фон (например Гайгер-Мюлеров брояч, датчик за радиация, дозиметър) - производство на уреди и апарати за геодезия, топография, земемерство, нивелиране и хидрография - производство на стъклени термометри с течност и биметални термометри (без медицинските) - производство на регулатори за влажност - производство на уреди за регулиране на температурата (терморегулатори, термостати) - производство на устройства за регулиране на пламъка и управление на горелките - производство на спектометри - производство на пневматични уреди за измерване - производство на уреди за измерване на разход: • сумиращ… @bg
scope note: Tato třída zahrnuje výrobu vyhledávacích, detekčních, navigačních, naváděcích, leteckých a lodních systémů a přístrojů; výrobu automatických kontrolních a regulačních přístrojů, např. pro použití u topení, klimatizace, chladicích systémů a spotřebičů; nástroje a přístroje pro měření, zobrazování, zaznamenávání, přenos, regulaci a kontroly teploty, vlhkosti, tlaku, podtlaku, spalování, toku, hustoty, viskozity, kyselosti, koncentrace a rotace; součtový (tj. zaznamenávající) průtokoměr a počitadla; nástroje pro měření a testování charakteristik proudu (elektřiny) a elektrických signálů; přístroje a systémy pro provádění laboratorní analýzy chemického nebo fyzikálního složení nebo koncentrace vzorků pevných, kapalných, plynných látek nebo směsí; ostatní měřicí a zkušební přístroje a jejich díly. Patří sem také výroba neelektrických měřicích, zkušebních a navigačních přístrojů (s výjimkou jednoduchých mechanických nástrojů). Z: - výrobu přístrojů pro letecké motory - výrobu přístrojů pro testování emisí motorových vozidel - výrobu meteorologických přístrojů - výrobu přístrojů pro zkoušení a kontrolu fyzikálních vlastností - výrobu detektorů lži - výrobu detektorů pohybu - výrobu detektorů záření a přístrojů pro monitorování záření - výrobu detektorů min, signálních generátorů, detektorů kovů - výrobu zeměměřických a geodetických přístrojů - výrobu kapalných a bimetalických teploměrů (kromě lékařských teploměrů) - výrobu regulátorů vlhkosti - výrobu regulátorů mezních hodnot teploty - výrobu regulátorů plamene a hořáků - výrobu spektrometrů - výrobu pneumatických měřicích přístrojů - výrobu měřičů spotřeby (např. vody, plynu, elektřiny) - výrobu průtokových měřičů a počitadel - výrobu počitadel ke sčítání kusů, osob apod. - výrobu vyhledávacích, detekčních, navigačních, leteckých a lodních (námořních) přístrojů, včetně zvukových bójek - výrobu radarů a radarových přístrojů - výrobu systému globální navigace (GPS) - výrobu měřicích přístrojů pro ochranu životního prostřed… @cs
scope note: Diese Klasse umfasst die Herstellung der folgenden Geräte: Such-, Detektions-, Navigations-, Streckenführungs-, aeronautische und nautische Systeme und -Instrumente, selbsttätige Steuerungs- und Regelungstechnik für Geräte wie Heizung, Klimaanlagen, Kühlsysteme, ferner Instrumente und Geräte zur Messung, Anzeige, Aufzeichnung, Übertragung und Steuerung der Temperatur, der Feuchtigkeit, des Luftdrucks, des Unterdrucks, der Verbrennung, des Durchflusses, der Höhe, der Viskosität, der Dichte, des Säuregehalts, der Konzentration und der Rotation; summierende Messgeräte und Zähleinrichtungen; Instrumente und Instrumentsysteme für die Laboranalyse der chemischen oder physikalischen Zusammensetzung oder Konzentration von Proben fester, flüssiger, gasförmiger oder gemischter Stoffe, sonstige Mess- und Prüfinstrumente und ihre Bestandteile. Hierzu zählt auch die Herstellung nichtelektrischer Mess-, Kontroll-, Navigations- und Steuerungsinstrumente (mit Ausnahme einfacher mechanischer Geräte). Diese Klasse umfasst: - Herstellung von Instrumenten für Flugzeugtriebwerke - Herstellung von Geräten für die Kraftfahrzeugabgasprüfung - Herstellung von meteorologischen Instrumenten - Herstellung von Geräten zur Prüfung und Kontrolle von physikalischen Eigenschaften - Herstellung von Lügendetektoren - Herstellung von Strahlungsdetektoren und Instrumenten zur Überwachung von Strahlungen - Herstellung von geodätischen Instrumenten - Herstellung von Flüssigkeits- und Bimetallthermometern (mit Ausnahme von medizinischen Thermometern) - Herstellung von Feuchtigkeitsreglern - Herstellung von Temperatur-Grenzwertreglern - Herstellung von Flammen- und Brennerreglern - Herstellung von Spektrometern - Herstellung von pneumatischen Messgeräten - Herstellung von Verbrauchsmessgeräten (z. B. für Wasser, Gas, Strom) - Herstellung von Durchflussmessern und Zähleinrichtungen - Herstellung von Handzählern - Herstellung von Minensuchgeräten, Signalgeneratoren, Metalldetektoren - Herstellung von Such-, … @de
scope note: This class comprises manufacturing of search, detection, navigation, guidance, aeronautical, and nautical systems and instruments; automatic controls and regulators for applications, such as heating, air-conditioning, refrigeration and appliances; instruments and devices for measuring, displaying, indicating, recording, transmitting, and controlling temperature, humidity, pressure, vacuum, combustion, flow, level, viscosity, density, acidity, concentration, and rotation; totalising (i.e., registering) fluid meters and counting devices; instruments for measuring and testing the characteristics of electricity and electrical signals; instruments and instrumentation systems for laboratory analysis of the chemical or physical composition or concentration of samples of solid, fluid, gaseous, or composite material; other measuring and testing instruments and parts thereof. The manufacture of non-electric measuring, testing and navigating equipment (except simple mechanical tools) is included here. This class includes: - manufacture of aircraft engine instruments - manufacture of automotive emissions testing equipment - manufacture of meteorological instruments - manufacture of physical properties testing and inspection equipment - manufacture of polygraph machines - manufacture of radiation detection and monitoring instruments - manufacture of surveying instruments - manufacture of thermometers liquid-in-glass and bimetal types (except medical) - manufacture of humidistats - manufacture of hydronic limit controls - manufacture of flame and burner control - manufacture of spectrometers - manufacture of pneumatic gauges - manufacture of consumption meters (e.g., water, gas, electricity) - manufacture of flow meters and counting devices - manufacture of tally counters - manufacture of mine detectors, pulse (signal) generators; metal detectors - manufacture of search, detection, navigation, aeronautical, and nautical equipment, including sonobuoys - manufacture of radar equipm… @en
scope note: Esta clase comprende la fabricación de sistemas e instrumentos de búsqueda, detección, navegación, orientación, aeronáuticos y náuticos; reguladores y controles automáticos para aplicaciones, como la calefacción, el aire acondicionado, la refrigeración y diversos electrodomésticos; instrumentos y dispositivos para medir, visualizar, indicar, registrar, transmitir y controlar la temperatura, humedad, presión, vacío, combustión, flujo, nivel, viscosidad, densidad, acidez, concentración o rotación; contadores y medidores de fluidos de totalización (es decir, de registro); instrumentos para la medición y la comprobación de las características de la electricidad y las señales eléctricas; instrumentos y sistemas de instrumentación para el análisis de laboratorio de la concentración o la composición química o física de muestras de materiales sólidos, líquidos, gaseosos o compuestos; otros instrumentos de medición y comprobación y partes de los mismos. Esta categoría comprende la fabricación de equipos de medida verificación y navegación no eléctricos (excepto las herramientas mecánicas simples). Esta clase comprende: - la fabricación de instrumentos para motores de aviación - la fabricación de equipos de comprobación de emisiones de gases de automoción - la fabricación de instrumentos meteorológicos - la fabricación de equipos de comprobación e inspección de las propiedades físicas - la fabricación de polígrafos - la fabricación de instrumentos de detección y vigilancia de radiaciones - la fabricación de instrumentos de geodesia - la fabricación de termómetros de vidrio relleno de líquido y bimetálicos (excepto de uso médico) - la fabricación de higrostatos - la fabricación de controles de límite hidrónico - la fabricación de controles de llama y de quemadores - la fabricación de espectrómetros - la fabricación de comparadores de aire comprimido - la fabricación de contadores de consumo (p. ej., agua, gas, electricidad) - la fabricación de caudalímetros y contadores de sum… @es
scope note: Cette classe comprend la fabrication de systèmes et instruments de recherche, de détection, de navigation et de guidage, de systèmes et instruments pour la marine ou l’aviation, de thermostats pour des applications telles que chauffage, climatiseur, réfrigération, appareils, d’instruments et d’appareils pour la mesure, l’affichage, l’indication, l’enregistrement, la transmission et le contrôle de température, d’humidité, de pression, de vide, de combustion, de débit, de viscosité, de densité, d’acidité, de concentration et de rotation, d’instruments de mesure des fluides (c’est-à-dire d’enregistrement) et de comptage, d’instruments de mesure et d’essai des caractéristiques de l’électricité et des signaux électriques, d’instruments et de systèmes d’instrumentation pour l’analyse en laboratoire de la composition ou de la concentration chimique ou physique d’échantillons de matériaux solides, liquides, gazeux ou composites, d’autres instruments de mesure et d’essais et de leurs éléments. La fabrication d’équipements de mesure, d’essai et de navigation (à l’exception d’outils mécaniques simples) est comprise dans cette classe. Cette classe comprend: - la fabrication d’instruments de moteur d’aéronef - la fabrication d’instruments de contrôle des émissions des véhicules à moteur - la fabrication d’instruments météorologiques - la fabrication d’instruments d’essai et de contrôle des propriétés physiques - la fabrication de polygraphes - la fabrication de détecteurs et de moniteurs de radiation - la fabrication d’instruments de géodésie - la fabrication de thermomètres, genre liquide-dans-verre et bilame (sauf médical) - la fabrication d’humidistats - la fabrication d’instruments de contrôle de limite hydronique - la fabrication d’instruments de contrôle de flamme et de brûleur - la fabrication de spectromètres - la fabrication de jauges pneumatiques - la fabrication de compteurs de consommation (eau, gaz, électricité, etc.) - la fabrication de débitmètres et de compteurs … @fr
scope note: Ovaj razred uključuje proizvodnju sustava i instrumenata za istraživanje, pronalaženje, navigaciju, vođenje, zrakoplovstvo i nautiku; programa i uređaja za automatsko upravljanje i reguliranje kao što su grijanje, klimatizacija, hlađenje; instrumenata i uređaja za mjerenje, prikazivanje, indiciranje, bilježenje, emitiranje i kontroliranje temperature, vlažnosti, tlaka, vakuuma, izgaranja, protoka, stupnjeva, viskoznosti, gustoće, kiselosti, koncentracije i rotacije; uređaja za sumiranje (tj. bilježenje); mjerača tekućine i uređaja za računanje; instrumenata za mjerenje i ispitivanje karakteristika električne energije i električnih signala; instrumenata i mjernih sustava za laboratorijske analize kemijskih ili fizičkih spojeva ili koncentraciju uzoraka krutih, tekućih, plinovitih ili složenih spojeva; ostala mjerenja, mjerni instrumenti i njihovi dijelovi. Ovdje je uključena i proizvodnja neelektrične opreme za mjerenje, testiranje i navigaciju (osim jednostavnih električnih alata). Ovaj razred uključuje: - proizvodnju instrumenata zrakoplovnih motora - proizvodnju opreme za testiranje automobilskih ispušnih plinova - proizvodnju meteoroloških instrumenata - proizvodnju opreme za testiranje fizičkih svojstava i inspekcijske opreme - proizvodnju poligrafskih uređaja - proizvodnju instrumenata za otkrivanje zračenja i praćenje - proizvodnju uređaja za istraživanja - proizvodnju termometra na bazi tekućine u staklu i termometara bimetalne vrste (osim medicinskih) - proizvodnju uređaja za reguliranje vlažnosti - proizvodnju hidroničkoga kontrolora ograničenosti - proizvodnju kontrolora vatre i plamenika - proizvodnju spektrometra - proizvodnju uređaja za baždarenje gumenih kotača - proizvodnju potrošačkih brojila (npr. vode, plina) - proizvodnju mjerača protoka i uređaja za računanje - proizvodnju telebrojača - proizvodnju detektora mina, signalnih generatora, metalnih detektora - proizvodnju opreme za istraživanje, pronalaženje, navigaciju, te zrakoplovnu i nautičku opr…
scope note: Ši klasė apima paieškos, aptikimo, navigacijos, valdymo, oro navigacijos ir jūrų navigacijos sistemų bei įtaisų arba aparatų gamybą; šildymo, oro kondicionavimo, šaldymo ir buitinių prietaisų automatinių valdytuvų ir reguliatorių gamybą; temperatūros, drėgmės, slėgio, vakuumo, degimo, srauto, lygio, klampos, tankio, rūgštingumo, koncentracijos ir sukimosi matavimo, atvaizdavimo, rodymo, įrašymo, perdavimo ir valdymo įtaisų ir aparatų gamybą; sumuojamųjų skysčių registravimo matuoklių ir skaičiavimo įtaisų gamybą; elektros ir elektrinių signalų charakteristikų matavimo ir tikrinimo įtaisų ir aparatų gamybą; kietųjų, skystųjų, dujinių arba sudėtinių medžiagų mėginių cheminės ar fizikinės sudėties arba koncentracijos laboratorinės analizės aparatų ir kontrolinių matavimo sistemų gamybą; kitų matavimo ir tikrinimo įtaisų ir aparatų bei jų dalių gamybą. Į šią klasę taip pat įeina neelektrinių matavimo, tikrinimo, bandymo ir navigacijos įrangos arba aparatų (išskyrus paprastus mechaninius įrankius) gamyba. Į šią klasę įeina: - orlaivių variklių prietaisų gamyba - automobilių išmetamųjų dujų tikrinimo įrangos gamyba - meteorologinių prietaisų gamyba - fizikinių savybių bandymo ir kontrolės įrangos gamyba - poligrafijos mašinų gamyba - jonizuojančiosios spinduliuotės aptikimo ir stebėjimo prietaisų arba aparatų gamyba - tyrinėjimų prietaisų arba aparatų gamyba - skystinių stiklinių ir bimetalinių termometrų (išskyrus medicininius) gamyba - drėgmės reguliatorių gamyba - vandeniu šildomų sistemų valdytuvų gamyba - liepsnos ir degiklių valdytuvų gamyba - spektrometrų gamyba - pneumatinių matuoklių gamyba - skaitiklių (pavyzdžiui, vandens, dujų, elektros) gamyba - srautmačių ir skaičiavimo įtaisų gamyba - medžių skaitiklių gamyba - minų ieškiklių, impulsų (signalų) generatorių, metalo aptiktuvų gamyba - paieškos, aptikimo, navigacijos, oro navigacijos ir jūrų navigacijos įrangos bei aparatų, įskaitant hidrolokatorius, gamyba - radarinės įrangos gamyba - pasaulinės vietos nustat… @lt
scope note: Этот класс включает: - производство иррадиационных аппаратов и приспособлений (например, промышленных, медицинских, диагностических, исследовательских и научных): • бета-, гамма, рентгеновского или прочего радиационного оборудования - производство CT сканеров - производство PET сканеров - производство оборудования для получения магнитно-резонансного изображения (MRI) - производство медицинского ультразвукового оборудования - производство электрокардиографов - производство электромедицинского эндоскопического оборудования - производство медицинского лазерного оборудования - производство регуляторов скорости - производство слуховых аппаратов Этот класс также включает: - производство иррадиационного оборудования для производства продуктов питания и молочных продуктов Этот класс исключает: - производство соляриев, см. 28.99 @ru
scope note: Bu sınıf, araştırma, tespit, seyrüsefer, kılavuzluk, havacılık ve denizcilik ile ilgili sistem ve aletlerin imalatını içermektedir. Bunlar, ısıtma, iklimlendirme, soğutma gibi uygulamalar ve cihazlar için otomatik kontrol ediciler ile düzenleyiciler; ısı derecesi, nem, basınç, vakum, yanma, debi, seviye, kıvam, yoğunluk, asitlik, yoğunlaşma ve deviri ölçmek, göstermek, işaret etmek, kaydetmek, iletmek ve kontrol etmek için kullanılan aletler ve cihazlar; sayaçlar(örn., kayıt etme) ve hesaplama cihazları; elektriğin ve elektrik sinyallerinin özelliklerini ölçmek ve test etmek için kullanılan aletler; katı, sıvı, gaz, ya da bileşik materyallerin numunelerinin kimyasal ya da fiziksel bileşimi ya da konsantrasyonlarının laboratuar analizinde kullanılan aletler ve sistemler; diğer ölçme ve test aletleri ile bunların parçalarından oluşmaktadır. Elektrikli olmayan ölçme, test ve seyrüsefer cihazları da (basit mekanik aletler hariç) burada kapsanmaktadır. Bu sınıf aşağıdakileri kapsamaktadır; - uçak motoru ile ilgili aletlerin imalatı, - otomotiv emisyonu test cihazlarının imalatı, - meteoroloji aletlerinin imalatı, - fiziksel özellikleri test etme ve inceleme cihazlarının imalatı, - yalan makinesi imalatı, - radyasyon belirleme ve izleme cihazlarının imalatı, - arazi ölçme (kadastro çalışmaları ile ilgili aletler) aletlerinin imalatı, - cam sıvı termometreleri ve çift metal tipli olanlarının imalatı (tıbbi olanlar hariç) - nem ayarlayıcı cihazların imalatı, - hidronik limit kontrol aletlerinin imalatı, - alev ve ateş kontrol cihazlarının imalatı, - spektrometrelerin imalatı, - hava basıncı ile çalışan göstergelerin imalatı, - tüketim sayaçlarının imalatı (örn. su, gaz, elektrik), - debi metreler (akış metreler) ve sayma aletleri imalatı, - sayma makinelerinin imalatı, - mayın dedektörlerinin, sinyal üreticilerin; metal detektörlerinin imalatı, - denize atılan ve yapı itibariyle suda yüzen şamandıralara benzeyen deniz altından aldıkları sesleri antenleri aracılığıyla radyo … @tr
preferred label: Производство на уреди и апарати за измерване, изпитване и навигация @bg
preferred label: Výroba měřicích, zkušebních a navigačních přístrojů @cs
preferred label: Fremstilling af udstyr til måling, afprøvning, navigation og kontrol @da
preferred label: Herstellung von Mess-, Kontroll-, Navigations- u. ä. Instrumenten und Vorrichtungen @de
preferred label: Κατασκευή οργάνων και συσκευών μέτρησης, δοκιμών και πλοήγησης @el
preferred label: Fabricación de instrumentos y aparatos de medida, verificación y navegación @es
preferred label: Mõõte-, katse- ja navigatsiooniseadmete tootmine @et
preferred label: Mittaus-, testaus- ja navigointivälineiden ja -laitteiden valmistus @fi
preferred label: Fabrication d'instruments et d'appareils de mesure, d'essai et de navigation @fr
preferred label: Mérőműszergyártás
preferred label: Fabbricazione di strumenti e apparecchi di misurazione, prova e navigazione @it
preferred label: Matavimo, bandymo, navigacinės ir kontrolės įrangos prietaisų ir aparatų gamyba @lt
preferred label: Mērīšanas, pārbaudes, izmēģināšanas un navigācijas instrumentu un aparātu ražošana @lv
preferred label: Manifattura ta' strumenti u għodod għall-kejl, ittestjar u navigar @mt
preferred label: Vervaardiging van meet-, controle- en navigatie-instrumenten en -apparatuur @nl
preferred label: Produksjon av måle-, kontroll- og navigasjonsinstrumenter @no
preferred label: Produkcja instrumentów i przyrządów pomiarowych, kontrolnych i nawigacyjnych @pl
preferred label: Fabricação de instrumentos e aparelhos de medição, verificação e navegação @pt
preferred label: Fabricarea de instrumente şi dispozitive pentru măsură, verificare, control, navigaţie @ro
preferred label: Производство инструментов и приборов для измерения, тестирования и навигации @ru
preferred label: Výroba nástrojov a zariadení na meranie, testovanie a navigovanie @sk
preferred label: Proizvodnja merilnih, preizkuševalnih in navigacijskih instrumentov in naprav @sl
preferred label: Tillverkning av instrument och apparater för mätning, provning och navigering @sv
preferred label: Ölçme, test ve seyrüsefer amaçlı alet ve cihazların imalatı @tr
broader: Manufacture of instruments and appliances for measuring, testing and navigation; watches and clocks

Manufacture of watches and clocks
type: Concept
notation: 26.52
status: valid
status modified: 2013-10-18
accepted date: 2013-10-18
in scheme: Statistical Classification of Economic Activities in the European Community, Rev. 2 (2008)
scope note: - производство на часовници: ръчни, джобни, стенни, будилници и други, вкл. часовници за командни табла - производство на корпуси за часовници, вкл. от благородни метали - производство на уреди и апарати за измерване, регистриране и отчитане на времето, с часовников механизъм или синхронен двигател като: • паркингови времеброячи (паркметри) • времеизмерватели • апарати за регистриране на присъствието; апарати за отбелязване на часа и датата • броячи за минути и секунди (хронометри) - производство на часовникови прекъсвачи и други апарати, позволяващи да се задвижи механизъм в определено време, снабдени с часовников механизъм или синхронен двигател • заключващ механизъм с блокировка, който не позволява преди определеното време да се отвори банков трезор или сейф - производство на части и принадлежности за часовници: • всякакъв вид механизми • пружини, камъни, циферблати, стрелки, пластинки, мостчета и други части • корпуси, кутии и шкафове от всякакъв материал - производство на каишки за часовници от текстил, кожа, пластмаси - 15.12 - производство на верижки за часовници от благородни метали - 32.12 - производство на верижки за часовници от неблагородни метали - 32.13 @bg
scope note: Tato třída zahrnuje výrobu hodin, hodinek a časoměrných mechanizmů a jejich dílů. Z: - výrobu hodin a hodinek všech druhů včetně hodin přístrojových - výrobu hodinových a hodinkových pouzder, včetně pouzder z drahých kovů - výrobu přístrojů pro zaznamenávání času a pro měření, zaznamenávání a jiné zobrazování časových intervalů s hodinovým nebo hodinkovým chodem nebo se synchronním motorem, např.: • parkovacích hodin • píchacích hodin • časových razítek pro datum/čas • signálních hodin - výrobu časových spínačů a jiných spínacích přístrojů s hodinovým nebo hodinkovým chodem nebo se synchronním motorem: • časových zámků - výrobu komponentů a dílů k hodinám a hodinkám: • hodinových strojů všech typů pro hodiny a hodinky • pružin, kamenů, číselníků, ručiček, můstků a ostatních dílů • pouzder pro hodiny a hodinky ze všech materiálů N: - výrobu nekovových hodinkových řemínků (textilních, usňových, plastových) (15.12) - výrobu hodinkových pásků, řemínků z drahých kovů (32.12) - výrobu hodinkových pásků, řemínků z obecných kovů (32.13) @cs
scope note: Diese Klasse umfasst die Herstellung von Klein- und Großuhren, Zeitmessgeräten und ihren Bestandteilen. Diese Klasse umfasst: - Herstellung von Klein- und Großuhren aller Art einschließlich Armaturbrettuhren - Herstellung von Gehäusen für Klein- und Großuhren, einschließlich Gehäusen aus Edelmetallen - Herstellung von Zeiterfassungsgeräten und Geräten für das Messen, Aufzeichnen und die sonstige Anzeige von Zeitabständen mit Uhrwerk oder Synchronmotor, z. B.: • Parkuhren • Stechuhren • Datums-/Uhrzeitstempeln • Zeitschaltuhren - Herstellung von Zeitschaltern und anderen Zeitauslösern mit Uhrwerk oder Synchronmotor: • Zeitschlösser - Herstellung von Bauteilen für Uhren und Uhrwerke: • Uhrwerke aller Art für Klein- und Großuhren • Federn, Steine, Zifferblätter, Zeiger, Brücken und sonstige Teile • Gehäuse für Klein- und Großuhren aus allen Materialien Diese Klasse umfasst nicht: - Herstellung nichtmetallischer Uhrbänder (Stoff, Leder, Kunststoff) (s. 15.12) - Herstellung von Uhrbändern aus Edelmetallen (s. 32.12) - Herstellung von Uhrbändern aus unedlen Metallen (s. 32.13) @de
scope note: This class includes the manufacture of watches, clocks and timing mechanisms and parts thereof. This class includes: - manufacture of watches and clocks of all kinds, including instrument panel clocks - manufacture of watch and clock cases, including cases of precious metals - manufacture of time-recording equipment and equipment for measuring, recording and otherwise displaying intervals of time with a watch or clock movement or with synchronous motor, such as: • parking meters • time clocks • time/date stamps • process timers - manufacture of time switches and other releases with a watch or clock movement or with synchronous motor: • time locks - manufacture of components for clocks and watches: • movements of all kinds for watches and clocks • springs, jewels, dials, hands, plates, bridges and other parts • watch and clock cases and housings of all materials This class excludes: - manufacture of non-metal watch bands (textile, leather, plastic), see 15.12 - manufacture of watch bands of precious metal, see 32.12 - manufacture of watch bands of non-precious metal, see 32.13 @en
scope note: Esta clase comprende la fabricación de relojes y cronógrafos, así como de partes de los mismos. Esta clase comprende: - la fabricación de relojes de todas clases, incluidos los relojes de cuadros de instrumentos - la fabricación de cajas de relojes, incluidas las de metales preciosos - la fabricación de equipos de contadores de tiempo y de aparatos para medir, registrar u otras formas de indicar intervalos de tiempo con un mecanismo de relojería o un motor sincrónico, como • parquímetros • relojes registradores • sellos de fecha y hora • contadores de minutos - la fabricación de temporizadores y otros dispositivos con un mecanismo de relojería o un motor sincrónico: • cerraduras temporizadas - la fabricación de piezas sueltas de relojería: • mecanismos de relojería de todo tipo • muelles, ranguas, esferas, manecillas, platinas, puentes y otras piezas • cajas de relojes de todo tipo de materiales Esta clase no comprende: - la fabricación de correas no metálicas para relojes de pulsera (p. ej., tela, cuero, plástico) (véase 15.12) - la fabricación de correas de relojes de metales preciosos (véase 32.12) - la fabricación de correas de relojes de metales no preciosos (véase 32.13) @es
scope note: Cette classe comprend la fabrication de montres, horloges et mouvements d’horlogerie et de leurs éléments. Cette classe comprend: - la fabrication de montres et horloges de tout type, y compris les horloges de tableau de bord - la fabrication de boîtiers de montres, de cages et de cabinets d’horlogerie, y compris en métaux précieux - la fabrication d’appareils de contrôle du temps ou d’appareils compteurs de temps, enregistrant ou affichant des intervalles de temps avec un mouvement de montre ou d’horloge ou à moteur synchrone, tels que: • parcmètres • horloges-pointeuses • tampons horaires et tampons dateurs • chronomicromètres - la fabrication d’interrupteurs horaires et d’autres appareils de déclenchement avec un mouvement de montre ou d’horloge ou à moteur synchrone, tels que: • fermetures commandées par une minuterie - la fabrication de pièces pour horloges et montres: • mouvements d’horlogerie de tous types • ressorts, pierres, cadrans, aiguilles, platines, ponts et autres pièces • boîtiers de montres, de cages et de cabinets d’horlogerie, en tous types de matériaux Cette classe ne comprend pas: - la fabrication de bracelets de montres autres qu’en métal (tissu, cuir, matières plastiques), voir 15.12 - la fabrication de bracelets de montres en métaux précieux, voir 32.12 - la fabrication de bracelets de montres en métaux non précieux, voir 32.13 @fr
scope note: Ovaj razred uključuje proizvodnju satova i vremenskih uređaja te njihovih dijelova. Ovaj razred uključuje: - proizvodnju satova svih vrsta, uključujući satove za instrument-ploče - proizvodnju kućišta za satove, uključujući i one od plemenitih metala - proizvodnju opreme za bilježenje vremena i opreme za mjerenje, bilježenje te one sa drugačijim prikazivanjem vremenskih intervala sa satnim mehanizmom ili sa sinkroniziranim motorom kao što su: • mjerači parkirnog vremena • satovi za mjerenje vremena • uređaji za otiskivanje vremena i datuma • procesni tajmeri - proizvodnju vremenskih prekidača i drugih naprava sa satnim mehanizmom ili sinkroniziranim motorom: • brava s ugrađenim satnim mehanizmom - proizvodnju dijelova za satove: • mehanizama za sve vrste satova • opruga, ležišnih kamenova, brojčanika, kazaljki, ploča, mostova i drugih dijelova • satnih futrola i kućišta od svih materijala Ovaj razred isključuje: - proizvodnju nemetalnog satnoga remena (tekstilnoga, kožnoga, plastičnoga), vidi 15.12 - proizvodnju satnog remena od plemenitih metala, vidi 32.12 - proizvodnju satnog remena od neplemenitih metala, vidi 32.13
scope note: Į šią klasę įeina laikrodžių, rankinių laikrodžių ir laikmačių bei jų dalių gamyba. Į šią klasę įeina: - visų tipų laikrodžių, įskaitant prietaisų skydų laikrodžius, gamyba - rankinių ir kitų laikrodžių korpusų, įskaitant brangiųjų metalų korpusus, gamyba - laiko įrašymo įrangos ir trukmių matavimo, įrašymo ir kitokios trukmių rodymo įrangos su laikrodžiu arba laikrodiniu mechanizmu ar sinchroniniu varikliu, tokių kaip: • automobilių stovėjimo trukmės skaitiklių • kontrolinių laikrodžių • laiko / datos žymėtuvų • procesų laikmačių gamyba - laikrodinių jungiklių ir kitokių išjungiklių su laikrodžiu arba laikrodiniu mechanizmu arba sinchroniniu varikliu gamyba: • laikrodinių užraktų - rankinių ir kitų laikrodžių komponentų gamyba: • visų rūšių laikrodžių mechanizmų • spyruoklių, akmenų, ciferblatų, rodyklių, skydelių, jungčių ir kitų dalių • rankinių ir kitų laikrodžių korpusų iš bet kokių medžiagų Į šią klasę neįeina: - nemetalinių (medžiaginių, odinių, plastikinių) laikrodžių dirželių gamyba, žr. 15.12 - laikrodžių dirželių iš tauriųjų metalų gamyba, žr. 32.12 - laikrodžių dirželių iš netauriųjų metalų gamyba, žr. 32.13 @lt
scope note: Bu sınıf kol saatleri, masa saatleri ve duvar saatleri ile zaman mekanizmaları ile bunların parçalarının imalatını kapsamaktadır.Bu sınıf aşağıdakileri kapsamaktadır; - göstergeli panel saatleri de dahil her çeşit kol saati, masa saati ve duvar saatlerinin imalatı, - değerli metal kasalar da dahil olmak üzere kol saati ve masa saati kasaları imalatı, - zaman kaydetme donanımlarının ve zaman aralıklarını ölçmek, kaydetmek ve başka şekillerde göstermek için kullanılan saat makineli veya senkron motorlu donanımların imalatı, örneğin; • parkmetreler, • işçilerin geliş ve gidişlerini kaydeden saatler, • zaman/tarih damgaları, • süreç kronometreleri, - saat makineli veya senkron motorlu zaman devre anahtarlarının ve diğer ayırıcıların imalatı; • zaman kilitleri, - masa, duvar ve kol saatleri için parçaların imalatı; • her çeşit masa, duvar ve kol saatleri için makineler, • zemberekler, kıymetli taşlar, saat kadranları, akrep ve yelkovanlar, taban levhaları, kordon köprüsü ve diğer parçalar, • her tür materyalden masa ve kol saatleri için kasalar ve muhafazalar. Kapsam dışı olanlar; - metal olmayan saat kayışlarının imalatı (tekstil, deri, plastik), bkz. 15.12, - değerli metallerden saat kayışlarının imalatı, bkz. 32.12, - değerli olmayan metallerden saat kayışı imalatı, bkz. 32.13, @tr
preferred label: Производство на часовници и часовникови механизми @bg
preferred label: Výroba časoměrných přístrojů @cs
preferred label: Fremstilling af ure @da
preferred label: Herstellung von Uhren @de
preferred label: Κατασκευή ρολογιών @el
preferred label: Fabricación de relojes @es
preferred label: Ajanäitajate tootmine @et
preferred label: Kellojen valmistus @fi
preferred label: Horlogerie @fr
preferred label: Óragyártás
preferred label: Fabbricazione di orologi @it
preferred label: Įvairių tipų laikrodžių gamyba @lt
preferred label: Pulksteņu ražošana @lv
preferred label: Manifattura ta' arloġġi ta' l-idejn u arloġġi oħra @mt
preferred label: Vervaardiging van uurwerken @nl
preferred label: Produksjon av klokker og ur @no
preferred label: Produkcja zegarków i zegarów @pl
preferred label: Fabricação de relógios e material de relojoaria @pt
preferred label: Producţia de ceasuri @ro
preferred label: Производство часов @ru
preferred label: Výroba hodín a hodiniek @sk
preferred label: Proizvodnja ur @sl
preferred label: Urtillverkning @sv
preferred label: Kol saatleri, masa ve duvar saatlerinin imalatı @tr
broader: Manufacture of instruments and appliances for measuring, testing and navigation; watches and clocks

Manufacture of irradiation, electromedical and electrotherapeutic equipment
type: Concept
notation: 26.6
status: valid
status modified: 2013-10-18
accepted date: 2013-10-18
in scheme: Statistical Classification of Economic Activities in the European Community, Rev. 2 (2008)
scope note: Данный класс включает производство оптических инструментов и линз, таких как бинокли, микроскопы (за исключением электронных и протонных), телескопы, призмы и линзы (за исключением офтальмологических); или полировку линз (за исключением офтальмологических); установку линз (за исключением офтальмологических) и производство фотографического оборудования, такого как фотоаппараты и вспышки. Этот класс включает: - производство оптических зеркал - производство оборудования для оптического прицела - производство оборудования для оптического позиционирования - производство оптических увеличительных инструментов - производство точных оптических приборов - производство оптических компараторов - производство видео и цифровых камер - производство кино и фото проекторов - производство проекторов для показа слайдов - производство инструментов, контрольных устройств и приборов для оптических измерений (например, противопожарного оборудования, фотометров, дальномеров) - производство линз, оптических микроскопов, биноклей и телескопов - производство лазерного оборудования Этот класс исключает: - производство компьютерных проекторов, см. 26.20 - производство профессиональных теле- и видео камер, см. 26.30 - производство видеокамер для домашнего пользования, см. 26.40 - производство укомплектованного оборудования с использованием лазерных компонентов, см. класс производства по типу оборудования (напр., медицинское лазерное оборудование), см. 26.60 - производство фотокопировальных приборов, см. 28.23 - производство офтальмологических товаров, см. 32.50 @ru
preferred label: Производство на излъчващи електромедицински и терапевтични апарати @bg
preferred label: Výroba ozařovacích, elektroléčebných a elektroterapeutických přístrojů @cs
preferred label: Fremstilling af bestrålingsudstyr og elektromedicinsk og elektroterapeutisk apparatur @da
preferred label: Herstellung von Bestrahlungs- und Elektrotherapiegeräten und elektromedizinischen Geräten @de
preferred label: Κατασκευή ακτινολογικών και ηλεκτρονικών μηχανημάτων ιατρικής και θεραπευτικής χρήσης @el
preferred label: Fabricación de equipos de radiación, electromédicos y electroterapéuticos @es
preferred label: Kiiritus-, elektromeditsiini- ja elektroteraapiaseadmete tootmine @et
preferred label: Säteilylaitteiden sekä elektronisten lääkintä- ja terapialaitteiden valmistus @fi
preferred label: Fabrication d'équipements d'irradiation médicale, d'équipements électromédicaux et électrothérapeutiques @fr
preferred label: Elektronikus orvosi berendezés gyártása
preferred label: Fabbricazione di strumenti per irradiazione, apparecchiature elettromedicali ed elettroterapeutiche @it
preferred label: Švitinimo, elektromedicininės ir elektroterapinės įrangos gamyba @lt
preferred label: Apstarošanas, elektromedicīnisko un elektroterapijas iekārtu ražošana @lv
preferred label: Manifattura ta' tagħmir għall-irradjazzjoni, elettromediku u elettroterapewtiku @mt
preferred label: Vervaardiging van bestralingsapparatuur en van elektromedische en elektrotherapeutische apparatuur @nl
preferred label: Produksjon av strålingsutstyr, elektromedisinsk og elektroterapeutisk utstyr @no
preferred label: Produkcja urządzeń napromieniowujących, sprzętu elektromedycznego i elektroterapeutycznego @pl
preferred label: Fabricação de equipamento de irradiação, electromedicina e electroterapêutico @pt
preferred label: Fabricarea de echipamente pentru radiologie, electrodiagnostic şi electroterapie @ro
preferred label: Производство облучающего, электромедицинского и электротерапевтического оборудования @ru
preferred label: Výroba prístrojov na ožarovanie, elektromedicínskych a elektroterapeutických prístrojov @sk
preferred label: Proizvodnja sevalnih, elektromedicinskih in elektroterapevtskih naprav @sl
preferred label: Tillverkning av strålningsutrustning samt elektromedicinsk och elektroterapeutisk utrustning @sv
preferred label: Işınlama, elektro medikal ve elektro terapi ile ilgili cihazların imalatı @tr
broader: Manufacture of computer, electronic and optical products
narrower: Manufacture of irradiation, electromedical and electrotherapeutic equipment

Manufacture of irradiation, electromedical and electrotherapeutic equipment
type: Concept
notation: 26.60
status: valid
status modified: 2013-10-18
accepted date: 2013-10-18
in scheme: Statistical Classification of Economic Activities in the European Community, Rev. 2 (2008)
scope note: - производство на излъчващи апарати и техните тръби (например промишлени, медикодиагностични или терапевтични, изследователски или за научни цели) • апарати, използващи бета-, гама- излъчвания, X-(рентгенови) лъчи или други излъчвания - производство на томографски апарати (скенери), управлявани от компютри - производство на КАТ скенери (с емисия на позитрони за триизмерна картина на сърцето) - производство на апарати за образна диагностика чрез магнитен резонанс - производство на медицинска ултразвукова апаратура - производство на електрокардиографи - производство на електромедицински ендоскопи - производство на медицинска лазерна апаратура - производство на сърдечни стимулатори - производство на слухови апарати - производство на излъчващи апарати за обработка и контрол на храни и мляко - производство на солариуми - 28.99 @bg
scope note: Z: - výrobu ozařovacích přístrojů a trubic (např. průmyslových, lékařských diagnostických a terapeutických, výzkumných, vědeckých): • přístrojů využívajících rentgenových paprsků beta, gama, paprsků X nebo ostatních ozařovacích přístrojů - výrobu CT snímačů - výrobu PET snímačů (pozitronových emisních tomografů) - výrobu tomografů magnetické rezonance (MRI) - výrobu lékařských ultrazvukových přístrojů - výrobu elektrokardiografů - výrobu lékařských endoskopických přístrojů - výrobu lékařských laserových přístrojů - výrobu kardiostimulátorů - výrobu sluchových pomůcek ZT: - výrobu ozařovacích přístrojů na potraviny a mléko N: - výrobu solárních lůžek (28.99) @cs
scope note: Diese Klasse umfasst: - Herstellung von Bestrahlungsgeräten und -röhren (Anwendungszwecke: Industrie, medizinische Diagnostik und Therapie, Forschung, Wissenschaft): • Geräte, die Beta-, Gamma-, Röntgenstrahlen verwenden, und sonstige Bestrahlungsgeräte - Herstellung von Computertomografen - Herstellung von Positron-Emissionstomografen - Herstellung von Magnetresonanztomographiegeräten - Herstellung von medizinischen Ultraschallgeräten - Herstellung von Elektrokardiografen - Herstellung von Elektroendoskopiegeräten - Herstellung von medizinischen Lasergeräten - Herstellung von Herzschrittmachern - Herstellung von Hörgeräten Diese Klasse umfasst ferner: - Herstellung von Apparaten zur Bestrahlung von Milch oder anderen Nahrungsmitteln Diese Klasse umfasst nicht: - Herstellung von Sonnenbänken (s. 28.99) @de
scope note: This class includes: - manufacture of irradiation apparatus and tubes (e.g. industrial, medical diagnostic, medical therapeutic, research, scientific): • beta-, gamma, X-ray or other radiation equipment - manufacture of CT scanners - manufacture of PET scanners - manufacture of magnetic resonance imaging (MRI) equipment - manufacture of medical ultrasound equipment - manufacture of electrocardiographs - manufacture of electromedical endoscopic equipment - manufacture of medical laser equipment - manufacture of pacemakers - manufacture of hearing aids This class also includes: - manufacture of food and milk irradiation equipment This class excludes: - manufacture of tanning beds, see 28.99 @en
scope note: Esta clase comprende: - la fabricación de aparatos y tubos de radiación (p. ej., para uso industrial, diagnóstico médico, para uso terapéutico, para investigación o para uso científico): • la fabricación de equipos de rayos beta, gamma y X, y de otros equipos de radiación - la fabricación de escáneres CT - la fabricación de escáneres PET - la fabricación de equipos de imagen por resonancia magnética (MRI) - la fabricación de equipos médicos de ultrasonido - la fabricación de electrocardiógrafos - la fabricación de equipos electromédicos de endoscopia - la fabricación de equipos de láser médico - la fabricación de marcapasos - la fabricación de audífonos Esta clase comprende también: - la fabricación de equipos para la radiación de alimentos y leche Esta clase no comprende: - la fabricación de camas de bronceado (véase 28.99) @es
scope note: Cette classe comprend: - la fabrication d’appareils et de tubes pour irradiations (à usage industriel, de diagnostic médical, de soins, de recherche, scientifique, etc.): • appareils à rayons X et appareils utilisant les radiations alpha, bêta ou gamma - la fabrication de tomographes par ordinateur - la fabrication de tomographes à émission de positons (PET) - la fabrication d’appareils d’imagerie par résonnance magnétique (IRM) - la fabrication d’appareils médicaux à ultrasons - la fabrication d’électrocardiographes - la fabrication d’appareils électromédicaux pour techniques endoscopiques - la fabrication d’appareils médicaux à laser - la fabrication de stimulateurs cardiaques - la fabrication d’appareils pour faciliter l’audition Cette classe comprend également: - la fabrication d’appareils d’irradiation des aliments et du lait Cette classe ne comprend pas: - la fabrication de bancs solaires, voir 28.99 @fr
scope note: Ovaj razred uključuje: - proizvodnju aparata i cijevi za zračenje (npr. industrijskih, medicinsko-dijagnostičkih, medicinsko-terapeutskih, istraživačkih, znanstvenih) - proizvodnju opreme za radiografiju - proizvodnju CT-skenera - proizvodnju PET-skenera - proizvodnju MRI-opreme - proizvodnju medicinske ultrazvučne opreme - proizvodnju elektrokardiografske opreme - proizvodnju elektromedicinske endoskopske opreme - proizvodnju medicinske laserske opreme - proizvodnju pejsmejkera - proizvodnju slušnih pomagala Ovaj razred također uključuje: - proizvodnju uređaja za steriliziranje mlijeka i hrane zračenjem Ovaj razred isključuje: - proizvodnju kreveta za sunčanje (solarija), vidi 28.99
scope note: Į šią klasę įeina: - švitinimo aparatų ir vamzdžių (pramoninių, medicinos diagnostikos, medicinos terapijos, tyrimų ir mokslinių) gamyba: • beta -, gama, rentgeno arba kitos spinduliuotės įrangos gamyba - kompiuterinių tomografų (CT) gamyba - pozitronų emisijos tomografų (PET) gamyba - magnetinio rezonanso tomografijos įrangos (MRI) gamyba - medicininės ultragarsinės įrangos - elektrokardiografų gamyba - elektromedicininės endoskopijos įrangos gamyba - medicininės lazerinės įrangos gamyba - stimuliatorių gamyba - klausos aparatų gamyba Į šią klasę taip pat įeina: - maisto ir pieno švitinimo įrangos gamyba Į šią klasę neįeina: - soliariumų gultų gamyba, žr. 28.99 @lt
scope note: Bu sınıf aşağıdakileri kapsamaktadır; - ışınlama cihazlarının ve tüplerinin imalatı (örn., endüstriyel, tıbbi tanı, tıbbi tedavi, araştırma, bilimsel); •beta, gama, X-ışını veya diğer ışınlama cihazları, - Bilgisayarlı tomografi (CT) tarayıcıları imalatı, - PET tarayıcıları imalatı, - manyetik rezonans görüntüleme (MRI) cihazlarının imalatı, - tıbbi ultrason cihazlarının imalatı, - elektrokardiyografi cihazlarının imalatı, - elektro tıbbi endoskopik cihazların imalatı, - tıbbi lazer cihazlarının imalatı, - kalp atışını ayarlayan cihazların imalatı, - işitme cihazlarının imalatı. Ayrıca bu sınıf aşağıdakileri de kapsamaktadır; - gıda ve sütün kalite ve güvenliği için kullanılan ışınlama cihazlarının imalatı, Kapsam dışı olanlar; - bronzlaşmada kullanılan cihazların imalatı, bkz. 28.99. @tr
preferred label: Производство на излъчващи електромедицински и терапевтични апарати @bg
preferred label: Výroba ozařovacích, elektroléčebných a elektroterapeutických přístrojů @cs
preferred label: Fremstilling af bestrålingsudstyr og elektromedicinsk og elektroterapeutisk apparatur @da
preferred label: Herstellung von Bestrahlungs- und Elektrotherapiegeräten und elektromedizinischen Geräten @de
preferred label: Κατασκευή ακτινολογικών και ηλεκτρονικών μηχανημάτων ιατρικής και θεραπευτικής χρήσης @el
preferred label: Fabricación de equipos de radiación, electromédicos y electroterapéuticos @es
preferred label: Kiiritus-, elektromeditsiini- ja elektroteraapiaseadmete tootmine @et
preferred label: Säteilylaitteiden sekä elektronisten lääkintä- ja terapialaitteiden valmistus @fi
preferred label: Fabrication d'équipements d'irradiation médicale, d'équipements électromédicaux et électrothérapeutiques @fr
preferred label: Elektronikus orvosi berendezés gyártása
preferred label: Fabbricazione di strumenti per irradiazione, apparecchiature elettromedicali ed elettroterapeutiche @it
preferred label: Švitinimo, elektromedicininės ir elektroterapinės įrangos gamyba @lt
preferred label: Apstarošanas, elektromedicīnisko un elektroterapijas iekārtu ražošana @lv
preferred label: Manifattura ta' tagħmir għall-irradjazzjoni, elettromediku u elettroterapewtiku @mt
preferred label: Vervaardiging van bestralingsapparatuur en van elektromedische en elektrotherapeutische apparatuur @nl
preferred label: Produksjon av strålingsutstyr, elektromedisinsk og elektroterapeutisk utstyr @no
preferred label: Produkcja urządzeń napromieniowujących, sprzętu elektromedycznego i elektroterapeutycznego @pl
preferred label: Fabricação de equipamento de irradiação, electromedicina e electroterapêutico @pt
preferred label: Fabricarea de echipamente pentru radiologie, electrodiagnostic şi electroterapie @ro
preferred label: Производство облучающего, электромедицинского и электротерапевтического оборудования @ru
preferred label: Výroba prístrojov na ožarovanie, elektromedicínskych a elektroterapeutických prístrojov @sk
preferred label: Proizvodnja sevalnih, elektromedicinskih in elektroterapevtskih naprav @sl
preferred label: Tillverkning av strålningsutrustning samt elektromedicinsk och elektroterapeutisk utrustning @sv
preferred label: Işınlama, elektro medikal ve elektro terapi ile ilgili cihazların imalatı @tr
broader: Manufacture of irradiation, electromedical and electrotherapeutic equipment

Manufacture of optical instruments and photographic equipment
type: Concept
notation: 26.7
status: valid
status modified: 2013-10-18
accepted date: 2013-10-18
in scheme: Statistical Classification of Economic Activities in the European Community, Rev. 2 (2008)
scope note: Данный класс включает производство магнитных и оптических средств передачи информации. Этот класс включает: - производство чистых магнитных аудио и видео носителей - производство чистых магнитных аудио и видео кассет - производство чистых дискет - производство чистых оптических дисков - производство накопителей на жестком магнитном диске Этот класс исключает: - воспроизведение записанных материалов (компьютерные, видео-, звуко- и прочие записи), см. 18,2 @ru
preferred label: Производство на оптични уреди и елементи и фотографска техника @bg
preferred label: Výroba optických a fotografických přístrojů a zařízení @cs
preferred label: Fremstilling af optiske instrumenter og fotografisk udstyr @da
preferred label: Herstellung von optischen und fotografischen Instrumenten und Geräten @de
preferred label: Κατασκευή οπτικών οργάνων και φωτογραφικού εξοπλισμού @el
preferred label: Fabricación de instrumentos de óptica y equipo fotográfico @es
preferred label: Optikainstrumentide ja -seadmete tootmine @et
preferred label: Optisten instrumenttien ja valokuvausvälineiden valmistus @fi
preferred label: Fabrication de matériels optique et photographique @fr
preferred label: Optikai eszköz gyártása
preferred label: Fabbricazione di strumenti ottici e attrezzature fotografiche @it
preferred label: Optinių prietaisų ir fotografijos įrangos gamyba @lt
preferred label: Optisko instrumentu un fotoaparatūras ražošana @lv
preferred label: Manifattura ta' strumenti ottiċi u tagħmir fotografiku @mt
preferred label: Vervaardiging van optische instrumenten en van foto- en filmapparatuur @nl
preferred label: Produksjon av optiske instrumenter og fotografisk utstyr @no
preferred label: Produkcja instrumentów optycznych i sprzętu fotograficznego @pl
preferred label: Fabricação de equipamentos e de instrumentos ópticos e fotográficos @pt
preferred label: Fabricarea de instrumente optice şi echipamente fotografice @ro
preferred label: Производство оптических приборов и фотографического оборудования @ru
preferred label: Výroba optických nástrojov a fotografických prístrojov @sk
preferred label: Proizvodnja optičnih instrumentov in fotografske opreme @sl
preferred label: Tillverkning av optiska instrument och fotoutrustning @sv
preferred label: Optik aletlerin ve fotoğrafçılıkla ilgili ekipmanların imalatı @tr
broader: Manufacture of computer, electronic and optical products
narrower: Manufacture of optical instruments and photographic equipment

Manufacture of optical instruments and photographic equipment
type: Concept
notation: 26.70
status: valid
status modified: 2013-10-18
accepted date: 2013-10-18
in scheme: Statistical Classification of Economic Activities in the European Community, Rev. 2 (2008)
scope note: Производство на оптични уреди и елементи като бинокли, микроскопи (без електронните и протонните), лещи (без контактните); наслояване, полиране или монтиране на лещи (без контактните); производство на фотографска техника, като фотоапарати. - производство на оптични огледала - производство на оптични мерници за оръжия - производство на оптични съоръжения за позициониране - производство на увеличителни стъкла, оптични лещи, лупи - производство на оптични уреди и апарати за фина механика - производство на оптични компаратори (измерителни устройства за точни и сравнителни измервания) - производство на кинокамери и фотоапарати, вкл. цифрови - производство на кинопрожекционни апарати, диаскопи за диапозитиви или диафилми и шрайбпроектори - производство на епидиаскопи - производство на оптични контролно-измервателни уреди (например комплект за управление на стрелбата, фотографски експозиметри, далекомери) - производство на обективи, оптични микроскопи, бинокли и телескопи - производство на лазерни устройства - производство на видеопрожекционни апарати за компютри - 26.20 - производство на телевизионни камери и професионални видеокамери - 26.30 - производство на непрофесионални видеокамери - 26.40 - производство на машини и апарати, в които е вграден лазер, класифицират се при машините и апаратите, с които имат сходни функции (например медицинска лазерна апаратура - 26.60) - производство на фотокопирни апарати - 28.23 - производство на офталмологични продукти - 32.50 @bg
scope note: Tato třída zahrnuje výrobu optických přístrojů a zařízení, např. dalekohledů, mikroskopů (kromě elektronových, protonových), teleskopů, hranolů a čoček (kromě očních); potahování, leštění, nasazování čoček (kromě očních); výrobu fotografických přístrojů a zařízení, např. fotoaparátů a expozimetrů. Z: - výrobu optických zrcadel - výrobu optických vojenských zaměřovacích přístrojů - výrobu optických navigačních přístrojů - výrobu optických zvětšovacích přístrojů - výrobu optických jemných mechanických nástrojů - výrobu optických porovnávacích přístrojů - výrobu filmových a digitálních kamer - výrobu filmových projektorů a diaprojektorů - výrobu zpětných projektorů - výrobu optických měřicích a kontrolních přístrojů a zařízení (např. protipožární monitorovací zařízení, expozimetry, dálkoměry) - výrobu čoček, optických mikroskopů, dalekohledů a teleskopů - výrobu laserových zařízení N: - výrobu počítačových projektorů (videoprojektorů) (26.20) - výrobu komerčních televizních kamer a videokamer (26.30) - výrobu videokamer domácího typu (26.40) - výrobu kompletních přístrojů používajících laserové komponenty (podle typu příslušného přístroje, např. lékařské laserové přístroje) (26.60) - výrobu fotokopírovacích strojů (28.23) - výrobu výrobků pro oční lékařství (32.50) @cs
scope note: Diese Klasse umfasst die Herstellung von optischen Instrumenten und Linsen, beispielsweise von Ferngläsern, Mikroskopen (ohne Elektronen- oder Feldionenmikroskope), Teleskopen, Prismen und Linsen (ohne ophthalmische Gläser); das Beschichten oder Polieren von Linsen (ohne ophthalmische Anwendungen); das Anbringen von Linsen (ohne ophthalmische Anwendungen) sowie die Herstellung fotografischer Ausrüstung wie Fotoapparate und Beleuchtungsmesser. Diese Klasse umfasst: - Herstellung von optischen Spiegeln - Herstellung von militärischen Sichtgeräten - Herstellung von optischen Positionsbestimmungsgeräten - Herstellung von optischen Vergrößerungsgeräten - Herstellung von optischen feinmechanischen Werkzeugen - Herstellung von optischen Vergleichsgeräten - Herstellung von analogen und digitalen Kameras - Herstellung von Film- und Diaprojektoren - Herstellung von Tageslichtprojektoren - Herstellung von optischen Instrumenten und Geräten zum Messen und Prüfen (z. B. Feuerüberwachungsanlagen, fotografische Lichtmessgeräte, Entfernungsmesser) - Herstellung von Linsen, optischen Mikroskopen, Ferngläsern und Teleskopen - Herstellung von Laseranlagen Diese Klasse umfasst nicht: - Herstellung von Projektoren (Videobeamern) (s. 26.20) - Herstellung von kommerziellen Fernseh- und Videokameras (s. 26.30) - Herstellung von Amateur-Videokameras (s. 26.40) - Herstellung von vollständigen Geräten mit Laserkomponenten; diese werden nach der Einordnung des Gerätetyps klassifiziert (z. B. medizinische Lasergeräte (s. 26.60) - Herstellung von Fotokopiergeräten (s. 28.23) - Herstellung von ophthalmischen Erzeugnissen (s. 32.50) @de
scope note: This class includes the manufacture of optical instruments and lenses, such as binoculars, microscopes (except electron, proton), telescopes, prisms and lenses (except ophthalmic); the coating or polishing of lenses (except ophthalmic); the mounting of lenses (except ophthalmic) and the manufacture of photographic equipment such as cameras and light meters. This class includes: - manufacture of optical mirrors - manufacture of optical gun sighting equipment - manufacture of optical positioning equipment - manufacture of optical magnifying instruments - manufacture of optical machinist's precision tools - manufacture of optical comparators - manufacture of film cameras and digital cameras - manufacture of motion picture and slide projectors - manufacture of overhead transparency projectors - manufacture of optical measuring and checking devices and instruments (e.g. fire control equipment, photographic light meters, range finders) - manufacture of lenses, optical microscopes, binoculars and telescopes - manufacture of laser assemblies This class excludes: - manufacture of computer projectors, see 26.20 - manufacture of commercial TV and video cameras, see 26.30 - manufacture of household-type video cameras, see 26.40 - manufacture of complete equipment using laser components, see manufacturing class by type of machinery (e.g. medical laser equipment, see 26.60) - manufacture of photocopy machinery, see 28.23 - manufacture of ophthalmic goods, see 32.50 @en
scope note: Esta clase comprende la fabricación de instrumentos de óptica y lentes, como gemelos, microscopios (excepto de electrones, protones), telescopios, prismas y lentes (excepto oftálmicas); el revestimiento y el pulido de lentes (excepto oftalmológicas); el montaje de lentes (excepto oftalmológicas); y la fabricación de equipo fotográfico como cámaras y fotómetros. Esta clase comprende: - la fabricación de espejos ópticos - la fabricación de miras ópticas para armas - la fabricación de equipos de posicionamiento óptico - la fabricación de instrumentos ópticos de aumento - la fabricación de instrumentos ópticos de precisión - la fabricación de comparadores ópticos - la fabricación de cámaras (de película y digitales) - la fabricación de proyectores de películas cinematográficas y diapositivas - la fabricación de retroproyectores de transparencias - la fabricación de dispositivos e instrumentos ópticos de medición y control (p. ej., equipos de control de incendios, fotómetros, telémetros) - la fabricación de lentes, microscopios ópticos, prismáticos y telescopios - la fabricación de dispositivos láser Esta clase no comprende: - la fabricación de proyectores informáticos (véase 26.20) - la fabricación de cámaras de televisión y vídeo de uso profesional (véase 26.30) - la fabricación de videocámaras de uso doméstico (véase 26.40) - la fabricación de equipos completos que utilizan componentes láser (véase la clase correspondiente a la fabricación por tipo de maquinaria (p. ej., equipos de láser médico, véase 26.60) - la fabricación de fotocopiadoras (véase 28.23) - la fabricación de artículos oftalmológicos (véase 32.50) @es
scope note: Cette classe comprend la fabrication d’instruments et de lentilles optiques, tels que jumelles, microscopes (à l’exception des microscopes électroniques, protoniques), télescopes, prismes et lentilles (sauf ophtalmiques), l’enduisage ou le polissage de lentilles (sauf ophtalmiques), le montage de lentilles (sauf ophtalmiques) et la fabrication de matériel photographique tel que appareils photographiques et luxmètres. Cette classe comprend: - la fabrication de miroirs optiques - la fabrication de matériel de visée optique équipant les fusils - la fabrication d’appareils de positionnement optique - la fabrication de loupes - la fabrication d’instruments optiques pour les travaux de mécanique de précision - la fabrication de comparateurs optiques - la fabrication d’appareils photos analogiques et numériques - la fabrication de matériel de projection de films ou de diapositives - la fabrication de matériel de rétroprojection - la fabrication d’appareils et d’instruments optiques de mesure et de contrôle (par exemple: matériel de lutte contre l’incendie, luxmètres à usage photographique, télémètres) - la fabrication de lentilles, de microscopes optiques, de jumelles et de télescopes - la fabrication d’assemblages laser Cette classe ne comprend pas: - la fabrication de vidéoprojecteurs, voir 26.20 - la fabrication de caméras vidéo et TV destinées à un usage commercial, voir 26.30 - la fabrication de caméscopes destinés à un usage domestique, voir 26.40 - la fabrication d’équipements complets utilisant des composants laser, voir la classe en fonction du type de machines (par exemple: appareils médicaux à laser, voir 26.60) - la fabrication de photocopieuses, voir 28.23 - la fabrication de produits ophtalmiques, voir 32.50 @fr
scope note: Ovaj razred uključuje proizvodnju optičkih instrumenata i leća kao što su dalekozori, mikroskopi (osim elektrona, protona), teleskopa, prizmi i leća (osim oftalmoloških); premazivanje ili poliranje leća (osim oftalmoloških), ugradnju leća (osim oftalmoloških), i proizvodnju fotografske opreme kao što su kamere i svjetlomjeri. Ovaj razred uključuje: - proizvodnju optičkih ogledala - proizvodnju optičkih nišana - proizvodnju optičke opreme za pozicioniranje - proizvodnju instrumenata s optičkim povećalima - proizvodnju optičkih uređaja s preciznim alatima - proizvodnju optičkih komparatera - proizvodnju kamera (optičkih i digitalnih) - proizvodnju projektora za prikazivanje filmova i slajdova - proizvodnju grafoskopa - proizvodnju mjernih optičkih i sigurnosnih uređaja i instrumenata (npr. protupožarnih uređaja, fotografskih svjetlomjera, daljinara) - proizvodnju leća, optičkih mikroskopa, dalekozora i teleskopa - proizvodnju laserskih sklopova Ovaj razred isključuje: - proizvodnju računalnih projektora, vidi 26.20 - proizvodnju komercijalnih televizora i videokamera, vidi 26.30 - proizvodnju videokamera za kućnu upotrebu, vidi 26.40 - proizvodnju kompletne opreme koja se koristi laserskim komponentama, vidi razred prerađivačke industrije prema vrsti strojeva (npr. medicinske laserske opreme, vidi 26.60) - proizvodnju fotokopirnih uređaja, vidi 28.23 - proizvodnju oftalmoloških proizvoda, vidi 32.50
scope note: Į šią klasę įeina optinių prietaisų ir lęšių, tokių kaip binokliai, mikroskopai (išskyrus elektroninius ir protoninius), teleskopai, prizmės bei lęšiai (išskyrus oftalmologinius) gamyba; lęšių dengimas ar poliravimas (išskyrus oftalmologinius); lęšių montavimas (išskyrus oftalmologinius); o taip pat fotografijos įrangos, tokios kaip fotoaparatai ir eksponometrai, gamyba. Į šią klasę įeina: - optinių veidrodžių gamyba - optinių taikiklių įrangos gamyba - optinės padėties nustatymo įrangos gamyba - optinių didinimo prietaisų gamyba - optinių šaltkalvystės tiksliųjų įrankių gamyba - optinių komparatorių gamyba - juostinių ir skaitmeninių fotoaparatų gamyba - filmų ir skaidrių projektorių gamyba - fotoprojektorių gamyba - optinių matavimo ir tikrinimo įtaisų ir aparatų gamyba (pvz., priešgaisrinės įrangos, fotografijos eksponometrų, nuotolio matuoklių) - lęšių, optinių mikroskopų, binoklių ir teleskopų gamyba - lazerinių įrenginių gamyba Į šią klasę neįeina: - kompiuterinių projektorių gamyba, žr. 26.20 - profesionaliųjų televizijos ir vaizdo kamerų gamyba, žr. 26.30 - buitinių vaizdo kamerų gamyba, žr. 26.40 - surinktos įrangos su lazerių komponentais gamyba, žr. gamybos klasę pagal įrangos tipą (pvz., medicinos lazerinė įranga, žr. 26.60) - fotokopijavimo mašinų ir aparatų gamyba, žr. 28.23 - oftalmologijos reikmenų gamyba, žr. 32.50 @lt
scope note: Данный раздел включает производство продукции, генерирующей и распределяющей использование электрической энергии. Также раздел включает производство электрического осветительного, сигнального оборудования и бытовых электроприборов. Данный раздел не включает производство электронной продукции (см. раздел 26). @ru
scope note: Bu sınıf, dürbünler, mikroskoplar (elektron ve proton hariç), teleskoplar, prizmalar ve lensler/mercekler (göz tedavisi ile ilgili olanlar hariç) gibi optik aletlerin ve lenslerin imalatını; lenslerin/merceklerin (göz tedavisi ile ilgili olanlar hariç) kaplanmasını ve parlatılmasını; lenslerin/merceklerin (göz tedavisi ile ilgili olanlar hariç) montajını ve fotoğraf makineleri ve fotometre (ışık ölçüm cihazı) gibi fotoğrafçılık aletlerinin imalatını kapsamaktadır.Bu sınıf aşağıdakileri kapsamaktadır; - optik aynaların imalatı, - tüfeklerin optik görüş ekipmanların (optik tüfek dürbünleri dahil) imalatı, - optik konumlandırma teçhizatının imalatı, - optik büyütme aletleri imalatı, - optik mekanistlerin hassas aletlerinin imalatı - optik karşılaştıcıların imalatı, - fotoğraf makinelerinin (filmli veya dijital) imalatı, - sinema filmi ve slayt projektörlerinin imalatı (bilgisayar projektörleri hariç), - tepegöz projektörlerin imalatı, - optik ölçme ve kontrol etme cihazlarının ve aletlerinin (örn. yangın kontrol teçhizatı, fotoğrafik fotometre (ışık ölçüm cihazı), telemetreler) imalatı - lens/merceklerin, optik mikroskopların, dürbünlerin ve teleskopların imalatı - lazer tertibatlarının ve parçalarının imalatı Kapsam dışı olanlar; - bilgisayar projektörlerinin imalatı, bkz. 26.20, - ticari televizyon ve video kameralarının imalatı, bkz. 26.30, - ev tipi video kameraların imalatı, bkz. 26.40, - lazer parçaları kullanan nihai teçhizatların imalatı, makinenin tipine göre imalat sınıfına bakınız (örn. medikal lazer teçhizatı için, bkz. 26.60), - fotokopi makinelerinin imalatı, bkz. 28.23, - göz tedavisi ile ilgili ürünlerin imalatı, bkz. 32.50. @tr
preferred label: Производство на оптични уреди и елементи и фотографска техника @bg
preferred label: Výroba optických a fotografických přístrojů a zařízení @cs
preferred label: Fremstilling af optiske instrumenter og fotografisk udstyr @da
preferred label: Herstellung von optischen und fotografischen Instrumenten und Geräten @de
preferred label: Κατασκευή οπτικών οργάνων και φωτογραφικού εξοπλισμού @el
preferred label: Fabricación de instrumentos de óptica y equipo fotográfico @es
preferred label: Optikainstrumentide ja -seadmete tootmine @et
preferred label: Optisten instrumenttien ja valokuvausvälineiden valmistus @fi
preferred label: Fabrication de matériels optique et photographique @fr
preferred label: Optikai eszköz gyártása
preferred label: Fabbricazione di strumenti ottici e attrezzature fotografiche i @it
preferred label: Optinių prietaisų ir fotografijos įrangos gamyba @lt
preferred label: Optisko instrumentu un fotoaparatūras ražošana @lv
preferred label: Manifattura ta' strumenti ottiċi u tagħmir fotografiku @mt
preferred label: Vervaardiging van optische instrumenten en van foto- en filmapparatuur @nl
preferred label: Produksjon av optiske instrumenter og fotografisk utstyr @no
preferred label: Produkcja instrumentów optycznych i sprzętu fotograficznego @pl
preferred label: Fabricação de instrumentos e de equipamentos, ópticos e fotográficoso @pt
preferred label: Fabricarea de instrumente optice şi echipamente fotografice @ro
preferred label: Производство оптических приборов и фотографического оборудования @ru
preferred label: Výroba optických nástrojov a fotografických prístrojov @sk
preferred label: Proizvodnja optičnih instrumentov in fotografske opreme @sl
preferred label: Tillverkning av optiska instrument och fotoutrustning @sv
preferred label: Optik aletlerin ve fotoğrafçılıkla ilgili ekipmanların imalatı @tr
broader: Manufacture of optical instruments and photographic equipment

Manufacture of magnetic and optical media
type: Concept
notation: 26.8
status: valid
status modified: 2013-10-18
accepted date: 2013-10-18
in scheme: Statistical Classification of Economic Activities in the European Community, Rev. 2 (2008)
scope note: Данная группа включает производство силовых, распределительных и специализированных трансформаторов; электромоторов, генераторов и моторно-генераторных устройств. @ru
preferred label: Производство на магнитни и оптични носители, незаписани @bg
preferred label: Výroba magnetických a optických médií @cs
preferred label: Fremstilling af magnetiske og optiske media @da
preferred label: Herstellung von magnetischen und optischen Datenträgern @de
preferred label: Κατασκευή μαγνητικών και οπτικών μέσων @el
preferred label: Fabricación de soportes magnéticos y ópticos @es
preferred label: Magnet- ja optilise andmekandjate tootmine @et
preferred label: Tallennevälineiden valmistus @fi
preferred label: Fabrication de supports magnétiques et optiques @fr
preferred label: Mágneses, optikai információhordozó gyártása
preferred label: Fabbricazione di supporti ottici e magnetici @it
preferred label: Magnetinių ir optinių laikmenų gamyba @lt
preferred label: Magnētisko un optisko datu nesēju ražošana @lv
preferred label: Manifattura ta' mezzi manjetiċi u ottiċi @mt
preferred label: Vervaardiging van magnetische en optische media @nl
preferred label: Produksjon av magnetiske og optiske media @no
preferred label: Produkcja magnetycznych i optycznych niezapisanych nośników informacji @pl
preferred label: Fabricação de suportes de informação magnéticos e ópticos @pt
preferred label: Fabricarea suporţilor magnetici şi optici destinaţi înregistrărilor @ro
preferred label: Производство магнитных и оптических средств передачи информации @ru
preferred label: Proizvodnja magnetnih in optičnih nosilcev zapisa @sl
preferred label: Tillverkning av magnetiska och optiska medier @sv
preferred label: Manyetik ve optik kaset, bant, CD vb. ortamların imalatı @tr
broader: Manufacture of computer, electronic and optical products
narrower: Manufacture of magnetic and optical media

Manufacture of magnetic and optical media
type: Concept
notation: 26.80
status: valid
status modified: 2013-10-18
accepted date: 2013-10-18
in scheme: Statistical Classification of Economic Activities in the European Community, Rev. 2 (2008)
scope note: - производство на незаписани магнитни ленти за звуко- и видеозапис - производство на незаписани магнитни касетки за звуко- и видеозапис - производство на незаписани дискети - производство на незаписани оптични дискове - производство на незаписани дискови запаметяващи носители - възпроизвеждане на записани носители (аудио-, видео-, компютърни и други) - 18.2 @bg
scope note: Tato třída zahrnuje výrobu magnetických a optických médií (nosičů dat). Z: - výrobu nenahraných magnetických audio a video pásků - výrobu nenahraných magnetických audio a videokazet - výrobu nenahraných disket - výrobu nenahraných optických disků - výrobu pevných disků N: - reprodukci nahraných nosičů zvuku, obrazu a dat (18.2) @cs
scope note: Diese Klasse umfasst die Herstellung von magnetischen und optischen Datenträgern. Diese Klasse umfasst: - Herstellung von unbespielten magnetischen Ton- und Videobändern - Herstellung von unbespielten magnetischen Ton- und Videobandkassetten - Herstellung von unbespielten Disketten - Herstellung von unbespielten Bildplatten - Herstellung von Festplatten-Datenträgern Diese Klasse umfasst nicht: - Vervielfältigung von bespielten Ton-, Bild und Datenträgern (s. 18.2) @de
scope note: This class includes the manufacture of magnetic and optical recording media. This class includes: - manufacture of blank magnetic audio and video tapes - manufacture of blank magnetic audio and video cassettes - manufacture of blank diskettes - manufacture of blank optical discs - manufacture of hard drive media This class excludes: - reproduction of recorded media (computer media, sound, video, etc.), see 18.2 @en
scope note: Esta clase comprende la fabricación de soportes para la grabación magnética y óptica. Esta clase comprende: - la fabricación de cintas magnéticas vírgenes de audio y vídeo - la fabricación de disquetes vírgenes - la fabricación de discos ópticos vírgenes - la fabricación de soportes para disco duro Esta clase no comprende: - la reproducción de soportes grabados (soportes informáticos, sonido, vídeo, etc.) (véase 18.2) @es
scope note: Cette classe comprend la fabrication de supports d’enregistrement magnétiques et optiques. Cette classe comprend: - la fabrication de bandes magnétiques vierges pour le son et l’image - la fabrication de cassettes vierges pour le son et l’image - la fabrication de disquettes vierges - la fabrication de disques optiques vierges - la fabrication de disques durs Cette classe ne comprend pas: - la reproduction de supports enregistrés (données informatiques, son, vidéo, etc.), voir 18.2 @fr
scope note: Ovaj razred uključuje proizvodnju magnetskih i optičkih medija za snimanje. Ovaj razred uključuje: - proizvodnju praznih magnetskih audio i videovrpci - proizvodnju praznih magnetskih audio i videokaseta - proizvodnju praznih disketa - proizvodnju praznih optičkih diskova - proizvodnju medija čvrstog pogona Ovaj razred isključuje: - reprodukciju snimljenih zapisa (računalnih medija, zvuka, videa itd.), vidi 18.2
scope note: Į šią klasę įeina įrašomų magnetinių ir optinių laikmenų gamyba. Į šią klasę įeina: - tuščių magnetinių garsajuosčių ir vaizdajuosčių gamyba - tuščių magnetinių garso ir vaizdo kasečių gamyba - tuščių diskelių gamyba - tuščių optinių diskų gamyba - standžiųjų diskų gamyba Į šią klasę neįeina: - įrašytų laikmenų tiražavimas (kompiuterinių, garso, vaizdo ir kt. laikmenų), žr. 18.2 @lt
scope note: Данный класс включает производство всех электромоторов и трансформаторов: AC, DC и AC/DC. Этот класс включает: - производство электромоторов (за исключением двигателей внутреннего сгорания) - производство распределительных электротрансформаторов - производство трансформаторов аргонной сварки - производство флюоресцирующих бареттеров (т.е. трансформаторов) - производство трансформаторных подстанций для распределения электроэнергии - производство передающих и распределительных регуляторов электрического напряжения - производство силовых генераторов (за исключением зарядки аккумуляторной батареи для двигателей внутреннего сгорания) - производство генераторных агрегатов (за исключением задающего блока генераторной установки) - наматывающее устройство для якоря на плавучих рыбозаводах Этот класс исключает: - производство электронных составляющих компонентов для трансформаторов и переключателей, см. 26.11 - производство электросварочного и паяльного оборудования, см. 27.90 - производство преобразователей, ректификаторов и конвертеров, см. 27.90 - производство турбогенераторных установок, см. 28.11 - производство пусковых двигателей и генераторов для двигателей внутреннего сгорания, см. 29.31 @ru
scope note: Bu sınıf, manyetik ve optik kayıt gereçlerinin imalatını kapsamaktadır. Bu sınıf aşağıdakileri kapsamaktadır; - boş manyetik ses ve görüntü bantlarının imalatı, - boş manyetik ses ve görüntü kasetlerinin imalatı, - boş disketlerin imalatı, - boş optik disklerin (CD, DVD vb.) imalatı, - taşınabilir belleklerin (flash disk, i-pot vb.) imalatı. Kapsam dışı olanlar, - kayıtlı medyanın (kayıtlı kaset, CD, DVD vb.) çoğaltılması (bilgisayar medyası, ses, görüntü, vb.), bkz. 18.2. @tr
preferred label: Производство на магнитни и оптични носители, незаписани @bg
preferred label: Výroba magnetických a optických médií @cs
preferred label: Fremstilling af magnetiske og optiske media @da
preferred label: Herstellung von magnetischen und optischen Datenträgern @de
preferred label: Κατασκευή μαγνητικών και οπτικών μέσων @el
preferred label: Fabricación de soportes magnéticos y ópticos @es
preferred label: Magnet- ja optilise andmekandjate tootmine @et
preferred label: Tallennevälineiden valmistus @fi
preferred label: Fabrication de supports magnétiques et optiques @fr
preferred label: Mágneses, optikai információhordozó gyártása
preferred label: Fabbricazione di supporti ottici e magnetici @it
preferred label: Magnetinių ir optinių laikmenų gamyba @lt
preferred label: Magnētisko un optisko datu nesēju ražošana @lv
preferred label: Manifattura ta' mezzi manjetiċi u ottiċi @mt
preferred label: Vervaardiging van magnetische en optische media @nl
preferred label: Produksjon av magnetiske og optiske media @no
preferred label: Produkcja magnetycznych i optycznych niezapisanych nośników informacji @pl
preferred label: Fabricação de suportes de informação magnéticos e ópticos @pt
preferred label: Fabricarea suporţilor magnetici şi optici destinaţi înregistrărilor @ro
preferred label: Производство магнитных и оптических средств передачи информации @ru
preferred label: Proizvodnja magnetnih in optičnih nosilcev zapisa @sl
preferred label: Tillverkning av magnetiska och optiska medier @sv
preferred label: Manyetik ve optik kaset, bant, CD vb. ortamların imalatı @tr
broader: Manufacture of magnetic and optical media

Manufacture of electrical equipment
type: Concept
notation: 27
status: valid
status modified: 2013-10-18
accepted date: 2013-10-18
in scheme: Statistical Classification of Economic Activities in the European Community, Rev. 2 (2008)
scope note: производство на съоръжения, които произвеждат, разпределят или използват електрическа енергия. Включва също производство на електрически осветителни и сигнализационни съоръжения и битови електроуреди. - производство на електронни продукти - раздел 26 @bg
scope note: Tento oddíl zahrnuje výrobu výrobků, pomocí kterých se elektřina vyrábí, rozvádí nebo využívá. Zahrnuje také výrobu elektrických zařízení pro svícení, signalizaci a výrobu elektrických domácích spotřebičů. Tento oddíl nezahrnuje výrobu elektronických výrobků (viz oddíl 26). @cs
scope note: Diese Abteilung umfasst die Herstellung von Produkten, die Elektrizität erzeugen, verteilen und verwenden. Diese Abteilung umfasst ferner die Herstellung elektrischer Beleuchtungs- und Signalgeräte sowie elektrischer Haushaltsgeräte. Diese Abteilung umfasst nicht die Herstellung von elektronischen Erzeugnissen (s. Abteilung 26). @de
scope note: This division includes the manufacture of products that generate, distribute and use electrical power. Also included is the manufacture of electrical lighting, signalling equipment and electric household appliances. This division excludes the manufacture of electronic products (see division 26). @en
scope note: Esta división comprende la fabricación de productos que generan, distribuyen y utilizan energía eléctrica. Se incluye asimismo la fabricación de equipo eléctrico de iluminación y señalización y de electrodomésticos. Esta división no comprende la fabricación de productos electrónicos (véase la división 26). @es
scope note: Cette division comprend la fabrication de produits destinés à la production, à la distribution et à l’utilisation d’électricité. La fabrication d’appareils électriques d’éclairage, d’appareils électriques de signalisation et d’appareils électroménagers est également incluse. Cette division ne comprend pas la fabrication de produits électroniques (voir division 26). @fr
scope note: Ovaj odjeljak uključuje proizvodnju proizvoda koji generiraju, distribuiraju i koriste se električnom energijom. Također uključuje proizvodnju električne rasvjete, signalne opreme i električnih uređaja za kućanstvo. Ovaj odjeljak isključuje proizvodnju elektroničkih proizvoda (vidi odjeljak 26).
scope note: Į šį skyrių įeina gaminančių, skirstančių ir naudojančių elektrą gaminių gamyba. Į skyrių taip pat įeina elektros apšvietimo, signalizavimo įrangos bei elektrinių buitinių prietaisų gamyba. Į šį skyrių neįeina elektroninių gaminių gamyba (žr. 26 skyrių). @lt
scope note: Этот класс включает: - производство выключателей электропитания - производство сетевых фильтров для электросети (для производственно-распределительной цепочки) - производство контрольных панелей для распределения электрического напряжения - производство электрических реле - производство кабеля для электрических распределительных щитов - производство электрических предохранителей - производство оборудования для переключения мощности - производство оборудования для переключения в электроэнергетической системе (за исключением пусковых кнопок, выключателей, соленоидов, тумблеров) - производство первичных источников энергии Этот класс исключает: - производство приборов контроля окружающей среды и промышленных процессов, см. 26.51 - производство переключателей для электрической цепи, таких как, пусковая кнопка и т.п., см. 27.33 @ru
scope note: Bu bölüm, elektrik enerjisini üreten, dağıtan ve kullanan ürünlerin imalatını kapsamaktadır. Elektrikli aydınlatma ve sinyalizasyon teçhizatı ile elektrikli ev gereçleri de bu bölüm de yer almaktadır. Bu bölüm, elektronik ürünlerin imalatını ise hariç tutmaktadır (bkz. Bölüm 26). @tr
preferred label: Производство на електрически съоръжения @bg
preferred label: Výroba elektrických zařízení @cs
preferred label: Fremstilling af elektrisk udstyr @da
preferred label: Herstellung von elektrischen Ausrüstungen @de
preferred label: Κατασκευή ηλεκτρολογικού εξοπλισμού @el
preferred label: Fabricación de material y equipo eléctrico @es
preferred label: Elektriseadmete tootmine @et
preferred label: Sähkölaitteiden valmistus @fi
preferred label: Fabrication d'équipements électriques @fr
preferred label: Villamos berendezés gyártása
preferred label: Fabbricazione di apparecchiature elettriche @it
preferred label: Elektros įrangos gamyba @lt
preferred label: Elektrisko iekārtu ražošana @lv
preferred label: Manifattura ta' tagħmir ta' l-elettriku @mt
preferred label: Vervaardiging van elektrische apparatuur @nl
preferred label: Produksjon av elektrisk utstyr @no
preferred label: Produkcja urządzeń elektrycznych @pl
preferred label: Fabricação de equipamento eléctrico @pt
preferred label: Fabricarea echipamentelor electrice @ro
preferred label: Производство электрического оборудования @ru
preferred label: Výroba elektrických zariadení @sk
preferred label: Proizvodnja električnih naprav @sl
preferred label: Tillverkning av elapparatur @sv
preferred label: Elektrikli teçhizat imalatı @tr
broader: MANUFACTURING
narrower: Manufacture of electric motors, generators, transformers and electricity distribution and control apparatus
narrower: Manufacture of batteries and accumulators
narrower: Manufacture of wiring and wiring devices
narrower: Manufacture of electric lighting equipment
narrower: Manufacture of domestic appliances
narrower: Manufacture of other electrical equipment

Manufacture of electric motors, generators, transformers and electricity distribution and control apparatus
type: Concept
notation: 27.1
status: valid
status modified: 2013-10-18
accepted date: 2013-10-18
in scheme: Statistical Classification of Economic Activities in the European Community, Rev. 2 (2008)
scope note: Tato skupina zahrnuje výrobu transformátorů síťových, distribučních, speciálních a ostatních; výrobu elektromotorů, generátorů a generátorových soustrojí. @cs
scope note: Diese Gruppe umfasst die Herstellung von Elektrizitätserzeugungs- und -verteilungseinrichtungen und Transformatoren; Elektromotoren, Generatoren und Motor-Generator-Aggregaten. @de
scope note: This group comprises the manufacture of power, distribution and specialty transformers; electric motors, generators, and motor generator sets. @en
scope note: Este grupo comprende la fabricación de transformadores eléctricos, transformadores de alimentación y transformadores especializados; motores eléctricos, generadores y grupos electrógenos. @es
scope note: Ce groupe comprend la fabrication de transformateurs de puissance, de distribution et de transformateurs spéciaux, de moteurs et de générateurs électriques et de groupes électrogènes à moteur. @fr
scope note: Ova skupina uključuje proizvodnju i distribuciju energije i posebnih transformatora, elektromotora, generatora i motornih generatora.
scope note: Ši grupė apima galios, skirstomųjų ir specialiųjų transformatorių gamybą; elektros variklių, generatorių ir jų agregatų gamybą. @lt
scope note: Bu grup, elektrik, dağıtım ve özel transformatörlerin imalatı ile elektrik motorlarının, jeneratörlerin ve motor jeneratör takımlarının imalatını kapsamaktadır. @tr
preferred label: Производство на електрически двигатели, генератори и трансформатори и апарати за управление и разпределение на електрическа енергия @bg
preferred label: Výroba elektrických motorů, generátorů, transformátorů a elektrických rozvodných a kontrolních zařízení @cs
preferred label: Fremstilling af elektriske motorer, generatorer, transformatorer og elektriske fordelings- og kontroltavler @da
preferred label: Herstellung von Elektromotoren, Generatoren, Transformatoren, Elektrizitätsverteilungs- und schalteinrichtungen @de
preferred label: Κατασκευή ηλεκτρικών κινητήρων, ηλεκτρογεννητριών, ηλεκτρικών μετασχηματιστών και συσκευών διανομής και ελέγχου του ηλεκτρικού ρεύματος @el
preferred label: Fabricación de motores, generadores y transformadores eléctricos, y de aparatos de distribución y control eléctrico @es
preferred label: Elektrimootorite, -generaatorite, trafode ja elektrijaotusseadmete ning juhtaparatuuri tootmine @et
preferred label: Sähkömoottorien, generaattorien, muuntajien sekä sähkönjakelu- ja valvontalaitteiden valmistus @fi
preferred label: Fabrication de moteurs, génératrices et transformateurs électriques et de matériel de distribution et de commande électrique @fr
preferred label: Villamos motor, áramfejlesztő, áramelosztó, -szabályozó készülék gyártása
preferred label: Fabbricazione di motori, generatori e trasformatori elettrici e di apparecchiature per la distribuzione e il controllo dell'elettricità @it
preferred label: Elektros variklių, generatorių, transformatorių bei elektros skirstomosios ir valdymo įrangos gamyba @lt
preferred label: Elektromotoru, ģeneratoru, transformatoru un elektrības sadales un kontroles iekārtu ražošana @lv
preferred label: Manifattura ta' muturi ta' l-elettriku, ġeneraturi, trasformaturi u apparat għat-tqassim u l-kontroll ta' l-elettriku @mt
preferred label: Vervaardiging van elektromotoren, van elektrische generatoren en transformatoren en van schakel- en verdeelinrichtingen @nl
preferred label: Produksjon av elektromotorer, generatorer, transformatorer og elektriske fordelings- og kontrolltavler og paneler @no
preferred label: Produkcja elektrycznych silników, prądnic, transformatorów, aparatury rozdzielczej i sterowniczej energii elektrycznej @pl
preferred label: Fabricação de motores, geradores e transformadores eléctricos e fabricação de material de distribuição e de controlo para instalações eléctricas @pt
preferred label: Fabricarea motoarelor electrice, generatoarelor şi transformatoarelor electrice şi a aparatelor de distribuţie şi control a electricităţii @ro
preferred label: Производство электромоторов, генераторов, трансформаторов и электрораспределительной и контрольной аппаратуры @ru
preferred label: Výroba elektrických motorov, generátorov, transformátorov a elektrických distribučných a kontrolných zariadení @sk
preferred label: Proizvodnja elektromotorjev, generatorjev, transformatorjev ter naprav za distribucijo in krmiljenje elektrike @sl
preferred label: Tillverkning av elmotorer, generatorer och transformatorer samt eldistributions- och elkontrollapparater @sv
preferred label: Elektrik motoru, jeneratör, transformatör ile elektrik dağıtım ve kontrol cihazlarının imalatı @tr
broader: Manufacture of electrical equipment
narrower: Manufacture of electric motors, generators and transformers
narrower: Manufacture of electricity distribution and control apparatus

Manufacture of electric motors, generators and transformers
type: Concept
notation: 27.11
status: valid
status modified: 2013-10-18
accepted date: 2013-10-18
in scheme: Statistical Classification of Economic Activities in the European Community, Rev. 2 (2008)
scope note: - производство на електрически двигатели (без стартери за двигатели с вътрешно горене) - производство на електрически трансформатори за разпределение на електрическа енергия - производство на трансформатори за електродъгово заваряване - производство на луминесцентни баластни съпротивления (например трансформатори) - производство на трансформатори за подстанции за разпределение на електрическа енергия - производство на регулатори за напрежение при пренос и разпределение на електрическа енергия - производство на генератори за електрическа енергия (без алтернатори за захранване на акумулаторни батерии за двигатели с вътрешно горене) - производство на моторгенераторни групи (без турбогенераторни агрегати) - заводско пренавиване на навити ротори - производство на трансформатори и прекъсвачи с електронни елементи - 26.11 - производство на електрически машини и устройства за спояване и заваряване - 27.90 - производство на полупроводникови инвертори, изправители и преобразуватели - 27.90 - производство на турбогенераторни групи - 28.11 - производство на стартери и генератори за двигатели с вътрешно горене - 29.31 @bg
scope note: Tato třída zahrnuje výrobu elektromotorů, generátorů a transformátorů: zařízení na střídavý, stejnosměrný a obojí proud. Z: - výrobu elektromotorů (kromě spouštěcích motorů pro motory s vnitřním spalováním) - výrobu elektrických distribučních transformátorů - výrobu transformátorů pro svařovací zařízení - výrobu předřadných přístrojů pro zářivky (tzn. transformátorů) - výrobu transformátorů pro elektrické rozvodné sítě - výrobu regulátorů přenosového a rozvodného napětí - výrobu generátorů proudu – dynam a alternátorů (kromě osvětlovacích dynam pro motory - s vnitřním spalováním) - výrobu generátorových soustrojí (kromě soustrojí turbína-generátor) - převíjení armatur na tovární bázi N: - výrobu elektronických komponentů - typu transformátorů a spínačů (26.11) - výrobu elektrických pájecích a svařovacích zařízení (27.90) - výrobu polovodičových měničů, usměrňovačů a konvertorů proudu (27.90) - výrobu soustrojí turbína-generátor (28.11) - výrobu spouštěcích agregátů a generátorů pro motory s vnitřním spalováním (29.31) @cs
scope note: Diese Klasse umfasst die Herstellung aller Elektromotoren und Transformatoren: Wechselstrom-, Gleichstrom- und Allstromgeräte. Diese Klasse umfasst: - Herstellung von Elektromotoren (mit Ausnahme von Anlassermotoren für Kolbenverbrennungsmotoren) - Herstellung von elektrischen Verteilungstransformatoren - Herstellung von Transformatoren für Lichtbogenschweißen - Herstellung von Vorschaltgeräten für Leuchtstofflampen (d.h. Transformatoren) - Herstellung von Umspanntransformatoren für Stromverteilungsnetze - Herstellung von Übertragungs- und Verteilungsspannungsreglern - Herstellung von Stromgeneratoren (mit Ausnahme von Lichtmaschinen für Kolbenverbrennungsmotoren) - Herstellung von Motor-Generator-Aggregaten (außer Turbinen-Generator-Aggregaten) - werkseitige Neuwicklung Diese Klasse umfasst nicht: - Herstellung von elektronischen Transformatoren und Schaltern (s. 26.11) - Herstellung von elektrischen Löt- und Schweißgeräten (s. 27.90) - Herstellung von Halbleiter-Wechselrichtern, Gleichrichtern und Konvertern (s. 27.90) - Herstellung von Turbinen-Generator-Aggregaten (s. 28.11) - Herstellung von Anlassermotoren und Generatoren für Kolbenverbrennungsmotoren (s. 29.31) @de
scope note: This class includes manufacture of all electric motors and transformers: AC, DC and AC/DC. This class includes: - manufacture of electric motors (except internal combustion engine starting motors) - manufacture of distribution transformers, electric - manufacture of arc-welding transformers - manufacture of fluorescent ballasts (i.e. transformers) - manufacture of substation transformers for electric power distribution - manufacture of transmission and distribution voltage regulators - manufacture of power generators (except battery charging alternators for internal combustion engines) - manufacture of motor generator sets (except turbine generator set units) - rewinding of armatures on a factory basis This class excludes: - manufacture of electronic component-type transformers and switches, see 26.11 - manufacture of electric welding and soldering equipment, see 27.90 - manufacture of solid state inverters, rectifiers and converters, see 27.90 - manufacture of turbine-generator sets, see 28.11 - manufacture of starting motors and generators for internal combustion engines, see 29.31 @en
scope note: Esta clase comprende la fabricación de todos los motores y transformadores eléctricos: AC, DC y AC/DC. Esta clase comprende: - la fabricación de motores eléctricos (excepto motores de arranque para motores de combustión interna) - la fabricación de transformadores de distribución eléctricos - la fabricación de transformadores para soldadura por arco - la fabricación de reactancias para lámparas fluorescentes (es decir, transformadores) - la fabricación de transformadores de subestación para la distribución de energía eléctrica - la fabricación de reguladores del voltaje de transmisión y distribución - la fabricación de generadores eléctricos (excepto alternadores de carga de batería para motores de combustión internos) - la fabricación de grupos electrógenos (excepto grupos turbogeneradores) - rebobinado de motores eléctricos a escala industrial Esta clase no comprende: - la fabricación de transformadores y conmutadores considerados componentes electrónicos (véase 26.11) - la fabricación de equipos para soldadura eléctrica (véase 27.90) - la fabricación de inversores, rectificadores y convertidores de estado sólido (véase 27.90) - la fabricación de grupos turbogeneradores (véase 28.11) - la fabricación de motores de arranque y generadores para motores de combustión interna (véase 29.31) @es
scope note: Cette classe comprend la fabrication de tout type de moteurs et transformateurs électriques: courant alternatif, courant continu ou alternatif-continu. Cette classe comprend: - la fabrication de moteurs électriques (à l’exception des moteurs de démarrage pour moteurs à combustion interne) - la fabrication de transformateurs électriques de distribution - la fabrication de transformateurs pour soudure à l’arc - la fabrication de ballasts fluorescents (transformateurs) - la fabrication de transformateurs de sous-station pour la distribution de l’électricité - la fabrication de régulateurs de voltage, transmission et distribution - la fabrication de groupes électrogènes (à l’exception des alternateurs charge batterie pour moteurs à combustion interne) - la fabrication de groupes électrogènes à moteur (à l’exception des turbines génératrices) - le rebobinage d’armatures en usine Cette classe ne comprend pas: - la fabrication de transformateurs et d’interrupteurs de type composants électroniques, voir 26.11 - la fabrication de matériel électrique à souder et à braser, voir 27.90 - la fabrication d’onduleurs à semi-conducteurs, de redresseurs et de convertisseurs, voir 27.90 - la fabrication de turbines génératrices, voir 28.11 - la fabrication de moteurs de démarrage et de générateurs pour moteurs à combustion interne, voir 29.31 @fr
scope note: Ovaj razred uključuje proizvodnju svih električnih motora i transformatora: AC, DC i AC/DC Ovaj razred uključuje: - proizvodnju električnih motora (osim startnih motora s unutarnjim izgaranjem) - proizvodnju električnih distribucijskih transformatora - proizvodnju elektrolučnih transformatora - proizvodnju fluorescentnog balasta (tj. transformatora) - proizvodnju izmjeničnih transformatora za distribuciju električne energije - proizvodnju regulatora za prijenos i distribuciju napona - proizvodnju generatora snage (osim baterija koje pune alternatore za motore s unutarnjim izgaranjem) - proizvodnju generatorskih setova motora (osim jedinica generatorskih setova turbina) - premotavanje tvorničke armature Ovaj razred isključuje: - proizvodnju elektroničkih komponenata - vrste transformatora i prekidača, vidi 26.12 - proizvodnju opreme za elektrozavarivanje i lemljenje, vidi 27.90 - proizvodnju čvrstih invertera, ispravljača, konvertera, vidi 27.90 - proizvodnju turbina - generatorskih setova, vidi 28.11 - proizvodnju startnih motora i generatora s unutarnjim izgaranjem, vidi 29.31
scope note: Į šią klasę įeina visų rūšių elektros variklių ir transformatorių gamyba: kintamosios srovės (AC), nuolatinės srovės (DC) bei kintamosios ir nuolatinės srovės (AC / DC). Į šią klasę įeina: - elektros variklių gamyba (išskyrus vidaus degimo variklių paleidimo variklius) - elektros skirstomųjų transformatorių gamyba - lankinio suvirinimo transformatorių gamyba - liuminescencinių įtaisų balastų (t.y. transformatorių) gamyba - pastočių elektros skirstomųjų transformatorių gamyba - perduodamos ir skirstomos įtampos reguliatorių gamyba - elektros generatorių gamyba (išskyrus vidaus degimo variklių akumuliatorių įkrovimos kintamosios srovės generatorius) - variklių ir generatorių agregatų gamyba (išskyrus turboagregatų įrenginius) - gamyklinis inkarų pervyniojimas Į šią klasę neįeina: - elektroninių komponentų tipo transformatorių ir jungiklių gamyba, žr. 26.11 - elektrinio suvirinimo ir litavimo įrangos gamyba, žr. 27.90 - puslaidininkinių (inverterių), lygintuvų ir keitiklių gamyba, žr. 27.90 - turbogeneratorinių agregatų gamyba, žr. 28.11 - vidaus degimo variklių paleidimo variklių ir generatorių gamyba, žr. 29.31 @lt
scope note: Данный подкласс включает производство не перезаряжаемых и перезаряжаемых батарей. Этот класс включает: - производство первичных элементов • элементов батареи, содержащих диоксид марганца, ртути, серебра и т.д. - производство электроаккумуляторов, включая запасные части к ним: • разделители, корпуса, колпаки - производство свинцово-кислотных батарей - производство никелекадмиевых батарей - производство никелеметаллогидридных батарей питания - производство литиевых батарей - производство сухих батарей - производство батарей с жидким электролитом @ru
scope note: Bu sınıf, tüm elektrik motorları ve transformatörlerin (AC, DC ve AC/DC) imalatını kapsamaktadır. Bu sınıf aşağıdakileri kapsamaktadır; - elektrik motorlarının imalatı (içten yanmalı motorlardaki marş motorları hariç), - elektrik dağıtım transformatörlerinin imalatı - ark kaynağı transformatörlerinin imalatı - floresan balastlarının (örn. transformatör) imalatı - elektrik dağıtımı için trafo imalatı, - iletim ve dağıtım voltaj düzenleyicilerin (regülatör) imalatı, - elektrik jeneratörlerinin imalatı (içten yanmalı motorlar için akü/pil şarj etmekte kullanılan alternatörler hariç), - motor jeneratör setleri imalatı (türbin jeneratör set birimleri hariç), - fabrika temelli bobinlerin tekrar sarılması. Kapsam dışı olanlar; - elektronik bileşenli transformatörlerin ve anahtarların imalatı, bkz. 26.11, - elektrikli kaynak ve lehim teçhizatlarının imalatı, bkz. 27.90, - katı hal çeviricilerinin, düzelticilerinin ve dönüştürücülerinin imalatı, bkz. 27.90, - türbin-jeneratör setlerinin imalatı, bkz. 28.11, - içten yanmalı motorlar için marş motorlarının ve araç dinamolarının imalatı, bkz. 29.31. @tr
preferred label: Производство на електрически двигатели, генератори и трансформатори @bg
preferred label: Výroba elektrických motorů, generátorů a transformátorů @cs
preferred label: Fremstilling af elektriske motorer, generatorer og transformatorer @da
preferred label: Herstellung von Elektromotoren, Generatoren und Transformatoren @de
preferred label: Κατασκευή ηλεκτροκινητήρων, ηλεκτρογεννητριών και ηλεκτρικών μετασχηματιστών @el
preferred label: Fabricación de motores, generadores y transformadores eléctricos @es
preferred label: Elektrimootorite, -generaatorite ja trafode tootmine @et
preferred label: Sähkömoottorien, generaattorien ja muuntajien valmistus @fi
preferred label: Fabrication de moteurs, génératrices et transformateurs électriques @fr
preferred label: Villamos motor, áramfejlesztő gyártása
preferred label: Fabbricazione di motori, generatori e trasformatori elettrici @it
preferred label: Elektros variklių, generatorių ir transformatorių gamyba @lt
preferred label: Elektromotoru, ģeneratoru un transformatoru ražošana @lv
preferred label: Manifattura ta' muturi ta' l-elettriku, ġeneraturi u trasformaturi @mt
preferred label: Vervaardiging van elektromotoren en van elektrische generatoren en transformatoren @nl
preferred label: Produksjon av elektromotorer, generatorer og transformatorer @no
preferred label: Produkcja elektrycznych silników, prądnic i transformatorów @pl
preferred label: Fabricação de motores, geradores e transformadores eléctricos @pt
preferred label: Fabricarea motoarelor, generatoarelor şi transformatoarelor electrice @ro
preferred label: Производство электромоторов, генераторов и трансформаторов @ru
preferred label: Výroba elektrických motorov, generátorov a transformátorov @sk
preferred label: Proizvodnja elektromotorjev, generatorjev in transformatorjev @sl
preferred label: Tillverkning av elmotorer, generatorer och transformatorer @sv
preferred label: Elektrik motorlarının, jeneratörlerin ve transformatörlerin imalatı @tr
broader: Manufacture of electric motors, generators, transformers and electricity distribution and control apparatus

Manufacture of electricity distribution and control apparatus
type: Concept
notation: 27.12
status: valid
status modified: 2013-10-18
accepted date: 2013-10-18
in scheme: Statistical Classification of Economic Activities in the European Community, Rev. 2 (2008)
scope note: - производство на прекъсвачи за електрическа енергия - производство на устройства за потискане на импулсни смущения (за нивото на напрежение при разпределение на електрическата енергия) - производство на табла за управление за електрическите разпределителни мрежи - производство на електрически релета - производство на канали със специален профил за монтаж на комутационни апарати - производство на електрически стопяеми предпазители - производство на комутационни апарати за енергетиката - производство на електрически превключватели за енергетиката (без бутони, ключове с блокировка, бобини, въртящи се превключватели) - производство на първични двигатели за генераторни групи - производство на уреди за контрол на околната среда и уреди за управление на производствените процеси - 26.51 - производство на превключватели за електрически вериги като бутони, ключове с блокировка, бобини, въртящи се превключватели - 27.33 @bg
scope note: Z: - výrobu přerušovačů elektrických obvodů - výrobu svodičů přepětí (pro distribuční hladinu napětí) - výrobu ovládacích panelů pro rozvod elektřiny - výrobu elektrických stykačů a relé - výrobu vedení pro elektrické ústrojí rozvodných desek - výrobu elektrických pojistek - výrobu vypínacích zařízení - výrobu elektrických vypínačů a spínačů (kromě spínačů tlačítkových, mřížkových instalačních, páčkových, elektromagnetů se spínačem) - výrobu hnacího stroje motorgenerátoru N: - výrobu měřicích přístrojů pro ochranu životního prostředí a průmyslových zařízení pro automatické řízení procesů (26.51) - výrobu spínačů tlačítkových, mřížkových instalačních, páčkových, elektromagnetů se spínačem pro elektrické obvody (27.33) @cs
scope note: Diese Klasse umfasst: - Herstellung von Leistungsschaltern - Herstellung von Überspannungsableitern (für Verteilernetzspannungen) - Herstellung von Apparatetischen für die Stromverteilung - Herstellung von elektrischen Relais - Herstellung von Leitungen für elektrische Schalttafeln - Herstellung von elektrischen Sicherungen - Herstellung von Stromschaltergeräten - Herstellung von elektrischen Schaltern (außer Druck- und Druckknopfschaltern, elektromagnetischen Schaltern, Schnapp- und Kippschalter) - Herstellung von Kraftmaschinen-Generator-Aggregaten Diese Klasse umfasst nicht: - Herstellung von Messgeräten für den Umweltschutz und industriellen Prozesssteuerungsanlagen (s. 26.51) - Herstellung von Schaltern für elektrische Stromkreise, wie Druckknopf- und Schnappschalter (s. 27.33) @de
scope note: This class includes: - manufacture of power circuit breakers - manufacture of surge suppressors (for distribution level voltage) - manufacture of control panels for electric power distribution - manufacture of electrical relays - manufacture of duct for electrical switchboard apparatus - manufacture of electric fuses - manufacture of power switching equipment - manufacture of electric power switches (except pushbutton, snap, solenoid, tumbler) - manufacture of prime mover generator sets This class excludes: - manufacture of environmental controls and industrial process control instruments, see 26.51 - manufacture of switches for electrical circuits, such as pushbutton and snap switches, see 27.33 @en
scope note: Esta clase comprende: - la fabricación de disyuntores de circuitos eléctricos - la fabricación de supresores de sobretensión (para el nivel de voltaje de distribución) - la fabricación de paneles de control para la distribución de energía eléctrica - la fabricación de relés eléctricos - la fabricación de conducciones para aparatos de conmutación eléctrica - la fabricación de fusibles eléctricos - la fabricación de equipos de conmutación de potencia - la fabricación de conmutadores eléctricos (excepto pulsadores, conmutadores de acción rápida, solenoides, interruptores basculantes) - la fabricación de grupos generadores de energía primaria Esta clase no comprende: - la fabricación de instrumentos para el control del medio ambiente y de los procesos industriales (véase 26.51) - la fabricación de conmutadores para circuitos eléctricos, como pulsadores e interruptores de acción rápida (véase 27.33) @es
scope note: Cette classe comprend: - la fabrication de disjoncteurs de puissance - la fabrication de limiteurs de tension (pour la tension au niveau de la distribution) - la fabrication de pupitres de commande pour la distribution de l’électricité - la fabrication de relais électriques - la fabrication de compartiments pour appareillage de tableaux de distribution électrique - la fabrication de fusibles électriques - la fabrication d’équipements électriques de commutation - la fabrication d’interrupteurs électriques (sauf à poussoir, à bouton poussoir, à bascule ou à solénoïde) - la fabrication de groupes électrogènes à moteur Cette classe ne comprend pas: - la fabrication d’instruments de contrôle environnementaux et des processus industriels, voir 26.51 - la fabrication d’interrupteurs pour circuits électriques, tels que interrupteurs à poussoir et à bouton poussoir, voir 27.33 @fr
scope note: Ovaj razred uključuje: - proizvodnju sklopnih prekidača na pogon - proizvodnju valovitih potiskivača (za distribuciju naponske razine) - proizvodnju kontrolnih ploča za distribuciju električne energije - proizvodnju električnih releja - proizvodnju vodova za električne sklopne ploče - proizvodnju električnih osigurača - proizvodnju opreme za prekidače električne energije - proizvodnju prekidača na električni pogon (osim tipke za pokretanje mehanizma, zavojnica, prebacivača) - proizvodnju generatorskog seta glavnog pokretača Ovaj razred isključuje: - proizvodnju instrumenata za kontrolu okoliša i industrijskih procesa, vidi 26.51 - proizvodnju prekidača za električni strujni krug kao što su prekidači i sklopke, vidi 27.33
scope note: Į šią klasę įeina: - elektros jungtuvų gamyba - viršįtampių ribotuvų (paskirstomosios įtampos lygiui nustatyti) gamyba - elektros skirtstomųjų valdymo skydų gamyba - elektrinių relių gamyba - elektrinių skydinių aparatų dėžių gamyba - elektros saugiklių gamyba - elektros perjungimo įrangos gamyba - elektros jungiklių gamyba (išskyrus mygtukinius, akimirkinius, solenoidinius jungiklius ir perjungiklius) - pirminių generatorinių agregatų variklių gamyba Į šią klasę neįeina: - aplinkos parametrų valdytuvų ir technologinių procesų valdymo prietaisų ir aparatų gamyba, žr. 26.51 - elektros grandinių jungiklių, tokių kaip mygtukai ir mikrojungikliai, gamyba, žr. 27.33 @lt
scope note: Данная группа включает производство токонесущих кабельных устройств и не токонесущих устройств системы электроснабжения, изготовленных из различных материалов. Данная группа также включает производство изолирующего провода и оптоволоконного кабеля. @ru
scope note: Bu sınıf aşağıdakileri kapsamaktadır; - elektrik devresi kesicilerinin (şalterler) imalatı, - aşırı gerilim koruyucusu imalatı (elektrik dağıtım voltaj seviyesi için) - elektrik dağıtımı için kontrol panellerinin imalatı, - elektrik rölelerinin (düzenleyicilerin) imalatı, - elektrikli tevzi pano hatlarının imalatı, - elektrik sigortalarının imalatı, - devre kesici donanımların imalatı, - elektrik dağıtım ve kontrol cihazları anahtarlarının (basma düğmesi, çıt çıt, solenoit (sarmal bobin), mandal hariç) imalatı, - güç sağlayıcı (çevirici) jeneratör setlerinin imalatı. Kapsam dışı olanlar; - çevresel kontrol aletleri ve sanayi işlem kontrol aletlerinin imalatı, bkz. 26.51, - elektrik devresi için çeşitli elektrik düğmelerinin imalatı, bkz. 27.33. @tr
preferred label: Производство на апарати за управление и разпределение на електрическа енергия @bg
preferred label: Výroba elektrických rozvodných a kontrolních zařízení @cs
preferred label: Fremstilling af elektriske fordelings- og kontrolapparater @da
preferred label: Herstellung von Elektrizitätsverteilungs- und -schalteinrichtungen @de
preferred label: Κατασκευή συσκευών διανομής και ελέγχου ηλεκτρικού ρεύματος @el
preferred label: Fabricación de aparatos de distribución y control eléctrico @es
preferred label: Elektrijaotusseadmete ja juhtaparatuuri tootmine @et
preferred label: Sähkönjakelu- ja valvontalaitteiden valmistus @fi
preferred label: Fabrication de matériel de distribution et de commande électrique @fr
preferred label: Áramelosztó, -szabályozó készülék gyártása
preferred label: Fabbricazione di apparecchiature per la distribuzione e il controllo dell'elettricità @it
preferred label: Elektros skirstomosios ir valdymo įrangos gamyba @lt
preferred label: Elektrosadales un kontroles iekārtu ražošana @lv
preferred label: Manifattura ta' apparat għat-tqassim u l-kontoll ta' l-elettriku @mt
preferred label: Vervaardiging van schakel- en verdeelinrichtingen @nl
preferred label: Produksjon av elektriske fordelings- og kontrolltavler og paneler @no
preferred label: Produkcja aparatury rozdzielczej i sterowniczej energii elektrycznej @pl
preferred label: Fabricação de material de distribuição e de controlo para instalações eléctricas @pt
preferred label: Fabricarea aparatelor de distribuţie şi control a electricităţii @ro
preferred label: Производство электрораспределительной и регулирующей аппаратуры @ru
preferred label: Výroba elektrických distribučných a kontrolných zariadení @sk
preferred label: Proizvodnja naprav za distribucijo in krmiljenje elektrike @sl
preferred label: Tillverkning av eldistributions- och elkontrollapparater @sv
preferred label: Elektrik dağıtım ve kontrol cihazları imalatı @tr
broader: Manufacture of electric motors, generators, transformers and electricity distribution and control apparatus

Manufacture of batteries and accumulators
type: Concept
notation: 27.2
status: valid
status modified: 2013-10-18
accepted date: 2013-10-18
in scheme: Statistical Classification of Economic Activities in the European Community, Rev. 2 (2008)
scope note: Этот класс включает: - производство оптоволоконного кабеля для передачи данных или прямой передачи изображений Этот класс исключает: - производство стекловолокна или жилы кабеля, см. 23.14 - производство приборов с волоконно-оптическим кабелем или составляющих с коннекторами или прочими приспособлениями (см. раздел в зависимости от назначения, например 26.11) @ru
preferred label: Производство на акумулаторни батерии и акумулатори @bg
preferred label: Výroba baterií a akumulátorů @cs
preferred label: Fremstilling af batterier og akkumulatorer @da
preferred label: Herstellung von Batterien und Akkumulatoren @de
preferred label: Κατασκευή ηλεκτρικών στηλών και συσσωρευτών @el
preferred label: Fabricación de pilas y acumuladores eléctricos @es
preferred label: Patareide ja akude tootmine @et
preferred label: Paristojen ja akkujen valmistus @fi
preferred label: Fabrication de piles et d'accumulateurs électriques @fr
preferred label: Akkumulátor, szárazelem gyártása
preferred label: Fabbricazione di batterie e accumulatori @it
preferred label: Baterijų ir akumuliatorių gamyba @lt
preferred label: Galvanisko elementu ražošana @lv
preferred label: Manifattura ta' batteriji u kumulaturi @mt
preferred label: Vervaardiging van batterijen en accumulatoren @nl
preferred label: Produksjon av batterier og akkumulatorer @no
preferred label: Produkcja baterii i akumulatorów @pl
preferred label: Fabricação de acumuladores e de pilhas eléctricas @pt
preferred label: Fabricarea de acumulatori şi baterii @ro
preferred label: Производство батарей и аккумуляторов @ru
preferred label: Výroba batérií a akumulátorov @sk
preferred label: Proizvodnja baterij in akumulatorjev @sl
preferred label: Batteri- och ackumulatortillverkning @sv
preferred label: Akümülatör ve pil imalatı @tr
broader: Manufacture of electrical equipment
narrower: Manufacture of batteries and accumulators

Manufacture of batteries and accumulators
type: Concept
notation: 27.20
status: valid
status modified: 2013-10-18
accepted date: 2013-10-18
in scheme: Statistical Classification of Economic Activities in the European Community, Rev. 2 (2008)
scope note: - производство на първични акумулаторни елементи и батерии • елементи, съдържащи манганов диоксид, живачен оксид, сребърен оксид и други - производство на електрически акумулатори и части за тях: • електрически сепаратори, контейнери, капаци - производство на оловни акумулатори - производство на никелово-кадмиеви акумулатори - производство на никел-метал-хидридни акумулатори - производство на литиеви батерии - производство на акумулатори със сухи елементи - производство на акумулатори с водоналивни елементи @bg
scope note: Tato třída zahrnuje výrobu nenabíjecích a nabíjecích baterií, galvanických článků a elektrických akumulátorů. Z: - výrobu primárních prvků a primárních baterií • primárních prvků obsahujících oxid manganičitý, oxid rtuťnatý, oxid stříbrný atd. - výrobu elektrických akumulátorů a jejich dílů: • separátorů, krytů, vík - výrobu olověných baterií - výrobu nikl-kadmiových baterií - výrobu NiMH-baterií - výrobu lithiových baterií - výrobu baterií se suchými články - výrobu baterií s mokrými články @cs
scope note: Diese Klasse umfasst die Herstellung von nichtwiederaufladbaren und von wiederaufladbaren Batterien. Diese Klasse umfasst: - Herstellung von Primärelementen und Primärbatterien • Primärelemente, die Mangandioxyd, Quecksilberdioxid, Silberoxid usw. enthalten - Herstellung von elektrischen Akkumulatoren und Teilen davon: • Separatoren, Gehäuse, Abdeckungen - Herstellung von Bleibatterien - Herstellung von Nickel-Cadmium-Batterien - Herstellung von NiMH-Batterien - Herstellung von Lithium-Batterien - Herstellung von Trockenzellenbatterien - Herstellung von Nasszellenbatterien @de
scope note: This class includes the manufacture of non-rechargeable and rechargeable batteries. This class includes: - manufacture of primary cells and primary batteries • cells containing manganese dioxide, mercuric dioxide, silver oxide etc. - manufacture of electric accumulators, including parts thereof: • separators, containers, covers - manufacture of lead acid batteries - manufacture of NiCad batteries - manufacture of NiMH batteries - manufacture of lithium batteries - manufacture of dry cell batteries - manufacture of wet cell batteries @en
scope note: Esta clase comprende la fabricación de baterías no recargables y recargables. Esta clase comprende: - la fabricación de pilas y baterías primarias • pilas de dióxido de manganeso, dióxido de mercurio, óxido de plata, etc. - la fabricación de acumuladores eléctricos y de las piezas de los mismos • separadores, contenedores, tapas - la fabricación de baterías de plomo - la fabricación de baterías de níquel-cadmio - la fabricación de baterías de hidruro de niquel metal - la fabricación de baterías de litio - la fabricación de pilas secas - la fabricación de pilas húmedas @es
scope note: Cette classe comprend la fabrication de batteries, rechargeables ou non. Cette classe comprend: - la fabrication de piles et de batteries électriques • piles au bioxyde de manganèse, à l’oxyde de mercure, à l’oxyde d’argent ou contenant d’autres matières - la fabrication d’accumulateurs électriques et de parties de ces appareils • séparateurs, bacs, couvercles - la fabrication d’accumulateurs au plomb - la fabrication d’accumulateurs au nickel-cadmium (Ni/Cd) - la fabrication d’accumulateurs au nickel-hydrure métallique (NiMH) - la fabrication d’accumulateurs au lithium - la fabrication d’accumulateurs à pile sèche - la fabrication d’accumulateurs à pile humide @fr
scope note: Ovaj razred uključuje proizvodnju nepunjivih i punjivih baterija. Ovaj razred uključuje: - proizvodnju primarnih stanica i primarnih baterija • stanica koje sadrže mangan-dioksid, živin dioksid, srebrni oksid itd. - proizvodnju električnih akumulatora te njihovih dijelova: • separatora, spremnika, prekrivača - proizvodnju olovnih baterija - proizvodnju NiCad-baterija - proizvodnju NiMH-baterija - proizvodnju litijevih baterija - proizvodnju baterija suhih stanica - proizvodnju baterija vlažnih stanica
scope note: Į šią klasę įeina neįkraunamų ir pakartotinai įkraunamų baterijų gamyba Į šią klasę įeina: - galvaninių elementų ir galvaninių baterijų gamyba • elementų, kurių sudėtyje yra mangano dioksido, gyvsidabrio dioksido, sidabro oksido ir kt. - elektrinių akumuliatorių ir jų dalių gamyba: • skirtuvų, talpyklų, dangčių - rūgštinių švino baterijų gamyba - nikelio - kadmio baterijų gamyba - NiMH baterijų gamyba - ličio baterijų gamyba - sausųjų elementų baterijų gamyba - šlapiųjų elementų baterijų gamyba @lt
scope note: Этот класс включает: - производство изолированного провода и кабеля из стали, меди и алюминия Этот класс исключает: - производство (вытяжку) проволоки, см. 24.34, 24.41, 24.42, 24.43, 24.44, 24.45 - производство кабеля для компьютеров, принтеров, USB портов и т.п. или комплектующих, см. 26.11 - производство электрического шнура с изолирующей поверхностью и коннекторами, см. 27.90 - производство кабеля, электропроводки и т.п. или комплектующих для автомобильных приборов, см. 29.31 @ru
scope note: Bu sınıf, şarj edilebilen ve edilemeyen pil ve akümülatör imalatını kapsamaktadır. Bu sınıf aşağıdakileri kapsamaktadır; - pil ve batarya imalatı: • manganez dioksit, cıva dioksit, gümüş oksit vb. içeren pil imalatı, - akümülatör ve parçalarının imalatı, • akümülatör separatörü, kapları ve kapakları. - kurşun asitli pillerin imalatı, - NiCad pillerin imalatı, - NiMH pillerin imalatı, - lityum pillerin imalatı, - kuru hücreli pil ve akülerin imalatı, - ıslak hücreli pil ve akülerin imalatı. @tr
preferred label: Производство на акумулаторни батерии и акумулатори @bg
preferred label: Výroba baterií a akumulátorů @cs
preferred label: Fremstilling af batterier og akkumulatorer @da
preferred label: Herstellung von Batterien und Akkumulatoren @de
preferred label: Κατασκευή ηλεκτρικών στηλών και συσσωρευτών @el
preferred label: Fabricación de pilas y acumuladores eléctricos @es
preferred label: Patareide ja akude tootmine @et
preferred label: Paristojen ja akkujen valmistus @fi
preferred label: Fabrication de piles et d'accumulateurs électriques @fr
preferred label: Akkumulátor, szárazelem gyártása
preferred label: Fabbricazione di batterie e accumulatori @it
preferred label: Baterijų ir akumuliatorių gamyba @lt
preferred label: Galvanisko elementu ražošana @lv
preferred label: Manifattura ta' batteriji u kumulaturi @mt
preferred label: Vervaardiging van batterijen en accumulatoren @nl
preferred label: Produksjon av batterier og akkumulatorer @no
preferred label: Produkcja baterii i akumulatorów @pl
preferred label: Fabricação de acumuladores e de pilhas eléctricas @pt
preferred label: Fabricarea de acumulatori şi baterii @ro
preferred label: Производство батарей и аккумуляторов @ru
preferred label: Výroba batérií a akumulátorov @sk
preferred label: Proizvodnja baterij in akumulatorjev @sl
preferred label: Batteri- och ackumulatortillverkning @sv
preferred label: Akümülatör ve pil imalatı @tr
broader: Manufacture of batteries and accumulators

Manufacture of wiring and wiring devices
type: Concept
notation: 27.3
status: valid
status modified: 2013-10-18
accepted date: 2013-10-18
in scheme: Statistical Classification of Economic Activities in the European Community, Rev. 2 (2008)
scope note: производство на токопреносни и нетокопреносни кабелни устройства за електрически мрежи независимо от материала. Тук се включва още производството на изолирани проводници и кабели от оптични влакна. @bg
scope note: Tato skupina zahrnuje výrobu vodivého a nevodivého instalačního materiálu pro instalace elektrických obvodů, nezávisle na tom, z jakého materiálu se vyrábí. Tato skupina zahrnuje také izolování drátu a výrobu kabelů z optických vláken. @cs
scope note: Diese Gruppe umfasst die Herstellung von stromführendem und nichtstromführendem Installationsmaterial, unabhängig davon, aus welchem Material es hergestellt wird, für die Installation von Stromkreisen. Diese Gruppe umfasst auch die Isolierung von Drähten und die Herstellung von Glasfaserkabeln. @de
scope note: This group includes the manufacture of current-carrying wiring devices and non current-carrying wiring devices for wiring electrical circuits regardless of material. This group also includes the insulating of wire and the manufacture of fibre optic cables. @en
scope note: Este grupo comprende la fabricación de dispositivos de cableado portador o no de corriente para circuitos eléctricos, con independencia del material. En este grupo se incluye asimismo el aislamiento de cables y la fabricación de cables de fibra óptica. @es
scope note: Ce groupe comprend la fabrication de dispositifs de câblage porteurs et non porteurs de courant pour le câblage d’installations électriques, quel que soit le matériau utilisé. Ce groupe comprend également la fabrication de fils et câbles électriques isolés et de câbles en fibres optiques. @fr
scope note: Ova skupina uključuje proizvodnju strujnih žičanih uređaja i nestrujnih žičanih uređaja za vodove električnih krugova bez obzira na materijal. Također uključuje izolaciju žica i proizvodnju vlaknastih optičkih kablova.
scope note: Į šią grupę įeina elektrai laidžių ar nelaidžių elektros instaliacijos įtaisų, nežiūrint kokia jų medžiaga, elektrinėms grandinėms montuoti, gamyba. Į šią grupę taip pat įeina laidų izoliavimas ir skaidulinės optikos kabelių gamyba. @lt
scope note: Данный подкласс включает производство токонесущих и не токонесущих кабельных устройств для системы электроснабжения, изготовленных из различных материалов. Этот класс включает: - производство токопроводящих шин, электропроводки (за исключением стрелочного провода) - производство выключателей цепи заземления - производство ламповых патронов - производство разрядников для защиты от искрового перенапряжения и катушек индуктивности - производство переключателей для электропроводки (например, переключателей напряжения, пусковых кнопок, размыкателей, тумблеров) - производство электрических штепсельных розеток и вилок - производство распределительных коробок - производство изоляционного провода и фитингов - производство линейной арматуры и воздушных линий передачи или связи - производство пластиковых удлинителей, включая пластиковые распределительные коробки и т.п., пластиковой линейной гарнитуры и переключателей Этот класс исключает: - производство керамических изоляционных составляющих, см. 23.43 - производство электронных коннекторов, розеток и выключателей, см. 26.11 @ru
scope note: Bu grup, materyaline bakılmaksızın elektrik devrelerini kablolamak için akım taşısın ya da taşımasın kablolamada kullanılan gereçlerin imalatını kapsamaktadır. Bu grup ayrıca, kabloların yalıtımının yapılmasını ve fiber optik kabloların imalatını da kapsamaktadır. @tr
preferred label: Производство на изолирани проводници и електроинсталационни изделия @bg
preferred label: Výroba elektrického vedení a elektroinstalačních zařízení @cs
preferred label: Fremstilling af ledninger og kabler og tilbehør hertil @da
preferred label: Herstellung von Kabeln und elektrischem Installationsmaterial @de
preferred label: Κατασκευή καλωδιώσεων και εξαρτημάτων καλωδίωσης @el
preferred label: Fabricación de cables y dispositivos de cableado @es
preferred label: Juhtmestiku ja selle tarvikute tootmine @et
preferred label: Sähköjohtojen ja kytkentälaitteiden valmistus @fi
preferred label: Fabrication de fils et câbles et de matériel d'installation électrique @fr
preferred label: Vezeték, kábel, huzalozott eszköz gyártása
preferred label: Fabbricazione di cablaggi e apparecchiature di cablaggio @it
preferred label: Laidų ir instaliacijos įtaisų gamyba @lt
preferred label: Vadu un instalāciju ierīču ražošana @lv
preferred label: Manifattura ta' wajers u għodod għall-wajers @mt
preferred label: Vervaardiging van kabels en van schakelaars, stekkers, stopcontacten e.d. @nl
preferred label: Produksjon av ledninger og ledningsmateriell @no
preferred label: Produkcja izolowanych przewodów i kabli oraz sprzętu instalacyjnego @pl
preferred label: Fabricação de fios e cabos isolados e seus acessórios @pt
preferred label: Fabricarea de fire şi cabluri; fabricarea dispozitivelor de conexiune pentru acestea @ro
preferred label: Производство электропроводки и электропроводных приборов @ru
preferred label: Výroba drôtov a elektroinštalačných zariadení @sk
preferred label: Proizvodnja oplaščenih vodnikov in naprav za ožičenje @sl
preferred label: Tillverkning av ledningar och kablar och kabeltillbehör @sv
preferred label: Kablolamada kullanılan teller ve kablolar ile gereçlerin imalatı @tr
broader: Manufacture of electrical equipment
narrower: Manufacture of fibre optic cables
narrower: Manufacture of other electronic and electric wires and cables
narrower: Manufacture of wiring devices

Manufacture of fibre optic cables
type: Concept
notation: 27.31
status: valid
status modified: 2013-10-18
accepted date: 2013-10-18
in scheme: Statistical Classification of Economic Activities in the European Community, Rev. 2 (2008)
scope note: - производство на кабели от оптични влакна за пренос на данни или на образ в реално време - производство на стъклени влакна, дори нарязани - 23.14 - производство на комплекти оптични кабели, снабдени със съединители или други части за свързване, класифицират се в зависимост от предназначението - например 26.11 @bg
scope note: Z: - výrobu kabelů z optických vláken pro přenos dat a přímý přenos obrazu N: - výrobu skleněných vláken nebo lanek (23.14) - výrobu svazků kabelů z optických vláken nebo instalačního materiálu s přípojkami nebo jinými zařízeními (viz zařazení dle oblasti využití, např. 26.11, 27.90) @cs
scope note: Diese Klasse umfasst: - Herstellung von Lichtleitfaserkabeln für die Datenübertragung und die Direktübertragung von Bildern Diese Klasse umfasst nicht: - Herstellung von Glasfasern oder Litzen (s. 23.14) - Herstellung von Lichtleitfaserkabelsätzen oder von Installationsmaterial mit Anschlüssen oder anderen Vorrichtungen (Zuordnung je nach Einsatzbereich, z. B. 26.11) @de
scope note: This class includes: - manufacture of fibre optic cable for data transmission or live transmission of images This class excludes: - manufacture of glass fibres or strand, see 23.14 - manufacture of optical cable sets or assemblies with connectors or other attachments, see depending on application, e.g. 26.11 @en
scope note: Esta clase comprende: - la fabricación de cable de fibra óptica para la transmisión de datos y de imágenes en directo Esta clase no comprende: - la fabricación de fibras y filamentos de vidrio (véase 23.14). - la fabricación de conjuntos o ensamblajes de cable óptico con conectores u otros elementos accesorios (véase en función de la aplicación; p. ej., 26.11) @es
scope note: Cette classe comprend: - la fabrication de câbles de fibres optiques pour la transmission des données ou la transmission en direct d’images Cette classe ne comprend pas: - la fabrication de fibres de verre, voir 23.14 - la fabrication d’ensembles ou assemblages de câbles optiques équipés de connecteurs ou autres dispositifs similaires, voir en fonction de l’application, par exemple: 26.11 @fr
scope note: Ovaj razred uključuje: - proizvodnju kablova od optičkih vlakana za prijenos podataka ili prijenos slike uživo Ovaj razred isključuje: - proizvodnju staklenih vlakana ili niti, vidi 23.14 - proizvodnju garnitura optičkih kablova ili sklopova s konektorima ili ostalim priključcima, vidi ovisno o uporabi, npr. 26.11
scope note: Į šią klasę įeina: - skaidulinės optikos kabelių duomenims ar tiesiogiai vaizdams perduoti gamyba Į šią klasę neįeina: - stiklo pluoštų ar gyslų gamyba, žr. 23.14 - optinių kabelių rinkinių arba sąrankų su jungtimis ar kitais priedais gamyba, žr. pagal taikymo sritį, pvz., 26.11 @lt
scope note: Bu sınıf aşağıdakileri kapsamaktadır; - veri veya görüntülerin canlı iletimi için fiber optik kablo imalatı. Kapsam dışı olanlar; - cam elyafı veya tellerinin imalatı, bkz. 23.14, - bağlantı parçası olan optik kablo setleri veya parçalarının imalatı, uygulamalara bağlı olarak bakınız, örn. 26.11. @tr
preferred label: Производство на кабели от оптични влакна @bg
preferred label: Výroba kabelů z optických vláken @cs
preferred label: Fremstilling af lyslederkabler @da
preferred label: Herstellung von Glasfaserkabeln @de
preferred label: Κατασκευή καλωδίων οπτικών ινών @el
preferred label: Fabricación de cables de fibra óptica @es
preferred label: Kiudoptilise kaabli tootmine @et
preferred label: Optisten kuitukaapelien valmistus @fi
preferred label: Fabrication de câbles de fibres optiques @fr
preferred label: Száloptikai kábel gyártása
preferred label: Fabbricazione di cavi a fibre ottiche @it
preferred label: Skaidulinės optikos kabelių gamyba @lt
preferred label: Optisko šķiedru kabeļu ražošana @lv
preferred label: Manifattura ta' kejbils tal-fibre optic @mt
preferred label: Vervaardiging van kabels van optische vezels @nl
preferred label: Produksjon av optiske fiberkabler @no
preferred label: Produkcja kabli światłowodowych @pl
preferred label: Fabricação de cabos de fibra óptica @pt
preferred label: Fabricarea de cabluri cu fibră optică @ro
preferred label: Производство волоконно-оптического кабеля @ru
preferred label: Výroba optických káblov @sk
preferred label: Proizvodnja kablov iz optičnih vlaken @sl
preferred label: Tillverkning av optiska fiberkablar @sv
preferred label: Fiber optik kabloların imalatı @tr
broader: Manufacture of wiring and wiring devices

Manufacture of other electronic and electric wires and cables
type: Concept
notation: 27.32
status: valid
status modified: 2013-10-18
accepted date: 2013-10-18
in scheme: Statistical Classification of Economic Activities in the European Community, Rev. 2 (2008)
scope note: - производство на изолирани проводници и кабели от стомана, мед, алумини - изтегляне на тел - 24.34, 24.41, 24.42, 24.43, 24.44, 24.45 - производство на кабели за компютри, печатащи устройства, кабели с универсална серийна шина (USB) и подобни комплекти от кабели - 26.11 - производство на електрически шнурове с изолирани проводници и съединители - 27.90 - производство на комплекти проводници за запалителни свещи и други комплекти проводници за превозни средства - 29.31 @bg
scope note: Z: - výrobu izolovaných elektrokabelů, vedení a drátů z oceli, mědi nebo hliníku N: - výrobu taženého drátu (24.34, 24.41, 24.42, 24.43, 24.44 a 24.45) - výrobu kabelů k počítačům, tiskárnám a USB kabelů a podobných svazků kabelů (26.11) - výrobu elektrických přívodních kabelů, a jiných svazků kabelů izolovaných, s přípojkami (27.90) - výrobu svazků kabelů nebo kabelových systémů pro motorová vozidla (29.31) @cs
scope note: Diese Klasse umfasst: - Herstellung von isolierten Elektrokabeln, -leitungen und -drähten aus Stahl, Kupfer oder Aluminium Diese Klasse umfasst nicht: - Herstellung von gezogenem Draht (s. 24.34, 24.41, 24.42, 24.43, 24.44 und 24.45) - Herstellung von Computer-, Drucker- und USB-Kabeln und ähnlichen Kabelsätzen (s. 26.11) - Herstellung von Elektrokabelsätzen, isoliert, mit Anschlüssen (s. 27.90) - Herstellung von Kabelbäumen und ähnlichen Kabelsätzen oder -zusammenstellungen für die Automobilindustrie (s. 29.31) @de
scope note: This class includes: - manufacture of insulated wire and cable, made of steel, copper, aluminium This class excludes: - manufacture (drawing) of wire, see 24.34, 24.41, 24.42, 24.43, 24.44, 24.45 - manufacture of computer cables, printer cables, USB cables and similar cable sets or assemblies, see 26.11 - manufacture of electrical cord sets with insulated wire and connectors, see 27.90 - manufacture of cable sets, wiring harnesses and similar cable sets or assemblies for automotive applications, see 29.31 @en
scope note: Esta clase comprende: - la fabricación de cables e hilos aislados realizados en acero, cobre, aluminio Esta clase no comprende: - el trefilado de cables, (véanse 24.34, 24.41, 24.42, 24.43, 24.44 y 24.45) - la fabricación de cables de ordenador, de impresora, USB y conjuntos de cables similares (véase 26.11) - la fabricación de cableado eléctrico con alambre aislado y conectores (véase 27.90) - la fabricación de juegos de cables, cableados preformados y conjuntos de cables similares para automóviles (véase 29.31) @es
scope note: Cette classe comprend: - la fabrication de fils et câbles isolés, en acier, cuivre, aluminium Cette classe ne comprend pas: - la fabrication du fil (tréfilage), voir 24.34, 24.41, 24.42, 24.43, 24.44 et 24.45 - la fabrication de câbles pour ordinateurs, pour imprimantes, USB et câbles similaires, voir 26.11 - la fabrication de jeux de fils électriques avec des fils isolés et des connecteurs, voir 27.90 - la fabrication de faisceaux et jeux de fils pour véhicules, voir 29.31 @fr
scope note: Ovaj razred uključuje: - proizvodnju izoliranih žica i kablova izrađenih od čelika, bakra, aluminija Ovaj razred isključuje: - proizvodnju (vučenje) žica, vidi 24.34, 24.41, 24.42, 24.43, 24.44 i 24.45 - proizvodnju računalnih kablova, kablova za printere, USB-kablova i sličnih kabelskih setova ili sklopova, vidi 26.11 - proizvodnju električnih kablova s izoliranim žicama i konektorima, vidi 27.90 - proizvodnju kabelskih setova, žičane opreme i sličnih kabelskih setova ili sklopova za primjenu u strojevima na vlastiti pogon, vidi 29.31
scope note: Į šią klasę neįeina: - stiklo pluoštų ar gyslų gamyba, žr. 23.14 - optinių kabelių rinkinių arba sąrankų su jungtimis ar kitais priedais gamyba, žr. pagal taikymo sritį, pvz., 26.11 Į šią klasę neįeina: - vielos gamyba (tempimas), žr. 24.34, 24.41, 24.42, 24.43, 24.44, 24.45 - kompiuterių kabelių, spausdintuvų kabelių, universaliųjų nuosekliųjų magistralių (USB) kabelių ir panašių kabelių rinkinių ar sąrankų gamyba, žr. 26.11 - elektros virvėlaidžių rinkinių su izoliuotais laidais ir jungtimis gamyba, žr. 27.90 - kabelių rinkinių, elektros laidų pynių ir panašių kabelių rinkinių arba sąrankų autotransporto priemonėms gamyba, žr. 29.31 @lt
scope note: Данный класс включает производство электрических ламп и прочих осветительных компонентов (за исключением стеклянного корпуса для электрических ламп), электроосветительных приборов и осветительного оборудования (за исключением токонесущих кабельных устройств). Этот класс включает: - производство флуоресцентных, ультрафиолетовых, инфракрасных и т.д. ламп накаливания - производство потолочных осветительных приборов - производство люстр - производство настольных ламп (в т.ч. осветительных приборов) - производство осветительных систем для новогодних елок - производство электрокаминов - производство ручных электрических фонарей - производство электроприборов для борьбы с насекомыми - производство ламп (например, карбидных, электрических, газовых, газолиновых) - производство прожекторов для подсветки, рамп - производство уличных осветительных приборов (за исключением светофоров) - производство осветительного оборудования для транспортировки (например, для автотранспортных средств, воздушных судов, лодок) Этот класс также включает: - производство неэлектрического осветительного оборудования Этот класс исключает: - производство плафонов для осветительных приборов, см. 23.19 - производство токонесущих приспособлений для осветительных приборов, см. 27.33 - производство потолочных вентиляторов в комплексе с осветительными приборами, см. 27.51 - производство электрического сигнального оборудования, такого как светофоры и пешеходные указатели, см. 27.90 - производство электрических указателей, см. 27.90 @ru
scope note: Bu sınıf aşağıdakileri kapsamaktadır; - çelik, bakır ve alüminyumdan yapılmış yalıtkan tellerin ve kabloların imalatı. Kapsam dışı olanlar; - tel imalatı (çekme), bkz. 24.34, 24.41, 24.42, 24.43, 24.44, 24.45, - bilgisayar kablolarının, yazıcı kablolarının, USB kablolarının ve benzer kablo setlerinin ya da parçalarının imalatı, bkz. 26.11, - yalıtkan telli ve bağlantı parçalı elektrik kablo setlerinin imalatı, bkz. 27.90, - motorlu araçlar için kablo setlerinin, kablo takımlarının ve benzer kablo setlerinin ya da parçalarının imalatı, bkz. 29.31. @tr
preferred label: Производство на други електрически и електронни проводници и кабели @bg
preferred label: Výroba ostatních elektronických a elektrických vodičů a kabelů @cs
preferred label: Fremstilling af andre elektroniske og elektriske ledninger og kabler @da
preferred label: Herstellung von sonstigen elektronischen und elektrischen Drähten und Kabeln @de
preferred label: Κατασκευή άλλων ηλεκτρονικών και ηλεκτρικών συρμάτων και καλωδίων @el
preferred label: Fabricación de otros hilos y cables electrónicos y eléctricos @es
preferred label: Muu elektroonika- ja elektrijuhtmete või -kaabli tootmine @et
preferred label: Muiden elektronisten ja sähköjohtojen sekä -kaapelien valmistus @fi
preferred label: Fabrication d'autres fils et câbles électroniques ou électriques @fr
preferred label: Egyéb elektronikus, villamos vezeték, kábel gyártása
preferred label: Fabbricazione di altri fili e cavi elettronici ed elettrici @it
preferred label: Kitų elektronikos bei elektros laidų ir kabelių gamyba @lt
preferred label: Citu elektronisko un elektrisko vadu un kabeļu ražošana @lv
preferred label: Manifattura ta' wajers u kejbils oħra elettroniċi u elettriċi @mt
preferred label: Vervaardiging van andere elektrische en elektronische kabels @nl
preferred label: Produksjon av andre elektroniske og elektriske ledninger og kabler @no
preferred label: Produkcja pozostałych elektronicznych i elektrycznych przewodów i kabli @pl
preferred label: Fabricação de outros fios e cabos eléctricos e electrónicos @pt
preferred label: Fabricarea altor fire şi cabluri electrice şi electronice @ro
preferred label: Производство прочих видов электропровода и кабеля @ru
preferred label: Výroba ostatných elektronických a elektrických drôtov a káblov @sk
preferred label: Proizvodnja drugih električnih kablov in žic @sl
preferred label: Tillverkning av andra elektroniska och elektriska ledningar och kablar @sv
preferred label: Diğer elektronik ve elektrik telleri ve kablolarının imalatı @tr
broader: Manufacture of wiring and wiring devices

Manufacture of wiring devices
type: Concept
notation: 27.33
status: valid
status modified: 2013-10-18
accepted date: 2013-10-18
in scheme: Statistical Classification of Economic Activities in the European Community, Rev. 2 (2008)
scope note: - производство на събирателни шини, електрически проводници (без тези за управление) - производство на защитни прекъсвачи, които се задействат при утечка между "фаза-земя" - производство на фасунги за лампи - производство на ограничители за силата на светлината - производство на превключватели за електрически вериги, като бутони, ключове с блокировка, бобини, въртящи се превключватели - производство на електрически щепселни съединения - производство на разклонителни кутии за електрическата мрежа (например конзоли за контакти, превключватели и други) - производство на пластмасови изолационни тръби и части за свързване - производство на предавателни пръти и линейни железарски изделия - производство на пластмасови нетоководещи части, вкл. разклонителни кутии и капачки за тях и подобни пластмасови присъединителни части към захранващата мрежа - производството на керамични изолатори - 23.43 - производство на съединители и прекъсвачи с електронни елементи - 26.11 @bg
scope note: Tato třída zahrnuje výrobu vodivého nebo nevodivého instalačního materiálu pro elektrické obvody, nezávisle na tom, z jakého materiálu se vyrábí. Z: - výrobu napájecích vozidlových kolejnic (trolejové sběrače), elektrických vodičů (kromě těch, co jsou určené pro rozvodná zařízení) - výrobu proudových chráničů (GFCI) - výrobu objímek žárovek - výrobu bleskojistek a cívek - výrobu spínačů tlačítkových, mřížkových instalačních, páčkových, elektromagnetů se spínačem pro elektrické obvody - výrobu elektrických zástrček nebo zásuvek - výrobu skříní pro instalaci elektrických obvodů (např. přípojky, rozvodné skříně, spínací skříně) - výrobu elektrických instalačních trubek a jejich spojek (potrubních vedení a tvarovek) - výrobu svorek (např. páskové svorky, krokodýlové svorky), páskových svorkovnic atd. - výrobu nevodivého instalačního materiálu z plastů včetně připojovacích skříní z plastů, čelních desek a podobných komponentů z plastů pro nadzemní vedení a kryty spínačů N: - výrobu keramických izolátorů (23.43) - výrobu elektronických součástek – typu konektorů, zásuvek a spínačů (26.11) @cs
scope note: Diese Klasse umfasst die Herstellung von stromführendem und von nichtstromführendem Installationsmaterial, unabhängig davon, aus welchem Material es hergestellt wird, für die Installation von elektrischen Stromkreisen. Diese Klasse umfasst: - Herstellung von Stromschienen, elektrischen Leitern (ohne solche für Schaltanlagen) - Herstellung von FI-Schutzschaltern - Herstellung von Lampenfassungen - Herstellung von Blitzschutzeinrichtungen und -spulen - Herstellung von Schaltern für Stromkreise (z. B. Druck-, Druckknopf-, Schnapp- und Kippschalter) - Herstellung von Steckdosen - Herstellung von Kästen für die Installation von Stromkreisen (z. B. Anschlusskästen, Verteilungskästen, Schaltkästen) - Herstellung von Isolierrohren und Rohrverbindungsstücken - Herstellung von Bauelementen aus Metall für Strommasten und -leitungen - Herstellung von nichtstromführendem Installationsmaterial aus Kunststoff einschließlich Anschlusskästen aus Kunststoff, Frontplatten u. Ä., Bauelemente aus Kunststoff für Überlandleitungen und Schalterabdeckungen Diese Klasse umfasst nicht: - Herstellung von Isolatoren aus keramischen Stoffen (s. 23.43) - Herstellung von elektronischen Anschlüssen, Steckdosen und Schaltern (s. 26.11) @de
scope note: This class includes the manufacture of current-carrying and non current-carrying wiring devices for electrical circuits regardless of material. This class includes: - manufacture of bus bars, electrical conductors (except switchgear-type) - manufacture of GFCI (ground fault circuit interrupters) - manufacture of lamp holders - manufacture of lightning arrestors and coils - manufacture of switches for electrical wiring (e.g. pressure, pushbutton, snap, tumbler switches) - manufacture of electrical outlets or sockets - manufacture of boxes for electrical wiring (e.g. junction, outlet, switch boxes) - manufacture of electrical conduit and fitting - manufacture of transmission pole and line hardware - manufacture of plastic non current carrying wiring devices including plastic junction boxes, face plates and similar, plastic pole line fittings and switch covers This class excludes: - manufacture of ceramic insulators, see 23.43 - manufacture of electronic component-type connectors, sockets, and switches, see 26.11 @en
scope note: Esta clase comprende la fabricación de dispositivos de cableado portador o no de corriente para circuitos eléctricos, con independencia del material. Esta clase comprende: - la fabricación de barras colectoras, conductores eléctricos (excepto del tipo conmutador) - la fabricación de interruptores del circuito por falta de conexión a tierra (GFCI) - la fabricación de portalámparas - la fabricación de pararrayos - la fabricación de conmutadores para cableado eléctrico (p. ej., conmutadores de presión, pulsadores, interruptores de acción rápida, interruptores basculantes) - la fabricación de enchufes hembra - la fabricación de cajas para cableado eléctrico (p. ej., de empalme, zócalos, de seccionamiento) - la fabricación de canalizaciones eléctricas y sus accesorios - la fabricación de equipos para postes y líneas de transmisión - la fabricación de dispositivos de cableado de plástico no portadores de corriente, incluidas cajas de empalme, paneles frontales y elementos similares de plástico, accesorios de plástico para postes eléctricos y cubreinterruptores de plástico Esta clase no comprende: - la fabricación de aisladores de cerámica (véase 23.43) - la fabricación de conectores, enchufes hembra y conmutadores considerados componentes electrónicos (véase 26.11) @es
scope note: Cette classe comprend la fabrication de dispositifs de câblage porteurs et non porteurs de courant pour le câblage d’installations électriques, quel que soit le matériau utilisé. Cette classe comprend: - la fabrication de barres bus, de conducteurs électriques (sauf de type commutateurs) - la fabrication de disjoncteurs différentiels - la fabrication de douilles pour lampes - la fabrication de coupe-circuits et de bobines - la fabrication d’interrupteurs pour câblages électriques (tels que interrupteurs à poussoir, à bouton poussoir, à bascule, etc.) - la fabrication de prises de courant - la fabrication de boîtiers pour les câblages électriques (par exemple: jonctions, prises de courant, interrupteurs) - la fabrication de canalisations et accessoires électriques - la fabrication de quincaillerie de ligne électrique suspendue - la fabrication de dispositifs de câblage non porteurs de courant fait de plastique, boîtes de connexion, plaques, raccords de lignes de poteaux Cette classe ne comprend pas: - la fabrication d’isolateurs en céramique, voir 23.43 - la fabrication de connecteurs, de prises et d’interrupteurs de type composants électroniques, voir 26.11 @fr
scope note: Ovaj razred uključuje proizvodnju strujnih i nestrujnih žičanih uređaja za električne strujne krugove neovisno o vrsti materijala. Ovaj razred uključuje: - proizvodnju sabirnih šipki i električnih vodiča (osim vrsta podesivača prekidača) - proizvodnju GFCI (prekidača za upravljanje prekidima strujnoga kruga) - proizvodnju držača za svjetiljke - proizvodnju osigurača i zavojnica za rasvjetu - proizvodnju prekidača za električne instalacije (npr. tlaka, tipke za pokretanje mehanizma, zavojnica, prebacivača) - proizvodnju električnih izlaza i utičnica - proizvodnju kutija za električne žice (npr. spojnica, izlaza, preklopnih kutija) - proizvodnju električnih vodova i pribora - proizvodnju transmisijskih stupova i linijskih sklopova - proizvodnju plastičnih nestrujnih žičanih uređaja, uključujući plastične spojačke kutije, površinske ploče i sličnu plastičnu instalacijsku opremu Ovaj razred isključuje: - proizvodnju keramičkih izolatora, vidi 23.43 - proizvodnju elektroničkih komponenata kao što su konektori, utičnice i prekidači, vidi 26.11
scope note: Į šią klasę įeina elektrai laidžių ar nelaidžių elektros instaliacijos įtaisų, nežiūrint kokia jų medžiaga, elektrinėms grandinėms montuoti, gamyba. Į šią klasę įeina: - elektrinių šinų, elektros laidininkų (išskyrus skirstomųjų įrenginių tipo) gamyba - įžemėjimo grandinių pertraukiklių gamyba - lempų laikiklių gamyba - žaibo iškroviklių ir ričių gamyba - elektros instaliacijos jungiklių (pvz., membraninių, mygtukinių, akimirkinių jungiklių ir perjungiklių) gamyba - kištukinių arba šakutės lizdų gamyba - elektros instaliacijos dėžučių (pvz., jungiamųjų, kištukinių lizdų, jungiklių dėžučių) gamyba - elektros apsauginių vamzdžių ir jungiamųjų detalių gamyba - elektros perdavimo stulpų ir linijų metalinių tvirtinimo detalių gamyba - plastikinių elektrai nelaidžių elektros instaliacijos įtaisų, įskaitant plastikines jungiamąsias dėžutes, skydelius ir panašius gaminius, plastikinių stulpų linijų jungiamų detalių ir jungiklių dangtelių gamyba Į šią klasę neįeina: - keraminių izoliatorių gamyba, žr. 23.43 - elektroninių komponentų tipo jungčių, lizdų ir jungiklių gamyba, žr. 26.11 @lt
scope note: Данная группа включает производство небольших электроприборов и электроприборов бытового назначения, бытовых вентиляторов, пылесосов, полировальных машин, кухонных приборов, прачечного оборудования, холодильников, морозильных камер и прочих электрических и не электрических бытовых приборов, таких как посудомоечные машины, водонагреватели и распределители отходов. Данная группа включает производство приборов, работающих от электросети, а также газовых или с использованием прочих видов топлива. @ru
scope note: Bu sınıf, materyaline bakılmaksızın elektrik devreleri için akım taşısın ya da taşımasın kablolamada kullanılan gereçlerin imalatını kapsamaktadır.Bu sınıf aşağıdakileri kapsamaktadır; - tevzi çubuklarının, elektrik iletkenlerinin (elektrik bağlantı düzeneği (şalt cihazı) tipinde olanlar hariç) imalatı, - topraklı arıza devre kesicileri (GFCI) imalatı, - lamba duylarının imalatı, - paratoner ve bobin imalatı, - elektrik tesisatları için anahtarların imalatı (örn. baskılı, düğmeli, çıtçıtlı, mandallı şalterler (anahtarlar)), - elektrik fişlerinin ve prizlerin imalatı, - elektrik tesisatında kullanılan kutuların (örn. bağlantı yeri, elektrik prizi ve panolar için olanlar) imalatı, - elektrik tellerinin tesisatında kullanılan boruların, kanalların ve bağlantı parçalarının imalatı, - iletim direkleri ve hatlarının donanımlarının imaları, - akım taşımayan kablolamada kullanılan plastik gereçlerin imalatı (plastik bağlantı kutuları, siperler ve benzerleri, plastik direk hatlarının bağlantı parçaları ve anahtar kapakları da dahil). Kapsam dışı olanlar; - seramik yalıtım malzemelerinin (izolatör) imalatı, bkz. 23.43, - elektronik parça tipindeki iletkenler, prizler, duylar ve anahtarların imalatı, bkz. 26.11. @tr
preferred label: Производство на електроинсталационни изделия @bg
preferred label: Výroba elektroinstalačních zařízení @cs
preferred label: Fremstilling af tilbehør til ledninger og kabler @da
preferred label: Herstellung von elektrischem Installationsmaterial @de
preferred label: Κατασκευή εξαρτημάτων καλωδίωσης @el
preferred label: Fabricación de dispositivos de cableado @es
preferred label: Juhtmestiku tarvikute tootmine @et
preferred label: Kytkentälaitteiden valmistus @fi
preferred label: Fabrication de matériel d'installation électrique @fr
preferred label: Huzalozott eszköz gyártása
preferred label: Fabbricazione di attrezzature per cablaggio @it
preferred label: Instaliacijos įtaisų gamyba @lt
preferred label: Elektroinstalāciju savienotājelementu ražošana @lv
preferred label: Manifattura ta' għodod għall-wajers @mt
preferred label: Vervaardiging van schakelaars, stekkers, stopcontacten e.d. @nl
preferred label: Produksjon av ledningsmateriell @no
preferred label: Produkcja sprzętu instalacyjnego @pl
preferred label: Fabricação de acessórios para fios e cabos @pt
preferred label: Fabricarea dispozitivelor de conexiune pentru fire şi cabluri electrice şi electronice @ro
preferred label: Производство электроприборов @ru
preferred label: Výroba elektroinštalačných zariadení @sk
preferred label: Proizvodnja vtičnic, stikal in drugih naprav za ožičenje @sl
preferred label: Tillverkning av kabeltillbehör @sv
preferred label: Kablolamada kullanılan gereçlerin imalatı @tr
broader: Manufacture of wiring and wiring devices

Manufacture of electric lighting equipment
type: Concept
notation: 27.4
status: valid
status modified: 2013-10-18
accepted date: 2013-10-18
in scheme: Statistical Classification of Economic Activities in the European Community, Rev. 2 (2008)
scope note: Этот класс включает: - производство электробытовых приборов: • холодильников • морозильных камер • посудомоечных машин • стиральных и сушильных машин • пылесосов • полотеров • разгрузочных устройств для отходов • измельчителей, блендеров, соковыжималок • открывалок для банок/консервных ножей • электробритв, электрических зубных щеток и прочих электроприборов, предназначенных для персонального ухода • точилок для ножей • вытяжных шкафов - производство бытовых электронагревательных приборов: • электрических водонагревателей • электрических одеял • фенов, расчесок, щеток, плоек • электрических утюгов • переносных электрообогревателей • электропечей • микроволновых печей • электрических плит и жарочных шкафов • тостеров • кофеварок и электрочайников • электросковород, жаровен, грилей, скороварок • электронагревателей и т.д. Этот класс исключает: - производство комнатных кондиционеров, вентиляторов, нагревателей постоянной отопительной системы, промышленных вытяжных вентиляторов, промышленного кухонного оборудования; оборудования для прачечных, оборудования для сухой чистки и выжимания; промышленных пылесосов и т.д., см. раздел 28 - производство бытовых швейных машин, см. 28.94 - установку центральной вытяжной системы, 43.29 @ru
preferred label: Производство на лампи и осветители @bg
preferred label: Výroba elektrických osvětlovacích zařízení @cs
preferred label: Fremstilling af elektriske belysningsartikler @da
preferred label: Herstellung von elektrischen Lampen und Leuchten @de
preferred label: Κατασκευή ηλεκτρολογικού φωτιστικού εξοπλισμού @el
preferred label: Fabricación de lámparas y aparatos eléctricos de iluminación @es
preferred label: Elektriliste valgustusseadmete tootmine @et
preferred label: Sähkölamppujen ja valaisimien valmistus @fi
preferred label: Fabrication d'appareils d'éclairage électrique @fr
preferred label: Villamos világítóeszköz gyártása
preferred label: Fabbricazione di apparecchiature per illuminazione @it
preferred label: Elektros apšvietimo įrangos gamyba @lt
preferred label: Apgaismes ierīču ražošana @lv
preferred label: Manifattura ta' tagħmir tad-dawl elettriku @mt
preferred label: Vervaardiging van elektrische verlichtingsbenodigdheden @nl
preferred label: Produksjon av belysningsutstyr @no
preferred label: Produkcja elektrycznego sprzętu oświetleniowego @pl
preferred label: Fabricação de lâmpadas eléctricas e de outro material de iluminação @pt
preferred label: Fabricarea de echipamente electrice de iluminat @ro
preferred label: Производство электроосветительного оборудования @ru
preferred label: Výroba elektrických svietidiel @sk
preferred label: Proizvodnja naprav in opreme za razsvetljavo @sl
preferred label: Tillverkning av belysningsarmatur @sv
preferred label: Elektrikli aydınlatma ekipmanlarının imalatı @tr
broader: Manufacture of electrical equipment
narrower: Manufacture of electric lighting equipment

Manufacture of electric lighting equipment
type: Concept
notation: 27.40
status: valid
status modified: 2013-10-18
accepted date: 2013-10-18
in scheme: Statistical Classification of Economic Activities in the European Community, Rev. 2 (2008)
scope note: Производство на електрически лампи с нажажаеми жички и тръби, части и принадлежности за тях (без отворените стъклени колби); електрически осветители и прикрепящите им детайли (без токопреносните устройства). - производство на лампи: газоразрядни, с нажажаема жичка, луминесцентни, с ултравиолетови или инфрачервени лъчи и други лампи - производство на приспособления за прикрепяне на осветители към тавана - производство на полилеи - производство на настолни лампи - производство на електрически гирлянди - производство на осветители имитиращи жив огън - производство на преносими фенерчета (с батерии) - производство на електрически лампи срещу насекоми - производство на фенери (например карбидни лампи, електрически, на газ, газьол или керосин) - производство на прожектори - производство на осветители за улично осветление (без светофари) - производство на осветители за превозни средства (например за автомобили, плавателни и въздухоплавателни средства) - производство на нелектрически осветители - производство на стъклария и стъклени части за осветители - 23.19 - производство на токопреносни кабелни устройства за осветители - 27.33 - производство на вентилатори за таван или баня, вградени в осветители - 27.51 - производство на електрическа апаратура за сигнализация като светофари и апаратура за сигнализиране на пешеходците - 27.90 - производство на светлинни надписи - 27.90 @bg
scope note: Tato třída zahrnuje výrobu žárovek a zářivek, jejich dílů a komponentů (kromě skleněných polotovarů pro žárovky), výrobu svítidel a jejich dílů a komponentů (kromě vodivého elektrického instalačního materiálu). Z: - výrobu výbojkových, vakuových, fluorescenčních, ultrafialových, infračervených a podobných lamp, svítidel a žárovek - výrobu stropních a nástěnných svítidel - výrobu lustrů - výrobu stolních lamp (tj. svítidel) - výrobu osvětlení na vánoční stromky - výrobu elektrických krbových plamenů - výrobu bleskových světel - výrobu elektrických lamp proti hmyzu - výrobu luceren (např. karbidových, elektrických, plynových, benzinových, petrolejových) - výrobu reflektorů - výrobu pouličního osvětlení (kromě dopravních semaforů) - výrobu osvětlovacích zařízení pro dopravní prostředky (např. pro automobily, letadla, lodě) ZT: - výrobu neelektrických osvětlovacích zařízení N: - výrobu skleněných výrobků a skleněných dílů pro svítidla (23.19) - výrobu vodivého instalačního materiálu pro svítidla (27.33) - výrobu stropních a koupelnových ventilátorů se zabudovanými svítidly (27.51) - výrobu elektrických signalizačních zařízení jako semaforů a signalizačních zařízení pro chodce (27.90) - výrobu elektrických signalizátorů (27.90) @cs
scope note: Diese Klasse umfasst die Herstellung von Glühlampen und Leuchtröhren und Teilen davon (ohne Glasrohlinge für Glühlampen) sowie die Herstellung von Beleuchtungskörpern und Teilen davon (ohne stromführendes elektrisches Installationsmaterial). Diese Klasse umfasst: - Herstellung von Entladungslampen, Glühlampen, Leuchtstofflampen, Ultraviolettlampen, Infrarotlampen und anderen Lampen und Beleuchtungskörpern - Herstellung von Decken- und Wandleuchten - Herstellung von Kronleuchter - Herstellung von Tischlampen - Herstellung von Weihnachtsbaum-Lichterketten - Herstellung von Elektrokaminen - Herstellung von Blitzlichtgeräten - Herstellung von elektrischen Insektenlampen - Herstellung von Laternen (z. B. Karbid-, Gas-, Benzin-, Petroleum- und elektrische Laternen) - Herstellung von Scheinwerfern - Herstellung von Straßenbeleuchtung (ohne Verkehrsampeln) - Herstellung von Fahrzeugbeleuchtungen (z. B. für Kraftfahrzeuge, Flugzeuge, Schiffe) Diese Klasse umfasst ferner: - Herstellung von nichtelektrischen Lampen und Leuchten Diese Klasse umfasst nicht: - Herstellung von Glaswaren und Teilen aus Glas für Lampen und Leuchten (s. 23.19) - Herstellung von stromführendem Installationsmaterial für Beleuchtungskörper (s. 27.33) - Herstellung von Decken- oder Badezimmerventilatoren mit integrierten Beleuchtungskörpern (s. 27.51) - Herstellung von elektrischen Signaleinrichtungen wie Verkehrsampeln und Signaleinrichtungen für Fußgänger (s. 27.90) - Herstellung von elektrischen Zeichen und Schildern (s. 27.90) @de
scope note: This class includes the manufacture of electric light bulbs and tubes and parts and components thereof (except glass blanks for electric light bulbs), electric lighting fixtures and lighting fixture components (except current-carrying wiring devices). This class includes: - manufacture of discharge, incandescent, fluorescent, ultra-violet, infra-red etc. lamps, fixtures and bulbs - manufacture of ceiling lighting fixtures - manufacture of chandeliers - manufacture of table lamps (i.e. lighting fixture) - manufacture of Christmas tree lighting sets - manufacture of electric fireplace logs - manufacture of flashlights - manufacture of electric insect lamps - manufacture of lanterns (e.g. carbide, electric, gas, gasoline, kerosene) - manufacture of spotlights - manufacture of street lighting fixtures (except traffic signals) - manufacture of lighting equipment for transportation equipment (e.g. for motor vehicles, aircraft, boats) This class also includes: - manufacture of non-electrical lighting equipment This class excludes: - manufacture of glassware and glass parts for lighting fixtures, see 23.19 - manufacture of current-carrying wiring devices for lighting fixtures, see 27.33 - manufacture of ceiling fans or bath fans with integrated lighting fixtures, see 27.51 - manufacture of electrical signalling equipment such as traffic lights and pedestrian signalling equipment, see 27.90 - manufacture of electrical signs, see 27.90 @en
scope note: Esta clase comprende la fabricación de bombillas y tubos de iluminación eléctricos, y de sus partes y componentes (excepto ampollas y envolturas de vidrio para bombillas eléctricas); aparatos de iluminación eléctrica y sus componentes (excepto dispositivos de cableado portador de corriente). Esta clase comprende: - la fabricación de lámparas, aparatos y bombillas de descarga, incandescentes, fluorescentes, ultravioletas, infrarrojos, etc. - la fabricación de lámparas de techo - la fabricación de lámparas de mesa - la fabricación de juegos de luces para árboles de Navidad - la fabricación de troncos de chimenea eléctricos - la fabricación de linternas - la fabricación de lámparas eléctricas contra insectos - la fabricación de faroles (p. ej., de carburo, eléctricos, de gas, de gasolina, de queroseno) - la fabricación de focos - la fabricación de equipos de alumbrado para vías públicas (excepto señales de tráfico) - la fabricación de dispositivos de iluminación para equipos de transporte (p. ej., para vehículos de motor, aeronaves, embarcaciones) Esta clase comprende también: - la fabricación de equipos de iluminación no eléctricos Esta clase no comprende: - la fabricación de artículos y piezas de vidrio para aparatos de iluminación (véase 23.19) - la fabricación de dispositivos de cableado portador de corriente para aparatos de iluminación (véase 27.33) - la fabricación de ventiladores de techo o de baño con dispositivos de iluminación integrados (véase 27.51) - la fabricación de equipos de señalización eléctricos como los semáforos y los dispositivos de señalización para peatones (véase 27.90) - la fabricación de rótulos luminosos (véase 27.90) @es
scope note: Cette classe comprend la fabrication d’ampoules et de tubes électriques, et de leurs pièces (à l’exception des ébauches de verre pour ampoules électriques), la fabrication d’appareils d’éclairage ainsi que de lampes de table et de lampadaires (à l’exception des dispositifs de câblage porteurs et non porteurs de courant). Cette classe comprend: - la fabrication de lampes à décharge, à incandescence, à fluorescence, à ultraviolet, à infrarouge, etc., leurs ampoules et accessoires - la fabrication de plafonniers - la fabrication de chandeliers - la fabrication de lampes de table (dispositifs d’éclairage) - la fabrication d’ornements électriques pour arbres de Noël - la fabrication de dispositifs lumineux décoratifs pour foyers - la fabrication d’appareils et de dispositifs pour la production de la lumière-éclair - la fabrication de lampes anti-insectes - la fabrication de lanternes (au carbure, électriques, au gaz, à l’essence, au kérosène, etc.) - la fabrication de projecteurs - la fabrication d’appareils d’éclairage de rue (à l’exception des feux de signalisation) - la fabrication d’appareils d’éclairage pour le matériel de transport (véhicules à moteur, avions, navires, etc.) Cette classe comprend également: - la fabrication de matériel d’éclairage non électrique Cette classe ne comprend pas: - la fabrication de verre et d’éléments en verre pour les appareils d’éclairage, voir 23.19 - la fabrication de dispositifs de câblage porteurs de courant pour les appareils d’éclairage, voir 27.33 - la fabrication de plafonniers ventilateurs ou de ventilateurs de salles de bain avec éclairage intégré, voir 27.51 - la fabrication d’appareils électriques de signalisation, tels que les feux de signalisation et les équipements de signalisation pour piétons, voir 27.90 - la fabrication de signaux électriques, voir 27.90 @fr
scope note: Ovaj razred uključuje proizvodnju električnih žarulja i cijevi te njihovih dijelova i komponenata (osim stakla za električne žarulje); električnih učvršćivača (osim za vozila), električne rasvjetne opreme, i rasvjetnih komponenata za ugradnju (osim strujnih žičanih uređaja). Ovaj razred uključuje: - proizvodnju svjetiljki, pribora i žarulja s pražnjenjem, žarnom niti, fluorescentnih, ultraljubičastih, infracrvenih itd. - proizvodnju plafonijera - proizvodnju lustera - proizvodnju stolnih lampi (tj. svjetiljaki) - proizvodnju rasvjetne opreme koja se koristi za božićna drvca - proizvodnju električnih kamina - proizvodnju baterijskih ručnih svjetiljki - proizvodnju električnih svjetiljki za hvatanje insekata - proizvodnju lanterni (npr. karbidnih, električnih, plinskih, gazolinskih, kerozinskih) - proizvodnju reflektora (osim za vozila) - proizvodnju ulične rasvjete (osim prometne signalizacije) - proizvodnju svjetlosne opreme kao dijela transportne opreme (npr. za motorna vozila i zrakoplove) Ovaj razred također uključuje: - proizvodnju neelektrične rasvjetne opreme Ovaj razred isključuje: - proizvodnju staklenog posuđa i staklenih dijelova za svjetiljke, vidi 23.19 - proizvodnju strujnih žičanih uređaja za rasvjetne instalacije, vidi 27.33 - proizvodnju stropnih ventilatora ili kupaonskih ventilatora sa svjetlosnim uređajima, vidi 27.51 - proizvodnju električne signalne opreme kao što je prometna i pješačka signalizacija, vidi 27.90 - proizvodnju električnih reklama, vidi 27.90
scope note: Į šią klasę įeina elektros kaitinamųjų lempų ir vamzdelių, jų dalių ir komponentų (išskyrus elektros lempų stiklo ruošinius) gamyba; elektrinių šviestuvų ir jų komponentų (išskyrus elektrai laidžius instaliacijos įtaisus) gamyba. Į šią klasę įeina: - dujų išlydžio, kaitinamųjų, liuminescencinių, ultravioletinių, infraraudonųjų ir kitokių elektros lempų, šviestuvų ir lempučių gamyba - palubinių šviestuvų gamyba - sietynų gamyba - stalinių lempų (t.y. šviestuvų) gamyba - Kalėdų eglučių apšvietimo rinkinių gamyba - elektrinių židinių rąstų gamyba - žibintuvėlių gamyba - elektrinių vabzdžių naikinimo ir atbaidymo lempų gamyba - nešiojamųjų žibintuvų (karbidinių, elektrinių, dujinių, benzininių, žibalinių) gamyba - prožektorių gamyba - kelių ir gatvių šviestuvų (išskyrus eismo reguliavimo signalus) gamyba - transporto priemonių (variklinių transporto priemonių, orlaivių, laivų) apšvietimo įrangos gamyba Į šią klasę taip pat įeina: - neelektrinės apšvietimo įrangos gamyba Į šią klasę neįeina: - stiklo gaminių ir šviestuvų stiklinių dalių gamyba, žr. 23.19 - šviestuvų elektrai laidžių instaliacijos įtaisų, gamyba, žr. 27.33 - palubinių ar vonios ventiliatorių su įmontuotais šviestuvais gamyba, žr. 27.51 - elektrinės signalizavimo įrangos, tokios kaip šviesoforai ir pėsčiųjų signalizavimo įranga, gamyba, žr. 27.90 - elektrinių ženklų ir iškabų gamyba, žr. 27.90 @lt
scope note: Этот класс включает: - производство бытового кухонного не электрического оборудования и обогревателей: • не электрических нагревателей, приспособлений для приготовления еды, сеток, плит, нагревателей для воды, кухонных приборов, подставок для тарелок @ru
scope note: Bu sınıf, elektrikli aydınlatma ampulleri ve tüpleri ile bunların parçaları ve bileşenlerinin (elektrikli aydınlatma ampulleri için camlar hariç), lamba donanımları ile bunların bileşenlerinin (akım taşıyan kablolamada kullanılan gereçler hariç) imalatını kapsamaktadır.Bu sınıf aşağıdakileri kapsamaktadır; - deşarj lambası, elektrikli filaman lambası, floresan, ultra-viole, enfraruj (kızılötesi) vb. lambalar, lamba donanımları ve ampullerin imalatı, - tavan aydınlatma donanımlarının imalatı, - avizelerin (şamdanlar) imalatı, - masa lambalarının imalatı (abajur dahil), - yılbaşı ağacı ışıklandırma setlerinin imalatı, - elektrikli şömine kütüğü imalatı, - el feneri imalatı, - elektrikli haşere lambalarının imalatı, - fener imalatı (örn. karpit, elektrik, gaz, gazolin, gaz yağı ile çalışan), - spot lambaları imalatı, - sokak aydınlatma donanımları imalatı, (trafik ışıkları hariç), - ulaştırma araçları için aydınlatma donanımları imalatı (örn. motorlu taşıtlar, uçaklar, tekneler için). Ayrıca bu sınıf aşağıdakileri de kapsamaktadır; - elektriksiz aydınlatma donanımlarının imalatı. Kapsam dışı olanlar; - zücaciye ve aydınlatma donanımları için cam parçaları imalatı, bkz. 23.19, - aydınlatma donanımları için akım taşıyan kablolamada kullanılan gereçlerin imalatı, bkz. 27.33, - aydınlatma donanımlı tavan veya banyo vantilatörleri imalatı, bkz. 27.51, - elektrikli sinyal donanımları imalatı (trafik ışıkları ve yayalar için sinyal donanımları dahil), bkz. 27.90, - elektrikli işaretlerin imalatı, bkz. 27.90. @tr
preferred label: Производство на лампи и осветители @bg
preferred label: Výroba elektrických osvětlovacích zařízení @cs
preferred label: Fremstilling af elektriske belysningsartikler @da
preferred label: Herstellung von elektrischen Lampen und Leuchten @de
preferred label: Κατασκευή ηλεκτρολογικού φωτιστικού εξοπλισμού @el
preferred label: Fabricación de lámparas y aparatos eléctricos de iluminación @es
preferred label: Elektriliste valgustusseadmete tootmine @et
preferred label: Sähkölamppujen ja valaisimien valmistus @fi
preferred label: Fabrication d'appareils d'éclairage électrique @fr
preferred label: Villamos világítóeszköz gyártása
preferred label: Fabbricazione di apparecchiature per illuminazione @it
preferred label: Elektros apšvietimo įrangos gamyba @lt
preferred label: Apgaismes ierīču ražošana @lv
preferred label: Manifattura ta' tagħmir tad-dawl elettriku @mt
preferred label: Vervaardiging van elektrische verlichtingsbenodigdheden @nl
preferred label: Produksjon av belysningsutstyr @no
preferred label: Produkcja elektrycznego sprzętu oświetleniowego @pl
preferred label: Fabricação de lâmpadas eléctricas e de outro material de iluminação @pt
preferred label: Fabricarea de echipamente electrice de iluminat @ro
preferred label: Производство электроосветительного оборудования @ru
preferred label: Výroba elektrických svietidiel @sk
preferred label: Proizvodnja naprav in opreme za razsvetljavo @sl
preferred label: Tillverkning av belysningsarmatur @sv
preferred label: Elektrikli aydınlatma ekipmanlarının imalatı @tr
broader: Manufacture of electric lighting equipment

Manufacture of domestic appliances
type: Concept
notation: 27.5
status: valid
status modified: 2013-10-18
accepted date: 2013-10-18
in scheme: Statistical Classification of Economic Activities in the European Community, Rev. 2 (2008)
scope note: производство на малки кухненски уреди и битови електроуреди като вентилатори, прахосмукачки, подочистачни машини, готварски уреди, перални, хладилници, замразители (вертикални или ракли) и други електрически или неелектрически битови уреди като съдомиялни машини, бойлери, самобръсначки. Битовите уреди, включени в тази група, могат да бъдат електрически, на газ или на друго гориво. @bg
scope note: Tato skupina zahrnuje výrobu malých spotřebičů a podobných výrobků určených převážně pro domácnost, např. ventilátorů, vysavačů, elektrických strojů na ošetřování podlah, kuchyňských spotřebičů, praček, sušiček prádla, chladniček, mrazniček a chladicích boxů, myček nádobí, ohřívačů vody, drtičů odpadu a ostatních elektrických a neelektrických spotřebičů určených převážně pro domácnost.Tato skupina zahrnuje výrobu přístrojů poháněných elektřinou, plynem nebo jiným zdrojem energie. @cs
scope note: Diese Gruppe umfasst die Herstellung von elektrischen Klein- und Haushaltsgeräten, Haushaltsventilatoren, Haushaltsstaubsaugern, elektrischen Bodenpflegemaschinen für den Haushalt, Haushaltskochgeräten, Wäschepflegegeräten für den Haushalt, Haushaltskühlschränken, Gefrierschränken und Kühltruhen und sonstigen elektrischen oder nichtelektrischen Haushaltsgeräten wie Geschirrspülmaschinen, Warmwasserbereiter und Mülltrennsysteme. Diese Gruppe umfasst die Herstellung von Geräten, die mit Strom, Gas oder durch eine andere Energiequelle betrieben werden. @de
scope note: This group includes the manufacture of small electric appliances and electric housewares, household-type fans, household-type vacuum cleaners, electric household-type floor care machines, household-type cooking appliances, household-type laundry equipment, household-type refrigerators, upright and chest freezers, and other electrical and non-electrical household appliances, such as dishwashers, water heaters, and garbage disposal units. This group includes the manufacture of appliances with electric, gas or other fuel sources. @en
scope note: Este grupo comprende la fabricación de pequeños aparatos y utensilios domésticos eléctricos, ventiladores, aspiradoras, dispositivos eléctricos para el cuidado de suelos, aparatos de cocina, lavadoras y secadoras eléctricas, frigoríficos, congeladores verticales y arcones de tipo doméstico, y otros aparatos domésticos eléctricos y no eléctricos, como lavavajillas, calentadores de agua y trituradores de basura. En este grupo se incluye la fabricación de aparatos eléctricos, de gas o de otros combustibles. @es
scope note: Ce groupe comprend la fabrication de petits appareils électroménagers, de ventilateurs de type ménager, d’aspirateurs de ménage, de cireuses électriques, de chauffe-plats domestiques, de machines de blanchisserie, de réfrigérateurs de ménage, de congélateurs verticaux et de congélateurs bahuts, ainsi que d’autres appareils ménagers électriques ou non, tels que machines à laver la vaisselle, chauffe-eau et broyeurs pour déchets. Ce groupe comprend la fabrication d’appareils fonctionnant à l’électricité, au gaz ou avec d’autres sources d’énergie. @fr
scope note: Ova skupina uključuje proizvodnju malih električnih aparata i električnih uređaja, ventilatora za domaćinstva, usisavača za kućanstva, električnih uređaja za čišćenje podova, uređaja za kuhanje, perilica rublja, hladnjaka za kućanstva, zamrzivača i ostalih električnih i neelektričnih uređaja za kućanstva kao što su perilice posuđa, električni grijači vode i uređaji za zbrinjavanje otpada. Ova skupina uključuje proizvodnju uređaja koja se kao pogonskim gorivom koriste strujom, plinom i sl.
scope note: Į šią grupę įeina mažų elektrinių prietaisų ir elektrinių namų apyvokos reikmenų, buitinių ventiliatorių, buitinių dulkių siurblių, buitinių elektrinių grindų valymo mašinų, buitinių maisto ruošimo prietaisų, buitinės skalbimo įrangos, buitinių šaldytuvų, spintinių ir dėžinių šaldiklių bei kitų elektrinių ir neelektrinių buitinių prietaisų, tokių kaip indaplovės, vandens šildytuvai, atliekų šalintuvai, gamyba. Ši grupė apima prietaisų su elektra, dujomis arba kitokiais kuro šaltiniais, gamybą. @lt
scope note: Bu grup, elektrikli küçük ev aletleri, elektrikli mutfak eşyaları, ev tipi vantilatörler, ev tipi süpürgeler, ev tipi elektrikli yer bakım makineleri, ev tipi yemek pişirme gereçleri, ev tipi çamaşır makineleri, ev tipi buzdolapları, duvar tipi ve üstten kapaklı sandık tipi dondurucular ile bulaşık makineleri, su ısıtıcıları ve çöp öğütücü birimleri gibi diğer elektrikli ya da elektriksiz ev aletleri imalatını kapsamaktadır. Bu grup, elektrik, gaz ya da diğer yakıt türleri ile çalışan aletlerin imalatını da kapsamaktadır. @tr
preferred label: Производство на битови уреди @bg
preferred label: Výroba spotřebičů převážně pro domácnost @cs
preferred label: Fremstilling af husholdningsapparater @da
preferred label: Herstellung von Haushaltsgeräten @de
preferred label: Κατασκευή οικιακών συσκευών @el
preferred label: Fabricación de aparatos domésticos @es
preferred label: Kodumasinate tootmine @et
preferred label: Kodinkoneiden valmistus @fi
preferred label: Fabrication d'appareils ménagers @fr
preferred label: Háztartási készülék gyártása
preferred label: Fabbricazione di apparecchi per uso domestico @it
preferred label: Buitinių aparatų ir prietaisų gamyba @lt
preferred label: Sadzīves aparatūras un iekārtu ražošana @lv
preferred label: Manifattura ta' apparat domestiku @mt
preferred label: Vervaardiging van huishoudapparaten @nl
preferred label: Produksjon av husholdningsmaskiner og -apparater @no
preferred label: Produkcja sprzętu gospodarstwa domowego @pl
preferred label: Fabricação de aparelhos para uso doméstico @pt
preferred label: Fabricarea de echipamente casnice @ro
preferred label: Производство бытовых приборов @ru
preferred label: Výroba zariadení pre domácnosti @sk
preferred label: Proizvodnja gospodinjskih naprav @sl
preferred label: Tillverkning av hushållsmaskiner och hushållsapparater @sv
preferred label: Ev aletleri imalatı @tr
broader: Manufacture of electrical equipment
narrower: Manufacture of electric domestic appliances
narrower: Manufacture of non-electric domestic appliances

Manufacture of electric domestic appliances
type: Concept
notation: 27.51
status: valid
status modified: 2013-10-18
accepted date: 2013-10-18
in scheme: Statistical Classification of Economic Activities in the European Community, Rev. 2 (2008)
scope note: - производство на битови електроуреди: • хладилници • замразители • съдомиялни машини • перални и сушилни машини • прахосмукачки и други уреди за почистване, работещи чрез вакуум • подолъскачки • мелници за кухненски отпадъци • мелници и миксери за хранителни продукти, сокоизтисквачки • отварачки за консерви • електрически самобръсначки, електрически четки за зъби и други електрически уреди за лична хигиена • уреди за точене на ножове • вентилатори и въздухоочистители - производство на битови електронагревателни уреди: • електрически бойлери • електрически одеяла • електрически сешоари, гребени, четки, маши • електрически ютии • уреди за отопление и уреди за затопляне на помещение с вграден вентилатор, преносими • електрически фурни • микровълнови фурни • готварски печки, котлони • тостери • кафеварки и самовари • тигани, скари, грилове • реотани и други - производство на промишлено хладилно и вентилационно оборудване; постоянно монтирани електрически отоплителни уреди за помещения; машини за промишлена обработка или производство на храни; промишлени перални машини, машини за химическо чистете, преси за гладене и промишлени уреди за почистване, работещи чрез вакуум - раздел 28 - производство на шевни машини за домакинска употреба - 28.94 - инсталиране на системи за централно вакуумно почистване - 43.29 @bg
scope note: Z: - výrobu elektrických přístrojů určených převážně pro domácnost: • chladniček • mrazniček, chladicích boxů • myček nádobí • praček a sušiček prádla • vysavačů prachu • přístrojů na leštění parket • drtičů odpadu • přístrojů na drcení a mletí potravin a mixerů, lisů na ovoce • otvíračů konzerv • elektrických holicích strojků • elektrických kartáčků na zuby a jiných elektrických přístrojů pro osobní hygienu • brusek nožů • odvětrávacích přístrojů, stropních a koupelnových ventilátorů, včetně se zabudovanými svítidly - výrobu elektrických termických přístrojů určených převážně pro domácnost: • ohřívačů vody • přikrývek s elektrickým topným zařízením • vysoušečů vlasů, hřebenů, kartáčů, natáček • elektrických žehliček • přenosných topných těles do místností a ventilátorů • elektrických sporáků, ploten • mikrovlnných trub • vařičů, ohřívačů jídel • opékačů topinek • kávovarů a samovarů • pečicích pánví, opékačů, grilů, digestoří • elektrických topných odporů atd. N: - výrobu komerčních a průmyslových chladicích, mrazicích a klimatizačních zařízení, průmyslových ventilačních a odvětrávacích zařízení, podstřešních ventilátorů; kuchyňských nástrojů a zařízení pro velkokuchyně; velkokapacitních praček, sušiček, strojů pro chemické čištění (vybavení pro prádelny, čistírny, sušárny a pro žehlení); velkokapacitních vysavačů prachu určených pro průmysl, kanceláře atd. (viz oddíl 28) - výrobu šicích strojů včetně určených pro domácnosti (28.94) - montáž systémů odsávání prachu (43.29) @cs
scope note: Diese Klasse umfasst: - Herstellung von elektrischen Haushaltsgeräten: • Kühlschränke • Gefrierschränke, Tiefkühltruhen • Geschirrspülmaschinen • Waschmaschinen und Wäschetrockner • Staubsauger • Bohnergeräte • Abfallzerkleinerer • Lebensmittelzerkleinerungs- und –mischgeräte, Saftpressen • Dosenöffner • Elektrorasierer, elektrische Zahnbürsten und andere elektrische Körperpflegegeräte • Messerschleifmaschinen • Abluft- und Dunstabzugshauben - Herstellung von elektrothermischen Haushaltsgeräten: • Elektrische Warmwasserbereiter • Heizdecken • elektrische Haartrockner, Kämme, Bürsten, Lockenwickler • elektrische Bügeleisen • Raumheizkörper und Haushaltsventilatoren, tragbar • Elektroherde • Mikrowellenherde • Kocher, Warmhalteplatten • Toaster • Kaffee- oder Teemaschinen • elektrische Bratpfannen, Röst- und Grillgeräte • elektrische Heizwiderstände Diese Klasse umfasst nicht: - Herstellung von kommerziellen Kühl- und Gefriergeräten, Klimageräten, Hallenentlüftungssystemen, ortsfesten elektrischen Raumheizgeräten sowie kommerziellen Belüftungs- und Abluftgebläsen, kommerziellen Kochgeräten, Ausrüstung für Wäschereien, chemische Reinigungen und zum Bügeln; Staubsauger für Gewerbe, Industrie und Büros (s. Abteilung 28) - Herstellung von Haushaltsnähmaschinen (s. 28.94) - Einbau von Zentralstaubsauganlagen (s. 43.29) @de
scope note: This class includes: - manufacture of domestic electric appliances: • refrigerators • freezers • dishwashers • washing and drying machines • vacuum cleaners • floor polishers • waste disposers • grinders, blenders, juice squeezers • tin openers • electric shavers, electric toothbrushes, and other electric personal care device • knife sharpeners • ventilating or recycling hoods - manufacture of domestic electrothermic appliances: • electric water heaters • electric blankets • electric dryers, combs, brushes, curlers • electric smoothing irons • space heaters and household-type fans, portable • electric ovens • microwave ovens • cookers, hotplates • toasters • coffee or tea makers • fry pans, roasters, grills, hoods • electric heating resistors etc. This class excludes: - manufacture of commercial and industrial refrigerators and freezers, room air-conditioners, attic fans, permanent mount space heaters, and commercial ventilation and exhaust fans, commercial-type cooking equipment; commercial-type laundry, dry-cleaning, and pressing equipment; commercial, industrial, and institutional vacuum cleaners, see division 28 - manufacture of household-type sewing machines, see 28.94 - installation of central vacuum cleaning systems, 43.29 @en
scope note: Esta clase comprende: - la fabricación de máquinas, aparatos y dispositivos domésticos eléctricos: • frigoríficos • congeladores • lavavajillas • lavadoras y secadoras • aspiradoras • enceradoras de suelos • trituradoras de basura • picadoras, licuadoras, exprimidores • abrelatas • afeitadoras eléctricas, cepillos de dientes eléctricos y otros aparatos eléctricos de higiene personal • afiladores • campanas de ventilación o reciclaje - la fabricación de aparatos electrotérmicos de uso doméstico: • calentadores de agua eléctricos • mantas eléctricas • secadores, peines, cepillos y rizadores eléctricos • planchas eléctricas • calefactores y ventiladores domésticos portátiles • hornos eléctricos • hornos de microondas • cocinas, placas eléctricas • tostadoras • cafeteras y teteras • sartenes, asadores, parrillas, campanas • resistencias eléctricas para calefacción, etc. Esta clase no comprende: - la fabricación de frigoríficos y congeladores comerciales e industriales, equipos de aire acondicionado, ventiladores de tejado, aparatos eléctricos para calefacción y ventilación de montaje permanente y ventiladores de extracción, equipos industriales de cocina, equipos industriales de lavandería, limpieza en seco y planchado, aspiradoras de uso industrial (véase la división 28) - la fabricación de máquinas de coser de uso doméstico (véase 28.94) - la instalación de sistemas centrales de limpieza por aspirado (véase 43.29) @es
scope note: Cette classe comprend: - la fabrication d’appareils électroménagers: • réfrigérateurs • congélateurs • machines à laver la vaisselle • machines à laver et à sécher le linge • aspirateurs • polisseurs de sols • broyeurs de déchets • presse-fruits et presse-légumes • ouvre-boîtes • rasoirs électriques, brosses à dents électriques et autres appareils domestiques électriques • appareils à aiguiser les couteaux • hottes aspirantes à extraction ou à recyclage - la fabrication d’appareils électrothermiques à usage domestique: • chauffe-eau électriques • couvertures chauffantes • sèche-cheveux, peignes, brosses, appareils à friser électriques • fers à repasser électriques • appareils pour le chauffage des locaux et ventilateurs de type ménager, portatifs • fours électriques • fours à micro-ondes • cuisinières, chauffe-plats • grille-pain • appareils pour la préparation du café ou du thé • poêles à frire, rôtissoires, grils, hottes • résistances chauffantes, etc. Cette classe ne comprend pas: - la fabrication de réfrigérateurs et de congélateurs à usage commercial et industriel, de matériel de conditionnement d’air, de ventilateurs de grenier, de chauffage de locaux à montage permanent, de ventilateurs d’évacuation, d’appareils pour la cuisine de type commercial, d’appareils de blanchisserie ou de nettoyage à sec de type commercial, d’aspirateurs de type commercial, industriel et institutionnel, voir division 28 - la fabrication de machines à coudre destinées à un usage domestique, voir 28.94 - l’installation d’aspirateurs à unité centrale, voir 43.29 @fr
scope note: Ovaj razred uključuje: - proizvodnju električnih uređaja za kućanstava: • hladnjaka • zamrzivača • perilica za posuđe • strojeva za pranje i sušenje • usisavača • aparata za čišćenje podova • uređaja za zbrinjavanje otpada • mlinaca, miksera, sokovnika • otvarača konzervi • električnih aparata za brijanje, električnih četkica za zube i ostalih osobnih uređaja za njegu • oštrila za noževe • napa za ventilaciju i recikliranje - proizvodnju elektrotermičkih aparata za kućanstvo: • električnih grijača vode • električnih pokrivača • električnih aparata za sušenje kose, češljeva, četki, uvijača • električnih glačala • prenosivih grijača prostorija i ventilatora • električnih pećnica • mikrovalnih pećnica • električnih štednjaka, kuhala (rešoa) • tostera • aparata za kavu i čaj • friteza, roštilja, pećnica, napa • električnih grijaćih tijela itd. Ovaj razred isključuje: - proizvodnju komercijalnih i industrijskih hladnjaka i zamrzivača, klimatizacijskih uređaja, antenskih ventilatora, ventilatora za potkrovlja, trajno montiranih grijača prostora i komercijalnih ventilatora te ispušnih ventilatora, štednjaka za komercijalnu upotrebu; perilica za rublje za komercijalne potrebe, perilica i sušilica, opremu za glačanje, komercijalnih, industrijskih i institucionalnih usisivača, vidi odjeljak 28 - proizvodnju šivaćih strojeva za kućanstva, vidi 28.94 - instalaciju centralnog sustava za usisavanje, 43.29
scope note: Į šią klasę įeina: - elektrinių buitinių prietaisų gamyba: • šaldytuvų • šaldiklių • indaplovių • skalbimo ir džiovinimo mašinų • dulkių siurblių • grindų poliruotuvų • atliekų šalintuvų • smulkintuvų, maišytuvų, sulčiaspaudžių • skardinių atidarytuvų • elektrinių skustuvų, elektrinių dantų valymo šepetėlių ir kitokių elektrinių asmeninės higienos įtaisų • peilių galąstuvų • ventiliacinių ar recirkuliacinių garų rinktuvų - buitinių elektroterminių prietaisų gamyba: • elektrinių vandens šildytuvų • elektrinių antklodžių • elektrinių džiovintuvų, šukų, šepečių, plaukų suktukų • elektrinių laidynių • nešiojamų patalpų šildytuvų ir buitinių elektrinių ventiliatorių • elektrinių krosnių • mikrobangų krosnelių • viryklių, kaitlenčių • skrudintuvų • kavinukų ar arbatinukų • keptuvių, troškintuvų, keptuvų, garų rinktuvų • varžinių elektrinių šildymo elementų ir kt. Į šią klasę neįeina: - komercinių ir pramoninių šaldytuvų bei šaldiklių, patalpų oro kondicionierių, pastogės ventiliatorių, stacionariai sumontuotų patalpų šildytuvų, komercinių vėdinimo ir ištraukiamųjų ventiliatorių, komercinės paskirties maisto ruošimo įrangos gamyba; komercinės skalbimo, sausojo valymo ir lyginimo įrangos gamyba; komercinių, pramoninių ir įstaigų dulkių siurblių, gamyba, žr. 28 skyrių - buitinių siuvamųjų mašinų gamyba, žr. 28.94 - centrinių dulkių siurbimo sistemų įrengimas, žr. 43.29 @lt
scope note: Данный класс включает производство разнообразного электрического оборудования, в отличие от моторов, генераторов и трансформаторов, батарей и аккумуляторов, проводки, осветительного оборудования или бытовых приборов. Этот класс включает: - производство зарядных устройств для твердых батарей - производство электроустройств для открывания и закрывания дверей - производство электрических дверных звонков - производство удлинителей из покупных изолированных проводов - производство ультразвуковых очистных машин (за исключением лабораторных и стоматологических) - производство инвертеров, ректификационных аппаратов, топливных батарей, приводных и не приводных двигателей - производство источников бесперебойного питания (UPS) - производство сетевых фильтров (за исключением распределения по уровням) - производство удлинителей и прочих видов электрической проводки с изолированной поверхностью и коннекторами - производство угольных и графитных волокон электродов, контактов и других электрических угольных и графитных изделий - производство усилителей частиц - производство электрических конденсаторных батарей, резисторов и подобных компонентов - производство электромагнитов - производство сирен - производство электронных табло - производство электрических указателей - производство электрического сигнального оборудования, такого как светофоры и пешеходные указатели - производство электрических изоляционных (кроме стекла и порцеляна) - производство электросварочного и паяльного оборудования, включая ручные паяльные утюги Этот класс исключает: - производство порцеляновых изоляционных составляющих, см. 23.43 - производство угольных и графитных волокон и изделий (за исключением электродов и электрических компонентов), см. 23.99 - производство электронных ректификаторов, интегральных микросхем, силовых преобразователей, электронных конденсаторов, резисторов и подобных устройств, см. 26.11 - производство трансформаторов, моторов, генераторов, коммутационной аппаратуры, реле и промышленны… @ru
scope note: Bu sınıf aşağıdakileri kapsamaktadır; - elektrikli ev aletlerinin imalatı: • buzdolapları, • dondurucular, • bulaşık makineleri, • çamaşır yıkama ve kurutma makineleri, • elektrikli süpürgeler, • yer silicileri/parlatıcıları, • çöp, atık öğütücüleri, • öğütücüler, blenderler, meyve sıkacakları, • konserve açacakları, • elektrikli tıraş aletleri, elektrikli diş fırçaları, ve diğer elektrikli kişisel bakım aletleri, • bıçak bileyicileri, • vantilatör ve aspiratörler. - ev tipi elektro termik aletlerin imalatı: • elektrikli su ısıtıcıları, • elektrikli battaniyeler, • elektrikli fön makineleri, taraklar, fırçalar, bigudiler, • elektrikli ütüler, • taşınabilir elektrikli radyatörler (ısıtıcılar) ve ev tipi vantilatörler, • elektrikli fırınlar, • mikrodalga fırınlar, • yemek pişirme ocakları, elektrikli saclar, • tost makineleri, • kahve veya çay makineleri, • elektrikli kızartma tavaları, kızartıcılar, ızgaralar, davlumbazlar, • elektrikli ısıtma rezistansları vb. Kapsam dışı olanlar; - ticari ve sanayi buzdolapları ve soğutucular, oda klimaları, tavan yelpazeleri, sabit hazneli sobalar ve ticari vantilatörler ve aspiratörler, ticari tipde yemek pişirme aletleri; ticari tipte çamaşırhaneler, kuru temizleme ve presleme teçhizatı; ticari ve sanayi elektrik süpürgelerinin imalatı, bkz. bölüm 28, - ev tipi dikiş makinelerinin imalatı, bkz. 28.94, - merkezi elektrikli süpürge sistemlerinin kurulması, bkz. 43.29.ı imalatı (trafik ışıkları ve yayalar için sinyal donanımları dahil), bkz. 27.90, - elektrikli işaretlerin imalatı, bkz. 27.90. @tr
preferred label: Производство на битови електроуреди @bg
preferred label: Výroba elektrických spotřebičů převážně pro domácnost @cs
preferred label: Fremstilling af elektriske husholdningsapparater @da
preferred label: Herstellung von elektrischen Haushaltsgeräten @de
preferred label: Κατασκευή ηλεκτρικών οικιακών συσκευών @el
preferred label: Fabricación de electrodomésticos @es
preferred label: Elektriliste kodumasinate tootmine @et
preferred label: Sähköisten kodinkoneiden valmistus @fi
preferred label: Fabrication d'appareils électroménagers @fr
preferred label: Háztartási villamos készülék gyártása
preferred label: Fabbricazione di elettrodomestici @it
preferred label: Buitinių elektrinių aparatų ir prietaisų gamyba @lt
preferred label: Elektriskās sadzīves aparatūras ražošana @lv
preferred label: Manifattura ta' apparat domestiku ta' l-elettriku @mt
preferred label: Vervaardiging van elektrische huishoudapparaten @nl
preferred label: Produksjon av elektriske husholdningsmaskiner og -apparater @no
preferred label: Produkcja elektrycznego sprzętu gospodarstwa domowego @pl
preferred label: Fabricação de aparelhos electrodomésticos @pt
preferred label: Fabricarea de aparate electrocasnice @ro
preferred label: Производство электробытовых приборов @ru
preferred label: Výroba elektrických zariadení pre domácnosti @sk
preferred label: Proizvodnja električnih gospodinjskih naprav @sl
preferred label: Tillverkning av elektriska hushållsmaskiner och hushållsapparater @sv
preferred label: Elektrikli ev aletlerinin imalatı @tr
broader: Manufacture of domestic appliances

Manufacture of non-electric domestic appliances
type: Concept
notation: 27.52
status: valid
status modified: 2013-10-18
accepted date: 2013-10-18
in scheme: Statistical Classification of Economic Activities in the European Community, Rev. 2 (2008)
scope note: - производство на неелектрически битови уреди за готвене и за отопление: • неелектрически отоплителни уреди за помещения, въздухоочистители за кухни, скари, печки за готвене и отопление, бойлери, готварски уреди, нагревателни плочи @bg
scope note: Z: - výrobu neelektrických zařízení pro vaření a topení určených pro domácnost: • neelektrických topných těles, kamen pro místnosti • neelektrických kuchyňských sporáků, ploten, roštů, vařičů a ohřívačů jídel • neelektrických ohřívačů vody @cs
scope note: Diese Klasse umfasst: - Herstellung von nichtelektrischen Küchen- und Heizgeräten: • nichtelektrische Raumheizkörper, Küchenherde, Feuerroste, Öfen, Warmwasserbereiter, Kochgeräte und Warmhalteplatten @de
scope note: This class includes: - manufacture of domestic non-electric cooking and heating equipment: • non-electric space heaters, cooking ranges, grates, stoves, water heaters, cooking appliances, plate warmers @en
scope note: Esta clase comprende: - la fabricación de aparatos domésticos no eléctricos para calefacción y cocina: • aparatos no eléctricos para calefacción, hornillos, hornos, estufas, calentadores de agua, aparatos para cocina y calientaplatos no eléctricos @es
scope note: Cette classe comprend: - la fabrication d’appareils non électriques pour le chauffage des locaux et la cuisine domestique: • appareils pour le chauffage des locaux, cuisinières, grils, poêles, chauffe-eau, ustensiles de cuisine, chauffe-plats, non électriques @fr
scope note: Ovaj razred uključuje: - proizvodnju neelektričnih kuhala i opreme za grijanje: • neelektričnih grijača prostora, površina za kuhanje, kamina, peći, grijača vode, uređaja za kuhanje, metalnih ploča za grijanje
scope note: Į šią klasę įeina: - neelektrinės buitinės virimo ir šildymo įrangos gamyba • neelektrinių patalpų šildytuvų, viryklių, krosnių, židinių, vandens šildytuvų, maisto ruošimo prietaisų, plokščiųjų šildytuvų gamyba @lt
scope note: Данный раздел включает производство техники и оборудования, которые работают независимо от материалов, будь то механический или термический метод обработки материалов или выполнение каких-либо работ с материалами (таких как, напыление, взвешивание или упаковка), включая их механические устройства и любые исходные заготовки, произведенные особым способом. Данный раздел включает производство не передвижных и мобильных устройств вне зависимости от того, были ли они сконструированы для промышленных, строительных или гражданских объектов, использования в сельском хозяйстве или быту. Производство специализированного оборудования для пассажирского или грузового транспорта также включено в данный раздел. Данный раздел делится на производство специализированной техники, то есть техники для ограниченного использования в промышленности или небольшой группе направлений промышленности и техники общего назначения, то есть техники, которая может быть использована в широком кругу направлений промышленности. Данный раздел также включает производство прочих видов техники специального назначения, которые не включены в другие разделы данного классификатора, таких как, оборудование для парков культуры и отдыха, автоматическое оборудование для кегельбана и т.д. Данный раздел не включает производство металлических изделий общего назначения (раздел 25), управляющих устройств, компьютерного, измерительного и контрольного оборудования, приборов для распределения и контроля электроэнергии (разделы 26 и 27) и автотранспортных средств общего назначения (разделы 29 и 30). @ru
scope note: Bu sınıf aşağıdakileri kapsamaktadır; - ev tipi, elektriksiz pişirme ve ısıtma aletlerinin imalatı: •elektrikli olmayan sobalar, pişirme setleri, ocaklar, fırınlar, su ısıtıcıları, yemek pişirme aletleri, tabak ısıtıcıları. @tr
preferred label: Производство на неелектрически битови уреди @bg
preferred label: Výroba neelektrických spotřebičů převážně pro domácnost @cs
preferred label: Fremstilling af ikke-elektriske husholdningsapparater @da
preferred label: Herstellung von nichtelektrischen Haushaltsgeräten @de
preferred label: Κατασκευή μη ηλεκτρικών οικιακών συσκευών @el
preferred label: Fabricación de aparatos domésticos no eléctricos @es
preferred label: Mitteelektriliste kodumasinate tootmine @et
preferred label: Sähköistämättömien kodinkoneiden valmistus @fi
preferred label: Fabrication d'appareils ménagers non électriques @fr
preferred label: Nem villamos háztartási készülék gyártása
preferred label: Fabbricazione di apparecchi per uso domestico non elettrici @it
preferred label: Buitinių neelektrinių aparatų ir prietaisų gamyba @lt
preferred label: Neelektrisko sadzīves iekārtu ražošana @lv
preferred label: Manifattura ta' apparat domestiku mhux ta' l-elettriku @mt
preferred label: Vervaardiging van niet-elektrische huishoudapparaten @nl
preferred label: Produksjon av ikke-elektriske husholdningsmaskiner og -apparater @no
preferred label: Produkcja nieelektrycznego sprzętu gospodarstwa domowego @pl
preferred label: Fabricação de aparelhos não eléctricos para uso doméstico @pt
preferred label: Fabricarea de echipamente casnice neelectrice @ro
preferred label: Производство не электрических бытовых приборов @ru
preferred label: Výroba neelektrických zariadení pre domácnosti @sk
preferred label: Proizvodnja neelektričnih gospodinjskih naprav @sl
preferred label: Tillverkning av icke-elektriska hushållsmaskiner och hushållsapparater @sv
preferred label: Elektriksiz ev aletlerinin imalatı @tr
broader: Manufacture of domestic appliances

Manufacture of other electrical equipment
type: Concept
notation: 27.9
status: valid
status modified: 2013-10-18
accepted date: 2013-10-18
in scheme: Statistical Classification of Economic Activities in the European Community, Rev. 2 (2008)
preferred label: Производство на други електрически съоръжения @bg
preferred label: Výroba ostatních elektrických zařízení @cs
preferred label: Fremstilling af andet elektrisk udstyr @da
preferred label: Herstellung von sonstigen elektrischen Ausrüstungen und Geräten a. n. g. @de
preferred label: Κατασκευή άλλου ηλεκτρικού εξοπλισμού @el
preferred label: Fabricación de otro material y equipo eléctrico @es
preferred label: Muude elektriseadmete tootmine @et
preferred label: Muiden sähkölaitteiden valmistus @fi
preferred label: Fabrication d'autres matériels électriques @fr
preferred label: Egyéb villamos berendezés gyártása
preferred label: Fabbricazione di altre apparecchiature elettriche @it
preferred label: Kitos elektros įrangos gamyba @lt
preferred label: Citu elektroiekārtu ražošana @lv
preferred label: Manifattura ta' tagħmir għad-dawl elettriku @mt
preferred label: Vervaardiging van andere elektrische apparatuur @nl
preferred label: Produksjon av annet elektrisk utstyr @no
preferred label: Produkcja pozostałego sprzętu elektrycznego @pl
preferred label: Fabricação de outro equipamento eléctrico @pt
preferred label: Fabricarea altor echipamente electrice @ro
preferred label: Производство прочего электрического оборудования @ru
preferred label: Výroba ostatných elektrických zariadení @sk
preferred label: Proizvodnja drugih električnih naprav @sl
preferred label: Tillverkning av annan elapparatur @sv
preferred label: Diğer elektrikli donanımların imalatı @tr
broader: Manufacture of electrical equipment
narrower: Manufacture of other electrical equipment

Manufacture of other electrical equipment
type: Concept
notation: 27.90
status: valid
status modified: 2013-10-18
accepted date: 2013-10-18
in scheme: Statistical Classification of Economic Activities in the European Community, Rev. 2 (2008)
scope note: - производство на зареждащи устройства за акумулатори - производство на електрически устройства за отваряне или затваряне на врати - производство на електрически звънци - производство на удължителни шнурове, произведени от закупени изолирани проводници - производство на машини за почистване с ултразвук (без лабораторни и зъболекарски) - производство на полупроводникови инвертори, изправители и преобразуватели, горивни елементи, регулируеми и нерегулируеми захранващи източници - производство на устройства за непрекъсваемо захранване (UPS) - производство на устройства за потискане на импулсни смущения (без тези за нивото на напрежение при разпределение на електрическата енергия) - производство на шнурове за електроуреди, удължители и други електрически шнурове с изолирани проводници и съединители - производство на графитни електроди, графитни четки и други изделия от графит или от друг въглерод - производство на ускорители на частици - производство на електрически кондензатори, резистори, съединители и подобни елементи - производство на електромагнити - производство на сирени - производство на електронни информационни табла - производство на светлинни надписи, светлинни указателни табели и подобни изделия (вкл. пътни знаци) - производство на електрическа апаратура за сигнализация като светофари и апаратура за сигнализиране на пешеходците - производство на електрически изолатори (без тези от стъкло или порцелан), изолационни тръби и части за свързване, от неблагородни метали - производство на електрически машини и устройства за спояване, заваряване и повърхностно закаляване, вкл. поялници и пистолети за спояване, за ръчна работа - производство на порцеланови електрически изолатори - 23.43 - производство на въглеродни и графитни влакна и продукти (без електроди и тези с електрическо приложение) - 23.99 - производство на елементи за електрониката като токоизправители, интегрални схеми за стабилизаране на напрежението, интегрални схеми за токоизправители с голяма мощност,… @bg
scope note: Tato třída zahrnuje výrobu různých jiných elektrických přístrojů a zařízení než jsou uvedeny v předchozích třídách. Z: - výrobu akumulátorových nabíječek - výrobu elektricky zařízení pro otevírání a zavírání dveří - výrobu elektrických zvonků, bzučáků, sirén - výrobu prodlužovacích kabelů z nakoupeného izolovaného drátu (tzn. drátu ne vlastní výroby) - výrobu ultrazvukových čisticích přístrojů (kromě přístrojů pro zubní a jiné laboratoře) - výrobu polovodičových měničů, usměrňovačů a konvertorů proudu, palivových článků, regulovaných a neregulovaných napájecích jednotek - výrobu nepřerušitelných zdrojů proudu (UPS) - výrobu ochrany proti předpětí - výrobu přívodních kabelů k přístrojům, prodlužovacích kabelů a jiných svazků elektrických kabelů z izolovaného drátu s přípojkami nebo jinými zařízeními - výrobu uhlíkových a grafitových elektrod, kontaktů a jiných výrobků z uhlíku a grafitu pro elektrické aplikace - výrobu urychlovačů částic - výrobu elektrických kondenzátorů, odporů a podobných komponentů - výrobu elektromagnetů - výrobu sirén - výrobu elektrických značek, ukazatelů - výrobu elektronických návěstních panelů a výsledkových tabulí - výrobu elektrických signalizačních přístrojů, např. dopravních semaforů a signalizačních zařízení pro chodce - výrobu elektrických izolátorů a součástek izolátorů (kromě izolátorů ze skla nebo keramiky), izolačních trubek a jejich spojek z obecných kovů - výrobu elektrických pájecích a svařovacích přístrojů, včetně ručně vedených pájedel N: - výrobu elektrických izolátorů z porcelánu (23.43) - výrobu uhlíkových a grafitových vláken a výrobků (kromě elektrod a výrobků pro použití v elektrotechnice) (23.99) - výrobu elektronických komponentů elektronických usměrňovačů, integrovaných spínacích obvodů k regulaci napětí, integrovaných spínacích obvodů k přeměně výkonu, elektronických kondenzátorů, odporů a podobných elektronických zařízení (26.11) - výrobu motorů, transformátorů, generátorů, spínacích zařízení, relé, průmyslových k… @cs
scope note: Diese Klasse umfasst die Herstellung von verschiedenen anderen elektrischen Geräten und Vorrichtungen außer Motoren, Generatoren, Batterien und Akkumulatoren, elektrischem Installationsmaterial, Beleuchtungen und Haushaltsgeräten. Diese Klasse umfasst: - Herstellung von Akku-Ladegeräten, transistoriert - Herstellung von elektrisch betätigten Türöffnungs- und Schließvorrichtungen - Herstellung von elektrischen Klingeln - Herstellung von Verlängerungskabeln aus zugekauftem isoliertem Draht - Herstellung von Ultraschall-Reinigungsgeräten (außer für Dental- und andere Laboratorien) - Herstellung von Halbleiter-Wechselrichtern, -Gleichrichtern, Brennstoffzellen, geregelten und ungeregelten Stromversorgungseinheiten - Herstellung von unterbrechungsfreien Stromversorgungen - Herstellung von Überspannungsableitern (außer für die Spannung auf der Verteilungsebene) - Herstellung von Geräteanschlusskabeln, Verlängerungskabeln und anderen Elektrokabelsätzen aus isolierten Drähten und Anschlüssen - Herstellung von Kohle- und Grafitelektroden, Kontakten und anderen Erzeugnissen aus Kohle und Grafit für elektrische Anwendungen - Herstellung von Teilchenbeschleunigern - Herstellung von elektrischen Kondensatoren, Widerständen und ähnlichen Bauteilen - Herstellung von Elektromagneten - Herstellung von Sirenen - Herstellung von elektronischen Anzeigetafeln - Herstellung von elektrischen Zeichen und Schildern - Herstellung von elektrischen Signaleinrichtungen wie Verkehrsampeln und Signaleinrichtungen für Fußgänger - Herstellung von elektrischen Isolatoren und Isolierteilen (außer aus Glas oder Keramik) - Herstellung von elektrischen Löt- und Schweißgeräten, einschließlich handgeführter Lötkolben Diese Klasse umfasst nicht: - Herstellung von elektrischen Isolatoren aus Porzellan (s. 23.43) - Herstellung von Erzeugnissen aus Kohlenstoff- und Grafitfasern (außer Elektroden und für elektrische Einsatzfelder) (s. 23.99) - Herstellung von elektronischen Gleichrichtern, integrierten Schaltk… @de
scope note: This class includes the manufacture of miscellaneous electrical equipment other than motors, generators and transformers, batteries and accumulators, wires and wiring devices, lighting equipment or domestic appliances. This class includes: - manufacture of battery chargers, solid-state - manufacture of door opening and closing devices, electrical - manufacture of electric bells - manufacture of extension cords made from purchased insulated wire - manufacture of ultrasonic cleaning machines (except laboratory and dental) - manufacture of solid state inverters, rectifying apparatus, fuel cells, regulated and unregulated power supplies - manufacture of uninterruptible power supplies (UPS) - manufacture of surge suppressors (except for distribution level voltage) - manufacture of appliance cords, extension cords, and other electrical cord sets with insulated wire and connectors - manufacture of carbon and graphite electrodes, contacts, and other electrical carbon and graphite products - manufacture of particle accelerators - manufacture of electrical capacitors, resistors, condensers and similar components - manufacture of electromagnets - manufacture of sirens - manufacture of electronic scoreboards - manufacture of electrical signs - manufacture of electrical signalling equipment such as traffic lights and pedestrian signalling equipment - manufacture of electrical insulators (except glass or porcelain) - manufacture of electrical welding and soldering equipment, including hand-held soldering irons This class excludes: - manufacture of porcelain electrical insulators, see 23.43 - manufacture of carbon and graphite fibres and products (except electrodes and electrical applications), see 23.99 - manufacture of electronic component-type rectifiers, voltage regulating integrated circuits, power converting integrated circuits, electronic capacitors, electronic resistors, and similar devices, see 26.11 - manufacture of transformers, motors, generators, switchgear, relays an… @en
scope note: Esta clase comprende la fabricación de aparatos eléctricos diversos, con excepción de motores, generadores y transformadores, baterías y acumuladores, cables y dispositivos de cableado, equipos de iluminación y aparatos domésticos. Esta clase comprende: - la fabricación de cargadores de batería de estado sólido - la fabricación de dispositivos eléctricos de apertura y cierre de puertas - la fabricación de timbres eléctricos - la fabricación de cables de extensión elaborados con alambre aislado adquirido a terceros - la fabricación de equipos de limpieza por ultrasonido (excepto de laboratorio y odontológicos) - la fabricación de inversores de estado sólido, rectificadores, pilas de combustible y fuentes de alimentación reguladas y no reguladas - la fabricación de sistemas de alimentación ininterrumpida (SAI) - la fabricación de supresores de sobretensión (excepto para el nivel de voltaje de distribución) - la fabricación de cables de aparatos, cables de extensión y otros juegos de cables eléctricos con alambre aislado y conectores - la fabricación de electrodos y contactos de carbón y de grafito, y de otros productos eléctricos de carbono y de grafito - la fabricación de aceleradores de partículas - la fabricación de capacitadores, condensadores, resistencias y componentes eléctricos similares - la fabricación de electroimanes - la fabricación de sirenas - la fabricación de marcadores electrónicos - la fabricación de rótulos luminosos - la fabricación de equipos de señalización eléctricos como los semáforos y los dispositivos de señalización para peatones - la fabricación de aisladores eléctricos (excepto de vidrio o porcelana), conducciones de base metálica y sus accesorios - la fabricación de equipos para soldadura eléctrica, incluidos soldadores de mano Esta clase no comprende: - la fabricación de aisladores eléctricos de porcelana (véase 23.43) - la fabricación de fibras y productos de carbono y de grafito (excepto electrodos y piezas eléctricas) (véase 23.99) -… @es
scope note: Cette classe comprend la fabrication de divers appareils électriques autres que moteurs, générateurs et transformateurs, piles et accumulateurs, câbles et câblages d’installations électriques, appareils d’éclairage ou appareils ménagers. Cette classe comprend: - la fabrication de chargeurs de batterie à semi-conducteurs - la fabrication de dispositifs électriques d’ouverture et de fermeture des portes - la fabrication de carillons électriques - la fabrication de prolongateurs électriques à partir de fils isolés achetés - la fabrication d’appareils de nettoyage par ultrasons (autres que ceux destinés à un usage en laboratoire ou dentaire) - la fabrication d’onduleurs à semi-conducteurs, de redresseurs, de piles à combustible, de générateurs électriques - la fabrication de sources d’alimentation électrique ininterruptibles - la fabrication de limiteurs de tension (sauf pour la tension au niveau de la distribution) - la fabrication de câbles d’appareils, de prolongateurs électriques et d’autres jeux de fils électriques avec des fils isolés et des connecteurs - la fabrication d’électrodes et de contacts en carbone et en graphite et d’autres produits électriques constitués de carbone et de graphite - la fabrication d’accélérateurs de particules - la fabrication de condensateurs électriques et de composants similaires - la fabrication d’électro-aimants - la fabrication de sirènes - la fabrication de tableaux d’affichage électroniques - la fabrication de signaux électriques - la fabrication d’appareils électriques de signalisation, tels que les feux de signalisation et les équipements de signalisation pour piétons - la fabrication d’isolateurs pour l’électricité (sauf en verre ou en céramique) - la fabrication de matériel électrique à souder et à braser, y compris les fers à souder portatifs Cette classe ne comprend pas: - la fabrication d’isolateurs en porcelaine, voir 23.43 - la fabrication de fibres de carbone et de graphites et de produits constitués de ces fibres (à l… @fr
scope note: Ovaj razred uključuje proizvodnju različite električne opreme, osim motora, generatora i transformatora, baterija i akumulatora, žica i žičanih uređaja, opreme za rasvjetu ili uređaja za kućanstva. Ovaj razred uključuje: - proizvodnju fiksnih punjača za baterije, tranzistornih - proizvodnju električnih uređaja za otvaranje i zatvaranje vrata - proizvodnju električnih zvona - proizvodnju produžnih kablova izrađenih od kupljene izolirane žice - proizvodnju ultrazvučnih uređaja za čišćenje (osim laboratorijskih i zubarskih) - proizvodnju invertera u čvrstom stanju, aparata za ispravljanje, stanica za gorivo, reguliranog ili nereguliranog pribora za napajanje - proizvodnju pribora za neprekidno napajanje (UPS) - proizvodnju valovitih potiskivača (osim za distribuciju naponske razine) - proizvodnju kablova za uređaje, produžnih kablova i ostalih električnih kablova sa izoliranom žicom i priključnicima - proizvodnju ugljikovih elektroda i elektroda od grafita, spojnika te ostalih električnih ugljičnih i grafitnih proizvoda - proizvodnju dijelova akceleratora - proizvodnju električnih kondenzatora, otpornika, kondenzatora i slično te akceleratora - proizvodnju elektromagneta - proizvodnju sirena - proizvodnju elektroničkih semafora (npr. za ispis rezultata utakmice) - proizvodnju električnih znakova - proizvodnju električne signalne opreme kao što je prometna i pješačka signalizacija - proizvodnju električnih izolatora (osim stakla ili porculana), izolacijskih cijevi i opreme od neplemenitih kovina - proizvodnju električne opreme za varenje i lemljenje, uključujući ručnodržeće lemilice Ovaj razred isključuje: - proizvodnju keramičkih izolatora, vidi 23.43 - proizvodnju ugljičnih i grafitnih vlakana i proizvoda (osim elektroda i onih za primjenu u električne svrhe), vidi 23.99 - proizvodnju elektroničkih komponenti za ispravljače, regulatore napona integriranih krugova, pretvarača struje integriranih krugova, elektroničkih kondenzatora, elektroničkih otpornika i sličnih ure…
scope note: Į šią klasę įeina įvairios elektrinės įrangos, kitokios nei varikliai, generatoriai, transformatoriai, baterijos ir akumuliatoriai, instaliacijos laidai ir įtaisai, apšvietimo įranga ir buitiniai prietaisai, gamyba. Į šią klasę įeina: - puslaidininkinių baterijų įkroviklių gamyba - elektrinių durų atidarymo ir uždarymo įtaisų gamyba - elektrinių skambučių gamyba - ilgintuvų, pagamintų iš ne savos gamybos izoliuotų laidų, gamyba - ultragarsinių valymo mašinų (išskyrus laboratorines ir odontologines) gamyba - puslaidininkinių inverterių, lygintuvų, kuro elementų, reguliuojamų ir nereguliuojamų maitinimo šaltinių gamyba - nepertraukiamo maitinimo šaltinių (UPS) gamyba - viršįtampių ribotuvų (išskyrus paskirstomosios įtampos lygiui nustatyti) gamyba - prietaisų virvėlaidžių, ilgintuvų ir kitų elektros virvėlaidžių rinkinių su izoliuotu laidu ir jungtimis gamyba - anglies ir grafito elektrodų, kontaktų ir kitų elektrinių anglies ir grafito gaminių gamyba - dalelių greitintuvų gamyba - greitintuvų elektrinių kondensatorių, rezistorių, kondensatorių ir panašių elementų gamyba - elektromagnetų gamyba - sirenų gamyba - elektroninių švieslenčių gamyba - elektrinių ženklų ir iškabų gamyba - elektrinės signalizavimo įrangos, tokios kaip šviesoforai ir pėsčiųjų signalizavimo įranga, gamyba - elektros izoliatorių (išskyrus stiklinius ir porcelianinius), netauriųjų metalų izoliacinių vamzdžių ir jungiamųjų detalių gamyba - elektrinio suvirinimo ir litavimo įrangos, įskaitant rankinius lituoklius, gamyba Į šią klasę neįeina: - porcelianinių elektros izoliatorių gamyba, žr. 23.43 - anglies ir grafito pluoštų bei gaminių (išskyrus elektrodus ir elektrinius taikmenis) gamyba, žr. 23.99 - elektroninių komponentų, tokių kaip lygintuvai, įtampos reguliavimo ar galios keitimo integriniai grandynai, elektroniniai kondensatoriai, elektroniniai rezistoriai ir panašūs įtaisai, gamyba, žr. 26.11 - transformatorių, variklių, generatorių, perjungimo įrenginių, relių ir pramoninių valdytuvų gamyb… @lt
scope note: Этот класс включает: - производство клапанов для двигателей внутреннего сгорания, за исключением автомобилей, воздушных судов и тяговых двигателей: • судовых двигателей • железнодорожных двигателей - производство клапанов, поршневых колец, карбюраторов и т.д. для всех двигателей внутреннего сгорания, дизельных двигателей и т.д. - производство вытяжных и выхлопных вентилей для двигателей внутреннего сгорания - производство турбин и их деталей: • паровых и прочих турбин • гидравлических турбин, рабочих колес гидротурбин и регуляторов к ним • ветряных двигателей • газовых турбин, за исключением турбореактивных или турбодвигателей для воздушных судов - производство котлотурбинных установок - производство турбогенераторных установок - производство двигателей для промышленного использования Этот класс исключает: - производство электрогенераторов (за исключением турбогенераторных установок), см. 27.11 - производство генераторных установок для первичных двигателей (за исключением турбогенераторных установок), см. 27.11 - производство электрического оборудования и компонентов для двигателей внутреннего сгорания, см. 29.31 - производство двигателей для автотранспортных средств, воздушных судов или мотоциклов, см. 29.10, 30.30, 30.91 - производство турбореактивных двигателей, см. 30.30 @ru
scope note: Bu sınıf, motor, jeneratör, transformatör, pil ve akümülatör, tel ve kablolamada kullanılan gereçler, aydınlatma aletleri ya da ev aletleri dışındaki çeşitli elektrikli donanımların imalatını kapsamaktadır.Bu sınıf aşağıdakileri kapsamaktadır; - pil, akü ve batarya şarj aleti imalatı (sabit durum), - elektrikli kapı açma ve kapama aletleri imalatı, - elektrikli zil imalatı, - yalıtkan elektrik tellerinden uzatma kablosu imalatı , - ultrasonik temizleme makineleri imalatı (laboratuar ve dişçilik hariç), - sabit durum redresörleri, dalgalı akımı doğru akıma çeviren cihazlar, yakıt hücreleri, düzenli ve düzensiz güç kaynakları imalatı, - kesintisiz güç kaynakları (UPS) imalatı, - aşırı gerilim koruyucu (süpresör) imalatı (elektrik dağıtım voltaj seviyesi için olanlar hariç), - yalıtkan telli ve bağlayıcı elemanlı cihaz kablolarının, uzatma kablolarının ve diğer elektrik kablo setlerinin imalatı, - karbon ve grafit elektrotların, bağlantıların ve diğer elektrikli karbon ve grafit ürünlerin imalatı, - parçacık hızlandırıcılar imalatı, - elektrikli kondansatör, direnç, yoğunlaştırıcılar ve benzer bileşenlerin imalatı, - elektro mıknatıs imalatı, - siren imalatı, - elektronik sayı levhası (skorbord) imalatı, - elektrikli işaretlerin (tabelaların) imalatı, - elektrikli sinyal donanımları imalatı (trafik ışıkları ve yayalar için sinyal donanımları dahil), - elektrik izolatörlerinin (cam ya da porselen hariç), adi metalden izolasyon borularının ve bağlantı parçalarının imalatı, - elektrikli kaynak ve lehim teçhizatının imalatı (lehim havyaları da dahil). Kapsam dışı olanlar; - porselen elektrik izolatörleri imalatı, bkz. 23.43, - karbon ve grafit tel ve ürün imalatı (elektrotlar ve elektrikli aletler hariç), bkz. 23.99, - elektronik bileşen tipli redresörler, voltaj düzenleyici entegre devreler, enerji dönüştüren entegre devreler, elektronik kondansatörler, elektronik dirençler ve benzer aletler imalatı, bkz. 26.11, - transformatörler, motorlar, jeneratörler, elektrik bağlant… @tr
preferred label: Производство на други електрически съоръжения @bg
preferred label: Výroba ostatních elektrických zařízení @cs
preferred label: Fremstilling af andet elektrisk udstyr @da
preferred label: Herstellung von sonstigen elektrischen Ausrüstungen und Geräten a. n. g. @de
preferred label: Κατασκευή άλλου ηλεκτρικού εξοπλισμού @el
preferred label: Fabricación de otro material y equipo eléctrico @es
preferred label: Muude elektriseadmete tootmine @et
preferred label: Muiden sähkölaitteiden valmistus @fi
preferred label: Fabrication d'autres matériels électriques @fr
preferred label: Egyéb villamos berendezés gyártása
preferred label: Fabbricazione di altre apparecchiature elettriche @it
preferred label: Kitos elektros įrangos gamyba @lt
preferred label: Citu elektroiekārtu ražošana @lv
preferred label: Manifattura ta' tagħmir għad-dawl elettriku @mt
preferred label: Vervaardiging van andere elektrische apparatuur @nl
preferred label: Produksjon av annet elektrisk utstyr @no
preferred label: Produkcja pozostałego sprzętu elektrycznego @pl
preferred label: Fabricação de outro equipamento eléctrico @pt
preferred label: Fabricarea altor echipamente electrice @ro
preferred label: Производство прочего электрического оборудования @ru
preferred label: Výroba ostatných elektrických zariadení @sk
preferred label: Proizvodnja drugih električnih naprav @sl
preferred label: Tillverkning av annan elapparatur @sv
preferred label: Diğer elektrikli donanımların imalatı @tr
broader: Manufacture of other electrical equipment

Manufacture of machinery and equipment n.e.c.
type: Concept
notation: 28
status: valid
status modified: 2013-10-18
accepted date: 2013-10-18
in scheme: Statistical Classification of Economic Activities in the European Community, Rev. 2 (2008)
scope note: производство на машини и оборудване, които въздействат механично или термично на материалите или извършват операции върху тях (манипулиране, третиране, разпръскване, измерване или пакетиране), вкл. резервни части и възли, които произвеждат и пренасят енергия. Производство на стационарни и самоходни устройства, преносими инструменти с вграден двигател, използвани в промишлеността, строителството или бита. Производство на специално оборудване за пренос на пътници или товари (асансьори, товароподемници, ескалатори) Раздел 28 разграничава производството на машини с общо предназначение (използвани в много производствени дейности) от тези със специално предназначение (използвани в една точно определена или в няколко взаимно свързани производствени дейности) производство на други машини със специално предназначение, некласифицирани другаде или които не се използват в производствения процес (например съоръжения за панаири и паркове за развлечение, боулинг и други). - производство на метални изделия с широко приложение - раздел 25 - производство на компютърна техника, уреди за измерване и изпитване, апарати за управление и разпределение на електрическа енергия - раздели 26 и 27 - производство на превозни средства - раздели 29 и 30 @bg
scope note: Tento oddíl zahrnuje výrobu strojů a zařízení, které mechanicky nebo tepelně působí na materiály nebo na materiálech provádějí výrobní procesy (např. manipulaci, postřikování, vážení nebo balení), včetně výroby jejich mechanických komponentů, které produkují a využívají sílu. Patří sem také speciálně vyrobené díly na tyto stroje a zařízení. Do tohoto oddílu dále patří pevná, pohyblivá nebo ručně ovládaná zařízení bez ohledu na to, zda jsou určená pro průmysl, řemesla, stavebnictví, zemědělství nebo pro použití v domácnostech. Výroba speciálních zařízení pro cestující nebo nákladní dopravu patří také do tohoto oddílu. V tomto oddíle rozlišujeme mezi výrobou speciálních strojů určených pro určitá hospodářská odvětví, to znamená pro výlučné používání v některém odvětví dle CZ-NACE, nebo malou skupinou odvětví dle CZ-NACE, a strojů určených pro všeobecné využití, to znamená v široké škále hospodářských odvětvích dle CZ-NACE. Tento oddíl dále zahrnuje ostatní speciální stroje, nezahrnuté v jiných oddílech klasifikace, nezávisle na tom, zda jsou nebo nejsou využívány v určitém procesu výroby, např. pojízdné pouťové atrakce, vybavení pro automatické bowlingové dráhy. Tento oddíl nezahrnuje výrobu kovodělných výrobků pro všeobecné použití (oddíl 25), výrobu kontrolních zařízení, počítačů, měřicích a zkušebních zařízení, elektrických rozvodných a spínacích zařízení (oddíly 26 a 27) a výrobu dopravních zařízení (oddíly 29 a 30). @cs
scope note: Diese Abteilung umfasst den Bau von Maschinen, die mechanisch oder durch Wärme auf Materialien einwirken oder an Materialien Vorgänge durchführen (wie Bearbeitung, Besprühen, Wiegen oder Verpacken), einschließlich ihrer mechanischen Bestandteile, die Kraft erzeugen und anwenden, sowie speziell gefertigter Teile. Hierunter fallen feste, bewegliche oder handgeführte Vorrichtungen, ungeachtet, ob sie für Industrie und Gewerbe, den Bau, die Landwirtschaft oder für den Einsatz im Haushalt bestimmt sind. Diese Abteilung umfasst ferner die Herstellung von Hebezeugen und Fördermitteln. In dieser Abteilung wird unterschieden zwischen der Herstellung von Spezialmaschinen für bestimmte einzelne oder eine kleine Gruppe von Wirtschaftszweigen der NACE und der Herstellung von nicht wirtschaftszweigspezifischen Maschinen. Diese Abteilung umfasst ferner die Herstellung von sonstigen, anderweitig in dieser Klassifikation nicht zugeordneten Spezialmaschinen, und zwar unabhängig davon, ob sie in einem Produktionsablauf eingesetzt werden, für Kirmes-Fahrgeschäfte, Ausrüstung für automatische Bowlingbahnen usw. Ausgeschlossen sind die Herstellung von Metallerzeugnissen zur allgemeinen Verwendung (Abteilung 25), die Herstellung von Kontrollvorrichtungen, Datenverarbeitungsgeräten und -einrichtungen, Mess- und Prüfvorrichtungen, Elektrizitätsverteilungs- und -schalteinrichtungen (Abteilungen 26 und 27) und der allgemeine Fahrzeugbau (Abteilungen 29 und 30). @de
scope note: This division includes the manufacture of machinery and equipment that act independently on materials either mechanically or thermally or perform operations on materials (such as handling, spraying, weighing or packing), including their mechanical components that produce and apply force, and any specially manufactured primary parts. This includes the manufacture of fixed and mobile or hand-held devices, regardless of whether they are designed for industrial, building and civil engineering, agricultural or home use. The manufacture of special equipment for passenger or freight transport within demarcated premises also belongs within this division. This division distinguishes between the manufacture of special-purpose machinery, i.e. machinery for exclusive use in a NACE industry or a small cluster of NACE industries, and general-purpose machinery, i.e. machinery that is being used in a wide range of NACE industries. This division also includes the manufacture of other special-purpose machinery, not covered elsewhere in the classification, whether or not used in a manufacturing process, such as fairground amusement equipment, automatic bowling alley equipment, etc. This division excludes the manufacture of metal products for general use (division 25), associated control devices, computer equipment, measurement and testing equipment, electricity distribution and control apparatus (divisions 26 and 27) and general-purpose motor vehicles (divisions 29 and 30). @en
scope note: Esta división comprende la fabricación de maquinaria y equipo que actúa de manera independiente sobre los materiales por medios mecánicos o térmicos o realizan operaciones sobre los materiales (como manejo, pulverización, pesado o envasado), incluidos los componentes mecánicos que producen y aplican fuerza, y todas las componentes primarias fabricadas especialmente. Esta división comprende los dispositivos fijos, móviles o manuales, tanto si se han diseñado para su utilización en la industria o la construcción como para uso agrario o doméstico. La fabricación de equipos especiales para el transporte de pasajeros o mercancías dentro de locales acotados corresponde también a esta división. En esta división se distingue entre la fabricación de maquinaria para usos específicos, es decir, la maquinaria para un uso exclusivo en una industria o en un pequeño conjunto de industrias de la NACE, y la maquinaria de uso general, es decir aquélla que se utiliza en una amplia gama de industrias de la NACE. Esta división comprende asimismo la fabricación de otra maquinaria para usos específicos no incluida en otros apartados de la clasificación, sea utilizada o no en procesos de fabricación, como los equipos para atracciones de feria, los equipos para boleras automáticas, etc. Esta división no comprende la fabricación de productos metálicos de uso general (división 25), de dispositivos de control asociados, de equipo informático, de equipos de medición, ensayo y distribución de energía eléctrica y aparatos de control (divisiones 26y 27) y de vehículos de motor de uso general (divisiones 29 y 30). @es
scope note: Cette division couvre la fabrication de machines et d’équipements qui exercent, de manière autonome, une action mécanique ou thermique sur des matières ou qui exécutent des opérations sur des matières (par exemple, manutention, pulvérisation, pesage ou emballage), y compris leurs organes mécaniques de production et de transmission de l’énergie et les pièces détachées spécialement fabriquées. Les machines et équipements comprennent également les appareils fixes, mobiles ou portatifs, qu’ils soient utilisés dans l’industrie, l’agriculture ou la construction ou qu’ils soient destinés à un usage militaire ou privé. La fabrication d’équipements spécifiques pour le transport de marchandises ou de passagers au sein d’installations délimitées appartient également à cette division. La structure de cette division distingue la fabrication de machines d’usage spécifique, c’est-à-dire des machines destinées exclusivement à être utilisées par une branche de la NACE ou un petit groupe de branches de la NACE des machines d’usage général, c’est-à-dire les machines utilisées dans un grand nombre de branches de la NACE. Cette division comprend également la fabrication de machines diverses d’usage spécifique, non classées ailleurs, utilisées ou non dans le cadre d’une opération de transformation, comme les manèges et attractions foraines, les installations de bowling, etc. Cette division ne comprend pas le travail des métaux d’usage général (division 25) ni la fabrication connexe d’appareils de contrôle, de matériel informatique, d’instruments de mesure et de contrôle, d’installations électriques (divisions 26 et 27) et de matériels de transport d’usage général (divisions 29 et 30). @fr
scope note: Ovaj odjeljak uključuje proizvodnju strojeva i uređaja koji samostalno djeluju na materijale, bilo mehanički bilo toplinski ili izvode operacije na materijalima (kao što je rukovanje, raspršivanje, vaganje ili pakiranje), uključujući njihove mehaničke komponente koje proizvode ili primjenjuju silu i bilo koje specijalno proizvedene primarne dijelove. Ovaj odjeljak uključuje fiksne i mobilne ili ručne (prenosive) naprave, neovisno o tome jesu li namijenjene upotrebi u industriji, građevinarstvu, poljoprivredi ili u kućanstvu. Proizvodnja specijalnih uređaja za prijevoz putnika ili tereta unutar unaprijed određenog razgraničenja također pripadaju ovom odjeljku. Ovaj odjeljak razlikuje proizvodnju strojeva za specijalne namjene, tj. strojeva koji se isključivo koriste u prerađivačkoj industriji klasifikacije NKD ili u malim skupinama klasifikacije NKD te strojeva opće namjene, tj. koji se koriste u najrazličitijim industrijama klasifikacije NKD. Ovaj odjeljak također uključuje ostale strojeve za specijalnu namjenu, koji nisu uključeni nigdje drugdje u klasifikaciji bez obzira na to koriste li se ili ne koriste u proizvodnim procesima kao što su sprave za zabavu na otvorenom (lunapark i sl.), oprema za automatizirane kuglane itd. Ovaj odjeljak isključuje proizvodnju metalnih proizvoda za opće namjene (odjeljak 25), pridružene kontrolne uređaje, računalnu opremu, uređaje za mjerenje i testiranje, aparate za distribuciju i kontrolu električne energije (odjeljak 26 i 27) i motorna vozila opće namjene (odjeljak 29 i 30).
scope note: Į šį skyrių įeina mašinų ir įrangos, kuriomis nepriklausomai apdorojamos medžiagos tiek mechaniniu, tiek terminiu būdu arba atliekamos operacijos su medžiagomis (pvz., krovinių tvarkymas, purškimas, svėrimas ar pakavimas), gamyba, įskaitant jų mechaninių komponentų, kurie kuria arba naudoja energiją, taip pat ir bet kokių specialiai gaminamų pirminių dalių gamyba. Čia įeina ir stacionarieji, ir kilnojamieji, taip pat rankiniai įtaisai, nepaisant ar tai pramoniniai, ar statybiniai, ar civilinės inžinerijos, ar žemės ūkio, ar namų ūkio įtaisai. Šiam skyriui taip pat priklauso specialiosios keleivių ar krovinių vežimui apribotose valdose skirtos įrangos gamyba. Šiame skyriuje specialios paskirties mašinų, t.y. mašinų, skirtų naudoti tik vienoje NACE veiklos rūšyje ar nedidelėje veiklos rūšių grupėje, gamyba atskiriama nuo bendros paskirties mašinų, naudojamų daugelyje NACE klasifikuojamų veiklos rūšių, gamybos. Į šį skyrių taip pat įeina kitos, niekur kitur šiame klasifikatoriuje nenurodytos, naudojamos arba nenaudojamos gaminių gamybai specialiosios paskirties mašinų, tokių kaip atrakcionų įranga, automatinė boulingo takelių įranga ir kt., gamyba Į šį skyrių neįeina bendrojo naudojimo metalo gaminių (25 skyrius), susietųjų valdymo įtaisų, kompiuterių įrangos, matavimo ir bandymo įrangos, elektros skirstomosios ir valdymo įrangos (26 – 27 skyriai) ir bendrosios paskirties variklinių transporto priemonių (29 – 30 skyriai) gamyba. @lt
scope note: Этот класс включает: - производство гидравлических и пневматических компонентов (включая гидравлические помпы для гидравлических моторов, гидравлические и пневматических цилиндры, клапаны, шланги и гарнитуру) - производство пневматического оборудования для очистки сжатого воздуха для использования в пневматических системах - производство гидравлических систем - производство гидравлического трансмиссионного оборудования - производство приборов объемной гидропередачи Этот класс исключает: - производство компрессоров, см. 28.13 - производство насосов для не гидравлического использования, см. 28.13 - производство клапанов для приборов, вырабатывающих не гидравлическую энергию, см. 28.14 - производство механического трансмиссионного оборудования, см. 28.15 @ru
scope note: Bu bölüm, güç üreten ve uygulayan mekanik bileşenler ve herhangi bir özel amaç için imal edilmiş temel parçalar da dahil mekanik veya termal olarak materyaller üzerinde bağımsızca hareket eden ya da materyaller üzerinde (işleme, püskürtme, bastırma ve paketleme gibi) işlemler yapan makinelerin ve teçhizatların imalatını kapsamaktadır. Bu bölüm, sanayide, bina ve bina dışı inşaat işlerinde, tarımda veya evde kullanılmak üzere tasarlanmış olsun ya da olmasın sabit ve hareketli ya da el aletleri imalatını kapsamaktadır. Yerleşke içerisinde yük ve yolcu taşımada kullanılan özel araçların imalatı da bu bölümün içindedir. Bu bölüm, NACE`de yer alan bir sanayide veya sanayilerin küçük bir grubunda özel olarak kullanılan makineler gibi özel amaçlı makinelerin imalatı ile sanayilerin büyük bir bölümünde kullanılan makineler gibi genel amaçlı makinelerin imalatını birbirinden ayırmaktadır. Bu bölüm ayrıca, panayır alanı eğlence teçhizatları, otomatik bovling salonu teçhizatları vb. gibi imalat sürecinde kullanılsın ya da kullanılmasın başka bir yerde sınıflandırılmayan diğer özel amaçlı makinelerin imalatını da kapsamaktadır. Genel kullanım amacıyla metal ürünlerin imalatı (bölüm 25), birleştirilmiş kontrol cihazlarının, bilgisayar donanımlarının, ölçme ve test donanımlarının, elektrik kontrol ve dağıtım cihazlarının imalatı (bölüm 26 ve 27) ve genel amaçlı motorlu taşıtların imalatı (bölüm 29 ve 30 ) bu bölümün kapsamı dışındadır. @tr
preferred label: Производство на машини и оборудване, с общо и специално предназначение @bg
preferred label: Výroba strojů a zařízení j. n. @cs
preferred label: Fremstilling af maskiner og udstyr i.a.n. @da
preferred label: Maschinenbau @de
preferred label: Κατασκευή μηχανημάτων και ειδών εξοπλισμού π.δ.κ.α. @el
preferred label: Fabricación de maquinaria y equipo n.c.o.p. @es
preferred label: Mujal liigitamata masinate ja seadmete tootmine @et
preferred label: Muiden koneiden ja laitteiden valmistus @fi
preferred label: Fabrication de machines et équipements n.c.a. @fr
preferred label: Gép, gépi berendezés gyártása
preferred label: Fabbricazione di macchinari e apparecchiature n.c.a. @it
preferred label: Niekur kitur nepriskirtų mašinų ir įrangos gamyba @lt
preferred label: Citur neklasificētu iekārtu, mehānismu un darba mašīnu ražošana @lv
preferred label: Manifattura ta' magni u tagħmir n.e.c. @mt
preferred label: Vervaardiging van machines, apparaten en werktuigen, n.e.g. @nl
preferred label: Produksjon av maskiner og utstyr til generell bruk, ikke nevnt annet sted @no
preferred label: Produkcja maszyn i urządzeń, gdzie indziej niesklasyfikowana @pl
preferred label: Fabricação de máquinas e equipamentos, n.e. @pt
preferred label: Fabricarea de maşini, utilaje şi echipamente n.c.a. @ro
preferred label: Производство машин и оборудования, не включенных в другие категории @ru
preferred label: Výroba strojov a zariadení i. n. @sk
preferred label: Proizvodnja drugih strojev in naprav @sl
preferred label: Tillverkning av övriga maskiner @sv
preferred label: Başka yerde sınıflandırılmamış makine ve ekipman imalatı @tr
broader: MANUFACTURING
narrower: Manufacture of general-purpose machinery
narrower: Manufacture of other general-purpose machinery
narrower: Manufacture of agricultural and forestry machinery
narrower: Manufacture of metal forming machinery and machine tools
narrower: Manufacture of other special-purpose machinery

Manufacture of general-purpose machinery
type: Concept
notation: 28.1
status: valid
status modified: 2013-10-18
accepted date: 2013-10-18
in scheme: Statistical Classification of Economic Activities in the European Community, Rev. 2 (2008)
scope note: Этот класс включает: - производство воздушных или вакуумных насосов, воздушных или прочих газовых компрессоров - производство насосов для жидкостей с измерительными устройствами или без них - производство насосов для двигателей внутреннего сгорания: масляных, водяных и топливных насосов для автотранспортных средств и т.д. Этот класс также включает: - производство ручных насосов Этот класс исключает: - производство гидравлического и пневматического оборудования, см. 28.12 @ru
preferred label: Производство на машини с общо предназначение @bg
preferred label: Výroba strojů a zařízení pro všeobecné účely @cs
preferred label: Fremstilling af maskiner til generelle formål @da
preferred label: Herstellung von nicht wirtschaftszweigspezifischen Maschinen @de
preferred label: Κατασκευή μηχανημάτων γενικής χρήσης @el
preferred label: Fabricación de maquinaria de uso general @es
preferred label: Üldmasinate tootmine @et
preferred label: Yleiskäyttöön tarkoitettujen voimakoneiden valmistus @fi
preferred label: Fabrication de machines d'usage général @fr
preferred label: Általános rendeltetésű gép gyártása
preferred label: Fabbricazione di macchine di impiego generale @it
preferred label: Bendrosios paskirties mašinų gamyba @lt
preferred label: Universālu mehānismu ražošana @lv
preferred label: Manifattura ta' magni għal għanijiet ġenerali @mt
preferred label: Vervaardiging van machines en apparaten voor algemeen gebruik @nl
preferred label: Produksjon av maskiner og utstyr til generell bruk @no
preferred label: Produkcja maszyn ogólnego przeznaczenia @pl
preferred label: Fabricação de máquinas e de equipamentos para uso geral @pt
preferred label: Fabricarea de maşini şi utilaje de utilizare generală @ro
preferred label: Производство машин общего назначения @ru
preferred label: Výroba strojov na všeobecné účely @sk
preferred label: Proizvodnja strojev za splošne namene @sl
preferred label: Tillverkning av maskiner för allmänt ändamål @sv
preferred label: Genel amaçlı makinelerin imalatı @tr
broader: Manufacture of machinery and equipment n.e.c.
narrower: Manufacture of engines and turbines, except aircraft, vehicle and cycle engines
narrower: Manufacture of fluid power equipment
narrower: Manufacture of other pumps and compressors
narrower: Manufacture of other taps and valves
narrower: Manufacture of bearings, gears, gearing and driving elements

Manufacture of engines and turbines, except aircraft, vehicle and cycle engines
type: Concept
notation: 28.11
status: valid
status modified: 2013-10-18
accepted date: 2013-10-18
in scheme: Statistical Classification of Economic Activities in the European Community, Rev. 2 (2008)
scope note: - производство на двигатели с вътрешно горене, без авиационни, автомобилни и мотоциклетни: • двигатели за плавателни съдове • двигатели за локомотиви и мотриси - производство на бутала, бутални пръстени, карбуратори и други за двигатели с вътрешно горене - производство на смукателни и изпускателни клапани за двигатели с вътрешно горене - производство на турбини и части за тях: • парни турбини • хидравлични турбини, колела и регулатори за тях • вятърни турбини • газови турбини, без турбореактивни и турбовитлови двигатели - производство на турбинни парогенератори - производство на турбогенераторни групи - производство на промишлени двигатели - производство на електрически генератори (без турбогенераторни групи) - 27.11 - производство на първични двигатели за генераторни групи (без турбогенераторни групи) - 27.12 - производство на електрически части и устройства за двигатели с вътрешно горене - 29.31 - производство на автомобилни, мотоциклетни и авиационни двигатели - 29.10, 30.30, 30.91 - производство на турбореактивни и турбовитлови двигатели - 30.30 @bg
scope note: Z: - výrobu pístových motorů s vnitřním spalováním a jejich dílů (kromě motorů pro motorová vozidla a letadla) a cyklických pohonných motorů: • lodních motorů • motorů kolejových vozidel - výrobu pístů, pístních kroužků, karburátorů apod. pro všechny motory s vnitřním spalováním, dieselové motory atd. - výrobu sacích a výfukových ventilů pro motory s vnitřním spalováním - výrobu turbín a jejich dílů: • parních turbín • vodních turbín, vodních kol a jejich regulátorů • větrných turbín • plynových turbín, kromě proudových nebo turbovrtulových pro pohon letadel - výrobu parních turbosoustrojí - výrobu soustrojí turbína-generátor - výrobu motorů pro průmyslové účely N: - výrobu elektrických generátorů a generátorových soustrojí, kromě soustrojí turbína-generátor (27.11) - výrobu elektrických zařízení a komponentů pro motory s vnitřním spalováním (29.31) - výrobu motorů pro motorová vozidla, letadla a cyklických pohonných motorů ( 29.10, 30.30, 30.91) - výrobu proudových nebo turbovrtulových motorů (30.30) @cs
scope note: Diese Klasse umfasst: - Herstellung von Kolbenverbrennungsmotoren und Teilen davon außer für Luft- und Straßenfahrzeuge: • Schiffsmotoren • Schienenfahrzeugmotoren - Herstellung von Kolben, Kolbenringen und Vergasern und dergleichen für alle Kolbenverbrennungsmotoren, Dieselmotoren usw. - Herstellung von Ein- und Auslassventilen für Kolbenverbrennungsmotoren - Herstellung von Turbinen und Teilen dafür: • Dampfturbinen • Wasserkraftturbinen, Wasserräder und Steuervorrichtungen dafür • Windturbinen • Gasturbinen (ohne Turbo-Strahltrieb- und Turbo-Propellertriebwerke für den Antrieb von Flugzeugen) - Herstellung von Dampfturbinenanlagen - Herstellung von Turbinen-Generator-Aggregaten - Herstellung von Industiemotoren Diese Klasse umfasst nicht: - Herstellung von Generatoren zur Stromerzeugung (außer Turbinen-Generator-Aggregaten) (s. 27.11) - Herstellung von Motor-Generatoren-Aggregaten (außer Turbinen-Generator-Aggregaten) (s. 27.11) - Herstellung von elektrischen Anlagen und Bauteilen für Verbrennungsmotoren (s. 29.31) - Herstellung von Antriebsmaschinen für Luft- und Straßenfahrzeuge (s. 29.10, 30.30, 30.91) - Herstellung von Turbo-Strahl- und Turbo-Propellertriebwerke (s. 30.30) @de
scope note: This class includes: - manufacture of internal combustion piston engines, except motor vehicle, aircraft and cycle propulsion engines: • marine engines • railway engines - manufacture of pistons, piston rings, carburettors and such for all internal combustion engines, diesel engines etc. - manufacture of inlet and exhaust valves of internal combustion engines - manufacture of turbines and parts thereof: • steam turbines and other vapour turbines • hydraulic turbines, waterwheels and regulators thereof • wind turbines • gas turbines, except turbojets or turbo propellers for aircraft propulsion - manufacture of boiler-turbine sets - manufacture of turbine-generator sets - manufacture of engines for industrial application This class excludes: - manufacture of electric generators (except turbine generator sets), see 27.11 - manufacture of prime mover generator sets (except turbine generator sets), see 27.11 - manufacture of electrical equipment and components of internal combustion engines, see 29.31 - manufacture of motor vehicle, aircraft or cycle propulsion engines, see 29.10, 30.30, 30.91 - manufacture of turbojets and turbo propellers, see 30.30 @en
scope note: Esta clase comprende: - la fabricación de motores de pistones de combustión interna, excepto los destinados a vehículos automóviles, aeronaves y motocicletas: • motores para barcos • motores para ferrocarril - la fabricación de pistones, anillos de pistón, carburadores y piezas análogas para todo tipo de motores de combustión interna, motores diésel, etc. - la fabricación de válvulas de admisión y escape para motores de combustión interna - la fabricación de turbinas y piezas para las mismas: • turbinas de vapor de agua y de vapores de otras clases • turbinas hidráulicas, ruedas hidráulicas y reguladores para las mismas • turbinas eólicas • turbinas de gas, excepto turborreactores y turbopropulsores para la propulsión de aeronaves - la fabricación de conjuntos de caldera y turbina - la fabricación de grupos turbogeneradores - la fabricación de motores para uso industrial Esta clase no comprende: - la fabricación de generadores eléctricos (excepto grupos turbogeneradores) (véase 27.11) - la fabricación de grupos generadores de energía primaria (excepto grupos turbogeneradores) (véase 27.11) - la fabricación de equipos y componentes eléctricos para motores de combustión interna (véase 29.31) - la fabricación de motores destinados a la propulsión de vehículos de motor, aeronaves y motocicletas (véanse 29.10, 30.30 y 30.91) - la fabricación de turborreactores y turbopropulsores (véase 30.30) @es
scope note: Cette classe comprend: - la fabrication de moteurs à piston à combustion interne, à l’exclusion des moteurs pour véhicules automobiles, aéronefs et motocycles: • moteurs pour navires et bateaux • moteurs pour véhicules ferroviaires - la fabrication de moteurs de pistons, segments de piston, carburateurs pour tous types de moteurs à combustion interne, moteurs diesel - la fabrication de soupapes d’admission et d’échappement pour moteurs à combustion interne - la fabrication de turbines et de leurs parties: • turbines produisant de la vapeur d’eau ou d’autres types de vapeur • turbines hydrauliques, roues hydrauliques et leurs régulateurs • turbines éoliennes • turbines à gaz, à l’exception des turboréacteurs et des turbopropulseurs pour la propulsion d’aéronefs - la fabrication d’ensembles turbine-chaudière - la fabrication de turbines génératrices - la fabrication de moteurs pour des applications industrielles Cette classe ne comprend pas: - la fabrication de génératrices électriques (à l’exception des turbines génératrices), voir 27.11 - la fabrication de groupes électrogènes à moteur (à l’exception des turbines génératrices), voir 27.11 - la fabrication d’équipements et de composants électriques pour moteurs à combustion interne, voir 29.31 - la fabrication de moteurs pour la propulsion de véhicules automobiles, d’aéronefs ou de motocycles, voir 29.10, 30.30 et 30.91 - la fabrication de turboréacteurs et de turbopropulseurs, voir 30.30 @fr
scope note: Ovaj razred uključuje: - proizvodnju klipnih motora s unutarnjim izgaranjem, osim motora vozila, zrakoplova i motocikla: • brodskih motora • motora za lokomotive - proizvodnju klipova, klipnih prstenova, karburatora i sličnoga za sve motore s unutarnjim izgaranjem, dizelske motore i sl. - proizvodnju ulaznih i ispušnih ventila za motore s unutarnjim izgaranjem - proizvodnju turbina i njihovih dijelova: • turbina na vodenu paru i ostalih parnih turbina • hidrauličnih turbina, vodenih kola i njihovih regulatora • turbina na vjetar • plinskih turbina, osim turbomlaznih i turbopropelerskih za pogon zrakoplova - proizvodnju svih jedinica za kotlove turbine - proizvodnju svih jedinica za generatorske turbine - proizvodnju motora za industrijsku primjenu Ovaj razred isključuje: - proizvodnju električnih generatora (osim jedinica generatorskih setova turbina), vidi 27.11 - proizvodnju generatorskih setova primarnih pokretača (osim jedinica generatorskih setova turbina), vidi 27.11 - proizvodnju električne opreme i dijelova motora s unutarnjim izgaranjem, vidi 29.31 - proizvodnju motora za vozila, zrakoplove ili motocikle, vidi 29.10, 30.30, 30.91 - proizvodnju turbomlaznih zrakoplova i turbopropelera, vidi 30.30
scope note: Į šią klasę įeina: - stūmoklinių vidaus degimo variklių, išskyrus variklinių transporto priemonių, orlaivių ir motociklų variklius, gamyba: • laivų variklių gamyba • lokomotyvų variklių gamyba - visų rūšių vidaus degimo ir dyzelinių variklių stūmoklių, stūmoklių žiedų, karbiuratorių ir panašių dalių gamyba - vidaus degimo variklių įleidžiamųjų ir išleidžiamųjų vožtuvų gamyba - turbinų ir jų dalių gamyba: • vandens arba kitokių garų turbinų • hidraulinių turbinų, vandens ratų ir jų reguliatorių • vėjo turbinų • dujų turbinų, išskyrus orlaivių turboreaktyvinius ar turbosraigtinius variklius - katilų turbinų blokų gamyba - turbogeneratorinių agregatų gamyba - pramonėje naudojamų variklių gamyba Į šią klasę neįeina: - elektros generatorių (išskyrus turbogeneratorinių agregatų) gamyba, žr. 27.11 - pirminių generatorinių agregatų (išskyrus turbogeneratorinius agregatus) gamyba, žr. 27.11 - vidaus degimo variklių elektros įrangos ir komponentų gamyba, žr. 29.31 - variklinių transporto priemonių, orlaivių ar stūmoklinių motociklų variklių gamyba, žr. 29.10, 30.30, 30.91 - turboreaktyvinių ir turbosraigtinių variklių gamyba, žr. 30.30 @lt
scope note: Этот класс включает: - производство промышленных кранов и вентилей, включая регулирующие клапаны и водозаборные краны - производство умывальных кранов и вентилей - производство отопительных кранов и вентилей Этот класс исключает: - производство вентилей из не усиленной вулканизированной резины, стекла или керамических материалов, см. 22.19, 23.19 или 23.44 - производство впускных и выпускных клапанов для двигателей внутреннего сгорания, см. 28.11 - производство гидравлических и пневматических клапанов и оборудования для очистки сжатого воздуха для использования в пневматических системах, см. 28.12 @ru
scope note: Bu sınıf aşağıdakileri kapsamaktadır; - içten yanmalı pistonlu motor imalatı (motorlu taşıt, uçak ve motosiklet motorları hariç): •deniz taşıtlarına ait motorlar, •lokomotif motorları. - tüm içten yanmalı motorlar, dizel motorlar vb.lerinde yer alan pistonların, piston sekmanlarının, karbüratörlerin imalatı, - içten yanmalı motorlar için egzoz ve emme supaplarının imalatı, - türbin ve türbin parçalarının imalatı: •su buharı türbinleri ve diğer buhar türbinleri, •hidrolik türbinler ve bunların su çarkları ve regülatörleri (düzenleyicileri), •rüzgar türbinleri, •gaz türbinleri (uçaklardaki turbo jetler veya turbo pervaneler hariç). - kazan türbin setlerinin imalatı, - türbin-jeneratör setlerinin imalatı, - sanayide kullanım amaçlı motor imalatı. Kapsam dışı olanlar; - elektrik jeneratörlerinin imalatı (türbin-jeneratör setleri hariç), bkz. 27.11, - ilk hareket ettirici jeneratör setleri imalatı (türbin-jeneratör setleri hariç), bkz. 27.11, - içten yanmalı motorların elektrikli donanım ve bileşenlerinin imalatı, bkz. 29.31, - motorlu taşıtlar, uçaklar veya motosikletler için tahrikli motorların imalatı, bkz. 29.10, 30.30, 30.91, - turbo jetler veya turbo pervanelerin imalatı, bkz. 30.30. @tr
preferred label: Производство на турбини и двигатели, без авиационни, автомобилни и мотоциклетни @bg
preferred label: Výroba motorů a turbín, kromě motorů pro letadla, automobily a motocykly @cs
preferred label: Fremstilling af motorer og turbiner undtagen motorer til flyvemaskiner, motorkøretøjer og knallerter @da
preferred label: Herstellung von Verbrennungsmotoren und Turbinen (ohne Motoren für Luft- und Straßenfahrzeuge) @de
preferred label: Κατασκευή κινητήρων και στροβίλων, με εξαίρεση τους κινητήρες αεροσκαφών, οχημάτων και δικύκλων @el
preferred label: Fabricación de motores y turbinas, excepto los destinados a aeronaves, vehículos automóviles y ciclomotores @es
preferred label: Mootorite ja turbiinide tootmine, v.a õhusõidukite, mootorsõidukite ja mootorrataste mootorid @et
preferred label: Moottorien ja turbiinien valmistus (pl. lentokoneiden ja ajoneuvojen moottorit) @fi
preferred label: Fabrication de moteurs et turbines, à l'exception des moteurs d'avions et de véhicules @fr
preferred label: Motor, turbina gyártása (kivéve: légi, közúti jármű-motor)
preferred label: Fabbricazione di motori e turbine, esclusi i motori per aeromobili, veicoli e motocicli @it
preferred label: Variklių ir turbinų, išskyrus orlaivių, transporto priemonių ir motociklų variklius, gamyba @lt
preferred label: Dzinēju un turbīnu ražošana, izņemot lidaparātu, automobiļu un divriteņu transportlīdzekļu dzinējus @lv
preferred label: Manifattura ta' magni u turbini, għajr inġenji ta' l-ajru, magni tal-vetturi u tal-muturi @mt
preferred label: Vervaardiging van motoren en turbines, exclusief motoren voor luchtvaartuigen, motorvoertuigen en bromfietsen @nl
preferred label: Produksjon av motorer og turbiner, unntatt motorer til luftfartøyer og motorvogner @no
preferred label: Produkcja silników i turbin, z wyłączeniem silników lotniczych, samochodowych i motocyklowych @pl
preferred label: Fabricação de motores e turbinas (excepto motores para aeronaves, automóveis e motociclos) @pt
preferred label: Fabricarea de motoare şi turbine (cu excepţia celor pentru avioane, autovehicule şi motociclete.) @ro
preferred label: Производство двигателей и турбин, кроме авиационных, автомобильных и мотоциклетных двигателей @ru
preferred label: Výroba motorov a turbín, okrem motorov pre lietadlá, autá a bicykle @sk
preferred label: Proizvodnja motorjev in turbin, razen za letala in motorna vozila @sl
preferred label: Tillverkning av motorer och turbiner utom för luftfartyg och fordon @sv
preferred label: Motor ve türbin imalatı; uçak, motorlu taşıt ve motosiklet motorları hariç @tr
broader: Manufacture of general-purpose machinery

Manufacture of fluid power equipment
type: Concept
notation: 28.12
status: valid
status modified: 2013-10-18
accepted date: 2013-10-18
in scheme: Statistical Classification of Economic Activities in the European Community, Rev. 2 (2008)
scope note: - производство на хидравлични и пневматични възли и части (вкл. хидравлични помпи и двигатели, хидравлични и пневматични цилиндри, клапани, маркучи и фитинги за тях) - производство на съоръжения за подготовка на въздуха за пневматични системи - производство на хидравлични системи - производство на хидравлични предавки - производство на хидростатични предавки - производство на компресори - 28.13 - производство на помпи, различни от хидравличните - 28.13 - производство на вентили и клапани, различни от хидравличните - 28.14 - производство на механични предавки - 28.15 @bg
scope note: Z: - výrobu hydraulických a pneumatických komponentů (včetně hydraulických čerpadel a motorů, hydraulických a pneumatických válců, ventilů, hadic a fitinek) - výrobu zařízení pro úpravu vzduchu pro použití v pneumatických systémech - výrobu proudových zařízení (kapalných napájecích sítí) - výrobu hydraulických hnacích ústrojí - výrobu hydrostatických pohonů - výrobu hydraulických převodů N: - výrobu kompresorů (28.13) - výrobu čerpadel pro jiná než hydraulická zařízení (28.13) - výrobu ventilů pro jiná než proudová zařízení (28.14) - výrobu mechanických převodových zařízení (28.15) @cs
scope note: Diese Klasse umfasst: - Herstellung von hydraulischen und pneumatischen Bauteilen (einschließlich hydraulische Pumpen und Motoren sowie hydraulische und pneumatische Zylinder, hydraulische und pneumatische Ventile, hydraulische und pneumatische Schläuche und Verbinder) - Herstellung von Luftaufbereitungseinrichtungen für pneumatische Systeme - Herstellung von Hydrosystemen - Herstellung von Hydraulikgetrieben - Herstellung von hydrostatischen Antrieben Diese Klasse umfasst nicht: - Herstellung von Kompressoren (s. 28.13) - Herstellung von Pumpen für nichthydraulische Anwendungen (s. 28.13) - Herstellung von Ventilen für andere als hydraulische und pneumatische Anwendungen (s. 28.14) - Herstellung von mechanischen Kraftübertragungselementen (s. 28.15) @de
scope note: This class includes: - manufacture of hydraulic and pneumatic components (including hydraulic pumps, hydraulic motors, hydraulic and pneumatic cylinders, hydraulic and pneumatic valves, hydraulic and pneumatic hose and fittings) - manufacture of air preparation equipment for use in pneumatic systems - manufacture of fluid power systems - manufacture of hydraulic transmission equipment - manufacture of hydrostatic transmissions This class excludes: - manufacture of compressors, see 28.13 - manufacture of pumps for non-hydraulic applications, see 28.13 - manufacture of valves for non-fluid power applications, see 28.14 - manufacture of mechanical transmission equipment, see 28.15 @en
scope note: Esta clase comprende: - la fabricación de componentes hidráulicos y neumáticos (incluyendo bombas hidráulicas, motores hidráulicos, cilindros hidráulicos y neumáticos, válvulas hidráulicas y neumáticas, mangueras y accesorios hidráulicos y neumáticos) - la fabricación de equipos de preparación de aire para su uso en sistemas neumáticos - la fabricación de sistemas de transmisión de energía mediante fluidos - la fabricación de equipos hidráulicos de transmisión - la fabricación de transmisiones hidrostáticas Esta clase no comprende: - la fabricación de compresores (véase 28.13) - la fabricación de bombas para aplicaciones no hidráulicas (véase 28.13) - la fabricación de válvulas para aplicaciones de transmisión de energía no basadas en fluidos (véase 28.14) - la fabricación de equipos de transmisión mecánica (véase 28.15) @es
scope note: Cette classe comprend: - la fabrication d’appareils hydrauliques et pneumatiques (y compris pompes hydrauliques, moteurs hydrauliques, cylindres hydrauliques et pneumatiques, valves hydrauliques et pneumatiques et accessoires) - la fabrication de systèmes de préparation de l’air pour une utilisation dans des systèmes pneumatiques - la fabrication de systèmes hydrauliques et pneumatiques - la fabrication d’organes hydrauliques de transmission - la fabrication de transmissions hydrostatiques Cette classe ne comprend pas: - la fabrication de compresseurs, voir 28.13 - la fabrication de pompes pour des applications non hydrauliques, voir 28.13 - la fabrication de valves pour des applications autres que hydrauliques et pneumatiques, voir 28.14 - la fabrication d’équipements de transmission mécanique, voir 28.15 @fr
scope note: Ovaj razred uključuje: - proizvodnju hidrauličnih i pneumatskih dijelova (uključujući hidraulične crpke, hidraulične motore, hidraulične i pneumatske cilindre, hidraulične i pneumatske klipove, hidraulične i pneumatske cijevi i opremu) - proizvodnju zračne opreme za korištenje u pneumatskim sustavima - proizvodnju fluidnog elektroenergetskog sustava - proizvodnju hidrauličnih pogonskih sustava - proizvodnju hidrostatičnih prijenosnih uređaja Ovaj razred isključuje: - proizvodnju kompresora, vidi 28.13 - proizvodnju crpki za nehidrauličnu uporabu, vidi 28.13 - proizvodnju ventila za nehidrauličnu uporabu, vidi 28.14 - proizvodnju mehaničkih prijenosnih uređaja, vidi 28.15
scope note: Į šią klasę įeina: - hidraulinių ir pneumatinių komponentų (įskaitant hidraulinius siurblius, hidraulinius variklius, hidraulinius ir pneumatinius cilindrus, hidraulines ir pneumatines sklendes, hidraulines ir pneumatines žarnas bei jungiamąsias detales) gamyba - oro paruošimo įrangos, naudojamos pneumatinėse sistemose, gamyba - hidraulinių sistemų gamyba - hidraulinių pavarų įrangos gamyba - hidrostatinių pavarų įrangos gamyba Į šią klasę neįeina: - kompresorių gamyba, žr. 28.13 - nehidraulinės paskirties siurblių gamyba, žr. 28.13 - nehidraulinės energijos taikmenų sklendžių gamyba, žr. 28.14 - mechaninių pavarų įrangos gamyba, žr. 28.15 @lt
scope note: Этот класс включает: - производство шариковых и роликовых опор и комплектующих - производство механического силового трансмиссионного оборудования: • трансмиссионных валов: распределительных/кулачковых, коленчатых валов, коленчатых рычагов и т.д. • корпусов подшипника и опор вала - производство механизмов, приводов, коробок передач и прочих устройств для переключения скорости - производство зажимных устройств и муфт сцепления валов - производство маховиков, шкивов и блоков - производство шарнирных соединений для цепи сдвига гребёнок - производство приводных цепей Этот класс исключает: - производство прочих цепей, см. 25.93 - производство гидравлического трансмиссионного оборудования, см. 28.12 - производство приборов объемных гидропередач, см. 28.12 - производство электромагнитных зажимных устройств, см. 29.31 - производство запасных комплектующих для силового трансмиссионного оборудования для автотранспортных средств или воздушных судов, см. разделы 29 и 30 @ru
scope note: Bu sınıf aşağıdakileri kapsamaktadır; - hidrolik ve pnömatik bileşenlerin imalatı (hidrolik pompalar, hidrolik motorlar, hidrolik ve pnömatik silindirler, hidrolik ve pnömatik valflar, hidrolik ve pnömatik hortumlar ve bağlantı parçaları dahil), - pnömatik sistemlerde kullanmak üzere hava hazırlama ekipmanı imalatı, - akışkan güç sistemleri imalatı, - hidrolik transmisyon donanımı imalatı, - hidrostatik transmisyon imalatı. Kapsam dışı olanlar; - kompresör imalatı, bkz. 28.13, - hidrolik olmayan uygulamalar için pompa imalatı, bkz. 28.13, - akışkan gücü ile çalışmayan uygulamalar için valf imalatı, bkz. 28.14, - mekanik transmisyon ekipmanı imalatı, bkz., 28.15. @tr
preferred label: Производство на хидравлични помпи, хидравлични и пневматични двигатели @bg
preferred label: Výroba hydraulických zařízení @cs
preferred label: Fremstilling af hydraulisk udstyr @da
preferred label: Herstellung von hydraulischen und pneumatischen Komponenten und Systemen @de
preferred label: Κατασκευή εξοπλισμού υδραυλικής ενέργειας @el
preferred label: Fabricación de equipos de transmisión hidráulica y neumática @es
preferred label: Hüdrauliliste ja pneumaatiliste jõuseadmete tootmine @et
preferred label: Hydraulisten voimalaitteiden valmistus @fi
preferred label: Fabrication d'équipements hydrauliques et pneumatiques @fr
preferred label: Hidraulikus, pneumatikus berendezés gyártása
preferred label: Fabbricazione di apparecchiature fluidodinamiche @it
preferred label: Hidraulinės energijos įrangos gamyba @lt
preferred label: Hidraulisko iekārtu ražošana @lv
preferred label: Manifattura ta' tagħmir idrawliku għall-enerġija @mt
preferred label: Vervaardiging van hydraulische apparatuur @nl
preferred label: Produksjon av komponenter til hydraulisk og pneumatisk utstyr @no
preferred label: Produkcja sprzętu i wyposażenia do napędu hydraulicznego i pneumatycznego @pl
preferred label: Fabricação de equipamento hidráulico e pneumático @pt
preferred label: Fabricarea de motoare hidraulice @ro
preferred label: Производство гидравлического оборудования @ru
preferred label: Výroba zariadení na kvapalný pohon @sk
preferred label: Proizvodnja naprav za fluidno tehniko @sl
preferred label: Tillverkning av fluidteknisk utrustning @sv
preferred label: Akışkan gücü ile çalışan ekipmanların imalatı @tr
broader: Manufacture of general-purpose machinery

Manufacture of other pumps and compressors
type: Concept
notation: 28.13
status: valid
status modified: 2013-10-18
accepted date: 2013-10-18
in scheme: Statistical Classification of Economic Activities in the European Community, Rev. 2 (2008)
scope note: - производство на въздушни и вакуум помпи, въздушни компресори или компресори за други газове - производство на помпи за течности, дори с измервателни уреди - производство на помпи за двигатели с вътрешно горене: за гориво, за масла или за охлаждаща течност - производство на ръчни помпи - производство на хидравлични и пневматични помпи и двигатели - 28.12 @bg
scope note: Z: - výrobu vzduchových nebo vakuových čerpadel, kompresorů vzduchových nebo na jiný plyn - výrobu čerpadel na kapaliny, vybavené nebo nevybavené měřicím zařízením - výrobu čerpadel vhodných pro motory s vnitřním spalováním: • čerpadel oleje, vody a pohonných hmot pro motorová vozidla atd. ZT: - výrobu ručních pump N: - výrobu hydraulických a pneumatických zařízení (28.12) @cs
scope note: Diese Klasse umfasst: - Herstellung von Luft- und Vakuumpumpen, Luft- und anderen Gaskompressoren - Herstellung von Pumpen für Flüssigkeiten, auch mit Messvorrichtung - Herstellung von Pumpen für den Anbau an Kolbenverbrennungsmotoren: Öl-, Wasser- und Kraftstoffpumpen für Kraftfahrzeuge Diese Klasse umfasst ferner: - Herstellung von Handpumpen Diese Klasse umfasst nicht: - Herstellung von Hydraulik- und Pneumatikausrüstungen (s. 28.12) @de
scope note: This class includes: - manufacture of air or vacuum pumps, air or other gas compressors - manufacture of pumps for liquids whether or not fitted with a measuring device - manufacture of pumps designed for fitting to internal combustion engines: oil, water and fuel pumps for motor vehicles etc. This class also includes: - manufacture of hand pumps This class excludes: - manufacture of hydraulic and pneumatic equipment, see 28.12 @en
scope note: Esta clase comprende: - la fabricación de bombas de aire o de vacío y de compresores de gas o aire - la fabricación de bombas para líquidos, estén o no equipados con un dispositivo de medición - la fabricación de bombas diseñadas para su ajuste en motores de combustión interna: bombas de aceite, agua y combustible para vehículos de motor, etc. Esta clase comprende también: - la fabricación de bombas de mano Esta clase no comprende: - la fabricación de equipos hidráulicos y neumáticos (véase 28.12) @es
scope note: Cette classe comprend: - la fabrication de pompes à air ou à vide et de compresseurs d’air ou d’autres gaz - la fabrication de pompes pour liquides, même comportant un dispositif mesureur - la fabrication de pompes pour moteurs à combustion interne: pompes à huile, à eau, à carburant pour véhicules automobiles, etc. Cette classe comprend également: - la fabrication de pompes actionnées à la main Cette classe ne comprend pas: - la fabrication de matériel hydraulique et pneumatique, voir 28.12 @fr
scope note: Ovaj razred uključuje: - proizvodnju zračnih i vakuumskih crpki, te zračnih i drugih plinskih kompresora - proizvodnju crpki za tekućine, opremljenih uređajem za mjerenje protoka ili neopremljenih - proizvodnju crpki dizajniranih za podešavanje na motore s unutarnjim izgaranjem, crpki na naftu, vodu i gorivo za motorna vozila itd. Ovaj razred također uključuje: - proizvodnju ručnih crpki Ovaj razred isključuje: - proizvodnju hidraulične i pneumatske opreme, vidi 28.12
scope note: Į šią klasę įeina: - oro ar vakuuminių siurblių, oro ar kitokių dujų kompresorių gamyba - skysčių siurblių, su matuokliais ar be jų, gamyba - siurblių, tinkamų vidaus degimo varikliams, gamyba: alyvos, vandens ir kuro siurbliai, skirti variklinėms transporto priemonėms ir kt. Į šią klasę taip pat įeina: - rankinių siurblių gamyba Į šią klasę neįeina: - hidraulinės ir pneumatinės įrangos gamyba, žr. 28.12 @lt
scope note: Bu sınıf aşağıdakileri kapsamaktadır; - havalı veya vakumlu pompaların, hava veya diğer gaz kompresörlerinin imalatı, - herhangi bir ölçüm aleti ile donatılmış olsun ya da olmasın sıvılar için pompa imalatı, - içten yanmalı motorlara monte etmek üzere tasarlanmış pompaların imalatı: motorlu araçlar ve benzeri için yağ pompaları, benzin pompaları, su pompaları, yakıt pompaları. Ayrıca bu sınıf aşağıdakileri de kapsamaktadır; - el pompalarının imalatı. Kapsam dışı olanlar; - hidrolik ve pnömatik donanımların imalatı, bkz. 28.12. @tr
preferred label: Производство на други помпи и компресори @bg
preferred label: Výroba ostatních čerpadel a kompresorů @cs
preferred label: Fremstilling af andre pumper og kompressorer @da
preferred label: Herstellung von Pumpen und Kompressoren a. n. g. @de
preferred label: Κατασκευή άλλων αντλιών και συμπιεστών @el
preferred label: Fabricación de otras bombas y compresores @es
preferred label: Muude pumpade ja kompressorite tootmine @et
preferred label: Pumppujen ja kompressoreiden valmistus @fi
preferred label: Fabrication d'autres pompes et compresseurs @fr
preferred label: Egyéb szivattyú, kompresszor gyártása
preferred label: Fabbricazione di altre pompe e compressori @it
preferred label: Kitų siurblių ir kompresorių gamyba @lt
preferred label: Sūkņu un kompresoru ražošana @lv
preferred label: Manifattura ta' pompi u kumpressuri oħra @mt
preferred label: Vervaardiging van andere pompen en compressoren @nl
preferred label: Produksjon av pumper og kompressorer ellers @no
preferred label: Produkcja pozostałych pomp i sprężarek @pl
preferred label: Fabricação de outras bombas e compressores @pt
preferred label: Fabricarea de pompe şi compresoare @ro
preferred label: Производство прочих насосов и компрессоров @ru
preferred label: Výroba iných čerpadiel a kompresorov @sk
preferred label: Proizvodnja črpalk in kompresorjev @sl
preferred label: Tillverkning av andra pumpar och kompressorer @sv
preferred label: Diğer pompaların ve kompresörlerin imalatı @tr
broader: Manufacture of general-purpose machinery

Manufacture of other taps and valves
type: Concept
notation: 28.14
status: valid
status modified: 2013-10-18
accepted date: 2013-10-18
in scheme: Statistical Classification of Economic Activities in the European Community, Rev. 2 (2008)
scope note: - производство на промишлени клапани и кранове, вкл. редуцирвентили и шибъри - производство на санитарна арматура - производство на арматура за отоплителни системи - производство на вентили и клапани от вулканизиран каучук, стъкло или керамични материали - 22.19, 23.19 или 23.44 - производство на смукателни и изпускателни клапани за двигатели с вътрешно горене - 28.11 - производство на хидравлични и пневматични клапани и съоръжения за подготовка на въздуха за пневматични системи - 28.12 @bg
scope note: Z: - výrobu průmyslových kohoutů a ventilů včetně redukčních a přívodních ventilů - výrobu sanitárních kohoutů a ventilů - výrobu topenářských kohoutů a ventilů N: - výrobu ventilů z netvrzené vulkanizované pryže, skla nebo keramiky (22.19, 23.19 nebo 23.44) - výrobu sacích a výfukových ventilů pro motory s vnitřním spalováním (28.11) - výrobu hydraulických a pneumatických ventilů a zařízení pro úpravu vzduchu pro použití v pneumatických systémech (28.12) @cs
scope note: Diese Klasse umfasst: - Herstellung von Industriarmaturen einschließlich Drossel- und Einlassventilen - Herstellung von Sanitärarmaturen - Herstellung von Heizungsarmaturen Diese Klasse umfasst nicht: - Herstellung von Armaturen aus ungehärtetem vulkanisiertem Gummi, Glas oder aus Keramik (s. 22.19, 23.19 bzw. 23.44) - Herstellung von Ein- und Auslassventilen für Verbrennungsmotoren (s. 28.11) - Herstellung von hydraulischen und pneumatischen Ventilen sowie Luftaufbereitungseinrichtungen für pneumatische Systeme (s. 28.12) @de
scope note: This class includes: - manufacture of industrial taps and valves, including regulating valves and intake taps - manufacture of sanitary taps and valves - manufacture of heating taps and valves This class excludes: - manufacture of valves of unhardened vulcanised rubber, glass or of ceramic materials, see 22.19, 23.19 or 23.44 - manufacture of inlet and exhaust valves of internal combustion engines, see 28.11 - manufacture of hydraulic and pneumatic valves and air preparation equipment for use in pneumatic systems, see 28.12 @en
scope note: Esta clase comprende: - la fabricación de grifos y válvulas industriales, incluidas las válvulas reguladoras y los grifos de admisión - la fabricación de grifos y válvulas para sanitarios - la fabricación de grifos y válvulas para aparatos de calefacción Esta clase no comprende: - la fabricación de válvulas industriales a base de caucho vulcanizado no endurecido, materias cerámicas o vidrio (véanse 22.19, 23.19 y 23.44) - la fabricación de válvulas de admisión y escape para motores de combustión interna (véase 28.11) - la fabricación de válvulas hidráulicas y neumáticas y equipos de preparación de aire para su uso en sistemas neumáticos (véase 28.12) @es
scope note: Cette classe comprend: - la fabrication de robinetterie et de vannes industrielles, y compris les vannes de régulation et la robinetterie d’adduction - la fabrication de robinetterie sanitaire - la fabrication de robinetterie pour le chauffage Cette classe ne comprend pas: - la fabrication d’articles de robinetterie en caoutchouc vulcanisé non durci, en verre ou en matières céramiques, voir 22.19, 23.19 ou 23.44 - la fabrication de soupapes d’admission et d’échappement pour moteurs à combustion interne, voir 28.11 - la fabrication de valves hydrauliques et pneumatiques et de systèmes de préparation de l’air pour une utilisation dans des systèmes pneumatiques, voir 28.12 @fr
scope note: Ovaj razred uključuje: - proizvodnju industrijskih slavina i ventila, uključujući ventile za reguliranje i slavine za dotok - proizvodnju sanitarnih slavina i ventila - proizvodnju slavina i ventila za grijanje Ovaj razred isključuje: - proizvodnju ventila od nestvrdnute vulkanizirane gume, stakla ili keramičkih materijala, vidi 22.19, 23.19 ili 23.44 - proizvodnju usisnih i ispušnih ventila za motore s unutarnjim izgaranjem, vidi 28.11 - proizvodnju hidrauličnih i pneumatskih ventila te priprema zračne opreme koja se koristi u pneumatskim sustavima, vidi 28.12
scope note: Į šią klasę įeina: - pramoninių čiaupų ir sklendžių, įskaitant reguliavimo sklendes ir įleidžiamuosius čiaupus, gamyba - santechnikos čiaupų ir sklendžių gamyba - šildymo čiaupų ir sklendžių gamyba Į šią klasę neįeina: - sklendžių iš nekietintos gumos, stiklinių ar keraminių medžiagų gamyba, žr. 22.19, 23.19 arba 23.44 - vidaus degimo variklių įleidžiamųjų ir išleidžiamųjų vožtuvų gamyba, žr. 28.11 - hidraulinių ir pneumatinių sklendžių ir oro paruošimo įrangos, naudojamos pneumatinėse sistemose, gamyba, žr. 28.12 @lt
scope note: Этот класс включает: - производство электрических и прочих промышленных и лабораторных печей, включая мусоросжигательные и кремационные печи - производство камер сгорания - производство стационарных электронагревателей, электронагревателей для плавательных бассейнов - производство стационарного нагревательного неэлектрического оборудования бытового назначения, такого как, солнечное, паровое отопление, масляные обогреватели и подобные отопительные системы - производство электрических отопительных приборов бытового назначения (с нагнетанием воздуха электрическим способом, тепловых насосов и т.д.), печей с нагнетанием воздуха не электрическим способом Этот класс также включает: - производство механических отопительных систем, жаровен и т.д. Этот класс исключает: - производство бытовых печей, см. 27.51 - производство сушильных аппаратов сельскохозяйственного назначения, см. 28.93 - производство хлебопекарных печей, см. 28.93 - производство сушильных аппаратов для древесины, бумажной древесной массы и целлюлозы, бумаги или картона, см. 28.99 - производство медицинских, хирургических или лабораторных стерилизаторов, см. 32.50 - производство зубоврачебных лабораторных печей, см. 32.50 @ru
scope note: Bu sınıf aşağıdakileri kapsamaktadır; - ayar vanaları ve giriş muslukları dahil, sanayi muslukları ve vanalarının imalatı, - sıhhi tesisatta kullanılan musluk ve vana imalatı, - ısıtmada kullanılan musluk ve vanaların imalatı. Kapsam dışı olanlar; - sertleştirilmemiş vulkanize kauçuk, cam ya da seramik malzemelerden valfların (vanaların) imalatı, bkz. 22.19, 23.19 ya da 23.44, - içten yanmalı motorların emme ve egzoz supaplarının imalatı, bkz. 28.11, - hidrolik ve pnömatik valflar ile pnömatik sistemlerde kullanmak üzere hava hazırlama donanımı imalatı, bkz. 28.12. @tr
preferred label: Производство на арматурни изделия @bg
preferred label: Výroba ostatních potrubních armatur @cs
preferred label: Fremstilling af andre haner og ventiler @da
preferred label: Herstellung von Armaturen a. n. g @de
preferred label: Κατασκευή άλλων ειδών κρουνοποιίας και βαλβίδων @el
preferred label: Fabricación de otra grifería y válvulas @es
preferred label: Muude kraanide ja ventiilide tootmine @et
preferred label: Muiden hanojen ja venttiilien valmistus @fi
preferred label: Fabrication d'autres articles de robinetterie @fr
preferred label: Csap, szelep gyártása
preferred label: Fabbricazione di altri rubinetti e valvole @it
preferred label: Kitų čiaupų ir sklendžių gamyba @lt
preferred label: Krānu un ventiļu ražošana @lv
preferred label: Manifattura ta' viti u valvi oħra @mt
preferred label: Vervaardiging van andere kranen en dergelijke artikelen @nl
preferred label: Produksjon av kraner og ventiler ellers @no
preferred label: Produkcja pozostałych kurków i zaworów @pl
preferred label: Fabricação de outras torneiras e válvulas @pt
preferred label: Fabricarea de articole de robinetărie @ro
preferred label: Производство прочих кранов и вентилей @ru
preferred label: Výroba iných kohútikov a ventilov @sk
preferred label: Proizvodnja pip in ventilov @sl
preferred label: Tillverkning av andra kranar och ventiler @sv
preferred label: Diğer musluk ve vana imalatı @tr
broader: Manufacture of general-purpose machinery

Manufacture of bearings, gears, gearing and driving elements
type: Concept
notation: 28.15
status: valid
status modified: 2013-10-18
accepted date: 2013-10-18
in scheme: Statistical Classification of Economic Activities in the European Community, Rev. 2 (2008)
scope note: - производство на сачмени, ролкови или иглени лагери и части за тях - производство на механични предавки: • трансмисионни валове и колена: гърбични и колянови валове, колена и други • лагерни кутии (опори) и лагерни черупки - производство на фрикционни колела, зъбни предавки, редуктори и скоростни регулатори - производство на съединители, шарнирни съединители и съединителни детайли - производство на маховици и ролки - производство на втулково-ролкови вериги (галови) и други вериги с шарнирно свързване - производство на верижни предавки - производство на вериги със заварени звена, с напречно усилени звена, вериги за сняг - 25.93 - производство на хидравлични предавки - 28.12 - производство на хидростатични предавки - 28.12 - производство на електромагнитни съединители - 29.32 - производство на детайли за предавки, които се идентифицират като резервни части за автомобили или въздухоплавателни средства - раздели 29 и 30 @bg
scope note: Z: - výrobu valivých ložisek (kuličkových, válečkových a jiných) a jejich dílů - výrobu mechanických dílů převodových zařízení: • převodových hřídelí včetně vačkových, klikových apod. a klikových ústrojí (klik) • ložiskových pouzder a ložiskových pánví - výrobu ozubených a řetězových kol, ozubených a jiných dílů převodů - výrobu převodovek, převodových skříní a ostatních měničů rychlosti - výrobu hřídelových spojek a jiných spojek - výrobu setrvačníků a řemenic - výrobu kloubových řetězů - výrobu řetězů pro přenos hnací síly N: - výrobu jiných řetězů (25.93) - výrobu hydraulických převodů (28.12) - výrobu hydrostatických pohonů (28.12) - výrobu (elektromagnetických) spojek (29.31) - výrobu dílů zařízení na převod hnací síly, které jsou rozpoznatelně jako díly pro vozidla nebo letadla (viz oddíly 29 a 30) @cs
scope note: Diese Klasse umfasst: - Herstellung von Kugel- und Rollenlagern sowie Teilen davon - Herstellung von mechanischen Kraftübertragungselementen: • Wellen und Kurbeln: Nockenwellen, Kurbelwellen, Kurbeln usw. • Lagergehäuse und -schalen, Gleitlager - Herstellung von Zahnrädern und Getrieben und anderen Kraftübersetzungselementen - Herstellung von Wellen- und anderen Kupplungen - Herstellung von Schwungrädern und Riemenscheiben - Herstellung von Gelenkketten - Herstellung von Kraftübertragungsketten Diese Klasse umfasst nicht: - Herstellung von anderen Ketten (s. 25.93) - Herstellung von Hydraulikgetrieben (s. 28.12) - Herstellung von hydrostatischen Antrieben (s. 28.12) - Herstellung von (elektromagnetischen) Kupplungen (s. 29.31) - Herstellung von Baugruppen von Kraftübertragungseinrichtungen, die erkennbar für Land- und Luftfahrzeuge bestimmt sind (s. Abteilungen 29 und 30) @de
scope note: This class includes: - manufacture of ball and roller bearings and parts thereof - manufacture of mechanical power transmission equipment: • transmission shafts and cranks: camshafts, crankshafts, cranks etc. • bearing housings and plain shaft bearings - manufacture of gears, gearing and gear boxes and other speed changers - manufacture of clutches and shaft couplings - manufacture of flywheels and pulleys - manufacture of articulated link chain - manufacture of power transmission chain This class excludes: - manufacture of other chain, see 25.93 - manufacture of hydraulic transmission equipment, see 28.12 - manufacture of hydrostatic transmissions, see 28.12 - manufacture of (electromagnetic) clutches, see 29.31 - manufacture of sub-assemblies of power transmission equipment identifiable as parts of vehicles or aircraft, see divisions 29 and 30 @en
scope note: Esta clase comprende: - la fabricación de rodamientos y de piezas para los mismos - la fabricación de equipos de transmisión mecánica: • ejes y manivelas de transmisión: ejes de levas, cigüeñales, etc. • soportes de cojinetes y cojinetes de transmisión - la fabricación de engranajes, cajas de engranajes y otros sistemas de cambio de velocidad - la fabricación de embragues y acoplamientos axiales - la fabricación de volantes y poleas - la fabricación de cadenas de eslabones articulados - la fabricación de cadenas de transmisión Esta clase no comprende: - la fabricación de otras cadenas (véase 25.93) - la fabricación de sistemas de transmisión hidráulica (véase 28.12) - la fabricación de transmisiones hidrostáticas (véase 28.12) - la fabricación de embragues (electromagnéticos) (véase 29.31) - la fabricación de subensamblajes de órganos de transmisión mecánica identificables como partes de vehículos o aeronaves (véanse las divisiones 29 y 30) @es
scope note: Cette classe comprend: - la fabrication de roulements à billes, à galets, à rouleaux ou à aiguilles et de leurs éléments - la fabrication d’organes mécaniques de transmission de l’énergie: • arbres de transmission et manivelles: arbres à cames, vilebrequins, manivelles, etc. • paliers et coussinets - la fabrication d’engrenages et de roues de friction ainsi que de réducteurs, de multiplicateurs et de variateurs de vitesse - la fabrication d’embrayages et d’organes d’accouplement - la fabrication de volants et de poulies - la fabrication de chaînes à maillons articulés - la fabrication de chaînes pour la transmission de l’énergie Cette classe ne comprend pas: - la fabrication d’autres chaînes, voir 25.93 - la fabrication d’organes hydrauliques de transmission, voir 28.12 - la fabrication de transmissions hydrostatiques, voir 28.12 - la fabrication d’embrayages (électromagnétiques), voir 29.31 - la fabrication de parties d’équipements de transmission de l’énergie identifiables comme parties de véhicules ou d’avions, voir divisions 29 et 30 @fr
scope note: Ovaj razred uključuje: - proizvodnju kugličnih i valjkastih ležajeva i njihovih dijelova - proizvodnju uređaja za mehanički prijenos: • prijenosnih osovina i koljena: zupčastih osovina i koljenastih osovina itd. • kliznih ležajeva i njihovih kućišta - proizvodnju zupčanika, prijenosnika te prijenosnih kutija i ostalih mjenjača brzine - proizvodnju kvačila i spojki - proizvodnju zamašnjaka i remenica - proizvodnju prijenosnih člankastih lanaca - proizvodnju prijenosnih pogonskih lanaca Ovaj razred isključuje: - proizvodnju ostalih lanaca, vidi 25.93 - proizvodnju hidraulične prijenosne opreme, vidi 28.12 - proizvodnju (elektromagnetskih) spojki, vidi 29.31 - proizvodnju polusastavljenih pogonskih uređaja koji se mogu prepoznati kao dijelovi vozila ili zrakoplova, vidi odjeljke 29 i 30
scope note: Į šią klasę įeina: - rutulinių ir ritininių guolių ir jų dalių gamyba - mechaninių pavarų įrangos gamyba • pavarų velenų ir alkūninių svirčių: kumštelinių velenų, alkūninių velenų, skriejikų ir kt. • guolių korpusų ir velenų slydimo guolių - krumpliaračių, krumplinių pavarų ir pavarų dėžių bei kitų greičio keitiklių gamyba - sankabų ir velenų movų gamyba - smagračių ir skriemulių gamyba - šarnyrinių plokščiagrandžių grandinių gamyba - pavaros grandinių gamyba Į šią klasę neįeina: - kitų grandinių gamyba, žr. 25.93 - hidraulinių pavarų įrangos gamyba, žr. 28.12 - hidrostatinių pavarų gamyba, žr. 28.12 - sankabų (elektromagnetinių) gamyba, žr. 29.31 - energijos perdavimo įrangos mazgų, kurie yra transporto priemonių arba orlaivių dalys, gamyba, žr. 29 ir 30 skyrius @lt
scope note: Этот класс включает: - производство ручных или механизированных подъемных, погрузочных или разгрузочных машин: • подъемников, лебедок и т.п. оборудования • подъемных приспособлений, передвижных подъемных рам, портальных лесовозов и т.д. • грузовых тягачей с или без транспортно-загрузочным оборудованием, самоходных или нет, используемых в производстве (включая ручные тележки и тачки) • механически управляемых устройств и промышленных роботов, специально разработанных для подъема, транспортировки, загрузки или разгрузки - производство конвейеров, телеметрической аппаратуры и т.д. - производство лифтов, эскалаторов и движущихся дорожек - производство запасных частей для подъемной, погрузочной или разгрузочной техники Этот класс исключает: - производство промышленных роботов для многоцелевого использования, см. 28.99 - производство элеваторов и конвейеров непрерывного действия для подземных работ, см. 28.92 - производство механических экскаваторов, погрузочных машин ковшового типа и одноковшовых погрузчиков, см. 28.92 - производство плавучих, железнодорожных кранов, кранов-погрузчиков, см. 30.11, 30.20 - монтаж подъемных установок и элеваторов, см. 43.29 @ru
scope note: Bu sınıf aşağıdakileri kapsamaktadır; - bilyeli veya makaralı rulman ve bunların parçalarının imalatı, - mekanik güç aktarma donanımlarının imalatı: • aktarma milleri (şaftları) ve krankları: kam milleri, krank milleri, kranklar ve benzerleri, • rulman yatakları ve düz mil (şaft) rulmanları. - dişliler/dişli takımlarının, şanzımanların, vites kutularının (makineler için olanlar) ve diğer hız değiştiricileri imalatı, - debriyaj ve mil (şaft) bağlantıları imalatı, - volan ve kasnak imalatı, - mafsallı bağlantı zinciri imalatı, - güç aktarım zinciri imalatı. Kapsam dışı olanlar; - diğer zincirlerin imalatı, bkz. 25.93, - hidrolik transmisyon donanımı imalatı, bkz. 28.12, - hidrostatik transmisyon imalatı, bkz. 28.12, - elektromanyetik debriyaj (kavrama) imalatı, bkz. 29.31, - motorlu taşıtların ya da uçakların parçaları olarak tanımlanabilen güç aktarım donanımına ait ara montaj ürünlerinin imalatı, bkz. bölüm 29 ve 30. @tr
preferred label: Производство на лагери, предавки и съединители @bg
preferred label: Výroba ložisek, ozubených kol, převodů a hnacích prvků @cs
preferred label: Fremstilling af lejer, tandhjul, tandhjulsudvekslinger og drivelementer @da
preferred label: Herstellung von Lagern, Getrieben, Zahnrädern und Antriebselementen @de
preferred label: Κατασκευή τριβέων, οδοντωτών μηχανισμών μετάδοσης κίνησης, στοιχείων οδοντωτών τροχών και μετάδοσης κίνησης @el
preferred label: Fabricación de cojinetes, engranajes y órganos mecánicos de transmisión @es
preferred label: Laagrite, ajamite, hammasülekannete ja ülekandeelementide tootmine @et
preferred label: Laakereiden, hammaspyörien, vaihteisto- ja ohjauselementtien valmistus @fi
preferred label: Fabrication d'engrenages et d'organes mécaniques de transmission @fr
preferred label: Csapágy, erőátviteli elem gyártása
preferred label: Fabbricazione di cuscinetti, ingranaggi e organi di trasmissione @it
preferred label: Guolių, krumpliaračių, krumplinių pavarų ir varomųjų elementų gamyba @lt
preferred label: Gultņu, zobratu, pārnesumu un piedziņas elementu ražošana @lv
preferred label: Manifattura ta' berings, gerijiet, elementi tal-gerijiet u tas-sewqan @mt
preferred label: Vervaardiging van tandwielen, lagers en andere drijfwerkelementen @nl
preferred label: Produksjon av lagre, gir, tannhjulsutvekslinger og andre innretninger for kraftoverføring @no
preferred label: Produkcja łożysk, kół zębatych, przekładni zębatych i elementów napędowych @pl
preferred label: Fabricação de rolamentos, de engrenagens e de outros órgãos de transmissão @pt
preferred label: Fabricarea lagărelor, angrenajelor, cutiilor de viteză şi a elementelor mecanice de transmisie @ro
preferred label: Производство подшипников, шестеренок, элементов зубчатых передач и приводов @ru
preferred label: Výroba ložísk, ozubených kolies, prevodových a ovládacích prvkov @sk
preferred label: Proizvodnja ležajev, zobnikov in elementov za mehanski prenos energije @sl
preferred label: Tillverkning av lager, kugghjul och andra delar för kraftöverföring @sv
preferred label: Rulman, dişli/dişli takımı, şanzıman ve tahrik elemanlarının imalatı @tr
broader: Manufacture of general-purpose machinery

Manufacture of other general-purpose machinery
type: Concept
notation: 28.2
status: valid
status modified: 2013-10-18
accepted date: 2013-10-18
in scheme: Statistical Classification of Economic Activities in the European Community, Rev. 2 (2008)
scope note: Этот класс включает: - производство счетных машин - производство вычислительных машин, кассовых аппаратов - производство калькуляторов, электронных или нет - производство франкировальных машин, почтовых сортировочных машин (оборудования для заполнения конвертов, заклеивания и адресации; открывания, сортировки, сканирования) - производство пишущих машинок - производство стенографических машинок - производство офисного скрепляющего оборудования (пластикового и ленточного) - производство машин для распечатки банковских чеков - производство техники для подсчета и упаковки денег - производство точилок для карандашей - производство стиплеров и механизмов для разгибания скоб - производство машин для подсчета голосов - производство держателей для клейкой ленты - производство компостеров и дыроколов - производство механических кассовых аппаратов - производство копировальных машин - производство картриджей - производство школьных досок; пластиковых досок и досок для маркеров - производство диктофонов Этот класс исключает: - производство компьютеров и компьютерного периферийного оборудования, см. 26.20 @ru
preferred label: Производство на други машини с общо предназначение @bg
preferred label: Výroba ostatních strojů a zařízení pro všeobecné účely @cs
preferred label: Fremstilling af øvrige maskiner til generelle formål @da
preferred label: Herstellung von sonstigen nicht wirtschaftszweigspezifischen Maschinen @de
preferred label: Κατασκευή άλλων μηχανημάτων γενικής χρήσης @el
preferred label: Fabricación de otra maquinaria de uso general @es
preferred label: Muude üldmasinate tootmine @et
preferred label: Muiden yleiskäyttöön tarkoitettujen koneiden valmistus @fi
preferred label: Fabrication d'autres machines d'usage général @fr
preferred label: Egyéb általános rendeltetésű gép gyártása
preferred label: Fabbricazione di altre macchine di impiego generale @it
preferred label: Kitų bendrosios paskirties mašinų ir įrangos gamyba @lt
preferred label: Pārējo universālu iekārtu ražošana @lv
preferred label: Manifattura ta' magni oħra għal għanijiet ġenerali @mt
preferred label: Vervaardiging van andere machines en apparaten voor algemeen gebruik @nl
preferred label: Produksjon av andre maskiner og annet utstyr til generell bruk @no
preferred label: Produkcja pozostałych maszyn ogólnego przeznaczenia @pl
preferred label: Fabricação de outras máquinas para uso geral @pt
preferred label: Fabricarea altor maşini şi utilaje de utilizare generală @ro
preferred label: Производство прочих машин общего назначения @ru
preferred label: Výroba ostatných strojov na všeobecné účely @sk
preferred label: Proizvodnja drugih naprav za splošne namene @sl
preferred label: Tillverkning av andra maskiner för allmänt ändamål @sv
preferred label: Genel amaçlı diğer makinelerin imalatı @tr
broader: Manufacture of machinery and equipment n.e.c.
narrower: Manufacture of ovens, furnaces and furnace burners
narrower: Manufacture of lifting and handling equipment
narrower: Manufacture of office machinery and equipment (except computers and peripheral equipment)
narrower: Manufacture of power-driven hand tools
narrower: Manufacture of non-domestic cooling and ventilation equipment
narrower: Manufacture of other general-purpose machinery n.e.c.

Manufacture of ovens, furnaces and furnace burners
type: Concept
notation: 28.21
status: valid
status modified: 2013-10-18
accepted date: 2013-10-18
in scheme: Statistical Classification of Economic Activities in the European Community, Rev. 2 (2008)
scope note: - производство на електрически и други промишлени и лабораторни пещи (вкл. пещи за изгаряне на отпадъци) - производство на горелки - производство на постоянно монтирани електрически отоплителни уреди за помещения и плувни басейни - производство на постоянно монтирани неелектрически битови уреди за отопление като слънчеви колектори, парно отопление, централно отопление на течно гориво и подобни отоплителни инсталации - производство на битови електрически отоплителни уреди (електрически отоплителни уреди с принудителна циркулация на въздуха, термопомпи и други) и неелектрически битови отоплителни уреди с принудителна циркулация на въздуха - производство на механични устройства за подаване на гориво в пещ, скари, устройства за отвеждане на пепел и други подобни устройства - производство на битови електрически фурни - 27.51 - производство на сушилни за селскостопански продукти - 28.93 - производство на пещи за хляб, хлебни или сладкарски изделия - 28.93 - производство на сушилни за дървен материал, хартиена маса, хартия или картон - 28.99 - производство на медицински, хирургически или лабораторни стерилизатори - 32.50 - производство на пещи за зъботехнически лаборатории - 32.50 @bg
scope note: Z: - výrobu elektrických a neelektrických průmyslových a laboratorních pecí včetně spalovacích pecí - výrobu hořáků - výrobu stacionárních (nepřenosných) elektrických topných těles pro místnosti a elektrických topných těles pro bazény - výrobu stacionárních (nepřenosných) neelektrických topných těles pro místnosti převážně pro domácnosti, např. solárních topných zařízení, parních topení, olejových topení a podobných kamen a topných zařízení - výrobu elektrických topných těles převážně pro domácnosti (teplovzdušné systémy s cirkulací vzduchu, tepelná čerpadla atd.) - výrobu neelektrických teplovzdušných systémů s cirkulací vzduchu ZT: - výrobu mechanických přikládacích zařízení, roštů, zařízení na odpopelňování atd. N: - výrobu sporáků převážně pro domácnost (27.51) - výrobu zemědělských sušiček (28.93) - výrobu pekárenských pecí (28.93) - výrobu strojů na sušení dřeva, buničiny, papíru nebo lepenky (28.99) - výrobu lékařských a laboratorních sterilizačních přístrojů (32.50) - výrobu pecí pro zubní laboratoře (32.50) @cs
scope note: Diese Klasse umfasst: - Herstellung von elektrischen und anderen Industrie- und Laboröfen einschließlich Verbrennungsöfen - Herstellung von Brennern - Herstellung von ortsfesten elektrischen Raumheizgeräten und elektrischen Heizgeräten für Schwimmbecken - Herstellung von ortsfesten nichtelektrischen Heizgeräten für Haushalte wie Solarheizanlagen, Dampfheizungen, Ölheizungen sowie ähnlich Öfen und Heizanlagen - Herstellung von elektrischen Haushaltsheizgeräten (Umwälzlufterhitzer, Wärmepumpen usw.), nichtelektrischen Umwälzlufterhitzern Diese Klasse umfasst ferner: - Herstellung von mechanischen Schürvorrichtungen, Rosten, Entaschungsvorrichtungen usw. Diese Klasse umfasst nicht: - Herstellung von Haushaltsöfen (s. 27.51) - Herstellung von landwirtschaftlichen Trocknern (s. 28.93) - Herstellung von Bäckereiöfen (s. 28.93) - Herstellung von Trocknern für Holz, Zellstoff, Papier und Pappe (s. 28.99) - Herstellung von medizinischen und Laborsterilisiergeräten (s. 32.50) - Herstellung von (zahn-)medizinischen Laboröfen (s. 32.50) @de
scope note: This class includes: - manufacture of electrical and other industrial and laboratory furnaces and ovens, including incinerators - manufacture of burners - manufacture of permanent mount electric space heaters, electric swimming pool heaters - manufacture of permanent mount non-electric household heating equipment, such as solar heating, steam heating, oil heat and similar furnaces and heating equipment - manufacture of electric household-type furnaces (electric forced air furnaces, heat pumps, etc.), non-electric household forced air furnaces This class also includes: - manufacture of mechanical stokers, grates, ash dischargers etc. This class excludes: - manufacture of household ovens, see 27.51 - manufacture of agricultural dryers, see 28.93 - manufacture of bakery ovens, see 28.93 - manufacture of dryers for wood, paper pulp, paper or paperboard, see 28.99 - manufacture of medical, surgical or laboratory sterilisers, see 32.50 - manufacture of (dental) laboratory furnaces, see 32.50 @en
scope note: Esta clase comprende: - la fabricación de hornos eléctricos y otros hornos industriales o de laboratorio, incluidos los incineradores - la fabricación de quemadores - la fabricación de aparatos eléctricos para calefacción de montaje permanente, calentadores eléctricos para piscinas - la fabricación de equipos de calefacción domésticos no eléctricos de montaje permanente, como la calefacción por energía solar, por vapor, de fueloil y equipos similares de hornos y calefacción - la fabricación de hornos eléctricos de uso doméstico (hornos eléctricos de convección, bombas de calor, etc.), hornos no eléctricos de convección de uso doméstico Esta clase comprende también: - la fabricación de cargadores mecánicos, rejillas, descargadores de ceniza, etc. Esta clase no comprende: - la fabricación de hornos de uso doméstico (véase 27.51) - la fabricación de hornos secadores para uso agrícola (véase 28.93) - la fabricación de hornos de panadería (véase 28.93) - la fabricación de hornos secadores para madera, pasta de papel, papel y cartón (véase 28.99) - la fabricación de aparatos de esterilización para usos médico-quirúrgicos y de laboratorio (véase 32.50) - la fabricación de hornos de laboratorio (odontológicos) (véase 32.50) @es
scope note: Cette classe comprend: - la fabrication de fours électriques et d’autres fours industriels ou de laboratoires, y compris les incinérateurs - la fabrication de brûleurs - la fabrication de chauffages électriques de locaux à montage permanent, de chauffages électriques de piscines - la fabrication de chauffages autres que électriques et à usage domestique à montage permanent, comme le chauffage solaire, chauffage à la vapeur, chauffage à l’huile et systèmes similaires de chauffage - la fabrication de fourneaux électriques à usage domestique (installations électriques à air pulsé, pompes à chaleur, etc.), installations non électriques à air pulsé Cette classe comprend également: - la fabrication de foyers automatiques, d’avant-foyers, de grilles mécaniques, de dispositifs pour l’évacuation des cendres, etc. Cette classe ne comprend pas: - la fabrication de fours pour cuisson industrielle, voir 27.51 - la fabrication de séchoirs pour produits agricoles, voir 28.93 - la fabrication de fours cuisson industrielle, voir 28.93 - la fabrication de séchoirs pour le bois, les pâtes à papier, les papiers ou les cartons, voir 28.99 - la fabrication de stérilisateurs médico-chirurgicaux ou de laboratoires, voir 32.50 - la fabrication de fours de laboratoires (dentaires), voir 32.50 @fr
scope note: Ovaj razred uključuje: - proizvodnju električnih i drugih industrijskih i laboratorijskih peći, uključujuči peći za spaljivanje - proizvodnju plamenika - proizvodnju trajnih visokih električnih grijača prostora, električnih grijača za bazene za kupanje - proizvodnju opreme za trajno visoko neelektrično grijanje kao što je solarno grijanje, grijanje na paru, grijanje na naftu te sličnih peći i opreme za grijanje - proizvodnju električnih peći za kućanstva (električne peći za zrak, crpke za grijanje, itd.), neelektričnih peći za kućanstva za zrak Ovaj razred također uključuje: - proizvodnju mehaničkih uređaja za loženje, odstranjivača pepela i ognjišta itd. Ovaj razred isključuje: - proizvodnju peći za kućanstva, vidi 27.51 - proizvodnju poljoprivrednih sušara, vidi 28.93 - proizvodnju pekarskih pećnica, vidi 28.93 - proizvodnju sušara za drvo, ljepenku, papir i karton, vidi 28.99 - proizvodnju medicinskih, kirurških i laboratorijskih sterilizatora, vidi 32.50 - proizvodnju (zubarskih) laboratorijskih peći, vidi 32.50
scope note: Į šią klasę įeina: - elektrinių ir kitokių pramoninių bei laboratorinių krosnių ir orkaičių, įskaitant atliekų deginimo ir krematoriumų krosnis, gamyba - degiklių gamyba - stacionariųjų elektrinių patalpų šildytuvų, elektrinių plaukymo baseinų šildytuvų gamyba - stacionariosios neelektrinės buitinės šildymo įrangos, tokios kaip šildymo saulės energija, garu, nafta ir panašių krosnių ir šildymo įrangos gamyba - elektrinių buitinių krosnių (elektrinių ventiliatorinių oro šildymo krosnių, šilumos siurblių ir pan.), neelektrinių buitinių ventiliatorinių oro šildymo krosnių gamyba Į šią klasę taip pat įeina: - mechaninių kūryklų, grotelių, pelenų šalintuvų ir kt., gamyba Į šią klasę neįeina: - buitinių orkaičių gamyba, žr. 27.51 - žemės ūkio džiovyklų gamyba, žr. 28.93 - kepyklų krosnių gamyba, žr. 28.93 - medienos, plaušienos, popieriaus ar kartono džiovyklų gamyba, žr. 28.99 - medicininių, chirurginių ar laboratorinių sterilizatorių gamyba, žr. 32.50 - (odontologijos) laboratorijų krosnių gamyba, žr. 32.50 @lt
scope note: Этот класс включает: - производство ручных инструментов, с электромоторами или без них или пневматических, таких как: • циркулярные или ножовочные станки • цепные пилы • буры и бурильные молотки • ручные пилы с электрическим приводом • пневматические гвоздезабивные станки • компрессоры • направляющие приспособления • шлифовальные станки • стиплеры • пневматические ручные инструменты для установки заклепок • строгальные станки • станки врезания режущей кромки в металл и обрезки • пневматические гаечные ключи ударного действия • гвоздезабивные станки Этот класс исключает: - производство запасных частей для ручных инструментов, см. 25.73 - производство ручного электрического паяльного и сварочного оборудования, см. 27.90 @ru
scope note: Bu sınıf aşağıdakileri kapsamaktadır: - Elektrikli ve diğer endüstriyel ve laboratuar ocaklarının ve fırınlarının imalatı, çöp yakma fırınları dahil- brülörlerin imalatı, - sabit bir yere monte edilen elektrikli sobaların ve yüzme havuzu için elektrikli ısıtıcıların imalatı,sabit bir yere monte edilen güneşle ısıtma sistemleri, buharla ısıtma sistemleri, yağla ısıtma sistemleri ve benzeri ocak ve ısınma donanımları gibi elektriksiz ev tipi ısıtma donanımları imalatı, - ev tipi elektrikli ısınma aletleri (elektrikli hava ısıtmalı ocaklar, ısı pompaları, vb.), elektriksiz ev tipi hava ısıtmalı ocakların imalatı. Ayrıca bu sınıf aşağıdakileri de kapsamaktadır; - mekanik kömür atıcılar (stoker), ocak ızgaraları, kül boşaltma hazneleri vb. imalatı. Kapsam dışı olanlar; - ev tipi fırın imalatı, bkz. 27.51, - tarım ürünleri kurutucuları imalatı, bkz. 28.93, - unlu mamul fırınlarının imalatı, bkz. 28.93, - tahta, kağıt hamuru, kağıt ya da mukavva kurutucuları imalatı, bkz. 28.99, - tıbbi, cerrahi ya da laboratuarlara ilişkin steril cihazları imalatı, bkz. 32.50, - laboratuar (dişçilik için) ocakları imalatı, bkz. 32.50. @tr
preferred label: Производство на пещи и горелки @bg
preferred label: Výroba pecí a hořáků pro topeniště @cs
preferred label: Fremstilling af ovne, ildsteder og fyringsaggregater @da
preferred label: Herstellung von Öfen und Brennern @de
preferred label: Κατασκευή φούρνων, κλιβάνων και καυστήρων @el
preferred label: Fabricación de hornos y quemadores @es
preferred label: Ahjude, tööstusahjude ja ahjupõletite tootmine @et
preferred label: Teollisuusuunien, lämmitysjärjestelmien ja tulipesäpolttimien valmistus @fi
preferred label: Fabrication de fours et brûleurs @fr
preferred label: Kemence gyártása
preferred label: Fabbricazione di forni, caldaie per il riscaldamento centrale e bruciatori per caldaie @it
preferred label: Orkaičių, krosnių ir krosnių degiklių gamyba @lt
preferred label: Kurtuvju, krāšņu un degļu ražošana @lv
preferred label: Manifattura ta' fran, fuklari u berners tal-fuklari @mt
preferred label: Vervaardiging van ovens en branders @nl
preferred label: Produksjon av industri- og laboratorieovner samt brennere @no
preferred label: Produkcja pieców, palenisk i palników piecowych @pl
preferred label: Fabricação de fornos e queimadores @pt
preferred label: Fabricarea cuptoarelor, furnalelor şi arzătoarelor @ro
preferred label: Производство плит, печей и печных горелок @ru
preferred label: Výroba rúr, pecí a horákov k peciam @sk
preferred label: Proizvodnja peči in gorilnikov @sl
preferred label: Tillverkning av ugnar och brännare @sv
preferred label: Fırın, ocak, soba ve brülör (ocak ateşleyicileri) imalatı @tr
broader: Manufacture of other general-purpose machinery

Manufacture of lifting and handling equipment
type: Concept
notation: 28.22
status: valid
status modified: 2013-10-18
accepted date: 2013-10-18
in scheme: Statistical Classification of Economic Activities in the European Community, Rev. 2 (2008)
scope note: - производство на подемно-транспортни и товаро-разтоварни машини, с ръчно или механично задвижване: • полиспасти, лебедки, кабестани и крикове • мачтово-стрелкови (дерик), подемни, мостови, козлови и други кранове • електро- и мотокари, със или без подемно устройство, самоходни и несамоходни, използвани в заводите (вкл. колички за пазаруване и ръчни колички) • механични манипулатори и промишлени роботи, специално проектирани за подемно-транспортни и товаро-разтоварни работи - производство на конвейери, въжени линии и други - производство на асансьори, ескалатори и движещи се пътеки - производство на части за подемно-транспортни машини - производство на подемници, транспортьори или конвейери, с непрекъснато действие, за мини или други подземни работи - 28.92 - производство на багери и товарачни машини - 28.92 - производство на многофункционални промишлени роботи - 28.99 - производство на автокранове, плаващи кранове, специализирани кранове за релсов път – 29.10, 30.11, 30.20 - инсталиране на асансьори и ескалатори - 43.29 @bg
scope note: Z: - výrobu ručně nebo motorově poháněných zdvihacích a manipulačních zařízení a nakládacích a vykládacích zařízení: • kladkostrojů, zdviháků, rumpálů, vrátků, vratidel a navijáků • deriků, jeřábů, mobilních zvedacích rámů atd. • pracovních vozíků, také s vlastním pohonem, mobilních obkročných vozíků, portálových nízkozdvižných vozíků, jeřábových vozíků, zdvihacích nebo stohovacích samohybných vozíků (včetně ručních vozíků a rudlů) • mechanických manipulátorů a průmyslových robotů speciálně konstruovaných pro zvedání, manipulaci, nakládání nebo vykládání - výrobu dopravníků, elevátorů, lanovek atd. - výrobu výtahů, eskalátorů, pohyblivých chodníků - výrobu speciálních dílů pro zdvihací a manipulační zařízení N: - výrobu víceúčelových průmyslových robotů (28.99) - výrobu nepřetržitě pracujících elevátorů a dopravních pásů pro využití v podzemí (28.92) - výrobu mechanických lopat, bagrů a lopatových nakladačů (28.92) - výroba plovoucích jeřábů, železničních jeřábů a jeřábů instalovaných na automobilech (autojeřábů) (30.11, 30.20) - instalování výtahů a zdviží (43.29) @cs
scope note: Diese Klasse umfasst: - Herstellung von hand- oder kraftbetriebenen Hebezeugen und Fördermitteln sowie Be- und Entladevorrichtungen: • Flaschenzüge, Hebezeuge, Winden und Spillen • Derricks, Kräne, fahrbare Hubvorrichtungen, Portalhubwagen usw. • Kraftkarren, auch mit Eigenantrieb, Hebezeugen und Fördermitteln, für industrielle Zwecke (einschließlich Hand- und Schubkarren) • eigens für Hebe-, Förder- sowie Be- und Entladetätigkeiten ausgelegte mechanische Greifer und Industrieroboter - Herstellung von Stetigförderern, Seilbahnen usw. - Herstellung von Aufzügen, Fahrtreppen und Fahrsteigen - Herstellung von Spezialteilen für Hebezeuge und Fördermittel Diese Klasse umfasst nicht: - Herstellung von Mehrzweckindustrierobotern (s. 28.99) - Herstellung von Stetigförderern für den Untertageeinsatz (s. 28.92) - Herstellung von Baggern und Schaufelladern (s. 28.92) - Herstellung von Schwimmkränen, Eisenbahnkränen und Kranwagen (s. 30.11, 30.20) - Installation von Aufzügen und Rolltreppen (s. 43.29) @de
scope note: This class includes: - manufacture of hand-operated or power-driven lifting, handling, loading or unloading machinery: • pulley tackle and hoists, winches, capstans and jacks • derricks, cranes, mobile lifting frames, straddle carriers etc. • works trucks, whether or not fitted with lifting or handling equipment, whether or not self-propelled, of the type used in factories (including hand trucks and wheelbarrows) • mechanical manipulators and industrial robots specifically designed for lifting, handling, loading or unloading - manufacture of conveyors, teleferics etc. - manufacture of lifts, escalators and moving walkways - manufacture of parts specialised for lifting and handling equipment This class excludes: - manufacture of industrial robots for multiple uses, see 28.99 - manufacture of continuous-action elevators and conveyors for underground use, see 28.92 - manufacture of mechanical shovels, excavators and shovel loaders, see 28.92 - manufacture of floating cranes, railway cranes, crane-lorries, see 30.11, 30.20 - installation of lifts and elevators, see 43.29 @en
scope note: Esta clase comprende: - la fabricación de máquinas y aparatos de elevación, carga, descarga y manipulación: • polipastos y cabrias, cabrestantes y gatos • grúas de todas clases, estructuras móviles de elevación, cargadores de caballete, etc. • carretillas, provistas o no de dispositivos de elevación o manipulación, autopropulsadas o no, del tipo utilizado en la industria (incluidas carretillas de mano) • manipuladores mecánicos y robots industriales concebidos especialmente para elevar, manipular, cargar o descargar - la fabricación de transportadores, teleféricos, etc. - la fabricación de ascensores, escaleras mecánicas y pasillos rodantes - la fabricación de partes especializadas para maquinaria de elevación y manipulación Esta clase no comprende: - la fabricación de robots industriales para usos diversos (véase 28.99) - la fabricación de elevadores y transportadores de movimiento continuo para trabajos subterráneos (véase 28.92) - la fabricación de palas mecánicas, excavadoras y cargadores de palas (véase 28.92) - la fabricación de grúas flotantes, grúas de ferrocarril, camiones grúa (véanse 30.11 y 30.20) - la instalación de ascensores y montacargas (véase 43.29) @es
scope note: Cette classe comprend: - la fabrication de machines et d’appareils de levage, de chargement, de déchargement ou de manutention actionnés par moteur ou à la main: • palans, treuils et cabestans, crics et vérins • bigues, grues, portiques mobiles, chariots-cavaliers, etc. • chariots, même automobiles, munis ou non d’un dispositif de levage ou de manutention, des types utilisés dans les usines (y compris diables et brouettes) • manipulateurs mécaniques et robots industriels spécialement conçus pour des opérations de levage, de manutention, de chargement ou de déchargement - la fabrication d’appareils transporteurs ou convoyeurs, de téléphériques, etc. - la fabrication d’ascenseurs, d’escaliers mécaniques et de trottoirs roulants - la fabrication d’éléments spécialisés de matériels de levage et de manutention Cette classe ne comprend pas: - la fabrication de robots industriels à usages multiples, voir 28.99 - la fabrication d’appareils élévateurs, transporteurs ou convoyeurs à action continue, pour mines au fond ou pour d’autres travaux souterrains, voir 28.92 - la fabrication de pelles mécaniques, d’excavateurs, de chargeuses et de chargeuses-pelleteuses, voir 28.92 - la fabrication de pontons-grues, de wagons-grues, de camions-grues, voir 30.11 et 30.20 - l’installation d’ascenseurs et monte-charge, voir 43.29 @fr
scope note: Ovaj razred uključuje: - proizvodnju strojeva za ručno upravljanje ili mehanički pogon, za podizanje, prenošenje, utovar i istovar: • kolotura, dizala, vitala, ručnih vitala • dizalica, kranova pokretnih platformi za podizanje, tronožaca itd. • radnih viljuškara bez obzira na to jesu li opremljeni uređajem za dizanje ili prenošenje ili su na vlastiti pogon, za korištenje u tvornicama (uključujući ručna kolica i tačke) • mehaničkih manipulatora i industrijskih robota posebno dizajniranih za dizanje, prenošenje, utovar ili istovar - proizvodnju pokretnih traka, žičara itd. - proizvodnju dizala, pokretnih stepenica i pokretnih staza za hodanje - proizvodnju specijaliziranih dijelova za uređaje za dizanje i prenošenje Ovaj razred isključuje: - proizvodnju industrijskih robota za višenamjensku upotrebu, vidi 28.99 - proizvodnju beskonačnih elevatora i pokretnih traka, za rad pod zemljom, vidi 28.92 - proizvodnju mehaničkih lopata, kopačica i utovarivača, vidi 28.92 - proizvodnju plovećih dizalica, željezničkih dizalica, kamionskih dizalica, vidi 30.11, 30.20 - montažu dizalica i elevatora, vidi 43.29
scope note: Į šią klasę įeina: - rankinių ar mechaninių kėlimo, perkėlimo, pakrovimo ar iškrovimo mechanizmų gamyba: • skridininių skrysčių ir keltuvų, gervių, vertikaliųjų gervių (špilių) ir kėliklių • stiebinių kranų (derikų), kranų, judamųjų kėlimo rėmų, portalinių kėlimo vežimėlių ir kt. • pramoninių savaeigių ar nesavaeigių vežimėlių su įtaisyta kėlimo ar krovimo įranga ar be jos (įskaitant rankinius ir vienračius vežimėlius) • mechaninių kėlimo, perkėlimo, pakrovimo ar iškrovimo manipuliatorių ir specialios konstrukcijos pramoninių robotų - konvejerių, kabamųjų kelių ir kt., gamyba - liftų, eskalatorių ir judamųjų pėsčiųjų takelių gamyba - kėlimo ir krovimo įrangos dalių gamyba Į šią klasę neįeina: - daugiafunkcės paskirties pramoninių robotų gamyba, žr. 28.99 - požeminių darbų tolydžiojo veikimo keltuvų ir konvejerių gamyba, žr. 28.92 - mechaninių semtuvų, ekskavatorių ir vienkaušių krautuvų gamyba, žr. 28.92 - plūdriųjų kranų, geležinkelių kranų, automobilinių kranų gamyba, žr. 30.11, 30.20 - liftų ir keltuvų įrengimas, žr. 43.29 @lt
scope note: Этот класс включает: - производство охлаждающего или замораживающего промышленного оборудования, включая комплектующие компоненты - производство кондиционеров, включая кондиционеры для автотранспортных средств - производство небытовых вентиляторов - производство теплообменников - производство техники для сжижения воздуха или газа - производство потолочных вентиляторов (фронтальных вентиляторов и т.д.) Этот класс исключает: - производство бытового холодильного или замораживающего оборудования, см. 27.51 - производство бытовых вентиляторов, см. 27.51 @ru
scope note: Bu sınıf aşağıdakileri kapsamaktadır: - el veya motor gücü ile çalıştırılan kaldırma, taşıma, yükleme ya da boşaltma makinelerinin imalatı: • vinç palangası ve yük asansörleri, bucurgat ve kriko, • kaldırma ve taşıma kuleleri, döner vinç, hareketli kaldırma kafesleri, tekerlekli büyük taşıyıcılar vb. • fabrikalarda kullanılan türden küçük yük taşıtları (el arabaları; tek tekerlekli olan el arabaları vb. dahil) (kaldırma veya taşıma sistemi ya da kendinden hareketli olsun olmasın), • kaldırma, taşıma, yükleme ya da boşaltma amacıyla özel tasarlanmış sanayi robotları ve mekanik manipülatörler. - konveyör (taşıma bantları vb.), teleferikler vb. imalatı, - asansörler, yürüyen merdivenler ve yürüyen yolların imalatı, - kaldırma ve taşıma donanımları için özel parçaların imalatı. Kapsam dışı olanlar; - çok amaçlı kullanım için endüstriyel robotların imalatı, bkz. 28.99, - yeraltında kullanılan devamlı hareketli asansör ve konveyör imalatı, bkz. 28.92, - mekanik kepçelerin, ekskavatörlerin ve yükleyicilerin imalatı, bkz. 28.92, - yüzen vinçlerin, raylı vinçlerin, vinçli kamyonların imalatı, bkz. 30.11, 30.20, - asansörlerin ve yük asansörlerinin kurulumu, bkz. 43.29. @tr
preferred label: Производство на подемно-транспортни машини @bg
preferred label: Výroba zdvihacích a manipulačních zařízení @cs
preferred label: Fremstilling af løfte- og håndteringsudstyr @da
preferred label: Herstellung von Hebezeugen und Fördermitteln @de
preferred label: Κατασκευή εξοπλισμού ανύψωσης και διακίνησης φορτίων @el
preferred label: Fabricación de maquinaria de elevación y manipulación @es
preferred label: Tõste- ja teisaldusseadmete tootmine @et
preferred label: Nosto- ja siirtolaitteiden valmistus @fi
preferred label: Fabrication de matériel de levage et de manutention @fr
preferred label: Emelő-, anyagmozgató gép gyártása
preferred label: Fabbricazione di apparecchi di sollevamento e movimentazione @it
preferred label: Kėlimo ir krovimo įrangos gamyba @lt
preferred label: Pacelšanas un pārvietošanas iekārtu ražošana @lv
preferred label: Manifattura ta' tagħmir biex jittellgħu l-oġġetti u għall-immaniġġar @mt
preferred label: Vervaardiging van hijs-, hef- en transportwerktuigen @nl
preferred label: Produksjon av løfte- og håndteringsutstyr @no
preferred label: Produkcja urządzeń dźwigowych i chwytaków @pl
preferred label: Fabricação de equipamento de elevação e de movimentação @pt
preferred label: Fabricarea echipamentelor de ridicat şi manipulat @ro
preferred label: Производство подъемного и транспортировочного оборудования @ru
preferred label: Výroba dvíhacích a manipulačných zariadení @sk
preferred label: Proizvodnja dvigalnih in transportnih naprav @sl
preferred label: Tillverkning av lyft- och godshanteringsanordningar @sv
preferred label: Kaldırma ve taşıma ekipmanları imalatı @tr
broader: Manufacture of other general-purpose machinery

Manufacture of office machinery and equipment (except computers and peripheral equipment)
type: Concept
notation: 28.23
status: valid
status modified: 2013-10-18
accepted date: 2013-10-18
in scheme: Statistical Classification of Economic Activities in the European Community, Rev. 2 (2008)
scope note: - производство на сметачни машини - производство на събирачни машини, регистриращи касови апарати - производство на калкулатори - електронни или не - производство на машини за обработка на пощата (машини за отпечатване на адреси, за сортиране и поставяне в пликове, за отваряне, затваряне или запечатване на кореспонденция и машини за поставяне или унищожаване на марки), машини за сортиране - производство на пишещи машини - производство на стенографски машини - производство на офис техника за подвързване (например за ламиниране или топлинно свързване) - производство на машини за попълване на чекове - производство на машини за броене и опаковане на монети - производство на острилки за моливи - производство на апарати за пришиване или за изваждане на телчета - производство на уредби за гласуване - производство на устройства за отпускане и нарязване на ленти - производство на перфоратори - производство на механични касови апарати - производство на фотокопирни апарати - производство на тонер касети - производство на черни и бели дъски и дъски за писане с маркери - производство на диктофони - производство на компютърна техника - 26.20 @bg
scope note: Z: - výrobu počítacích strojů - výrobu sčítacích strojů, registračních pokladen - výrobu elektronických a ostatních kalkulaček - výrobu strojů na počítání poštovného, na manipulaci s poštou (plnění obálek, zalepování a adresování; zařízení pro otevírání, třídění a skenování), snášecí zařízení - výrobu psacích strojů - výrobu stenografických strojů - výrobu kancelářských vázacích strojů (tzn. hřebenová vazba nebo lepicí páskou) - výrobu strojů pro vystavování šeků - výrobu zařízení na počítání mincí a balení mincí - výrobu ořezávátek na tužky - výrobu sešívaček a nástrojů na odstraňování svorek - výrobu strojů na počítání hlasů - výrobu dávkovačů samolepicí pásky - výrobu děrovaček - výrobu mechanických registračních pokladen - výrobu fotokopírovacích strojů - výrobu tonerových kazet - výrobu školních tabulí; bílých a značkovacích tabulí - výrobu diktafonů N: - výrobu počítačů a periferních zařízení (26.20) @cs
scope note: Diese Klasse umfasst: - Herstellung von Rechenmaschinen - Herstellung von Addiermaschinen, Registerkassen - Herstellung von elektronischen und sonstigen Rechenmaschinen - Herstellung von Briefmarkenzählgeräten, Postbearbeitungsmaschinen (Kuvertier-, Verschließ- und Adressiermaschinen; Postöffnungs-, Sortier- und Scan-Geräte) - Herstellung von Schreibmaschinen - Herstellung von Stenografiermaschinen - Herstellung von Bindemaschinen für den Büroeinsatz (d. h. zum Binden mit Klebeband oder Kunststoffkleber) - Herstellung von Scheckschreibmaschinen - Herstellung von Münzzähl- und Münzeinwickelmaschinen - Herstellung von Bleistiftspitzmaschinen - Herstellung von Heftmaschinen und Heftklammerentfernern - Herstellung von Wahlmaschinen - Herstellung von Klebstreifenspendern - Herstellung von Lochern - Herstellung von mechanischen Registerkassen - Herstellung von Fotokopiergeräten - Herstellung von Tonerpatronen - Herstellung von Schreibtafeln - Herstellung von Diktiergeräten Diese Klasse umfasst nicht: - Herstellung von Datenverarbeitungsgeräten und peripheren Geräten (s. 26.20) @de
scope note: This class includes: - manufacture of calculating machines - manufacture of adding machines, cash registers - manufacture of calculators, electronic or not - manufacture of postage meters, mail handling machines (envelope stuffing, sealing and addressing machinery; opening, sorting, scanning), collating machinery - manufacture of typewriters - manufacture of stenography machines - manufacture of office-type binding equipment (i.e. plastic or tape binding) - manufacture of cheque writing machines - manufacture of coin counting and coin wrapping machinery - manufacture of pencil sharpeners - manufacture of staplers and staple removers - manufacture of voting machines - manufacture of tape dispensers - manufacture of hole punches - manufacture of cash registers, mechanically operated - manufacture of photocopy machines - manufacture of toner cartridges - manufacture of blackboards; white boards and marker boards - manufacture of dictating machines This class excludes: - manufacture of computers and peripheral equipment, see 26.20 @en
scope note: Esta clase comprende: - la fabricación de máquinas calculadoras - la fabricación de máquinas sumadoras, cajas registradoras - la fabricación de calculadoras, electrónicas o no - la fabricación de franqueadoras, máquinas para la gestión de correo (maquinaria para la preparación de sobres y el despacho y sellado de correspondencia; apertura, clasificación, escaneado), maquinaria de compaginación - la fabricación de máquinas de escribir - la fabricación de máquinas de estenografía - la fabricación de equipos de encuadernación de oficina (es decir, encuadernación con plástico o cinta) - la fabricación de máquinas para rellenar cheques - la fabricación de maquinaria para el recuento y la envoltura de monedas - la fabricación de sacapuntas - la fabricación de grapadoras y extractores de grapas - la fabricación de máquinas de votar - la fabricación de dispensadores de cinta - la fabricación de perforadoras - la fabricación de cajas registradoras de accionamiento mecánico - la fabricación de fotocopiadoras - la fabricación de cartuchos de tóner - la fabricación de pizarras; pizarras blancas y pizarras para rotulador - la fabricación de dictáfonos Esta clase no comprende: - la fabricación de ordenadores y periféricos (véase 26.20) @es
scope note: Cette classe comprend: - la fabrication de machines à calculer - la fabrication de caisses enregistreuses - la fabrication de calculateurs, électroniques ou non - la fabrication de compteurs de timbres-poste, de machines de gestion du courrier (adressage, mise sous pli, cachetage et expédition de plis, ouverture, tri, numérisation), de relieuses - la fabrication de machines à écrire - la fabrication de machines à sténographie - la fabrication de relieuses de bureau (reliures plastiques ou à bande) - la fabrication de machines à écrire des chèques - la fabrication de machines à compter ou à encartoucher les pièces de monnaie - la fabrication de taille-crayons - la fabrication de machines à poser et à enlever les agrafes - la fabrication de machines à voter - la fabrication de distributeurs de ruban - la fabrication de perforatrices - la fabrication de caisses enregistreuses fonctionnant mécaniquement - la fabrication de photocopieuses - la fabrication de cartouches d’encre - la fabrication de tableaux noirs, blancs, etc. - la fabrication de machines à dicter Cette classe ne comprend pas: - la fabrication d’ordinateurs et d’équipements périphériques, voir 26.20 @fr
scope note: Ovaj razred uključuje: - proizvodnju računskih strojeva - proizvodnju strojeva za zbrajanje, registar-blagajni - proizvodnju kalkulatora, elektroničkih ili neelektroničkih - proizvodnju strojeva za frankiranje pošte, uređaja za obradu pošte (uređaja za popunjavanje omotnica, pečatiranje i adresiranje; otvaranje, sortiranje, pregledavanje), uređaja za razvrstavanje - proizvodnju pisaćih strojeva - proizvodnju strojeva za stenografiju - proizvodnju uređaja za uvezivanje uredskog tipa (tj. plastičnih ili u obliku vrpca) - proizvodnju uređaja za ispis čekova - proizvodnju uređaja za prebrojavanje i pakiranje kovanica - proizvodnju strojeva za oštrenje olovaka - proizvodnju uređaja za klamanje i spravica za uklanjanje spojnica - proizvodnju uređaja za glasanje - proizvodnju stalaka za samoljepive vrpce - proizvodnju bušilica - proizvodnju registar-blagajni, mehaničkih - proizvodnju fotokopirnih uređaja - proizvodnju uložaka za toner - proizvodnju školskih ploča, bijelih ploča i ploča za zacrtavanje - proizvodnju diktafona Ovaj razred isključuje: - proizvodnju računala i periferne opreme, vidi 26.20
scope note: Į šią klasę įeina: - skaičiavimo mašinų gamyba - sumavimo mašinų, kasos aparatų gamyba - elektroninių ar neelektroninių skaičiuotuvų gamyba - pašto mokesčio žymėtuvų, pašto tvarkymo mašinų (vokų įdėliojimo, užklijavimo ir adresavimo; atidarymo, rūšiavimo, nuskaitymo), spaudos lapų rūšiavimo ir grupavimo mašinų gamyba - rašomųjų mašinėlių gamyba - stenografijos mašinų gamyba - įstaigų tipo (t.y. plastikinio arba juostinio) įrišimo įrangos gamyba - čekių išrašymo mašinų gamyba - monetų skaičiavimo ir pakavimo mašinų gamyba - pieštukų drožtukų gamyba - susegimo apkabėlėmis ir išsegimo mašinų gamyba - balsavimo mašinų gamyba - lipnios juostelės dalytuvų gamyba - skylmušių gamyba - mechaninių kasos aparatų gamyba - fotokopijavimo mašinų gamyba - rašalo kasečių gamyba - lentų, baltųjų lentų ir lentų, skirtų rašyti žymekliais, gamyba - diktofonų gamyba Į šią klasę neįeina: - kompiuterių ir išorinės įrangos gamyba, žr. 26.20 @lt
scope note: Этот класс включает: - производство взвешивающего оборудования (не лабораторного оборудования): • бытовых и магазинных, платформенных весов, весов для непрерывного взвешивания, мостовых весов и т.д. - производство очистительных аппаратов для жидкостей - производство оборудования для производства, диспергирования или распыления жидких минералов или порошков: • краскопульт, огнетушителей, пескоструйных машин, паровых очищающих машин и т.д. - производство упаковочных и обертывающих устройств: • наполняющих, закрывающих, уплотняющих, завинчивающих или наклеивающих этикетки машин и т.д. - производство оборудования для мытья и сушки бутылок и производства газированных напитков - производство очистительного оборудования для очистки нефти, для химической промышленности, индустрии по производству напитков и т.д. - производство газогенераторов - производство счетных или прочих рулонных машин и цилиндров к ним (за исключением из металла и стекла) - производство центрифуг (за исключением сливкоотделителей и сушильных аппаратов) - производство сальников и т.п. элементов, изготовленных из скомбинированных материалов или прокладок из тех же материалов - производство автоматов для продажи товаров - производство нивелиров/уровней, рулеток/сантиметров и подобных ручных инструментов, точных приборов для слесарей и механиков (за исключением оптических) - производство не электрического сварочного и паяльного оборудования - производство стояков водяного охлаждения и т.п. для прямого охлаждения посредством рециркуляции воды Этот класс исключает: - производство точных (лабораторного типа) весов, см. 26.51 - производство бытового холодильного или замораживающего оборудования, см. 27.51 - производство бытовых вентиляторов, см. 27.51 - производство электросварочного и паяльного оборудования, см. 27.90 - производство сельскохозяйственной распыляющей техники, см. 28.30 - производство оборудования для прокатки металлов или стекла и цилиндров к нему, см. 28.91, 28.99 - производство сушильных аппа… @ru
scope note: Bu sınıf aşağıdakileri kapsamaktadır: - hesap makineleri imalatı, - basit dört işlem makinelerinin, yazarkasaların imalatı, - elektronik olsun veya olmasın hesap makinesi imalatı, - posta ücretlendirme makinelerinin, posta işleme makinelerinin (zarf doldurma, damgalama ve adreslendirme makineleri; açma, tasnif etme, tarama), harmanlama / birleştirme makinelerinin imalatı, - daktilo imalatı, - stenografi makineleri imalatı, - büro-tipi ciltleme donanımları imalatı (örn. plastik veya şerit ciltleme), - çek yazma makineleri imalatı, - madeni para sayma ve madeni para paketleme makineleri imalatı, - kalemtıraş imalatı, - tel zımbalar (kırtasiyede kullanılan) ve tel zımba çıkartıcıları imalatı, - oy kullanma makinesi imalatı, - bant kesicileri imalatı, - delgi aleti imalatı, - mekanik olarak işleyen yazarkasa imalatı, - fotokopi makineleri imalatı, - toner kartuşları imalatı, - yazı tahtalarının (kara tahtalar, beyaz tahtalar vb.) imalatı, - dikte makineleri (taşınabilir, küçük ses kayıt cihazları) imalatı. Kapsam dışı olanlar; - bilgisayar ve çevre birimleri imalatı, bkz. 26.20. @tr
preferred label: Производство на офис техника, без компютърната @bg
preferred label: Výroba kancelářských strojů a zařízení, kromě počítačů a periferních zařízení @cs
preferred label: Fremstilling af kontormaskiner og -udstyr (undtagen computere og ydre enheder) @da
preferred label: Herstellung von Büromaschinen (ohne Datenverarbeitungsgeräte und periphere Geräte) @de
preferred label: Κατασκευή μηχανών και εξοπλισμού γραφείου (εκτός ηλεκτρονικών υπολογιστών και περιφερειακού εξοπλισμού) @el
preferred label: Fabricación de máquinas y equipos de oficina, excepto equipos informáticos @es
preferred label: Kontorimasinate ja -seadmete tootmine, v.a arvutid ja arvuti välisseadmed @et
preferred label: Konttorikoneiden ja -laitteiden valmistus (pl. tietokoneet ja niiden oheislaitteet) @fi
preferred label: Fabrication de machines et d'équipements de bureau (à l'exception des ordinateurs et équipements périphériques) @fr
preferred label: Irodagép gyártása (kivéve: számítógép és perifériái)
preferred label: Fabbricazione di macchine e attrezzature per ufficio (esclusi computer e unità periferiche) @it
preferred label: Įstaigos mašinų ir įrangos (išskyrus kompiuterius ir išorinę įrangą) gamyba @lt
preferred label: Biroja tehnikas un iekārtu ražošana (izņemot datorus un perifērās iekārtas) @lv
preferred label: Manifattura ta' magni u tagħmir għall-uffiċċji (għajr kompjuters u tagħmir periferali) @mt
preferred label: Vervaardiging van kantoormachines en -uitrusting (exclusief computers en randapparatuur) @nl
preferred label: Produksjon av kontormaskiner og utstyr (unntatt datamaskiner og tilleggsutstyr) @no
preferred label: Produkcja maszyn i sprzętu biurowego (z wyłączeniem komputerów i urządzeń peryferyjnych) @pl
preferred label: Fabricação de máquinas e equipamento de escritório (excepto computadores e equipamento periférico) @pt
preferred label: Fabricarea maşinilor şi echipamentelor de birou (exclusiv fabricarea calculatoarelor şi a echipamentelor periferice) @ro
preferred label: Производство офисной техники и оборудования (за исключением компьютеров и периферийного оборудования) @ru
preferred label: Výroba kancelárskych strojov a zariadení (okrem počítačov a periférnych zariadení) @sk
preferred label: Proizvodnja pisarniških strojev in naprav (razen računalnikov in perifernih naprav) @sl
preferred label: Tillverkning av kontorsmaskiner och kontorsutrustning (utom datorer och kringutrustning) @sv
preferred label: Büro makineleri ve ekipmanları imalatı (bilgisayarlar ve çevre birimleri hariç) @tr
broader: Manufacture of other general-purpose machinery

Manufacture of power-driven hand tools
type: Concept
notation: 28.24
status: valid
status modified: 2013-10-18
accepted date: 2013-10-18
in scheme: Statistical Classification of Economic Activities in the European Community, Rev. 2 (2008)
scope note: - производство на преносими ръчни инструменти с пневматично устройство или вграден електрически или неелектрически двигател като: • циркулярни триони или триони с възвратно-постъпателно движение • верижни триони • пробивни машини и ударни пробивни машини • ръчно задвижвани шлифовъчни машини • пневматични машини за забиване на гвоздеи • буфери • фрезови машини за профилиране на повърхности • шлифовъчни машини • телови шивачки • пневматични чукове за занитване • рендета • ножици за метални листове и ниблерио • ударни гаечни ключове • електрически ударни машини за забиване на гвоздеи - производство на сменяеми инструменти за инструменти за ръчна работа - 25.73 - производство на електрически поялници и пистолети за спояване, за ръчна работа - 27.90 @bg
scope note: Z: - výrobu ručních nástrojů a nářadí, s vlastním elektrickým nebo neelektrickým motorem popř. pneumatickým pohonem, např.: • cirkulárky nebo vratné pily • řetězové pily • vrtačky, vyvrtávací stroje, kladivové drtiče a sbíječky • příruční výkonné brusky • hřebíkovačky • leštičky povrchu • pilovací stroje • pěchovadla na písek a pěchovačky na zeminu • stroje na kartáčování drátěnými kartáči • nýtovačky a nýtovací kladiva • hoblovací a kalibrovací zařízení, frézky • řezače plechu, kleště, střihače, křovinořezy, nůžky a štípačky • nárazové utahováky, klíče, šroubováky, seřizovače matic • nastřelovací přístroje N: - výrobu vyměnitelných nástrojů pro ruční nářadí (25.73) - výrobu ručních elektrických pájecích a svařovacích přístrojů (27.90) @cs
scope note: Diese Klasse umfasst: - Herstellung von handgeführten Werkzeugen mit eingebautem Elektromotor oder nichtelektrischem bzw. pneumatischem Kraftantrieb, z. B.: • Kreis- und Stichsägen • Kettensägen • Bohrer und Bohrhämmer • handgeführte Schleifmaschinen mit Kraftantrieb • Druckluftnagler • Poliermaschinen • Oberfräsmaschienen • Schärfmaschinen • Drahtheftmaschinen • Druckluft-Niethämmer • Hobelmaschinen • Scheren und Blechknabber • Schlagschrauber • pyrotechnische Nagler Diese Klasse umfasst nicht: - Herstellung von austauschbaren Werkzeugen für handgeführte Werkzeuge mit Motorantrieb (s. 25.73) - Herstellung von handgeführten elektrischen Löt- und Schweißgeräten (s. 27.90) @de
scope note: This class includes: - manufacture of hand tools, with self-contained electric or non-electric motor or pneumatic drive, such as: • circular or reciprocating saws • chain saws • drills and hammer drills • hand held power sanders • pneumatic nailers • buffers • routers • grinders • staplers • pneumatic rivet guns • planers • shears and nibblers • impact wrenches • powder actuated nailers This class excludes: - manufacture of interchangeable tools for hand tools, see 25.73 - manufacture of electrical hand held soldering and welding equipment, see 27.90 @en
scope note: Esta clase comprende: - la fabricación de herramientas de mano, con motor eléctrico o no eléctrico independiente o mecanismos de accionamiento neumático, como: • sierras circulares o con movimiento alternativo • sierras de cadena • taladros y perforadoras de percusión • lijadoras mecánicas de mano • máquinas neumáticas para clavar clavos • pulidoras • buriladoras • esmeriladoras • grapadoras • remachadoras neumáticas • aplanadoras • cizallas y recortadoras • llaves de percusión • máquinas de clavadoras accionadas mediante pólvora Esta clase no comprende: - la fabricación de útiles intercambiables por máquinas herramienta de mano (véase 25.73) - la fabricación de equipos manuales para soldadura eléctrica (véase 27.90) @es
scope note: Cette classe comprend: - la fabrication d’outils portatifs à moteur électrique ou non électrique intégré ou pneumatique, tels que: • scies circulaires ou alternatives • tronçonneuses • perceuses et perceuses à percussion • ponceuses à main • marteaux pneumatiques • tampons • routeurs • meuleuses • agrafeuses • riveteuses pneumatiques • raboteuses • ciseaux et cisailles • clés à molette • cloueuses à poudre Cette classe ne comprend pas: - la fabrication d’outils interchangeables pour outillage à main, voir 25.73 - la fabrication de matériel électrique portatif à souder et à braser, voir 27.90 @fr
scope note: Ovaj razred uključuje: - proizvodnju ručnih alata, s električnim ili neelektričnim motorom ili na pneumatski pogon, kao što su: • cirkular ili stapni uređaji za piljenje • bušilice i bušni čekići • ručne brusilice • pneumatski uređaji za stavljanje čavala • baferi • usmjerivači • brusilice • uređaji za klamanje • pneumatski čekići • ravnalice • alati za guljenje i grickanje • odvijači • mehanički uređaji za zabijanje čavala Ovaj razred isključuje: - proizvodnju zamjenjivih alata za ručne alate, vidi 25.73 - proizvodnju električne opreme za varenje i lemljenje, uključujući ručnodržeće lemilice, vidi 27.90
scope note: Į šią klasę įeina: - rankinių įrankių su įmontuotu elektriniu arba neelektriniu varikliu ar pneumatine pavara, gamyba: • diskinių ar slankiojamojo judesio pjūklų • grandininių pjūklų • gręžtuvų ir gręžiamųjų plaktukų • rankinių variklinių šlifuotuvų • pneumatinių vinių kalimo įrankių • slopintuvų • fasoninio frezavimo staklių • smulkintuvų • sąsagų kalimo įrankių • pneumatinių kniedytuvų • oblių • žirklių ir vibracinių žirklių • smūginių veržliarakčių • variklinių vinių kalimo įrankių Į šią klasę neįeina: - keičiamųjų rankinių įrankių dalių gamyba, žr. 25.73 - rankinės elektrinio suvirinimo ir litavimo įrangos gamyba, žr. 27.90 @lt
scope note: Bu sınıf aşağıdakileri kapsamaktadır; - elektrik motorlu veya elektrikli olmayan motorlu veya pnömatik el aletlerinin imalatı, örneğin: •yuvarlak veya vargel testere, •zincir testere, •matkaplar ve darbeli matkaplar, •elle kullanılan zımpara makineleri, •pnömatik çivileme aletleri, •parlatma makinesi, •frezeler, •taşlama makineleri, •zımbalama makineleri, •pnömatik perçin tabancaları, •elle kullanılan motorlu planyalar, •pnömatik veya motorlu metal kesme makasları ve metal delme aletleri, •darbeli cıvata anahtarları, •barutlu çivi çakma makineleri. Kapsam dışı olanlar; - el aletleri için birbiriyle değiştirilebilir aletlerin imalatı: matkap uçları, zımbalar (zımba uçları), freze bıçakları vb., bkz. 25.73, - lehim ve kaynak yapmada kullanılan elektrikli el aletleri, bkz. 27.90. @tr
preferred label: Производство на преносими инструменти с вграден двигател @bg
preferred label: Výroba ručních mechanizovaných nástrojů @cs
preferred label: Fremstilling af motordrevet håndværktøj @da
preferred label: Herstellung von handgeführten Werkzeugen mit Motorantrieb @de
preferred label: Κατασκευή ηλεκτροκίνητων εργαλείων χειρός @el
preferred label: Fabricación de herramientas eléctricas manuales @es
preferred label: Ajamiga käsi-tööriistade tootmine @et
preferred label: Voimakäyttöisten käsityökalujen valmistus @fi
preferred label: Fabrication d'outillage portatif à moteur incorporé @fr
preferred label: Gépi meghajtású hordozható kézi szerszámgép gyártása
preferred label: Fabbricazione di utensili portatili a motore @it
preferred label: Variklinių rankinių įrankių gamyba @lt
preferred label: Mehāniskās piedziņas rokas darbarīku ražošana @lv
preferred label: Manifattura ta' għodod ta' l-idejn li jaħdmu bl-elettriku @mt
preferred label: Vervaardiging van elektrisch handgereedschap @nl
preferred label: Produksjon av motordrevet håndverktøy @no
preferred label: Produkcja narzędzi ręcznych mechanicznych @pl
preferred label: Fabricação demáquinas-ferramentas portáteis com motor @pt
preferred label: Fabricarea maşinilor-unelte portabile acţionate electric @ro
preferred label: Производство ручных электрических инструментов @ru
preferred label: Výroba ručného náradia na mechanický pohon @sk
preferred label: Proizvodnja ročnih strojev in naprav @sl
preferred label: Tillverkning av motordrivna handverktyg @sv
preferred label: Motorlu veya pnömatik (hava basınçlı) el aletlerinin imalatı @tr
broader: Manufacture of other general-purpose machinery

Manufacture of non-domestic cooling and ventilation equipment
type: Concept
notation: 28.25
status: valid
status modified: 2013-10-18
accepted date: 2013-10-18
in scheme: Statistical Classification of Economic Activities in the European Community, Rev. 2 (2008)
scope note: - производство на промишлено хладилно или замразяващо оборудване, вкл. сглобяване на съставните им части - производство на машини и апарати за климатизиране на въздух, вкл. за моторни превозни средства - производство на промишлени вентилатори - производство на топлообменници - производство на апарати и устройства за втечняване на въздух или газ - производство на промишлени вентилатори (за монтиране на стени, тавани или покриви) - производство на битови електроуреди (хладилници, замразители и вентилатори) - 27.51 @bg
scope note: Z: - výrobu chladicích a mrazicích zařízení, včetně montáže komponentů - výrobu klimatizačních zařízení, včetně pro motorová vozidla - výrobu průmyslových ventilátorů - výrobu výměníků tepla - výrobu strojů na zkapalnění vzduchu nebo plynů - výrobu střešních ventilátorů (štítové větráky, stropní ventilátory atd.) N: - výrobu chladniček, mrazniček a chladicích boxů převážně pro domácnost (27.51) - výrobu ventilátorů převážně pro domácnost (27.51) @cs
scope note: Diese Klasse umfasst: - Herstellung von Kühl- und Gefriereinrichtungen, einschließlich Baugruppen - Herstellung von Klimageräten, auch für Kraftfahrzeuge - Herstellung von Ventilatoren, nicht für den Haushalt - Herstellung von Wärmeaustauschern - Herstellung von Maschinen zum Verflüssigen von Luft oder Gasen - Herstellung von Hallenentlüftungssystemen (Giebelventilatoren, Dachventilatoren usw.) Diese Klasse umfasst nicht: - Herstellung von Kühl- und Gefriereinrichtungen für Haushalte (s. 27.51) - Herstellung von Haushaltsventilatoren (s. 27.51) @de
scope note: This class includes: - manufacture of refrigerating or freezing industrial equipment, including assemblies of components - manufacture of air-conditioning machines, including for motor vehicles - manufacture of non-domestic fans - manufacture of heat exchangers - manufacture of machinery for liquefying air or gas - manufacture of attic ventilation fans (gable fans, roof ventilators, etc.) This class excludes: - manufacture of domestic refrigerating or freezing equipment, see 27.51 - manufacture of domestic fans, see 27.51 @en
scope note: Esta clase comprende: - la fabricación de maquinaria de congelación y refrigeración industrial, incluidos los ensamblajes de componentes - la fabricación de aparatos de aire acondicionado, incluidos los destinados a vehículos de motor - la fabricación de ventiladores de uso no doméstico - la fabricación de intercambiadores de calor - la fabricación de maquinaria para la licuefacción de aire o gas - la fabricación de ventiladores de tejado (ventiladores de azotea, de alero, etc.) Esta clase no comprende: - la fabricación de maquinaria de congelación y refrigeración para uso doméstico (véase 27.51) - la fabricación de ventiladores domésticos (véase 27.51) @es
scope note: Cette classe comprend: - la fabrication d’équipements industriels pour la production du froid, y compris l’assemblage des éléments les composant - la fabrication de machines et d’appareils pour le conditionnement de l’air, y compris pour les véhicules automobiles - la fabrication de ventilateurs à usage non domestique - la fabrication d’échangeurs de chaleur - la fabrication de machines à liquéfier l’air ou le gaz - la fabrication de ventilateurs de grenier (ventilateurs sur pignon, ventilateurs sur toit, etc.) Cette classe ne comprend pas: - la fabrication de matériel, de machines et d’appareils pour la production du froid de type ménager, voir 27.51 - la fabrication de ventilateurs de type ménager, voir 27.51 @fr
scope note: Ovaj razred uključuje: - proizvodnju industrijskih uređaja za hlađenje i zamrzavanje, uključujući dodatke za glavne komponente - proizvodnju uređaja za klimatizaciju, uključujući one za motorna vozila - proizvodnju ventilatora, osim za kućanstva - proizvodnju toplinskih izmjenjivača - proizvodnju strojeva za ukapljivanje zraka i plina - proizvodnju ventilatora za tavanske prostore (npr. ventilatora za potkrovlje itd.) Ovaj razred isključuje: - proizvodnju uređaja za hlađenje i zamrzavanje u kućanstvima, vidi 27.51 - proizvodnju ventilatora za kućanstva, vidi 27.51
scope note: Į šią klasę įeina: - pramoninės šaldymo ar užšaldymo įrangos, įskaitant komponentų sąrankas, gamyba - oro kondicionavimo įrenginių, įskaitant naudojamus variklinėse transporto priemonėse, gamyba - nebuitinių ventiliatorių gamyba - šilumokaičių gamyba - oro arba dujų suskystinimo įrenginių gamyba - pastogės vėdinimo ventiliatorių (kraigo vėdintuvų, stogo ventiliatorių ir kt.) gamyba Į šią klasę neįeina: - buitinės šaldymo ar užšaldymo įrangos gamyba, žr. 27.51 - buitinių ventiliatorių gamyba, žr. 27.51 @lt
scope note: Этот класс включает: - производство тракторов, используемых в сельском и лесном хозяйстве - производство малых тракторов, управляемых идущим водителем (мотоблоков) - производство косилок, включая газонокосилки - производство сельскохозяйственных самозарядных или с автоматической выгрузкой трейлеров или полуприцепов - производство сельскохозяйственной техники для подготовки почвы, посева или внесения удобрений: • плугов, распределителей удобрений, посевных агрегатов/сеялок, борон и т.д. - производство техники для сбора и молотьбы: • уборочных машин, молотилок, сортировщиков и т.д. - производство доильных машин - производство сельскохозяйственной распыляющей техники - производство различной сельскохозяйственной техники: • оборудования для использования в области птицеводства, пчеловодства, для подготовки кормов и т.д. • машин для очищения, сортировки или обработки яиц, фруктов и т.д. Этот класс исключает: - производство механических ручных сельскохозяйственных инструментов, см. 25.73 - производство конвейеров для использования на фермах, см. 28.22 - производство ручных электрических инструментов, см. 28.24 - производство сливкоотделителей, см. 28.93 - производство оборудования для очистки, сортировки или калибровки семян, зерна или сухих бобовых культур, см. 28.93 - производство дорожных тягачей для полуприцепов, см. 29.10 - производство дорожных прицепов или полуприцепов, см. 29.20 @ru
scope note: Bu sınıf aşağıdakileri kapsamaktadır; - sanayi tipi soğutma veya dondurma donanımlarının imalatı, bileşenlerin montajı dahil, - motorlu taşıtlar için olanlar da dahil iklimlendirme cihazları (klimaların) imalatı, - evde kullanılanlar hariç vantilatörlerin imalatı, - ısı değiştiricilerin (eşanjörlerin) imalatı, - hava ya da gazların sıvılaştırılmasında kullanılan makinelerin imalatı, - çatı havalandırma pervanelerinin (çatı altındaki üç köşeli yan duvardaki havalandırmalar, çatı vantilatörleri, vb.) imalatı Kapsam dışı olanlar; - evde kullanılan soğutma ya da dondurma ekipmanlarının imalatı, bkz. 27.51, - evde kullanılan vantilatörlerin imalatı, bkz. 27.51. @tr
preferred label: Производство на промишлено хладилно и вентилационно оборудване @bg
preferred label: Výroba průmyslových chladicích a klimatizačních zařízení @cs
preferred label: Fremstilling af køle- og ventilationsanlæg (til industriel brug) @da
preferred label: Herstellung von kälte- und lufttechnischen Erzeugnissen, nicht für den Haushalt @de
preferred label: Κατασκευή ψυκτικού και κλιματιστικού εξοπλισμού μη οικιακής χρήσης @el
preferred label: Fabricación de maquinaria de ventilación y refrigeración no doméstica @es
preferred label: Tööstuslike külmutus- ja ventilatsiooniseadmete tootmine @et
preferred label: Muuhun kuin kotitalouskäyttöön tarkoitettujen jäähdytys- ja tuuletuslaitteiden valmistus @fi
preferred label: Fabrication d'équipements aérauliques et frigorifiques industriels @fr
preferred label: Nem háztartási hűtő, légállapot-szabályozó gyártása
preferred label: Fabbricazione di attrezzature di uso non domestico per la refrigerazione e la ventilazione @it
preferred label: Nebuitinių aušinimo ir vėdinimo įrenginių gamyba @lt
preferred label: Rūpniecisko dzesēšanas un ventilācijas iekārtu ražošana @lv
preferred label: Manifattura ta' tagħmir mhux domestiku għat-tkessiħ u l-ventilazzjoni @mt
preferred label: Vervaardiging van machines en apparaten voor de koeltechniek en de klimaatregeling, voor niet-huishoudelijk gebruik @nl
preferred label: Produksjon av kjøle- og ventilasjonsanlegg, unntatt til husholdningsbruk @no
preferred label: Produkcja przemysłowych urządzeń chłodniczych i wentylacyjnych @pl
preferred label: Fabricação de equipamento não doméstico para refrigeração e ventilação @pt
preferred label: Fabricarea echipamentelor de ventilaţie şi frigorifice, exclusiv a echipamentelor de uz casnic @ro
preferred label: Производство промышленного холодильного и вентиляционного оборудования @ru
preferred label: Výroba chladiacich a ventilačných zariadení iných ako pre domácnosti @sk
preferred label: Proizvodnja hladilnih in prezračevalnih naprav, razen za gospodinjstva @sl
preferred label: Tillverkning av maskiner och apparater för kyla och ventilation utom för hushåll @sv
preferred label: Soğutma ve havalandırma donanımlarının imalatı, evde kullanılanlar hariç @tr
broader: Manufacture of other general-purpose machinery

Manufacture of other general-purpose machinery n.e.c.
type: Concept
notation: 28.29
status: valid
status modified: 2013-10-18
accepted date: 2013-10-18
in scheme: Statistical Classification of Economic Activities in the European Community, Rev. 2 (2008)
scope note: - производство на уреди и апарати за претегляне (различни от аналитичните везни): • домакински везни и везни за магазини, везни за непрекъснато претегляне, мостови везни, теглилки и други - производство на апарати за филтриране или пречистване на течности - производство на апарати за изхвърляне, разпръскване или пулверизиране на течни или прахообразни материали: • пожарогасители, шприцпистолети, пясъкоструйни, пароструйни и други подобни машини - производство на машини и апарати за пакетиране и опаковане: • машини за пълнене, затваряне, капсуловане, запечатване, етикетиране - производство на машини за почистване или изсушаване на бутилки и машини и устройства за газиране на напитки - производство на апарати за дестилация или ректификация за нефтените рафинерии, химическата промишленост, производството на напитки - производство на газгенератори - производство на каландри, валци и цилиндри за тях (без тези за метали и стъкло) - производство на центрофуги (без млекарските и тези за облекло) - производство на металопластични и механични уплътнители - производство на автоматични машини за продажба на стоки, вкл. за размяна на монети - производство на либели, ролетки и подобни инструменти за ръчна работа, инструменти за прецизни машини (без оптичните) - производство на неелектрически машини и устройства за спояване, заваряване и повърхностно закаляване - производство на охладителни кули и подобни за непосредствено охлаждане чрез повторно използване на движещата се в затворен кръг вода - производство на аналитични везни - 26.51 - производство на битови електроуреди ( хладилници, замразители и вентилатори) - 27.51 - производство на електрически машини и устройства за спояване и заваряване - 27.90 - производство на пръскачки или прахоразпръсквачки, за селското стопанство - 28.30 - производство на машини за валцуване на метал и стъкло и валци за тях - 28.91, 28.99 - производство на сушилни за селскостопански продукти - 28.93 - производство на апарати за филтриране или пречист… @bg
scope note: Z: - výrobu vážicích zařízení (kromě citlivých laboratorních vah): • váhy pro domácnost a pro obchody, váhy stolní, mostní, pro kontinuální vážení, závaží atd. - výrobu filtračních a čisticích zařízení a přístrojů pro kapaliny - výrobu zařízení pro rozmetání, rozptylování, rozstřikování nebo rozprašování kapalin nebo prášků: • stříkací pistole, hasicí přístroje, stroje na pískování, stroje na čištění vodní párou atd. - výrobu balicích a obalových strojů: • stroje plnicí, uzavírací, pečetící, etiketovací atd. - výrobu strojů pro čištění nebo sušení lahví a na sycení nápojů - výrobu destilačních nebo rektifikačních přístrojů pro použití v rafinerii ropy, chemickém průmyslu, při výrobě nápojů atd. - výrobu plynových generátorů - výrobu kalandrovacích nebo jiných válcovacích strojů a válců pro ně (kromě pro kovy a sklo) - výrobu odstředivek (kromě odstředivek smetany a ždímaček prádla) - výrobu těsnění a podobných spojů vyrobených z kombinací různých materiálů nebo z více vrstev stejného materiálu - výrobu prodejních automatů - výrobu vodováh, krejčovských metrů a podobných ručních nástrojů, přesných strojních nástrojů (kromě optických) - výrobu neelektrických pájecích a svařovacích přístrojů - výrobu chladicích věží a podobných zařízení pro přímé chlazení cirkulací vody N: - výrobu citlivých laboratorních vah (26.51) - výrobu chladniček, mrazniček a chladicích boxů převážně pro domácnost (27.51) - výrobu ventilátorů převážně pro domácnost (27.51) - výrobu elektrických pájecích a svařovacích přístrojů (27.90) - výrobu zemědělských postřikovacích a rozprašovacích zařízení (28.30) - výrobu válcovacích zařízení na kov a sklo a válců pro ně (28.91, 28.99) - výrobu zemědělských sušiček (28.93) - výrobu strojů pro filtrování nebo čištění potravin (28.93) - výrobu odstředivek smetany (28.93) - výrobu sušiček prádla pro prádelny (28.94) - výrobu strojů pro potisk textilu (28.94) @cs
scope note: Diese Klasse umfasst: - Herstellung von Wiegevorrichtungen (mit Ausnahme von Laborwaagen): • Haushalts- und Ladenwaagen, Tafelwaagen, Waagen für kontinuierliches Wiegen, Brückenwaagen, Gewichte usw. - Herstellung von Filter- und Reinigungsanlagen und -geräten für Flüssigkeiten - Herstellung von Vorrichtungen zum Verteilen, Spritzen, Versprühen oder Zerstäuben von Flüssigkeiten oder Pulver: • Spritzpistolen, Feuerlöscher, Sandstrahlmaschinen, Dampfreinigungsmaschinen usw. - Herstellung von Verpackungsmaschinen: • Maschinen zum Füllen, Verschließen, Versiegeln, Verkapseln oder Etikettieren usw. - Herstellung von Maschinen zum Reinigen oder Trocknen von Flaschen und zum Versetzen von Getränken mit Kohlensäure - Herstellung von Destillier- und Rektifizieranlagen für Erdölraffinerien sowie für die Chemie- und die Getränkeherstellung usw. - Herstellung von Gaserzeugern - Herstellung von Kalandern und Walzwerken sowie Walzen dafür (außer für Metall und Glas) - Herstellung von Zentrifugen (außer Milchentrahmern und Wäscheschleudern) - Herstellung von Dichtungen aus einer Verbindung von verschiedenen Materialien oder aus mehreren Schichten desselben Materials - Herstellung von Warenverkaufsautomaten - Herstellung von Wasserwaagen, Bandmaßen und ähnlichen Handwerkzeugen, feinmechanischen Werkzeugen (außer optischen) - Herstellung von nichtelektrischen Löt- und Schweißgeräten - Herstellung von Kühltürmen und ähnlichen Einrichtungen für die Direktkühlung durch Wasserkreisläufe Diese Klasse umfasst nicht: - Herstellung von Feinwaagen (Laborwaagen) (s. 26.51) - Herstellung von Kühl- und Gefriereinrichtungen für Haushalte (s. 27.51) - Herstellung von Haushaltsventilatoren (s. 27.51) - Herstellung von elektrischen Löt- und Schweißgeräten (s. 27.90) - Herstellung von landwirtschaftlichen Spritz- und Sprühmaschinen (s. 28.30) - Herstellung von Metallwalzwerken und Glaswalzmaschinen sowie zugehörigen Walzen (s. 28.91, 28.99) - Herstellung von landwirtschaftlichen Trocknern (s. 28.93) … @de
scope note: This class includes: - manufacture of weighing machinery (other than sensitive laboratory balances): • household and shop scales, platform scales, scales for continuous weighing, weighbridges, weights etc. - manufacture of filtering or purifying machinery and apparatus for liquids - manufacture of equipment for projecting, dispersing or spraying liquids or powders: • spray guns, fire extinguishers, sandblasting machines, steam cleaning machines etc. - manufacture of packing and wrapping machinery: • filling, closing, sealing, capsuling or labelling machines etc. - manufacture of machinery for cleaning or drying bottles and for aerating beverages - manufacture of distilling or rectifying plant for petroleum refineries, chemical industries, beverage industries etc. - manufacture of gas generators - manufacture of calendaring or other rolling machines and cylinders thereof (except for metal and glass) - manufacture of centrifuges (except cream separators and clothes dryers) - manufacture of gaskets and similar joints made of a combination of materials or layers of the same material - manufacture of automatic goods vending machines - manufacture of levels, tape measures and similar hand tools, machinists' precision tools (except optical) - manufacture of non-electrical welding and soldering equipment - manufacture of cooling towers and similar for direct cooling by means of re-circulated water This class excludes: - manufacture of sensitive (laboratory-type) balances, see 26.51 - manufacture of domestic refrigerating or freezing equipment, see 27.51 - manufacture of domestic fans, see 27.51 - manufacture of electrical welding and soldering equipment, see 27.90 - manufacture of agricultural spraying machinery, see 28.30 - manufacture of metal or glass rolling machinery and cylinders thereof, see 28.91, 28.99 - manufacture of agricultural dryers, see 28.93 - manufacture of machinery for filtering or purifying food, see 28.93 - manufacture of cream separators, see 28.93 - … @en
scope note: Esta clase comprende: - la fabricación de máquinas y aparatos para pesar (con exclusión de las balanzas de precisión de laboratorio): • balanzas domésticas y para el comercio, básculas de plataforma, básculas para pesada continua, básculas puente, etc. - la fabricación de máquinas y aparatos para el filtrado o la depuración de líquidos - la fabricación de máquinas y aparatos para proyectar, dispersar o pulverizar líquidos o polvos: • la fabricación de pistolas de pulverización de aerosol, extintores, máquinas y aparatos de chorro de arena, máquinas de limpieza por vapor, etc. - la fabricación de máquinas y aparatos para empaquetar o embalar mercancías: • máquinas para el llenado, cerrado, sellado, encapsulado, etiquetado, etc. - la fabricación de máquinas para limpiar y secar botellas y para gasificar bebidas - la fabricación de unidades de destilación y rectificación para refinerías de petróleo, industrias químicas, industrias de bebidas, etc. - la fabricación de generadores de gas - la fabricación de calandrias y otras laminadoras, así como de los cilindros de éstas (excepto para metal y vidrio) - la fabricación de centrifugadoras (excepto las desnatadoras y las secadoras de ropa) - la fabricación de juntas de estanqueidad y de otras juntas construidas con una combinación de materiales o de capas del mismo material - la fabricación de máquinas expendedoras automáticas - la fabricación de niveles, cintas métricas y herramientas de precisión (excepto ópticas) - la fabricación de equipos para soldadura no eléctrica - la fabricación de torres de refrigeración y estructuras similares para la refrigeración directa mediante agua recirculada Esta clase no comprende: - la fabricación de balanzas de precisión de tipo laboratorio (véase 26.51) - la fabricación de maquinaria de congelación y refrigeración para uso doméstico (véase 27.51) - la fabricación de ventiladores domésticos (véase 27.51) - la fabricación de equipos para soldadura eléctrica (véase 27.90) - la fabricació… @es
scope note: Cette classe comprend: - la fabrication d’appareils et d’instruments de pesage (autres que les balances de précision utilisées dans les laboratoires): • balances de ménage et de magasin, bascules, bascules à pesage continu, ponts-bascules, poids pour balances, etc. - la fabrication d’appareils pour la filtration ou l’épuration des liquides - la fabrication d’appareils à projeter, à disperser ou à pulvériser des matières liquides ou en poudre: • pistolets aérographes, extincteurs, machines et appareils à jet de sable, appareils de nettoyage à vapeur, etc. - la fabrication de machines et d’appareils à empaqueter ou emballer les marchandises: • machines et appareils à remplir, fermer, sceller, capsuler ou étiqueter, etc. - la fabrication de machines et d’appareils servant à nettoyer ou à sécher les bouteilles ainsi que de machines et d’appareils à gazéifier les boissons - la fabrication d’appareils de distillation ou de rectification pour les raffineries de pétrole, les industries chimiques, les industries des boissons, etc. - la fabrication de générateurs de gaz - la fabrication de calandres et de laminoirs ainsi que de cylindres pour ces machines (sauf pour le métal et le verre) - la fabrication de machines centrifuges (sauf les écrémeuses et les sèche-linge) - la fabrication de joints d’étanchéité et de joints similaires composés de matériaux différents ou de plusieurs couches d’un même matériau - la fabrication de machines automatiques de vente de produits - la fabrication de niveaux, de mètres à ruban et d’outils à main similaires, d’instruments pour les travaux de mécanique de précision (sauf optiques) - la fabrication de matériel non électrique à souder et à braser - la fabrication de tours de refroidissement et de dispositifs similaires destinés au refroidissement direct fonctionnant avec de l’eau réinjectée Cette classe ne comprend pas: - la fabrication de balances de précision des types utilisés dans les laboratoires, voir 26.51 - la fabrication de matériel, … @fr
scope note: Ovaj razred uključuje: - proizvodnju uređaja za vaganje (osim osjetljivih laboratorijskih vaga): • vaga za trgovinu i kućanstvo, platformskih vaga, vaga za kontinuirano vaganje, mosnih vaga, utega itd. - proizvodnju strojeva i aparata za filtriranje i pročišćavanje tekućine - proizvodnju uređaja za izbacivanje, raspršivanje i prskanje tekućina ili praha: • pištolja za raspršivanje, aparata za gašenje požara, strojeva za čišćenje pješčanim mlazom, strojeva za čišćenje parom itd. - proizvodnju uređaja za pakiranje i zamatanje: • strojeva za punjenje, zatvaranje, hermetičko zatvaranje, začepljivanje, etiketiranje itd. - proizvodnju strojeva za pranje i sušenje boca i za gaziranje pića - proizvodnju postrojenja za destiliranje ili rektifikaciju u rafinerijama nafte, kemijskoj industriji, industriji pića itd. - proizvodnju plinskih generatora - proizvodnju kalandera i drugih strojeva za valjanje i njihovih cilindara (osim za metal i staklo) - proizvodnju centrifuga (osim strojeva za obiranje mlijeka i centrifuga za sušenje rublja) - proizvodnju brtvila i sličnih spojnica, od kombiniranih materijala ili slojeva istog materijala - proizvodnju automata za prodaju gotove robe - proizvodnju ravnala, krojačkih metara i sličnih ručnih alata, preciznih alata za mehaničare (osim optičkih) - proizvodnju neelektrične opreme za varenje i lemljenje - proizvodnju rashladnih tornjeva i sličnoga za neposredno hlađenje pomoću recirkulirajuće vode Ovaj razred isključuje: - proizvodnju preciznih (laboratorijskih) vaga, vidi 26.51 - proizvodnju opreme za hladnjake i zamrzivače koji se koriste u kućanstvima, vidi 27.51 - proizvodnju ventilatora za kućanstva, vidi 27.51 - proizvodnju električne opreme za varilice i lemilice, vidi 27.90 - proizvodnju poljoprivrednih strojeva za prskanje, vidi 28.30 - proizvodnju uređaja za valjanje metala ili stakla i njihovih dijelova, vidi 28.91, 28.99 - proizvodnju poljoprivrednih sušara, vidi 28.93 - proizvodnju uređaja za filtriranje ili pročišćavanje hra…
scope note: Į šią klasę įeina: - svarstyklių (kitokių negu tiksliosios laboratorinės svarstyklės) gamyba: • buitinių ir prekybinių, platforminių, tolydinio svėrimo, tiltinių svarstyklių, svarsčių ir kt. - skysčių filtravimo ar gryninimo mašinų ir aparatų gamyba - skysčių ar miltelių įterpimo, paskleidimo ar purškimo įrangos gamyba: • purkštuvų, gesintuvų, smėliasraučių, garasraučių valytuvų ir kt. - pakavimo ir vyniojimo mašinų gamyba: • pildymo, uždarymo, sandarinimo, užkimšimo ar ženklinimo mašinų ir kt. - butelių plovimo ar džiovinimo ir gėrimų dujinimo mašinų gamyba - naftos perdirbimo įmonių, chemijos ir gėrimų pramonės distiliavimo ar rektifikavimo ir kt. įrenginių gamyba - dujų generatorių gamyba - kalandravimo ar kitokių valcavimo mašinų ir jų valcų (išskyrus metalo ir stiklo) gamyba - centrifugų (išskyrus pieno separatorių ir drabužių džiovintuvų) gamyba - skirtingų medžiagų ar tos pačios medžiagos kelių sluoksnių tarpiklių ir panašių jungčių gamyba - prekybos automatų gamyba - gulsčiukų, matavimo juostų ir panašių rankinių įrankių, šaltkalvystės tiksliųjų įrankių (išskyrus optinius) gamyba - neelektrinės suvirinimo ir litavimo įrangos gamyba - tiesioginio aušinimo bokštų ir panašių įrenginių, naudojančių pakartotinės cirkuliacijos vandenį, gamyba Į šią klasę neįeina: - (laboratorinių) tiksliųjų svarstyklių gamyba, žr. 26.51 - buitinės šaldymo ar užšaldymo įrangos gamyba, žr. 27.51 - buitinių ventiliatorių gamyba, žr. 27.51 - elektrinio suvirinimo ir litavimo įrangos gamyba, žr. 27.90 - žemės ūkio purškimo mašinų gamyba, žr. 28.30 - metalo ar stiklo valcavimo staklių ir jų valcų gamyba, žr. 28.91, 28.99 - žemės ūkio džiovintuvų, žr. 28.93 - maisto produktų filtravimo ar gryninimo mašinų gamyba, žr. 28.93 - pieno separatorių gamyba, žr. 28.93 - komercinių drabužių džiovintuvų gamyba, žr. 28.94 - tekstilės marginimo mašinų gamyba, žr. 28.94 @lt
scope note: Данная группа включает производство оборудования для обработки металлов давлением и механических станков, например, механических станков для обработки металлов и прочих материалов (дерева, кости, камня, твердой резины, жесткой пластмассы, холодного стекла и т.д.), включая лазерную обработку лучом, ультразвуком, плазменной дугой, магнитными импульсами и т.д. @ru
scope note: Bu sınıf aşağıdakileri kapsamaktadır: - tartı aletleri imalatı (laboratuarlarda kullanılan hassas tartı aletleri hariç): • ev ve dükkanlarda kullanılan tartı aletleri, platformlu tartı aletleri, sürekli ölçüm için tartılar, taşıt baskülleri vb. tartı aletleri. • sıvılar için filtreleme ya da temizleme makine ve aparatları imalatı, - sıvı ve tozları atan, dağıtan ya da püskürten donanımların imalatı: • püskürtme tabancası, yangın söndürme ve kum püskürtme cihazları, buhar temizleme makineleri vb. - paketleme ve ambalajlama makineleri imalatı: • doldurma, kapatma, mühürleme, kapsülleme ya da etiketleme aletleri vb. - şişe temizleme ya da kurutma makineleri ile içeceklerin gazlandırılmasında kullanılan makinelerin imalatı, - petrol rafineleri, kimya sanayii, içecek sanayii vb. için damıtma veya rektifiye donanımları imalatı, - gaz jeneratörleri imalatı, - silindirli haddeleme makineleri ya da diğer haddeleme makineler ile bunların silindirlerinin imalatı (metal ve cam için olanlar hariç), - santrifüj imalatı (krema makinesi, çamaşır kurutma makinesi hariç), - aynı maddenin tabakalarından ya da çeşitli maddelerin kombinasyonundan yapılmış conta ve benzeri bağlantı parçalarının imalatı, - otomatik mal satış makineleri imalatı, - yer terazileri, şerit metreler, mezuralar ve benzeri el aletler ile mekanistlerin hassas aletleri (optik olanlar hariç), - elektrikli olmayan kaynak ve lehim aletlerinin imalatı, - su sirkülasyonu yoluyla doğrudan soğutma için soğutma kuleleri ve benzerlerinin imalatı. Kapsam dışı olanlar: - hassas (laboratuar tipi) terazilerin imalatı, bkz. 26.51, - evlerde kullanılan soğutma ya da dondurma donanımlarının imalatı, bkz. 27.51, - evlerde kullanılan vantilatörlerin imalatı, bkz. 27.51, - elektrikli kaynak ve lehim cihazlarının imalatı, bkz. 27.90, - tarımsal püskürtme makinelerinin imalatı, bkz. 28.30, - metal ve cam haddeleme makinelerinin ve bunların silindirlerinin imalatı, bkz. 28.91, 28.99, - tarımsal kurutma makinelerinin imalatı bkz.28.93, -… @tr
preferred label: Производство на други машини с общо предназначение, некласифицирани другаде @bg
preferred label: Výroba ostatních strojů a zařízení pro všeobecné účely j. n. @cs
preferred label: Fremstilling af andre maskiner til generelle formål i.a.n. @da
preferred label: Herstellung von sonstigen nicht wirtschaftszweigspezifischen Maschinen a. n. g. @de
preferred label: Κατασκευή άλλων μηχανημάτων γενικής χρήσης π.δ.κ.α. @el
preferred label: Fabricación de otra maquinaria de uso general n.c.o.p. @es
preferred label: Mujal liigitamata üldmasinate ja mehhanismide tootmine @et
preferred label: Muualla luokittelematon yleiskäyttöön tarkoitettujen koneiden valmistus @fi
preferred label: Fabrication de machines diverses d'usage général @fr
preferred label: M.n.s. egyéb általános rendeltetésű gép gyártása
preferred label: Fabbricazione di altre macchine di impiego generale n.c.a. @it
preferred label: Kitų, niekur kitur nepriskirtų, bendrosios paskirties mašinų ir įrangos gamyba @lt
preferred label: Citur neklasificētu universālu iekārtu ražošana @lv
preferred label: Manifattura ta' magni oħra għal għanijiet ġenerali n.e.c. @mt
preferred label: Vervaardiging van andere machines en apparaten voor algemeen gebruik, n.e.g. @nl
preferred label: Produksjon av maskiner og utstyr til generell bruk, ikke nevnt annet sted @no
preferred label: Produkcja pozostałych maszyn ogólnego przeznaczenia, gdzie indziej niesklasyfikowana @pl
preferred label: Fabricação de outras máquinas para uso geral, n.e. @pt
preferred label: Fabricarea altor maşini şi utilaje de utilizare generală n.c.a. @ro
preferred label: Производство прочих машин и оборудования общего назначения, не включенных в другие категории @ru
preferred label: Výroba ostatných strojov na všeobecné účely i. n. @sk
preferred label: Proizvodnja drugih strojev in naprav za splošne namene @sl
preferred label: Övrig tillverkning av maskiner för allmänt ändamål @sv
preferred label: Başka yerde sınıflandırılmamış diğer genel amaçlı makinelerin imalatı @tr
broader: Manufacture of other general-purpose machinery

Manufacture of agricultural and forestry machinery
type: Concept
notation: 28.3
status: valid
status modified: 2013-10-18
accepted date: 2013-10-18
in scheme: Statistical Classification of Economic Activities in the European Community, Rev. 2 (2008)
scope note: Ova skupina uključuje proizvodnju strojeva za poljoprivredu i šumarstvo.
scope note: Этот класс включает: - производство механических станков для обработки металлов, включая лазерную обработку лучом, ультразвуком, плазменной дугой, магнитными импульсами и т.д. - производство механических станков для токарной обработки, сверления, измельчения, формования, обработки на строгальном станке, проделывания отверстий, измельчения и т.д. - производство штамповочных и прессующих механических станков - производство компостерных, гидравлических прессов, гидравлических дробилок, подвесных свайных молотов, оборудования для обработки металлов давлением и т.д. - производство волочильных станков, мотальных машин или машин для обработки проволоки Этот класс исключает: - производство запасных частей и комплектующих, см. 25.73 - производство электросварочного и паяльного оборудования, см. 27.90 @ru
preferred label: Производство на машини за селското и горското стопанство @bg
preferred label: Výroba zemědělských a lesnických strojů @cs
preferred label: Fremstilling af landbrugs- og skovbrugsmaskiner @da
preferred label: Herstellung von land- und forstwirtschaftlichen Maschinen @de
preferred label: Κατασκευή γεωργικών και δασοκομικών μηχανημάτων @el
preferred label: Fabricación de maquinaria agraria y forestal @es
preferred label: Põllu- ja metsamajandusmasinate tootmine @et
preferred label: Maa- ja metsätalouskoneiden valmistus @fi
preferred label: Fabrication de machines agricoles et forestières @fr
preferred label: Mezőgazdasági, erdészeti gép gyártása
preferred label: Fabbricazione di macchine per l'agricoltura e la silvicoltura @it
preferred label: Žemės ir miškų ūkio mašinų gamyba @lt
preferred label: Lauksaimniecības un mežsaimniecības mašīnu ražošana @lv
preferred label: Manifattura ta' magni ta' l-agrikoltura u tal-forestrija @mt
preferred label: Vervaardiging van machines en werktuigen voor de landbouw en de bosbouw @nl
preferred label: Produksjon av jordbruks- og skogbruksmaskiner @no
preferred label: Produkcja maszyn dla rolnictwa i leśnictwa @pl
preferred label: Fabricação de máquinas e de tractores para a agricultura, pecuária e silvicultura @pt
preferred label: Fabricarea masinilor şi utilajelor pentru agricultură şi exploatări forestiere @ro
preferred label: Производство сельскохозяйственной и лесохозяйственной техники @ru
preferred label: Výroba strojov pre poľnohospodárstvo a lesníctvo @sk
preferred label: Proizvodnja kmetijskih in gozdarskih strojev @sl
preferred label: Tillverkning av jord- och skogsbruksmaskiner @sv
preferred label: Tarım ve ormancılık makineleri imalatı @tr
broader: Manufacture of machinery and equipment n.e.c.
narrower: Manufacture of agricultural and forestry machinery

Manufacture of agricultural and forestry machinery
type: Concept
notation: 28.30
status: valid
status modified: 2013-10-18
accepted date: 2013-10-18
in scheme: Statistical Classification of Economic Activities in the European Community, Rev. 2 (2008)
scope note: - производство на трактори за селското и горското стопанство - зеленчуково-градинарски трактори, ръчно управлявани - производство на сенокосачки, вкл. косачки за тревни площи - производство на самотоварещи се или саморазтоварващи се ремаркета и полуремаркета за селското стопанство - производство на машини за подготовка или обработка на почвата, за култивация или наторяване: • плугове, сеялки, брани, разпръсквачки на торове и други - производство на машини за събиране на реколтата или вършитба: • машини за събиране на реколтата, вършачки, за сортиране и други - производство на доилни машини - производство на пръскачки или прахоразпръсквачки за селското стопанство - производство на други машини за селското и горското стопанство: • машини и апарати за птицевъдството и пчеларството, машини за подготвяне на храна за животните и други • машини за почистване или сортиране на яйца, плодове и други земеделски продукти - производство на селскостопански сечива и инструменти за ръчна работа, без вграден двигател - 25.73 - производство на конвейери, използвани във фермите - 28.22 - производство на преносими инструменти с вграден двигател - 28.24 - производство на млекарски центрофуги - 28.93 - производство на машини за почистване, сортиране или пресяване на зърна или сухи бобови растения - 28.93 - производство на пътни влекачи за полуремаркета - 29.10 - производство на ремаркета и полуремаркета - 29.20 @bg
scope note: Z: - výrobu traktorů pro zemědělství a lesnictví - výrobu jednonápravových malotraktorů - výrobu žacích strojů včetně sekaček na trávu - výrobu zemědělských samonakládacích nebo samovýklopných přívěsů a návěsů - výrobu zemědělských strojů pro přípravu půdy, pěstování nebo hnojení: • pluhy, rozmetače hnojiva, secí stroje, brány atd. - výrobu sklizňových strojů vč. lesních těžebních strojů a mlátiček: • sklízečky, mlátičky, třídičky atd. - výrobu dojicích strojů - výrobu zemědělských postřikovacích a rozprašovacích zařízení - výrobu různých zemědělských strojů: • stroje pro chov drůbeže a chov včel, stroje na přípravu krmiva atd. • stroje na čištění, třídění nebo značkování (klasifikování) vajec, ovoce a ostatních plodin N: - výrobu zemědělských ručních nástrojů bez motorového pohonu (25.73) - výrobu dopravníků pro použití na farmách (28.22) - výrobu ručních mechanizovaných nástrojů (28.24) - výrobu odstředivek smetany (28.93) - výrobu strojů a přístrojů pro čištění, třídění nebo přesívání osiva, zrna a suchých luštěnin (28.93) - výrobu silničních traktorů pro návěsy (29.10) - výrobu silničních přívěsů a návěsů (29.20) @cs
scope note: Diese Klasse umfasst: - Herstellung von land- und forstwirtschaftlichen Zugmaschinen - Herstellung von Einachsschleppern - Herstellung von Mähmaschinen einschließlich Rasenmähern - Herstellung von landwirtschaftlichen Anhängern und Sattelanhängern mit Selbstlade- und Entladevorrichtung - Herstellung von landwirtschaftlichen Maschinen für die Bodenbearbeitung, zum Pflanzen oder Düngen: • Pflüge, Stalldungstreuer, Sämaschinen, Eggen usw. - Herstellung von Ernte- und Dreschmaschinen: • Erntemaschinen, Dreschmaschinen, Sortiermaschinen usw. - Herstellung von Melkmaschinen - Herstellung von landwirtschaftlichen Spritz- und Sprühmaschinen - Herstellung von verschiedenen landwirtschaftlichen Maschinen: • Maschinen für Geflügelhaltung und Imkerei, Futteraufbereitungsmaschinen usw. • Maschinen zum Säubern, Sortieren oder Klassieren von Eiern, Obst usw. Diese Klasse umfasst nicht: - Herstellung von Handwerkzeugen mit Kraftantrieb (s. 25.73) - Herstellung von Fördergeräten für landwirtschaftliche Zwecke (s. 28.22) - Herstellung von handgeführten Werkzeugen mit Motorantrieb (s. 28.24) - Herstellung von Milchzentrifugen (s. 28.93) - Herstellung von Maschinen, Apparaten und Geräten zum Reinigen, Sortieren oder Sieben von Körner- oder Hülsenfrüchten (s. 28.93) - Herstellung von Sattelstraßenzugmaschinen (s. 29.10) - Herstellung von Straßenanhängern und -sattelanhängern (s. 29.20) @de
scope note: This class includes: - manufacture of tractors used in agriculture and forestry - manufacture of walking (pedestrian-controlled) tractors - manufacture of mowers, including lawnmowers - manufacture of agricultural self-loading or self-unloading trailers or semi-trailers - manufacture of agricultural machinery for soil preparation, planting or fertilising: • ploughs, manure spreaders, seeders, harrows etc. - manufacture of harvesting or threshing machinery: • harvesters, threshers, sorters etc. - manufacture of milking machines - manufacture of spraying machinery for agricultural use - manufacture of diverse agricultural machinery: • poultry-keeping machinery, bee-keeping machinery, equipment for preparing fodder etc. • machines for cleaning, sorting or grading eggs, fruit etc. This class excludes: - manufacture of non-power-driven agricultural hand tools, see 25.73 - manufacture of conveyors for farm use, see 28.22 - manufacture of power-driven hand tools, see 28.24 - manufacture of cream separators, see 28.93 - manufacture of machinery to clean, sort or grade seed, grain or dried leguminous vegetables, see 28.93 - manufacture of road tractors for semi-trailers, see 29.10 - manufacture of road trailers or semi-trailers, see 29.20 @en
scope note: Esta clase comprende: - la fabricación de tractores empleados en la agricultura y en la silvicultura - la fabricación de motocultores - la fabricación de segadoras, incluidos los cortacésped - la fabricación de remolques y semirremolques autocargadores y autodescargadores concebidos para usos agrícolas - la fabricación de máquinas y aparatos agrícolas para preparar el suelo, plantar y abonar: • arados, esparcidoras de estiércol, sembradoras, gradas, etc. - la fabricación de maquinaria cosechadora y trilladora: • cosechadoras, trilladoras, clasificadoras, etc. - la fabricación de máquinas ordeñadoras - la fabricación de maquinaria de pulverización para usos agrícolas - la fabricación de otras máquinas y aparatos usados en la agricultura: • máquinas y aparatos para la avicultura y apicultura, para la preparación de forraje y piensos para los animales, etc. • máquinas para limpiar, separar y clasificar huevos, frutas, etc. Esta clase no comprende: - la fabricación de herramientas agrícolas manuales no eléctricas (véase 25.73) - la fabricación de transportadores para uso agrario (véase 28.22) - la fabricación de herramientas manuales eléctricas (véase 28.24) - la fabricación de desnatadoras (véase 28.93) - la fabricación de maquinaria para limpiar, separar y clasificar semillas, granos y leguminosas de grano seco (véase 28.93) - la fabricación de cabezas tractoras para semirremolques (véase 29.10) - la fabricación de remolques y semirremolques (véase 29.20) @es
scope note: Cette classe comprend: - la fabrication de tracteurs agricoles et forestiers - la fabrication de motoculteurs - la fabrication de faucheuses, y compris les tondeuses à gazon - la fabrication de remorques ou de semi-remorques autochargeuses ou autodéchargeuses, pour usages agricoles - la fabrication de machines, d’appareils et d’engins agricoles pour la préparation du sol, la plantation des cultures ou l’épandage des engrais: • charrues, épandeurs de fumier, semoirs, herses, etc. - la fabrication de machines, d’appareils et d’engins pour la récolte et le battage des produits agricoles: • moissonneuses, batteuses, machines pour le triage, etc. - la fabrication de machines à traire - la fabrication de machines et d’appareils de pulvérisation pour l’agriculture - la fabrication d’autres machines et appareils pour l’agriculture: • machines et appareils pour l’aviculture, l’apiculture, la préparation des aliments ou provendes pour animaux, etc. • machines pour le nettoyage, le triage ou le calibrage des œufs, des fruits, etc. Cette classe ne comprend pas: - la fabrication d’outillage portatif agricole mécanique, voir 25.73 - la fabrication de convoyeurs à usage agricole, voir 28.22 - la fabrication d’outils portatif à moteur, voir 28.24 - la fabrication d’écrémeuses, voir 28.93 - la fabrication de machines pour le nettoyage, le triage ou le calibrage de semences, de grains ou de légumes à cosse secs, voir 28.93 - la fabrication de tracteurs routiers pour semi-remorques, voir 29.10 - la fabrication de remorques ou de semi-remorques routières, voir 29.20 @fr
scope note: Ovaj razred uključuje: - proizvodnju traktora koji se koriste u poljoprivredi i šumarstvu - proizvodnju motokultivatora - proizvodnju kosilica, uključujući kosilice za travnjake - proizvodnju poljoprivrednih samotovarnih i samoistovarnih prikolica i poluprikolica - proizvodnju poljoprivrednih strojeva za pripremu zemljišta, sjetvu ili gnojenje: • plugova, rasipača gnoja, sijačica, drljača itd. - proizvodnju strojeva za žetvu i vršenje: • žetelica, vršalica, razvrstačica itd. - proizvodnju strojeva za mužnju - proizvodnju strojeva za prskanje koji se koriste u poljoprivredi - proizvodnju raznovrsne poljoprivredne opreme: • za uzgoj peradi, uzgoj pčela, pripremu stočne hrane itd. • za čišćenje, sortiranje ili gradiranje jaja, voća itd. Ovaj razred isključuje: - proizvodnju nepogonskih ručnih alata, vidi 25.73 - proizvodnju pokretnih vrpca za upotrebu na poljoprivrednim gospodarstvima, vidi 28.22 - proizvodnju pogonskih ručnih alata, vidi 28.24 - proizvodnju separatora za vrhnje, vidi 28.93 - proizvodnju strojeva za čišćenje, sortiranje, ljuštenje zrnastog ili suhoga mahunastog povrća, vidi 28.93 - proizvodnju cestovnih traktora za poluprikolice, vidi 29.10 - proizvodnju prikolica i poluprikolica, vidi 29.20
scope note: Į šią klasę įeina: - žemės ir miškų ūkio traktorių gamyba - pėsčiojo valdomų traktorių gamyba - žoliapjovių, įskaitant vejapjoves, gamyba - savikrovių ar savivarčių žemės ūkio priekabų ar puspriekabių gamyba - dirvos paruošimo, sodinimo ar tręšimo mašinų gamyba: • plūgų, mėšlakračių, sėjamųjų, akėčių ir kt. - derliaus nuėmimo ar kuliamųjų mašinų gamyba: • kertamųjų, kuliamųjų, rūšiuotuvų ir kt. - melžimo įrenginių gamyba - žemės ūkio purškimo mašinų gamyba - įvairios paskirties žemės ūkio mašinų gamyba: • paukštininkystės, bitininkystės įrangos, pašarų ruošimo ir kt. įrenginių • kiaušinių, vaisių, uogų, ir kt. valymo, rūšiavimo ar kalibravimo mašinų Į šią klasę neįeina: - rankinių nevariklinių žemės ūkio įrankių gamyba, žr. 25.73 - žemės ūkio paskirties konvejerių gamyba, žr. 28.22 - variklinių rankinių įrankių gamyba, žr. 28.24 - pieno separatorių gamyba, žr. 28.93 - grūdinių kultūrų ir džiovintų ankštinių daržovių valymo, rūšiavimo ar kalibravimo mašinų gamyba, žr. 28.93 - kelių vilkikų su puspriekabėmis gamyba, žr. 29.10 - kelių transporto priekabų ar puspriekabių gamyba, žr. 29.20 @lt
scope note: Этот класс включает: - производство механических станков для обработки дерева, кости, камня, твердой резины, жесткой пластмассы, холодного стекла и т.д., включая лазерную обработку лучом, ультразвуком, плазменной дугой, магнитными импульсами и т.д. - производство приспособлений для установки деталей для механических станков - производство делительных головок и прочих специальных приспособлений для механических станков - производство стационарного оборудования для забивания гвоздей, скрепления скобами, склеивания или прочих видов сборки деревянных, пробковых, костяных изделий, а также изделий из жесткой резины или пластика и т.д. - производство стационарных роторных установок или роторных перкуссионных сверлильных установок, заполняющих и клепальных машин, оборудования для нарезки металлических листов и т.д. - производство прессов для производства ДСП и т.п. - производство оборудования для гальванопокрытия Этот класс также включает: - производство комплектующих и аксессуаров для механических станков, перечисленных выше Этот класс исключает: - производство запасных частей для механических станков (буров, пробойников, прессовальных форм, насадок, фрез, инструментов для токарной обработки, лезвий пил и т.д.), см. 25.73 - производство ручного электрического паяльного и сварочного оборудования, см. 27.90 - производство ручных электрических инструментов, см. 28.24 - производство оборудования, используемого на металлургических заводах или в литейных цехах, см. 28.91 - производство техники для горнодобывающей промышленности и подземной разработки, см. 28.92 @ru
scope note: Bu sınıf aşağıdakileri kapsamaktadır: - tarım ve ormancılıkta kullanılan traktörlerin imalatı, - yaya kontrollü traktör imalatı, - biçici makinelerin imalatı (çim biçme makineleri de dahil), - tarımsal amaçlı kendinden yüklemeli veya kendinden boşaltmalı romörkler veya yarı römork imalatı, - toprağın hazırlanması, ekilmesi veya gübrelenmesi için tarımsal makinelerin imalatı: • pulluklar, gübre serpiciler, mibzerler, tırmıklar, diskarolar, tapanlar vb. - hasat veya harman makinelerinin imalatı: • biçer döverler, harman dövücüler, ayıklayıcılar vb. - süt sağma makinelerinin imalatı, - tarımsal kullanım amacıyla püskürtme makinelerinin imalatı, - tarımda kullanılan muhtelif makinelerin imalatı: • kümes hayvanları ve arıcılık makineleri ile hayvan yemleri hazırlamak için kullanılan donanımlar vb., • yumurtaların, meyvelerin vb. temizlenmesi, tasnif edilmesi veya derecelendirilmesi için kullanılan makinelerin imalatı. Kapsam dışı olanlar: - motorsuz tarımsal el aletleri imalatı, bkz. 25.73, - tarımda kullanılan taşıyıcıların (konveyör) imalatı, bkz. 28.22, - motorlu tarımsal el aletlerinin imalatı, bkz. 28.24, - krema ayırıcılarının imalatı, bkz. 28.93, - tohumların, tanelerin ya da kuru baklagillerin temizlenmesi, tasniflenmesi ya da derecelendirilmesi için makinelerin imalatı, bkz. 28.93, - yarı treylerler için tır çekicilerinin imalatı, bkz. 29.10, - yol treylerlerinin ya da yarı treylerlerin imalatı, bkz. 29.20. @tr
preferred label: Производство на машини за селското и горското стопанство @bg
preferred label: Výroba zemědělských a lesnických strojů @cs
preferred label: Fremstilling af landbrugs- og skovbrugsmaskiner @da
preferred label: Herstellung von land- und forstwirtschaftlichen Maschinen @de
preferred label: Κατασκευή γεωργικών και δασοκομικών μηχανημάτων @el
preferred label: Fabricación de maquinaria agraria y forestal @es
preferred label: Põllu- ja metsamajandusmasinate tootmine @et
preferred label: Maa- ja metsätalouskoneiden valmistus @fi
preferred label: Fabrication de machines agricoles et forestières @fr
preferred label: Mezőgazdasági, erdészeti gép gyártása
preferred label: Fabbricazione di macchine per l'agricoltura e la silvicoltura @it
preferred label: Žemės ir miškų ūkio mašinų gamyba @lt
preferred label: Lauksaimniecības un mežsaimniecības mašīnu ražošana @lv
preferred label: Manifattura ta' magni ta' l-agrikoltura u tal-forestrija @mt
preferred label: Vervaardiging van machines en werktuigen voor de landbouw en de bosbouw @nl
preferred label: Produksjon av jordbruks- og skogbruksmaskiner @no
preferred label: Produkcja maszyn dla rolnictwa i leśnictwa @pl
preferred label: Fabricação de máquinas e de tractores para a agricultura, pecuária e silvicultura @pt
preferred label: Fabricarea masinilor şi utilajelor pentru agricultură şi exploatări forestiere @ro
preferred label: Производство сельскохозяйственной и лесохозяйственной техники @ru
preferred label: Výroba strojov pre poľnohospodárstvo a lesníctvo @sk
preferred label: Proizvodnja kmetijskih in gozdarskih strojev @sl
preferred label: Tillverkning av jord- och skogsbruksmaskiner @sv
preferred label: Tarım ve ormancılık makineleri imalatı @tr
broader: Manufacture of agricultural and forestry machinery

Manufacture of metal forming machinery and machine tools
type: Concept
notation: 28.4
status: valid
status modified: 2013-10-18
accepted date: 2013-10-18
in scheme: Statistical Classification of Economic Activities in the European Community, Rev. 2 (2008)
scope note: производство на машини за обработка на метал и други материали (дървесина, камъни, кост, ебонит, твърди пластмаси, за студена обработка на стъкло), вкл. тези работещи с лазерни лъчи, ултразвук, плазмена дъга или магнитни импулси. @bg
scope note: Tato skupina zahrnuje výrobu kovoobráběcích a ostatních obráběcích strojů, tzn. strojů na opracování kovů a jiných materiálů (dřeva, kostí, kamenů, tvrdé pryže, tvrdých plastů, studeného skla atd.), včetně strojů využívajících laserových paprsků, ultrazvukových vln, plazmatických oblouků, magnetických impulsů atd. @cs
scope note: Diese Gruppe umfasst die Herstellung von Maschinen zur Metallbearbeitung und von Werkzeugmaschinen, d. h. von Werkzeugmaschinen zur Bearbeitung von Metallen und anderen Stoffen (Holz, Bein, Hartkautschuk, harten Kunststoffen, kaltem Glas usw.), einschließlich solcher, die dazu einen Laserstrahl, Ultraschallwellen, Plasmabögen, magnetische Impulse usw. nutzen. @de
scope note: This group includes the manufacture of metal forming machinery and machine tools, e.g. manufacture of machine tools for working metals and other materials (wood, bone, stone, hard rubber, hard plastics, cold glass etc.), including those using a laser beam, ultrasonic waves, plasma arc, magnetic pulse etc. @en
scope note: Este grupo comprende la fabricación de máquinas y máquinas herramienta para conformar metales, por ejemplo de máquinas herramienta para trabajar metales y otros materiales (madera, hueso, piedra, caucho endurecido, materias plásticas endurecidas, vidrio en frío, etc.), incluidas aquéllas que utilizan rayos láser, ondas ultrasónicas, arco de plasma, impulsos magnéticos, etc. @es
scope note: Ce groupe comprend la fabrication de machines de formage des métaux et de machines-outils, comme la fabrication de machines-outils pour le travail des métaux et d’autres matériaux (bois, os, pierre, caoutchouc durci, matières plastiques dures ou le travail à froid du verre), y compris la fabrication de machines opérant par faisceaux laser, par ultrasons, par jet de plasma ou par impulsions magnétiques, etc. @fr
scope note: Ova skupina uključuje proizvodnju strojeva za obradu metala i alatnih strojeva npr. proizvodnju alatnih strojeva za obradu metala i ostalih materijala (drva, kosti, kamena, tvrde gume, tvrde plastike, hladnog stakla), uključujući one koji se koriste laserskim zrakama, ultrazvučnim valovima, mlazom plazme, magnetskim pulsom itd.
scope note: Į šią grupę įeina metalo formavimo mašinų ir staklių gamyba, t.y. metalų ir kitų medžiagų (medienos, kaulo, akmens, kietosios gumos, kietųjų plastikų, šaltojo stiklo ir kt.), apdirbimo staklių, įskaitant tas, kuriose naudojamas lazerio pluoštas, ultragarso bangos, plazmos lankas, magnetinis impulsas ir kt., gamybą. @lt
scope note: Данная группа включает производство техники специального назначения, то есть техники для специализированного использования в промышленности или нескольких областях индустрии. Большинство из них также используется в других производственных процессах, таких как, производство продуктов питания или текстильном производстве. Данная группа также включает производство специфического оборудования для прочих (не производственной индустрии) отраслей, такого как, пусковые устройства для воздушных судов или развлекательного оборудования/каруселей и т.п. для мест отдыха. @ru
scope note: Bu grup, metal işleyen makinelerin ve takım tezgahlarının imalatını kapsamaktadır. Örneğin, metal ve diğer maddelerin (ahşap, kemik, sert kauçuk, sert plastik, soğuk cam vb.) işlenmesi için takım tezgahlarının imalatı, lazer ışınlarını, ultrasonik dalgaları, plazma arkları, manyetik darbe ve benzerlerini kullanan mekanizmalar dahildir. @tr
preferred label: Производство на обработващи машини @bg
preferred label: Výroba kovoobráběcích a ostatních obráběcích strojů @cs
preferred label: Fremstilling af metalforarbejdende værktøjsmaskiner og værktøjsmaskiner @da
preferred label: Herstellung von Werkzeugmaschinen @de
preferred label: Κατασκευή μηχανημάτων μορφοποίησης μετάλλου και εργαλειομηχανών @el
preferred label: Fabricación de máquinas herramienta para trabajar el metal y otras máquinas herramienta @es
preferred label: Metallistantside ja muude tööpinkide tootmine @et
preferred label: Metallin työstökoneiden ja konetyökalujen valmistus @fi
preferred label: Fabrication de machines de formage des métaux et de machines-outils @fr
preferred label: Szerszámgép-gyártás
preferred label: Fabbricazione di macchine per la formatura dei metalli e di altre macchine utensili @it
preferred label: Metalo formavimo įrangos ir staklių gamyba @lt
preferred label: Darbgaldu ražošana @lv
preferred label: Manifattura ta' magni tal-metall għall-iffurmar u għodod mekkaniċi @mt
preferred label: Vervaardiging van niet-verspanende machines voor de metaalbewerking en van gereedschapswerktuigen @nl
preferred label: Produksjon av maskiner til metallbearbeiding og annet maskinverktøy @no
preferred label: Produkcja maszyn i narzędzi mechanicznych @pl
preferred label: Fabricação de maquinaria para metalurgia e de máquinas-ferramentas @pt
preferred label: Fabricarea utilajelor pentru prelucrarea metalului şi a maşinilor-unelte @ro
preferred label: Производство оборудования для обработки металлов давлением и механических станков @ru
preferred label: Výroba strojov na tvarovanie kovov a obrábanie @sk
preferred label: Proizvodnja obdelovalnih strojev @sl
preferred label: Tillverkning av maskiner för metallbearbetning och verktygsmaskiner @sv
preferred label: Metal işleme makineleri ve takım tezgahları imalatı @tr
broader: Manufacture of machinery and equipment n.e.c.
narrower: Manufacture of metal forming machinery
narrower: Manufacture of other machine tools

Manufacture of metal forming machinery
type: Concept
notation: 28.41
status: valid
status modified: 2013-10-18
accepted date: 2013-10-18
in scheme: Statistical Classification of Economic Activities in the European Community, Rev. 2 (2008)
scope note: - производство на машини за обработка на метал, вкл. тези работещи с лазерни лъчи, ултразвук, плазмена дъга или магнитни импулси - производство на стругове, машини пробивни, фрезови, шепинги, разстъргващи, шлифовъчни, резбонарезни и други машини, работещи чрез отнемане на метал - производство на машини ковашки или щамповъчни - производство на преси, щамповъчни и хидравлични и чукове щамповъчни, падащи или хидравлични - производство на стендове за изтегляне на пръти или подобни, машини резбонакатни или резбовалцуващи, машини за изработване на изделия от тел - производство на сменяеми инструменти - 25.73 - производство на електрически машини и устройства за спояване и заваряване - 27.90 - производство на неелектрически машини и устройства за спояване и заваряване - 28.29 @bg
scope note: Z: - výrobu kovoobráběcích strojů pro opracování kovů včetně strojů využívajících laserového paprsku, ultrazvukových vln, plazmatických oblouků, magnetických impulsů atd. - výrobu strojů na soustružení, vrtání, frézování, tváření, hoblování, vyvrtávání, broušení atd., kovů - výrobu razicích a lisovacích nástrojů - výrobu děrovacích lisů, hydraulických lisů, hydraulických brzd, bucharů, kovacích strojů atd., pro tváření kovových materiálů - výrobu tažných stolic, strojů na válcování závitu nebo strojů na zpracování kovového drátu N: - výrobu vyměnitelných nástrojů (25.73) - výrobu elektrických pájecích a svařovacích přístrojů (27.90) @cs
scope note: Diese Klasse umfasst: - Herstellung von Werkzeugmaschinen zur Bearbeitung von Metallen einschließlich solcher, die dazu einen Laserstrahl, Ultraschallwellen, Plasmabögen, magnetische Impulse usw. nutzen - Herstellung von Werkzeugmaschinen zum Bohren, Drehen, Fräsen, Erodieren, Hobeln, Läppen, Räumen, Richten, Sägen, Schleifen, Schärfen, Stoßen usw. - Herstellung von Werkzeugmaschinen zum Stanzen oder Pressen - Herstellung von Lochstanzen, hydraulischen Pressen, hydraulischen Gesenkbiegepressen, Fallhämmer, Schmiedemaschinen usw. - Herstellung von Drahtziehmaschinen, Drahtwalzmaschinen und Drahtbearbeitungsmaschinen Diese Klasse umfasst nicht: - Herstellung von auswechselbaren Werkzeugen für handgeführte Werkzeuge mit Motorantrieb (s. 25.73) - Herstellung von elektrischen Löt- und Schweißgeräten (s. 27.90) @de
scope note: This class includes: - manufacture of machine tools for working metals, including those using a laser beam, ultrasonic waves, plasma arc, magnetic pulse etc. - manufacture of machine tools for turning, drilling, milling, shaping, planing, boring, grinding etc. - manufacture of stamping or pressing machine tools - manufacture of punch presses, hydraulic presses, hydraulic brakes, drop hammers, forging machines etc. - manufacture of draw-benches, thread rollers or machines for working wires This class excludes: - manufacture of interchangeable tools, see 25.73 - manufacture of electrical welding and soldering machines, see 27.90 @en
scope note: Esta clase comprende: - la fabricación de máquinas herramienta para el trabajo de los metales, incluidas aquéllas que utilizan rayos láser, ondas ultrasónicas, arco de plasma, impulsos magnéticos, etc. - la fabricación de máquinas herramienta para torneado, fresado, conformación, cepillado, perforación, esmerilado, etc. - la fabricación de máquinas herramienta para embutición o estampación - la fabricación de prensas troqueladoras, prensas hidráulicas, frenos hidráulicos, martillos de caída, máquinas para forjar, etc. - la fabricación de bancos de trefilar, laminadores para roscas, y máquinas para el trabajo con alambre Esta clase no comprende: - la fabricación de herramientas intercambiables (véase 25.73) - la fabricación de máquinas eléctricas para soldadura (véase 27.90) @es
scope note: Cette classe comprend: - la fabrication de machines de formage des métaux, y compris celles opérant par faisceaux laser, par ultrasons, par jet de plasma ou par impulsions magnétiques, etc. - la fabrication de machines-outils servant à tourner, percer, fraiser, limer, raboter, aléser, rectifier, etc. - la fabrication de machines-outils à estamper ou à presser - la fabrication de machines à poinçonner, presses hydrauliques, freins hydrauliques, marteaux-pilons, machines à forger, etc. - la fabrication de bancs à étirer, de machines pour exécuter un filetage par roulage ou de machines pour le travail des métaux sous forme de fils Cette classe ne comprend pas: - la fabrication d’outils interchangeables, voir 25.73 - la fabrication de matériel électrique à souder et à braser, voir 27.90 @fr
scope note: Ovaj razred uključuje: - proizvodnju alatnih strojeva za obradu metala, uključujući one koji se koriste laserskim zrakama, ultrazvučnim valovima, mlazom plazme, magnetskim pulsom itd. - proizvodnju alatnih strojeva za tokarenje, bušenje, glodanje, oblikovanje, blanjanje, brušenje, itd. - proizvodnju alatnih strojeva za utiskivanje i prešanje - proizvodnju preša za presijecanje, hidrauličnih preša, hidrauličnih otkivača, čekića za oblikovanje, strojeva za kovanje itd. - proizvodnju strojeva za vučenje metala, valjaka za žice ili strojeva za rad sa žicom Ovaj razred isključuje: - proizvodnju zamjenjivih alata za ručne alate, vidi 25.73 - proizvodnju uređaja za varenje i lemljenje, vidi 27.90
scope note: Į šią klasę įeina: - metalo apdirbimo staklių, įskaitant tas, kuriose naudojamas lazerio pluoštas, ultragarso bangos, plazmos lankas, magnetinis impulsas ir kt., gamyba - tekinimo, gręžimo, frezavimo, formavimo, drožimo, ištekinimo, šlifavimo ir kt. staklių gamyba - štampavimo ir presavimo staklių gamyba - skylmušių presų, hidraulinių presų, hidraulinių stabdžių, smūginių kūjų, kalybos mašinų ir kt., gamyba - tempimo staklių, sriegių valcavimo ar vielos apdorojimo mašinų gamyba Į šią klasę neįeina: - keičiamųjų įrankių gamyba, žr. 25.73 - elektrinių suvirinimo ir litavimo mašinų gamyba, žr. 27.90 @lt
scope note: Этот класс включает: - производство машин и оборудования для горячей обработки металлов: • конверторов, литейного оборудования, разливочных литейных ковшей, разливочных машин - производство металлосгибающего оборудования и катушек для него Этот класс исключает: - производство форм, см. 28.41 - производство отливочных форм (за исключением литейного оборудования), см. 25.73 - производство оборудования для отливки форм, см. 28.99 @ru
scope note: Bu sınıf aşağıdakileri kapsamaktadır - metal işleyen takım tezgahlarının imalatı (lazer ışınlarını, ultrasonik dalgaları, plazma arklarını, manyetik darbeleri ve benzerlerini kullananlar da dahil), - tornalama, delme, öğütme, şekillendirme, planyalama, oyma, taşlama vb. için takım tezgahı imalatı, - damga ya da pres makineleri imalatı, - metal işlemede kullanılan delgi preslerinin, hidrolik preslerin, hidrolik frenlerin, şahmerdanların (elektrikli çekiçlerin), demir dövme makinelerinin vb. imalatı, - hadde tezgahları, diş haddesi veya tel işleme makineleri imalatı. Kapsam dışı olanlar; - birbiriyle değiştirilebilir aletlerin imalatı, bkz. 25.73. - elektrikli kaynak ve lehim makineleri imalatı bkz.27.90 @tr
preferred label: Производство на машини за обработка на метал @bg
preferred label: Výroba kovoobráběcích strojů @cs
preferred label: Fremstilling af metalforarbejdende værktøjsmaskiner @da
preferred label: Herstellung von Werkzeugmaschinen für die Metallbearbeitung @de
preferred label: Κατασκευή μηχανημάτων μορφοποίησης μετάλλου @el
preferred label: Fabricación de máquinas herramienta para trabajar el metal @es
preferred label: Metallistantside tootmine @et
preferred label: Metallin työstökoneiden valmistus @fi
preferred label: Fabrication de machines de formage des métaux @fr
preferred label: Fémmegmunkáló szerszámgép gyártása
preferred label: Fabbricazione di macchine per la formatura dei metalli @it
preferred label: Metalo formavimo įrangos gamyba @lt
preferred label: Metālapstrādes darbgaldu ražošana @lv
preferred label: Manifattura ta' magni għall-iffurmar tal-metall @mt
preferred label: Vervaardiging van machines voor de metaalbewerking @nl
preferred label: Produksjon av maskinverktøy til metallbearbeiding @no
preferred label: Produkcja maszyn do obróbki metalu @pl
preferred label: Fabricação de maquinaria para metalurgia @pt
preferred label: Fabricarea utilajelor şi a maşinilor-unelte pentru prelucrarea metalului @ro
preferred label: Производство оборудования для обработки металлов давлением @ru
preferred label: Výroba strojov na obrábanie kovov @sk
preferred label: Proizvodnja strojev za oblikovanje in obdelavo kovin @sl
preferred label: Tillverkning av verktygsmaskiner för metallbearbetning @sv
preferred label: Metal işleme makinelerinin imalatı @tr
broader: Manufacture of metal forming machinery and machine tools

Manufacture of other machine tools
type: Concept
notation: 28.49
status: valid
status modified: 2013-10-18
accepted date: 2013-10-18
in scheme: Statistical Classification of Economic Activities in the European Community, Rev. 2 (2008)
scope note: - производство на машини за обработка на дървесина, камъни, кост, ебонит, твърди пластмаси, за студена обработка на стъкло, вкл. тези работещи с лазерни лъчи, ултразвук, плазмена дъга, магнитни импулси или с подобни методи - производство на държачи на инструменти за обработващи машини - производство на делителни глави и други специални приспособления за обработващи машини - производство на неподвижни машини за забиване на пирони, захващане със скоби, залепване или съединяване по друг начин на дървесина, корк, кост, ебонит, твърди пластмаси и подобни твърди материали - производство на неподвижни ротативни или ударни пробивни машини, флайфмашини, нитовъчна машина, машина за рязане на метални листове и други - производство на преси за производство на фурнир и дървесни плочи - производство на машини и апарати за галванотехника - производство на части и принадлежности за други обработващи машини - производство на сменяеми инструменти за обработващи машини (например за щанцоване, нарязване на резби, пробиване, фрезоване, струговане, ленти за триони, ножове и режещи остриета) - 25.73 - производство на електрически поялници и пистолети за спояване, за ръчна работа - 27.90 - производство на преносими инструменти с вграден двигател - 28.24 - производство на машини и оборудване за металургията и леярството - 28.91 - производство на машини за добива и строителството - 28.92 @bg
scope note: Z: - obráběcí stroje pro opracování dřeva, kostí, kamene, tvrdé pryže a plastů, studeného skla atd., včetně strojů využívajících laserového paprsku, ultrazvukových vln, plazmatických oblouků, magnetických impulsů atd. - výrobu upínacích zařízení pro obráběcí stroje - výrobu dělicích hlav a ostatního speciálního příslušenství pro obráběcí nástroje - výrobu stacionárních (nepřenosných) strojů pro přibíjení (hřebíků), spínání (sešívání), lepení nebo jiné spojování (montáž) dřeva, korku, kostí, tvrdé pryže nebo plastů atd. - výrobu stacionárních (nepřenosných) rotačních nebo rotačních nárazových vrtáků, plnicích strojů, nýtovaček, řezaček plechu atd. - výrobu lisů pro výrobu dřevotřískových desek apod. - výrobu strojů pro galvanické pokovování ZT: - výrobu dílů a příslušenství pro uvedené obráběcí stroje N: - výrobu vyměnitelných nástrojů pro obráběcí stroje (vrtáky, děrovací dláta, zápustky, frézy, soustružnické nože, listy pil, řezací nože atd.) (25.73) - výrobu ručních elektrických svařovacích a pájecích přístrojů (27.90) - výrobu ručních nářadí s motorem (28.24) - výrobu strojů pro zpracování kovů nebo pro slévárny (28.91) - výrobu strojů pro těžbu a dobývání (28.92) @cs
scope note: Diese Klasse umfasst: - Herstellung von Werkzeugmaschinen zur Bearbeitung von Holz, Bein, Stein, Hartkautschuk, harten Kunststoffen, kaltem Glas usw. einschließlich solcher, die dazu einen Laserstrahl, Ultraschallwellen, Plasmabögen, magnetische Impulse usw. nutzen - Herstellung von Aufspannvorrichtungen für Werkzeugmaschinen - Herstellung von Teilköpfen und sonstigen Spezialvorrichtungen für Werkzeugmaschinen - Herstellung von ortsfesten Maschinen zum Nageln, Heften, Leimen oder sonstigem Zusammenfügen von Holz, Kork, Bein, Hartgummi oder Kunststoff usw. - Herstellung von ortsfesten Bohrern oder Schlagbohrern, Feilmaschinen, Nietmaschinen, Blechschneidern usw. - Herstellung von Pressen für die Herstellung von Spanplatten u. Ä. - Herstellung von Maschinen zum Elektroplattieren Diese Klasse umfasst ferner: - Herstellung von Teilen und Zubehör für die aufgeführten Werkzeugmaschinen Diese Klasse umfasst nicht: - Herstellung von auswechselbaren Werkzeugen für Werkzeugmaschinen (Bohrer, Stanzwerkzeuge, Gesenke, Fräsen, Sägeblätter, Schneidmesser usw. (s. 25.73) - Herstellung von handgeführten elektrischen Lötkolben und Schweißgeräten (s. 27.90) - Herstellung von handgeführten Werkzeugen mit Motorantrieb (s. 28.24) - Herstellung von Maschinen für den Einsatz in metallurgischen Betrieben oder Gießereien (s. 28.91) - Herstellung von Bergwerksmaschinen (s. 28.92) @de
scope note: This class includes: - manufacture of machine tools for working wood, bone, stone, hard rubber, hard plastics, cold glass etc., including those using a laser beam, ultrasonic waves, plasma arc, magnetic pulse etc. - manufacture of work holders for machine tools - manufacture of dividing heads and other special attachments for machine tools - manufacture of stationary machines for nailing, stapling, glueing or otherwise assembling wood, cork, bone, hard rubber or plastics etc. - manufacture of stationary rotary or rotary percussion drills, filing machines, riveters, sheet metal cutters etc. - manufacture of presses for the manufacture of particle board and the like - manufacture of electroplating machinery This class also includes: - manufacture of parts and accessories for the machine tools listed This class excludes: - manufacture of interchangeable tools for machine tools (drills, punches, dies, taps, milling cutters, turning tools, saw blades, cutting knives etc.), see 25.73 - manufacture of electric hand held soldering irons and soldering guns, see 27.90 - manufacture of power-driven hand tools, see 28.24 - manufacture of machinery used in metal mills or foundries, see 28.91 - manufacture of machinery for mining and quarrying, see 28.92 @en
scope note: Esta clase comprende: - la fabricación de máquinas herramienta para el trabajo de madera, hueso, piedra, caucho endurecido, materias plásticas endurecidas, vidrio en frío, etc., incluidas aquéllas que utilizan rayos láser, ondas ultrasónicas, arco de plasma, impulsos magnéticos, etc. - la fabricación de portapiezas para máquinas herramienta - la fabricación de dispositivos divisores y otros dispositivos especiales para máquinas herramienta - la fabricación de máquinas fijas para clavar, grapar, encolar o ensamblar de otro modo madera, corcho, hueso, caucho endurecido o materias plásticas endurecidas, etc. - la fabricación de perforadoras fijas rotatorias y de percusión, limadoras, remachadoras, cortadoras de láminas de metal, etc. - la fabricación de prensas para la fabricación de tableros de partículas y similares - la fabricación de maquinaria de galvanoplastia Esta clase comprende también: - la fabricación de componentes y accesorios para las máquinas herramienta descritas Esta clase no comprende: - la fabricación de accesorios intercambiables para máquinas herramienta (brocas, punzones, matrices, machos de aterrajar, fresas, adminículos de movimiento radial, hojas de sierra, cuchillas, etc.) (véase 25.73) - la fabricación de soldadores y pistolas de soldar eléctricos de mano (véase 27.90) - la fabricación de herramientas manuales eléctricas (véase 28.24) - la fabricación de maquinaria utilizada en talleres de fundición y trabajo de metales (véase 28.91) - la fabricación de maquinaria para la explotación de minas y canteras (véase 28.92) @es
scope note: Cette classe comprend: - la fabrication de machines-outils pour le travail du bois, de l’os, de la pierre, du caoutchouc durci, des matières plastiques dures ou le travail à froid du verre, y compris celles opérant par faisceaux laser, par ultrasons, par jet de plasma ou par impulsions magnétiques, etc. - la fabrication de porte-pièces pour machines-outils - la fabrication de plateaux diviseurs et autres dispositifs spéciaux pour machines-outils - la fabrication de machines-outils pour clouer, agrafer, coller ou autrement assembler le bois, le liège, l’os, le caoutchouc durci ou les matières plastiques dures, etc. - la fabrication de machines de forage rotatives par percussion, de limeuses, de riveteuses, de machines à découper les feuilles de métal, etc. - la fabrication de presses pour la fabrication de panneaux de bois - la fabrication de machines pour le traitement électrolytique Cette classe comprend également: - la fabrication de pièces et accessoires destinés aux machines-outils énumérées Cette classe ne comprend pas: - la fabrication d’outils interchangeables pour machines-outils (outils à percer ou à poinçonner, matrices, tarauds, fraises, outils à tourner, lames de scies, couteaux tranchants, etc.), voir 25.73 - la fabrication de fers et de fusils à souder et à braser portatifs, voir 27.90 - la fabrication d’outils portatifs à moteur, voir 28.24 - la fabrication de machines utilisées dans les laminoirs ou les fonderies, voir 28.91 - la fabrication de machines pour l’extraction, voir 28.92 @fr
scope note: Ovaj razred uključuje: - proizvodnju alatnih strojeva za obradu drva, kosti, kamena, tvrde gume, tvrde plastike, hladnog stakla itd., uključujući one koji se koriste laserskim zrakama, ultrazvučnim valovima, mlazom plazme, magnetskim pulsom itd. - proizvodnju držača za alatne strojeve - proizvodnju razdjelnih glava i ostalih specijalnih dodataka za alatne strojeve - proizvodnju statičnih strojeva za zabijanje čavala, klamanje, lijepljenje i drugih načina povezivanja drva, pluta, kosti, tvrde gume ili plastike itd. - proizvodnju statičnih rotirajućih ili rotirajućih potresnih bušilica, uređaja za punjenje, pričvršćivača, uređaja za rezanje metala na listiće itd. - proizvodnju preša, pojedinačnih dasaka i slično - proizvodnju strojeva za elektrofrezu Ovaj razred također uključuje: - proizvodnju dijelova i pribora za već spomenute alatne strojeve Ovaj razred isključuje: - proizvodnju zamjenjivih dijelova alata za alatne strojeve (bušilica, svrdla, odvijača, nareznica za navoj, britvica, oštrica za noževe itd.), vidi 25.73 - proizvodnju električnih ručnih lemilica i pištoljskih lemilica, vidi 27.90 - proizvodnju ručnih alata na vozni pogon, vidi 28.24 - proizvodnju strojeva koji se koriste u pogonima metala i ljevaonicama, vidi 28.91 - proizvodnju strojeva za rudarstvo i vađenje, vidi 28.92
scope note: Į šią klasę įeina: - medienos, kaulo, akmens, kietosios gumos, kietųjų plastikų, šaltojo stiklo ir kt. apdirbimo staklių, įskaitant tas kuriose naudojamas lazerio pluoštas, ultragarso bangos, plazmos lankas, magnetinis impulsas ir kt., gamyba - ruošinių laikiklių staklėse gamyba - dalijimo galvučių ir kitų specialiųjų staklių įtaisų gamyba - stacionariųjų medienos, kamštienos, kaulo, kietosios gumos ar plastikų ir kt. sujungimo vinimis, sankabomis, klijais ar kitais būdais, mašinų gamyba - stacionariųjų sukiųjų grąžtų ar sukiųjų gręžiamųjų plaktukų, galandimo staklių, kniedytuvų, lakštinio metalo pjoviklių ir kt. gamyba - smulkinių ir panašių plokščių gamybai skirtų presų gamyba - elektrolitinio dengimo įrenginių gamyba Į šią klasę taip pat įeina: - išvardytų staklių ir mašinų dalių ir reikmenų gamyba Į šią klasę neįeina: - keičiamų staklių įrankių (grąžtų, skylmušių, sriegimo galvučių, sriegiklių, frezavimo pjoviklių, tekinimo įrankių, pjūklų geležčių, pjovimo peilių ir kt.) gamyba, žr. 25.73 - elektrinių rankinių lituoklių ir litavimo pistoletų gamyba, žr. 27.90 - variklinių rankinių įrankių gamyba, žr. 28.24 - metalo valcavimo ar liejimo staklių gamyba, žr. 28.91 - kasyklų ir karjerų eksploatavimo mašinų gamyba, žr. 28.92 @lt
scope note: Этот класс включает: - производство элеваторов и конвейеров непрерывного действия для подземных работ - производство бурильного, режущего оборудования, техники для прокладывания тоннелей и подъемных машин (для подземного и прочего использования) - производство техники для обработки минералов, просеивания, сортировки, разделения, промывки, дробления и т.д. - производство бетоносмесителей и растворосмесителей - производство землеройных машин: • бульдозеров, бульдозеров с поворотным отвалом/универсальных бульдозеров, грейдеров, скребковых конвейеров, выравнивателей, одноковшовых экскаваторов, одноковшовых погрузчиков и т.д. - производство техники для распределения раствора, битума, бетона и т.д. - производство тракторов, используемых в строительной промышленности или горнодобывающей отрасли - производство бульдозеров и отвалов для универсальных бульдозеров - производство самосвалов-внедорожников Этот класс исключает: - производство подъемного и такелажного оборудования, см. 28.22 - производство других тракторов, см. 28.30, 29.10 - производство станков для обработки камня, включая машины для раскалывания или расщепления камня, см. 28.49 - производство грузовиков с бетономешалками, см. 29.10 @ru
scope note: Bu sınıf aşağıdakileri kapsamaktadır; - ahşap, kemik, taş, sert kauçuk (ebonit), sert plastik, soğuk cam vb. işlemek için takım tezgahlarının imalatı (lazer ışınları, ultrasonik dalgalar, plazma arkları, manyetik darbeleri ve benzerlerini kullananlarda dahil). - takım tezgahları için taşıyıcı yüzey imalatı, - takım tezgahları için bölme başlıkları ve diğer özel ek parçaların imalatı, - ahşap, mantar, kemik, sert kauçuk ya da plastik vb.nin çivilenmesi, zımbalanması, yapıştırılması ya da başka şekilde birleştirilmesi için sabit makinelerin imalatı, - sabit rotatif veya rotatif darbeli matkaplarının, eğeleme makinelerinin, perçinleme makinelerinin, metal levha kesme makinelerinin vb. imalatı, - ince elyaflı sunta levhaların ve benzerlerinin imalatında kullanılan pres makinelerinin imalatı - elektriksel kaplama tezgahlarının imalatı Ayrıca bu sınıf aşağıdakileri de kapsamaktadır; - yukarıda yer alan takım tezgahlarının aksesuar ve parçalarının imalatı. Kapsam dışı olanlar; - takım tezgahları için birbiriyle değiştirilebilir aletlerin imalatı (matkaplar, delgeçler, delgiler, tıkaçlar, frezeler, dönen aletler, bıçkı ağızları, kesme bıçakları vb.), bkz. 25.73, - elle kullanılan elektrikli lehim havyası ve lehim tabancalarının imalatı, bkz. 27.90, - motorlu el aletlerinin imalatı, bkz. 28.24, - metal haddeleme ve dökümünde kullanılan makinelerin imalatı, bkz. 28.91, - madencilik ve taşocakçılığı için makinelerin imalatı, bkz. 28.92. @tr
preferred label: Производство на други обработващи машини @bg
preferred label: Výroba ostatních obráběcích strojů @cs
preferred label: Fremstilling af andre værktøjsmaskiner @da
preferred label: Herstellung von sonstigen Werkzeugmaschinen @de
preferred label: Κατασκευή άλλων εργαλειομηχανών @el
preferred label: Fabricación de otras máquinas herramienta @es
preferred label: Muude tööpinkide tootmine @et
preferred label: Muiden konetyökalujen valmistus @fi
preferred label: Fabrication d'autres machines-outils @fr
preferred label: Egyéb szerszámgép gyártása
preferred label: Fabbricazione di altre macchine utensili @it
preferred label: Kitų staklių gamyba @lt
preferred label: Cita veida darbgaldu ražošana @lv
preferred label: Manifattura ta' għodod oħra tal-magni @mt
preferred label: Vervaardiging van andere gereedschapswerktuigen @nl
preferred label: Produksjon av maskinverktøy ikke nevnt annet sted @no
preferred label: Produkcja pozostałych narzędzi mechanicznych @pl
preferred label: Fabricação de outras máquinas-ferramentas @pt
preferred label: Fabricarea altor maşini-unelte n.c.a. @ro
preferred label: Производство прочих металлообрабатывающих станков @ru
preferred label: Výroba ostatných strojov na obrábanie @sk
preferred label: Proizvodnja drugih obdelovalnih strojev @sl
preferred label: Tillverkning av övriga verktygsmaskiner @sv
preferred label: Diğer takım tezgahlarının imalatı @tr
broader: Manufacture of metal forming machinery and machine tools

Manufacture of other special-purpose machinery
type: Concept
notation: 28.9
status: valid
status modified: 2013-10-18
accepted date: 2013-10-18
in scheme: Statistical Classification of Economic Activities in the European Community, Rev. 2 (2008)
scope note: производство на машини със специално предназначение (които се използват в една точно определена или в няколко взаимно свързани производствени дейности). някои специфични машини, които не се използват в производстения процес (например апарати и устройства за изстрелване на въздухоплавателни средства или съоръжения за панаири и паркове за развлечение и други). @bg
scope note: Tato skupina zahrnuje výrobou speciálních strojů určených pro určitá hospodářská odvětví, to znamená pro výlučné používání v některém odvětví dle CZ-NACE, nebo malou skupinou odvětví dle CZ-NACE. Většina z těchto strojů se používá ve výrobních procesech, např. při výrobě potravin nebo textilií. Zahrnuje se sem ale i výroba strojů pro speciální užití v nevýrobním odvětví, např. startovací letecké příslušenství nebo vybavení zábavného parku. @cs
scope note: Diese Gruppe umfasst die Herstellung von Spezialmaschinen, d. h. von Maschinen, die ausschließlich in einem bestimmten Wirtschaftszweig der NACE oder in einigen wenigen Wirtschaftszweigen zum Einsatz kommen. Zwar werden die meisten dieser Maschinen in anderen Herstellungsverfahren, etwa der Herstellung von Nahrungsmitteln oder Textilien verwendet, doch umfasst diese Gruppe auch die Herstellung von Spezialmaschinen für andere Wirtschaftszweige (die nicht die Herstellung von Waren betreffen), etwa Abschussrampen für Flugzeuge oder für Kirmes-Fahrgeschäfte. @de
scope note: This group includes the manufacture of special-purpose machinery, i.e. machinery for exclusive use in an NACE industry or a small cluster of NACE industries. While most of these are used in other manufacturing processes, such as food manufacturing or textile manufacturing, this group also includes the manufacture of machinery specific for other (non-manufacturing industries), such as aircraft launching gear or amusement park equipment. @en
scope note: Este grupo comprende la fabricación de maquinaria para usos específicos, es decir, la maquinaria para un uso exclusivo en una industria o en un pequeño conjunto de industrias de la NACE. Aunque la mayoría de estas máquinas se utilizan en otros procesos de fabricación, como la producción de alimentos o textiles, este grupo comprende asimismo la fabricación de maquinaria específica para otras (industrias no manufactureras), como mecanismos de lanzamiento de aeronaves o equipos para parques de atracciones. @es
scope note: Ce groupe comprend la fabrication de machines d’usage spécifique, c’est-à-dire des machines destinées à être exclusivement utilisées par une branche de la NACE ou un petit groupe de branches de la NACE. Si la plupart de ces machines sont utilisées dans le cadre d’autres opérations de transformation, telles que l’industrie alimentaire ou textile, ce groupe comprend également la fabrication de machines diverses d’usage spécifique destinées à d’autres branches d’activités (relevant de l’industrie non manufacturière), comme la fabrication d’appareils et de dispositifs pour le lancement de véhicules aériens ou de manèges de parcs d’attraction. @fr
scope note: Ova skupina uključuje proizvodnju strojeva za posebne namjene, tj. strojeva koji se isključivo koriste u industrijama klasifikacije NKD ili u manjim skupinama NKD prerađivačke industrije. Dok se većina koristi u proizvodnim procesima kao što su proizvodnja hrane i tekstila, ova skupina također uključuje proizvodnju strojeva karakterističnih za ostale neproizvodne industrije kao što su uređaji za pokretanje zrakoplova ili oprema za zabavne parkove.
scope note: Į šią grupę įeina specialiosios paskirties mašinų, t.y. mašinų, naudojamų išskirtinai pramoninėse NACE veiklos rūšyse ar mažose šių veiklos rūšių grupelėse, gamyba. Nors dauguma jų naudojamos gaminių gamybos procesuose, tokiuose kaip maisto produktų ar tekstilės gamyba, į šią grupę taip pat įeina ir kitose specifinėse (nepramoninėse) veiklos rūšyse naudojamų mašinų, tokių kaip orlaivių paleidimo įrenginiai ar atrakcionų parko įranga, gamyba. @lt
scope note: Этот класс включает: - производство сельскохозяйственных сушилок - производство техники для молочной промышленности: • молочных сепараторов • оборудования для обработки молока (например, гомогенизирующее оборудование) • оборудования для переработки молока (например, для выработки, обработки и формовки сливочного масла) • машин и оборудования для производства сыра (например, гомогенизирующее оборудование, формовочные аппараты, прессы) и т.д. - производство машин и оборудования для мукомольной промышленности: • оборудования для очистки, сортировки или измельчения зерна, семян и сухих бобовых культур (веялок, просеивателей, сортировочных аппаратов, очистителей и т.д.) • оборудования для производства муки, мучки и т.д. (молотилок, подающих устройств, фильтров, удалителей отходов, смесителей, шлифователей для риса, расщепителей для гороха) - производство прессов, дробилок и т.д. используемых в виноделии, производстве сидра, фруктовых соков и т.д. - производство оборудования для хлебопекарной промышленности или для производства макарон, спагетти или подобных продуктов: • хлебопекарных печей, смесителей для теста, разделителей для теста, формователей, укладчиков для кексов и т.д. - производство оборудования для производства различных продуктов питания: • для производства конфет, какао или шоколада, сахара; для пивоваренных заводов; для переработки мяса и домашней птицы, для переработки фруктов, орехов или овощей; для переработки рыбы, моллюсков, ракообразных и прочих морепродуктов • для фильтрации и очистки • прочего оборудования для промышленной переработки или производства продуктов питания или напитков - производство оборудования для производства животных или растительных жиров - производство оборудования для производства табачных изделий и для изготовления сигарет, сигар и табака для курительных трубок, жевательного и нюхательного табака - производство оборудования для производства продуктов питания в гостиницах и ресторанах Этот класс исключает: - производство иррадиа… @ru
scope note: Bu grup, NACE`de yer alan bir sanayide veya sanayilerin küçük bir grubunda özel olarak kullanılan makineler gibi özel amaçlı makinelerin imalatını kapsamaktadır. Bunların çoğu, gıda imalatı veya tekstil imalatı gibi diğer imalat süreçlerinde kullanılırken, bu grup ayrıca, hava taşıtı fırlatma donanımlarının veya eğlence parkı donanımları gibi diğer (imalat dışı sanayilerde kullanılan) özel makinelerin imalatını da kapsamaktadır. @tr
preferred label: Производство на други машини със специално предназначение @bg
preferred label: Výroba ostatních strojů pro speciální účely @cs
preferred label: Fremstilling af øvrige maskiner til specielle formål @da
preferred label: Herstellung von Maschinen für sonstige bestimmte Wirtschaftszweige @de
preferred label: Κατασκευή άλλων μηχανημάτων ειδικής χρήσης @el
preferred label: Fabricación de otra maquinaria para usos específicos @es
preferred label: Muude erimasinate tootmine @et
preferred label: Muiden erikoiskoneiden valmistus @fi
preferred label: Fabrication d'autres machines d'usage spécifique @fr
preferred label: Egyéb speciális rendeltetésű gép gyártása
preferred label: Fabbricazione di altre macchine per impieghi speciali @it
preferred label: Kitų specialiosios paskirties mašinų gamyba @lt
preferred label: Pārējo speciālas nozīmes mašīnu ražošana @lv
preferred label: Manifattura ta' magni oħra għal għanijiet speċjali @mt
preferred label: Vervaardiging van andere machines, apparaten en werktuigen voor specifieke doeleinden @nl
preferred label: Produksjon av andre spesialmaskiner @no
preferred label: Produkcja pozostałych maszyn specjalnego przeznaczenia @pl
preferred label: Fabricação de outras máquinas e equipamento para uso específico @pt
preferred label: Fabricarea altor maşini şi utilaje cu destinaţie specifică @ro
preferred label: Производство прочих видов техники специального назначения @ru
preferred label: Výroba ostatných strojov na špeciálne účely @sk
preferred label: Proizvodnja drugih strojev za posebne namene @sl
preferred label: Tillverkning av andra specialmaskiner @sv
preferred label: Diğer özel amaçlı makinelerin imalatı @tr
broader: Manufacture of machinery and equipment n.e.c.
narrower: Manufacture of machinery for metallurgy
narrower: Manufacture of machinery for mining, quarrying and construction
narrower: Manufacture of machinery for food, beverage and tobacco processing
narrower: Manufacture of machinery for textile, apparel and leather production
narrower: Manufacture of machinery for paper and paperboard production
narrower: Manufacture of plastics and rubber machinery
narrower: Manufacture of other special-purpose machinery n.e.c.

Manufacture of machinery for metallurgy
type: Concept
notation: 28.91
status: valid
status modified: 2013-10-18
accepted date: 2013-10-18
in scheme: Statistical Classification of Economic Activities in the European Community, Rev. 2 (2008)
scope note: - производство на машини и оборудване за металургията и леярството: • конвертори, леярски кофи и кокили, машини за отливане и други - производство на машини за валцуване на метал и валци за тях - производство на формовъчни каси и леярски форми (без кокили) - 25.73 - производство на машини протяжни, работещи чрез отнемане на метал - 28.41 - производство на машини за изработване на пясъчни леярски форми - 28.99 @bg
scope note: Z: - výrobu strojů a zařízení pro zpracování roztavených kovů ve slévárnách: • konvertory, kokily pro ingoty, pánve, licí stroje - výrobu válcovacích stolic, válcovacích tratí a válců pro ně N: - výrobu formovacích rámů a forem (kromě kokil) (25.73) - výrobu tažných stolic (28.41) - výrobu strojů na tvarování licích forem (28.99) @cs
scope note: Diese Klasse umfasst: - Herstellung von Maschinen und Einrichtungen für die Verarbeitung heißer Metalle: • Konverter, Blockformen, Gießpfannen, Gießmaschinen - Herstellung von Metallwalzwerken und zugehörigen Walzen Diese Klasse umfasst nicht: - Herstellung von Drahtziehmaschinen (s. 28.41) - Herstellung von Formkästen und Formen (außer Blockformen) (s. 25.73) - Herstellung von Maschinen zum Herstellen von Gießereiformen (s. 28.99) @de
scope note: This class includes: - manufacture of machines and equipment for handling hot metals: • converters, ingot moulds, ladles, casting machines - manufacture of metal-rolling mills and rolls for such mills This class excludes: - manufacture of draw-benches, see 28.41 - manufacture of moulding boxes and moulds (except ingot moulds), see 25.73 - manufacture of machines for forming foundry moulds, see 28.99 @en
scope note: Esta clase comprende: - la fabricación de maquinaria y equipos mecánicos para la manipulación de metales en caliente: • convertidores, lingoteras, calderos de colada y máquinas de colar y moldear - la fabricación de laminadores, trenes de laminación y cilindros para los mismos Esta clase no comprende: - la fabricación de bancos de trefilar (véase 28.41) - la fabricación de cajas de fundición y de moldes y coquillas (excepto lingoteras) (véase 25.73) - la fabricación de máquinas para la fabricación de moldes de fundición (véase 28.99) @es
scope note: Cette classe comprend: - la fabrication de machines et d’appareils pour la manutention des métaux à haute température: • convertisseurs, lingotières, poches de coulée, machines à couler (mouler) - la fabrication de laminoirs à métaux et de leurs cylindres Cette classe ne comprend pas: - la fabrication de bancs à étirer, voir 28.41 - la fabrication de châssis de fonderie et de moules (à l’exclusion des lingotières), voir 25.73 - la fabrication des machines destinées à construire les moules de fonderie, voir 28.99 @fr
scope note: Ovaj razred uključuje: - proizvodnju strojeva i uređaja za rukovanje vrućim metalima: • konvertera, kalupa za ingote, kutljača, strojeva za lijevanje - proizvodnju valjačkih stanova i njihovih valjaka Ovaj razred isključuje: - proizvodnju strojeva za vučenje metala, vidi 28.41 - proizvodnju kutija i kalupa za lijevanje (osim kalupa za ingote), vidi 25.73 - proizvodnju strojeva za oblikovanje ljevaoničkih kalupa, vidi 28.99
scope note: Į šią klasę įeina: - išlydyto metalo apdorojimo mašinų ir įrangos gamyba: • konverterių, luitadėžių, liejimo kaušų, liejimo mašinų - metalo valcavimo staklynų ir jų valcų gamyba Į šią klasę neįeina: - tempimo staklių gamyba, žr. 28.41 - formadėžių ir liejimo formų, išskyrus luitadėžes, gamyba, žr. 25.73 - liejimo formų gamybos mašinų gamyba, žr. 28.99 @lt
scope note: Этот класс включает: - производство оборудования для изготовления текстильных изделий: • производство машин для подготовки, производства, формования, вытягивания, текстурирования или резки химических текстильных волокон, текстильных материалов или пряжи • машин для подготовки текстильных волокон: хлопкопрядильных установок, предварительно-чесальных, трепальных, раскладочных машин для хлопка, машин для промывки шерсти, карбонизаторов шерсти, гребнечесальных, кардочесальных машин, ровничных машин и т.п. • прядильных машин • машин для подготовки текстильной пряжи: мотальных, сновальных и подобных машин • ткацких станков, включая ручные • вязальных машин • машин для изготовления сетчатого полотна, тюля, кружев, тесьмы, басона и т.п. - производство вспомогательных машин или оборудования для текстильной промышленности: • ремизных рам, жаккардовых механизмов, автоматических выключающих механизмов, механизмов смены челноков, веретен и т.п. - производство текстильного печатного оборудования - производство машин для обработки тканей: • машин и оборудования для стирки, отбеливания, крашения, аппретирования, отделки, нанесения покрытий или пропитки текстильных тканей • производство оборудования для наматывания, разматывания, складывания, резки, кройки, плиссирования, отделки зубчиками текстильных тканей - производство машин и оборудования для прачечных: • гладильных машин, включая гладильные прессы • производственных стиральных и сушильных машин для прачечных • оборудования для сухой чистки - производство швейных машин, головок и иголок для швейных машин (для использования в быту и нет) - производство машин и оборудования для производства и обработки войлока и прочих нетканых материалов - производство машин и оборудования для обработки кожи и изделий из кожи: • оборудования для подготовки, выделки и обработки шкур и кожи • оборудования для изготовления или ремонта обуви или прочих изделий из шкур, кожи и меха Этот класс исключает: - производство бумажных или картонных перфокарт… @ru
scope note: Bu sınıf aşağıdakileri kapsamaktadır: - sıcak metallerin işlenmesine yönelik makine ve donanımların imalatı: • çelik fırını, külçe kalıpları (ingot kalıpları), döküm kepçeleri, döküm makineleri. - metal hadde makineleri ve bunlar için silindir imalatı. Kapsam dışı olanlar; - hadde tezgahı imalatı, bkz. 28.41, - kalıp kutularının ve kalıpların (külçe kalıplar hariç) imalatı, bkz. 25.73, - döküm kalıbı şekillendirme makinelerinin imalatı, bkz. 28.99. @tr
preferred label: Производство на машини и оборудване за металургията и леярството @bg
preferred label: Výroba strojů pro metalurgii @cs
preferred label: Fremstilling af maskiner til metallurgi @da
preferred label: Herstellung von Maschinen für die Metallerzeugung, von Walzwerkseinrichtungen und Gießmaschinen @de
preferred label: Κατασκευή μηχανημάτων για τη μεταλλουργία @el
preferred label: Fabricación de maquinaria para la industria metalúrgica @es
preferred label: Metallurgiamasinate tootmine @et
preferred label: Metallinjalostuskoneiden valmistus @fi
preferred label: Fabrication de machines pour la métallurgie @fr
preferred label: Kohászati gép gyártása
preferred label: Fabbricazione di macchine per la metallurgia @it
preferred label: Metalurgijos mašinų gamyba @lt
preferred label: Mašīnu ražošana metalurģijai @lv
preferred label: Manifattura ta' makkinarju għall-metallurġija @mt
preferred label: Vervaardiging van machines voor de metallurgie @nl
preferred label: Produksjon av maskiner og utstyr til metallurgisk industri @no
preferred label: Produkcja maszyn dla metalurgii @pl
preferred label: Fabricação de máquinas para a metalurgia @pt
preferred label: Fabricarea utilajelor pentru metalurgie @ro
preferred label: Производство машин и оборудования для металлургии @ru
preferred label: Výroba strojov pre metalurgiu @sk
preferred label: Proizvodnja metalurških strojev @sl
preferred label: Tillverkning av maskiner för metallurgi @sv
preferred label: Metalürji makineleri imalatı @tr
broader: Manufacture of other special-purpose machinery

Manufacture of machinery for mining, quarrying and construction
type: Concept
notation: 28.92
status: valid
status modified: 2013-10-18
accepted date: 2013-10-18
in scheme: Statistical Classification of Economic Activities in the European Community, Rev. 2 (2008)
scope note: - производство на подемници, транспортьори или конвейери, с непрекъснато действие, за мини или други подземни работи - производство на машини за сондиране или пробиване, забойни машини, машини за копаене на тунели или галерии - производство на машини и апарати за пресяване, сортиране, разделяне, раздробяване на твърди минерални материали - производство на бетонобъркачки и други смесителни машини за приготвяне на строителни разтвори - производство на самоходни машини за земни работи: • булдозери, грейдери, скрепери, багери, кофъчни товарачи, трамбовъчни машини, пътни валяци и други самоходни машини - производство на пилотонабиващи чукове и машини за изтегляне на пилоти, машини за полагане на строителни разтвори и асфалт, за изравняване на бетон и други - производство на верижни и други трактори за добива или строителството - производство на ножове за булдозери - производство на самосвали, предназначени да бъдат използвани извън пътната мрежа - производство на подемно-транспортни машини - 28.22 - производство на селскостопански трактори - 28.30 - производство на машини за обработка на камък, вкл. машини за рязане или почистване на камък - 28.49 - производство на пътни влекачи за полуремаркета - 29.10 - производство на автобетоносмесители - 29.10 @bg
scope note: Z: - výrobu nepřetržitě pracujících elevátorů a dopravních pásů pro využití v podzemí - výrobu vrtacích, řezacích, hloubicích a razicích strojů (také pro použití v podzemí) - výrobu strojů pro úpravu nerostů prosíváním, tříděním, oddělováním, praním, drcením atd. - výrobu míchačů na betonovou směs a maltu - výrobu strojů na odstraňování a přemisťování zeminy: • buldozery, angldozery, gradery (srovnávače), rypadla, vyrovnávače, mechanické lopaty, lopatové nakládače atd. - výrobu beranidel a stohovačů, rozhrnovačů malty, rozstřikovačů živic, strojů na betonování povrchů atd. - výrobu traktorů na pokládání kolejí a traktorů pro stavebnictví nebo hornictví - výrobu radlic pro buldozery a angldozery - výrobu terénních vyklápěcích náklaďáků N: - výrobu zdvihacích a manipulačních zařízení (28.22) - výrobu jiných traktorů (28.30, 29.10) - výrobu obráběcích strojů na opracování kamene včetně strojů pro štípání nebo čištění kamene (28.49) - výrobu vozidel s míchačem betonové směsi (29.10) @cs
scope note: Diese Klasse umfasst: - Herstellung von Stetigförderern für den Untertageeinsatz - Herstellung von Bohr-, Schneid-, Abteuf- und Streckenvortriebsmaschinen (auch für den Untertageeinsatz) - Herstellung von Maschinen für die Mineralaufbereitung durch Sieben, Sortieren, Trennen, Waschen, Brechen usw. - Herstellung von Beton- und Mörtelmischmaschinen - Herstellung von Erdbewegungsmaschinen: • Planiermaschinen ("Bulldozer" und "Angledozer"), Erd- oder Straßenhobel ("Grader"), Schürfwagen ("Scraper"), Schürf- und andere Schaufellader usw. - Herstellung von Pfahlrammen und -ziehern, Mörtelverteilern, Bitumenverteilern, Maschinen zum Bearbeiten von Betonflächen usw. - Herstellung von Gleiskettenzugmaschinen und Zugmaschinen für den Einsatz am Bau oder im Bergbau - Herstellung von Planierschilden - Herstellung von geländegängigen Muldenkippern Diese Klasse umfasst nicht: - Herstellung von Hebezeugen und Fördermitteln (s. 28.22) - Herstellung von anderen Zugmaschinen (s. 28.30, 29.10) - Herstellung von Werkzeugmaschinen zum Bearbeiten von Steinen einschließlich Maschinen zum Spalten oder Wegräumen von Steinen (s. 28.49) - Herstellung von Betonmischwagen (s. 29.10) @de
scope note: This class includes: - manufacture of continuous-action elevators and conveyors for underground use - manufacture of boring, cutting, sinking and tunnelling machinery (whether or not for underground use) - manufacture of machinery for treating minerals by screening, sorting, separating, washing, crushing etc. - manufacture of concrete and mortar mixers - manufacture of earth-moving machinery: • bulldozers, angle-dozers, graders, scrapers, levellers, mechanical shovels, shovel loaders etc. - manufacture of pile drivers and pile extractors, mortar spreaders, bitumen spreaders, concrete surfacing machinery etc. - manufacture of track laying tractors and tractors used in construction or mining - manufacture of bulldozer and angle-dozer blades - manufacture of off-road dumping trucks This class excludes: - manufacture of lifting and handling equipment, see 28.22 - manufacture of other tractors, see 28.30, 29.10 - manufacture of machine tools for working stone, including machines for splitting or clearing stone, see 28.49 - manufacture of concrete-mixer lorries, see 29.10 @en
scope note: Esta clase comprende: - la fabricación de elevadores y transportadores de acción progresiva para trabajos subterráneos - la fabricación de maquinaria para perforar, cortar, hincar y tunelar (destinada o no a usos subterráneos) - la fabricación de máquinas para el tratamiento de minerales por los procedimientos de cribado, clasificación, separación, lavado, trituración, etc. - la fabricación de hormigoneras y mezcladoras de mortero - la fabricación de máquinas para el movimiento de tierras: • explanadoras y niveladoras, motoniveladoras y traillas aplanadoras, palas mecánicas, cargadores de palas, etc. - la fabricación de martinetes y extractores de pilotes, extendedoras de mortero, extendedoras de betún, máquinas para el tratamiento superficial del hormigón, etc. - la fabricación de tractores de oruga y tractores utilizados en obras de construcción y en la explotación de minas - la fabricación de palas de niveladoras y explanadoras - la fabricación de camiones todoterreno de caja basculante Esta clase no comprende: - la fabricación de material de elevación y manipulación (véase 28.22) - la fabricación de otros tractores (véanse 28.30 y 29.10) - la fabricación de máquinas herramienta para el trabajo de la piedra, incluidas las máquinas para romper y limpiar la piedra (véase 28.49) - la fabricación de camiones hormigonera (véase 29.10) @es
scope note: Cette classe comprend: - la fabrication d’appareils élévateurs, transporteurs ou convoyeurs à action continue pour mines au fond ou autres travaux souterrains - la fabrication de machines de sondage, de haveuses, de machines de forage et de machines à creuser les tunnels ou les galeries (destinées ou non aux travaux souterrains) - la fabrication de machines et d’appareils à traiter les minéraux par criblage, triage, séparation, lavage, concassage, etc. - la fabrication de bétonnières et d’appareils à gâcher le ciment - la fabrication de machines et d’appareils de terrassement: • bouteurs (bulldozers), bouteurs biais (angledozers), niveleuses, décapeuses (scrapers), pelles mécaniques, chargeuses et chargeuses-pelleteuses, etc. - la fabrication de sonnettes de battage et de machines pour l’arrachage des pieux, d’épandeurs de mortier et de bitume, de machines pour le surfaçage du béton, etc. - la fabrication de tracteurs poseurs de voies et de tracteurs utilisés dans la construction et les mines - la fabrication de lames de bouteurs et de bouteurs biais - la fabrication de camions à benne tout-terrains Cette classe ne comprend pas: - la fabrication de matériel de levage et de manutention, voir 28.22 - la fabrication d’autres tracteurs, voir 28.30 et 29.10 - la fabrication de machines-outils pour le travail de la pierre, y compris les machines à fendre ou à cliver, voir 28.49 - la fabrication de camions-bétonnières, voir 29.10 @fr
scope note: Ovaj razred uključuje: - proizvodnju beskonačnih traka i elevatora, za rad pod zemljom - proizvodnju strojeva za bušenje, presijecanje, kopanje i prokopavanje tunela (bez obzira na to jesu li za upotrebu pod zemljom ili ne) - proizvodnju strojeva za obradu minerala prosijavanjem, sortiranjem, separiranjem itd. - proizvodnju mješalica za beton i žbuku - proizvodnju strojeva za uklanjanje zemlje: • buldožera, angladozera, ravnjača, zgrtalica, nivelirki, mehaničkih lopata, utovarivača lopatom itd. - proizvodnju strojeva za nabijanje jamske građe, vađenje jamske građe, nanošenje žbuke, betoniranje itd. - proizvodnju pružnih traktora i traktora za upotrebu u građevinarstvu i rudarstvu - proizvodnju lopata za buldožere i angladozere - proizvodnju terenskih kamiona za odlaganje Ovaj razred isključuje: - proizvodnju opreme za dizanje i prenošenje, vidi 28.22 - proizvodnju ostalih traktora, vidi 28.30, 29.10 - proizvodnju alatnih strojeva za obradu kamena, uključujući strojeve za cijepanje ili grubu obradu kamena, vidi 28.49 - proizvodnju automiješalica za beton, vidi 29.10
scope note: Į šią klasę įeina: - požeminių darbų tolydžiojo veikimo keltuvų ir konvejerių gamyba - gręžimo, kirtimo, šulinių, tunelių kasimo mašinų gamyba - mineralų apdorojimo sijojant, rūšiuojant, skirstant, plaunant, traiškant ir kt. mašinų gamyba - betono ir skiedinio maišytuvų gamyba - žemės darbų mašinų gamyba: • buldozerių, universaliųjų buldozerių, greiderių, skreperių, grunto lygintuvų, mechaninių semtuvų, kaušinių krautuvų ir kt. - poliakalių ir poliatraukių, skiedinio skirstytuvų, bitumo skirstytuvų, betono paviršiaus apdirbimo mašinų ir kt. gamyba - vikšrinių traktorių ir traktorių, naudojamų statyboje ar kasyboje, gamyba - buldozerių ir universaliųjų buldozerių verstuvų gamyba - visureigių savivarčių gamyba Į šią klasę neįeina: - kėlimo ir krovimo įrangos gamyba, žr. 28.22 - kitokių traktorių gamyba, žr. 28.30, 29.10 - akmens apdirbimo staklių, įskaitant akmens skaldymo ar akmenų pašalinimo mašinas, gamyba, žr. 28.49 - automobilinių betono maišytuvų gamyba, žr. 29.10 @lt
scope note: Этот класс включает: - производство машин и оборудования для изготовления бумажной древесной массы и целлюлозы - производство машин и оборудования для изготовления бумаги и картона - производство машин и оборудования для изготовления изделий из бумаги или картона @ru
scope note: Bu sınıf aşağıdakileri kapsamaktadır; - yeraltı kullanımı için sürekli hareketli asansör ve konveyör imalatı, - delme kesme, sondaj, kuyu açma ve tünel açma makineleri(yeraltı kullanım için olsun ya da olmasın) imalatı, - eleme, tasnif etme, ayırma, yıkama, kırma ve benzeri yollarla minerallerin işlemden geçirilmesi için kullanılan makinelerin imalatı, - beton ve harç karıştırıcıları (mikserleri) imalatı, - harfiyat makinelerinin imalatı: • buldozer, angledozer, greyder, kazıyıcı, düzleyici, mekanik kepçe, kepçeli yükleyici vb., • temel kazığı çakma ve sökme makineleri, harç yayıcılar, zift (bitüm) ve asfalt yayıcılar, beton kaplama makineleri vb. imalatı, - inşaatta veya madencilikte kullanılan traktörler ile paletli traktörlerin imalatı, - buldozer ve angledozer bıçaklarının imalatı, - kara yolu dışında kullanılan damperli yük kamyonlarının imalatı. Kapsam dışı olanlar; - kaldırma ve taşıma donanımlarının imalatı, bkz. 28.22, - diğer traktörlerin imalatı, bkz. 28.30, 29.10, - taşların işlenmesi için takım tezgahları imalatı (taşların parçalanması ve temizlenmesinde kullanılan makineler dahil), bkz. 28.49, - beton karıştırıcılı (mikserli) kamyonların imalatı, bkz. 29.10. @tr
preferred label: Производство на машини за добива и строителството @bg
preferred label: Výroba strojů pro těžbu, dobývání a stavebnictví @cs
preferred label: Fremstilling af maskiner til råstofindvindingsindustrien samt bygge- og anlæg @da
preferred label: Herstellung von Bergwerks-, Bau- und Baustoffmaschinen @de
preferred label: Κατασκευή μηχανημάτων για τα ορυχεία, τα λατομεία και τις δομικές κατασκευές @el
preferred label: Fabricación de maquinaria para las industrias extractivas y de la construcción @es
preferred label: Kaevandus-, karjääri- ja ehitusmasinate tootmine @et
preferred label: Kaivos-, louhinta- ja rakennuskoneiden valmistus @fi
preferred label: Fabrication de machines pour l'extraction ou la construction @fr
preferred label: Bányászati, építőipari gép gyártása
preferred label: Fabbricazione di macchine da miniera, cava e cantiere @it
preferred label: Kasybos, karjerų eksploatavimo ir statybos mašinų gamyba @lt
preferred label: Mašīnu ražošana ieguves rūpniecībai, karjeru izstrādei un būvniecībai @lv
preferred label: Manifattura ta' makkinarju għall-minjieri, il-barrieri u l-kostruzzjoni @mt
preferred label: Vervaardiging van machines voor de winning van delfstoffen en voor de bouw @nl
preferred label: Produksjon av maskiner og utstyr til bergverksdrift og bygge- og anleggsvirksomhet @no
preferred label: Produkcja maszyn dla górnictwa, kopalnictwa i budownictwa @pl
preferred label: Fabricação de máquinas para as indústrias extractivas e para a construção @pt
preferred label: Fabricarea utilajelor pentru extracţie şi construcţii @ro
preferred label: Производство техники для горнодобывающей промышленности и подземной разработки @ru
preferred label: Výroba strojov pre baníctvo, ťažbu a stavebníctvo @sk
preferred label: Proizvodnja rudarskih in gradbenih strojev @sl
preferred label: Tillverkning av gruv-, bergbrytnings- och byggmaskiner @sv
preferred label: Maden, taş ocağı ve inşaat makineleri imalatı @tr
broader: Manufacture of other special-purpose machinery

Manufacture of machinery for food, beverage and tobacco processing
type: Concept
notation: 28.93
status: valid
status modified: 2013-10-18
accepted date: 2013-10-18
in scheme: Statistical Classification of Economic Activities in the European Community, Rev. 2 (2008)
scope note: - производство на сушилни за селскостопански продукти - производство на млекопреработващи машини и апарати: • млекарски центрофуги • машини за обработка на мляко (хомогенизатори) • машини и устройства за производство на масло (маслобойни, машини за отливане на масло в различни разфасовки) • машини за производство на сирене и кашкавал (хомогенизатори, машини за отливане, преси) и други - производство на машини за мелничарството: • машини за почистване, сортиране или пресяване на зърна или сухи бобови растения (веялки, транспортни ленти за пресяване, сепаратори, машини за четкане на зърната и други) • машини за производство на грис или брашно и други машини (мелници за зърно, захранващи устройства, машини за пресяване, машини за почистване на брашното от трици, смесители, лющилни машини за ориз, машини за натрошаване на грах) - производство на преси, гроздомелачки и устройства за производство на вино, плодови сокове или подобни напитки - производство на машини за хляб и хлебни изделия или за производство на макарони и подобни изделия: • пещи за хляб, хлебни и сладкарски изделия; машини за месене, разделяне, оформяне и нарязване на тесто - производство на други машини и оборудване за преработка на храни: • машини за производство на захар, какао, шоколад, захарни изделия; машини за първична обработка на плодове, ядки, зеленчуци, месо, риба, мекотели, ракообразни и други водни животни • апарати за филтриране или пречистване • други машини за промишлена обработка или производство на храни или напитки - производство на машини за извличане и преработка на растителни и животински масла или мазнини - производство на машини за пребработка на тютюн или производство на цигари или пури, тютюн за лула, тютюн за дъвчене или смъркане (енфие) - производство на машини за приготвяне на храни в хотели и ресторанти - производство на излъчващи апарати за обработка и контрол на храни и мляко - 26.60 - производство на машини за пакетиране, опаковане и претегляне - 28.29 - производство на ма… @bg
scope note: Z: - výrobu zemědělských sušiček - výrobu strojů pro mlékárenský průmysl: • odstředivky smetany • stroje na zpracování mléka (např. homogenizéry) • stroje na přeměnu mléka (např. máselnice, hnětačky a formovačky másla) • stroje na výrobu sýrů (homogenizéry, tvarovačky, lisy atd.) - výrobu zařízení pro průmyslové mletí zrna: • stroje a přístroje pro čištění, třídění nebo přesívání osiva, zrna nebo suchých luštěnin (čističky, prosévací pásy, separátory, leštičky zrn atd.) • stroje na výrobu mouky, obilné drtě apod. (mlýny, drtírny, plničky, filtry, síta, čističky otrub, loupačky rýže, separátory hrachu) - výrobu lisů, drtičů atd. pro výrobu vína, moštu, ovocných šťáv atd. - výrobu zařízení pro pekárenský průmysl a pro výrobu makaronů, špaget a podobných výrobků: • pekárenské pece, míchačky a děličky těsta, formovací stroje, kráječe, stroje na sázení těstových kusů atd. - výrobu strojů a zařízení pro zpracování různých potravin: • stroje na výrobu cukrovinek, kakaa nebo čokolády; na výrobu cukru; pro pivovary; na zpracování masa nebo drůbeže; na zpracování ovoce, ořechů nebo zeleniny; na zpracování ryb, korýšů nebo jiných plodů moře • stroje pro filtrování nebo čištění potravin • ostatní stroje pro průmyslové zpracování nebo výrobu potravin a nápojů - výrobu strojů pro extrakci nebo zpracování živočišných nebo rostlinných olejů a tuků - výrobu strojů na úpravu a zpracování tabáku a na výrobu cigaret, doutníků, dýmkového, žvýkacího a šňupacího tabáku - výrobu strojů na přípravu potravin v hotelích a restauracích N: - výrobu ozařovacích přístrojů na potraviny a mléko (26.60) - výrobu balicích a vážicích zařízení (28.29) - výrobu strojů na čištění, třídění nebo značkování vajec, ovoce a ostatních plodin (kromě osiva, zrna a suchých luštěnin) (28.30) @cs
scope note: Diese Klasse umfasst: - Herstellung von landwirtschaftlichen Trocknern - Herstellung von milchwirtschaftlichen Maschinen: • Milchzentrifugen • Milchverarbeitungsmaschinen (z. B. Homogenisierapparate) • Maschinen zur Weiterverarbeitung von Milch (z. B. Buttermaschinen, Butterkneter und -formmaschinen) • Maschinen zur Käseherstellung (Homogenisierapparate, Formmaschinen, Pressen usw.) - Herstellung von Maschinen für Mahl- und Schälmühlen: • Maschinen, Apparate und Geräte zum Reinigen, Sortieren oder Sieben von Körner- oder Hülsenfrüchten (Windfegen, Bandausleser, Getreidebürstmaschinen usw.) • Maschinen zur Herstellung von Mehl und dergleichen: Kornmühlen, Füllapparate, Beutelvorrichtungen, Kleiereiniger, Mischpumpen, Reisschälmaschinen, Erbsenspaltmaschinen usw. - Herstellung von Pressen, Quetschen usw. zur Erzeugung von Wein, Apfelwein, Fruchtsaft usw. - Herstellung von Maschinen zur Herstellung von Backwaren und Teigwaren: • Bäckereiöfen, Teigmisch- und -teilmaschinen, Form- und Schneidemaschinen, Kuchensetzmaschinen usw. - Herstellung von Maschinen und Einrichtungen zur Verarbeitung verschiedener Nahrungsmittel: • Maschinen zur Herstellung von Süßwaren, Kakao oder Schokolade; zur Herstellung von Zucker; für Brauereien; zur Verarbeitung von Fleisch oder Geflügel; zur Verarbeitung von Obst, Nüssen oder Gemüse; zur Verarbeitung von Fisch, Schalentieren und anderen Meeresfrüchten • Filter- und Reinigungsmaschinen • sonstige Maschinen für die Be- und Verarbeitung sowie Herstellung von Nahrungsmitteln und Getränken - Herstellung von Maschinen zur Extraktion oder Zubereitung von Ölen und Fetten pflanzlicher oder tierischer Herkunft - Herstellung von Maschinen zur Aufbereitung oder Verarbeitung von Tabak sowie zur Herstellung von Zigaretten, Zigarren, Pfeifen-, Kau- und Schnupftabak - Herstellung von Maschinen zur Zubereitung von Nahrungsmitteln in Hotels und Restaurants Diese Klasse umfasst nicht: - Herstellung von Apparaten zur Bestrahlung von Milch oder anderen Nahrung… @de
scope note: This class includes: - manufacture of agricultural dryers - manufacture of machinery for the dairy industry: • cream separators • milk processing machinery (e.g. homogenisers) • milk converting machinery (e.g. butter chums, butter workers and moulding machines) • cheese-making machines (e.g. homogenisers, moulders, presses) etc. - manufacture of machinery for the grain milling industry: • machinery to clean, sort or grade seeds, grain or dried leguminous vegetables (winnowers, sieving belts, separators, grain brushing machines etc.) • machinery to produce flour and meal etc. (grinding mills, feeders, sifters, bran cleaners, blenders, rice hullers, pea splitters) - manufacture of presses, crushers etc. used to make wine, cider, fruit juices etc. - manufacture of machinery for the bakery industry or for making macaroni, spaghetti or similar products: • bakery ovens, dough mixers, dough-dividers, moulders, slicers, cake depositing machines etc. - manufacture of machines and equipment to process diverse foods: • machinery to make confectionery, cocoa or chocolate; to manufacture sugar; for breweries; to process meat or poultry, to prepare fruit, nuts or vegetables; to prepare fish, shellfish or other seafood • machinery for filtering and purifying • other machinery for the industrial preparation or manufacture of food or drink - manufacture of machinery for the extraction or preparation of animal or vegetable fats or oils - manufacture of machinery for the preparation of tobacco and for the making of cigarettes or cigars, or for pipe or chewing tobacco or snuff - manufacture of machinery for the preparation of food in hotels and restaurants This class excludes: - manufacture of food and milk irradiation equipment, see 26.60 - manufacture of packing, wrapping and weighing machinery, see 28.29 - manufacture of cleaning, sorting or grading machinery for eggs, fruit or other crops (except seeds, grains and dried leguminous vegetables), see 28.30 @en
scope note: Esta clase comprende: - la fabricación de hornos secadores para uso agrícola - la fabricación de maquinaria para la industria láctea: • desnatadoras • maquinaria para la elaboración de la leche (p. ej., homogeneizadoras) • maquinaria para la transformación de la leche (p. ej., mantequeras, batidoras y moldeadoras para la fabricación de mantequilla) • maquinaria para la fabricación de queso (p. ej., homogeneizadoras, moldeadoras, prensas, etc.) - la fabricación de maquinaria empleada en molinería: • maquinaria para limpiar, separar y clasificar semillas, granos y leguminosas de grano seco (aventadoras, cintas cribadoras, separadoras, acepilladoras, etc.) • maquinaria para producir harinas y sémolas, etc. (trituradoras, alimentadoras, cribadoras, depuradoras de afrecho, mezcladoras, descascarilladoras de arroz, partidoras de guisantes) - la fabricación de prensas y trituradoras para la elaboración de vino, sidra y zumos de frutas - la fabricación de maquinaria para la industria panadera o de las pastas alimenticias: • hornos de panadería, mezcladoras y divisoras de masas, moldeadoras, máquinas de rebanar, para depositar las pastas, etc. - la fabricación de maquinaria para la elaboración de alimentos diversos: • maquinaria para la elaboración de confitería, cacao y chocolate, para las industrias azucarera y cervecera, para la preparación de carnes, incluidas las de aves de corral, para la preparación de frutas, frutos secos y hortalizas, para la preparación de pescados, moluscos y otros mariscos • maquinaria para el filtrado o la depuración • otra maquinaria para la preparación o fabricación industrial de alimentos y bebidas - la fabricación de maquinaria para la extracción o preparación de aceites y grasas animales y vegetales - la fabricación de maquinaria para la preparación del tabaco y para la fabricación de cigarrillos y cigarros puros, de tabaco de pipa, de mascar y rapé - la fabricación de maquinaria para la preparación de alimentos en hoteles y restaurantes Es… @es
scope note: Cette classe comprend: - la fabrication de séchoirs pour produits agricoles - la fabrication de machines et d’appareils de laiterie: • écrémeuses • machines pour le traitement du lait (appareils homogénéisateurs, par exemple) • machines et appareils pour la transformation du lait (barattes, malaxeurs et machines à mouler le beurre) • machines et appareils de fromagerie (machines à lisser et à mouler, presses à fromage, etc.) - la fabrication de machines et d’appareils pour la minoterie: • machines pour le nettoyage, le triage ou le calibrage de semences, de grains ou de légumes à cosse secs (tarares, toiles trieuses, séparateurs, machines à brosser les grains, etc.) • machines et appareils pour la production de farines, gruaux ou autres produits de minoterie (moulins à meules de pierre, alimentateurs, machines à nettoyer les sons, mélangeurs, machines à décortiquer le riz, machines à casser les pois) - la fabrication de presses, de pressoirs et de fouloirs, etc., utilisés pour la fabrication du vin, du cidre, des jus de fruits, etc. - la fabrication de machines et d’appareils pour la boulangerie, la pâtisserie, la biscuiterie ou pour la fabrication des pâtes alimentaires: • fours de boulangerie, malaxeurs à pâte, machines à diviser la pâte, machines à mouler la pâte, machines à trancher, appareils de pâtisserie à doser les pâtes et les ingrédients, etc. - la fabrication de machines et d’appareils pour la transformation de divers produits alimentaires: • machines et appareils pour la confiserie ou pour la fabrication du cacao ou du chocolat, pour la sucrerie, pour la brasserie, pour le travail des viandes ou de la volaille, pour la préparation des fruits, des légumes ou des fruits à coque, pour la préparation des poissons, des crustacés, des coquillages et d’autres produits de la mer • appareils pour la filtration ou l’épuration • autres machines pour la préparation ou la fabrication industrielle de produits alimentaires ou de boissons - la fabrication de machines et… @fr
scope note: Ovaj razred uključuje: - proizvodnju poljoprivrednih sušara - proizvodnju strojeva za mljekarsku industriju: • obirača mlijeka • strojeva za doradu mlijeka (npr. homogenizatora) • strojeva za proizvodnju maslaca (npr. strojeva za tučenje, obradu i oblikovanje maslaca) • strojeva za proizvodnju sira (npr. homogenizatora, kalupa, preša) itd. - proizvodnju strojeva za industriju mljevenja žita: • strojeva za čišćenje, sortiranje, i gradiranje sjemenja, zrnja ili sušenoga mahunastog povrća (vršilica, sita za prosijavanje, separatora, strojeva za ljuštenje itd.) • strojeva za proizvodnju brašna i prekrupe itd. (mlinskih valjaka, ubacivača sirovina prosijača, odvajača mekinja, miješalica brašna, ljuštilica za rižu, strojeva za trijebljenje lupina) - proizvodnju preša, drobilica itd. za proizvodnju vina, jabukovače, voćnih sokova itd. - proizvodnju strojeva za pekarsku industriju i izradu makarona, špageta i sličnih proizvoda: • pekarskih pećnica, miješalica za tijesto, dijelilica tijesta, strojeva za oblikovanje, strojeva za rezanje, strojeva za čuvanje kolača itd. - proizvodnju strojeva i opreme za preradu raznovrsne hrane: • strojeva za proizvodnju slastica, kakaa i čokolade, za proizvodnju šećera, za pivovare, za preradu mesa i peradi, za pripremu voća, orašastog voća i povrća; za preradu ribe, rakova i slične morske hrane • uređaja za filtriranje i pročišćavanje • ostalih strojeva za industrijsku pripremu i proizvodnju hrane i pića - proizvodnju strojeva za vađenje i preradu životinjskih i biljnih masti i ulja - proizvodnju strojeva za preradu duhana te za izradu cigara i cigareta ili duhana za lulu, žvakanje i šmrkanje - proizvodnju strojeva za pripremu hrane u hotelima i restoranima Ovaj razred isključuje: - proizvodnju uređaja za zračenje hrane i mlijeka, vidi 26.60 - proizvodnju strojeva za pakiranje, zamatanje i vaganje, vidi 28.29 - proizvodnju strojeva za čišćenje, sortiranje ili gradiranje jaja, voća i ostalih usjeva (osim sjemenki, zrnja ili suhoga mahunastog…
scope note: Į šią klasę įeina: - žemės ūkio džiovintuvų gamyba - pieno pramonės mašinų gamyba: • pieno separatorių • pieno apdorojimo mašinų (pvz., homogenizatorių) • pieno perdirbimo mašinų (pvz., sviestamušių, sviesto apdorojimo ir formavimo mašinų) • sūrių gamybos mašinų (pvz., homogenizatorių, formuotuvų, presų) ir kt. - grūdų malimo pramonės mašinų gamyba: • sėklų, grūdų arba džiovintų ankštinių daržovių valymo, rūšiavimo arba kalibravimo mašinų (vėtytuvų, juostinių sietų, separatorių, šepetinių grūdų valymo mašinų ir kt.) • miltų gamybos mašinų (grudų trupintuvų, tiektuvų, sijotuvų, sėlenų valytuvų, maišytuvų, ryžių lukštentuvų, žirnių skaldytuvų ir kt.) - vyno, sidro, vaisių, uogų sulčių gamyboje naudojamų presų, smulkintuvų ir kt. gamyba - kepimo pramonės arba makaronų, spagečių ar panašių produktų gamybos mašinų gamyba: • kepyklų krosnių, tešlos maišytuvų, dalytuvų, formuotuvų, raikytuvų, pyragaičių išdėstymo mašinų ir kt. - įvairių maisto produktų apdorojimo mašinų ir įrenginių gamyba: • saldumynų, kakavos ar šokolado gamybos; cukraus gamybos; alaus gamybos; mėsos ar paukštienos apdorojimo, vaisių, uogų, riešutų ar daržovių paruošimo; žuvų, vėžiagyvių ar kitų jūros produktų paruošimo mašinų • filtravimo ir gryninimo mašinų • kitų maisto produktų ar gėrimų pramoninio paruošimo ar gamybos mašinų - gyvūninių arba augalinių riebalų ar aliejaus ekstrahavimo ar paruošimo mašinų gamyba - tabako paruošimo ir cigarečių ar cigarų, pypkių tabako, kramtomojo ar uostomojo tabako gamybos mašinų gamyba - viešbučių ir restoranų maisto paruošimo mašinų gamyba Į šią klasę neįeina: - maisto produktų ir pieno švitinimo įrangos gamyba, žr. 26.60 - pakavimo, vyniojimo ir svėrimo mašinų gamyba, žr. 28.29 - kiaušinių, vaisių, uogų ar kitų žemės ūkio produktų (išskyrus sėklas, grūdus ir džiovintas ankštines daržoves) valymo, rūšiavimo arba kalibravimo mašinų gamyba, žr. 28.30 @lt
scope note: Этот класс включает: - производство оборудования для производства и обработки мягкой резины или пластика и производства изделий из данных материалов: • штамповочных и формовочных машин, пневматического оборудования для изготовления шин или оборудования для восстановления протектора и прочих машин для изготовления специфических резиновых и пластиковых изделий @ru
scope note: Bu sınıf aşağıdakileri kapsamaktadır; - tarımsal kurutma makinelerinin imalatı, - süt ürünleri sanayii için makine imalatı: • krema ayırıcıları • süt işleme makineleri (örn. homojenleştirme), • süt dönüştürme makineleri (örn. tereyağı topakları, tereyağı işleme ve kalıplama makineleri), • peynir makineleri, (örn. homojenleştirme, kalıplama, presleme) vb. - değirmencilik sanayi için makine imalatı: • tohumların, tanelerin ya da kuru baklagillerin temizlenmesi, tasniflenmesi ya da derecelendirilmesi için makineler (buğday savurucu, elek kayışları, ayırıcılar, hububat polisaj makineleri vb.) • un ve kaba un vb. üretmek için kullanılan makineler (öğütme değirmenleri, işlenecek malzemeyi makineye veren cihaz, elekler, kepek temizleyiciler, karıştırıcılar, çeltik soyma makineleri, bezelye kırma makineleri). - şarap, elma şarabı, meyve suları vb. yapımında kullanılan pres, ezici vb. imalatı, - unlu ürünler sanayi için ya da makarna, spagetti ya da benzer ürünleri yapmak için kullanılan makinelerin imalatı: • ekmek fırını, hamur karıştırıcı, hamur ayırıcı, hamur kalıplama, hamur kesme, pasta makineleri vb. • çeşitli gıdaların işlenmesi için kullanılan makine ve donanım imalatı: • şekerleme, kakao ya da çikolata yapımında kullanılan makineler; şeker imalatında kullanılan makineler; bira makineleri; et ya da kümes hayvanı etlerinin işlenmesinde kullanılan makineler, meyve, kabuklu yemiş ve sebze hazırlanmasında kullanılan makineler; balıkların, kabuklu deniz hayvanlarının ya da yenebilen diğer deniz ürünlerinin hazırlanmasında kullanılan makineler, • filtreleme ya da temizlemede kullanılan makineler, • gıda ve içeceklerin endüstriyel olarak hazırlanmasında ve imalatında kullanılan diğer makinelerin imalatı. - hayvansal ya da bitkisel katı ya da sıvı yağların hazırlanması ya da çıkarılmasına özgü makinelerin imalatı, - tütünün hazırlanmasında ve sigara, puro ve pipo tütünü imalinde veya çiğneme tütünleri ya da enfiye imalatında kullanılan makinelerin imalatı, - otel ve lokanta… @tr
preferred label: Производство на машини и оборудване за преработка на храни, напитки и тютюн @bg
preferred label: Výroba strojů na výrobu potravin, nápojů a zpracování tabáku @cs
preferred label: Fremstilling af maskiner til føde-, drikke- og tobaksvareindustrien @da
preferred label: Herstellung von Maschinen für die Nahrungs- und Genussmittelerzeugung und die Tabakverarbeitung @de
preferred label: Κατασκευή μηχανημάτων επεξεργασίας τροφίμων, ποτών και καπνού @el
preferred label: Fabricación de maquinaria para la industria de la alimentación, bebidas y tabaco @es
preferred label: Toiduaine-, joogi- ja tubakatööstusmasinate tootmine @et
preferred label: Elintarvike-, juoma- ja tupakkateollisuuden koneiden valmistus @fi
preferred label: Fabrication de machines pour l'industrie agro-alimentaire @fr
preferred label: Élelmiszer-, dohányipari gép gyártása
preferred label: Fabbricazione di macchine per l'industria alimentare, delle bevande e del tabacco @it
preferred label: Maisto, gėrimų ir tabako apdorojimo mašinų gamyba @lt
preferred label: Mašīnu ražošana pārtikas, dzērienu un tabakas apstrādei @lv
preferred label: Manifattura ta' makkinarju għall-ipproċessar ta' ikel, xorb u tabakk @mt
preferred label: Vervaardiging van machines voor de productie van voedings- en genotmiddelen @nl
preferred label: Produksjon av maskiner og utstyr til nærings- og nytelsesmiddelindustri @no
preferred label: Produkcja maszyn stosowanych w przetwórstwie żywności, tytoniu i produkcji napojów @pl
preferred label: Fabricação de máquinas para as indústrias alimentares, das bebidas e do tabaco @pt
preferred label: Fabricarea utilajelor pentru prelucrarea produselor alimentare, băuturilor şi tutunului @ro
preferred label: Производство оборудования для производства и переработки продуктов питания, напитков и табачных изделий @ru
preferred label: Výroba strojov na spracovanie potravín, nápojov a tabaku @sk
preferred label: Proizvodnja strojev za živilsko in tobačno industrijo @sl
preferred label: Tillverkning av maskiner för framställning av livsmedel, drycker och tobaksvaror @sv
preferred label: Gıda, içecek ve tütün işleme makineleri imalatı @tr
broader: Manufacture of other special-purpose machinery

Manufacture of machinery for textile, apparel and leather production
type: Concept
notation: 28.94
status: valid
status modified: 2013-10-18
accepted date: 2013-10-18
in scheme: Statistical Classification of Economic Activities in the European Community, Rev. 2 (2008)
scope note: - производство на текстилни машини: • машини за подготовка, екструдиране, изтегляне, текстуриране или нарязване на синтетични или изкуствени текстилни материали • машини за подготовка на текстилни материали: маган (за отделяне на семена от памук), балоразтварящи, гарнет, разстилачни за памук, за пране и за карбонизиране на вълна, дараци, гребенни (решещи) и предпредачни (флаер) машини и други • предачни машини • машини за подготовка на текстилни прежди: за скатяване, пресукване, намотаване, насноваване и подобни машини • тъкачни машини (станове), вкл. станове за ръчна работа • плетачни машини • машини за оплитане на шнурове, тюл, дантела, ширит и други - производство на спомагателни машини или устройства за текстилни машини: • нищелкови и жакардови механизми, автоматични спирачи за основа и вътък, механизми за смяна на совалки, вретена, перки за вретена и други - производство на машини за отпечатване върху текстил - производство на други машини за обработка на тъкани: • машини за пране, избелване и боядисване, апретиране, промазване, импрегниране на тъкани • машини за навиване, развиване, сгъване, рязане или назъбено рязане на тъкани - производство на машини за обществени перални и химическо чистене: • машини за гладене (вкл. преси за фиксиране) • перални машини и машини за сушене на прежди, тъкани или изделия от текстилни материали, с капацитет > 10 кг сухо пране • машини за химическо чистене - производство на шевни машини (вкл. за домакинска употреба), глави и игли за тях - производство на машини за производство или довършване на филц или нетъкан текстил - производство на машини за обработка и преработка на кожи: • машини за подготовка, дъбене или обработка на кожи • машини за производство или поправка на обувки и други кожени изделия - производство на хартиени или картонени карти за жакардовите машини - 17.29 - производство на перални и сушилни машини, за домакинска употреба - 27.51 - производство на машини за гладене от типа на каландрите - 28.29 - производство … @bg
scope note: Z: - výrobu textilních strojů: • strojů pro přípravu, úpravu, výrobu, spřádání, protahování, tvarování nebo stříhání syntetických a umělých textilních vláken • strojů pro přípravu nebo úpravu textilních vláken: strojů na vyzrňování, rozvolňování, rozvlákňování, rozprostírání bavlny, strojů na loupání a karbonizaci vlny a strojů pro mykání, česání, předpřádání atd. • dopřádacích strojů • strojů na přípravu a úpravu přízí: motacích, snovacích a podobných strojů • tkacích strojů včetně ručních tkalcovských stavů • háčkovacích a pletacích strojů • strojů pro výrobu sítěk, tylu, krajek, výšivek, prýmek a podobných strojů - výrobu pomocných strojů a vybavení pro textilní strojní park: • listovek, žakár, osnovních zarážek, mechanismů na výměnu člunků, vřeten a vřetenových setrvačníků atd. - výrobu strojů pro potisk textilií - výrobu strojů pro zušlechťování textilií: • strojů pro praní, bělení, barvení, apretaci, úpravu, potahování nebo impregnování tkanin • výrobu strojů pro navíjení, odmotávání, skládání, stříhání nebo začišťování tkanin - výrobu velkokapacitních strojů určených pro prádelny a čistírny textilu: • žehlicích strojů a žehlicích lisů včetně fixačních lisů • praček a sušiček prádla pro prádelny • strojů pro chemické čištění - výrobu šicích strojů, hlav a jehel do šicích strojů (včetně určených pro domácnosti) - výrobu strojů pro výrobu nebo konečnou úpravu plsti nebo netkaných textilií - výrobu kožedělných strojů: • strojů pro přípravu, vyčinění nebo zpracování surových kůží, kožek nebo usní • strojů pro výrobu nebo opravy obuvi nebo jiných výrobků z kůží, kožek, usní nebo kožešin N: - výrobu papíru a lepenky pro použití na žakárových strojích (17.29) - výrobu praček a sušiček převážně pro domácnost (27.51) - výrobu strojů kalandrovacích strojů (28.29) - výrobu knihvazačských strojů (28.99) @cs
scope note: Diese Klasse umfasst: - Herstellung von Textilmaschinen: • Maschinen zum Vor- oder Aufbereiten, Herstellen, Düsenspinnen, Verstrecken, Texturieren oder Schneiden von synthetischen und künstlichen Spinnstoffen • Maschinen zum Vor- oder Aufbereiten von Spinnstoffen: Egreniermaschinen, Ballenbrecher, Garnettöffner, Baumwollausbreitmaschinen, Wollwaschmaschinen, Wollkarbonisiermaschinen und andere Maschinen zum Kardieren, Kämmen, Vorspinnen usw. • Spinnmaschinen • Maschinen zum Vor- oder Aufbereiten von Spinnstoffgarnen: Haspel-, Schär- und ähnliche Maschinen • Webmaschinen einschließlich Handwebstühle • Wirk- und Strickmaschinen • Netz-, Tüll-, Spitzen-, Stick-, Flecht- und ähnliche Maschinen - Herstellung von Hilfsmaschinen und Teilen und Zubehör für Textilmaschinen: • Schaftmaschinen, Jacquardmaschinen, Kett- und Schussfadenwächter, Webschützenwechsler, Spindeln und Spindelflügel usw. - Herstellung von Textildruckmaschinen - Herstellung von Maschinen für die Textilveredlung: • Maschinen zum Waschen, Bleichen, Färben, Appretieren, Ausrüsten, Beschichten oder Imprägnieren von Geweben • Herstellung von Maschinen zum Auf- oder Abwickeln, Falten, Schneiden oder Auszacken von Geweben - Herstellung von Maschinen für Wäschereien und Textilreinigungen: • Bügeleimaschinen und Bügelpressen einschließlich Fixierpressen • kommerzielle Waschmaschinen und Trockenmaschinen • Maschinen für die Textilreinigung - Herstellung von Nähmaschinen, Nähmaschinenköpfen und Nähmaschinennadeln (auch für den Haushalt) - Herstellung von Maschinen zum Herstellen oder Ausrüsten von Filz oder Vliesstoffen - Herstellung von Maschinen zum Be- oder Verarbeiten von Leder: • Maschinen zum Aufbereiten, Gerben oder Bearbeiten von Häuten, Fellen oder Leder • Maschinen zum Herstellen oder Instandsetzen von Schuhen oder anderen Waren aus Häuten, Fellen, Leder oder Pelzfellen Diese Klasse umfasst nicht: - Herstellung von Papier- oder Pappkarten zum Einsatz in Jacquardmaschinen (s. 17.29) - Herstellung von Wasch… @de
scope note: This class includes: - manufacture of textile machinery: • machines for preparing, producing, extruding, drawing, texturing or cutting man-made textile fibres, materials or yarns • machines for preparing textile fibres: cotton gins, bale breakers, garnetters, cotton spreaders, wool scourers, wool carbonisers, combs, carders, roving frames etc. • spinning machines • machines for preparing textile yarns: reelers, warpers and related machines • weaving machines (looms), including hand looms • knitting machines • machines for making knotted net, tulle, lace, braid etc. - manufacture of auxiliary machines or equipment for textile machinery: • dobbies, jacquards, automatic stop motions, shuttle changing mechanisms, spindles and spindle flyers etc. - manufacture of textile printing machinery - manufacture of machinery for fabric processing: • machinery for washing, bleaching, dyeing, dressing, finishing, coating or impregnating textile fabrics • manufacture of machines for reeling, unreeling, folding, cutting or pinking textile fabrics - manufacture of laundry machinery: • ironing machines, including fusing presses • commercial washing and drying machines • dry-cleaning machines - manufacture of sewing machines, sewing machine heads and sewing machine needles (whether or not for household use) - manufacture of machines for producing or finishing felt or non-wovens - manufacture of leather machines: • machinery for preparing, tanning or working hides, skins or leather • machinery for making or repairing footwear or other articles of hides, skins, leather or fur skins This class excludes: - manufacture of paper or paperboard cards for use on jacquard machines, see 17.29 - manufacture of domestic washing and drying machines, see 27.51 - manufacture of calendaring machines, see 28.29 - manufacture of machines used in bookbinding, see 28.99 @en
scope note: Esta clase comprende: - la fabricación de maquinaria para la industria textil: • máquinas para la preparación, producción, extrusión, estampado, cortado y texturación de fibras, hilos y materiales sintéticos o artificiales • máquinas para la preparación de fibras textiles desmotadoras de algodón, abridoras de balas, máquinas deshilachadoras Garnett, extendedoras de algodón, lavadoras y carbonizadoras de lanas, peines, cardas, mecheras, etc. • máquinas para la hilatura • máquinas para preparar hilos textiles: bobinadoras, urdidoras y otras similares • máquinas para tejer, incluidos los telares manuales • tricotosas • maquinaria para hacer red anudada, tules, encajes, pasamanería, etc. - la fabricación de máquinas y equipos accesorios para la maquinaria textil: • telares, máquinas Jacquard, dispositivos de parada automática, mecanismos de cambio de lanzaderas, husillos, husos de aletas, etc. - la fabricación de maquinaria para la impresión textil - la fabricación de maquinaria para el procesado de los tejidos: • maquinaria para el lavado, blanqueo, teñido, apresto, acabado e impregnación de manufacturas textiles • máquinas para el enrollado, desenrollado, plegado, cortado o dentellado de telas - la fabricación de maquinaria de lavandería: • planchas, incluidas las de prensado • lavadoras y secadoras industriales • máquinas para la limpieza en seco - la fabricación de máquinas de coser y de agujas de coser y cabezas para las mismas (sean o no para uso doméstico) - la fabricación de maquinaria para la fabricación y el acabado del fieltro o telas no tejidas - la fabricación de máquinas para la industria del cuero: • máquinas y aparatos para la preparación, el curtido y el trabajo de los cueros y pieles • máquinas y aparatos para la fabricación o reparación de calzado u otras manufacturas de cuero, piel o peletería Esta clase no comprende: - la fabricación de tarjetas de papel o cartón para máquinas Jacquard (véase 17.29) - la fabricación de lavadoras y secadoras de uso d… @es
scope note: Cette classe comprend: - la fabrication de machines pour l’industrie textile: • machines pour la préparation, la fabrication, le filage (extrusion), l’étirage, la texturation ou le tranchage des fibres, des matières ou des fils textiles, synthétiques ou artificiels • machines pour la préparation des fibres textiles: égreneuses de coton, machines brise-balles, effilocheuses du type Garnett, batteurs-étaleurs à coton, machines à dessuinter la laine, machines à carboniser la laine, peigneuses, cardes, métiers à mèches, etc. • métiers à filer • machines pour la préparation des fils textiles: bobinoirs, ourdissoirs et machines similaires • métiers à tisser, y compris les métiers à main • machines et métiers à bonneterie • machines et métiers à filet, à tulle, à dentelle, à passementerie, etc. - la fabrication de machines et d’appareils auxiliaires pour les machines de l’industrie textile: • ratières, mécaniques Jacquard, casse-chaînes et casse-trames, mécanismes de changement de navettes, broches, ailettes, etc. - la fabrication de machines à imprimer sur les matières textiles - la fabrication de machines et d’appareils pour le traitement des tissus: • machines et appareils pour le lavage, le blanchiment, la teinture, l’apprêt, le finissage, l’enduction ou l’imprégnation des tissus en matières textiles • machines à enrouler, dérouler, plier, couper ou denteler les tissus en matières textiles - la fabrication de machines et d’appareils de blanchisserie: • machines à repasser, y compris les presses à fixer • machines commerciales à laver et à sécher le linge • machines pour le nettoyage à sec - la fabrication de machines à coudre ainsi que de têtes et d’aiguilles pour machines à coudre (à usage domestique ou autre) - la fabrication de machines et d’appareils pour la fabrication ou le finissage du feutre ou des non-tissés - la fabrication de machines et d’appareils pour l’industrie du cuir: • machines et appareils pour la préparation, le tannage ou le travail des cuirs ou d… @fr
scope note: Ovaj razred uključuje: - proizvodnju strojeva za tekstil: • strojeva za pripremu, proizvodnju, protiskivanje, izvlačenje, strukturiranje ili rezanje umjetnih vlakana, materijala i pređe • strojeva za pripremu tekstilnih vlakana: za čišćenje pamuka od sjemenja, rezanje bala, rastresanje pamuka, pregledavanje vune, karboniziranje vune, češljanje, grebenanje, namatanje vune na okvire itd. • strojeva za predenje • strojeva za pripremu tekstilnih vlakana: za namatanje, izradu potki i pripadajućih strojeva • tkalačkih stanova (razboja), uključujući ručne razboje • strojeva za pletenje • uređaja za izradu pletenih mreža, tila, čipke, gajtana itd. - proizvodnju pomoćnih strojeva ili opreme za tekstilne stojeve: • dobijevki, žakardica, uređaja za automatsko zaustavljanje, mehanizma za zamjenjivanje čunaka, vretena, krilaca za vretena itd. - proizvodnju strojeva za tiskanje tekstila - proizvodnju strojeva za preradu tkanina: • strojeva za pranje, bijeljenje, bojenje, pripremanje, dovršavanje ili impregniranje tekstilnih tkanina • proizvodnju strojeva za namatanje, odmatanje, previjanje, sječenje i perforiranje tekstilnih vlakana - proizvodnju strojeva za pranje rublja: • uređaja za glačanje, uključujući tople preše • komercijalnih strojeva za pranje i sušenje • strojeva za kemijsko čišćenje - proizvodnju šivaćih strojeva, glava šivaćih strojeva i igala za šivaće strojeve (bez obzira na to jesu li za upotrebu u kućanstvu ili ne) - proizvodnju strojeva za izradu i dovršavanje pusta i netkanoga tekstila - proizvodnju strojeva za kožu: • strojeva za pripremu, štavljenje te obradu kože i krzna • strojeva za izradu i popravak obuće te drugih proizvoda od krzna, sirove kože i obrađene kože Ovaj razred isključuje: - proizvodnju papira i kartica s programom za rad žakard-strojeva, vidi 17.29 - proizvodnju strojeva za pranje i sušenje rublja za kućanstvo, vidi 27.51 - proizvodnju kalander-strojeva, vidi 28.29 - proizvodnju strojeva koji se koriste za uvezivanje knjiga, vidi 28.99
scope note: Į šią klasę įeina: - tekstilės mašinų gamyba: • cheminių tekstilės pluoštų, medžiagų ar verpalų paruošimo, gamybos, išspaudimo, tempimo, tekstūravimo ar pjaustymo mašinų • tekstilės pluoštų paruošimo mašinų: medvilnės valytuvų, brauktuvių, pašukų rinktuvų, medvilnės skirstytuvų; vilnos riebalų šalintuvų, karbonizatorių, šukuotuvių, karštuvų, pusverpalių brauktuvių ir kt. • verptuvų (verpimo mašinų) • tekstilės verpalų paruošimo mašinų: pervijimo, apmetimo ir kt. panašių mašinų • audimo mašinų (staklių), įskaitant rankines stakles • mezgimo mašinų • tinklo, tiulio, nėrinių, juostelių ir kt. gamybos mašinų - tekstilės mašinų pagalbinių mechanizmų ar įrangos gamyba: • nytelių, žakardo mašinų, automatinių mašinos stabdiklių, šaudyklių keitimo mechanizmų, verptuvų, skriejikų ir kt. - tekstilės marginimo mašinų gamyba - audinių apdorojimo mašinų gamyba: • tekstilės audinių skalbimo, balinimo, dažymo, apretavimo, apdailos, padengimo ar įmirkymo mašinų • tekstilės audinių vyniojimo į rietimus, išvyniojimo iš rietimų, lankstymo, pjaustymo ar badymo mašinų - skalbyklų mašinų gamyba: • laidymo mašinų, įskaitant fiksuojančiuosius presus • pramoninių skalbimo ir džiovinimo mašinų • sausojo valymo mašinų - siuvamųjų mašinų, siuvamųjų mašinų galvučių ir siuvamųjų mašinų adatų (buitinių ir nebuitinių) gamyba - veltinių arba neaustinių medžiagų gamybos ar apdailos mašinų gamyba - odos apdirbimo mašinų gamyba: • kailių, žaliaminių odų arba odų paruošimo, rauginimo ar išdirbimo mašinų • avalynės ar kitų odinių ar kailinių dirbinių gamybos ir taisymo mašinų Į šią klasę neįeina: - žakardo mašinų popierinių ar kartoninių kortų gamyba, žr. 17.29 - buitinių skalbimo ir džiovinimo mašinų gamyba, žr. 27.51 - kalandravimo mašinų gamyba, žr. 28.29 - knygų įrišimo mašinų gamyba, žr. 28.99 @lt
scope note: Данный класс включает производство оборудования специального назначения, не входящего в остальные разделы данного классификатора. Этот класс включает: - производство сушилок для древесины, бумажной древесной массы и целлюлозы, бумаги или картона и прочих материалов (за исключением сельскохозяйственной продукции и текстильных изделий) - производство оборудования для изготовления печатной продукции и переплетного дела из различных материалов - производство оборудования для изготовления напольных покрытий, кирпича, керамического клея, труб, графитных электродов, мела для школьных досок и т.д. - производство полупроводникового производственного оборудования - производство промышленных роботов для многоцелевого специализированного использования - производство различных многофункциональных машин и оборудования специального назначения: • оборудования для сборки электронных ламп, трубок или ламп накаливания • оборудования для производства или горячей обработки стекла или стеклянной посуды, стекловолокнистых материалов или пряжи • производство техники или аппаратов для разделения изотопов - производство оборудования для геометрии и балансировки шин; балансировочного оборудования (за исключением оборудования для балансировки колес) - производство центральных смазочных систем - производство пусковых устройств для воздушных судов, катапультирующих устройств для воздушных судов и т.п. оборудования - производство соляриев - производство автоматического оборудования для боулинга (например, устанавливающих устройств) - производство каруселей, качелей, тиров и прочего развлекательного оборудования Этот класс исключает: - производство бытовых приборов, см. 27.5 - производство фотокопировальных приборов и т.п., см. 28.23 - производство оборудования для производства эбонита, твердого пластика или холодного стекла, см. 28.49 - производство литейного оборудования, см. 28.91 @ru
scope note: Bu sınıf aşağıdakileri kapsamaktadır; - tekstil makineleri imalatı: • suni veya sentetik tekstil elyafı, malzemesi ya da ipliklerinin hazırlanması, üretilmesi, ekstrüzyonu, çekilmesi, dokunması ya da kesilmesi için makineler, • tekstil elyafı hazırlanması için makineler: çırçır makineleri, balya açıcılar, tarak ve kardeleme makineleri, pamuk yayıcılar, yün temizleyiciler, yün karbonlaştırıcılar, büküm tezgahları vb. • büküm makineleri, • tekstil ipliği hazırlanması için makineler: çile sarıcılar, çözgü tezgahları ve ilgili makineler, • dokuma makineleri (el dokuma tezgahları dahil), • örgü makineleri, • örme ağ, tül, dantel, kurdela vb. yapmak için makineler. - tekstil makineleri için yardımcı makine veya donanımların imalatı: • armür makineleri, jakarlar, otomatik durdurma tertibatı, mekik değiştirme mekanizmaları, iğler ve iğ kanatları vb. - tekstil baskı makinelerinin imalatı, - kumaş işleme makineleri imalatı: • tekstil kumaşlarını yıkama, ağartma, boyama, apreleme, bitirme, kaplama veya emdirme (emprenye etme) makineleri imalatı, • tekstil kumaşları için sarma, çözme, katlama, kesme veya sürfile makinelerinin imalatı. - çamaşırhane makinelerinin imalatı: • ütüleme makineleri (pres ütüler dahil), , • çamaşırhane tipi yıkama ve kurutma makineleri, • kuru temizleme makineleri. - dikiş makineleri, dikiş makineleri başları ve dikiş makineleri iğneleri (evde kullanım için olsun ya da olmasın) imalatı , - keçe ya da dokuma olmayan kumaşların üretilmesi ya da bitirilmesi için makinelerin imalatı, - deri makineleri imalatı; • postların veya derilerin hazırlanması, tabaklanması veya işlenmesi için makineler, • post, deri ya da kürklü derilerden ayakkabı veya diğer eşyaların yapımı veya tamiri için kullanılan makineler. Kapsam dışı olanlar; - jakar makinelerinde kullanılan kağıt ve mukavva kartları imalatı, bkz. 17.29, - ev tipi çamaşır yıkama ve kurutma makineleri imalatı, bkz. 27.51, - silindirli haddeleme makineleri imalatı, bkz. 28.29, - ciltlemede kullanılan makinele… @tr
preferred label: Производство на машини за текстил, облекло, кожи и кожени изделия @bg
preferred label: Výroba strojů na výrobu textilu, oděvních výrobků, výrobků z usní @cs
preferred label: Fremstilling af maskiner til produktion af tekstiler, beklædningsartikler og læder @da
preferred label: Herstellung von Maschinen für die Textil- und Bekleidungsherstellung und die Lederverarbeitung @de
preferred label: Κατασκευή μηχανημάτων για τη βιομηχανία κλωστοϋφαντουργικών προϊόντων, ενδυμάτων ή δερμάτινων ειδών @el
preferred label: Fabricación de maquinaria para las industrias textil, de la confección y del cuero @es
preferred label: Tekstiili-, rõiva- ja nahatööstusmasinate tootmine @et
preferred label: Tekstiili-, vaate- ja nahkateollisuuden koneiden valmistus @fi
preferred label: Fabrication de machines pour les industries textiles @fr
preferred label: Textil-, ruházati, bőripari gép gyártása
preferred label: Fabbricazione di macchine per le industrie tessili, dell'abbigliamento e del cuoio @it
preferred label: Tekstilės, drabužių ir odos gaminių gamybos mašinų gamyba @lt
preferred label: Mašīnu ražošana tekstilizstrādājumu, apģērbu un ādas izstrādājumu ražošanai @lv
preferred label: Manifattura ta' makkinarju għall-produzzjoni ta' tessuti, lbies u ġilda @mt
preferred label: Vervaardiging van machines voor de productie van textiel, kleding en leer @nl
preferred label: Produksjon av maskiner og utstyr til tekstil-, konfeksjons- og lærvareindustri @no
preferred label: Produkcja maszyn dla przemysłu tekstylnego, odzieżowego i skórzanego @pl
preferred label: Fabricação de máquinas para as indústrias têxtil, do vestuário e do couro @pt
preferred label: Fabricarea utilajelor pentru industria textilă, a îmbrăcămintei şi a pielăriei @ro
preferred label: Производство оборудования для изготовления текстильных, швейных, меховых и кожаных изделий @ru
preferred label: Výroba strojov pre textilný, odevný a kožiarsky priemysel @sk
preferred label: Proizvodnja strojev za tekstilno, oblačilno in usnjarsko industrijo @sl
preferred label: Tillverkning av maskiner för produktion av textil-, beklädnads- och lädervaror @sv
preferred label: Tekstil, giyim eşyası ve deri üretiminde kullanılan makinelerin imalatı @tr
broader: Manufacture of other special-purpose machinery

Manufacture of machinery for paper and paperboard production
type: Concept
notation: 28.95
status: valid
status modified: 2013-10-18
accepted date: 2013-10-18
in scheme: Statistical Classification of Economic Activities in the European Community, Rev. 2 (2008)
scope note: - производство на машини за хартиена маса (влакнести полуфабрикати) - производство на машини за хартия и картон - производство на машини за изделия от хартия и картон - производство на сушилни за дървен материал, хартиена маса, хартия или картон - 28.99 @bg
scope note: Z: - výrobu strojů na výrobu papíroviny - výrobu strojů na výrobu papíru, lepenky nebo kartonu - výrobu strojů na výrobu výrobků z papíru, lepenky nebo kartonu @cs
scope note: Diese Klasse umfasst: - Herstellung von Maschinen zum Herstellen von Papierhalbstoff - Herstellung von Maschinen zum Herstellen von Papier, Pappe oder Karton - Herstellung von Maschinen zum Herstellen von Waren aus Papier, Pappe oder Karton @de
scope note: This class includes: - manufacture of machinery for making paper pulp - manufacture of paper and paperboard making machinery - manufacture of machinery producing articles of paper or paperboard @en
scope note: Esta clase comprende: - la fabricación de maquinaria empleada en la elaboración de pasta de papel - la fabricación de maquinaria empleada en la elaboración de papel y cartón - la fabricación de maquinaria empleada en la producción de artículos de papel o de cartón @es
scope note: Cette classe comprend: - la fabrication de machines pour la fabrication de pâte à papier - la fabrication de machines pour la fabrication du papier et du carton - la fabrication de machines pour la fabrication d’articles en papier ou en carton @fr
scope note: Ovaj razred uključuje: - proizvodnju strojeva za izradu papirne celuloze - proizvodnju strojeva za izradu papira i kartona - proizvodnju strojeva za proizvodnju proizvoda od papira i kartona
scope note: Į šią klasę įeina: - popieriaus plaušienos gamybos mašinų gamyba - popieriaus ir kartono gamybos mašinų gamyba - popierinių arba kartoninių reikmenų mašinų gamyba @lt
scope note: Данный раздел включает производство автотранспортных средств для транспортировки пассажиров или грузов. Производство различных комплектующих и аксессуаров, а также производство трейлеров и полуприцепов также включены в данный раздел. Технический уход, содержание и ремонт автотранспортных средств классифицируются в классе 45.20. @ru
scope note: Bu sınıf aşağıdakileri kapsamaktadır; - kağıt hamuru yapımında kullanılan makine imalatı, - kağıt ve mukavva makinelerinin imalatı, - kağıt ve mukavva eşyaların üretiminde kullanılan makinelerin imalatı @tr
preferred label: Производство на машини за хартия, картон и изделия от хартия и картон @bg
preferred label: Výroba strojů a přístrojů na výrobu papíru a lepenky @cs
preferred label: Fremstilling af maskiner til produktion af papir og pap @da
preferred label: Herstellung von Maschinen für die Papiererzeugung und –verarbeitung @de
preferred label: Κατασκευή μηχανημάτων για την παραγωγή χαρτιού και χαρτονιού @el
preferred label: Fabricación de maquinaria para la industria del papel y del cartón @es
preferred label: Paberi- ja papitööstusmasinate tootmine @et
preferred label: Paperi-, kartonki- ja pahviteollisuuden koneiden valmistus @fi
preferred label: Fabrication de machines pour les industries du papier et du carton @fr
preferred label: Papíripari gép gyártása
preferred label: Fabbricazione di macchine per l'industria della carta e del cartone @it
preferred label: Popieriaus ir kartono gamybos mašinų gamyba @lt
preferred label: Mašīnu ražošana papīra un kartona izgatavošanai @lv
preferred label: Manifattura ta' makkinarju għall-produzzjoni tal-karta u l-kartun @mt
preferred label: Vervaardiging van machines voor de productie van papier en karton @nl
preferred label: Produksjon av maskiner og utstyr til papir- og pappvareindustri @no
preferred label: Produkcja maszyn dla przemysłu papierniczego @pl
preferred label: Fabricação de máquinas para as indústrias do papel e do cartão @pt
preferred label: Fabricarea utilajelor pentru industria hârtiei şi cartonului @ro
preferred label: Производство техники для изготовления бумаги и картона @ru
preferred label: Výroba strojov na výrobu papiera a lepenky @sk
preferred label: Proizvodnja strojev za industrijo papirja in kartona @sl
preferred label: Tillverkning av maskiner för produktion av massa, papper och papp @sv
preferred label: Kağıt ve mukavva üretiminde kullanılan makinelerin imalatı @tr
broader: Manufacture of other special-purpose machinery

Manufacture of plastics and rubber machinery
type: Concept
notation: 28.96
status: valid
status modified: 2013-10-18
accepted date: 2013-10-18
in scheme: Statistical Classification of Economic Activities in the European Community, Rev. 2 (2008)
scope note: - производство на машини за обработка на каучук или пластмаси или за производство на изделия от тях: • машини за леене под налягане, екструдери, вакуумформувъчни и горещоформувъчни машини за каучук или пластмаси, преси, машини за производство или регенериране на пневматични гуми и други машини за производство на специфични каучукови или пластмасови изделия @bg
scope note: Z: - výrobu strojů na opracování netvrzeného kaučuku nebo plastů nebo na výrobu výrobků z těchto materiálů: • strojů vytlačovacích (extruderů), licích nebo formovacích, strojů na výrobu nebo protektorování pneumatik a strojů na výrobu určitých pryžových nebo plastických výrobků @cs
scope note: Diese Klasse umfasst: - Herstellung von Maschinen zum Be- oder Verarbeiten von Kunststoffen und Kautschuk, oder für die Herstellung von Waren aus diesen Stoffen: • Strangpressen (Extruder), Gieß- oder Formmaschinen, Maschinen zum Herstellen oder Runderneuern von Luftreifen und andere Maschinen zum Herstellen bestimmter Kunststoff- oder Gummiwaren @de
scope note: This class includes: - manufacture of machinery for working soft rubber or plastics or for the manufacture of products of these materials: • extruders, moulders, pneumatic tyre making or retreading machines and other machines for making a specific rubber or plastic product @en
scope note: Esta clase comprende: - la fabricación de maquinaria para trabajar el caucho y las materias plásticas o para la fabricación de manufacturas de dichas materias: • extrusoras, moldeadoras, máquinas para la fabricación o el recauchutado de neumáticos, y otras máquinas y aparatos concebidos para fabricar productos determinados de caucho o de materias plásticas @es
scope note: Cette classe comprend: - la fabrication de machines pour le travail du caoutchouc tendre ou des matières plastiques, ou pour la fabrication de produits en ces matières: • extrudeuses, machines à mouler, machines à fabriquer ou à rechaper les pneumatiques et autres machines et appareils à fabriquer des produits spécifiques en caoutchouc ou en matières plastiques @fr
scope note: Ovaj razred uključuje: - proizvodnju strojeva za izradu meke gume ili plastike te strojeva za izradu proizvoda od tih materijala: • ekstrudera, kalupa, strojeva za izradu pneumatike i protektiranje guma te drugih strojeva za izradu posebnih vrsta proizvoda od gume i plastike
scope note: Į šią klasę įeina: - minkštosios gumos ar plastikų ir jų produktų apdirbimo mašinų gamyba: • ekstruderių, liejimo mašinų, pneumatinių padangų gamybos ar protektorių restauravimo mašinų ir kitų guminių bei plastikinių gaminių mašinų @lt
scope note: Bu sınıf aşağıdakileri kapsamaktadır; - yumuşak kauçuk ya da plastiğin işlenmesinde, kauçuk ve plastik ürünlerin imalatında kullanılan makinelerin imalatı: • ekstrüderler, kalıp makineleri, pnömatik tekerlek yapımında ya da lastiğe sırt geçirmede kullanılan makineler ile özel kauçuk veya plastik ürünlerin yapımı için diğer makineler. @tr
preferred label: Производство на машини за каучук или пластмаси @bg
preferred label: Výroba strojů na výrobu plastů a pryže @cs
preferred label: Fremstilling af maskiner til produktion af plast og gummi @da
preferred label: Herstellung von Maschinen für die Verarbeitung von Kunststoffen und Kautschuk @de
preferred label: Κατασκευή μηχανημάτων παραγωγής πλαστικών και ελαστικών ειδών @el
preferred label: Fabricación de maquinaria para las industrias del plástico y del caucho @es
preferred label: Plasti- ja kummitööstusmasinate tootmine @et
preferred label: Muovi- ja kumiteollisuuden koneiden valmistus @fi
preferred label: Fabrication de machines pour le travail du caoutchouc ou des plastiques @fr
preferred label: Műanyag-, gumifeldolgozó gép gyártása
preferred label: Fabbricazione di macchine per l'industria delle materie plastiche e della gomma @it
preferred label: Plastikų ir gumos gamybos mašinų gamyba @lt
preferred label: Mašīnu ražošana plastmasas un gumijas apstrādei @lv
preferred label: Manifattura ta' makkinarju tal-plastik u l-lasktu @mt
preferred label: Vervaardiging van machines voor de kunststof- en rubberindustrie @nl
preferred label: Produksjon av maskiner og utstyr til plast- og gummiindustri @no
preferred label: Produkcja maszyn do obróbki gumy lub tworzyw sztucznych oraz wytwarzania wyrobów z tych materiałów @pl
preferred label: Fabricação de máquinas para as indústrias do plástico e da borracha @pt
preferred label: Fabricarea utilajelor pentru prelucrarea maselor plastice şi a cauciucului @ro
preferred label: Производство оборудования для переработки пластмасс и резины @ru
preferred label: Výroba strojov na výrobu plastov a gumy @sk
preferred label: Proizvodnja strojev za plastiko in gumo @sl
preferred label: Tillverkning av maskiner för gummi och plast @sv
preferred label: Plastik ve kauçuk makinelerinin imalatı @tr
broader: Manufacture of other special-purpose machinery

Manufacture of other special-purpose machinery n.e.c.
type: Concept
notation: 28.99
status: valid
status modified: 2013-10-18
accepted date: 2013-10-18
in scheme: Statistical Classification of Economic Activities in the European Community, Rev. 2 (2008)
scope note: - производство на сушилни за дървен материал, хартиена маса, хартия или картон - производство на печатарски и книговезки машини и спомагателни машини за печат на различни видове материал - производство на машини за формуване на керамични маси, за производство на керемиди, тухли, тръби, за отливане на графитни електроди, за производство на тебешири - производство на апарати за автоматично запояване при сглобяване на полупроводници прибори, за производство на полупроводникови шайби (wafers) и други подобни апарати - производство на многофункционални промишлени роботи - производство на разнообразни машини и оборудване със специално предназначение: • производство на машини за сглобяване на електрически или електронни лампи, тръби или на лампи за светкавици, които имат стъклена обвивка • производство на машини за производство или гореща обработка на стъкло, или изделия от стъкло • производство на машини и апарати за изотопно разделяне - производство на машини за изравняване и балансиране на пневматични гуми; машини и апарати за балансиране на механични части (без тези за балансиране на колела) - производство на централизирани системи за гресиране - производство на апарати и устройства за изстрелване на въздухоплавателни средства, устройства за зареждане във въздуха на самолети, катапулти за самолети ракетоносци и подобни устройства - производство на солариуми - производство на игри с автоматични кегли (боулинг) - производство на въртележки, люлки, стрелбища и други съоръжения за панаири и паркове за развлечение - производство на битови уреди - 27.5 - производство на фотокопирни апарати - 28.23 - производство на машини и оборудване за обработка на ебонит или твърди пластмаси или за студена обработка на стъкло - 28.49 - производство на кокили - 28.91 @bg
scope note: Tato třída zahrnuje výrobu strojů pro speciální účely, jinde nezařazených. Z: - výrobu strojů na sušení dřeva, buničiny, papíru nebo lepenky a jiných materiálů (kromě zemědělských produktů a textilií) - výrobu tiskařských a knihvazačských strojů a strojů pro činnosti podporující tisk na různé materiály - výrobu strojů na výrobu cihel, tvárnic, tvarovaných keramických hmot, potrubí, grafitových elektrod, kříd na tabuli atd. - výrobu strojů na výrobu polovodičů - výrobu víceúčelových průmyslových robotů pro speciální účely - výrobu strojů na tvarování licích forem - výrobu různých strojů a zařízení pro speciální účely: • strojů pro sestavování (montování) elektrických nebo elektronických lamp, trubic (lamp) nebo žárovek • strojů na výrobů nebo zpracování za tepla, skla nebo skleněných produktů, skleněných vláken nebo skleněných přízí • strojů a přístrojů na separaci izotopů - výrobu zařízení pro vyvažování pneumatik; zařízení pro vyvažování (kromě vyvažování kol) - výrobu centrálních mazacích zařízení - výrobu zařízení pro přistávání letadel a vrtulníků na lodích; katapultů a podobných zařízení - výrobu solárních lůžek - výrobu zařízení pro automatický bowling (např. automatické stavění kuželek) - výrobu kolotočů, houpaček, střelnic a podobných vybavení zábavních parků N: - výrobu spotřebičů převážně pro domácnost (27.5) - výrobu fotokopírovacích přístrojů atd. (28.23) - výrobu strojů pro opracování tvrdé pryže a plastů nebo studeného skla (28.49) - výrobu kokil pro ingoty (28.91) - výrobu stolních nebo společenských her pro zábavní parky (32.40) @cs
scope note: Diese Klasse umfasst die Herstellung von anderweitig nicht genannten Spezialmaschinen. Diese Klasse umfasst: - Herstellung von Trocknern für Holz, Zellstoff, Papier und Pappe sowie andere Materialien (außer für ladwirtschaftliche Erzeugnisse und Textilien) - Herstellung von Druckerei- und Buchbindereimaschinen und Maschinen zur Unterstützung des Druckens auf verschiedenen Materialien - Herstellung von Maschinen zur Herstellung von Mauer- und Dachziegeln, geformten keramischen Massen, Rohren, Grafitelektroden, Tafelkreide usw. - Herstellung von Maschinen zur Herstellung von Halbleitern - Herstellung von Mehrzweckindustrierobotern für verschiedene Spezialaufgaben - Herstellung von verschiedenen Maschinen und Einrichtungen: • Maschinen zum Zusammenbauen von elektrischen Lampen und Elektronenröhren u. Ä. • Maschinen zum Herstellen oder Warmbearbeiten von Glas oder Glaswaren, Glasfasern oder -garnen • Maschinen und Geräte zur Isotopentrennung - Herstellung von Einrichtungen zum Auswuchten von Reifen; Auswuchtgeräte (außer für Räder) - Herstellung von Zentralschmieranlagen - Herstellung von Vorrichtungen für den Start von Flugzeugen vom Boden und von Flugzeugträgern sowie Zubehör - Herstellung von Sonnenbänken - Herstellung von Ausrüstungen für automatische Bowlingbahnen (z. B. Kegelaufsteller) - Herstellung von Karussells, Wippen, Schießständen und anderen Geräten und Ausrüstungen für das Schaustellergewerbe Diese Klasse umfasst nicht: - Herstellung von Haushaltsgeräten (s. 27.5) - Herstellung von Fotokopiergeräten usw. (s. 28.23) - Herstellung von Maschinen und Einrichtungen zum Bearbeiten von Hartgummi, -kunststoffen oder Kaltglas (s. 28.49) - Herstellung von Blockformen (s. 28.91) @de
scope note: This class includes the manufacture of special-purpose machinery not elsewhere classified. This class includes: - manufacture of dryers for wood, paper pulp, paper or paperboard and other materials (except for agricultural products and textiles) - manufacture of printing and bookbinding machines and machines for activities supporting printing on a variety of materials - manufacture of machinery for producing tiles, bricks, shaped ceramic pastes, pipes, graphite electrodes, blackboard chalk etc. - manufacture of semi-conductor manufacturing machinery - manufacture of industrial robots performing multiple tasks for special purposes - manufacture of diverse special-purpose machinery and equipment: • machines to assemble electric or electronic lamps, tubes (valves) or bulbs • machines for production or hot-working of glass or glassware, glass fibre or yarn • machinery or apparatus for isotopic separation - manufacture of tyre alignment and balancing equipment; balancing equipment (except wheel balancing) - manufacture of central greasing systems - manufacture of aircraft launching gear, aircraft carrier catapults and related equipment - manufacture of tanning beds - manufacture of automatic bowling alley equipment (e.g. pin-setters) - manufacture of roundabouts, swings, shooting galleries and other fairground amusements This class excludes: - manufacture of household appliances, see 27.5 - manufacture of photocopy machines etc., see 28.23 - manufacture of machinery or equipment to work hard rubber, hard plastics or cold glass, see 28.49 - manufacture of ingot moulds, see 28.91 @en
scope note: Esta clase comprende la fabricación de maquinaria para usos específicos no clasificada en otros apartados. Esta clase comprende: - la fabricación de secadoras de madera, pasta papelera, papel o cartón y otros materiales (excepto productos agrícolas y textiles) - la fabricación de máquinas para imprenta y encuadernación y de máquinas auxiliares de la impresión sobre diversos materiales - la fabricación de maquinaria para producir baldosas, ladrillos, pastas de cerámica moldeadas, tuberías, electrodos de grafito, tiza para pizarras, etc. - la fabricación de maquinaria para la fabricación de semiconductores - la fabricación de robots industriales multitarea para usos específicos - la fabricación de máquinas y equipos para usos específicos diversos: • máquinas para el montaje de lámparas eléctricas o electrónicas, tubos (válvulas) o bombillas • máquinas para la producción o el trabajo en caliente de vidrio o de manufacturas de vidrio de fibra o hilo de vidrio, • máquinas y aparatos para la separación isotópica, - la fabricación de equipos de alineado y equilibrado de neumáticos; equipos de equilibrado (excepto para equilibrado de ruedas) - la fabricación de sistemas centrales de engrase - la fabricación de mecanismos de lanzamiento de aeronaves, catapultas de portaviones y equipos afines - la fabricación de camas de bronceado - la fabricación de equipos para boleras automáticas (p. ej., colocadores de bolos) - la fabricación de tiovivos, columpios, barracas de tiro al blanco y otras atracciones de feria Esta clase no comprende: - la fabricación de aparatos de uso doméstico (véase 27.5) - la fabricación de fotocopiadoras, etc. (véase 28.23) - la fabricación de máquinas o equipos para el trabajo del caucho endurecido, de materias plásticas endurecidas o de vidrio en frío (véase 28.49) - la fabricación de lingoteras (véase 28.91) @es
scope note: Cette classe comprend la fabrication de machines d’usage spécifique non classées ailleurs. Cette classe comprend: - la fabrication de séchoirs pour le bois, les pâtes à papier, les papiers ou les cartons et d’autres matières (à l’exception des produits agricoles et textiles) - la fabrication de machines et de matériel pour l’imprimerie, le brochage et la reliure et de machines pour les activités d’impression sur différents types de matériaux - la fabrication de machines et appareils pour la fabrication de tuiles, de briques, de pâtes céramiques formées, de tuyaux, d’électrodes de graphite, de craies à écrire et à dessiner, etc. - la fabrication de machines à fabriquer les semi-conducteurs - la fabrication de robots industriels multi-tâches à usage spécifique - la fabrication d’autres machines et appareils à usage spécifique: • machines pour l’assemblage de lampes, de tubes, de valves électriques ou électroniques ou d’ampoules • machines pour la fabrication ou le travail à chaud du verre ou des ouvrages en verre, des fibres et des fils de verre • machines et appareils pour la séparation isotopique - la fabrication de matériel d’équilibrage des pneumatiques et de réglage de géométrie, de matériel d’équilibrage (sauf équilibrage des roues) - la fabrication d’appareillages dits de "graissage centralisé" - la fabrication d’appareils et de dispositifs pour le lancement de véhicules aériens, de catapultes destinées à équiper des porte-avions et de matériel similaire - la fabrication de bancs solaires - la fabrication d’installations de bowling automatiques (par exemple: machines à requiller) - la fabrication de manèges, de balançoires, de stands de tir et d’autres attractions foraines Cette classe ne comprend pas: - la fabrication des appareils ménagers, voir 27.5 - la fabrication de photocopieuses, voir 28.23 - la fabrication de machines ou de matériel pour le travail du caoutchouc durci, des matières plastiques dures ou du verre (travail à froid), voir 28.49 - la fabrica… @fr
scope note: Ovaj razred uključuje proizvodnju strojeva za posebne namjene koji nisu razvrstani nigdje drugdje. Ovaj razred uključuje: - proizvodnju sušilica za drvo, papirne celuloze, papira i kartona - proizvodnju tiskarskih strojeva i strojeva za uvezivanje knjiga i strojeva za djelatnosti koje podržavaju tiskanje na različitim materijalima - proizvodnju strojeva za izradu crepova, cigli, oblikovanje keramičkih tuba, cijevi, grafitnih elektroda, krede za školske ploče, ljevaoničkih kalupa itd. - proizvodnju strojeva za proizvodnju poluvodiča - proizvodnju industrijskih robota za višenamjensku upotrebu za specijalne namjene - proizvodnju raznovrsnih specijalnih strojeva i opreme: • strojeva za sastavljanje električnih i elektroničkih svjetiljaka, cijevi svjetiljki ili žarulja • strojeva za toplu obradu stakla i staklene robe, staklenog vlakna i prediva • strojeva i aparata za izdvajanje izotopa - proizvodnju uređaja za centriranje i balansiranje guma; opreme za balansiranje (osim balansiranja kotača) - proizvodnju središnjeg sustava za podmazivanje - proizvodnju uređaja za lansiranje zrakoplova, zrakoplova nosioca katapulta i srodne opreme - proizvodnju kreveta za sunčanje (solarij) - proizvodnju opreme za automatizirane kuglane (npr. podizač čunjeva) - proizvodnju vrtuljaka, ljuljački, streljana i drugih uređaja za zabavu Ovaj razred isključuje: - proizvodnju uređaja za kućanstva, vidi 27.5 - proizvodnju fotokopirnih uređaja itd., vidi 28.23 - proizvodnju uređaja ili opreme za rad s tvrdom gumom, tvrdom plastikom ili hladnim staklom, vidi 28.49 - proizvodnju kalupa za ingote, vidi 28.91
scope note: Į šią klasę įeina niekur kitur nepriskirtų specialiosios paskirties mašinų gamyba. Į šią klasę įeina: - medienos, popieriaus plaušienos, popieriaus, kartono ir kitų medžiagų (išskyrus žemės ūkio produktų ir tekstilės gaminių) džiovyklų gamyba - spausdinimo ir knygų įrišimo mašinų bei susijusios su spausdinimu ant įvairių medžiagų veiklos palaikymo mašinų gamyba - plytelių, plytų, formuotų keraminių pastų, vamzdžių, grafito elektrodų, mokyklinės kreidos ir kt. gamybos mašinų gamyba - puslaidininkių gamybos mašinų gamyba - įvairių specialiosios paskirties pramoninių daugiafunkcių robotų gamyba - įvairių specialiosios paskirties mašinų ir įrangos gamyba: • elektros ar elektroninių lempų, vamzdžių ar lempučių surinkimo mašinų • stiklo ar stiklo dirbinių, stiklo pluošto ar verpalų gamybos ar šiluminio apdorojimo mašinų • izotopinio separavimo mašinų ar aparatų - padangų reguliavimo ir balansavimo įrangos; balansavimo įrangos (išskyrus ratų balansavimą) gamyba - centrinės tepimo sistemos gamyba - orlaivių paleidimo įrenginių, lėktuvnešių katapultų ir susijusios įrangos gamyba - soliariumų gultų gamyba - automatinės boulingo takelių įrangos gamyba (pvz., kėglių pastatymo įrenginių) - karuselių, sūpuoklių, šaudymo į taikinius ir kitų atrakcionų įrangos gamyba Į šią klasę neįeina: - buitinių prietaisų gamyba, žr. 27.5 - fotokopijavimo mašinų ir kt., gamyba, žr. 28.23 - kietosios gumos, kietųjų plastikų ar šaltojo stiklo apdorojimo mašinų ar įrangos gamyba, žr. 28.49 - luitadėžių gamyba, žr. 28.91 @lt
scope note: Этот класс включает: - производство пассажирских автомобилей - производство производственных автотранспортных средств: • фургонов, грузовиков, внедорожных тягачей для полуприцепов и т.д. - производство автобусов, троллейбусов и пассажирских вагонов - производство двигателей для автотранспортных средств - производство шасси для автотранспортных средств - производство прочих автотранспортных средств: • снегоходов, гольф-каров, наземно-водных автотранспортных средств • пожарных машин, машин для уборки улиц и дорог, мобильных библиотек, бронированных автомобилей и т.д. • грузовиков с бетономешалками - вездеходов, картов и подобных, включая гоночные автомобили Этот класс также включает: - капитальный заводской ремонт двигателей для автотранспортных средств Этот класс исключает: - производство электромоторов (за исключением пусковых двигателей), см. 27.11 - производство осветительного оборудования для автотранспортных средств, см. 27.40 - производство клапанов, поршневых колец и карбюраторов, см. 28.11 - производство сельскохозяйственных тракторов, см. 28.30 - производство тракторов, используемых в строительстве или горнодобывающей промышленности, см. 28.92 - производство самосвалов-внедорожников, см. 28.92 - производство кузовов для автотранспортных средств, см. 29.20 - производство электрических комплектующих для автотранспортных средств, см. 29.31 - производство комплектующих и аксессуаров для автотранспортных средств, см. 29.32 - производство танков и прочих боевых автотранспортных средств, см. 30.40 - технический уход, содержание, ремонт и реконструкцию автотранспортных средств, см. 45.20 @ru
scope note: Bu sınıf başka yerde sınıflandırılmamış olan özel amaçlı makinelerin imalatını kapsamaktadır. Bu sınıf aşağıdakileri kapsamaktadır; - ahşap, kağıt hamuru, kağıt veya karton ile diğer malzemeler için kurutucuların imalatı (tarımsal ürünler ve tekstil için olanlar hariç), - basım ve ciltleme makineleri ile çeşitli materyaller üzerine basımı destekleyici faaliyetler için kullanılan makinelerin imalatı, - kiremit, briket, şekilli seramik hamuru, boru, grafit elektrotu, yazı tahtası tebeşiri vb.lerinin üretilmesi için makine imalatı, - yarı iletken imalat makinelerinin imalatı, - özel amaçlar için çoklu görevlerde kullanılabilen endüstriyel robotların imalatı, - çeşitli özel amaçlı makineler ve donanımların imalatı: • elektrikli veya elektronik lamba, tüp ya da ampullerin montajı için kullanılan makineler, • cam veya cam eşya, cam elyafı veya ipinin üretimi ya da sıcak işlenmesi için makineler, • izotopik ayırma için makine veya cihazlar, - lastik tekerlerin hizalanmasında ve balansında kullanılan donanımların imalatı (jant balansında kullanılanlar hariç), - merkezi yağlama sistemlerinin imalatı, - hava taşıtı fırlatma donanımlarının, uçak gemilerinde kullanılan katapultların (kısa mesafede uçakların havalanmasını sağlayan mekanizma) ve ilgili donanımların imalatı, - bronzlaşmada kullanılan cihazların imalatı, - otomatik bovling salonu donanımlarının (örn. labut dizici) imalatı, - dönme dolapların, salıncakların, poligonların ve diğer panayır alanı eğlence donanımlarının imalatı. Kapsam dışı olanlar; - ev aletleri imalatı, bkz. 27.5, - fotokopi makineleri vb. imalatı, bkz. 28.23, - sert kauçuk, sert plastik ya da soğuk cam işleyen makine ya da donanımların imalatı, bkz. 28.49, - külçe kalıplarının imalatı, bkz. 28.91. @tr
preferred label: Производство на други машини със специално предназначение, некласифицирани другаде @bg
preferred label: Výroba ostatních strojů pro speciální účely j. n. @cs
preferred label: Fremstilling af øvrige maskiner til specielle formål i.a.n. @da
preferred label: Herstellung von Maschinen für sonstige bestimmte Wirtschaftszweige a. n. g. @de
preferred label: Κατασκευή άλλων μηχανημάτων ειδικής χρήσης π.δ.κ.α. @el
preferred label: Fabricación de otra maquinaria para usos específicos n.c.o.p. @es
preferred label: Mujal liigitamata erimasinate tootmine @et
preferred label: Muualla luokittelematon erikoiskoneiden valmistus @fi
preferred label: Fabrication d'autres machines d'usage spécifique n.c.a. @fr
preferred label: M.n.s. egyéb speciális gép gyártása
preferred label: Fabbricazione di altre macchine per impieghi speciali n.c.a. @it
preferred label: Kitų, niekur kitur nepriskirtų, specialiosios paskirties mašinų gamyba @lt
preferred label: Citu speciālas nozīmes mašīnu ražošana @lv
preferred label: Manifattura ta' makkinarju ieħor għal għanijiet speċjali n.e.c. @mt
preferred label: Vervaardiging van andere machines, apparaten en werktuigen voor specifieke doeleinden, n.e.g. @nl
preferred label: Produksjon av spesialmaskiner ikke nevnt annet sted @no
preferred label: Produkcja pozostałych maszyn specjalnego przeznaczenia, gdzie indziej niesklasyfikowana @pl
preferred label: Fabricação de outras máquinas e equipamento para uso específico, n.e. @pt
preferred label: Fabricarea altor maşini şi utilaje specifice n.c.a. @ro
preferred label: Производство прочих машин и оборудования специального назначения, не включенных в другие категории @ru
preferred label: Výroba ostatných strojov na špeciálne účely i. n. @sk
preferred label: Proizvodnja strojev za druge posebne namene @sl
preferred label: Tillverkning av diverse övriga specialmaskiner @sv
preferred label: Başka yerde sınıflandırılmamış diğer özel amaçlı makinelerin imalatı @tr
broader: Manufacture of other special-purpose machinery

Manufacture of motor vehicles, trailers and semi-trailers
type: Concept
notation: 29
status: valid
status modified: 2013-10-18
accepted date: 2013-10-18
in scheme: Statistical Classification of Economic Activities in the European Community, Rev. 2 (2008)
scope note: производство на автомобили за превоз на пътници или товари, на ремаркета и полуремаркета, както и на различни части и принадлежности за тях. - техническо обслужване и ремонт на автомобили - 45.20 @bg
scope note: Tento oddíl zahrnuje výrobu motorových vozidel pro přepravu osob nebo nákladu. Zahrnuje také výrobu různých dílů, příslušenství a výrobu přívěsů a návěsů. Opravy, údržba a přestavby motorových vozidel (kromě přestavby na alternativní pohon) vyráběných v tomto oddílu jsou zařazeny ve skupině 45.20. @cs
scope note: Diese Abteilung umfasst die Herstellung von Kraftwagen zur Personen- oder Güterbeförderung. Sie umfasst ferner die Herstellung verschiedener Teile und Zubehör sowie die Herstellung von Anhängern und Sattelanhängern. Wartung und Instandsetzung von Kraftwagen werden in der Klasse 45.20 nachgewiesen. @de
scope note: This division includes the manufacture of motor vehicles for transporting passengers or freight. The manufacture of various parts and accessories, as well as the manufacture of trailers and semi-trailers, is included here. The maintenance and repair of vehicles produced in this division are classified in 45.20. @en
scope note: Esta división comprende la fabricación de vehículos de motor para el transporte de pasajeros o mercancías. Se incluye también la fabricación de diversos componentes y accesorios, así como de remolques y semirremolques. El mantenimiento y la reparación de vehículos producidos en esta división se clasifican en 45.20 @es
scope note: Cette division comprend la fabrication de véhicules automobiles destinés au transport de passagers ou de marchandises. La fabrication de parties et d’accessoires, ainsi que la fabrication de remorques et de semi-remorques sont comprises dans cette division. L’entretien et la réparation de véhicules produits dans cette division sont rangés dans la classe 45.20. @fr
scope note: Ovaj odjeljak uključuje proizvodnju motornih vozila za prijevoz putnika ili roba. Proizvodnja različitih dijelova i pribora, kao i proizvodnja prikolica i poluprikolica, razvrstane su ovdje. Održavanje i popravak vozila proizvedenih u ovom odjeljku razvrstani su u 45.20.
scope note: Į šį skyrių įeina keleivinių arba krovininių variklinių transporto priemonių gamyba. Įvairių dalių ir pagalbinių reikmenų gamyba, taip pat priekabų ir puspriekabių gamyba. Šiame skyriuje pagamintų transporto priemonių techninė priežiūra ir remontas yra klasifikuojami 45.20 klasėje. @lt
scope note: Bu bölüm, yolcuların ya da yüklerin taşınması amacıyla motorlu kara taşıtlarının imalatını kapsamaktadır. Treyler ve yarı treylerlerin imalatı dahil motorlu kara taşıtlarına ait çeşitli parça ve aksesuarların imalatı da bu bölümde kapsanmaktadır. Bu bölümde üretilen araçların bakım ve onarımı, 45.20`de sınıflandırılmıştır. @tr
preferred label: Производство на автомобили, ремаркета и полуремаркета @bg
preferred label: Výroba motorových vozidel (kromě motocyklů), přívěsů a návěsů @cs
preferred label: Fremstilling af motorkøretøjer, påhængsvogne og sættevogne @da
preferred label: Herstellung von Kraftwagen und Kraftwagenteilen @de
preferred label: Κατασκευή μηχανοκίνητων οχημάτων, ρυμουλκούμενων και ημιρυμουλκούμενων οχημάτων @el
preferred label: Fabricación de vehículos de motor, remolques y semirremolques @es
preferred label: Mootorsõidukite, haagiste ja poolhaagiste tootmine @et
preferred label: Moottoriajoneuvojen, perävaunujen ja puoliperävaunujen valmistus @fi
preferred label: Industrie automobile @fr
preferred label: Közúti jármű gyártása
preferred label: Fabbricazione di autoveicoli, rimorchi e semirimorchi @it
preferred label: Variklinių transporto priemonių, priekabų ir puspriekabių gamyba @lt
preferred label: Automobiļu, piekabju un puspiekabju ražošana @lv
preferred label: Manifattura ta' vetturi bil-mutur, trejlers u semitrejlers @mt
preferred label: Vervaardiging van auto's, aanhangwagens en opleggers @nl
preferred label: Produksjon av motorvogner og tilhengere @no
preferred label: Produkcja pojazdów samochodowych, przyczep i naczep @pl
preferred label: Fabricação de veículos automóveis, reboques e semi-reboques @pt
preferred label: Fabricarea autovehiculelor de transport rutier, a remorcilor şi semiremorcilor @ro
preferred label: Производство автотранспортных средств, трейлеров и полуприцепов @ru
preferred label: Výroba motorových vozidiel, návesov a prívesov @sk
preferred label: Proizvodnja motornih vozil, prikolic in polprikolic @sl
preferred label: Tillverkning av motorfordon, släpfordon och påhängsvagnar @sv
preferred label: Motorlu kara taşıtı, treyler (römork) ve yarı treyler (yarı römork) imalatı @tr
broader: MANUFACTURING
narrower: Manufacture of motor vehicles
narrower: Manufacture of bodies (coachwork) for motor vehicles; manufacture of trailers and semi-trailers
narrower: Manufacture of parts and accessories for motor vehicles

Manufacture of motor vehicles
type: Concept
notation: 29.1
status: valid
status modified: 2013-10-18
accepted date: 2013-10-18
in scheme: Statistical Classification of Economic Activities in the European Community, Rev. 2 (2008)
scope note: Этот класс включает: - производство автомобильных кузовов, включая кабины для водителей - оснащение всех типов автотранспортных средств, трейлеров и полуприцепов - производство трейлеров и полуприцепов: • танкеров, трейлеров и т.д. • фургонов и т.д. - производство грузовых контейнеров для перевозки одним или несколькими видами транспорта Этот класс исключает: - производство трейлеров и полуприцепов, специально разработанных для использования в сельском хозяйстве, см. 28.30 - производство комплектующих и аксессуаров для кузовов автотранспортных средств, см. 29.32 - производство транспортных средств, запрягаемых животными, см. 30.99 @ru
preferred label: Производство на автомобили и техните двигатели @bg
preferred label: Výroba motorových vozidel, kromě motocyklů @cs
preferred label: Fremstilling af motorkøretøjer @da
preferred label: Herstellung von Kraftwagen und Kraftwagenmotoren @de
preferred label: Κατασκευή μηχανοκίνητων οχημάτων @el
preferred label: Fabricación de vehículos de motor @es
preferred label: Mootorsõidukite tootmine @et
preferred label: Moottoriajoneuvojen valmistus @fi
preferred label: Construction de véhicules automobiles @fr
preferred label: Közúti gépjármű gyártása
preferred label: Fabbricazione di autoveicoli @it
preferred label: Variklinių transporto priemonių gamyba @lt
preferred label: Automobiļu ražošana @lv
preferred label: Manifattura ta' vetturi bil-mutur @mt
preferred label: Vervaardiging van auto's @nl
preferred label: Produksjon av motorvogner @no
preferred label: Produkcja pojazdów samochodowych @pl
preferred label: Fabricação de veículos automóveis @pt
preferred label: Fabricarea autovehiculelor de transport rutier @ro
preferred label: Производство моторных транспортных средств @ru
preferred label: Výroba motorových vozidiel @sk
preferred label: Proizvodnja motornih vozil @sl
preferred label: Motorfordonstillverkning @sv
preferred label: Motorlu kara taşıtlarının imalatı @tr
broader: Manufacture of motor vehicles, trailers and semi-trailers
narrower: Manufacture of motor vehicles

Manufacture of motor vehicles
type: Concept
notation: 29.10
status: valid
status modified: 2013-10-18
accepted date: 2013-10-18
in scheme: Statistical Classification of Economic Activities in the European Community, Rev. 2 (2008)
scope note: - производство на леки автомобили - производство на товарни автомобили: • камиони, пътни влекачи за полуремаркета - производство на автобуси, тролейбуси - производство на двигатели с вътрешно горене за автомобили - производство на шасита за автомобили - производство на автомобили със специално предназначение: • за придвижване върху сняг, върху игрища за голф, автомобили амфибии • противопожарни автомобили, за почистване на улици, подвижни библиотеки, бронирани автомобили за превоз на пари и други • автобетоносмесители - автомобили за телевизионни репортажи, картинги и други подобни, вкл. състезателни автомобили - регенериране (основен ремонт) на двигатели с вътрешно горене за автомобили - производство на електрически двигатели (без стартери за двигатели с вътрешно горене) - 27.11 - производство на лампи и фарове за автомобили - 27.40 - производство на бутала, бутални пръстени и карбуратори - 28.11 - производството на трактори за селското и горското стопанство - 28.30 - производство на трактори за добива или строителството - 28.92 - производство на самосвали, предназначени да бъдат използвани извън пътната мрежа - 28.92 - производство на купета и каросерии за автомобили - 29.20 - производство на електрически части и устройства за автомобили - 29.31 - производство на други части и принадлежности за автомобили- 29.32 - производството на танкове и други бойни бронирани транспортни машини - 30.40 - техническо обслужване и ремонт на автомобили - 45.20 @bg
scope note: Z: - výrobu osobních automobilů - výrobu užitkových motorových vozidel: • dodávek, nákladních aut, silničních tahačů (traktorů) pro návěsy atd. - výrobu autobusů, trolejbusů a autokarů - výrobu motorů pro motorová vozidla - výrobu podvozků pro motorová vozidla - výrobu ostatních motorových vozidel: • pásových sněhových vozidel, golfových vozíků, obojživelných vozidel • požárních automobilů, kropicích a čisticích vozů, pojízdných knihoven, pancéřovaných vozidel atd. • vozidel s míchačem betonové směsi • terénních vozidel, motokár o podobných vozidel včetně závodních aut ZT: - průmyslovou rekonstrukci (přestavbu) motorů motorových vozidel a přestavbu na alternativní pohon N: - výrobu elektromotorů (kromě spouštěcích motorů) (27.11) - výrobu osvětlovacích zařízení pro automobily (27.40) - výrobu pístů, pístních kroužků a karburátorů (28.11) - výrobu zemědělských traktorů a malotraktorů (28.30) - výrobu pásových vozidel a traktorů pro stavebnictví nebo hornictví (28.92) - výrobu terénních vyklápěcích náklaďáků (28.92) - výrobu karoserií motorových vozidel (29.20) - výrobu elektrických zařízení a přístrojů pro motorová vozidla (29.31) - výrobu dílů a příslušenství pro motorová vozidla (29.32) - výrobu tanků a ostatních vojenských bojových vozidel (30.40) - údržbu, opravy a přestavby motorových vozidel (45.20) @cs
scope note: Diese Klasse umfasst: - Herstellung von Personenkraftwagen - Herstellung von Nutzkraftwagen: • Lieferwagen, Lastkraftwagen, Sattelstraßenzugmaschinen usw. - Herstellung von Bussen, Oberleitungsbussen und Reiseomnibussen - Herstellung von Kraftwagenmotoren - Herstellung von Fahrgestellen für Kraftfahrzeuge - Herstellung von sonstigen Kraftwagen: • Schneemobile, Golfwagen, Amphibienfahrzeuge • Löschfahrzeuge, Straßenkehrmaschinen, Fahrbüchereien, gepanzerte Fahrzeuge usw. • Betonmischwagen - Geländefahrzeuge, Gokarts und ähnliche Fahrzeuge einschließlich Rennwagen Diese Klasse umfasst ferner: - Werksüberholung von Kraftwagenmotoren Diese Klasse umfasst nicht: - Herstellung von Elektromotoren (außer Anlassermotoren) (s. 27.11) - Herstellung von Beleuchtungseinrichtungen für Kraftfahrzeuge (s. 27.40) - Herstellung von Kolben, Kolbenringen und Vergasern (s. 28.11) - Herstellung von landwirtschaftlichen Zugmaschinen (s. 28.30) - Herstellung von Zugmaschinen für den Einsatz am Bau oder im Bergbau (s. 28.92) - Herstellung von geländegängigen Muldenkippern (s. 28.92) - Herstellung von Kraftwagenaufbauten (s. 29.20) - Herstellung von elektrischen Ausrüstungen für Kraftwagen (s. 29.31) - Herstellung von Teilen und Zubehör für Kraftwagen (s. 29.32) - Herstellung von Panzern und sonstigen Kampffahrzeugen (s. 30.40) - Instandhaltung und Reparatur von Kraftwagen (s. 45.20) @de
scope note: This class includes: - manufacture of passenger cars - manufacture of commercial vehicles: • vans, lorries, over-the-road tractors for semi-trailers etc. - manufacture of buses, trolley-buses and coaches - manufacture of motor vehicle engines - manufacture of chassis for motor vehicles - manufacture of other motor vehicles: • snowmobiles, golf carts, amphibious vehicles • fire engines, street sweepers, travelling libraries, armoured cars etc. • concrete-mixer lorries - ATVs, go-carts and similar including race cars This class also includes: - factory rebuilding of motor vehicle engines This class excludes: - manufacture of electric motors (except starting motors), see 27.11 - manufacture of lighting equipment for motor vehicles, see 27.40 - manufacture of pistons, piston rings and carburettors, see 28.11 - manufacture of agricultural tractors, see 28.30 - manufacture of tractors used in construction or mining, see 28.92 - manufacture of off-road dumping trucks, see 28.92 - manufacture of bodies for motor vehicles, see 29.20 - manufacture of electrical parts for motor vehicles, see 29.31 - manufacture of parts and accessories for motor vehicles, see 29.32 - manufacture of tanks and other military fighting vehicles, see 30.40 - maintenance and repair of motor vehicles, see 45.20 @en
scope note: Esta clase comprende: - la fabricación de vehículos de pasajeros - la fabricación de vehículos comerciales: • furgonetas, camiones, cabezas tractoras (de uso en carretera) para semirremolques, etc. - la fabricación de autobuses, trolebuses y autocares - la fabricación de motores para vehículos automóviles - la fabricación de chasis para vehículos de motor - la fabricación de otros vehículos de motor: • mototrineos, vehículos para campos de golf, vehículos anfibios • camiones y coches de bomberos, máquinas barredoras de vías públicas, bibliotecas ambulantes, vehículos blindados, etc. • camiones hormigonera - quads, karts y similares, incluidos automóviles de carreras Esta clase comprende también: - la reconstrucción en fábrica de motores para vehículos automóviles Esta clase no comprende: - la fabricación de motores eléctricos (excepto motores de arranque) (véase 27.11) - la fabricación de dispositivos de iluminación para vehículos de motor (véase 27.40) - la fabricación de pistones, anillos de pistón y carburadores (véase 28.11) - la fabricación de tractores para uso agrícola (véase 28.30) - la fabricación de tractores utilizados en obras de construcción y en la explotación de minas y canteras (véase 28.92) - la fabricación de camiones todoterreno de caja basculante (véase 28.92) - la construcción de carrocerías para vehículos de motor (véase 29.20) - la construcción de piezas eléctricas para vehículos de motor (véase 29.31) - la construcción de piezas y accesorios de vehículos de motor (véase 29.32) - la fabricación de carros de combate y de otros vehículos militares de combate (véase 30.40) - el mantenimiento, la reparación o la transformación de vehículos de motor (véase 45.20) @es
scope note: Cette classe comprend: - la fabrication de voitures de tourisme - la fabrication de véhicules utilitaires: • camions et camionnettes, tracteurs routiers pour semi-remorques, etc. - la fabrication d’autobus, de trolleybus et d’autocars - la fabrication de moteurs pour véhicules automobiles - la fabrication de châssis pour véhicules à moteur - la fabrication d’autres véhicules automobiles: • autoneiges et motoneiges, véhicules spéciaux pour le transport de personnes sur les terrains de golf, véhicules amphibies • autopompes, balayeuses, bibliobus, voitures blindées, etc. • camions-bétonnières - la fabrication de véhicules tout terrain, karts et engins similaires, y compris les voitures de course Cette classe comprend également: - le réusinage de moteurs pour véhicules automobiles Cette classe ne comprend pas: - la fabrication de moteurs électriques (à l’exception des moteurs de démarrage), voir 27.11 - la fabrication d’appareils d’éclairage pour véhicules automobiles, voir 27.40 - la fabrication de pistons, segments de piston, carburateurs, voir 28.11 - la fabrication de tracteurs agricoles, voir 28.30 - la fabrication de tracteurs utilisés dans la construction et les mines, voir 28.92 - la fabrication de camions à benne tout-terrains, voir 28.92 - la fabrication de carrosseries pour véhicules automobiles, voir 29.20 - la fabrication de parties électriques pour véhicules automobiles, voir 29.31 - la fabrication de parties et d’accessoires pour véhicules automobiles, voir 29.32 - la fabrication de chars et d’autres véhicules militaires de combat, voir 30.40 - l’entretien et la réparation de véhicules automobiles, voir 45.20 @fr
scope note: Ovaj razred uključuje: - proizvodnju putničkih vozila - proizvodnju komercijalnih vozila: • kamiona, teretnjaka, cestovnih traktora za poluprikolice itd. - proizvodnju autobusa, trolejbusa i kočija - proizvodnju motora za motorna vozila - proizvodnju šasija za motorna vozila - proizvodnju ostalih motornih vozila: • vozila za snijeg, vozila za golf, amfibijskih vozila • vatrogasnih vozila, vozila za čišćenje ulica, pokretnih knjižnica, armiranih vozila itd. • kamiona za miješanje betona - ATV (motocikla), gokarta i slično, uključujući trkaća vozila Ovaj razred također uključuje: - tvornice za poboljšanje karakteristika motora motornih vozila Ovaj razred isključuje: - proizvodnju električnih motora (osim startnih motora), vidi 27.11 - proizvodnju svjetlosne opreme za motorna vozila, vidi 27.40 - proizvodnju klipova i klipnih prstenova te karburatora, vidi 28.11 - proizvodnju poljoprivrednih traktora, vidi 28.30 - proizvodnju traktora koji se koriste u građevinarstvu i rudarstvu, vidi 28.92 - proizvodnju kamiona za istovar, vidi 28.92 - proizvodnju karoserija za motorna vozila, vidi 29.20 - proizvodnju električnih dijelova za motorna vozila, vidi 29.31 - proizvodnju dijelova i pribora za motorna vozila, vidi 29.32 - proizvodnju tenkova i ostalih vojnih borbenih vozila, vidi 30.40 - održavanje, popravak i rekonstrukciju motornih vozila, vidi 45.20
scope note: Į šią klasę įeina: - keleivinių lengvųjų automobilių gamyba - komercinių transporto priemonių gamyba: • autofurgonų, sunkvežimių, kelių vilkikų su puspriekabėmis ir kt., gamyba - autobusų, troleibusų ir turistinių tarpmiestinių autobusų gamyba - variklinių transporto priemonių variklių gamyba - variklinių transporto priemonių važiuoklių gamyba - kitų variklinių transporto priemonių gamyba: • sniegaeigių, golfo automobiliukų, amfibinių transporto priemonių • ugniagesių automobilių, gatvių valymo mašinų, kilnojamų bibliotekų, šarvuotų automobilių ir kt. • automobilinių betono maišytuvų - keturračių motociklų (ATV), kartingų ir panašių, įskaitant lenktyninius automobilius Į šią klasę taip pat įeina: - variklinių transporto priemonių variklių gamyklinis atstatymas Į šią klasę neįeina: - elektros variklių (išskyrus paleidimo variklius) gamyba, žr. 27.11 - variklinių transporto priemonių apšvietimo įrangos gamyba, žr. 27.40 - stūmoklių, stūmoklių žiedų ir karbiuratorių gamyba, žr. 28.11 - žemės ūkio traktorių gamyba, žr. 28.30 - statybose ar kasyboje naudojamų traktorių gamyba, žr. 28.92 - visureigių savivarčių gamyba, žr. 28.92 - variklinių transporto priemonių kėbulų gamyba, žr. 29.20 - variklinių transporto priemonių elektros įrangos dalių gamyba, žr. 29.31 - variklinių transporto priemonių atsarginių dalių ir pagalbinių reikmenų gamyba, žr. 29.32 - tankų ir kitų karinių kovos mašinų gamyba, žr. 30.40 - variklinių transporto priemonių techninė priežiūra, remontas ir pertvarkymas, žr. 45.20 @lt
scope note: Bu sınıf aşağıdakileri kapsamaktadır; - binek otomobillerin imalatı, - ticari kara taşıtlarının imalatı: • kamyonetler, kamyonlar ile yarı römorklar için çekiciler vb. - otobüs ve troleybüs (çift katlı, körüklü vb. Otobüsler) imalatı, - motorlu kara taşıtları motorlarının imalatı, - motorlu kara taşıtları için şasi imalatı, - diğer motorlu kara taşıtlarının imalatı : • kar motosikletleri, golf arabaları, hem karada hem suda hareket edebilen (amfibi) araçlar, • itfaiye arabaları, yol temizleme araçları, gezici kütüphaneler, zırhlı otomobiller vb. • beton karıştırıcılı (mikserli) kamyonlar, - ATV motosikletleri( dört tkerelekli motosiklet),go-kart arabları ve benzeri( yarış arabaları dahil) Ayrıca bu sınıf aşağıdakileri de kapsamaktadır; - motorlu kara taşıtları motorlarının fabrikada yeniden yapımı. Kapsam dışı olanlar; - elektrikli motorların imalatı (marş motoru hariç), bkz. 27.11, - motorlu kara taşıtları için aydınlatma ekipmanlarının imalatı, bkz. 27.40, - pistonların, sekmanların ve karbüratörlerin imalatı, bkz. 28.11, - tarımda kullanılan traktörlerin imalatı, bkz. 28.30, - inşaatta veya madencilikte kullanılan traktörlerin imalatı, bkz. 28.92, - Kara yolu dışında kullanılan damperli yük kamyonların imalatı, bkz. 28.92, - motorlu kara taşıtları karoseri (kaporta) imalatı, bkz. 29.20, - motorlu kara taşıtlarının elektrikli parçalarının imalatı, bkz. 29.31, - motorlu kara taşıtları için parça ve aksesuar imalatı, bkz. 29.32, - askeri tankların ve diğer askeri savaş araçlarının imalatı, bkz. 30.40, - motorlu kara taşıtlarının bakım, onarım ve parçalarının değiştirilmesi, bkz.45.20. @tr
preferred label: Производство на автомобили и техните двигатели @bg
preferred label: Výroba motorových vozidel, kromě motocyklů @cs
preferred label: Fremstilling af motorkøretøjer @da
preferred label: Herstellung von Kraftwagen und Kraftwagenmotoren @de
preferred label: Κατασκευή μηχανοκίνητων οχημάτων @el
preferred label: Fabricación de vehículos de motor @es
preferred label: Mootorsõidukite tootmine @et
preferred label: Moottoriajoneuvojen valmistus @fi
preferred label: Construction de véhicules automobiles @fr
preferred label: Közúti gépjármű gyártása
preferred label: Fabbricazione di autoveicoli @it
preferred label: Variklinių transporto priemonių gamyba @lt
preferred label: Automobiļu ražošana @lv
preferred label: Manifattura ta' vetturi bil-mutur @mt
preferred label: Vervaardiging van auto's @nl
preferred label: Produksjon av motorvogner @no
preferred label: Produkcja pojazdów samochodowych @pl
preferred label: Fabricação de veículos automóveis @pt
preferred label: Fabricarea autovehiculelor de transport rutier @ro
preferred label: Производство моторных транспортных средств @ru
preferred label: Výroba motorových vozidiel @sk
preferred label: Proizvodnja motornih vozil @sl
preferred label: Motorfordonstillverkning @sv
preferred label: Motorlu kara taşıtlarının imalatı @tr
broader: Manufacture of motor vehicles

Manufacture of bodies (coachwork) for motor vehicles; manufacture of trailers and semi-trailers
type: Concept
notation: 29.2
status: valid
status modified: 2013-10-18
accepted date: 2013-10-18
in scheme: Statistical Classification of Economic Activities in the European Community, Rev. 2 (2008)
scope note: Этот класс включает: - производство электрического оборудования для транспортных средств, такого как генераторы, генераторы переменного тока, свечи зажигания, электропроводки системы зажигания, системы автоматического открывания/закрывания окон и дверей, регуляторы напряжения и т.п. Этот класс исключает: - производство батарей для транспортных средств, см. 27.20 - производство осветительного оборудования для автотранспортных средств, см. 27.40 - производство насосов для автотранспортных средств и двигателей, см. 28.13 @ru
preferred label: Производство на купета и каросерии за автомобили; производство на ремаркета и полуремаркета @bg
preferred label: Výroba karoserií motorových vozidel; výroba přívěsů a návěsů @cs
preferred label: Fremstilling af karosserier til motorkøretøjer; fremstilling af påhængsvogne og sættevogne @da
preferred label: Herstellung von Karosserien, Aufbauten und Anhängern @de
preferred label: Κατασκευή αμαξωμάτων για μηχανοκίνητα οχήματα· κατασκευή ρυμουλκούμενων και ημιρυμουλκούμενων οχημάτων @el
preferred label: Fabricación de carrocerías para vehículos de motor; fabricación de remolques y semirremolques @es
preferred label: Mootorsõidukikerede tootmine; haagiste ja poolhaagiste tootmine @et
preferred label: Moottoriajoneuvojen korien valmistus; perävaunujen ja puoliperävaunujen valmistus @fi
preferred label: Fabrication de carrosseries et remorques @fr
preferred label: Gépjármű-karosszéria, pótkocsi gyártása
preferred label: Fabbricazione di carrozzerie per autoveicoli; fabbricazione di rimorchi e semirimorchi @it
preferred label: Variklinių transporto priemonių kėbulų gamyba; priekabų ir puspriekabių gamyba @lt
preferred label: Automobiļu virsbūvju ražošana; piekabju un puspiekabju ražošana @lv
preferred label: Manifattura ta' karozzerija għal vetturi bil-mutur; manifattura ta' trejlers u semitrejlers @mt
preferred label: Vervaardiging van carrosserieën voor auto's; vervaardiging van aanhangwagens en opleggers @nl
preferred label: Produksjon av karosserier og tilhengere @no
preferred label: Produkcja nadwozi do pojazdów silnikowych; produkcja przyczep i naczep @pl
preferred label: Fabricação de carroçarias, reboques e semi-reboques @pt
preferred label: Producţia de caroserii pentru autovehicule; fabricarea de remorci şi semiremorci @ro
preferred label: Производство кузовов для автотранспортных средств; производство трейлеров и полуприцепов @ru
preferred label: Výroba karosérií pre motorové vozidlá; výroba návesov a prívesov @sk
preferred label: Proizvodnja karoserij za vozila; proizvodnja prikolic, polprikolic @sl
preferred label: Tillverkning av karosserier för motorfordon; tillverkning av släpfordon och påhängsvagnar @sv
preferred label: Motorlu kara taşıtları karoseri (kaporta) imalatı; treyler (römork) ve yarı treyler (yarı römork) imalatı @tr
broader: Manufacture of motor vehicles, trailers and semi-trailers
narrower: Manufacture of bodies (coachwork) for motor vehicles; manufacture of trailers and semi-trailers

Manufacture of bodies (coachwork) for motor vehicles; manufacture of trailers and semi-trailers
type: Concept
notation: 29.20
status: valid
status modified: 2013-10-18
accepted date: 2013-10-18
in scheme: Statistical Classification of Economic Activities in the European Community, Rev. 2 (2008)
scope note: - производство на купета и каросерии (вкл. кабини) за автомобили - оборудване на всички видове автомобили, ремаркета и полуремаркета - производство на ремаркета и полуремаркета: • цистерни за автомобили; товарни ремаркета • ремаркета тип каравани и други - производство на карго контейнери - производство на самотоварещи се или саморазтоварващи се ремаркета и полуремаркета за селското стопанство - 28.30 - производство на части и принадлежности за купета и каросерии на автомобили - 29.32 - производство на превозни средства, теглени от животни - 30.99 @bg
scope note: Z: - výrobu karoserií včetně kabin řidiče pro motorová vozidla - vybavování všech typů motorových vozidel, přívěsů a návěsů - výrobu přívěsů a návěsů: • cisternových návěsů, stěhovacích přívěsů (karavanů) atd. • kempinkových a obytných přívěsů atd. - výrobu dopravních kontejnerů pro jedno nebo více druhů dopravy N: - výrobu zemědělských přívěsů a návěsů (28.30) - výrobu dílů a příslušenství pro karoserie motorových vozidel (29.32) - výrobu dopravních prostředků tažených zvířaty (30.99) @cs
scope note: Diese Klasse umfasst: - Herstellung von Karosserien einschließlich Führerhäusern für Kraftwagen - Ausrüstung von Kraftwagen, Anhängern und Sattelanhängern - Herstellung von Anhängern und Sattelanhängern: • Tank- und Umzugsanhänger usw. • Camping- und Wohnanhänger usw. - Herstellung von Transportcontainern für eine oder mehrere Beförderungsarten Diese Klasse umfasst nicht: - Herstellung von landwirtschaftlichen Anhängern und Sattelanhängern (s. 28.30) - Herstellung von Teilen und Zubehör für Kraftwagen (s. 29.32) - Herstellung von Tieren zu ziehenden Gespannfahrzeugen (s. 30.99) @de
scope note: This class includes: - manufacture of bodies, including cabs for motor vehicles - outfitting of all types of motor vehicles, trailers and semi-trailers - manufacture of trailers and semi-trailers: • tankers, removal trailers etc. • caravans etc. - manufacture of containers for carriage by one or more modes of transport This class excludes: - manufacture of trailers and semi-trailers specially designed for use in agriculture, see 28.30 - manufacture of parts and accessories of bodies for motor vehicles, see 29.32 - manufacture of vehicles drawn by animals, see 30.99 @en
scope note: Esta clase comprende: - la fabricación de carrocerías, incluidas las cabinas, para vehículos automóviles - el equipamiento exterior de todo tipo de vehículos de motor, remolques y semirremolques - la fabricación de remolques y semirremolques: • camiones cisterna, de mudanzas, etc. • remolques tipo caravana, etc. - la fabricación de contenedores para una o más modalidades de transporte Esta clase no comprende: - la construcción de remolques y semirremolques especialmente concebidos para usos agrícolas (véase 28.30) - la construcción de piezas y accesorios de carrocerías para vehículos de motor (véase 29.32) - la fabricación de vehículos de tracción animal (véase 30.99) @es
scope note: Cette classe comprend: - la fabrication de carrosseries, y compris les cabines, pour véhicules automobiles - l’aménagement de tous types de véhicules automobiles, de remorques et de semi-remorques - la fabrication de remorques et de semi-remorques: • camions-citernes, véhicules de déménagement • remorques pour le camping, etc. - la fabrication de cadres et de conteneurs spécialement conçus et équipés pour un ou plusieurs modes de transport Cette classe ne comprend pas: - la fabrication de remorques et de semi-remorques à usage agricole, voir 28.30 - la fabrication de parties et d’accessoires de carrosseries pour véhicules automobiles, voir 29.32 - la fabrication de véhicules à traction animale, voir 30.99 @fr
scope note: Ovaj razred uključuje: - proizvodnju karoserija, uključujući kabine za motorna vozila - opremu za sve vrste motornih vozila, prikolica i poluprikolica - proizvodnju prikolica i poluprikolica: • cisterni, prikolica za selidbe itd. • kućica na kotačima itd. - proizvodnju kontejnera za prenošenje za jednu ili više vrsta prijevoza Ovaj razred isključuje: - proizvodnju prikolica i poluprikolica posebno izrađenih za upotrebu u poljoprivredi, vidi 28.30 - proizvodnju dijelova i pribora za karoserije motornih vozila, vidi 29.32 - proizvodnju vozila koje vuku životinje, vidi 30.99
scope note: Į šią klasę įeina: - variklinių transporto priemonių kėbulų, įskaitant kabinas, gamyba - visų tipų variklinių transporto priemonių, priekabų ir puspriekabių įrengimas - priekabų ir puspriekabių gamyba: • autocisternų, perkraustymo priekabų ir kt. • poilsinių ant ratų ir kt. - vienos ar kelių transporto rūšių krovinių konteinerių gamyba Į šią klasę neįeina: - specialiųjų žemės ūkio priekabų ir puspriekabių gamyba, žr. 28.30 - variklinių transporto priemonių kėbulų atsarginių dalių ir reikmenų gamyba, žr. 29.32 - gyvūnų traukiamų vežimų gamyba, žr. 30.99 @lt
scope note: Этот класс включает: - производство различных комплектующих и аксессуаров для автотранспортных средств: • тормозов, коробок передач, осей, ходовых колес, амортизаторов, радиаторов, глушителей, выхлопных труб, каталитических дожигателей выхлопных газов, муфт сцеплений, рулевых колес, рулевых колонок, рулевых приводов - производство комплектующих и аксессуаров для кузовов автотранспортных средств: • ремней безопасности, воздушных подушек, дверей, бамперов - производство сидений для автомобилей Этот класс исключает: - производство шин, см. 22.11 - производство резиновых шлангов, ремней и прочей резиновой продукции, см. 22.19 - производство клапанов, поршневых колец и карбюраторов, см. 28.11 - технический уход, содержание, ремонт и реконструкцию автотранспортных средств, см. 45.20 @ru
scope note: Bu sınıf aşağıdakileri kapsamaktadır; - karoser (kaporta) imalatı (motorlu kara taşıtları için kabin imalatı da dahil), - her çeşit motorlu araç, treyler (römork) ve yarı treyler (yarı römork) donatımı, - treyler (römork) ve yarı treyler (yarı römork) imalatı: • tankerler, ayrılabilir treylerler (römork) vb. • motorsuz karavanlar vb. - bir veya daha fazla taşıma çeşidine göre tasarlanmış konteynerlerin imalatı. Kapsam dışı olanlar; - özellikle tarımda kullanmak için tasarlanmış römork ve yarı-römork imalatı, bkz. 28.30, - motorlu kara taşıt karoserlerinin (kaporta) parça ve aksesuarlarının imalatı, bkz. 29.32, - hayvanlar tarafından çekilen arabaların (at arabası, fayton vb.) imalatı, bkz. 30.99. @tr
preferred label: Производство на купета и каросерии за автомобили; производство на ремаркета и полуремаркета @bg
preferred label: Výroba karoserií motorových vozidel; výroba přívěsů a návěsů @cs
preferred label: Fremstilling af karosserier til motorkøretøjer; fremstilling af påhængsvogne og sættevogne @da
preferred label: Herstellung von Karosserien, Aufbauten und Anhängern @de
preferred label: Κατασκευή αμαξωμάτων για μηχανοκίνητα οχήματα· κατασκευή ρυμουλκούμενων και ημιρυμουλκούμενων οχημάτων @el
preferred label: Fabricación de carrocerías para vehículos de motor; fabricación de remolques y semirremolques @es
preferred label: Mootorsõidukikerede tootmine; haagiste ja poolhaagiste tootmine @et
preferred label: Moottoriajoneuvojen korien valmistus; perävaunujen ja puoliperävaunujen valmistus @fi
preferred label: Fabrication de carrosseries et remorques @fr
preferred label: Gépjármű-karosszéria, pótkocsi gyártása
preferred label: Fabbricazione di carrozzerie per autoveicoli; fabbricazione di rimorchi e semirimorchi @it
preferred label: Variklinių transporto priemonių kėbulų gamyba; priekabų ir puspriekabių gamyba @lt
preferred label: Automobiļu virsbūvju ražošana; piekabju un puspiekabju ražošana @lv
preferred label: Manifattura ta' karozzerija għal vetturi bil-mutur; manifattura ta' trejlers u semitrejlers @mt
preferred label: Vervaardiging van carrosserieën voor auto's; vervaardiging van aanhangwagens en opleggers @nl
preferred label: Produksjon av karosserier og tilhengere @no
preferred label: Produkcja nadwozi do pojazdów silnikowych; produkcja przyczep i naczep @pl
preferred label: Fabricação de carroçarias, reboques e semi-reboques @pt
preferred label: Producţia de caroserii pentru autovehicule; fabricarea de remorci şi semiremorci @ro
preferred label: Производство кузовов для автотранспортных средств; производство трейлеров и полуприцепов @ru
preferred label: Výroba karosérií pre motorové vozidlá; výroba návesov a prívesov @sk
preferred label: Proizvodnja karoserij za vozila; proizvodnja prikolic, polprikolic @sl
preferred label: Tillverkning av karosserier för motorfordon; tillverkning av släpfordon och påhängsvagnar @sv
preferred label: Motorlu kara taşıtları karoseri (kaporta) imalatı; treyler (römork) ve yarı treyler (yarı römork) imalatı @tr
broader: Manufacture of bodies (coachwork) for motor vehicles; manufacture of trailers and semi-trailers

Manufacture of parts and accessories for motor vehicles
type: Concept
notation: 29.3
status: valid
status modified: 2013-10-18
accepted date: 2013-10-18
in scheme: Statistical Classification of Economic Activities in the European Community, Rev. 2 (2008)
scope note: Данный раздел включает строительство транспортных средств, таких как морские суда и корабли, производство железнодорожных составов и локомотивов, воздушных и космических судов и комплектующих материалов. @ru
preferred label: Производство на части и принадлежности за автомобили @bg
preferred label: Výroba dílů a příslušenství pro motorová vozidla, kromě motocyklů @cs
preferred label: Fremstilling af dele og tilbehør til motorkøretøjer @da
preferred label: Herstellung von Teilen und Zubehör für Kraftwagen @de
preferred label: Κατασκευή μερών και εξαρτημάτων για μηχανοκίνητα οχήματα @el
preferred label: Fabricación de componentes, piezas y accesorios para vehículos de motor @es
preferred label: Mootorsõidukite osade ja lisaseadmete tootmine @et
preferred label: Osien ja tarvikkeiden valmistus moottoriajoneuvoihin @fi
preferred label: Fabrication d'équipements automobiles @fr
preferred label: Közúti jármű alkatrészeinek gyártása
preferred label: Fabbricazione di parti ed accessori per autoveicoli @it
preferred label: Variklinių transporto priemonių ir jų dalių bei pagalbinių reikmenų gamyba @lt
preferred label: Detaļu un piederumu ražošana mehāniskajiem transportlīdzekļiem @lv
preferred label: Manifattura ta' partijiet u aċċessorji għal vetturi bil-mutur @mt
preferred label: Vervaardiging van delen en toebehoren voor auto's @nl
preferred label: Produksjon av deler og utstyr til motorvogner @no
preferred label: Produkcja części i akcesoriów do pojazdów silnikowych @pl
preferred label: Fabricação de componentes e acessórios para veículos automóveis @pt
preferred label: Producţia de piese şi accesorii pentru autovehicule şi pentru motoare de autovehicule @ro
preferred label: Производство комплектующих и аксессуаров для автотранспортных средств @ru
preferred label: Výroba dielov a príslušenstva pre motorové vozidlá @sk
preferred label: Proizvodnja delov in opreme za motorna vozila @sl
preferred label: Tillverkning av delar och tillbehör till motorfordon @sv
preferred label: Motorlu kara taşıtları için parça ve aksesuar imalatı @tr
broader: Manufacture of motor vehicles, trailers and semi-trailers
narrower: Manufacture of electrical and electronic equipment for motor vehicles
narrower: Manufacture of other parts and accessories for motor vehicles

Manufacture of electrical and electronic equipment for motor vehicles
type: Concept
notation: 29.31
status: valid
status modified: 2013-10-18
accepted date: 2013-10-18
in scheme: Statistical Classification of Economic Activities in the European Community, Rev. 2 (2008)
scope note: - производство на електрически устройства за автомобили като генератори, алтернатори, свещи за запалване, комплекти проводници за запалителни свещи, системи за задвижване на прозорците и вратите, регулатори за напрежение, сглобяване на закупени измервателни урeди в таблото за управление на автомобила и други - производство на акумулатори за автомобили - 27.20 - производство на лампи и фарове за автомобили - 27.40 - производство на помпи за двигатели с вътрешно горене: за гориво, за масла или за охлаждаща течност - 28.13 @bg
scope note: Z: - výrobu elektrického vybavení a spouštěcích a regulačních agregátů motorových vozidel, např. generátorů, alternátorů, zapalovacích svíček, kabelů zapalování, elektrických spouštěčů oken a zajištění dveří, regulátorů napětí, svazků kabelů a kabelových systémů pro motorová vozidla - výrobu (elektromagnetických) spojek - montáž zakoupených měřicích přístrojů, např. rychloměrů, otáčkoměrů, do palubní desky N: - výrobu baterií do vozidel (27.20) - výrobu osvětlovacích zařízení pro motorová vozidla (27.40) - výrobu čerpadel pro motorová vozidla a motory (28.13) @cs
scope note: Diese Klasse umfasst: - Herstellung von elektrischen Ausrüstungsgegenständen wie Lichtmaschinen, Zündkerzen, Zündkabel, elektrische Fensterheber und Türverriegelungen, Einbau von zugekauften Anzeigeinstrumenten in Armaturenbretter, Spannungsregler usw. Diese Klasse umfasst nicht: - Herstellung von Fahrzeugbatterien (s. 27.20) - Herstellung von Beleuchtungseinrichtungen für Kraftfahrzeuge (s. 27.40) - Herstellung von Pumpen für Kraftfahrzeuge und Motoren (s. 28.13) @de
scope note: This class includes: - manufacture of motor vehicle electrical equipment, such as generators, alternators, spark plugs, ignition wiring harnesses, power window and door systems, assembly of purchased gauges into instrument panels, voltage regulators, etc. This class excludes: - manufacture of batteries for vehicles, see 27.20 - manufacture of lighting equipment for motor vehicles, see 27.40 - manufacture of pumps for motor vehicles and engines, see 28.13 @en
scope note: Esta clase comprende: - la fabricación de equipo eléctrico para vehículos de motor, como generadores, alternadores, bujías de encendido, arneses de encendido, sistemas de accionamiento eléctrico de puertas y ventanas, ensamblaje de indicadores adquiridos en paneles de instrumentos, reguladores de voltaje, etc. Esta clase no comprende: - la fabricación de baterías para vehículos (véase 27.20) - la fabricación de dispositivos de iluminación para vehículos de motor (véase 27.40) - la fabricación de bombas para vehículos de motor y motores (véase 28.13) @es
scope note: Cette classe comprend: - la fabrication de dispositifs électriques pour véhicules automobiles, tels que génératrices, alternateurs, bougies d’allumage, jeux de fils pour bougies d’allumage, systèmes d’ouverture et de fermeture électriques des portières et des vitres, assemblage de jauges achetées dans le tableau de bord, régulateurs de tension, etc. Cette classe ne comprend pas: - la fabrication de batteries pour véhicules automobiles, voir 27.20 - la fabrication d’appareils d’éclairage pour véhicules automobiles, voir 27.40 - la fabrication de pompes pour véhicules à moteurs et moteurs, voir 28.13 @fr
scope note: Ovaj razred uključuje: - proizvodnju električne opreme za motorna vozila kao što su generatori, alternatori, svjećice, žice za inicijalno pokretanje, za dizanje i spuštanje prozora te otvaranje i zatvaranje vrata, mjerači sklopljeni u panel instrumentnu spravu, regulatori napona itd. Ovaj razred isključuje: - proizvodnju baterija za vozila, vidi 27.20 - proizvodnju svjetlosne opreme za motorna vozila, vidi 27.40 - proizvodnju crpki za motorna vozila, vidi 28.13
scope note: Į šią klasę įeina: - variklinių transporto priemonių elektros įrangos, tokios kaip generatoriai, kintamosios srovės generatoriai, uždegimo žvakės, uždegimo laidų pynės, automatinių langų ir durų sistemos, prietaisų skydeliai surinkti iš įsigytų matavimo prietaisų, įtampos reguliatoriai ir kt., gamyba Į šią klasę neįeina: - transporto priemonių akumuliatorių gamyba, žr. 27.20 - variklinių transporto priemonių apšvietimo įrangos gamyba, žr. 27.40 - siurblių variklinėms transporto priemonėms ir varikliams gamyba, žr. 28.13 @lt
scope note: Данная группа включает строительство морских судов, лодок и прочих плавучих конструкций для транспортировки и прочих производственных целей, а также для спортивных и развлекательных мероприятий. @ru
scope note: Bu sınıf aşağıdakileri kapsamaktadır; - motorlu kara taşıtları için dinamolar, alternatörler, bujiler, ateşlemede kullanılan elektrik tesisatı takımları, elektrikli cam ve kapı sistemleri, göstergelerin gösterge paneline montajı, voltaj regülatörleri vb. gibi elektrikli donanımların imalatı. Kapsam dışı olanlar; - motorlu kara taşıtları için akümülatör imalatı, bkz. 27.20, - motorlu kara taşıtları için aydınlatma donanımı imalatı, bkz. 27.40, - motorlu kara taşıtları ve motorları için pompa imalatı, bkz. 28.13. @tr
preferred label: Производство на електронни и електрически части и устройства за автомобили @bg
preferred label: Výroba elektrického a elektronického zařízení pro motorová vozidla, kromě motocyklů @cs
preferred label: Fremstilling af elektrisk og elektronisk udstyr til motorkøretøjer @da
preferred label: Herstellung elektrischer und elektronischer Ausrüstungsgegenstände für Kraftwagen @de
preferred label: Κατασκευή ηλεκτρικού και ηλεκτρονικού εξοπλισμού για μηχανοκίνητα οχήματα @el
preferred label: Fabricación de equipos eléctricos y electrónicos para vehículos de motor @es
preferred label: Mootorsõidukite elektri- ja elektroonikaseadmete tootmine @et
preferred label: Sähkö- ja elektroniikkalaitteiden valmistus moottoriajoneuvoihin @fi
preferred label: Fabrication d'équipements électriques et électroniques automobiles @fr
preferred label: Járművillamossági, -elektronikai készülékek gyártása
preferred label: Fabbricazione di apparecchiature elettriche ed elettroniche per autoveicoli @it
preferred label: Variklinių transporto priemonių ir jų elektros ir elektroninės įrangos gamyba @lt
preferred label: Elektrisko iekārtu ražošana mehāniskajiem transportlīdzekļiem @lv
preferred label: Manifattura ta' tagħmir elettriku u elettroniku għal vetturi bil-mutur @mt
preferred label: Vervaardiging van elektrische en elektronische benodigdheden voor auto's @nl
preferred label: Produksjon av elektrisk og elektronisk utstyr til motorvogner @no
preferred label: Produkcja wyposażenia elektrycznego i elektronicznego do pojazdów silnikowych @pl
preferred label: Fabricação de equipamento eléctrico e electrónico para veículos automóveis @pt
preferred label: Fabricarea de echipamente electrice şi electronice pentru autovehicule şi pentru motoare de autovehicule @ro
preferred label: Производство электрических и электронных комплектующих для автотранспортных средств @ru
preferred label: Výroba elektrických a elektronických prístrojov pre motorové vozidlá @sk
preferred label: Proizvodnja električne in elektronske opreme za motorna vozila @sl
preferred label: Tillverkning av elektrisk och elektronisk utrustning för motorfordon @sv
preferred label: Motorlu kara taşıtları için elektrik ve elektronik donanımlarının imalatı @tr
broader: Manufacture of parts and accessories for motor vehicles

Manufacture of other parts and accessories for motor vehicles
type: Concept
notation: 29.32
status: valid
status modified: 2013-10-18
accepted date: 2013-10-18
in scheme: Statistical Classification of Economic Activities in the European Community, Rev. 2 (2008)
scope note: - производство на разнообразни части и принадлежности за автомобили: • спирачки, предавателни (скоростни) кутии, оси, ходови колела, амортисьори, радиатори, шумозаглушители, ауспуси, катализатори, съединители, волани, кормилни колонки и кормилни кутии - производство на части и принадлежности за купета и каросерии на автомобили: • предпазни колани, предпазни въздушни възглавници (airbags) със система за надуване, врати, брони - производство на седалки за автомобили - производство на вътрешни и външни гуми - 22.11 - производство на маркучи, ремъци и други изделия от каучук - 22.19 - производство на бутала, бутални пръстени и карбуратори - 28.11 - техническо обслужване и ремонт на автомобили - 45.20 @bg
scope note: Z: - výrobu různých dílů a příslušenství pro motorová vozidla: • brzdy, převodovky, nápravy, kola, tlumiče nárazů, chladiče, tlumiče výfuku, výfukové trubky, katalyzátory, spojky, volanty, hřídele volantu a skříně řízení - výrobu dílů a příslušenství pro karoserie motorových vozidel: • bezpečnostní pásy, airbagy, dveře, nárazníky - výrobu sedadel pro motorová vozidla N: - výrobu pneumatik (22.11) - výrobu pryžových hadic, řemenů a jiných výrobků z pryže (22.19) - výrobu pístů, pístních kroužků a karburátorů (28.11) - údržbu, opravy a přestavby motorových vozidel (45.20) @cs
scope note: Diese Klasse umfasst: - Herstellung von verschiedenen Teilen und Zubehör für Kraftwagen: • Bremsen, Getriebe, Achsen, Räder, Stoßdämpfer, Kühler, Auspufftöpfe, Auspuffrohre, Katalysatoren, Kupplungen, Lenkräder, Lenksäulen und Lenkgetriebe - Herstellung von Teilen und Zubehör für Kraftwagenkarosserien: • Sicherheitsgurte, Airbags, Türen, Stoßstangen - Herstellung von Sitzen für Kraftfahrzeuge Diese Klasse umfasst nicht: - Herstellung von Bereifungen (s. 22.11) - Herstellung von Gummischläuchen und –riemen sowie anderen Gummierzeugnissen (s. 22.19) - Herstellung von Kolben, Kolbenringen und Vergasern (s. 28.11) - Instandhaltung, Reparatur und Umbau von Kraftwagen (s. 45.20) @de
scope note: This class includes: - manufacture of diverse parts and accessories for motor vehicles: • brakes, gearboxes, axles, road wheels, suspension shock absorbers, radiators, silencers, exhaust pipes, catalytic converters, clutches, steering wheels, steering columns and steering boxes - manufacture of parts and accessories of bodies for motor vehicles: • safety belts, airbags, doors, bumpers - manufacture of car seats This class excludes: - manufacture of tyres, see 22.11 - manufacture of rubber hoses and belts and other rubber products, see 22.19 - manufacture of pistons, piston rings and carburettors, see 28.11 - maintenance, repair and alteration of motor vehicles, see 45.20 @en
scope note: Esta clase comprende: - la fabricación de diversas piezas y accesorios para vehículos de motor: • frenos, cajas de cambios, ejes, ruedas, amortiguadores de suspensión, radiadores, silenciadores, tubos de escape, catalizadores, embragues, volantes, columnas de dirección y cajas de dirección - la fabricación de piezas y accesorios de carrocerías para vehículos de motor: • cinturones de seguridad, airbags, puertas, parachoques - la fabricación de asientos para vehículos Esta clase no comprende: - la fabricación de neumáticos (véase 22.11) - la fabricación de tubos, correas y otros productos de caucho (véase 22.19) - la fabricación de pistones, anillos de pistón y carburadores (véase 28.11) - el mantenimiento, la reparación o la transformación de vehículos de motor (véase 45.20) @es
scope note: Cette classe comprend: - la fabrication de parties et accessoires divers pour véhicules automobiles: • freins, boîtes de vitesses, essieux, roues, amortisseurs, radiateurs, silencieux, tuyaux d’échappement, catalyseurs, embrayages, volants, colonnes et boîtiers de direction - la fabrication de parties et accessoires pour carrosseries de véhicules automobiles: • ceintures de sécurité, coussins gonflables de sécurité, portières, pare-chocs - la fabrication de sièges de voitures Cette classe ne comprend pas: - la fabrication de pneumatiques, voir 22.11 - la fabrication de pantalons et de ceintures en caoutchouc et d’autres articles en caoutchouc, voir 22.19 - la fabrication de pistons, segments de piston, carburateurs, voir 28.11 - l’entretien, la réparation et la transformation de véhicules automobiles, voir 45.20 @fr
scope note: Ovaj razred uključuje: - proizvodnju različitih dijelova i pribora za motorna vozila: • kočnica, mjenjačkih kutija, osovina, kotača, amortizera, hladnjaka, prigušivača, ispušnih cijevi, katalizatora, mjenjača brzina, upravljača (volana), upravljačkih stupova i upravljačkih kutija - proizvodnju dijelova i pribora za karoserije motornih vozila: • sigurnosnih pojaseva, zračnih jastuka, vrata, odbojnika - proizvodnju automobilskih sjedala Ovaj razred isključuje: - proizvodnju vanjskih i unutrašnjih guma za vozila, vidi 22.11 - proizvodnju gumenih cijevi i pojaseva te ostalih gumenih proizvoda, vidi 22.19 - proizvodnju klipova i klipnih prstenova te karburatora, vidi 28.11 - održavanje, popravak i alteraciju motornih vozila, vidi 45.20
scope note: Į šią klasę įeina: - variklinių transporto priemonių įvairių dalių ir pagalbinių reikmenų gamyba: • stabdžių, pavarų dėžių, ašių, ratų, pakabos amortizatorių, radiatorių, duslintuvų, išmetimo vamzdžių, katalizinių keitiklių, sankabų, vairaračių, vairo kolonėlių, vairo mechanizmo karterių - variklinių transporto priemonių kėbulų dalių ir pagalbinių reikmenų gamyba: • saugos diržų, avarinių apsaugos pagalvių, durų ir bamperių - automobilių sėdynių gamyba Į šią klasę neįeina: - padangų gamyba, žr. 22.11 - guminių žarnų ir diržų bei kitų gumos gaminių gamyba, žr. 22.19 - stūmoklių, stūmoklių žiedų ir karbiuratorių gamyba, žr. 28.11 - variklinių transporto priemonių techninė priežiūra, remontas ir perdarymas, žr. 45.20 @lt
scope note: Данный класс включает строительство морских судов, за исключением судов для спортивных или развлекательных мероприятий, и строительство плавучих конструкций: Этот класс включает: - строительство промышленных судов: • пассажирских, грузовых, морских грузовых судов, танкеров, буксирных суден и т.д. - строительство военных кораблей - строительство судов для рыбной ловли и перерабатывающих плавучих рыбозаводов Этот класс также включает: - строительство транспортных средств на воздушной подушке (за исключением развлекательных) - строительство буровых платформ, плавучих или расположенных на воде - строительство плавучих конструкций: • плавучих доков, понтонов, кессон для подводных работ, плавучих или наземных пристаней, бакенов, плавучих резервуаров, барж, маяков, плавучих кранов, не развлекательных надувных плотов и т.д. - производство сегментов для судов и плавучих конструкций Этот класс исключает: - производство второстепенных комплектующих для судов: • производство парусов, см. 13.92 • производство судовых винтов и лопастей, см. 25.99 • производство железных или стальных якорей, см. 25.99 • производство морских двигателей, см. 28.11 - производство навигационных инструментов, см. 26.51 - производство осветительного оборудования для судов, см. 27.40 - производство наземно-водных автотранспортных средств, см. 29.10 - производство развлекательных надувных плотов и лодок, см. 30.12 - специализированный ремонт и технический уход и содержание судов и плавучих конструкций, см. 33.15 - разбор кораблей на части, см. 38.31 - установку внутреннего оборудования на судах, см. 43.3 @ru
scope note: Bu sınıf aşağıdakileri kapsamaktadır; - motorlu kara taşıtları için çeşitli parça ve aksesuarların imalatı: • frenler, dişli kutuları, şanzımanlar, dingiller, jantlar, süspansiyonlu amortisörler, radyatörler, susturucular, egzoz boruları, katalitik konvertör, debriyajlar (clutches), direksiyon simitleri, direksiyon milleri ve direksiyon kutuları, - motorlu kara taşıtları için karoser (kaporta) parça ve aksesuarlarının imalatı: • emniyet kemerleri, hava yastıkları, kapılar, tamponlar. - araba koltuklarının imalatı. Kapsam dışı olanlar; - lastik tekerlek imalatı, bkz. 22.11, - kauçuk hortumlar ve kemerler ile diğer kauçuk ürünlerin imalatı, bkz. 22.19, - pistonların, piston sekmanlarının ve karbüratörlerin imalatı, bkz. 28.11, - motorlu taşıtların bakımı, onarımı ve parçalarının değiştirilmesi, bkz. 45.20. @tr
preferred label: Производство на други части и принадлежности за автомобили @bg
preferred label: Výroba ostatních dílů a příslušenství pro motorová vozidla, kromě motocyklů @cs
preferred label: Fremstilling af andre dele og tilbehør til motorkøretøjer @da
preferred label: Herstellung von sonstigen Teilen und sonstigem Zubehör für Kraftwagen @de
preferred label: Κατασκευή άλλων μερών και εξαρτημάτων για μηχανοκίνητα οχήματα @el
preferred label: Fabricación de otros componentes, piezas y accesorios para vehículos de motor @es
preferred label: Mootorsõidukite muude osade ja lisaseadmete tootmine @et
preferred label: Muiden osien ja tarvikkeiden valmistus moottoriajoneuvoihin @fi
preferred label: Fabrication d'autres équipements automobiles @fr
preferred label: Közúti jármű, járműmotor alkatrészeinek gyártása
preferred label: Fabbricazione di altre parti ed accessori per autoveicoli @it
preferred label: Variklinių transporto priemonių ir jų kitų dalių bei reikmenų gamyba @lt
preferred label: Detaļu un piederumu ražošana mehāniskajiem transportlīdzekļiem @lv
preferred label: Manifattura ta' partijiet u aċċessorji oħra għal vetturi bil-mutur @mt
preferred label: Vervaardiging van andere delen en toebehoren van auto's @nl
preferred label: Produksjon av andre deler og annet utstyr til motorvogner @no
preferred label: Produkcja pozostałych części i akcesoriów do pojazdów silnikowych @pl
preferred label: Fabricação de outros componentes e acessórios para veículos automóveis @pt
preferred label: Fabricarea altor piese şi accesorii pentru autovehicule şi pentru motoare de autovehicule @ro
preferred label: Производство прочих комплектующих и аксессуаров для автотранспортных средств @ru
preferred label: Výroba ostatných dielov a príslušenstva pre motorové vozidlá @sk
preferred label: Proizvodnja drugih delov in opreme za motorna vozila @sl
preferred label: Tillverkning av andra delar och tillbehör till motorfordon @sv
preferred label: Motorlu kara taşıtları için diğer parça ve aksesuarların imalatı @tr
broader: Manufacture of parts and accessories for motor vehicles

Manufacture of other transport equipment
type: Concept
notation: 30
status: valid
status modified: 2013-10-18
accepted date: 2013-10-18
in scheme: Statistical Classification of Economic Activities in the European Community, Rev. 2 (2008)
scope note: строителство на плавателни средства и производството на локомотиви и вагони, въздухоплавателни и космически средства и техните части. @bg
scope note: Tento oddíl zahrnuje výrobu ostatních dopravních prostředků, např. výrobu člunů a stavbu lodí, výrobu kolejových vozidel a lokomotiv, letadel a kosmických lodí a výrobu jejich dílů. @cs
scope note: Diese Abteilung umfasst den sonstigen Fahrzeugbau, wie den Schiffbau und die Herstellung von Booten, die Herstellung von Schienenfahrzeugen, Luft- und Raumfahrzeugen und die Herstellung von Teilen dafür. @de
scope note: This division includes the manufacture of transportation equipment such as ship building and boat manufacturing, the manufacture of railroad rolling stock and locomotives, air and spacecraft and the manufacture of parts thereof. @en
scope note: Esta división comprende la fabricación de equipos de transporte, como la construcción de buques y otras embarcaciones, la fabricación de locomotoras y de material rodante para ferrocarriles, y la fabricación de aeronaves y naves espaciales y de componentes para las mismas. @es
scope note: Cette division comprend la fabrication de matériel de transport telle que la construction de bateaux et de navires, la fabrication de matériel ferroviaire roulant et de locomotives, la construction aéronautique et spatiale et la fabrication d’éléments de ces équipements. @fr
scope note: Ovaj odjeljak uključuje proizvodnju transportnih sredstava kao što je gradnja čamaca i brodova, proizvodnju tračničkih vozila i lokomotiva, zrakoplova i svemirskih letjelica te proizvodnju njihovih dijelova.
scope note: Į šį skyrių įeina transporto įrangos gamyba, tokia kaip laivų statyba ir valčių gamyba, geležinkelio riedmenų ir lokomotyvų gamyba, orlaivių ir erdvėlaivių gamyba, ir jos dalių gamyba. @lt
scope note: Этот класс включает: - производство надувных плотов и лодок - строительство парусных лодок со вспомогательным мотором или без него - строительство моторных лодок - строительство развлекательных транспортных средств на воздушной подушке - производство персональных водных средств - производство прочих развлекательных и спортивных лодок: • каноэ, байдарок, гребных лодок, плоскодонных гребных лодок Этот класс исключает: - производство комплектующих для развлекательных и спортивных лодок: • производство парусов, см. 13.92 • производство железных или стальных якорей, см. 25.99 • производство морских двигателей, см. 28.11 - производство парусных досок и досок для серфинга, см. 32.30 - технический уход, содержание и ремонт развлекательных лодок, см. 33.15 @ru
scope note: Bu bölüm, gemi yapımı ve tekne imalatı, demiryolu için demiryolu vagonlarının ve lokomotiflerin imalatı, uçakların ve uzay gemilerinin ve bunların parçalarının imalatı gibi ulaşım araçlarının imalatını kapsamaktadır. @tr
preferred label: Производство на превозни средства, без автомобили @bg
preferred label: Výroba ostatních dopravních prostředků a zařízení @cs
preferred label: Fremstilling af andre transportmidler @da
preferred label: Sonstiger Fahrzeugbau @de
preferred label: Κατασκευή λοιπού εξοπλισμού μεταφορών @el
preferred label: Fabricación de otro material de transporte @es
preferred label: Muude transpordivahendite tootmine @et
preferred label: Muiden kulkuneuvojen valmistus @fi
preferred label: Fabrication d'autres matériels de transport @fr
preferred label: Egyéb jármű gyártása
preferred label: Fabbricazione di altri mezzi di trasporto @it
preferred label: Kitų transporto priemonių ir įrangos gamyba @lt
preferred label: Citu transportlīdzekļu ražošana @lv
preferred label: Manifattura ta' tagħmir ieħor għat-trasport @mt
preferred label: Vervaardiging van andere transportmiddelen @nl
preferred label: Produksjon av andre transportmidler @no
preferred label: Produkcja pozostałego sprzętu transportowego @pl
preferred label: Fabricação de outro equipamento de transporte @pt
preferred label: Fabricarea altor mijloace de transport @ro
preferred label: Производство прочего транспортного оборудования @ru
preferred label: Výroba ostatných dopravných prostriedkov @sk
preferred label: Proizvodnja drugih vozil in plovil @sl
preferred label: Tillverkning av andra transportmedel @sv
preferred label: Diğer ulaşım araçlarının imalatı @tr
broader: MANUFACTURING
narrower: Building of ships and boats
narrower: Manufacture of railway locomotives and rolling stock
narrower: Manufacture of air and spacecraft and related machinery
narrower: Manufacture of military fighting vehicles
narrower: Manufacture of transport equipment n.e.c.

Building of ships and boats
type: Concept
notation: 30.1
status: valid
status modified: 2013-10-18
accepted date: 2013-10-18
in scheme: Statistical Classification of Economic Activities in the European Community, Rev. 2 (2008)
scope note: строителство на плавателни съдове и плаващи съоръжения за превоз на пътници или товари, или за развлечение или спорт. @bg
scope note: Tato skupina zahrnuje stavbu lodí, člunů a jiných plovoucích zařízení sloužících přepravě a ostatním komerčním účelům, jako i sportovním a rekreačním účelům. Patří sem i průmyslová přestavba a generální oprava lodí a člunů. Běžné opravy a údržba patří do třídy 33.15. @cs
scope note: Diese Gruppe umfasst den Bau von Schiffen, Booten und anderen schwimmenden Vorrichtungen für die Personen- oder Güterbeförderung sowie für Sport- und Freizeitzwecke. @de
scope note: This group includes the building of ships, boats and other floating structures for transportation and other commercial purposes, as well as for sports and recreational purposes. @en
scope note: Este grupo comprende la construcción de barcos y otras estructuras flotantes para el transporte y otros fines comerciales, así como para actividades deportivas y recreativas. @es
scope note: Ce groupe comprend la construction de navires, de bateaux et de structures flottantes pour le transport ou d’autres usages commerciaux, ainsi que pour le sport et les loisirs. @fr
scope note: Ova skupina uključuje gradnju brodova, čamaca i ostalih plutajućih objekata za potrebe prijevoza i ostale komercijalne svrhe, kao i za potrebe sporta i rekreacije.
scope note: Į šią grupę įeina laivų, valčių ir kitų plūdriųjų statinių, skirtų transporto ir kitiems komerciniams tikslams, taip pat sporto ir pramoginiams tikslams, statyba. @lt
scope note: Bu grup, ulaştırma ve diğer ticari amaçlar için gemilerin, teknelerin ve diğer yüzen yapıların inşaasını kapsamaktadır (spor ve eğlence amaçlı olanlar da dahil). @tr
preferred label: Строителство на плавателни съдове @bg
preferred label: Stavba lodí a člunů @cs
preferred label: Bygning af skibe og både @da
preferred label: Schiff- und Bootsbau @de
preferred label: Ναυπήγηση πλοίων και σκαφών @el
preferred label: Construcción naval @es
preferred label: Laeva- ja paadiehitus @et
preferred label: Laivojen ja veneiden rakentaminen @fi
preferred label: Construction navale @fr
preferred label: Hajó, csónak gyártása
preferred label: Costruzione di navi e imbarcazioni @it
preferred label: Įvairių tipų laivų statyba @lt
preferred label: Kuģu un laivu būve @lv
preferred label: Bini ta' vapuri u dgħajjes @mt
preferred label: Scheepsbouw @nl
preferred label: Bygging av skip og båter @no
preferred label: Produkcja statków i łodzi @pl
preferred label: Construção naval @pt
preferred label: Construcţia de nave şi bărci @ro
preferred label: Производство морских судов и лодок @ru
preferred label: Stavba lodí a člnov @sk
preferred label: Gradnja ladij in čolnov @sl
preferred label: Skepps- och båtbyggeri @sv
preferred label: Gemi ve tekne yapımı @tr
broader: Manufacture of other transport equipment
narrower: Building of ships and floating structures
narrower: Building of pleasure and sporting boats

Building of ships and floating structures
type: Concept
notation: 30.11
status: valid
status modified: 2013-10-18
accepted date: 2013-10-18
in scheme: Statistical Classification of Economic Activities in the European Community, Rev. 2 (2008)
scope note: - строителство на плавателни съдове с гражданско предназначение: пътнически кораби, фериботи, товарни кораби, танкери, влекачи и други - строителство на бойни кораби - строителство на риболовни кораби, кораби заводи и други кораби за обработка или консервиране на продуктите от риболова - строителство на кораби на въздушни възглавници (без тези за отдих) - строителство на сондажни платформи, плаващи или потопяеми - строителство на плаващи съоръжения: • плаващи докове, понтони, шамандури, кесони, сигнални знаци, резервоари, тласкачи, - производство на части за плавателни съдове, без тези, които образуват корпуса: • производство на платна за плавателни съдове - 13.92 • производство на гребни винтове - 25.99 • производство на котви от чугун или стомана - 25.99 • производство на двигатели за плавателни съдове - 28.11 - производство на уреди и апарати за навигация - 26.51 - производство на лампи и фарове за плавателни съдове - 27.40 - производство на автомобили със специално предназначение (амфибии) - 29.10 - производство на надуваеми лодки и салове за отдих - 30.12 - ремонт и поддържане на плавателни съдове - 33.15 - разрушаване на кораби - 38.31 - вътрешно обзавеждане на плавателни съдове - 43.3 @bg
scope note: Tato třída zahrnuje stavbu lodí a plavidel (kromě plavidel pro sportovní a rekreační účely), a stavbu plovoucích zařízení: Z: - stavbu komerčních plavidel: • osobních, převozních (trajektů), nákladních, cisternových (tankerů), remorkérů atd. - stavbu válečných lodí - stavbu rybářských lodí a plovoucích základen pro zpracování ryb (zpracovatelských lodí) ZT: - stavbu vznášedel (kromě vznášedel pro sportovní a rekreační účely) - stavbu plovoucích nebo ukotvených vrtných plošin - stavbu plovoucích zařízení: • plovoucích doků, pontonů, ochranných hrází (kesonů), plovoucích přístavních můstků, bójí, plovoucích nádrží, nákladních člunů, majáků, plovoucích jeřábů, nafukovacích raftů kromě určených pro sportovní a rekreační účely atd. - výrobu základních prvků lodí a plovoucích zařízení N: - výrobu dílů plavidel, kromě základních prvků trupu: • výrobu plachet (13.92) • výrobu lodních šroubů (25.99) • výrobu kotev ze železa a oceli (25.99) • výrobu lodních motorů (28.11) - výrobu navigačních přístrojů (26.51) - výrobu lamp a osvětlení pro lodě (27.40) - stavbu obojživelných vozidel (29.10) - výrobu nafukovacích člunů nebo raftů pro sportovní a rekreační účely (30.12) - běžnou opravu a údržbu lodí a plovoucích zařízení (33.15) - demontáž lodí (38.31) - vnitřní vybavení lodí a člunů (43.3) @cs
scope note: Diese Klasse umfasst den Bau von Schiffen, außer Boote und Yachten für Sport- und Freizeitzwecke, und von schwimmenden Vorrichtungen: Diese Klasse umfasst: - Bau von Schiffen für die Personen- und Güterbeförderung: • Fahrgastschiffe, Fährschiffe, Frachtschiffe, Tankschiffe, Schlepper usw. - Bau von Kriegsschiffen - Bau von Fischereifahrzeugen und von Fisch verarbeitenden Fabrikschiffen Diese Klasse umfasst ferner: - Bau von Luftkissenfahrzeugen (ohne Luftkissenfahrzeugen für Freizeitzwecke) - Bau von schwimmenden oder tauchenden Bohrplattformen - Bau von schwimmenden Vorrichtungen: • Schwimmdocks, Pontons, Kofferdämme, schwimmende Landungsbrücken, Bojen, Schwimmtanks, Schuten, Leichter, Schwimmkräne, aufblasbare Flöße nicht für Freizeitzwecke usw. - Herstellung von Schiffssegmenten und schwimmenden Vorrichtungen Diese Klasse umfasst nicht: - Herstellung von Teilen von Wasserfahrzeugen, außer Rumpfgrundelementen: • Herstellung von Segeln (s. 13.92) • Herstellung von Schiffsschrauben (s. 25.99) • Herstellung von Ankern aus Eisen oder Stahl (s. 25.99) • Herstellung von Schiffsmotoren (s. 28.11) - Herstellung von Navigationsinstrumenten (s. 26.51) - Herstellung von Lampen und Leuchten für Schiffe (s. 27.40) - Bau von Amphibienfahrzeugen (s. 29.10) - Herstellung von aufblasbaren Booten und Flößen für Freizeitzwecke (s. 30.12) - spezialisierte Instandhaltung und Reparatur von Schiffen und schwimmenden Einrichtungen (s. 33.15) - Schiffsverschrottung (s. 38.31) - Innenausstattung von Booten (s. 43.3) @de
scope note: This class includes the building of ships, except vessels for sports or recreation, and the construction of floating structures: This class includes: - building of commercial vessels: • passenger vessels, ferry boats, cargo ships, tankers, tugs etc. - building of warships - building of fishing boats and fish-processing factory vessels This class also includes: - building of hovercraft (except recreation-type hovercraft) - construction of drilling platforms, floating or submersible - construction of floating structures: • floating docks, pontoons, coffer-dams, floating landing stages, buoys, floating tanks, barges, lighters, floating cranes, non-recreational inflatable rafts etc. - manufacture of sections for ships and floating structures This class excludes: - manufacture of parts of vessels, other than major hull assemblies: • manufacture of sails, see 13.92 • manufacture of ships' propellers, see 25.99 • manufacture of iron or steel anchors, see 25.99 • manufacture of marine engines, see 28.11 - manufacture of navigational instruments, see 26.51 - manufacture of lighting equipment for ships, see 27.40 - manufacture of amphibious motor vehicles, see 29.10 - manufacture of inflatable boats or rafts for recreation, see 30.12 - specialised repair and maintenance of ships and floating structures, see 33.15 - ship-breaking, see 38.31 - interior installation of boats, see 43.3 @en
scope note: Esta clase comprende la construcción de buques, excepto embarcaciones para deporte o recreo, y la construcción de estructuras flotantes. Esta clase comprende: - la construcción de buques de uso comercial: • buques de pasajeros, transbordadores, buques cargueros, buques cisterna, remolcadores, etc. - la construcción de buques de guerra - la construcción de pesqueros y buques-factoría Esta clase comprende también: - la construcción de aerodeslizadores (excepto aerodeslizadores de recreo) - la construcción de plataformas de perforación flotantes o sumergibles - la construcción de estructuras flotantes: • diques flotantes, pontones, embarcaderos flotantes, boyas, tanques flotantes, gabarras, barcazas, grúas flotantes, balsas inflables distintas de las de recreo, etc. - la fabricación de secciones para buques y estructuras flotantes Esta clase no comprende: - la fabricación de partes de embarcaciones, excepto de secciones importantes del casco: • la fabricación de velas (véase 13.92) • la fabricación de hélices de barco (véase 25.99) • la fabricación de anclas de hierro o acero (véase 25.99) • la fabricación de motores para barcos (véase 28.11) - la fabricación de instrumentos de navegación (véase 26.51) - la fabricación de dispositivos de iluminación para barcos (véase 27.40) - la fabricación de vehículos motorizados anfibios (véase 29.10) - la fabricación de botes o balsas neumáticas de recreo (véase 30.12) - la reparación y el mantenimiento especializados de buques y estructuras flotantes (véase 33.15) - el desguace naval (véase 38.31) - la instalación interior de embarcaciones (véase 43.3) @es
scope note: Cette classe comprend la construction de navires et de bateaux, à l’exception des embarcations de sport ou de plaisance, et la construction de structures flottantes: Cette classe comprend: - la construction de navires de commerce: navires à passagers, transbordeurs, cargos, bateaux-citernes, remorqueurs, etc. - la construction de navires de guerre - la construction de bateaux de pêche et de navires usines procédant à la transformation du poisson Cette classe comprend également: - la construction d’aéroglisseurs (à l’exception des aéroglisseurs de plaisance) - la construction de plates-formes de forage flottantes ou submersibles - la construction de structures et d’engins flottants: • docks flottants, pontons, caissons, coffres d’amarrage flottants, bouées, réservoirs flottants, barges, allèges, gabares, pontons-grues, radeaux gonflables autres que récréatifs, etc. - la fabrication d’éléments métalliques pour la construction navale et de structures flottantes Cette classe ne comprend pas: - la construction de parties de bateaux autres que les parties qui constituent la coque: • la fabrication de voiles, voir 13.92 • la fabrication d’hélices pour navires et bateaux, voir 25.99 • la fabrication d’ancres en fonte ou en acier, voir 25.99 • la fabrication de moteurs pour navires et bateaux, voir 28.11 - la fabrication d’instruments de navigation, voir 26.51 - la fabrication d’appareils d’éclairage pour navires et bateaux, voir 27.40 - la fabrication de véhicules automobiles amphibies, voir 29.10 - la fabrication de bateaux ou de radeaux gonflables récréatifs, voir 30.12 - les activités d’entretien et de réparation spécialisée de navires, bateaux et structures flottantes, voir 33.15 - la démolition navale, voir 38.31 - l’aménagement intérieur des bateaux, voir 43.3 @fr
scope note: Ovaj razred uključuje gradnju brodova, osim plovila za sport i rekreaciju, te gradnju plutajućih objekata. Ovaj razred uključuje: - gradnju komercijalnih brodova • putničkih plovila, trajekata, brodova za prijevoz tereta, tankera, tegljača itd. - gradnju ratnih brodova - gradnju ribarskih brodova i tvornica brodova za preradu ribe Ovaj razred također uključuje: - gradnju lebdjelica (osim rekreacijskih lebdjelica) - izgradnju platformi za bušenje, plutajućih ili podvodnih - izgradnju plutajućih objekata: • plutajućih dokova, pontona, kesona, plutajućih pristaništa, plutača, plutajućih spremnika, teglenica, svjetionika, plutajućih dizalica, gumenih čamaca na napuhavanje koji se ne koriste u rekreacijske svrhe itd. - proizvodnju elemenata za brodove te plutajućih objekata Ovaj razred isključuje: - proizvodnju dijelova za plovila koja ne čine glavne dijelove trupa: • proizvodnju jedara, vidi 13.92 • proizvodnju brodskih propelera, vidi 25.99 • proizvodnju sidara od željeza i čelika, vidi 25.99 • proizvodnju brodskih motora, vidi 28.11 - proizvodnju navigacijskih instrumenata, vidi 26.51 - proizvodnju svjetlosne opreme za brodove, vidi 27.40 - proizvodnju amfibijskih motornih vozila, vidi 29.10 - proizvodnju brodova i čamaca na napuhavanje koji se koriste u rekreacijske svrhe, vidi 30.12 - specijalizirani popravci i održavanje brodova te plutajućih objekata, vidi 33.15 - lomljenje brodova, vidi 38.31 - unutarnje instalacije brodova, vidi 43.3
scope note: Į šią klasę įeina laivų, išskyrus sportinius ar pramoginius, ir plūdriųjų statinių statyba: - komercinių laivų: • keleivinių laivų, keltų, krovininių laivų, tanklaivių ir kt. statyba - karinių laivų statyba - žvejybos laivų ir žuvies apdorojimo laivų statyba Į šią klasę taip pat įeina: - transporto priemonių su oro pagalvėmis gamyba (išskyrus pramogines transporto priemones su oro pagalvėmis) - plūdriųjų ar panardinamųjų gręžinių platformų statyba - plūdriųjų statinių statyba: • plūdriųjų dokų, pontonų, kesonų, plūdriųjų prieplaukų, plūdurų, plūdriųjų rezervuarų, baržų, lichterių, plūdriųjų kranų, nepramoginių pripučiamųjų plaustų ir kt. - laivų ir plūdriųjų statinių sekcijų gamyba Į šią klasę neįeina: - laivų dalių, išskyrus stambiuosius korpusų mazgus, gamyba: • burių gamyba, žr. 13.92 • laivų sraigtų gamyba, žr. 25.99 • geležinių ir plieninių inkarų gamyba, žr. 25.99 • laivų variklių gamyba, žr. 28.11 - navigacijos prietaisų gamyba, žr. 26.51 - laivų apšvietimo įrangos gamyba, žr. 27.40 - amfibinių variklinių transporto priemonių gamyba, žr. 29.10 - pripučiamųjų pramoginių valčių ar plaustų gamyba, žr. 30.12 - laivų ir plūdriųjų statinių specializuotas remontas ir techninė priežiūra, žr. 33.15 - laivų laužymas, žr. 38.31 - laivų vidaus įrengimas, žr. 43.3 @lt
scope note: Этот класс включает: - производство электро-, дизельных, паровых и прочих железнодорожных локомотивов - производство самодвижущихся железнодорожных или трамвайных вагонов, фургонов и грузовиков, транспортные средства для обслуживания - производство железнодорожных или трамвайных подвижных составов, не самодвижущихся: • пассажирских, грузовых вагонов, вагонов-цистерн, самодвижущихся вагонов, товарных вагонов, крановых платформ, цистерн для перевозки горючих материалов и т.д. - производство специализированных комплектующих для железнодорожных или трамвайных локомотивов или подвижных составов: • валов, осей, шпинделей, колес, тормозов и комплектующих для них; рычагов, муфт и соединяющих устройств, буферов и комплектующих; амортизаторов; оснований фургонов и локомотивов; кузовов; коридорных соединений и т.д. Этот класс также включает: - производство рельсовых тележек и локомотивов для горнодобывающей промышленности - производство механического и электромеханического сигнального оборудования, оборудования для контроля безопасности и для управления движением на железнодорожных, трамвайных, внутренних водных путях, автотрассах, парковках, летных полях и т.д. - производство сидений для железнодорожных вагонов Этот класс исключает: - производство сборных рельс, см. 24.10 - производство смонтированных креплений для железнодорожных путей, см. 25.99 - производство электромоторов, см. 27.11 - производство механического и электромеханического сигнального оборудования, оборудования для контроля безопасности и для управления движением на дорогах, см. 27.90 - производство двигателей и турбин, см. 28.11 @ru
scope note: Bu sınıf gemilerin yapımını (spor ve eğlence amacıyla kullanılan tekneler hariç) ve yüzen yapıların inşa edilmesini kapsamaktadır Bu sınıf aşağıdakileri kapsamaktadır; - ticari gemilerin yapılması: • yolcu gemileri, feribotlar, yük gemileri (şilepler), tankerler, romorkörler vb. - savaş gemilerinin yapımı, - balıkçı teknelerinin ve balık işleme gemilerinin yapımı. Ayrıca bu sınıf aşağıdakileri de kapsamaktadır; - hover kraftların (tazikli hava üzerinde, denizde ve karada gidebilen hava taşıtı) inşası (eğlence amaçlı hoverkraftlar hariç), - yüzen ve su altında kalabilen sondaj platformlarının inşası, - yüzen yapıların inşası: • yüzen rıhtımlar, dubalar, koferdamlar, yüzen iskeleler, şamandıralar, yüzen tanklar, mavnalar, salapuryalar, yüzen vinçler, eğlence amaçlı olmayan şişme botlar vb. - gemiler ve yüzen yapılar için bölmelerin imalatı. Kapsam dışı olanlar; - gemi ve tekne parçaları imalatı (gemi ve teknelere ait büyük parçalar hariç): • yelken imalatı, bkz. 13.92, • deniz taşıtlarının pervanelerinin imalatı, bkz. 25.99, • demir veya çelik çapaların imalatı, bkz. 25.99, • deniz taşıtlarında kullanılan motorların imalatı, bkz. 28.11, - seyrüsefer aletlerinin imalatı, bkz. 26.51, - deniz taşıtları için aydınlatma donanımı imalatı, bkz. 27.40, - hem suda hem de karada gidebilen (amfibi) motorlu kara taşıtlarının imalatı, bkz. 29.10, - eğlence amaçlı şişirilebilir motorlu veya motorsuz botların, bkz. 30.12, - gemilerin ve yüzen yapıların uzmanlık gerektiren bakım ve onarımı, bkz. 33.15, - gemilerin sökülmesi, bkz. 38.31, - teknelerin iç kısımlarının kurulumu, bkz. 43.3. @tr
preferred label: Строителство на плавателни съдове, без тези за отдих @bg
preferred label: Stavba lodí a plavidel @cs
preferred label: Bygning af skibe og flydende materiel @da
preferred label: Schiffbau (ohne Boots- und Yachtbau) @de
preferred label: Ναυπήγηση πλοίων και πλωτών κατασκευών @el
preferred label: Construcción de barcos y estructuras flotantes @es
preferred label: Laevade ja ujuvkonstruktsioonide ehitus @et
preferred label: Laivojen ja kelluvien rakenteiden rakentaminen @fi
preferred label: Construction de navires et de structures flottantes @fr
preferred label: Hajógyártás
preferred label: Costruzione di navi e di strutture galleggianti @it
preferred label: Laivų ir plūdriųjų konstrukcijų statyba @lt
preferred label: Kuģu un peldošo iekārtu būve @lv
preferred label: Bini ta' dgħajjes u strutturi għal fuq wiċċ l-ilma @mt
preferred label: Bouw van schepen en drijvend materieel @nl
preferred label: Bygging av skip og flytende materiell @no
preferred label: Produkcja statków i konstrukcji pływających @pl
preferred label: Construção de embarcações e estruturas flutuantes @pt
preferred label: Construcţia de nave şi structuri plutitoare @ro
preferred label: Строительство кораблей и плавучих конструкций @ru
preferred label: Stavba lodí a plávajúcich konštrukcií @sk
preferred label: Gradnja ladij in plavajočih konstrukcij @sl
preferred label: Byggande av fartyg och flytande materiel @sv
preferred label: Gemilerin ve yüzen yapıların inşası @tr
broader: Building of ships and boats

Building of pleasure and sporting boats
type: Concept
notation: 30.12
status: valid
status modified: 2013-10-18
accepted date: 2013-10-18
in scheme: Statistical Classification of Economic Activities in the European Community, Rev. 2 (2008)
scope note: - производство на надуваеми лодки и салове - строителство на ветроходни яхти, дори със спомагателен двигател - строителство на моторни лодки - строителство на кораби на въздушни възглавници за отдих - производство на водни скутери - производство на други плавателни съдове за отдих: • канута, каяци, лодки с гребла, скифове - производство на части за плавателни съдове за отдих: • производство на платна за плавателни съдове - 13.92 • производство на котви от чугун или стомана - 25.99 • производство на двигатели за плавателни съдове - 28.11 - производство на сърф бордове и сърфове с платна - 32.30 - ремонт и поддържане на плавателни съдове за отдих - 33.15 @bg
scope note: Z: - výrobu nafukovacích člunů a raftů - stavbu plachetnic a jachet, také s přídavným motorem - stavbu motorových člunů - stavbu vznášedel rekreační typu - výrobu osobních plavidel - výrobu ostatních rekreačních a sportovních člunů: • kanoí, kajaků, veslových člunů, skifů N: - výrobu dílů rekreačních a sportovních člunů: • plachet (13.92) • kotev ze železa nebo oceli (25.99) • lodních motorů (28.11) - výrobu surfů a surfových prken (32.30) - opravy a údržbu rekreačních lodí (33.15) @cs
scope note: Diese Klasse umfasst: - Herstellung von aufblasbaren Booten und Flößen - Bau von Segelbooten und -yachten, auch mit Hilfsmotor - Bau von Motorbooten - Bau von Luftkissenfahrzeugen für Freizeitzwecke - Herstellung von kleinen Wasserfahrzeugen, wie Jet Ski u. Ä. - Herstellung von sonstigen Vergnügungs- und Sportbooten: • Kanus, Kajaks, Ruderboote, Skiffs Diese Klasse umfasst nicht: - Herstellung von Teilen von Vergnügungs- und Sportbooten: • Herstellung von Segeln (s. 13.92) • Herstellung von Ankern aus Eisen oder Stahl (s. 25.99) • Herstellung von Schiffsmotoren (s. 28.11) - Herstellung von Segelbrettern und Surfbrettern (s. 32.30) - Instandhaltung und Reparatur von Vergnügungsbooten (s. 33.15) @de
scope note: This class includes: - manufacture of inflatable boats and rafts - building of sailboats with or without auxiliary motor - building of motor boats - building of recreation-type hovercraft - manufacture of personal watercraft - manufacture of other pleasure and sporting boats: • canoes, kayaks, rowing boats, skiffs This class excludes: - manufacture of parts of pleasure and sporting boats: • manufacture of sails, see 13.92 • manufacture of iron or steel anchors, see 25.99 • manufacture of marine engines, see 28.11 - manufacture of sailboards and surfboards, see 32.30 - maintenance and repair of pleasure boats, see 33.15 @en
scope note: Esta clase comprende: - la fabricación de botes y balsas inflables - la construcción de veleros con o sin motor auxiliar - la construcción de embarcaciones de motor - la construcción de aerodeslizadores de recreo - la fabricación de motos acuáticas - la construcción de otras embarcaciones de recreo y de deporte: • canoas, kayaks, embarcaciones de remos, botes, etc. Esta clase no comprende: - la fabricación de partes de embarcaciones de recreo y de deporte: • la fabricación de velas (véase 13.92) • la fabricación de anclas de hierro o acero (véase 25.99) • la fabricación de motores para barcos (véase 28.11) - la fabricación de tablas de vela y de surf (véase 32.30) - el mantenimiento y la reparación de embarcaciones de recreo (véase 33.15) @es
scope note: Cette classe comprend: - la construction de bateaux et de radeaux gonflables - la construction de voiliers, avec ou sans moteur auxiliaire - la construction de bateaux à moteur - la construction d’aéroglisseurs de plaisance - la fabrication de motos marines - la construction d’autres embarcations de plaisance et de sport: • canoës, kayaks, canots, skiffs Cette classe ne comprend pas: - la construction de parties d’embarcations de plaisance et de sport: • la fabrication de voiles, voir 13.92 • la fabrication d’ancres en fonte ou en acier, voir 25.99 • la fabrication de moteurs pour navires et bateaux, voir 28.11 - la fabrication de planches à voile et de planches de surf, voir 32.30 - l’entretien et la réparation de bateaux de plaisance, voir 33.15 @fr
scope note: Ovaj razred uključuje: - proizvodnju brodova i čamaca na napuhavanje - gradnju jedrilica sa ili bez pomoćnog motora - gradnju motornih čamaca - gradnju lebdjelica za rekreacijske svrhe - proizvodnju osobnih skutera - proizvodnju ostalih čamaca za razonodu i sport: • kanua, kajaka, čamaca za veslanje, skifova (lakih čamaca) Ovaj razred isključuje: - proizvodnju dijelova čamaca za razonodu i sport: • proizvodnju jedara, vidi 13.92 • proizvodnju sidara od željeza i čelika, vidi 25.99 • proizvodnju brodskih motora, vidi 28.11 - proizvodnju dasaka za jedrenje i surfanje, vidi 32.30 - održavanje, popravak i alteraciju brodova za razonodu, vidi 33.15
scope note: Į šią klasę įeina: - pripučiamųjų valčių ir plaustų gamyba - burlaivių su pagalbiniu varikliu ar be jo statyba - variklinių katerių statyba - pramoginių transporto priemonių su oro pagalvėmis statyba - individualių laivų gamyba - kitų pramoginių ir sportinių laivų statyba: • kanojų, baidarių, irklinių valčių, eldijų Į šią klasę neįeina: - pramoginių ir sportinių laivų dalių gamyba: • burių gamyba, žr. 13.92 • ketinių ir plieninių inkarų gamyba, žr. 25.99 • laivų variklių gamyba, žr. 28.11 - burlenčių ir banglenčių gamyba, žr. 32.30 - pramoginių katerių techninė priežiūra ir remontas, žr. 33.15 @lt
scope note: Bu sınıf aşağıdakileri kapsamaktadır; - şişirilebilen motorlu ve motorsuz botların imalatı, - motorlu veya motorsuz yelkenli teknelerin yapımı, - motorlu teknelerin yapımı, - eğlence amaçlı hoverkraftların yapımı, - kişisel su araçlarının (jet ski dahil) imalatı - diğer eğlence ve sportif amaçlı teknelerin imalatı: • kanolar, sandallar, kayıklar Kapsam dışı olanlar; - eğlence ve spor amaçlı tekne parçalarının imalatı: • yelken imalatı, bkz. 13.92, • demir ve çelik çapaların imalatı, bkz. 25.99, • deniz taşıtlarında kullanılan motorların imalatı, bkz. 28.11, - yelkenli sörflerin, sörf tahtalarının imalatı, bkz. 32.30, - eğlence botlarının bakım ve onarımı, bkz. 33.15. @tr
preferred label: Строителство на плавателни съдове за отдих @bg
preferred label: Stavba rekreačních a sportovních člunů @cs
preferred label: Bygning af både til fritid og sport @da
preferred label: Boots- und Yachtbau @de
preferred label: Ναυπήγηση σκαφών αναψυχής και αθλητισμού @el
preferred label: Construcción de embarcaciones de recreo y deporte @es
preferred label: Lõbusõidu- ja sportpaatide ehitus @et
preferred label: Huvi- ja urheiluveneiden rakentaminen @fi
preferred label: Construction de bateaux de plaisance @fr
preferred label: Szabadidő-, sporthajó gyártása
preferred label: Costruzione di imbarcazioni da diporto e sportive @it
preferred label: Pramoginių ir sportinių katerių (laivų) statyba @lt
preferred label: Atpūtas un sporta laivu būve @lv
preferred label: Bini ta' dgħajjes tad-divertiment u ta' l-isport @mt
preferred label: Bouw van plezier- en sportvaartuigen @nl
preferred label: Bygging av fritidsbåter @no
preferred label: Produkcja łodzi wycieczkowych i sportowych @pl
preferred label: Construção de embarcações de recreio e desporto @pt
preferred label: Construcţia de ambarcaţiuni sportive şi de agrement @ro
preferred label: Строительство прогулочных и спортивных лодок @ru
preferred label: Stavba rekreačných a športových člnov @sk
preferred label: Proizvodnja čolnov za razvedrilo in šport @sl
preferred label: Byggande av fritidsbåtar @sv
preferred label: Eğlence ve spor amaçlı teknelerin yapımı @tr
broader: Building of ships and boats

Manufacture of railway locomotives and rolling stock
type: Concept
notation: 30.2
status: valid
status modified: 2013-10-18
accepted date: 2013-10-18
in scheme: Statistical Classification of Economic Activities in the European Community, Rev. 2 (2008)
scope note: Этот класс включает: - производство самолетов для перевозки грузов или пассажиров, для использования в целях обороны, спортивных или прочих целях - производство вертолетов - производство планеров, дельтапланов - производство дирижаблей и баллонов с горячим воздухом - производство комплектующих и принадлежностей для воздушных судов данного класса: • основных комплектующих, таких как, фюзеляжи, крылья, двери, рули управления/штурвалы, шасси, баки для горючего, открытые кабины самолетов и т.д. • пропеллеров, моторов вертолетов и лопастей пропеллеров • типичных моторов и двигателей для воздушных судов • комплектующих для турбореактивных и турбовинтовых воздушных судов - производство наземных летательных тренажеров - производство пусковых летательных аппаратов, искусственных спутников, планетарных зондов, орбитальных станций, челноков - производство межконтинентальных баллистических ракет Этот класс также включает: - ремонт и реконструкцию воздушных судов или двигателей для воздушных судов - производство сидений для воздушных судов Этот класс исключает: - производство парашютов, см. 13.92 - производство боеприпасов, см. 25.40 - производство телекоммуникационного оборудования для спутниковых антенн, см. 26.30 - производство инструментов для воздушных судов и аэронавигационных приборов, см. 26.51 - производство воздушных навигационных систем, см. 26.51 - производство осветительного оборудования для воздушных судов, см. 27.40 - производство замков зажигания и прочих электрических комплектующих для двигателей внутреннего сгорания, см. 27.90 - производство клапанов, поршневых колец и карбюраторов, см. 28.11 - производство пусковых устройств для воздушных судов, катапульт для воздушных судов и т.п. оборудования, см. 28.99 @ru
preferred label: Производство на локомотиви, мотриси и вагони @bg
preferred label: Výroba železničních lokomotiv a vozového parku @cs
preferred label: Fremstilling af lokomotiver og andet rullende materiel til jernbaner og sporveje @da
preferred label: Schienenfahrzeugbau @de
preferred label: Κατασκευή σιδηροδρομικών αμαξών και τροχαίου υλικού @el
preferred label: Fabricación de locomotoras y material ferroviario @es
preferred label: Raudteevedurite ja -veeremi tootmine @et
preferred label: Raideliikenteen kulkuneuvojen valmistus @fi
preferred label: Construction de locomotives et d’autre matériel ferroviaire roulant @fr
preferred label: Vasúti, kötöttpályás jármű gyártása
preferred label: Costruzione di locomotive e di materiale rotabile ferro-tranviario @it
preferred label: Geležinkelio lokomotyvų bei riedmenų gamyba @lt
preferred label: Dzelzceļa lokomotīvju un ritošā sastāva ražošana @lv
preferred label: Manifattura ta' lokomottivi tal-ferrovija u materjal ċirkulanti @mt
preferred label: Vervaardiging van rollend materieel voor spoorwegen @nl
preferred label: Produksjon av lokomotiver og annet rullende materiell til jernbane og sporvei @no
preferred label: Produkcja lokomotyw kolejowych oraz taboru szynowego @pl
preferred label: Fabricação de material circulante para caminhos-de-ferro @pt
preferred label: Fabricarea materialului rulant @ro
preferred label: Производство железнодорожных локомотивов и подвижного состава @ru
preferred label: Výroba železničných lokomotív a vozového parku @sk
preferred label: Proizvodnja železniških in drugih tirnih vozil @sl
preferred label: Tillverkning av rälsfordon @sv
preferred label: Demiryolu lokomotifleri ve vagonlarının imalatı @tr
broader: Manufacture of other transport equipment
narrower: Manufacture of railway locomotives and rolling stock

Manufacture of railway locomotives and rolling stock
type: Concept
notation: 30.20
status: valid
status modified: 2013-10-18
accepted date: 2013-10-18
in scheme: Statistical Classification of Economic Activities in the European Community, Rev. 2 (2008)
scope note: - производство на електрически, дизелови, парни и други локомотиви за релсов път - производство на самоходни вагони, платформи и фургони, превозни средства за поддържане и обслужване на релсов път - производство на несамоходни вагони за релсов път: • пътнически и товарни вагони, вагон-цистерни, саморазтоварващи се вагони, вагон-работилници, вагон-кранове, тендери и други - производство на части за локомотиви, мотриси и вагони: • талиги, оси, колела, спирачки и части за тях; куки и други системи за захващане, буфери и части за тях; амортисьори; шасита на вагони и локомотиви; рами; съединителни предпазни хармоники за вътрешна връзка между вагоните и други - производство на локомотиви и вагонетки за минни или други подземни работи, вкл. изкопни машини монтирани върху вагони - производство на механични и електромеханични устройства за сигнализация, безопасност, контрол или управление на релсов път, шосейни - производство на елементи за релсов път - 24.10 - производство на сглобени неподвижни съоръжения за релсов път - 25.99 - производство на електрически двигатели - 27.11 - производство на електрически апарати за сигнализация, за безопасност, за контрол или управление на релсов път - 27.90 - производство на двигатели за локомотиви - 28.11 @bg
scope note: Z: - výrobu elektrických, dieselových, parních a jiných železničních lokomotiv - výrobu kolejových vozidel, vagonů, nákladních vozů, vozidel na údržbu nebo servis, s vlastním pohonem - výrobu železničních nebo tramvajových kolejových vozidel bez vlastního pohonu: • osobních vozů, nákladových vozů, cisternových vozů, samovykládacích vozů a vagonů, opravárenských vozů, jeřábových vozů, tendrů atd. - výrobu specializovaných dílů pro železniční nebo tramvajové kolejové lokomotivy a vozový park: • podvozků, náprav a kol, brzd a dílů brzd; háků a jiných spojovacích elementů; nárazníků a jejich dílů, tlumičů nárazů; rámů vagonů a lokomotiv; karoserií; přechodů spojení atd. ZT: - výrobu lokomotiv a kolejových vozidel pro těžbu a dobývání - výrobu mechanických a elektromechanických signalizačních, bezpečnostních, kontrolních a řídicích zařízení pro železniční, tramvajovou, říční, silniční dopravu, pro parkovací zařízení, letiště atd. - výrobu sedadel pro kolejová vozidla - průmyslovou přestavbu a generální opravy lokomotiv a kolejových vozidel N: - výrobu nesmontovaných kolejí (24.10) - výrobu montovaných materiálů pro železniční svršky (25.99) - výrobu elektromotorů (27.11) - výrobu elektrických signalizačních, bezpečnostních, kontrolních a řídicích přístrojů a zařízení (27.90) - výrobu spalovacích motorů a turbín (28.11) - opravy a údržbu lokomotiv a kolejových vozidel (33.17) @cs
scope note: Diese Klasse umfasst: - Herstellung von Schienenfahrzeugen, die elektrisch, mit Dieselkraftstoff, Dampf oder anderweitig betrieben werden - Herstellung von anderen Schienenfahrzeugen mit Eigenantrieb: Triebwagen, Straßenbahnen, Güterwagen, Schienenfahrzeuge zur Gleisunterhaltung und andere Dienstfahrzeuge - Herstellung von Schienenfahrzeugen ohne Eigenantrieb: • Personenwagen, Güterwagen, Kesselwagen, Selbstentladewagen, Werkstattwagen, Kranwagen, Tender usw. - Herstellung von Schienenfahrzeugteilen: • Drehgestelle, Achsen und Räder, Bremsvorrichtungen und Teile davon, Zughaken und andere Kupplungsvorrichtungen, Puffer und Pufferteile, Stoßdämpfer, Untergestelle, Aufbauten, Übergänge usw. Diese Klasse umfasst ferner: - Herstellung von Schienenfahrzeugen für den Einsatz im Bergbau - Herstellung von mechanischen und elektromechanischen Signal-, Sicherungs-, Überwachungs- und Steuergeräte für Schienenwege oder dergleichen, Binnenwasserstraßen, Straßen, Parkplätze oder Parkhäuser, Flughäfen usw. - Herstellung von Sitzen für Schienenfahrzeuge Diese Klasse umfasst nicht: - Herstellung von unmontierten Schienen (s. 24.10) - Herstellung von montiertem Gleismaterial (s. 25.99) - Herstellung von Elektromotoren (s. 27.11) - Herstellung von elektrischen Signal-, Sicherungs-, Überwachungs- oder Steuergeräten (s. 27.90) - Herstellung von Verbrennungsmotoren und Turbinen (s. 28.11) @de
scope note: This class includes: - manufacture of electric, diesel, steam and other rail locomotives - manufacture of self-propelled railway or tramway coaches, vans and trucks, maintenance or service vehicles - manufacture of railway or tramway rolling stock, not self-propelled: • passenger coaches, goods vans, tank wagons, self-discharging vans and wagons, workshop vans, crane vans, tenders etc. - manufacture of specialised parts of railway or tramway locomotives or of rolling stock: • bogies, axles and wheels, brakes and parts of brakes; hooks and coupling devices, buffers and buffer parts; shock absorbers; wagon and locomotive frames; bodies; corridor connections etc. This class also includes: - manufacture of mining locomotives and mining rail cars - manufacture of mechanical and electromechanical signalling, safety and traffic control equipment for railways, tramways, inland waterways, roads, parking facilities, airfields etc. - manufacture of railway car seats This class excludes: - manufacture of unassembled rails, see 24.10 - manufacture of assembled railway track fixtures, see 25.99 - manufacture of electric motors, see 27.11 - manufacture of electrical signalling, safety or traffic-control equipment, see 27.90 - manufacture of engines and turbines, see 28.11 @en
scope note: Esta clase comprende: - la construcción de locomotoras eléctricas, diésel, de vapor y de otros tipos para ferrocarril - la construcción de coches de viajeros, vagones y furgones autopropulsados para ferrocarril y tranvía, así como de vehículos autopropulsados de mantenimiento o servicios - la construcción de material rodante no autopropulsado para ferrocarril y tranvía: • coches de pasajeros, furgones de mercancías, vagones cisterna, vagones y furgones de descarga automática, así como furgones taller y furgones grúa, ténderes, etc. - la fabricación de piezas especiales para locomotoras y otro material rodante: • bogies, ejes y ruedas, frenos y sus componentes, ganchos y demás dispositivos de enganche, topes y sus componentes, amortiguadores de choque, bastidores de vagones y locomotoras, carrocerías, elementos de interconexión, etc. Esta clase comprende también: - la fabricación de locomotoras y automotores para minería - la fabricación de equipo mecánico y electromecánico de señalización, seguridad y control del tráfico para ferrocarriles, tranvías, carreteras, vías de navegación interiores, aparcamientos, aeropuertos, etc. - la fabricación de asientos para vagones ferroviarios Esta clase no comprende: - la fabricación de raíles sin ensamblar (véase 24.10) - la fabricación de piezas y accesorios ensamblados para vías de ferrocarril (véase 25.99) - la fabricación de motores eléctricos (véase 27.11) - la fabricación de aparatos eléctricos de señalización, equipos de seguridad o control de tráfico (véase 27.90) - la construcción de motores y turbinas (véase 28.11) @es
scope note: Cette classe comprend: - la fabrication de locomotives et de locotracteurs électriques, diesel, à vapeur ou autres - la fabrication d’automotrices, d’autorails, de véhicules d’entretien ou de service - la fabrication de véhicules pour voies ferrées ou similaires dépourvus d’organes moteurs: • voitures pour voyageurs, wagons pour le transport de marchandises, wagons-citernes, wagons à déchargement automatique, wagons-ateliers, wagons-grues, tenders, etc. - la fabrication de parties de véhicules pour voies ferrées ou similaires: • bogies, essieux et roues, freins et leurs parties, crochets et autres systèmes d’attelage, tampons de choc et leurs parties, amortisseurs, châssis de wagons et de locomotives, caisses, soufflets, etc. Cette classe comprend également: - la fabrication de locomotives utilisées dans les mines et de wagonnets miniers - la fabrication d’appareils mécaniques et électromécaniques de signalisation, de sécurité, de contrôle ou de commande pour voies ferrées, voies fluviales, voies routières, installations portuaires et aéroports, etc. - la fabrication de sièges de wagons Cette classe ne comprend pas: - la fabrication de rails non assemblés, voir 24.10 - la construction d’équipements de voies ferrées assemblés, voir 25.99 - la fabrication de moteurs électriques, voir 27.11 - la fabrication d’appareils électriques de signalisation, de sécurité, de contrôle ou de commande, voir 27.90 - la fabrication de moteurs et de turbines, voir 28.11 @fr
scope note: Ovaj razred uključuje: - proizvodnju električnih, dizelskih, parnih i drugih željezničkih lokomotiva - proizvodnju samohodnih željezničkih i tramvajskih vagona, prikolica i teretnih vagona, vozila za održavanje i servisiranje - proizvodnju željezničkih i tramvajskih tračničkih vagona bez vlastitog pogona: • putničkih vagona, teretnih vagona, vagona-cisterni, vagona s automatskim istovarivanjem, vagona-radionica, vagona-dizalica opskrbnih brodova itd. - proizvodnju dijelova željezničkih i tramvajskih lokomotiva i tračničkih vagona: • podvozja, osovina i kotača, kočnica i njihovih dijelova, kuka i spojnica vagona, odbojnika i njihovih dijelova; amortizera udaraca; kostura vagona i lokomotiva; trupa vagona; spojeva platformi itd. Ovaj razred također uključuje: - proizvodnju lokomotiva i tračničkih vozila za rudnike - proizvodnju mehaničke i elektromehaničke opreme za signalizaciju, opremu za sigurnost i kontrolu prometa željeznice, tramvaje, ceste, unutarnje vodene puteve, parking objekte ili zračna uzletišta itd. - proizvodnju sjedala za željeznička vozila Ovaj razred isključuje: - proizvodnju nesastavljenih tračnica, vidi 24.10 - proizvodnju sastavljenih spojnica za tračnička vozila, vidi 25.99 - proizvodnju elektromotora, vidi 27.11 - proizvodnju opreme za električnu signalizaciju, opreme za sigurnost i kontrolu prometa, vidi 27.90 - proizvodnju motora i turbina, vidi 28.11
scope note: Į šią klasę įeina: - elektrovežių, dyzelinių lokomotyvų, garvežių ir kitokių geležinkelio lokomotyvų gamyba - savaeigių geležinkelio ar tramvajaus keleivinių, bagažo ir platforminių vagonų, techninės priežiūros ar paslaugų vagonų gamyba - nesavaeigių geležinkelio ar tramvajaus riedmenų gamyba: • keleivinių vagonų, prekinių vagonų, vagonų - cisternų, savivarčių krovininių vagonėlių ir vagonų, vagonų - dirbtuvių, vagonų - kranų, tenderių ir kt. - geležinkelio ar tramvajaus lokomotyvų ar riedmenų specialiųjų dalių gamyba: • dviašių vežimėlių, ašių ir ratų, stabdžių ir jų dalių; kablių ir kitų sukabinimo įtaisų, buferių ir jų dalių, amortizatorių; vagonų ir lokomotyvų rėmų, kėbulų, koridorių jungčių ir kt. Į šią klasę taip pat įeina: - kasybos lokomotyvų ir kasybos bėginių vežimėlių gamyba - geležinkelių, tramvajų, vidaus vandens kelių, kelių, stovėjimo aikštelių, aerodromų ir kt. mechaninės ir elektromechaninės signalizacijos, saugumo ir eismo valdymo įrangos gamyba - geležinkelio vagonų sėdynių gamyba Į šią klasę neįeina: - nesumontuotų bėgių gamyba, žr. 24.10 - surenkamų geležinkelio kelio tvirtinimo detalių gamyba, žr. 25.99 - elektros variklių gamyba, žr. 27.11 - elektrinio signalizavimo, saugos ar eismo valdymo įrangos gamyba, žr. 27.90 - variklių ir turbinų gamyba, žr. 28.11 @lt
scope note: Bu sınıf aşağıdakileri kapsamaktadır; - elektrikli, dizel, buharlı ve diğer demiryolu lokomotiflerinin imalatı - kendinden tahrikli demiryolu araçları veya tramvaylar ile bakım veya hizmet araçlarının imalatı - kendinden tahrikli olmayan demiryolu ve tramvay vagonlarının imalatı • yolcu vagonları, yük vagonları, tank vagonları, kendinden boşaltma tertibatlı vagonlar, atölye vagonları, vinç vagonları, tender (lokomotife bağlı kömür ve su taşıyan vagon) vb. - demiryolu veya tramvay lokomotiflerinin veya vagonlarının özel parçalarının imalatı: • alt düzenler, dingiller ve tekerler, frenler ve fren parçaları; kancalar ve bağlama tertibatları, tamponlar ve tampon parçaları; amortisörler; vagon ve lokomotif iskeletleri; karoserleri; koridor bağlantıları vb. Ayrıca bu sınıf aşağıdakileri de kapsamaktadır; - madencilikte kullanılan lokomotiflerin ve vagonların imalatı - demiryolları, tramvay hatları, iç su yolları, karayolları, park tesisleri, hava alanları vb. için mekanik ve elektro mekanik sinyalizasyon, güvenlik ve trafik kontrol donanımlarının imalatı, - raylı sistem taşıtları için koltuk imalatı. Kapsam dışı olanlar; - birleştirilmemiş rayların imalatı, bkz. 24.10, - monte edilmiş demiryolu hatlarına ait tertibatların imalatı, bkz. 25.99, - elektrik motorları imalatı, bkz. 27.11, - elektrikli sinyalizasyon, güvenlik veya trafik kontrol donanımlarının imalatı, bkz. 27.90, - motorların ve türbinlerin imalatı, bkz. 28.11. @tr
preferred label: Производство на локомотиви, мотриси и вагони @bg
preferred label: Výroba železničních lokomotiv a vozového parku @cs
preferred label: Fremstilling af lokomotiver og andet rullende materiel til jernbaner og sporveje @da
preferred label: Schienenfahrzeugbau @de
preferred label: Κατασκευή σιδηροδρομικών αμαξών και τροχαίου υλικού @el
preferred label: Fabricación de locomotoras y material ferroviario @es
preferred label: Raudteevedurite ja -veeremi tootmine @et
preferred label: Raideliikenteen kulkuneuvojen valmistus @fi
preferred label: Construction de locomotives et d’autre matériel ferroviaire roulant @fr
preferred label: Vasúti, kötöttpályás jármű gyártása
preferred label: Costruzione di locomotive e di materiale rotabile ferro-tranviario @it
preferred label: Geležinkelio lokomotyvų bei riedmenų gamyba @lt
preferred label: Dzelzceļa lokomotīvju un ritošā sastāva ražošana @lv
preferred label: Manifattura ta' lokomottivi tal-ferrovija u materjal ċirkulanti @mt
preferred label: Vervaardiging van rollend materieel voor spoorwegen @nl
preferred label: Produksjon av lokomotiver og annet rullende materiell til jernbane og sporvei @no
preferred label: Produkcja lokomotyw kolejowych oraz taboru szynowego @pl
preferred label: Fabricação de material circulante para caminhos-de-ferro @pt
preferred label: Fabricarea materialului rulant @ro
preferred label: Производство железнодорожных локомотивов и подвижного состава @ru
preferred label: Výroba železničných lokomotív a vozového parku @sk
preferred label: Proizvodnja železniških in drugih tirnih vozil @sl
preferred label: Tillverkning av rälsfordon @sv
preferred label: Demiryolu lokomotifleri ve vagonlarının imalatı @tr
broader: Manufacture of railway locomotives and rolling stock

Manufacture of air and spacecraft and related machinery
type: Concept
notation: 30.3
status: valid
status modified: 2013-10-18
accepted date: 2013-10-18
in scheme: Statistical Classification of Economic Activities in the European Community, Rev. 2 (2008)
scope note: Этот класс включает: - производство танков - производство бронированного наземно-водного военного автотранспорта - производство прочих военных боевых автотранспортных средств Этот класс исключает: - производство оружия и боеприпасов, см. 25.40 @ru
preferred label: Производство на въздухоплавателни и космически средства и техните двигатели @bg
preferred label: Výroba letadel a kosmických lodí a souvisejících zařízení @cs
preferred label: Fremstilling af luft- og rumfartøjer o.l. @da
preferred label: Luft- und Raumfahrzeugbau @de
preferred label: Κατασκευή αεροσκαφών και διαστημοπλοίων και συναφών μηχανημάτων @el
preferred label: Construcción aeronáutica y espacial y su maquinaria @es
preferred label: Õhu- ja kosmosesõidukite jms tootmine @et
preferred label: Ilma- ja avaruusalusten ja niihin liittyvien koneiden valmistus @fi
preferred label: Construction aéronautique et spatiale @fr
preferred label: Légi-, űrjármű gyártása
preferred label: Fabbricazione di aeromobili, di veicoli spaziali e dei relativi dispositivi @it
preferred label: Orlaivių ir erdvėlaivių bei susijusios įrangos gamyba @lt
preferred label: Lidaparātu, kosmisko aparātu un to iekārtu ražošana @lv
preferred label: Manifattura ta' inġenji ta' l-ajru u ta' l-ispazju u makkinarju relatat @mt
preferred label: Vervaardiging van lucht- en ruimtevaartuigen en van toestellen in verband daarmee @nl
preferred label: Produksjon av luftfartøyer og romfartøyer og lignende utstyr @no
preferred label: Produkcja statków powietrznych, statków kosmicznych i podobnych maszyn @pl
preferred label: Fabricação de aeronaves, veículos espaciais e equipamento relacionado @pt
preferred label: Fabricarea de aeronave şi nave spaţiale @ro
preferred label: Производство воздушных и космических летательных аппаратов @ru
preferred label: Výroba lietadiel a kozmických lodí a podobných zariadení @sk
preferred label: Proizvodnja zračnih in vesoljskih plovil @sl
preferred label: Tillverkning av luftfartyg, rymdfarkoster o.d. @sv
preferred label: Hava ve uzay araçları ve ilgili makinelerin imalatı @tr
broader: Manufacture of other transport equipment
narrower: Manufacture of air and spacecraft and related machinery

Manufacture of air and spacecraft and related machinery
type: Concept
notation: 30.30
status: valid
status modified: 2013-10-18
accepted date: 2013-10-18
in scheme: Statistical Classification of Economic Activities in the European Community, Rev. 2 (2008)
scope note: - производство на самолети за превоз на товари или пътници (граждански), военни, спортни и други - производство на хеликоптери - производство на безмоторни самолети, делтапланери - производство на дирижабли и балони с топъл въздух - производство на части и принадлежности за въздухоплавателни средства: • основни елементи: корпуси, крила, врати, елерони, колесници, резервоари за гориво, кабини и други • ротори, витла и двигателни перки на витла на хеликоптери • двигатели за въздухоплавателни и космически средства • части за турбореактивни и турбовитлови двигатели - производство на наземни авиотренажори - производство на космически летателни апарати и космически ракети носители, спътници, космически изследователски сонди, орбитални станции, совалки - производство на междуконтинентални балистични ракети (ICBM) и подобни ракети - основен ремонт и възстановяване на въздухоплавателни средства и техните двигатели - производство на седалки за въздухоплавателни средства - производство на парашути - 13.92 - производство на въоръжение и боеприпаси - 25.40 - производство на далекосъобщителна техника за спътници - 26.30 - производство на уреди и апарати за въздушна или космическа навигация - 26.51 - производство на системи за въздухоплаване - 26.51 - производство на лампи и фарове за въздухоплавателни средства - 27.40 - производство на бутала, бутални пръстени и карбуратори - 28.11 - производство на апарати и устройства за изстрелване на въздухоплавателни средства, устройства за зареждане във въздуха на самолети, катапулти за самолети ракетоносци и подобни устройства - 28.99 @bg
scope note: Z: - výrobu letadel pro přepravu osob nebo nákladů, pro vojenské, sportovní a jiné účely - výrobu helikoptér - výrobu kluzáků a rogal - výrobu vzducholodí a horkovzdušných balónů - výrobu dílů a příslušenství pro letadla této třídy, např.: • trupů, křídel, dveří, sedadel, kontrolních ploch, podvozků letadel, palivových nádrží, kabin letadel atd. • vrtulí, rotorů helikoptér a hnacích rotorů lopatek • motorů a hnacích ústrojí pro letadla a kosmické lodě • dílů pro proudové a turbovrtulové motory pro letadla a kosmické lodě - výrobu pozemních letadlových trenažérů - výrobu kosmických dopravních prostředků a nosných raket, družic, meziplanetárních sond, orbitálních stanic, raketoplánů - výrobu mezikontinentálních balistických raket (ICBM) ZT: - průmyslovou přestavbu, renovace a generální opravy letadel nebo jejich motorů N: - výrobu padáků (13.92) - výrobu vojenských náloží a střeliva (25.40) - výrobu telekomunikačních přístrojů pro družice (26.30) - výrobu leteckých systémů a přístrojů (26.51) - výrobu leteckých navigačních systémů (26.51) - výrobu osvětlovacích zařízení pro letadla (27.40) - výrobu elektrických spouštěcích a jiných elektrických dílů pro spalovací motory (27.90) - výrobu pístů, pístních kroužků a karburátorů (28.11) - výrobu zařízení pro přistávání letadel a vrtulníků na lodích; katapultů a podobných zařízení (28.99) - běžné opravy a údržbu letadel a jejich motorů (33.16) @cs
scope note: Diese Klasse umfasst: - Herstellung von Luftfahrzeugen zur Beförderung von Gütern oder Personen, für militärische, sportliche und andere Zwecke - Herstellung von Hubschraubern - Herstellung von Segelflugzeugen und Hanggleitern (Flugdrachen) - Herstellung von Luftschiffen und Heißluftballons - Herstellung von Teilen und Zubehör für Luft- und Raumfahrzeuge: • Grundelemente wie Rümpfe, Tragflächen, Türen, Steuerflächen, Fahrwerke, Treibstofftanks, Abteile usw. • Propeller, Schrauben, Rotoren und Rotorblätter • Motoren und Triebwerke für Luft- und Raumfahrzeuge • Teile für Turbinenluftstrahl-Triebwerke und Turboprop-Triebwerke für Luft- und Raumfahrzeuge - Herstellung von Bodengeräten zur Flugausbildung - Herstellung von Raumfahrzeugen und ihren Abschusseinrichtungen, Satelliten, Planetensonden, Raumstationen, Raumfähren - Herstellung von interkontinentalen ballistischen Flugkörpern (ICBM) Diese Klasse umfasst ferner: - Instandhaltung, Reparatur und Umbau von Luftfahrzeugen oder Motoren und Triebwerken dafür - Herstellung von Sitzen für Luftfahrzeuge Diese Klasse umfasst nicht: - Herstellung von Fallschirmen (s. 13.92) - Herstellung von militärischen Sprengkörpern und Munition (s. 25.40) - Herstellung von Telekommunikationsgeräten für Satelliten (s. 26.30) - Herstellung von Instrumenten für Luftfahrzeuge (s. 26.51) - Herstellung von Flugnavigationssystemen (s. 26.51) - Herstellung von Lampen und Leuchten für Flugzeuge (s. 27.40) - Herstellung von elektrischen Zünd- oder Anlassvorrichtungen und anderen Elektroteilen für Verbrennungsmotoren (s. 27.90) - Herstellung von Kolben, Kolbenringe und Vergasers (s. 28.11) - Herstellung von Startvorrichtungen am Boden und auf Flugzeugträger sowie ähnliche Vorrichtungen (s. 28.99) @de
scope note: This class includes: - manufacture of airplanes for the transport of goods or passengers, for use by the defence forces, for sport or other purposes - manufacture of helicopters - manufacture of gliders, hang-gliders - manufacture of dirigibles and hot air balloons - manufacture of parts and accessories of the aircraft of this class: • major assemblies such as fuselages, wings, doors, control surfaces, landing gear, fuel tanks, nacelles etc. • airscrews, helicopter rotors and propelled rotor blades • motors and engines of a kind typically found on aircraft • parts of turbojets and turboprops for aircraft - manufacture of ground flying trainers - manufacture of spacecraft and launch vehicles, satellites, planetary probes, orbital stations, shuttles - manufacture of intercontinental ballistic missiles (ICBM) This class also includes: - overhaul and conversion of aircraft or aircraft engines - manufacture of aircraft seats This class excludes: - manufacture of parachutes, see 13.92 - manufacture of military ordinance and ammunition, see 25.40 - manufacture of telecommunication equipment for satellites, see 26.30 - manufacture of aircraft instrumentation and aeronautical instruments, see 26.51 - manufacture of air navigation systems, see 26.51 - manufacture of lighting equipment for aircraft, see 27.40 - manufacture of ignition parts and other electrical parts for internal combustion engines, see 27.90 - manufacture of pistons, piston rings and carburettors, see 28.11 - manufacture of aircraft launching gear, aircraft carrier catapults and related equipment, see 28.99 @en
scope note: Esta clase comprende: - la construcción de aeronaves para el transporte de mercancías o pasajeros o para fines militares, deportivos u otros - la construcción de helicópteros - la construcción de planeadores, alas delta - la construcción de dirigibles y globos de aire caliente - la fabricación de piezas y accesorios de aeronaves de esta clase: • elementos principales tales como fuselajes, alas, puertas, tableros de mando, trenes de aterrizaje, depósitos de combustible, góndolas, etc. • hélices de uso aeronáutico, rotores de helicópteros y palas para rotores • motores de uso aeronáutico • componentes de turborreactores y turbohélices para aeronaves - la fabricación de aparatos para prácticas de vuelo en tierra - la construcción de naves espaciales y sus vehículos de lanzamiento, satélites, sondas planetarias, estaciones orbitales, transbordadores espaciales - la fabricación de misiles balísticos intercontinentales Esta clase comprende también: - la revisión o transformación de aeronaves y motores de aeronaves - la fabricación de asientos para aeronaves Esta clase no comprende: - la fabricación de paracaídas (véase 13.92) - la fabricación de armamento y munición militar (véase 25.40) - la fabricación de equipos de telecomunicación para satélites (véase 26.30) - la fabricación de instrumentos de navegación y otros aparatos utilizados en aeronaves (véase 26.51) - la fabricación de sistemas de navegación aérea (véase 26.51) - la fabricación de dispositivos de iluminación para aeronaves (véase 27.40) - la fabricación de piezas de sistemas de encendido y otras piezas eléctricas para motores de combustión interna (véase 27.90) - la fabricación de pistones, anillos de pistón y carburadores (véase 28.11) - la fabricación de mecanismos de lanzamiento de aeronaves, catapultas de portaviones y equipos afines (véase 28.99) @es
scope note: Cette classe comprend: - la construction d’avions conçus pour le transport de marchandises ou de passagers, pour les forces militaires, pour le sport ou pour d’autres usages - la construction d’hélicoptères - la construction de planeurs et d’ailes delta - la construction de dirigeables et de ballons à air chaud - la fabrication de parties et accessoires des appareils relevant de cette classe: • grands assemblages tels que fuselages, ailes, portes, gouvernes, trains d’atterrissage, réservoirs à combustibles, nacelles, etc. • hélices, rotors et pales de rotors pour hélicoptères • moteurs des types généralement utilisés pour la propulsion des véhicules aériens • parties de turboréacteurs et de turbopropulseurs - la fabrication d’appareils au sol d’entraînement au vol - la construction de véhicules spatiaux et de leurs véhicules lanceurs, de satellites, de sondes planétaires, de stations orbitales, de navettes spatiales - la fabrication de missiles balistiques intercontinentaux Cette classe comprend également: - la révision et la conversion des aéronefs et de leurs moteurs - la fabrication de sièges d’avions Cette classe ne comprend pas: - la fabrication de parachutes, voir 13.92 - la fabrication de pièces d’artillerie et de munitions, voir 25.40 - la fabrication de matériel de télécommunications pour satellites, voir 26.30 - la fabrication d’instruments pour l’aviation et l’aéronautique, voir 26.51 - la fabrication de systèmes d’assistance à la navigation aérienne, voir 26.51 - la fabrication d’appareils d’éclairage pour avions, voir 27.40 - la fabrication de parties de systèmes d’allumage et d’autres parties électriques des moteurs à combustion interne, voir 27.90 - la fabrication de pistons, segments de piston, carburateurs, voir 28.11 - la fabrication d’appareils et de dispositifs pour le lancement de véhicules aériens, de catapultes destinées à équiper des porte-avions et de matériel similaire, voir 28.99 @fr
scope note: Ovaj razred uključuje: - proizvodnju zrakoplova za prijevoz robe i putnika za potrebe obrambenih snaga, za sport i druge svrhe - proizvodnju helikoptera - proizvodnju zračnih jedrilica i visećih jedrilica - proizvodnju dirižabla i balona - proizvodnju dijelova i pribora za zrakoplove ovog razreda: • glavnih dijelova kao što su trupovi zrakoplova, krila, vrata, kontrolne površine, uređaji za prizemljivanje, rezervoari za gorivo, pilotska kabina itd. • propelera, helikopterskih rotora i pripadajućih okretnih lopatica • vrsta motora i strojeva koje se mogu naći samo u zrakoplovima • dijelova turbomlaznih i turbopropelerskih zrakoplova - proizvodnju uređaja za obuku letenja na tlu - proizvodnju svemirskih letjelica i lansirnih rampi, satelita, međuplanetarnih sondi, orbitalnih stanica, šatlova - proizvodnju interkontinentalnih balističkih projektila. Ovaj razred također uključuje: - servisiranje i zamjenu zrakoplova i zrakoplovnih motora - proizvodnju sjedala za zrakoplove Ovaj razred isključuje: - proizvodnju padobrana, vidi 13.92 - proizvodnju uobičajenoga vojnog oružja i municije, vidi 25.40 - proizvodnju telekomunikacijske oopreme za satelite, vidi 26.30 - proizvodnju kontrolno-mjernih instrumenata za letjelice i zrakoplove, vidi 26.51 - proizvodnju sustava za zračnu navigaciju, vidi 26.51 - proizvodnju svjetlosne opreme za letjelice, vidi 27.40 - proizvodnju dijelova za paljenje i drugih električnih dijelova za motore s unutarnjim izgaranjem, vidi 27.90 - proizvodnju klipova, klipnih prstenova i karburatora, vidi 28.11 - proizvodnju uređaja za polijetanje zrakoplova, zrakoplovnih izbacivača katapulta i pripadajuće opreme, vidi 28.99
scope note: Į šią klasę įeina: - krovininių ar keleivinių lėktuvų, naudojamų gynybos, sporto ar kitokiems tikslams, gamyba - sraigtasparnių gamyba - sklandytuvų ir skraidyklių gamyba - dirižablių ir oro balionų gamyba - šios klasės orlaivių dalių ir pagalbinių reikmenų gamyba: • pagrindinių sąrankų tokių kaip liemenys, sparnai, durys, vairai, važiuoklės, degalų bakai, variklio gondolos ir kt. • propelerių, sraigtasparnių keliamųjų sraigtų, keliamųjų sraigtų menčių • variklių, skirtų orlaiviams, gamyba • orlaivių turboreaktyvinių ir turbosraigtinių variklių dalys - lakūnų treniruoklių gamyba - erdvėlaivių ir jų paleidimo įrenginių, palydovų, planetinių zondų, orbitinių stočių, daugkartinių erdvėlaivių gamyba - tarpžemyninių balistinių (ICBM) raketų gamyba Į šią klasę taip pat įeina: - orlaivių ar orlaivių variklių kapitalinis remontas ir pertvarkymas - orlaivių sėdynių gamyba Į šią klasę neįeina: - parašiutų gamyba, žr. 13.92 - artilerijos patrankų ir šaudmenų gamyba, žr. 25.40 - palydovų telekomunikacijos įrangos gamyba, žr. 26.30 - orlaiviuose naudojamų prietaisų ir oreivystės įrankių gamyba, žr. 26.51 - oro navigacijos sistemų gamyba, žr. 26.51 - orlaivių apšvietimo įrangos gamyba, žr. 27.40 - vidaus degimo variklių paleidimo ir kitų elektrinių dalių gamyba, žr. 27.90 - stūmoklių, stūmoklių žiedų ir karbiuratorių gamyba, žr. 28.11 - orlaivių paleidimo įrenginių, lėktuvnešių katapultų ir susijusios įrangos gamyba, žr. 28.99 @lt
scope note: Данная группа включает производство транспортного оборудования, не имеющего отношения к таким транспортным средствам, как рельсовый, водный, воздушный или космический транспорт, а также к автотранспортным средствам боевого и военного назначения. @ru
scope note: Bu sınıf aşağıdakileri kapsamaktadır; - yük ve yolcu taşımacılığı için, hava kuvvetleri tarafından ya da spor ve diğer amaçlar için kullanılmak üzere uçakların imalatı, - helikopter imalatı, - planörlerin, delta kanatlı planörlerin imalatı, - zeplinlerin ve sıcak hava balonlarının imalatı, - bu sınıfta yer alan hava taşıtları parçaları ve aksesuarlarının imalatı: • uçak gövdesi, kanatları, kapıları, kumanda yüzeyleri, iniş takımları, yakıt tankları, motor yerleri vb. gibi ana montaj parçaları, • pervaneler, helikopter rotorları ve pervane kanatları, • hava araçlarında bulunan çeşitli tipteki motorlar ve makineler, • hava araçları için turbo jetlerin ve pervaneli türbin motorlarının parçaları - yerde uçuş eğitimi yapmaya özgü cihazlar ve tertibatların imalatı, - uzay gemisi ve fırlatma araçları, uydular, uzay roketleri, yörünge istasyonları, uzay mekiklerinin imalatı, - kıtalararası balistik füzelerin (ICBM) imalatı. Ayrıca bu sınıf aşağıdakileri de kapsamaktadır; - hava taşıtlarının veya hava taşıtı motorlarının revizyondan geçirilmesi ve değiştirilmesi, - hava ve uzay taşıtı koltuklarının imalatı. Kapsam dışı olanlar; - paraşüt imalatı, bkz. 13.92, - askeri savaş gereçleri ve mühimmat imalatı, bkz. 25.40, - uydular için telekomünikasyon donanımlarının imalatı, bkz. 26.30, - hava taşıtları ve havacılık aletlerinin imalatı, bkz. 26.51, - hava seyrüsefer sistemlerinin imalatı, bkz. 26.51, - hava taşıtları için aydınlatma donanımları imalatı, bkz. 27.40 , - içten yanmalı motorlar için ateşleme parçalarının ve diğer elektrikli parçaların imalatı, bkz. 27.90, - pistonların, piston sekmanlarının ve karbüratörlerin imalatı, bkz. 28.11, - hava taşıtı fırlatma donanımlarının, uçak gemilerinde kullanılan katapultların (kısa mesafede uçakların havalanmasını sağlayan mekanizma) ve ilgili donanımların imalatı, bkz. 28.99. @tr
preferred label: Производство на въздухоплавателни и космически средства и техните двигатели @bg
preferred label: Výroba letadel a kosmických lodí a souvisejících zařízení @cs
preferred label: Fremstilling af luft- og rumfartøjer o.l. @da
preferred label: Luft- und Raumfahrzeugbau @de
preferred label: Κατασκευή αεροσκαφών και διαστημοπλοίων και συναφών μηχανημάτων @el
preferred label: Construcción aeronáutica y espacial y su maquinaria @es
preferred label: Õhu- ja kosmosesõidukite jms tootmine @et
preferred label: Ilma- ja avaruusalusten ja niihin liittyvien koneiden valmistus @fi
preferred label: Construction aéronautique et spatiale @fr
preferred label: Légi-, űrjármű gyártása
preferred label: Fabbricazione di aeromobili, di veicoli spaziali e dei relativi dispositivi @it
preferred label: Orlaivių ir erdvėlaivių bei susijusios įrangos gamyba @lt
preferred label: Lidaparātu, kosmisko aparātu un to iekārtu ražošana @lv
preferred label: Manifattura ta' inġenji ta' l-ajru u ta' l-ispazju u makkinarju relatat @mt
preferred label: Vervaardiging van lucht- en ruimtevaartuigen en van toestellen in verband daarmee @nl
preferred label: Produksjon av luftfartøyer og romfartøyer og lignende utstyr @no
preferred label: Produkcja statków powietrznych, statków kosmicznych i podobnych maszyn @pl
preferred label: Fabricação de aeronaves, veículos espaciais e equipamento relacionado @pt
preferred label: Fabricarea de aeronave şi nave spaţiale @ro
preferred label: Производство воздушных и космических летательных аппаратов @ru
preferred label: Výroba lietadiel a kozmických lodí a podobných zariadení @sk
preferred label: Proizvodnja zračnih in vesoljskih plovil @sl
preferred label: Tillverkning av luftfartyg, rymdfarkoster o.d. @sv
preferred label: Hava ve uzay araçları ve ilgili makinelerin imalatı @tr
broader: Manufacture of air and spacecraft and related machinery

Manufacture of military fighting vehicles
type: Concept
notation: 30.4
status: valid
status modified: 2013-10-18
accepted date: 2013-10-18
in scheme: Statistical Classification of Economic Activities in the European Community, Rev. 2 (2008)
scope note: Этот класс включает: - производство мотоциклов, мопедов и прочих подобных транспортных средств со вспомогательным двигателем - производство двигателей для мотоциклов - производство колясок для мотоциклов - производство комплектующих и аксессуаров для мотоциклов Этот класс исключает: - производство велосипедов, см. 30.92 - производство инвалидных колясок, см. 30.92 @ru
preferred label: Производство на бойни бронирани транспортни машини @bg
preferred label: Výroba vojenských bojových vozidel @cs
preferred label: Fremstilling af militære kampfartøjer @da
preferred label: Herstellung von militärischen Kampffahrzeugen @de
preferred label: Κατασκευή στρατιωτικών οχημάτων μάχης @el
preferred label: Fabricación de vehículos militares de combate @es
preferred label: Militaarveokite tootmine @et
preferred label: Taisteluajoneuvojen valmistus @fi
preferred label: Construction de véhicules militaires de combat @fr
preferred label: Katonai harcjármű gyártása
preferred label: Fabbricazione di veicoli militari da combattimento @it
preferred label: Karinių kovinių transporto priemonių gamyba @lt
preferred label: Militāro kaujas transportlīdzekļu ražošana @lv
preferred label: Manifattura ta' vetturi tal-ġlied militari @mt
preferred label: Vervaardiging van militaire gevechtsvoertuigen @nl
preferred label: Produksjon av militære stridskjøretøyer @no
preferred label: Produkcja wojskowych pojazdów bojowych @pl
preferred label: Fabricação de veículos militares de combate @pt
preferred label: Fabricarea vehiculelor militare de luptă @ro
preferred label: Производство военных боевых транспортных средств @ru
preferred label: Výroba vojenských bojových vozidiel @sk
preferred label: Proizvodnja bojnih vozil @sl
preferred label: Tillverkning av militära stridsfordon @sv
preferred label: Askeri savaş araçlarının imalatı @tr
broader: Manufacture of other transport equipment
narrower: Manufacture of military fighting vehicles

Manufacture of military fighting vehicles
type: Concept
notation: 30.40
status: valid
status modified: 2013-10-18
accepted date: 2013-10-18
in scheme: Statistical Classification of Economic Activities in the European Community, Rev. 2 (2008)
scope note: - производство на танкове - производство на бойни бронирани транспортни машини - производство на други бойни транспортни машини - производство на въоръжение и боеприпаси - 25.40 @bg
scope note: Z: - výrobu tanků - výrobu obrněných obojživelných vojenských vozidel - výrobu ostatních vojenských bojových vozidel - opravy a údržbu vojenských bojových vozidel N: - výrobu zbraní a střeliva (25.40) @cs
scope note: Diese Klasse umfasst: - Herstellung von Panzern - Herstellung gepanzerter Amphibienfahrzeuge für militärische Zwecke - Herstellung von sonstigen militärischen Kampffahrzeugen Diese Klasse umfasst nicht: - Herstellung von Waffen und Munition (s. 25.40) @de
scope note: This class includes: - manufacture of tanks - manufacture of armoured amphibious military vehicles - manufacture of other military fighting vehicles This class excludes: - manufacture of weapons and ammunitions, see 25.40 @en
scope note: Esta clase comprende: - la fabricación de carros de combate - la fabricación de vehículos militares anfibios blindados - la fabricación de otros vehículos militares de combate Esta clase no comprende: - la fabricación de armas y munición (véase 25.40) @es
scope note: Cette classe comprend: - la fabrication de chars - la fabrication de véhicules amphibies blindés de l’armée - la construction d’autres véhicules militaires de combat Cette classe ne comprend pas: - la fabrication d’armes et de munitions, voir 25.40 @fr
scope note: Ovaj razred uključuje: - proizvodnju tenkova - proizvodnju oružanih vojnih amfibijskih vozila - proizvodnju ostalih vojnih borbenih vozila Ovaj razred isključuje: - proizvodnju oružja i municije, vidi 25.40
scope note: Į šią klasę įeina: - tankų gamyba - ginkluotų amfibinių karinių transporto priemonių gamyba - kitų karinių kovinių transporto priemonių gamyba Į šią klasę neįeina: - ginklų ir šaudmenų gamyba, žr. 25.40 @lt
scope note: Этот класс включает: - производство не моторизированных велосипедов и прочих подобных транспортных средств, включая трехколесные велосипеды, тандемы, детские велосипеды и трехколесные велосипеды - производство комплектующих и аксессуаров для велосипедов - производство инвалидных колясок с мотором или без - производство комплектующих и аксессуаров для инвалидных колясок - производство детских колясок Этот класс исключает: - - производство велосипедов со вспомогательным мотором, см. 30.91 - производство колесных игрушек, предназначенных для катания на них, включая пластиковые велосипеды и трехколесные велосипеды, см. 32.40 @ru
scope note: Bu sınıf aşağıdakileri kapsamaktadır; - tankların imalatı, - zırhlı amfibi (hem suda hem de karada hareket edebilen) askeri araçların imalatı, - diğer askeri savaş araçlarının imalatı. Kapsam dışı olanlar; - silah ve mühimmatın imalatı, bkz. 25.40. @tr
preferred label: Производство на бойни бронирани транспортни машини @bg
preferred label: Výroba vojenských bojových vozidel @cs
preferred label: Fremstilling af militære kampfartøjer @da
preferred label: Herstellung von militärischen Kampffahrzeugen @de
preferred label: Κατασκευή στρατιωτικών οχημάτων μάχης @el
preferred label: Fabricación de vehículos militares de combate @es
preferred label: Militaarveokite tootmine @et
preferred label: Taisteluajoneuvojen valmistus @fi
preferred label: Construction de véhicules militaires de combat @fr
preferred label: Katonai harcjármű gyártása
preferred label: Fabbricazione di veicoli militari da combattimento @it
preferred label: Karinių kovinių transporto priemonių gamyba @lt
preferred label: Militāro kaujas transportlīdzekļu ražošana @lv
preferred label: Manifattura ta' vetturi tal-ġlied militari @mt
preferred label: Vervaardiging van militaire gevechtsvoertuigen @nl
preferred label: Produksjon av militære stridskjøretøyer @no
preferred label: Produkcja wojskowych pojazdów bojowych @pl
preferred label: Fabricação de veículos militares de combate @pt
preferred label: Fabricarea vehiculelor militare de luptă @ro
preferred label: Производство военных боевых транспортных средств @ru
preferred label: Výroba vojenských bojových vozidiel @sk
preferred label: Proizvodnja bojnih vozil @sl
preferred label: Tillverkning av militära stridsfordon @sv
preferred label: Askeri savaş araçlarının imalatı @tr
broader: Manufacture of military fighting vehicles

Manufacture of transport equipment n.e.c.
type: Concept
notation: 30.9
status: valid
status modified: 2013-10-18
accepted date: 2013-10-18
in scheme: Statistical Classification of Economic Activities in the European Community, Rev. 2 (2008)
scope note: Tato skupina zahrnuje výrobu ostatních dopravních prostředků, kromě motorových vozidel a železničních, vodních, leteckých nebo kosmických dopravních prostředků a vojenských vozidel. @cs
scope note: Diese Gruppe umfasst die Herstellung von Fahrzeugen, mit Ausnahme von Kraftwagen, Schienen-, Wasser-, Luft- oder Raumfahrzeugen sowie militärischen Fahrzeugen. @de
scope note: This group includes the manufacture of transport equipment other than motor vehicles and rail, water, air or space transport equipment and military vehicles. @en
scope note: Este grupo comprende la fabricación de material de transporte distinto de los vehículos de motor, los equipos de transporte ferroviario, por agua, aéreo o espacial y los vehículos militares. @es
scope note: Ce groupe comprend la fabrication de matériel de transport autre que véhicules automobiles, de transport ferroviaire ou par voies navigables, de moyens de transport aérien ou spatial et de véhicules militaires. @fr
scope note: Ova skupina uključuje proizvodnju prijevoznih sredstava, osim motornih vozila i željeznice, vodenih, zračnih i svemirskih prijevoznih sredstava i vojnih vozila.
scope note: Į šią grupę įeina kitos transporto įrangos nei variklinės transporto priemonės, geležinkelio transporto priemonės, vandens, oro ar kosminės erdvės transporto priemonės bei karinės transporto priemonės gamyba. @lt
scope note: Этот класс включает: - производство транспортных средств с ручным управлением: багажных грузовых средств, ручных тележек, саней, тележек для покупок в универсамах и т.д. - производство транспортных средств, управляемых животными: одноместных двуколок, повозок, катафалков и т.д. Этот класс исключает: - подъемные тягачи, снабженные или нет подъемным или ручным оборудованием, самодвижущиеся или нет, используемые в производстве (включая ручные тележки и тачки), см. 28.22 - декоративные ресторанные тележки, такие как, мобильные десертные столики, тележки для подачи готовых блюд, см. 31.01 @ru
scope note: Bu grup motorlu kara taşıtları ve demiryolu, su, hava veya uzay taşımacılığında kullanılan araçlar ile askeri araçlar dışındaki taşımacılıkta kullanılan diğer taşıtların imalatını kapsamaktadır. @tr
preferred label: Производство на други превозни средства @bg
preferred label: Výroba dopravních prostředků a zařízení j. n. @cs
preferred label: Fremstilling af transportmidler i.a.n. @da
preferred label: Herstellung von Fahrzeugen a. n. g. @de
preferred label: Κατασκευή εξοπλισμού μεταφορών π.δ.κ.α. @el
preferred label: Fabricación de material de transporte n.c.o.p. @es
preferred label: Mujal liigitamata transpordivahendite tootmine @et
preferred label: Muualla luokittelematon kulkuneuvojen valmistus @fi
preferred label: Fabrication de matériels de transport n.c.a. @fr
preferred label: Egyéb jármű gyártása
preferred label: Fabbricazione di mezzi di trasporto n.c.a. @it
preferred label: Niekur kitur nepriskirtų transporto priemonių gamyba @lt
preferred label: Pārējo transportlīdzekļu ražošana @lv
preferred label: Manifattura ta' tagħmir għat-trasport n.e.c. @mt
preferred label: Vervaardiging van transportmiddelen, n.e.g. @nl
preferred label: Produksjon av transportmidler ikke nevnt annet sted @no
preferred label: Produkcja sprzętu transportowego, gdzie indziej niesklasyfikowana @pl
preferred label: Fabricação de equipamento de transporte, n. e. @pt
preferred label: Fabricarea altor echipamente de transport n.c.a. @ro
preferred label: Производство транспортного оборудования, не включенного в другие категории @ru
preferred label: Výroba dopravných prostriedkov i. n. @sk
preferred label: Proizvodnja drugih vozil @sl
preferred label: Övrig tillverkning av transportmedel @sv
preferred label: Başka yerde sınıflandırılmamış ulaşım araçlarının imalatı @tr
broader: Manufacture of other transport equipment
narrower: Manufacture of motorcycles
narrower: Manufacture of bicycles and invalid carriages
narrower: Manufacture of other transport equipment n.e.c.

Manufacture of motorcycles
type: Concept
notation: 30.91
status: valid
status modified: 2013-10-18
accepted date: 2013-10-18
in scheme: Statistical Classification of Economic Activities in the European Community, Rev. 2 (2008)
scope note: - производство на мотоциклети, мотопеди и велосипеди със спомагателен двигател - производство на двигатели за мотоциклети - производство на кошове за мотоциклети - производство на части и принадлежности за мотоциклети - производство на велосипеди - 30.92 - производство на инвалидни колички - 30.92 - техническо обслужване и peмонт на мотоциклети - 45.40 @bg
scope note: Z: - výrobu motocyklů, mopedů a jízdních kol vybavených přídavným motorem - výrobu motorů pro motocykly - výrobu postranních vozíků (sajdkár) - výrobu dílů a příslušenství pro motocykly N: - výrobu jízdních kol (30.92) - výrobu invalidních vozíků (30.92) @cs
scope note: Diese Klasse umfasst: - Herstellung von Krafträdern einschließlich Kleinkrafträdern und Fahrrädern mit Hilfsmotor - Herstellung von Motoren für Krafträder - Herstellung von Beiwagen - Herstellung von Teilen und Zubehör für Krafträder Diese Klasse umfasst nicht: - Herstellung von Fahrrädern (s. 30.92) - Herstellung von Rollstühlen und anderen Fahrzeugen für Kranke und Behinderte (s. 30.92) @de
scope note: This class includes: - manufacture of motorcycles, mopeds and cycles fitted with an auxiliary engine - manufacture of engines for motorcycles - manufacture of sidecars - manufacture of parts and accessories for motorcycles This class excludes: - manufacture of bicycles, see 30.92 - manufacture of invalid carriages, see 30.92 @en
scope note: Esta clase comprende: - la fabricación de motocicletas, ciclomotores y vehículos similares equipados con motor - la fabricación de motores para motocicletas - la fabricación de sidecares - la fabricación de piezas y accesorios de motocicletas Esta clase no comprende: - la fabricación de bicicletas (véase 30.92) - la fabricación de vehículos motorizados para discapacitados (véase 30.92) @es
scope note: Cette classe comprend: - la fabrication de motocycles, de cyclomoteurs et de cycles équipés d’un moteur auxiliaire - la fabrication de moteurs pour motocycles - la fabrication de sidecars - la fabrication de parties et d’accessoires pour motocycles Cette classe ne comprend pas: - la fabrication de bicyclettes, voir 30.92 - la fabrication de véhicules pour invalides, voir 30.92 @fr
scope note: Ovaj razred uključuje: - proizvodnju motocikala, mopeda i bicikala opremljenih pomoćnim motorom - proizvodnju motora za motocikle - proizvodnju bočnih prikolica za motore - proizvodnju dijelova i pribora za motocikle Ovaj razred isključuje: - proizvodnju bicikla, vidi 30.92 - proizvodnju invalidskih kolica, vidi 30.92
scope note: Į šią klasę įeina: - motociklų, mopedų ir dviračių su pagalbiniais varikliais gamyba - motociklų variklių gamyba - motociklų priekabų gamyba - motociklų dalių ir pagalbinių reikmenų gamyba Į šią klasę neįeina: - dviračių gamyba, žr. 30.92 - invalidų vežimėlių gamyba, žr. 30.92 @lt
scope note: Данный раздел включает производство мебели и т.п. изделий из любых материалов, за исключением камня, бетона и керамики. Процессы, используемые в производстве мебели, представляют собой стандартные методы подбора материалов и сборки компонентов, включая нарезку, формовку и ламинацию. При их разработке учитывается как эстетическая сторона, так и функциональная направленность, что является важным аспектом производственного процесса. Некоторые из процессов, используемых в мебельном производстве подобны процессам, которые используются в прочих сегментах производства. Например, нарезка и сборка в производстве деревянных балок классифицированы в разделе 16 (Производство древесины и деревянных изделий). Однако, данный множественный процесс делится на производство деревянной мебели и производство деревянных изделий. Аналогично, при изготовлении металлической мебели используются те же технологии, что и в производстве гнутых изделий, классифицированных в разделе 25 (Производство готовых металлических изделий). Процесс изготовления пластиковой мебели схож с прочими процессами при изготовлении пластиковой продукции. Однако производство пластиковой мебели относится к специализированной деятельности. @ru
scope note: Bu sınıf aşağıdakileri kapsamaktadır; - motosiklet, moped ve motorlu bisiklet (bir yardımcı motoru bulunan bisikletler)) imalatı, - motosiklet motorlarının imalatı, - motosikletlere takılıp yanda oturmayı sağlayan sepetlerin imalatı, - motosikletler için parçalar ve aksesuarların imalatı. Kapsam dışı olanlar; - bisiklet imalatı, bkz. 30.92, - engelli araçlarının (tekerlekli sandalye vb.) imalatı, bkz. 30.92. @tr
preferred label: Производство на мотоциклети и техните двигатели @bg
preferred label: Výroba motocyklů @cs
preferred label: Fremstilling af motorcykler @da
preferred label: Herstellung von Krafträdern @de
preferred label: Κατασκευή μοτοσυκλετών @el
preferred label: Fabricación de motocicletas @es
preferred label: Mootorrataste tootmine @et
preferred label: Moottoripyörien valmistus @fi
preferred label: Fabrication de motocycles @fr
preferred label: Motorkerékpár gyártása
preferred label: Fabbricazione di motocicli @it
preferred label: Motociklų gamyba @lt
preferred label: Motociklu ražošana @lv
preferred label: Manifattura ta' muturi @mt
preferred label: Vervaardiging van motorfietsen @nl
preferred label: Produksjon av motorsykler @no
preferred label: Produkcja motocykli @pl
preferred label: Fabricação de motociclos @pt
preferred label: Fabricarea de motociclete @ro
preferred label: Производство мотоциклов @ru
preferred label: Výroba motocyklov @sk
preferred label: Proizvodnja motornih koles @sl
preferred label: Tillverkning av motorcyklar @sv
preferred label: Motosiklet imalatı @tr
broader: Manufacture of transport equipment n.e.c.

Manufacture of bicycles and invalid carriages
type: Concept
notation: 30.92
status: valid
status modified: 2013-10-18
accepted date: 2013-10-18
in scheme: Statistical Classification of Economic Activities in the European Community, Rev. 2 (2008)
scope note: - производство на велосипеди, вкл. триколесни велосипеди за доставка на стоки, тандеми, детски велосипеди с две или три колела (метални), без двигател - производство на части и принадлежности за велосипеди - производство на инвалидни колички със или без двигател - производство на части и принадлежности за инвалидни колички - производство на бебешки и детски колички и части за тях - производство на велосипеди със спомагателен двигател - 30.91 - производство на играчки на колела, управлявани от деца, вкл. пластмасови детски велосипеди с две или три колела - 32.40 - ремонт на велосипеди - 95.29 @bg
scope note: Z: - výrobu nemotorizovaných jízdních kol a ostatních kol, včetně trojkolek (také pro přepravu), tandemů, dětských kovových jízdních kol a tříkolek - výrobu dílů a příslušenství pro jízdní kola - výrobu invalidních vozíků s nebo bez motoru - výrobu dílů a příslušenství invalidních vozíků - výrobu dětských kočárků N: - výrobu jízdních kol vybavených přídavným motorem (30.91) - výrobu her a hraček, včetně jízdních kol a tříkolek z plastů (32.40) @cs
scope note: Diese Klasse umfasst: - Herstellung von Fahrrädern und anderen Rädern ohne Motor, einschließlich Dreirädern (auch für Transporte), Tandems, Kinderfahrrädern und -dreirädern - Herstellung von Teilen und Zubehör für Fahrräder - Herstellung von Rollstühlen und anderen Fahrzeugen - Herstellung von Teilen und Zubehör für diese Fahrzeuge - Herstellung von Kinderwagen Diese Klasse umfasst nicht: - Herstellung von Fahrrädern mit Hilfsmotor (s. 30.91) - Herstellung von Spielfahrzeugen, einschließlich Fahrrädern und Dreirädern aus Kunststoff (s. 32.40) @de
scope note: This class includes: - manufacture of non-motorised bicycles and other cycles, including (delivery) tricycles, tandems, children's bicycles and tricycles - manufacture of parts and accessories of bicycles - manufacture of invalid carriages with or without motor - manufacture of parts and accessories of invalid carriages - manufacture of baby carriages This class excludes: - manufacture of bicycles with auxiliary motor, see 30.91 - manufacture of wheeled toys designed to be ridden, including plastic bicycles and tricycles, see 32.40 @en
scope note: Esta clase comprende: - la fabricación de bicicletas no motorizadas y de vehículos similares, incluidos triciclos (de reparto), tándems, y bicicletas y triciclos para niños - la fabricación de piezas y accesorios de bicicletas - la fabricación de vehículos, con o sin motor, para discapacitados - la fabricación de piezas y accesorios de vehículos para discapacitados - la fabricación de carritos para niños Esta clase no comprende: - la fabricación de bicicletas con motor auxiliar (véase 30.91) - la fabricación de juguetes con ruedas diseñados para montar en ellos, incluidas bicicletas y triciclos de plástico (véase 32.40) @es
scope note: Cette classe comprend: - la fabrication de bicyclettes et autres cycles (y compris les triporteurs), sans moteur, de tandems, bicyclettes et tricycles d’enfants - la fabrication de parties et d’accessoires de bicyclettes - la fabrication de véhicules pour invalides, avec ou sans moteur - la fabrication de parties et d’accessoires de véhicules pour invalides - la fabrication de landaus et de poussettes Cette classe ne comprend pas: - la fabrication de cycles équipés d’un moteur auxiliaire, voir 30.91 - la fabrication de jouets à roues conçus pour être montés par les enfants, y compris les bicyclettes et tricycles en plastique, voir 32.40 @fr
scope note: Ovaj razred uključuje: - proizvodnju nemotoriziranih bicikla i ostalih bicikla, uključujući tricikle s ugrađenom kutijom za transport robe (npr. prodaja peciva i sl.), dvocikle, dječje bicikle, tricikle - proizvodnju dijelova i pribora za bicikle - proizvodnju invalidskih kolica sa ili bez motora - proizvodnju dijelova i pribora za invalidska kolica - proizvodnju dječjih kolica Ovaj razred isključuje: - proizvodnju bicikala s pomoćnim motorom, vidi 30.91 - proizvodnju igračaka na kotače namijenjenih vožnji, uključujući plastične bicikle i tricikle, vidi 32.40
scope note: Į šią klasę įeina: - bevariklių ir kitų dviračių, įskaitant triračius (prekių išvežiojimo), dviviečius dviračius, vaikų dviračius ir triračius, gamyba - dviračių dalių ir pagalbinių reikmenų gamyba - invalidų vežimėlių su varikliu ar be variklio gamyba - invalidų vežimėlių dalių ir pagalbinių reikmenų gamyba - vaikų vežimėlių gamyba Į šią klasę įeina: - bevariklių ir kitų dviračių, įskaitant triračius (prekių išvežiojimo), dviviečius dviračius, vaikų dviračius ir triračius, gamyba - dviračių dalių ir pagalbinių reikmenų gamyba - invalidų vežimėlių su varikliu ar be variklio gamyba - invalidų vežimėlių dalių ir pagalbinių reikmenų gamyba - vaikų vežimėlių gamyba @lt
scope note: Bu sınıf aşağıdakileri kapsamaktadır; - motorsuz bisiklet ve diğer bisikletlerin imalatı (üç tekerlekli servis bisikletleri, iki ya da daha fazla kişilik bisikletler, çocuklar için iki ve üç tekerlekli bisikletler dahil) - bisiklet parça ve aksesuarlarının imalatı, - motorlu olsun veya olmasın engelli araçlarının imalatı, - engelli araçlarının parça ve aksesuarlarının imalatı, - bebek arabası imalatı. Kapsam dışı olanlar; - motorlu bisiklet (bir yardımcı motoru bulunan bisikletler) imalatı, bkz. 30.91, - binilmek üzere tasarlanmış tekerlekli oyuncakların imalatı (plastik iki ve üç tekerlekli bisikletler dahil), bkz. 32.40. @tr
preferred label: Производство на велосипеди и инвалидни колички @bg
preferred label: Výroba jízdních kol a vozíků pro invalidy @cs
preferred label: Fremstilling af cykler og invalidekøretøjer @da
preferred label: Herstellung von Fahrrädern sowie von Behindertenfahrzeugen @de
preferred label: Κατασκευή ποδηλάτων και αναπηρικών αμαξιδίων @el
preferred label: Fabricación de bicicletas y de vehículos para personas con discapacidad @es
preferred label: Jalgrataste ja invasõidukite tootmine @et
preferred label: Polkupyörien ja invalidiajoneuvojen valmistus @fi
preferred label: Fabrication de bicyclettes et de véhicules pour invalides @fr
preferred label: Kerékpár, mozgássérült-kocsi gyártása
preferred label: Fabbricazione di biciclette e veicoli per invalidi @it
preferred label: Dviračių ir invalidų vežimėlių gamyba @lt
preferred label: Velosipēdu un invalīdu ratiņu ražošana @lv
preferred label: Manifattura ta' roti u siġġijiet bir-roti @mt
preferred label: Vervaardiging van fietsen en invalidenwagens @nl
preferred label: Produksjon av sykler og invalidevogner @no
preferred label: Produkcja rowerów i wózków inwalidzkich @pl
preferred label: Fabricação de bicicletas e de veículos para inválidos @pt
preferred label: Fabricarea de biciclete şi de de vehicule pentru invalizi @ro
preferred label: Производство велосипедов и инвалидных колясок/кресел @ru
preferred label: Výroba bicyklov a invalidných vozíkov @sk
preferred label: Proizvodnja koles in invalidskih vozičkov @sl
preferred label: Tillverkning av cyklar och invalidfordon @sv
preferred label: Bisiklet ve engelli aracı imalatı @tr
broader: Manufacture of transport equipment n.e.c.

Manufacture of other transport equipment n.e.c.
type: Concept
notation: 30.99
status: valid
status modified: 2013-10-18
accepted date: 2013-10-18
in scheme: Statistical Classification of Economic Activities in the European Community, Rev. 2 (2008)
scope note: - производство на ръчно задвижвани превозни средства: колички за багаж, колички за пазаруване, ръчни колички, шейни за превоз - производство на превозни средства, теглени от животни: едноместни двуколки, каруци, катафалки и други - производство на кари, със или без подемно устройство, самоходни или несамоходни, използвани в заводите (вкл. колички за пазаруване и ръчни колички) - 28.22 - производство на колички за сервиране в ресторантите като колички за десерти, затворени колички за храни - 31.01 @bg
scope note: Z: - výrobu ručně tažených nebo tlačených dopravních prostředků: zavazadlové vozíky, ruční dvoukolky, sáně, nákupní vozíky atd. - výrobu dopravních prostředků tažených zvířaty: sulky, vozíky pro osly, pohřební vozy atd. N: - výrobu pracovních vozíků, také s vlastním pohonem, vybavené nebo nevybavené zdvihacím a manipulačním zařízením typu používaných v průmyslu (včetně ručních vozíků a rudlů) (28.22) - výrobu dekorativních servírovacích vozíků, např. dezertní vozíky, potravinové servírovací vozíky (31.01) @cs
scope note: Diese Klasse umfasst: - Herstellung von gezogenen oder geschobenen Fahrzeugen: Gepäckwagen, Handwagen, Schlitten, Einkaufswagen - Herstellung von Gespannfahrzeugen: Sulkies, Eselskarren, Leichenwagen usw. Diese Klasse umfasst nicht: - Kraftkarren, auch mit Eigenantrieb, Hebezeug und Fördermittel für industrielle Zwecke (einschließlich Hand- und Schubkarren) (s. 28.22) - dekorative Servierwagen für den Restaurantbedarf (s. 31.01) @de
scope note: This class includes: - manufacture of hand-propelled vehicles: luggage trucks, handcarts, sledges, shopping carts etc. - manufacture of vehicles drawn by animals: sulkies, donkey-carts, hearses etc. This class excludes: - works trucks, whether or not fitted with lifting or handling equipment, whether or not self-propelled, of the type used in factories (including hand trucks and wheelbarrows), see 28.22 - decorative restaurant carts, such as a desert cart, food wagons, see 31.01 @en
scope note: Esta clase comprende: - la fabricación de vehículos impulsados a mano: carritos para equipaje, carros de mano, trineos, carritos para supermercados, etc. - la fabricación de vehículos de tracción animal: sulkys, carretas, carruajes, etc. Esta clase no comprende: - la fabricación de carretillas, provistas o no de dispositivos de elevación o manipulación, autopropulsadas o no, del tipo utilizado en la industria (incluidas carretillas de mano) (véase 28.22) - la fabricación de carritos decorativos para restaurantes, como carritos de postres (véase 31.01) @es
scope note: Cette classe comprend: - la fabrication de véhicules propulsés à la main: chariots à bagages, charrettes à bras, traîneaux, chariots pour achats, etc. - la fabrication de véhicules à traction animale: sulkies, charrettes, corbillards, etc. Cette classe ne comprend pas: - les chariots, même automobiles, munis ou non d’un dispositif de levage ou de manutention, des types utilisés dans les usines (y compris diables et brouettes), voir 28.22 - les chariots décoratifs de restaurant, tels que chariots à dessert, à buffets, voir 31.01 @fr
scope note: Ovaj razred uključuje: - proizvodnju vozila na ručno upravljanje: putnih torba, ručnih torba, saonica, kolica za kupnju itd. - proizvodnju vozila koja vuku životinje: kočija na dva kotača (jednosjed), kočija koje vuku magarac, katafalk itd. Ovaj razred isključuje: - radne kamionete, neovisno o tome jesu li opremljeni opremom za podizanje i rukovanje, na vlastiti pogon ili ne, ona koja se koriste u tvornicama (uključujući ručna kolica i tačke), vidi 28.22 - dekorativna kolica za potrebe restorana, vidi 31.01
scope note: Į šią klasę įeina: - rankomis varomų transporto priemonių gamyba: bagažo vežimėlių, rankinių vežimėlių, rogučių, prekių vežimėlių ir kt. - gyvūnų traukiamų transporto priemonių gamyba: vienviečių dviračių vežimų, asilų traukiamų vežimėlių, katafalkų ir kt. Į šią klasę neįeina: - pramoninių savaeigių ar nesavaeigių vežimėlių su įtaisyta kėlimo ar krovimo įranga ar be jos (įskaitant rankinius ir vienračius vežimėlius) gamyba, žr. 28.22 - dekoratyvinių restoranų vežimėlių, tokių kaip desertui ar maistui vežioti, žr. 31.01 @lt
scope note: Данный класс включает производство мебели любых видов из любых материалов (за исключением камня, бетона или керамики) для любых мест и различных целей. Этот класс включает: - производство стульев и сидений для офисов, студий, гостиниц, ресторанов и общественных мест - производство стульев и сидений для театров, кинотеатров и т.п. - производство специальной мебели для магазинов: прилавков, демонстрационных шкафов, полок и т.д. - производство офисной мебели - производство лабораторных скамей, табуретов и прочих лабораторных сидений, лабораторной мебели (например, шкафов и столов) - производство мебели для церквей, школ, ресторанов Этот класс также включает: - декоративные ресторанные тележки, такие как, мобильные десертные столики, тележки для подачи готовых блюд Этот класс исключает: - изготовление школьных досок, см. 28.23 - производство сидений для автомобилей, см. 29.32 - производство сидений для железнодорожных вагонов, см. 30.20 - производство сидений для воздушных судов, см. 30.30 - производство медицинской, хирургической, стоматологической или ветеринарной мебели, см. 32.50 - модульную мебель и ее установку, частичную установку лабораторного мебельного оборудования, см. 43.32 @ru
scope note: Bu sınıf aşağıdakileri kapsamaktadır; - elle itilen araçların imalatı: bagaj arabaları, çekçek türü el arabaları, kızaklar, alışveriş arabaları vb. - hayvanlar tarafından çekilen araçların imalatı: iki tekerlekli at arabaları, eşekler tarafından çekilen arabalar, atların çektiği cenaze arabaları vb. Kapsam dışı olanlar; - fabrikalarda kullanılan türden küçük yük taşıtları (el arabaları; tek tekerlekli olan el arabaları vb. dahil) kaldırma veya taşıma sistemi olsun olmasın ya da kendinden tahrikli olsun olmasın, bkz. 28.22, - lokantalarda kullanılan dekoratif servis arabaları (tatlı servisinde kullanılan el arabaları, üzerinde yiyecek taşınan küçük el arabaları vb.), bkz. 31.01. @tr
preferred label: Производство на други превозни средства, некласифицирани другаде @bg
preferred label: Výroba ostatních dopravních prostředků a zařízení j. n. @cs
preferred label: Fremstilling af andre transportmidler i.a.n. @da
preferred label: Herstellung von sonstigen Fahrzeugen a. n. g. @de
preferred label: Κατασκευή λοιπού εξοπλισμού μεταφορών π.δ.κ.α. @el
preferred label: Fabricación de otro material de transporte n.c.o.p. @es
preferred label: Muude mujal liigitamata transpordivahendite tootmine @et
preferred label: Muiden muualla luokittelemattomien kulkuneuvojen valmistus @fi
preferred label: Fabrication d'autres équipements de transport n.c.a. @fr
preferred label: M.n.s. egyéb jármű gyártása
preferred label: Fabbricazione di altri mezzi di trasporto n.c.a. @it
preferred label: Kitos, niekur kitur nepriskirtos, transporto įrangos gamyba @lt
preferred label: Pārējo transportlīdzekļu ražošana @lv
preferred label: Manifattura ta' tagħmir ieħor għat-trasport n.e.c. @mt
preferred label: Vervaardiging van andere transportmiddelen, n.e.g. @nl
preferred label: Produksjon av andre transportmidler ikke nevnt annet sted @no
preferred label: Produkcja pozostałego sprzętu transportowego, gdzie indziej niesklasyfikowana @pl
preferred label: Fabricação de outro equipamentol de transporte, n.e. @pt
preferred label: Fabricarea altor mijloace de transport n.c.a. @ro
preferred label: Производство прочих транспортных средств и оборудования, не включенных в другие категории @ru
preferred label: Výroba ostatných dopravných prostriedkov i. n. @sk
preferred label: Proizvodnja vprežnih in drugih vozil @sl
preferred label: Övrig transportmedelstillverkning @sv
preferred label: Başka yerde sınıflandırılmamış diğer ulaşım araçlarının imalatı @tr
broader: Manufacture of transport equipment n.e.c.

Manufacture of furniture
type: Concept
notation: 31
status: valid
status modified: 2013-10-18
accepted date: 2013-10-18
in scheme: Statistical Classification of Economic Activities in the European Community, Rev. 2 (2008)
scope note: производство на мебели от всякакъв материал, без камък, бетон или керамика. В процеса на производство на мебели се използват стандартни методи за обработка на материала и сглобяване на елементите, вкл. рязане, формоване и ламиниране. Дизайнът, естетическите и функционалните качества на мебелите са от съществено значение за производствения процес. Някои от процесите, използвани при производството на мебели, са сходни с тези, използвани в други сектори на производството. Например въпреки че имаме рязане и сглобяване при производството на дървени подпори, те се класифицират в раздел 16 „Производство на дървен материал и изделия от него“. Производството на мебели от дървесина се отличава от производството на изделия от дървен материал по това, че се осъществяват много и различни процеси. По същият начин при производството на мебели от метал се използват технологии, с които си служат и при производството на валцувани продукти, които се класифицират в раздел 25 „Производство на метални изделия“. Процесът по формуване на мебели от пластмаси е сходен с този по отливане на други изделия от пластмаси. Производството на мебели от пластмаси обаче се разглежда като обособена дейност. @bg
scope note: Tento oddíl zahrnuje výrobu nábytku a příbuzných výrobků z jakéhokoliv materiálu, kromě z kamene, betonu a keramiky. Výrobní postupy používané při výrobě nábytku jsou obvyklé postupy používané při tvarování materiálu a montáži dílů, včetně řezání, formování a laminování. Důležitým aspektem výrobního procesu je design nábytku vycházející z estetických a funkčních požadavků. Některé z postupů používaných při výrobě nábytku se podobají postupům v jiných výrobních oblastech. Např. postup řezání a montáže se vyskytují také ve výrobě nosníků ze dřeva, která spadá do oddílu 16 (zpracování dřeva, výroba dřevěných výrobků, kromě nábytku), avšak výroba nábytku ze dřeva se od všeobecného zpracování dřeva odlišuje množstvím procesů. Podobné platí pro výrobu nábytku z kovů, při které se používají obdobné postupy, jako při výrobě kovodělných výrobků v oddílu 25 (výroba kovových konstrukcí a kovodělných výrobků). Výrobní proces tvarování nábytku z plastů se podobá postupu tvarování jiných výrobků z plastů, přesto je výroba nábytku z plastů v zásadě specializovanou činností zařazenou samostatně. @cs
scope note: Diese Abteilung umfasst die Herstellung von Möbeln und verwandten Erzeugnissen aus beliebigem Material, außer Stein, Beton und Keramik. Die für die Herstellung der Möbel eingesetzten Verfahren sind die üblichen Verfahren zur Formgebung und zur Verbindung von Teilen, einschließlich Schneiden, Hobeln und Laminieren. Das Design des Möbelstücks unter ästhetischen und funktionellen Gründen ist ein wichtiger Aspekt des Herstellungsverfahrens. Einige der in der Möbelherstellung genutzten Verfahren ähneln Verfahren in anderen Herstellungsbereichen. So finden sich Schneide- und Montageverfahren auch in der Herstellung von Holzträgern, die unter Abteilung 16 (Holzgewerbe (ohne Herstellung von Möbeln)) fallen. Allerdings unterscheidet sich die Herstellung von Möbeln aus Holz von der allgemeinen Holzverarbeitung durch die Vielzahl der Verfahren. Ähnliches gilt für die Herstellung von Möbeln aus Metall, in der Verfahren verwendet werden, die auch bei der Herstellung von gewalzten Erzeugnissen in Abteilung 25 (Herstellung von Metallerzeugnissen) eingesetzt werden. Das Formungsverfahren von Möbeln aus Kunststoff ähnelt dem der Formungsverfahren anderen Erzeugnisse aus Kunststoff. Dennoch ist die Herstellung von Möbeln aus Kunststoff im Allgemeinen eine spezialisierte Tätigkeit. @de
scope note: This division includes the manufacture of furniture and related products of any material except stone, concrete and ceramic. The processes used in the manufacture of furniture are standard methods of forming materials and assembling components, including cutting, moulding and laminating. The design of the article, for both aesthetic and functional qualities, is an important aspect of the production process. Some of the processes used in furniture manufacturing are similar to processes that are used in other segments of manufacturing. For example, cutting and assembly occurs in the production of wood trusses that are classified in division 16 (Manufacture of wood and wood products). However, the multiple processes distinguish wood furniture manufacturing from wood product manufacturing. Similarly, metal furniture manufacturing uses techniques that are also employed in the manufacturing of roll-formed products classified in division 25 (Manufacture of fabricated metal products). The moulding process for plastics furniture is similar to the moulding of other plastics products. However, the manufacture of plastics furniture tends to be a specialised activity. @en
scope note: Esta división comprende la fabricación de muebles y productos afines de cualquier material, excepto piedra, hormigón y cerámica. Los procesos utilizados en la fabricación de muebles son métodos estándar de elaboración de materiales y montaje de componentes, incluidos los de corte, moldeo y laminación. El diseño del artículo, para la consecución de cualidades tanto estéticas como funcionales, constituye un aspecto importante del proceso de producción. Algunos de los procesos empleados en la fabricación de muebles son similares a los utilizados en otros segmentos de la manufactura. Por ejemplo, se llevan a cabo tareas de corte y montaje en la producción de vigas trianguladas de madera, que se clasifica en la división 16 (Industria de la madera). Sin embargo, el conjunto de procesos aplicados distinguen la fabricación de muebles de madera de la de productos de la madera. Del mismo modo, en la fabricación de mobiliario metálico se utilizan técnicas empleadas igualmente en la fabricación de productos laminados clasificados en la división 25 (Fabricación de productos metálicos). El proceso de moldeo del mobiliario de material plástico es similar al que se aplica a otros productos de plástico. Sin embargo, la fabricación de este tipo de muebles tiende a ser una actividad especializada. @es
scope note: Cette division comprend la fabrication de meubles de toute nature en tout matériau sauf pierre, béton ou céramique. Les procédés de fabrication de meubles sont les méthodes normales de formage des matériaux et d’assemblage des éléments les composant, y compris la découpe, le moulage et le laminage. Le design de l’article, concernant à la fois ses caractéristiques esthétiques et fonctionnelles, constitue un aspect important du processus de production. Certains procédés de fabrication des meubles sont analogues aux procédés employés dans d’autres branches de l’activité manufacturière. Par exemple, la découpe et l’assemblage sont des opérations intervenant dans la fabrication d’armatures en bois, classée dans la division 16 (Travail du bois et fabrication d’articles en bois). C’est néanmoins la multiplicité des processus qui différencie la fabrication de meubles en bois de la fabrication d’articles en bois. De même, la fabrication de meubles en métal fait appel à des techniques qui sont également employées dans la fabrication de produits laminés, classée dans la division 25 (Travail des métaux). Le procédé de moulage de meubles en plastique est analogue au moulage d’autres articles en plastique. Néanmoins, la fabrication de meubles en plastique tend à être une activité spécialisée. @fr
scope note: Ovaj odjeljak uključuje proizvodnju namještaja i pripadajućih proizvoda od bilo kojeg materijala osim kamena, betona i keramike. Procesi koji se koriste u proizvodnji namještaja jesu standardne metode za oblikovanje materijala i spajanje komponenata, uključujući rezanje, modeliranje i lameliranje. Dizajn proizvoda te estetska i funkcionalna kvaliteta važan su aspekt proizvodnog procesa. Neki procesi koji se koriste u proizvodnji namještaja slični su procesima koji se koriste u ostalim segmentima proizvodnje. Na primjer, rezanje i sastavljanje pojavljuju se u proizvodnji drvenih greda, a razvrstavaju se u odjeljku 16 (Proizvodnja drva i proizvoda od drva). Ipak, višestruki procesi razlikuju proizvodnju drvenog namještaja i proizvodnju proizvoda od drva. Slično, proizvodnja metalnog namještaja koristi se tehnikama istovjetnima onima u proizvodnji kružno oblikovanih proizvoda klasificiranih u odjeljku 25 (Proizvodnja proizvoda od metala). Proces oblikovanja namještaja od plastike sličan je oblikovanju ostalih proizvoda od plastike. Međutim proizvodnja namještaja od plastike ima tendenciju postati specijalizirana djelatnost.
scope note: Į šį skyrių įeina baldų ir susijusių gaminių iš bet kokių medžiagų, išskyrus akmenį, betoną ir keramiką, gamyba. Baldų gamyboje naudojami procesai yra standartiniai medžiagų ir jungiamųjų komponentų formavimo metodai, įskaitant pjaustymą, liejimą ir laminavimą. Gaminio dizainas estetinės ir funkcinės kokybės požiūrių yra svarbus gamybos proceso aspektas. Kai kurie baldų gamyboje naudojami procesai yra panašūs į kitose gamybos šakose naudojamus procesus. Pavyzdžiui, medienos tašų pjovimas ir surinkimas yra klasifikuojami 16 skyriuje (Medienos ir medienos gaminių gamyba). Tačiau daugialypiai procesai atskiria medinių baldų gamybą nuo medienos gaminių gamybos. Panašiai, metalinių baldų gamyboje naudojamos technologijos taip pat taikomos valcuotų gaminių, klasifikuojamų 25 skyriuje, gamyboje (Surenkamų metalo gaminių gamyba). Plastikinių baldų liejimo procesas yra panašus į kitų plastikinių gaminių liejimą. Vis dėlto plastikinių baldų gamyba priskirtina specializuotai veiklai. @lt
scope note: Этот класс включает: - производство кухонной мебели @ru
scope note: Bu bölüm, taş, beton ve seramik dışında herhangi bir maddeden yapılan mobilya ve ilgili ürünlerin imalatını kapsar. Mobilya imalatında kullanılan yöntemler kesme, biçimlendirme ve lamine etme de dahil standart materyal biçimlendirme ve parçaları birleştirme yöntemleridir. Maddenin hem estetik hem de işlevsel niteliği göz önüne alınarak tasarlanması, üretim sürecinin önemli bir yanını oluşturur. Mobilya imalatında kullanılan bazı yöntemler, imalat sanayinin diğer bölümlerinde kullanılan işlemlerle benzerdir. Örneğin kesme ve montaj işlemleri, 16. bölümde (Ağaç ve ağaç ürünleri imalatı) sınıflandırılmış olan kereste kirişlerinin üretimi sırasında ortaya çıkmaktadır. Ancak, çoklu işlemler ahşap mobilya imalatını, ahşap ürünlerin imalatından ayırmaktadır. Benzer bir şekilde, metal mobilya imalatında, 25. bölümde (Fabrikasyon metal ürünleri imalatı) sınıflandırılan haddeleme ile biçimlendirilerek (roll-formed) üretilen ürünlerin imalatında da yer alan teknikler kullanılmaktadır. Plastik mobilyalar için kalıplama işlemi diğer plastik ürünlerin şekillendirilmesi ile benzerdir. Ancak, plastik mobilyaların imalatı uzmanlaşmış bir faaliyete dönüşmektedir. @tr
preferred label: Производство на мебели @bg
preferred label: Výroba nábytku @cs
preferred label: Fremstilling af møbler @da
preferred label: Herstellung von Möbeln @de
preferred label: Κατασκευή επίπλων @el
preferred label: Fabricación de muebles @es
preferred label: Mööblitootmine @et
preferred label: Huonekalujen valmistus @fi
preferred label: Fabrication de meubles @fr
preferred label: Bútorgyártás
preferred label: Fabbricazione di mobili @it
preferred label: Baldų gamyba @lt
preferred label: Mēbeļu ražošana @lv
preferred label: Manifattura ta' għamara @mt
preferred label: Vervaardiging van meubelen @nl
preferred label: Produksjon av møbler @no
preferred label: Produkcja mebli @pl
preferred label: Fabricação de mobiliário e de colchões @pt
preferred label: Fabricarea de mobilă @ro
preferred label: Производство мебели @ru
preferred label: Proizvodnja pohištva @sl
preferred label: Tillverkning av möbler @sv
preferred label: Mobilya imalatı @tr
broader: MANUFACTURING
narrower: Manufacture of furniture

Manufacture of furniture
type: Concept
notation: 31.0
status: valid
status modified: 2013-10-18
accepted date: 2013-10-18
in scheme: Statistical Classification of Economic Activities in the European Community, Rev. 2 (2008)
scope note: Tato skupina zahrnuje výrobu nábytku všeho druhu z jakéhokoliv materiálu (kromě z kamene, betonu nebo keramiky) pro všechny oblasti využití a pro nejrůznější účely. @cs
scope note: Этот класс включает: - производство матрасов: • матрасов с пружинами или набитых; матрасов, содержащих материалы, поддерживающие упругость • не обтянутых резиновых или пластиковых матрасов - производство подставок для матрасов Этот класс исключает: - производство надувных резиновых матрасов, см. 22.19 - производство резиновых матрасов для водяной кровати, см. 22.19 @ru
preferred label: Производство на мебели @bg
preferred label: Výroba nábytku @cs
preferred label: Fremstilling af møbler @da
preferred label: Herstellung von Möbeln @de
preferred label: Κατασκευή επίπλων @el
preferred label: Fabricación de muebles @es
preferred label: Mööblitootmine @et
preferred label: Huonekalujen valmistus @fi
preferred label: Fabrication de meubles @fr
preferred label: Bútorgyártás
preferred label: Fabbricazione di mobili @it
preferred label: Baldų gamyba @lt
preferred label: Mēbeļu ražošana @lv
preferred label: Manifattura ta' għamara @mt
preferred label: Vervaardiging van meubelen @nl
preferred label: Produksjon av møbler @no
preferred label: Produkcja mebli @pl
preferred label: Fabricação de mobiliário e de colchões @pt
preferred label: Fabricarea de mobilă @ro
preferred label: Производство мебели @ru
preferred label: Proizvodnja pohištva @sl
preferred label: Tillverkning av möbler @sv
preferred label: Mobilya imalatı @tr
broader: Manufacture of furniture
narrower: Manufacture of office and shop furniture
narrower: Manufacture of kitchen furniture
narrower: Manufacture of mattresses
narrower: Manufacture of other furniture

Manufacture of office and shop furniture
type: Concept
notation: 31.01
status: valid
status modified: 2013-10-18
accepted date: 2013-10-18
in scheme: Statistical Classification of Economic Activities in the European Community, Rev. 2 (2008)
scope note: производство на мебели от всякакъв материал (без камък, бетон или керамика) за всякакви места и с различно предназначение. - производство на столове за офиси, работни стаи (зали), хотели, ресторанти и обществени помещения - производство на столове за театрални и концертни зали, киносалони и други подобни - производство на мебели, специално предназначени за магазини: щандове, шкафове-витрини, рафтове - производство на офис мебели - производство на мебели за лаборатории - банки, табуретки и други столове, шкафове и работни маси - производство на мебели за църкви, училища, ресторанти - производство на колички за сервиране в ресторанти като колички за десерти и затворени колички за храни - производство на дъски за писане - 28.23 - производство на седалки за автомобили - 29.32 - производство на седалки за локомотиви и вагони - 30.20 - производство на седалки за въздухоплавателни средства - 30.30 - производство на мебелировка за медицински, хирургически, зъболекарски или ветеринарни кабинети и зали - 32.50 - прикрепяне и инсталиране на модули за кухненско обзавеждане, монтажни работи на прегради, инсталиране на лабораторни мебели - 43.32 @bg
scope note: Z: - výrobu židlí a jiných sedadel pro kanceláře, pracovní místnosti, hotely, restaurace a veřejné prostory - výrobu židlí a jiných sedadel pro divadla, kina a podobně - výrobu speciálního nábytku pro obchody: prodejní pulty, výstavní skříňky (vitríny), police, regály atd. - výrobu kancelářského nábytku - výrobu lavic, stoliček a jiných sedadel pro laboratoře, výrobu laboratorního nábytku (tj. skříněk s přihrádkami a stoly) - výrobu nábytku pro kostely, školy, restaurace ZT: - výrobu dekorativních servírovacích vozíků, např. dezertní vozíky, potravinové servírovací vozíky N: - výrobu školních tabulí (28.23) - výrobu sedadel pro motorová vozidla (29.32) - výrobu sedadel pro kolejová vozidla (30.20) - výrobu sedadel pro letadla (30.30) - výrobu nábytku a vybavení lékařských, chirurgických, dentálních a veterinárních pracovišť (32.50) - montáž, připevnění a instalaci nábytkových systémů, dělicích příček, laboratorního nábytku (43.32) @cs
scope note: Diese Klasse umfasst die Herstellung von Möbeln aller Arten aus beliebigem Material (außer Stein, Beton oder Keramik) für alle Einsatzbereiche und die verschiedensten Zwecke. Diese Klasse umfasst: - Herstellung von Stühlen und anderen Sitzmöbeln für Büro- und Arbeitsräume, Hotels, Restaurants und für den öffentlichen Raum - Herstellung von Stühlen und anderen Sitzmöbeln für Theater, Kinos und dergleichen - Herstellung von Ladenmöbeln: Ladentische, Schauvitrinen, Regale usw. - Herstellung von Büromöbeln - Herstellung von Sitzmöbeln aller Art für die Laborausstattung, Labormöbel (z. B. Schränke und Tische) - Herstellung von Möbeln für Kirchen, Schulen und Gaststätten Diese Klasse umfasst ferner: - dekorative Servierwagen für den Restaurantbedarf Diese Klasse umfasst nicht: - Wandtafeln (s. 28.23) - Herstellung von Sitzen für Kraftfahrzeuge (s. 29.32) - Herstellung von Sitzen für Schienenfahrzeuge (s. 30.20) - Herstellung von Sitzen für Luftfahrzeuge (s. 30.30) - Herstellung von medizinischen, zahnmedizinischen und veterinärmedizinischen Möbeln (s. 32.50) - Montage von Systemmöbeln, Montage von Trennwänden, Montage von Labormöbeln (s. 43.32) @de
scope note: This class includes the manufacture of furniture of any kind, any material (except stone, concrete or ceramic) for any place and various purposes. This class includes: - manufacture of chairs and seats for offices, workrooms, hotels, restaurants and public premises - manufacture of chairs and seats for theatres, cinemas and the like - manufacture of special furniture for shops: counters, display cases, shelves etc. - manufacture of office furniture - manufacture of laboratory benches, stools, and other laboratory seating, laboratory furniture (e.g. cabinets and tables) - manufacture of furniture for churches, schools, restaurants This class also includes: - decorative restaurant carts, such as a desert cart, food wagons This class excludes: - blackboards, see 28.23 - manufacture of car seats, see 29.32 - manufacture of railway car seats, see 30.20 - manufacture of aircraft seats, see 30.30 - manufacture of medical, surgical, dental or veterinary furniture, see 32.50 - modular furniture attachment and installation, partition installation, laboratory equipment furniture installation, see 43.32 @en
scope note: En esta clase se incluye la fabricación de muebles de todo tipo, de cualquier material (excepto piedra, hormigón y cerámica) para cualquier lugar y para diversos usos. Esta clase comprende: - la fabricación de sillas y asientos para oficinas, talleres, hoteles, restaurantes y locales públicos - la fabricación de sillas y asientos para teatros, cines y similares - la fabricación de mobiliario especial para establecimientos comerciales: mostradores, aparadores, estanterías, etc. - la fabricación de muebles de oficina - la fabricación de bancos, taburetes y otros asientos para laboratorio, mobiliario de laboratorio (p. ej., armarios y mesas) - la fabricación de muebles para iglesias, centros de enseñanza y restaurantes Esta clase comprende también: - la fabricación de carritos decorativos para restaurantes, como carritos de postres Esta clase no comprende: - pizarras (véase 28.23) - la fabricación de asientos para automóviles (véase 29.32) - la fabricación de asientos para vagones ferroviarios (véase 30.20) - la fabricación de asientos para aeronaves (véase 30.30) - la fabricación de muebles para uso médico, quirúrgico, dental o veterinario (véase 32.50) - el montaje e instalación de mobiliario modular, la instalación de tabiques, la instalación de mobiliario para equipos de laboratorio (véase 43.32) @es
scope note: Cette classe comprend la fabrication de meubles de toute nature en tout matériau (sauf pierre, béton ou céramique) pour tout lieu et pour tout usage. Cette classe comprend: - la fabrication de sièges d’ameublement, de bureau et d’atelier, d’hôtels, de restaurants et de locaux publics - la fabrication de sièges pour salles de spectacles - la fabrication de meubles spéciaux pour magasins: comptoirs, présentoirs, rayonnages, etc. - la fabrication de meubles de bureau - la fabrication de bancs et de chaises de laboratoire et d’autres sièges de laboratoires, meubles de laboratoire (par exemple: armoires et tables) - la fabrication de mobilier pour églises, écoles, restaurants Cette classe comprend également: - les chariots décoratifs de restaurant, tels que chariots à dessert, à buffets Cette classe ne comprend pas: - les tableaux noirs, voir 28.23 - la fabrication de sièges de voitures, voir 29.32 - la fabrication de sièges de wagons, voir 30.20 - la fabrication de sièges d’avions, voir 30.30 - la fabrication de mobilier pour la médecine, la chirurgie, l’art dentaire ou l’art vétérinaire, voir 32.50 - la fixation et l’installation de mobilier modulaire, l’installation de cloisons, l’installation de meubles de laboratoire, voir 43.32 @fr
scope note: Ovaj razred uključuje proizvodnju namještaja bilo koje vrste, od bilo kojeg materijala (osim kamena, betona ili keramike) za bilo koje mjesto i bilo koje svrhe. Ovaj razred uključuje: - proizvodnju stolica i sjedala za urede, radne sobe, hotele, restorane, javne i kućanske potrebe - proizvodnju stolica i sjedala za kazališta, kina i slično - proizvodnju specijalnog namještaja za prodavaonice: pultova, izložbenih ormara, polica itd. - proizvodnju uredskog namještaja - proizvodnju laboratorijskih klupa, stolica (bez naslona) i ostalih laboratorijskih sjedalica te laboratorijskog namještaja (npr. kabineta i stolova) - proizvodnju namještaja za crkve, škole, restorane Ovaj razred također uključuje: - dekorativna kolica za potrebe restorana Ovaj razred isključuje: - školske ploče, vidi 28.23 - proizvodnju sjedala za automobile, vidi 29.32 - proizvodnju sjedala za vlakove, vidi 30.20 - proizvodnju sjedala za zrakoplove, vidi 30.30 - proizvodnju medicinskog, kirurškog, zubarskog ili veterinarskog namještaja, vidi 32.50 - ugradbeni namještaj, postavljanje pomičnih pregrada, montiranje laboratorijskog namještaja, vidi 43.32
scope note: Į šią klasę įeina bet kurios rūšies baldų iš bet kurių medžiagų (išskyrus akmenį, betoną ar keramiką), naudojamų bet kurioje vietoje ir įvairios paskirties, gamyba. Į šią klasę įeina: - įstaigų, darbo kambarių, viešbučių, restoranų ir viešųjų patalpų kėdžių ir sėdynių gamyba - teatrų, kino teatrų ir kt. kėdžių ir sėdynių gamyba - parduotuvių specialiųjų baldų: prekystalių, ekspozicinių stendų, lentynų ir kt. gamyba - įstaigų baldų gamyba - laboratorijų suolų, kėdžių ir kitų sėdimųjų laboratorijų baldų, laboratorijų baldų (pvz., spintų ir stalų) gamyba - bažnyčių, mokyklų, restoranų baldų gamyba Į šią klasę taip pat įeina: - dekoratyviniai restoranų vežimėliai, tokie kaip desertui ar maistui vežioti Į šią klasę neįeina: - mokyklinės lentos, žr. 28.23 - automobilių sėdynių gamyba, žr. 29.32 - geležinkelio vagonų sėdynių gamyba, žr. 30.20 - orlaivių sėdynių gamyba, žr. 30.30 - medicininių, chirurginių, odontologinių ar veterinarinių baldų gamyba, žr. 32.50 - modulinių baldų pritvirtinimas ir įrengimas, pertvarų montavimas, laboratorijų įrangos baldų įrengimas, žr. 43.32 @lt
scope note: Этот класс включает: - производство диванов, диван-кроватей и т.п. - производство садовых стульев и сидений - производство мебели для спальни, гостиной, сада и т.д. - производство тумб для швейных машин, телевизоров и т.д. Этот класс также включает: - отделку, такую как обтяжка стульев и сидений - отделку мебели, такую как обработка, окрашивание, полировка и обтяжка Этот класс исключает: - производство подушек, пуфов, диванных подушек, стеганых и пуховых одеял, см. 13.92 - производство мебели из керамики, цемента и камня, см. 23.42, 23.69, 23.70 - производство осветительного оборудования или ламп, см. 27.40 - производство сидений для автомобилей, см. 29.32 - производство сидений для железнодорожных вагонов, см. 30.20 - производство сидений для воздушных судов, см. 30.30 - перетяжку и восстановление мебели, см. 95.24 @ru
scope note: Bu sınıf çeşitli yer ve değişik amaçlara göre, her tip ve her tür maddeden (taş, beton veya seramik hariç) mobilya imalatını kapsamaktadır. Bu sınıf aşağıdakileri kapsamaktadır; - bürolar, çalışma odaları, oteller, lokantalar ve halka açık kapalı alanlar için sandalye ve koltuk imalatı, - sinema, tiyatro ve benzerleri için sandalye ve koltuk imalatı, - dükkanlar için özel mobilya imalatı: tezgahlar, vitrinler, raflar vb. - büro mobilyası imalatı, - laboratuar sıraları, tabureleri ve diğer laboratuar oturakları, laboratuar mobilyaları (örn. dolaplar ve masalar) imalatı, - dini binalar, okullar, lokantalar için mobilya imalatı. Ayrıca bu sınıf aşağıdakileri de kapsamaktadır; - lokantalarda kullanılan dekoratif servis arabaları (tatlı servisinde kullanılan el arabaları, üzerinde yiyecek taşınan küçük el arabaları vb.). Kapsam dışı olanlar; - yazı tahtası imalatı, bkz. 28.23, - araba koltuklarının imalatı, bkz. 29.32, - raylı sistem taşıtları için (tren vb.) koltuk imalatı, bkz. 30.20, - hava ve uzay taşıtları için koltuk imalatı, bkz. 30.30. - tıbbi, cerrahi, diş hekimliği veya veterinerlikle ilgili mobilyaların imalatı, bkz. 32.50, - modüler mobilyaların birleştirilmesi ve kurulumu, parçaların bir araya getirilmesi, laboratuar ekipmanı olarak kullanılan mobilyaların kurulumu, bkz. 43.32, @tr
preferred label: Производство на мебели за офиси и магазини @bg
preferred label: Výroba kancelářského nábytku a zařízení obchodů @cs
preferred label: Fremstilling af kontor- og butiksmøbler @da
preferred label: Herstellung von Büro- und Ladenmöbeln @de
preferred label: Κατασκευή επίπλων για γραφεία και καταστήματα @el
preferred label: Fabricación de muebles de oficina y de establecimientos comerciales @es
preferred label: Kontori- ja kauplusemööbli tootmine @et
preferred label: Konttori- ja myymäläkalusteiden valmistus @fi
preferred label: Fabrication de meubles de bureau et de magasin @fr
preferred label: Irodabútor gyártása
preferred label: Fabbricazione di mobili per uffici e negozi @it
preferred label: Įstaigos ir prekybos įmonių (parduotuvių) baldų gamyba @lt
preferred label: Biroju un veikalu mēbeļu ražošana @lv
preferred label: Manifattura ta' għamara għall-uffiċċji u għall-ħwienet @mt
preferred label: Vervaardiging van kantoor- en winkelmeubelen @nl
preferred label: Produksjon av kontor- og butikkmøbler @no
preferred label: Produkcja mebli biurowych i sklepowych @pl
preferred label: Fabricação de mobiliário para escritório e comércio @pt
preferred label: Fabricarea de mobilă pentru birouri şi magazine @ro
preferred label: Производство офисной и магазинной мебели @ru
preferred label: Výroba kancelárskeho nábytku a nábytku do obchodov @sk
preferred label: Proizvodnja pohištva za poslovne in prodajne prostore @sl
preferred label: Tillverkning av kontors- och butiksmöbler samt kontors- och butiksinredningar @sv
preferred label: Büro ve mağaza mobilyaları imalatı @tr
broader: Manufacture of furniture

Manufacture of kitchen furniture
type: Concept
notation: 31.02
status: valid
status modified: 2013-10-18
accepted date: 2013-10-18
in scheme: Statistical Classification of Economic Activities in the European Community, Rev. 2 (2008)
scope note: - производство на кухненски мебели - производство на кухненски столове @bg
scope note: Z: - výrobu kuchyňského nábytku z jakéhokoliv materiálu, kromě z kamene, betonu nebo keramiky @cs
scope note: Diese Klasse umfasst: - Herstellung von Küchenmöbeln @de
scope note: This class includes: - manufacture of kitchen furniture @en
scope note: Esta clase comprende: - la fabricación de mobiliario de cocina @es
scope note: Cette classe comprend: - la fabrication de meubles de cuisine @fr
scope note: Ovaj razred uključuje: - proizvodnju kuhinjskog namještaja
scope note: Į šią klasę įeina: - virtuvės baldų gamyba @lt
scope note: Данный раздел включает производство различных товаров, не входящих в прочие части данного классификатора. Начиная с данного, оставшийся раздел включает описание производственных процессов, включая материалы и дальнейшее использование произведенных товаров, которые могут широко варьироваться, и обычные критерии для группировки классов здесь не применяются. @ru
scope note: Bu sınıf aşağıdakileri kapsamaktadır; - mutfak mobilyalarının imalatı. @tr
preferred label: Производство на кухненски мебели @bg
preferred label: Výroba kuchyňského nábytku @cs
preferred label: Fremstilling af køkkenmøbler @da
preferred label: Herstellung von Küchenmöbeln @de
preferred label: Κατασκευή επίπλων κουζίνας @el
preferred label: Fabricación de muebles de cocina @es
preferred label: Köögimööbli tootmine @et
preferred label: Keittiökalusteiden valmistus @fi
preferred label: Fabrication de meubles de cuisine @fr
preferred label: Konyhabútorgyártás
preferred label: Fabbricazione di mobili per cucina @it
preferred label: Virtuvės baldų gamyba @lt
preferred label: Virtuves mēbeļu ražošana @lv
preferred label: Manifattura ta' għamara għall-kċejjen @mt
preferred label: Vervaardiging van keukenmeubelen @nl
preferred label: Produksjon av kjøkkenmøbler @no
preferred label: Produkcja mebli kuchennych @pl
preferred label: Fabricação de mobiliário de cozinha @pt
preferred label: Fabricarea de mobilă pentru bucătării @ro
preferred label: Производство кухонной мебели @ru
preferred label: Výroba kuchynského nábytku @sk
preferred label: Proizvodnja kuhinjskega pohištva @sl
preferred label: Tillverkning av köksmöbler och köksinredningar @sv
preferred label: Mutfak mobilyalarının imalatı @tr
broader: Manufacture of furniture

Manufacture of mattresses
type: Concept
notation: 31.03
status: valid
status modified: 2013-10-18
accepted date: 2013-10-18
in scheme: Statistical Classification of Economic Activities in the European Community, Rev. 2 (2008)
scope note: - производство на матраци и дюшеци: • матраци с пружини, или тапицирани или пълнени с различни материали • необвити дюшеци от порест каучук или пластмаси - производство на пружини за легла и поставки за матраци - производство на надуваеми дюшеци от каучук - 22.19 - производство на водни матраци - 22.19 @bg
scope note: Z: - výrobu matrací: • matrace vybavené pružinami nebo plněné nebo vnitřně vybavené nosným materiálem • nepotažené matrace z lehčeného kaučuku nebo plastů - výrobu rámů (vyztužení) na matrace N: - výrobu nafukovacích pryžových matrací (22.19) - výrobu pryžových matrací do vodních postelí (22.19) @cs
scope note: Diese Klasse umfasst: - Herstellung von Matratzen: • mit Federung oder gepolstert oder mit Füllung aus Stützmaterial • nichtüberzogene Schaumstoffmatratzen auf Kautschuk- oder Gummibasis - Herstellung von Sprungrahmen Diese Klasse umfasst nicht: - Herstellung von Luftmatratzen (s. 22.19) - Herstellung von Wassermatratzen aus Gummi (s. 22.19) @de
scope note: This class includes: - manufacture of mattresses: • mattresses fitted with springs or stuffed or internally fitted with a supporting material • uncovered cellular rubber or plastic mattresses - manufacture of mattress supports This class excludes: - manufacture of inflatable rubber mattresses, see 22.19 - manufacture of rubber waterbed mattresses, see 22.19 @en
scope note: Esta clase comprende: - la fabricación de colchones: • colchones de muelles o colchones rellenos o guarnecidos interiormente de cualquier material • colchones de caucho celular sin cubrir o de materias plásticas - la fabricación de soportes para colchones Esta clase no comprende: - la fabricación de colchones de caucho inflables (véase 22.19) - la fabricación de colchones de caucho para camas de agua (véase 22.19) @es
scope note: Cette classe comprend: - la fabrication de matelas: • matelas comportant des ressorts ou bien rembourrés ou garnis intérieurement d’un matériau de soutien • matelas non recouverts en caoutchouc alvéolaire ou en matières plastiques alvéolaires - la fabrication de sommiers Cette classe ne comprend pas: - la fabrication de matelas gonflables, voir 22.19 - la fabrication de matelas à eau en caoutchouc, voir 22.19 @fr
scope note: Ovaj razred uključuje: - proizvodnju madraca: • madraca opremljenih oprugama ili punjenih ili iznutra opremljenih potpornim materijalom • nepresvučenih madraca od pjenaste gume ili plastike - proizvodnju pomoćnih strunjača Ovaj razred isključuje: - proizvodnju gumenih madraca za napuhavanje, vidi 22.19 - proizvodnju gumenih vodenih kreveta, vidi 22.19
scope note: Į šią klasę įeina: - čiužinių gamyba: • spyruoklinių ar kimštinių arba su vidiniais tvirtikliais • neaptrauktų akytosios gumos ar akytojo plastiko čiužinių - čiužinių pastovų (karkasų) gamyba Į šią klasę neįeina: - pripučiamųjų guminių čiužinių gamyba, žr. 22.19 - guminių vandens lovų čiužinių gamyba, žr. 22.19 @lt
scope note: Данная группа включает производство драгоценностей и искусственных драгоценных изделий. @ru
scope note: Bu sınıf aşağıdakileri kapsamaktadır; - yatak imalatı: • yaylı veya dolgulu yataklar ya da içten destekleyici maddelerle yapılmış yataklar, • kaplanmamış sünger veya plastikten yataklar. - yatak desteklerinin imalatı Kapsam dışı olanlar; - şişme yatak imalatı (kauçuk), bkz. 22.19, - kauçuk su yatağı imalatı , bkz. 22.19. @tr
preferred label: Производство на матраци и дюшеци @bg
preferred label: Výroba matrací @cs
preferred label: Fremstilling af madrasser @da
preferred label: Herstellung von Matratzen @de
preferred label: Κατασκευή στρωμάτων @el
preferred label: Fabricación de colchones @es
preferred label: Madratsitootmine @et
preferred label: Patjojen valmistus @fi
preferred label: Fabrication de matelas @fr
preferred label: Ágybetét gyártása
preferred label: Fabbricazione di materassi @it
preferred label: Čiužinių gamyba @lt
preferred label: Matraču ražošana @lv
preferred label: Manifattura ta' saqqijiet @mt
preferred label: Vervaardiging van matrassen @nl
preferred label: Produksjon av madrasser @no
preferred label: Produkcja materaców @pl
preferred label: Fabricação de colchoaria @pt
preferred label: Fabricarea de saltele şi somiere @ro
preferred label: Производство матрасов @ru
preferred label: Výroba matracov @sk
preferred label: Proizvodnja žimnic @sl
preferred label: Tillverkning av madrasser @sv
preferred label: Yatak imalatı @tr
broader: Manufacture of furniture

Manufacture of other furniture
type: Concept
notation: 31.09
status: valid
status modified: 2013-10-18
accepted date: 2013-10-18
in scheme: Statistical Classification of Economic Activities in the European Community, Rev. 2 (2008)
scope note: - производство на канапета, дивани и фотьойли, дори разтегателни - производство на градински столове - производство на мебели за спални, всекидневни, столови, градини и други - производство на шкафове за шевни машини, телевизионни приемници и други - довършителни работи на столове и седалки - тапициране - довършителни работи на мебели - боядисване, полиране, нанасяне на покритие чрез пулверизиране и тапициране - производство на юргани, възглавници, завивки с пълнеж от перушина или пух, спални чували - 13.92 - производство на мебели от керамика, бетон, гипс, цимент и декоративни камъни - 23.42, 23.69, 23.70 - производство на осветители - 27.40 - производство на седалки за автомобили - 29.32 - производство на седалки за локомотиви и вагони - 30.20 - производство на седалки за въздухоплавателни средства - 30.30 - претапициране и реставриране на мебели - 95.24 @bg
scope note: Z: - výrobu pohovek, gaučů a sedacích souprav - výrobu zahradních židlí a zahradního sedacího nábytku - výrobu nábytku pro ložnice, obývací pokoje, zahrady atd. - výrobu skříní na šicí stroje, televizory atd. ZT: - konečnou úpravu jako čalounění židlí a jiných sedadel - konečnou úpravu nábytku, např. stříkání, lakování, šelakovou polituru nebo potahování, čalounění N: - výrobu polštářů vč. čalouněných, prošívaných a péřových přikrývek (13.92) - výrobu nábytku z keramiky, betonu a kamene (23.42, 23.69, 23.70) - výrobu elektrických osvětlovacích zařízení (27.40) - výrobu sedadel pro motorová vozidla (29.32) - výrobu sedadel pro kolejová vozidla (30.20) - výrobu sedadel pro letadla (30.30) - přečalounění a restaurování nábytku (95.24) @cs
scope note: Diese Klasse umfasst: - Herstellung von Sofas, Bettcouches und Polstergarnituren - Herstellung von Gartenstühlen und -sitzmöbeln - Herstellung von Schlafzimmer-, Wohnzimmer- und Gartenmöbeln usw. - Herstellung von Schränken für Nähmaschinen, Fernsehgeräte usw. Diese Klasse umfasst ferner: - Veredlung, wie z. B. Bespannung und Polsterung von Stühlen und anderen Sitzmöbeln - Veredlung, wie z. B. Spritzen, Lackieren, Schellackpolitur oder Bespannen Diese Klasse umfasst nicht: - Herstellung von Kissen, Polstern, Steppdecken und Daunendecken (s. 13.92) - Herstellung von Möbeln aus Keramik, Beton und Stein (s. 23.42, 23.69, 23.70) - Herstellung von elektrischen Lampen und Leuchten (s. 27.40) - Herstellung von Sitzen für Kraftfahrzeuge (s. 29.32) - Herstellung von Sitzen für Schienenfahrzeuge (s. 30.20) - Herstellung von Sitzen für Luftfahrzeuge (s. 30.30) - Neubespannung und Restaurierung von Möbeln (s. 95.24) @de
scope note: This class includes: - manufacture of sofas, sofa beds and sofa sets - manufacture of garden chairs and seats - manufacture of furniture for bedrooms, living rooms, gardens etc. - manufacture of cabinets for sewing machines, televisions etc. This class also includes: - finishing such as upholstery of chairs and seats - finishing of furniture such as spraying, painting, French polishing and upholstering This class excludes: - manufacture of pillows, pouffes, cushions, quilts and eiderdowns, see 13.92 - manufacture of furniture of ceramics, concrete and stone, see 23.42, 23.69, 23.70 - manufacture of lighting fittings or lamps, see 27.40 - manufacture of car seats, see 29.32 - manufacture of railway car seats, see 30.20 - manufacture of aircraft seats, see 30.30 - reupholstering and restoring of furniture, see 95.24 @en
scope note: Esta clase comprende: - la fabricación de sofás, sofás cama y tresillos - la fabricación de sillas y otros asientos para jardín - la fabricación de muebles de dormitorio, salón, jardín, etc. - la fabricación de armarios para máquinas de coser, televisiones, etc. Esta clase comprende también: - los acabados de mobiliario tales como el tapizado de sillas y asientos - los acabados de muebles, como lacado, pintado, barnizado con muñequilla y tapizado Esta clase no comprende: - la fabricación de almohadas, pufes, almohadones, acolchados y edredones (véase 13.92) - la fabricación de muebles de cerámica, hormigón y piedra (véanse 23.42, 23.69 y 23.70) - la fabricación de lámparas o accesorios para la iluminación (véase 27.40) - la fabricación de asientos para automóviles (véase 29.32) - la fabricación de asientos para vagones ferroviarios (véase 30.20) - la fabricación de asientos para aeronaves (véase 30.30) - el retapizado y la restauración de muebles (véase 95.24) @es
scope note: Cette classe comprend: - la fabrication de canapés et de canapés-lits - la fabrication de sièges de jardin - la fabrication de mobilier de jardin et de meubles des types utilisés dans les chambres à coucher, les salles à manger et de séjour, etc. - la fabrication de meubles de machines à coudre, meubles-télévision, etc. Cette classe comprend également: - le finissage des sièges par des opérations telles que le rembourrage - le finissage des meubles par des opérations telles que l’aspersion, la pulvérisation, la mise en peinture, le vernissage au tampon et le rembourrage Cette classe ne comprend pas: - la fabrication d’oreillers, de poufs, de coussins, de couvre-pieds et d’édredons, voir 13.92 - la fabrication de meubles en céramique, béton et pierre, voir 23.42, 23.69 et 23.70 - la fabrication de lampes ou d’appareils d’éclairage, voir 27.40 - la fabrication de sièges de voitures, voir 29.32 - la fabrication de sièges de wagons, voir 30.20 - la fabrication de sièges d’avions, voir 30.30 - le rembourrage et la restauration de meubles, voir 95.24 @fr
scope note: Ovaj razred uključuje: - proizvodnju sofa, sofa-kreveta i sofa-sjedala - proizvodnju vrtnih stolica i sjedala - proizvodnju namještaja za spavaće sobe, sobe za dnevni boravak, vrtove itd. - proizvodnju ormarića za šivaće strojeve, televizore itd. Ovaj razred također uključuje: - dovršavanje namještaja kao što je tapeciranje stolica i sjedala - dovršavanje namještaja u obliku prskanja, bojanja, francuskog poliranja i tapeciranja Ovaj razred isključuje: - proizvodnju jastuka, jastučića, popluna i perina, vidi 13.92 - proizvodnju namještaja od keramike, betona ili kamena, vidi 23.42, 23.69, 23.70 - proizvodnju svjetiljaka i pribora za rasvjetu, vidi 27.40 - proizvodnju sjedala za automobile, vidi 29.32 - proizvodnju sjedala za vlakove, vidi 30.20 - proizvodnju sjedala za zrakoplove, vidi 30.30 - ponovno tapeciranje i restauriranje namještaja, vidi 95.24
scope note: Į šią klasę įeina: - sofų, sofų - lovų ir sofų komplektų gamyba - sodo kėdžių ir krėslų gamyba - miegamojo, svetainės, sodo ir kt. baldų gamyba - siuvimo mašinų, televizorių spintelių ir kt., gamyba Į šią klasę taip pat įeina: - kėdžių ir krėslų aptraukimas - baldų apdaila, tokia kaip purškimas, dažymas, tamponinis poliravimas ir aptraukimas Į šią klasę neįeina: - pagalvių, pampsukų (pufų), pagalvėlių, vatinių ir pūkinių antklodžių gamyba, žr. 13.92 - keraminių, betoninių ir akmeninių baldų gamyba, žr. 23.42, 23.69, 23.70 - šviestuvų ar lempų gamyba, žr. 27.40 - automobilių sėdynių gamyba, žr. 29.32 - geležinkelio vagonų sėdynių gamyba, žr. 30.20 - orlaivių sėdynių gamyba, žr. 30.30 - senų baldų aptraukimas ir restauravimas, žr. 95.24 @lt
scope note: Этот класс включает: - производство монет, включая монеты для использования в качестве законного платежного средства, из ценных или не ценных металлов @ru
scope note: Bu sınıf aşağıdakileri kapsamaktadır; - kanepe, divan, çek yat ve koltuk takımlarının imalatı, - bahçe sandalyeleri, koltukları vb. imalatı, - yatak odaları, oturma odaları, bahçeler vb. için mobilya imalatı, - dikiş makineleri, televizyonlar vb. için dolap ve sehpa imalatı. Ayrıca bu sınıf aşağıdakileri de kapsamaktadır; - sandalye ve koltukların döşenmesi gibi tamamlayıcı işlerinin yapılması, - mobilyaların püskürtme, boyama, gomalak cilalama ve döşeme gibi tamamlayıcı işlerinin yapılması. Kapsam dışı olanlar; - yastık, puf, minder, örtü ve yorganların imalatı, bkz. 13.92, - seramik, beton ve taştan mobilya imalatı, bkz. 23.42, 23.69, 23.70, - aydınlatma tesisatlarının bağlantı parçaları veya lambaların imalatı, bkz. 27.40, - araba, raylı sistem taşıtları ile hava ve uzay taşıtları için koltuk imalatı, bkz. 29.32, 30.20, 30.30, - araba koltuklarının imalatı, bkz. 29.32, - raylı sistem taşıtları için koltuk imalatı, bkz. 30.20, - hava ve uzay taşıtları için koltuk imalatı, bkz. 30.30, - mobilyaların yeniden kaplanması ve yenilenmesi, bkz. 95.24, @tr
preferred label: Производство на други мебели @bg
preferred label: Výroba ostatního nábytku @cs
preferred label: Fremstilling af andre møbler @da
preferred label: Herstellung von sonstigen Möbeln @de
preferred label: Κατασκευή άλλων επίπλων @el
preferred label: Fabricación de otros muebles @es
preferred label: Muu mööbli tootmine @et
preferred label: Muiden huonekalujen valmistus @fi
preferred label: Fabrication d'autres meubles @fr
preferred label: Egyéb bútor gyártása
preferred label: Fabbricazione di altri mobili @it
preferred label: Kitų baldų gamyba @lt
preferred label: Citu mēbeļu ražošana @lv
preferred label: Manifattura ta' għamara oħra @mt
preferred label: Vervaardiging van andere meubelen @nl
preferred label: Produksjon av møbler ellers @no
preferred label: Produkcja pozostałych mebli @pl
preferred label: Fabricação de mobiliário para outros fins @pt
preferred label: Fabricarea de mobilă n.c.a. @ro
preferred label: Производство прочей мебели @ru
preferred label: Výroba ostatného nábytku @sk
preferred label: Proizvodnja drugega pohištva @sl
preferred label: Tillverkning av andra möbler @sv
preferred label: Diğer mobilyaların imalatı @tr
broader: Manufacture of furniture

Other manufacturing
type: Concept
notation: 32
status: valid
status modified: 2013-10-18
accepted date: 2013-10-18
in scheme: Statistical Classification of Economic Activities in the European Community, Rev. 2 (2008)
scope note: Производство на разнообразни стоки, които не са обхванати от други раздели на класификацията. Тъй като това е остатъчен раздел, производствените процеси, суровините и крайната употреба на произведените продукти са многообразни. Ето защо обичайните критерии за групиране не са приложими тук. @bg
scope note: Tento oddíl zahrnuje výrobu řady výrobků, které nejsou zařazeny v jiných částech klasifikace. Jedná se zde o výrobu ostatních výrobků, proto se mohou výrobní procesy, vstupní materiály a oblasti použití výrobků značně rozcházet. Obvyklá kritéria pro zařazování do jednotlivých tříd zde nebyla použita. @cs
scope note: Diese Abteilung umfasst die Herstellung einer Reihe von Erzeugnissen, die nicht unter andere Teile der Klassifikation fallen. Da es sich hier um die Abteilung für sonstige Erzeugnisse handelt, können die Herstellungsverfahren, die Ausgangsstoffe und die Verwendung der Erzeugnisse weit auseinander gehen. Die üblichen Gliederungskriterien wurden daher nicht angewandt. @de
scope note: This division includes the manufacture of a variety of goods not covered in other parts of the classification. Since this is a residual division, production processes, input materials and use of the produced goods can vary widely and usual criteria for grouping classes into divisions have not been applied here. @en
scope note: Esta división comprende la fabricación de diversos artículos no incluidos en otras partidas de la clasificación. Puesto que se trata de una división residual, los procesos de producción, los materiales y el uso de los bienes producidos pueden variar ampliamente, y no se han aplicado aquí los criterios habituales para agrupar clases en divisiones. @es
scope note: Cette division comprend la fabrication de différents articles non classés ailleurs dans la nomenclature. Dans la mesure où il s’agit d’une division résiduelle, les processus de production, les matières de base et l’utilisation des articles produits peuvent varier considérablement et les critères usuels pour regrouper les classes en divisions n’ont pas été appliqués ici. @fr
scope note: Ovaj odjeljak uključuje proizvodnju različitih proizvoda koji nisu uključeni u ostalim dijelovima klasifikacije. Budući da je ovo rezidualni odjeljak, proizvodni procesi, ulazni materijali te upotreba proizvedenih proizvoda mogu imati vrlo širok raspon te se stoga ovdje ne primjenjuju uobičajeni kriteriji za grupiranje razreda u odjeljke.
scope note: Į šį skyrių įeina įvairių, niekur kitur neklasifikuojamų, gaminių gamyba. Kadangi tai įvairialypės veiklos skyrius, gamybos procesai, naudojamos medžiagos ir pagamintų prekių paskirtis yra labai įvairi, o įprasti klasių grupavimo į skyrius kriterijai čia netaikomi. @lt
scope note: Этот класс включает: - производство культивированного жемчуга - производство драгоценных и полудрагоценных камней в стадии обработки, включая промышленную обработку камней и синтетических и обработанных драгоценных и полудрагоценных камней - обработку бриллиантов - производство драгоценностей из драгоценных металлов и основных металлов с покрытием из драгоценных металлов, или драгоценных и полудрагоценных камней, или комбинаций из драгоценных металлов и драгоценных или полудрагоценных камней или прочих материалов - производство ювелирных изделий из драгоценных металлов или основных металлов с покрытием из ценных металлов: • столовой посуды, мелкой и плоской посуды, глубокой посуды, туалетных принадлежностей, офисных или настольных изделий, изделий для ритуального использования в религиозных службах и т.д. - производство технических и лабораторных принадлежностей из драгоценных металлов (за исключением инструментов и запасных частей): тиглей, шпателей, анодов с гальванопокрытием и т.д. - производство драгоценных металлических браслетов для наручных часов, ремешков, браслетов и портсигаров Этот класс также включает: - гравировку драгоценных персональных и не драгоценных изделий из металла Этот класс исключает: - производство неметаллических браслетов для наручных часов (например, из ткани, кожи, пластика), см. 15.12 - производство изделий из основных металлов с покрытием из ценных металлов (за исключением искусственных драгоценностей), см. раздел 25 - производство корпусов для часов, см. 26.52 - производство (неценных) металлических браслетов для наручных часов, см. 32.13 - производство искусственных драгоценностей, см. 32.13 - ремонт драгоценностей, см. 95.25 @ru
scope note: Bu bölüm, sınıflamanın diğer bölümlerinde kapsanmamış olan çeşitli malların imalatını kapsamaktadır. Bu bölüm arta kalanlardan oluşan bir bölüm olduğundan, üretim süreçleri, girdi olarak kullanılan materyaller ve üretilen malların kullanım alanları çok geniş bir aralıkta değişmektedir ve genellikle bölümleri sınıflara gruplamakta kullanılan ölçütler burada uygulanamamıştır. @tr
preferred label: Производство, некласифицирано другаде @bg
preferred label: Ostatní zpracovatelský průmysl @cs
preferred label: Anden fremstillingsvirksomhed @da
preferred label: Herstellung von sonstigen Waren @de
preferred label: Άλλες μεταποιητικές δραστηριότητες @el
preferred label: Otras industrias manufactureras @es
preferred label: Muu tootmine @et
preferred label: Muu valmistus @fi
preferred label: Autres industries manufacturières @fr
preferred label: Egyéb feldolgozóipari tevékenység
preferred label: Altre industrie manifatturiere @it
preferred label: Kita gamyba @lt
preferred label: Cita veida ražošana @lv
preferred label: Manifattura oħra @mt
preferred label: Overige industrie @nl
preferred label: Annen industriproduksjon @no
preferred label: Produkcja wyrobów, pozostała @pl
preferred label: Outras indústrias transformadoras @pt
preferred label: Alte activităţi industriale n.c.a. @ro
preferred label: Производство прочих готовых изделий @ru
preferred label: Iná výroba @sk
preferred label: Druge raznovrstne predelovalne dejavnosti @sl
preferred label: Annan tillverkning @sv
preferred label: Diğer imalatlar @tr
broader: MANUFACTURING
narrower: Manufacture of jewellery, bijouterie and related articles
narrower: Manufacture of musical instruments
narrower: Manufacture of sports goods
narrower: Manufacture of games and toys
narrower: Manufacture of medical and dental instruments and supplies
narrower: Manufacturing n.e.c.

Manufacture of jewellery, bijouterie and related articles
type: Concept
notation: 32.1
status: valid
status modified: 2013-10-18
accepted date: 2013-10-18
in scheme: Statistical Classification of Economic Activities in the European Community, Rev. 2 (2008)
scope note: Тази група включва изработване на бижутерийни и други изделия от благородни метали и скъпоценни камъни и бижута имитация. @bg
scope note: Tato skupina zahrnuje výrobu šperků, zlatnických imitací a bižuterie. @cs
scope note: Diese Gruppe umfasst die Herstellung von Schmuck und Fantasieschmuck. @de
scope note: This group includes the manufacture of jewellery and imitation jewellery articles. @en
scope note: Este grupo comprende la fabricación de artículos de joyería y de bisutería. @es
scope note: Ce groupe comprend les activités de bijouterie, joaillerie, orfèvrerie et la fabrication de bijouterie fantaisie. @fr
scope note: Ova skupina uključuje proizvodnju nakita i bižuterije.
scope note: Į šią grupę įeina juvelyrinių ir dirbtinės bižuterijos dirbinių bei gaminių gamyba. @lt
scope note: Этот класс включает: - производство комплектов или искусственных драгоценностей: • колец, браслетов, цепочек, ожерелий и подобных изделий и драгоценностей из основных металлов с покрытием из ценных металлов • ювелирных изделий, содержащих искусственные камни, такие как, искусственные драгоценные камни, искусственные бриллианты и т.п. - производство металлических браслетов для наручных часов (за исключением ценных металлов) Этот класс исключает: - производство ювелирных изделий из драгоценных металлов или с покрытием из ценных металлов, см. 32.12 - производство драгоценностей, содержащих настоящие драгоценные камни, см. 32.12 - производство ценных металлических браслетов для наручных часов, см. 32.12 @ru
scope note: Bu grup mücevherat ile imitasyon (taklit süs eşyalarının) takıların imalatını kapsamaktadır. @tr
preferred label: Производство на бижута и подобни изделия @bg
preferred label: Výroba klenotů, bižuterie a příbuzných výrobků @cs
preferred label: Fremstilling af smykker, bijouteri, mønter og lignende varer @da
preferred label: Herstellung von Münzen, Schmuck und ähnlichen Erzeugnissen @de
preferred label: Κατασκευή κοσμημάτων, πολύτιμων αντικειμένων και συναφών ειδών @el
preferred label: Fabricación de artículos de joyería, bisutería y similares @es
preferred label: Väärisesemete, ehete jms toodete tootmine @et
preferred label: Korujen, kultasepäntuotteiden ja muiden vastaavien tuotteiden valmistus @fi
preferred label: Fabrication d'articles de joaillerie, bijouterie et articles similaires @fr
preferred label: Ékszergyártás
preferred label: Fabbricazione di gioielleria, bigiotteria e articoli connessi @it
preferred label: Papuošalų, juvelyrinių, bižuterijos ir panašių dirbinių gamyba @lt
preferred label: Juvelierizstrādājumu, bižutērijas un līdzīgu izstrādājumu ražošana @lv
preferred label: Manifattura ta' ġojjellerija, biġotterija u oġġetti relatati @mt
preferred label: Bewerken van edelstenen en vervaardiging van sieraden en dergelijke artikelen @nl
preferred label: Produksjon av gull- og sølvvarer, bijouteri og lignende artikler @no
preferred label: Produkcja wyrobów jubilerskich, biżuterii i podobnych wyrobów @pl
preferred label: Fabricação de joalharia, ourivesaria, bijutaria e artigos similares @pt
preferred label: Fabricarea bijuteriilor, imitaţiilor de bijuterii şi articolelor similare @ro
preferred label: Производство ювелирных изделий, бижутерии и аналогичных изделий @ru
preferred label: Výroba šperkov, bižutérie a podobných predmetov @sk
preferred label: Proizvodnja nakita, bižuterije in podobnih izdelkov @sl
preferred label: Tillverkning av smycken, guld- och silversmedsvaror samt bijouterier @sv
preferred label: Mücevherat, bijuteri eşyaları ve ilgili ürünlerin imalatı @tr
broader: Other manufacturing
narrower: Striking of coins
narrower: Manufacture of jewellery and related articles
narrower: Manufacture of imitation jewellery and related articles

Striking of coins
type: Concept
notation: 32.11
status: valid
status modified: 2013-10-18
accepted date: 2013-10-18
in scheme: Statistical Classification of Economic Activities in the European Community, Rev. 2 (2008)
scope note: - сечене на монети, вкл. като платежно средство, независимо дали са от благородни метали @bg
scope note: Z: - výrobu mincí včetně mincí používaných jako zákonné platidlo z drahých a jiných kovů @cs
scope note: Diese Klasse umfasst: - Herstellung von Münzen einschließlich Münzen zur Verwendung als gesetzliche Zahlungsmittel auch aus Edelmetallen @de
scope note: This class includes: - manufacture of coins, including coins for use as legal tender, whether or not of precious metal @en
scope note: Esta clase comprende: - la fabricación de monedas, incluida las de curso legal, de metales preciosos o no preciosos @es
scope note: Cette classe comprend: - la fabrication de monnaies, y compris celles ayant cours légal, en métaux précieux ou non @fr
scope note: Ovaj razred uključuje: - proizvodnju kovanog novca, uključujući onaj koji je zakonsko sredstvo plaćanja bez obzira na to je li od plemenitog metala ili ne
scope note: Į šią klasę įeina: - tauriųjų ar netauriųjų metalų monetų, įskaitant įteisintas mokėjimo monetas, gamyba @lt
scope note: Bu sınıf aşağıdakileri kapsamaktadır; - değerli metallerden yapılmış olsun veya olmasın, yasal olarak geçerli paralar dahil, madeni para imalatı. @tr
preferred label: Сечене на монети @bg
preferred label: Ražení mincí @cs
preferred label: Prægning af mønter @da
preferred label: Herstellung von Münzen @de
preferred label: Κοπή νομισμάτων @el
preferred label: Fabricación de monedas @es
preferred label: Müntide vermimine @et
preferred label: Kolikoiden ja mitalien valmistus @fi
preferred label: Frappe de monnaie @fr
preferred label: Érmegyártás
preferred label: Conio di monete @it
preferred label: Monetų kalimas @lt
preferred label: Monētu kalšana @lv
preferred label: Muniti ta' metall prezzjuż @mt
preferred label: Slaan van munten @nl
preferred label: Preging av mynter og medaljer @no
preferred label: Produkcja monet @pl
preferred label: Cunhagem de moedas @pt
preferred label: Baterea monedelor @ro
preferred label: Чеканка монет @ru
preferred label: Razenie mincí @sk
preferred label: Kovanje kovancev @sl
preferred label: Prägling av mynt @sv
preferred label: Madeni para basımı @tr
broader: Manufacture of jewellery, bijouterie and related articles

Manufacture of jewellery and related articles
type: Concept
notation: 32.12
status: valid
status modified: 2013-10-18
accepted date: 2013-10-18
in scheme: Statistical Classification of Economic Activities in the European Community, Rev. 2 (2008)
scope note: - обработка на перли - обработка на скъпоценни камъни (благородни или полублагородни), вкл. на синтетични или синтеровани скъпоценни камъни - обработка на диаманти - производство на бижута от благородни метали или от неблагородни метали, плакирани с благородни метали, от скъпоценни камъни или от тяхната комбинация с други материали, вкл. сечене на медали от благородни метали - изработка на златарски изделия от благородни метали или от неблагородни метали, плакирани с благородни метали: • прибори за хранене и за маса, тоалетни и канцеларски изделия, артикули за религиозни ритуали - производство на технически или лабораторни изделия от благородни метали (без уреди и апарати и техните части): тигели, шпатули, аноди за нанасяне на галванично покритие - производство на верижки за часовници, бутониери и табакери от благородни метали - гравиране на предмети от благородни и неблагородни метали - производство на каишки за часовници от текстил, кожа, пластмаси - 15.12 - производство на изделия от неблагородни метали с покритие от благородни метали (с изключение на бижута имитация) - раздел 25 - производство на корпуси за часовници - 26.52 - производство на верижки за часовници от неблагородни метали - 32.13 - производство на бижута имитация - 32.13 - поправка на бижута - 95.25 @bg
scope note: Z: - výrobu opracovaných perel - výrobu opracovaných drahokamů a polodrahokamů, včetně opracování kamenů v průmyslové kvalitě a syntetických nebo rekonstituovaných drahokamů a polodrahokamů - opracování diamantů - výrobu klenotů z drahých kovů nebo z obecných kovů plátovaných drahými kovy nebo drahokamy a polodrahokamy nebo z kombinací drahých kovů a drahokamů nebo polodrahokamů nebo jiných materiálů - výrobu zlatnických výrobků z drahých kovů nebo z obecných kovů plátovaných drahými kovy: • stolního a kuchyňského nádobí, příborů, toaletních výrobků, kancelářských výrobků nebo výrobků na psací stůl, náboženských předmětů atd. - výrobu technických nebo laboratorních výrobků z drahých kovů (kromě přístrojů a jejich dílů): • tavicích kelímků, špachtlí, anod pro elektrolytické pokovování atd. - výrobu hodinkových náramků, řemínků, pásků, řetízků a cigaretových pouzder z drahých kovů ZT: - rytí (gravírování) osobních předmětů z drahých a obecných kovů N: - výrobu nekovových hodinkových řemínků, pásků (textilních, usňových, plastových atd.) (15.12) - výrobu různých výrobků z obecných kovů potažených drahým kovem (kromě zlatnických výrobků a bižuterie) (viz oddíl 25) - výrobu pouzder pro hodiny a hodinky, včetně pouzder z drahých kovů (26.52) - výrobu hodinkových řemínků, pásků z obecných kovů (32.13) - výrobu bižuterie (32.13) - opravy šperků (95.25) @cs
scope note: Diese Klasse umfasst: - Herstellung von bearbeiteten Perlen - Herstellung von bearbeiteten Edel- und Schmucksteinen einschließlich Bearbeitung von industriellen Qualitätssteinen und synthetischen oder rekonstituierten Steinen - Bearbeitung von Diamanten - Herstellung von Schmuck aus Edelmetallen oder aus unedlen Metallen, die mit Edelmetallen plattiert wurden, oder aus Kombinationen von Edelmetallen und Edel- oder Schmucksteinen oder anderen Materialien - Herstellung von Gold- und Silberschmiedewaren aus Edelmetallen oder aus unedlen Metallen, die mit Edelmetallen plattiert wurden: • Tafelgeschirr, Toiletteartikel, Büro- oder Schreibtischartikel, Kultgegenstände usw. - Herstellung von technischen oder labortechnischen Erzeugnissen aus Edelmetallen (ohne Geräte und Teile davon): Schmelztiegel, Spachtel, Anoden für Elektroplattieren usw. - Herstellung von Uhrketten, Armbändern, Uhrbändern und Zigarettenetuis aus Edelmetallen Diese Klasse umfasst ferner: - Gravierung von persönlichen Gegenständen aus Edelmetallen und aus unedlen Metallen Diese Klasse umfasst nicht: - Herstellung nichtmetallischer Uhrbänder (Stoff, Leder, Kunststoff usw.) (s. 15.12) - Herstellung von Waren aus plattierten unedlen Metallen (ohne Fantasieschmuck) (s. Abteilung 25) - Herstellung von Uhrengehäusen (s. 26.52) - Herstellung von Uhrbändern aus unedlen Metallen (s. 32.13) - Herstellung von Fantasieschmuck (s. 32.13) - Reparatur von Schmuck (s. 95.25) @de
scope note: This class includes: - production of worked pearls - production of precious and semi-precious stones in the worked state, including the working of industrial quality stones and synthetic or reconstructed precious or semi-precious stones - working of diamonds - manufacture of jewellery of precious metal or of base metals clad with precious metals, or precious or semi-precious stones, or of combinations of precious metal and precious or semi-precious stones or of other materials - manufacture of goldsmiths' articles of precious metals or of base metals clad with precious metals: • dinnerware, flatware, hollowware, toilet articles, office or desk articles, articles for religious use etc. - manufacture of technical or laboratory articles of precious metal (except instruments and parts thereof): crucibles, spatulas, electroplating anodes etc. - manufacture of precious metal watch bands, wristbands, watch straps and cigarette cases This class also includes: - engraving of personal precious and non-precious metal products This class excludes: - manufacture of non-metal watch bands (fabric, leather, plastic etc.), see 15.12 - manufacture of articles of base metal plated with precious metal (except imitation jewellery), see division 25 - manufacture of watchcases, see 26.52 - manufacture of (non-precious) metal watch bands, see 32.13 - manufacture of imitation jewellery, see 32.13 - repair of jewellery, see 95.25 @en
scope note: Esta clase comprende: - la producción de perlas trabajadas - producción de piedras preciosas y semipreciosas labradas. Se incluye la producción de piedras de calidad industrial y de piedras preciosas y semipreciosas sintéticas y reconstruidas - la talla de diamantes - la fabricación de artículos de joyería de metales preciosos, o de metales comunes chapados con metales preciosos, de piedras preciosas o semipreciosas, o de combinaciones de metales preciosos y piedras preciosas o semipreciosas u otros materiales - la fabricación de artículos de orfebrería de materiales preciosos, o de metales comunes chapados con metales preciosos: • servicios de mesa, cuberterías, artículos de tocador, artículos de escritorio o de oficina, artículos para el culto religioso, etc. - la fabricación de artículos de uso técnico y de laboratorio elaborados con metales preciosos (excepto instrumentos y piezas de instrumentos): crisoles, espátulas, ánodos de galvanoplastia, etc. - la fabricación de correas de reloj, pulseras y pitilleras de metales preciosos Esta clase comprende también: - el grabado de productos personales de metales preciosos y no preciosos Esta clase no comprende: - la fabricación de correas que no sean metálicas para relojes de pulsera (p. ej., tela, cuero, plástico) (véase 15.12) - la fabricación de artículos de metal común chapado con metales preciosos (excepto bisutería) (véase la división 25) - la fabricación de cajas de relojes de pulsera (véase 26.52) - la fabricación de correas de relojes de metales no preciosos (véase 32.13) - la fabricación de bisutería (véase 32.13) - la reparación de joyería (véase 95.25) @es
scope note: Cette classe comprend: - la fabrication de perles travaillées - la production de pierres gemmes (précieuses ou fines), travaillées, y compris le travail de pierres de qualité industrielle et de pierres synthétiques ou reconstituées - le travail du diamant - la fabrication d’articles de bijouterie en métaux précieux, en plaqués ou en doublés de métaux précieux ou de pierres gemmes (précieuses ou fines) sur des métaux communs, ou en assemblages de métaux précieux et de pierres gemmes (précieuses ou fines) ou d’autres matériaux - la fabrication d’articles d’orfèvrerie en métaux précieux ou en plaqués ou doublés de métaux précieux sur des métaux communs: • vaisselle plate et creuse, couverts, articles de toilette, garnitures de bureau, articles à usage religieux, etc. - la fabrication d’articles techniques et de laboratoire en métal précieux (sauf instruments ou parties d’instruments): creusets, spatules, anodes de placage, etc. - la fabrication de bracelets de montres, de bracelets et d’étuis à cigarettes en métaux précieux Cette classe comprend également: - la gravure, personnalisée ou non, d’articles en métaux précieux et non précieux Cette classe ne comprend pas: - la fabrication de bracelets de montres autres qu’en métal (tissu, cuir, matières plastiques), voir 15.12 - la fabrication d’articles en plaqués ou doublés de métaux précieux sur des métaux communs (à l’exception de la bijouterie fantaisie), voir division 25 - la fabrication de boîtiers de montres, voir 26.52 - la fabrication de bracelets de montres en métaux non précieux, voir 32.13 - la fabrication de bijouterie de fantaisie, voir 32.13 - la réparation d’articles de bijouterie, voir 95.25 @fr
scope note: Ovaj razred uključuje: - proizvodnju obrađenih bisera - proizvodnju obrađenoga dragog i poludragog kamenja, uključuje obradu industrijskog kvalitetnog kamenja, sintetičkog i rekonstruiranoga dragog i poludragog kamenja - obradu dijamanata - proizvodnju nakita od plemenitih metala ili osnovnih metala presvučenih plemenitim metalima, od dragoga ili poludragoga kamenja, od kombinacije plemenitih metala i dragoga i poludragoga kamenja ili od drugih materijala - proizvodnju zlatarskih proizvoda od plemenitih metala ili osnovnih metala presvučenih plemenitim metalima: • pribora za jelo, poslužavnika, šupljih predmeta, toaletnog pribora, uredskog pribora, proizvoda koji se koriste za religijske svrhe itd. - proizvodnju tehničkih i laboratorijskih predmeta od plemenitih metala (osim instrumenata i njihovih dijelova): lončića za taljenje, spatula, elektroplatiniranih anoda itd. - proizvodnju narukvica za satove od plemenitih metala, zglobnih remena, običnih remena za satove i kutija za cigarete Ovaj razred također uključuje: - graviranje osobnih predmeta od plemenitih i neplemenitih metala Ovaj razred isključuje: - proizvodnju nemetalnih satnih remena (od tkanine, kože, plastike itd.), vidi 15.12 - proizvodnju predmeta od osnovnih metala prevučenih plemenitim metalima (osim imitacije nakita), vidi odjeljak 25 - proizvodnju kućišta za satove, vidi 26.52 - proizvodnju (ne plemenitih) metalnih remena za satove, vidi 32.13 - proizvodnju imitacija nakita, vidi 32.13 - popravak nakita, vidi 95.25
scope note: Į šią klasę įeina: - apdirbtų perlų gamyba - apdirbtų brangakmenių ir pusbrangių akmenų gamyba, įskaitant pramoninių ir dirbtinių ar restauruotų brangakmenių ar pusbrangių akmenų apdorojimą - deimantų apdirbimas - tauriųjų arba netauriųjų metalų, plakiruotų tauriaisiais metalais arba brangakmeniais ar pusiau brangiais akmenimis, ar tauriųjų metalų ir brangakmenių, pusiau brangių akmenų ar kitų medžiagų deriniais bižuterijos dirbinių gamyba - tauriųjų metalų arba plakiruotų tauriaisiais metalais netauriųjų metalų dailidirbystės dirbinių gamyba: • gilių ir plokščių indų bei stalo indų, tualeto reikmenų, raštinės ar stalo reikmenų, religinės paskirties dirbinių ir kt. - techninių ir laboratorijų dirbinių iš tauriųjų metalų gamyba (išskyrus instrumentus ir jų dalis): tiglių, mentelių, galvanizuotų anodų ir kt. - tauriųjų metalų laikrodžių dirželių, juostelių, apyrankių ir cigarečių dėkliukų gamyba Į šią klasę taip pat įeina: - tauriųjų ir netauriųjų metalų dirbinių graviravimas Į šią klasę neįeina: - nemetalinių laikrodžių dirželių gamyba (medžiaginių, odinių, plastikinių ir kt.), žr. 15.12 - netauriųjų metalų, plakiruotų tauriaisiais metalais, dirbinių gamyba (išskyrus dirbtinę bižuteriją), žr. 25 skyrių - laikrodžių korpusų gamyba, žr. 26.52 - netauriųjų metalų laikrodžių dirželių gamyba, žr. 32.13 - dirbtinės bižuterijos gamyba, žr. 32.13 - juvelyrinių dirbinių taisymas, žr. 95.25 @lt
scope note: Этот класс включает: - производство струнных инструментов - производство клавишных струнных инструментов, включая электронные пианино - производство клавишно-духовых инструментов, включая гармони и подобные инструменты с металлическими трубками - производство аккордеонов и подобных инструментов, включая губные гармошки - производство духовых инструментов - производство ударных музыкальных инструментов - производство электронных музыкальных инструментов - производство музыкальных шкатулок, органов, каллиоп и т.д. - производство комплектующих и аксессуаров для музыкальных инструментов: • метрономов, камертонов, дисков и прочих настраивающих автоматических и механических инструментов и приборов и т.д. Этот класс также включает: - производство свистков, губных гармошек и прочих подобных сигнальных инструментов Этот класс исключает: - воспроизведение звуко- и видео материалов и дисков до выпуска, см. 18.2 - производство микрофонов, усилителей, громкоговорителей, наушников и подобных компонентов, см. 26.40 - производство плееров, магнитофонов и т.п., см. 26.40 - производство игрушечных музыкальных инструментов, см. 32.40 - восстановление органов и прочих исторических музыкальных инструментов, см. 33.19 - запись звуко- и видео материалов и дисков до выпуска, см. 59.20 - настройку пианино, см. 95.29 @ru
scope note: Bu sınıf aşağıdakileri kapsamaktadır; - işlenmiş inci üretimi, - işlenmiş durumdaki değerli ve yarı değerli taşların üretimi, (sanayide kullanılan nitelikli taşların ve sentetik veya yeniden oluşturulmuş değerli veya yarı değerli taşların işlenmesi dahil), - elmasların işlenmesi, - değerli metallerden, değerli metallerle kaplı ana metallerden ya da değerli veya yarı değerli taşlardan mücevher imalatı, ayrıca, değerli metallerin kombinasyonundan, değerli veya yarı değerli taşların veya diğer materyallerin kombinasyonundan mücevher imalatı, - değerli metallerden yada değerli metallerle kaplı ana metallerden kuyumculuk ürünlerinin imalatı: • yemek takımları, çatal bıçak takımları, değerli metallerden kap veya kaseler, tuvalet malzemeleri, büro ya da masa malzemeleri, dini amaçlı kullanılan eşyalar vb., - değerli metallerden teknik eşyalar ya da laboratuar eşyalarının imalatı (donanımları ve bunların parçaları hariç): değerli metallerden maden eritme kapları, spatulalar, elektrolitik kaplama anotlar vb., - değerli metallerden saat bandı, bileklik, saat kayışı ve sigaralık imalatı. Ayrıca bu sınıf aşağıdakileri de kapsamaktadır; - değerli olsun olmasın metalden imal edilmiş kişisel eşyalar üzerine yapılan kabartmacılık Kapsam dışı olanlar; - metal olmayan saat bandı imalatı (kumaş, deri, plastik vb.), bkz.15.12, - değerli metallerle kaplı ana metallerden eşyaların üretimi (imitasyon takılar hariç), bkz. bölüm 25, - saat kasalarının imalatı, bkz. 26.52, - metalden (değerli olmayan) saat bantı imalatı, bkz. 32.13, - imitasyon takıların imalatı, bkz. 32.13, - mücevheratın onarılması (imitasyon olanlar dahil), bkz. 95.25. @tr
preferred label: Производство на бижутерийни и подобни изделия от благородни метали @bg
preferred label: Výroba klenotů a příbuzných výrobků @cs
preferred label: Fremstilling af smykker i ædle metaller og relaterede produkter @da
preferred label: Herstellung von Schmuck, Gold- und Silberschmiedewaren (ohne Fantasieschmuck) @de
preferred label: Κατασκευή κοσμημάτων και συναφών ειδών @el
preferred label: Fabricación de artículos de joyería y artículos similares @es
preferred label: Väärisesemete jms toodete tootmine @et
preferred label: Jalokivikorujen ja muiden kultasepäntuotteiden valmistus @fi
preferred label: Fabrication d'articles de joaillerie et bijouterie @fr
preferred label: Ékszergyártás
preferred label: Fabbricazione di gioielli e articoli connessi @it
preferred label: Papuošalų, juvelyrinių ir panašių dirbinių gamyba @lt
preferred label: Juvelierizstrādājumu un līdzīgu izstrādājumu ražošana @lv
preferred label: Manifattura ta' ġojjellerija u oġġetti relatati @mt
preferred label: Bewerken van edelstenen en vervaardiging van sieraden en dergelijke artikelen @nl
preferred label: Produksjon av gull- og sølvvarer og lignende artikler @no
preferred label: Produkcja wyrobów jubilerskich i podobnych @pl
preferred label: Fabricação de joalharia, ourivesaria e artigos similares @pt
preferred label: Fabricarea bijuteriilor şi articolelor similare din metale şi pietre preţioase @ro
preferred label: Производство ювелирных изделий и аналогичных изделий @ru
preferred label: Výroba šperkov a podobných predmetov @sk
preferred label: Proizvodnja nakita in podobnih izdelkov @sl
preferred label: Tillverkning av smycken, guld- och silversmedsvaror @sv
preferred label: Mücevherat ve ilgili eşyaların imalatı @tr
broader: Manufacture of jewellery, bijouterie and related articles

Manufacture of imitation jewellery and related articles
type: Concept
notation: 32.13
status: valid
status modified: 2013-10-18
accepted date: 2013-10-18
in scheme: Statistical Classification of Economic Activities in the European Community, Rev. 2 (2008)
scope note: - производство на бижута имитация: • пръстени, гривни, гердани и подобни бижутерийни изделия, изработени от неблагородни метали с покритие от благородни метали • украшения, съдържащи камъни - имитация на перли, диаманти, скъпоценни камъни - производство на верижки за часовници от неблагородни метали - производство на бижута от благородни метали или от неблагородни метали, плакирани с благородни метали - 32.12 - производство на бижута, изработени със скъпоценни камъни - 32.12 - производство на верижки за часовници от благородни метали - 32.12 @bg
scope note: Z: - výrobu bižuterie: • prsteny, náhrdelníky a podobné výrobky z obecných kovů pokovované drahým kovem (pozlacené, postříbřené atd.) • bižuterie obsahující imitací drahých kamenů, např. drahokamů, diamantů - výrobu hodinkových náramků, řemínků, pásků z obecných kovů N: - výrobu šperků z drahých kovů nebo plátovaných drahými kovy (32.12) - výrobu šperků obsahujících pravý drahokam (32.12) - výrobu hodinkových náramků, řemínků, pásků z drahých kovů (32.12) @cs
scope note: Diese Klasse umfasst: - Herstellung von Fantasieschmuck: • Ringe, Halsketten und ähnlicher Schmuckwaren aus versiberten, vergoldeten oder platinierten unedlen Metallen • Schmuckwaren mit synthetischen Steinen, wie synthetischen Edelsteinen, synthetischen Diamanten u. Ä. - Herstellung vom Uhrbändern aus Metallen (ohne Edelmetall) Diese Klasse umfasst nicht: - Herstellung von Schmuck aus Edelmetallen oder aus plattierten unedlen Metallen (s. 32.12) - Herstellung von Schmuck mit Edelsteinen (s. 32.12) - Herstellung von Uhrbändern aus Edelmetallen (s. 32.12) @de
scope note: This class includes: - manufacture of costume or imitation jewellery: • rings, bracelets, necklaces, and similar articles of jewellery made from base metals plated with precious metals • jewellery containing imitation stones such as imitation gems stones, imitation diamonds, and similar - manufacture of metal watch bands (except precious metal) This class excludes: - manufacture of jewellery made from precious metals or clad with precious metals, see 32.12 - manufacture of jewellery containing genuine gem stones, see 32.12 - manufacture of precious metal watch bands, see 32.12 @en
scope note: Esta clase comprende: - la fabricación de bisutería: • anillos, pulseras, collares y artículos similares de joyería fabricados de metales comunes chapados con metales preciosos • artículos de joyería que contienen piedras de imitación, como gemas y diamantes de imitación, y similares - la fabricación de correas de relojes de metal (excepto metales preciosos) Esta clase no comprende: - la fabricación de artículos de joyería de metales preciosos o chapados con metales preciosos (véase 32.12) - la fabricación de artículos de joyería que contienen piedras preciosas auténticas (véase 32.12) - la fabricación de correas de relojes de metales preciosos (véase 32.12) @es
scope note: Cette classe comprend: - la fabrication de bijoux de fantaisie: • bagues, bracelets, colliers et articles de bijouterie similaires en plaqués ou en doublés de métaux précieux sur métaux communs • articles de bijouterie contenant des pierres artificielles, telles que pierres précieuses artificielles, diamants de synthèse et autres - la fabrication de bracelets de montres en métal (à l’exception des métaux précieux) Cette classe ne comprend pas: - la fabrication d’articles de bijouterie en métaux précieux, en plaqués ou en doublés de métaux précieux, voir 32.12 - la fabrication d’articles de bijouterie contenant des pierres précieuses authentiques, voir 32.12 - la fabrication de bracelets de montres en métaux précieux, voir 32.12 @fr
scope note: Ovaj razred uključuje: - proizvodnju umjetnog nakita ili imitacija nakita: • prstenova, narukvica, ogrlica i sličnih predmeta napravljenih od osnovnih metala prevučenih plemenitim metalima • nakit koji sadrži imitaciju dragoga kamenja kao što je imitacija dragulja, imitacija dijamanata i slično - proizvodnju metalnih remena za satova (osim od plemenitih metala) Ovaj razred isključuje: - proizvodnju nakita od plemenitih metala ili prevučenih plemenitim metalima, vidi 32.12 - proizvodnju nakita koji sadrži pravo drago kamenje, vidi 32.12 - proizvodnju satnih remena od plemenitih metala, vidi 32.12
scope note: Į šią klasę įeina: - pigios ar dirbtinės bižuterijos gamyba: • žiedų, apyrankių, vėrinių ir panašių juvelyrinių dirbinių iš netauriųjų metalų, plakiruotų tauriaisiais metalais • juvelyrinių dirbinių su dirbtiniais akmenimis, pavyzdžiui, dirbtiniais brangakmeniais, dirbtiniais deimantais ir pan. - metalinių laikrodžių dirželių gamyba (išskyrus tauriųjų metalų) Į šią klasę neįeina: - juvelyrinių dirbinių iš tauriųjų metalų arba plakiruotų tauriaisiais metalais gamyba, žr. 32.12 - juvelyrinių dirbinių su tikrais brangiaisiais akmenimis gamyba, žr. 32.12 - tauriųjų metalų laikrodžių dirželių gamyba, žr. 32.12 @lt
scope note: Bu sınıf aşağıdakileri kapsamaktadır; - imitasyon takıların imalatı: • yüzükler, bilezikler, gerdanlıklar ve değerli metallerle kaplanmış ana metallerden yapılmış benzer takılar, • imitasyon değerli taşlar, imitasyon pırlantalar ve benzerleri gibi imitasyon taşları içeren takılar, - metal saat bantlarının imalatı (değerli metaller hariç). Kapsam dışı olanlar; - değerli metallerden yapılmış veya değerli metallerle kaplanmış mücevher imalatı, bkz. 32.12, - hakiki değerli taşları içeren mücevherat imalatı, bkz. 32.12, - değerli metallerden saat bantlarının imalatı, bkz. 32.12. @tr
preferred label: Производство на бижута имитация @bg
preferred label: Výroba bižuterie a příbuzných výrobků @cs
preferred label: Fremstilling af bijouteri og lignende varer @da
preferred label: Herstellung von Fantasieschmuck @de
preferred label: Κατασκευή κοσμημάτων απομίμησης και συναφών ειδών @el
preferred label: Fabricación de artículos de bisutería y artículos similares @es
preferred label: Juveeltoodete imitatsioonide jms tootmine @et
preferred label: Jäljitelmäkorujen ja muiden vastaavien tuotteiden valmistus @fi
preferred label: Fabrication d'articles de bijouterie fantaisie et articles similaires @fr
preferred label: Divatékszer gyártása
preferred label: Fabbricazione di bigiotteria e articoli simili @it
preferred label: Dirbtinės bižuterijos ir panašių dirbinių gamyba @lt
preferred label: Juvelierizstrādājumu imitāciju un līdzīgu izstrādājumu ražošana @lv
preferred label: Manifattura ta' ġojjellerija ta' imitazzjoni u oġġetti reltati @mt
preferred label: Vervaardiging van imitatiesieraden en dergelijke artikelen @nl
preferred label: Produksjon av bijouteri og lignende artikler @no
preferred label: Produkcja sztucznej biżuterii i wyrobów podobnych @pl
preferred label: Fabricação de bijutarias @pt
preferred label: Fabricarea imitaţiilor de bijuterii şi articole similare @ro
preferred label: Производство бижутерии и аналогичных изделий @ru
preferred label: Výroba bižutérie a podobných predmetov @sk
preferred label: Proizvodnja bižuterije @sl
preferred label: Tillverkning av bijouterier o.d. @sv
preferred label: İmitasyon takıların ve ilgili eşyaların imalatı @tr
broader: Manufacture of jewellery, bijouterie and related articles

Manufacture of musical instruments
type: Concept
notation: 32.2
status: valid
status modified: 2013-10-18
accepted date: 2013-10-18
in scheme: Statistical Classification of Economic Activities in the European Community, Rev. 2 (2008)
scope note: Данный подкласс включает производство спортивных и атлетических товаров (за исключением одежды и обуви). Этот класс включает: - производство изделий и оборудования для спортивных, уличных и комнатных игр из любых материалов: • жестких, мягких и надувных мячей • ракеток и бит • лыж, палок и т.д. • лыжных ботинок • парусных досок и досок для серфинга • принадлежностей для спортивной рыбной ловли, включая сети • принадлежностей для охоты, альпинизма и т.д. • спортивных кожаных перчаток и спортивных головных уборов • бассейнов для плавания, бассейнов глиномялки и т.д. • ледовых, роликовых коньков и т.д. • луков и самострелов • оборудования гимнастических залов, фитнес-центров или атлетического оборудования Этот класс исключает: - производство парусов, см. 13.92 - производство спортивной одежды, см. 14.19 - производство шорных изделий и сбруи, см. 15.12 - производство кнутов и снаряжения для верховой езды, см. 15.12 - производство спортивной обуви, см. 15.20 - производство спортивного оружия и боеприпасов, см. 25.40 - производство металлических форм в качестве поднятия тяжестей в тренировочных целях, см. 25.99 - производство спортивных транспортных и прочих средств, кроме саней и т.п., см. разделы 29 и 30 - производство лодок, см. 30.12 - производство бильярдных столов, см. 32.40 - производство зажимов для ушей и носа (например, для плавания и защиты носа), см. 32.99 - ремонт спортивных товаров, см. 95.29 @ru
preferred label: Производство на музикални инструменти @bg
preferred label: Výroba hudebních nástrojů @cs
preferred label: Fremstilling af musikinstrumenter @da
preferred label: Herstellung von Musikinstrumenten @de
preferred label: Κατασκευή μουσικών οργάνων @el
preferred label: Fabricación de instrumentos musicales @es
preferred label: Muusikariistade tootmine @et
preferred label: Soitinten valmistus @fi
preferred label: Fabrication d'instruments de musique @fr
preferred label: Hangszergyártás
preferred label: Fabbricazione di strumenti musicali @it
preferred label: Muzikos instrumentų gamyba @lt
preferred label: Mūzikas instrumentu ražošana @lv
preferred label: Manifattura ta' strumenti mużikali @mt
preferred label: Vervaardiging van muziekinstrumenten @nl
preferred label: Produksjon av musikkinstrumenter @no
preferred label: Produkcja instrumentów muzycznych @pl
preferred label: Fabricação de instrumentos musicais @pt
preferred label: Fabricarea instrumentelor muzicale @ro
preferred label: Производство музыкальных инструментов @ru
preferred label: Výroba hudobných nástrojov @sk
preferred label: Proizvodnja glasbil @sl
preferred label: Tillverkning av musikinstrument @sv
preferred label: Müzik aletleri imalatı @tr
broader: Other manufacturing
narrower: Manufacture of musical instruments

Manufacture of musical instruments
type: Concept
notation: 32.20
status: valid
status modified: 2013-10-18
accepted date: 2013-10-18
in scheme: Statistical Classification of Economic Activities in the European Community, Rev. 2 (2008)
scope note: - производство на струнни инструменти - производство на клавишни струнни музикални инструменти, вкл. автоматични пиана - производство на органи с тръби и клавиатура, вкл. хармониуми и подобни инструменти с клавиатура и свободен метален платък - производство на акордеони и подобни инструменти, вкл. устни хармоники - производство на духови музикални инструменти - производство на ударни музикални инструменти - производство на музикални инструменти, чийто звук се произвежда или усилва по електронен начин - производство на музикални кутии, оркестриони, латерни и други - производство на части и принадлежности за музикални инструменти: • метрономи, камертони, карти, дискове и рула, музикални кутии и латерни - производство на свирки, рогове и други подобни - възпроизвеждане на звуко- и видеозаписи върху аудио- и видеокасети, компактдискове (CD) и цифрови дискове (DVD) - 18.2 - производство на високоговорители, слушалки, микрофони, усилватели и подобни апарати за усилване на звука - 26.40 - производство на звукозаписни и презаписващи апарати - 26.40 - производство на играчки - музикални инструменти - 32.40 - реставриране на органи и други старинни музикални инструменти - 33.19 - издаване на звукозаписи - 59.20 - акордиране на пиана - 95.29 @bg
scope note: Z: - výrobu strunných hudebních nástrojů - výrobu klávesových strunných nástrojů včetně automatických pian - výrobu klávesových a píšťalových varhan, včetně harmonií a podobných klávesových nástrojů s kovovými jazýčky - výrobu akordeonů a podobných nástrojů včetně foukacích harmonik - výrobu dechových nástrojů - výrobu bicích hudebních nástrojů - výrobu elektronických hudebních nástrojů - výrobu hracích skříní, orchestrionů, flašinetů atd. - výrobu dílů a příslušenství hudebních nástrojů: • metronomů, ladiček, ladicích píšťal, karet, disků a válců pro mechanické hrací skříňky atd. ZT: - výrobu píšťal, hlásných trub a jiných signálních dechových hudebních nástrojů N: - reprodukci nahraných magnetofonových kazet, videokazet, CD a DVD (18.2) - výrobu mikrofonů, zesilovačů, reproduktorů, sluchátek a podobných přístrojů (26.40) - výrobu gramofonů, magnetofonů a podobně (26.40) - výrobu hudebních nástrojů jako hraček (32.40) - restaurování varhan a jiných historických hudebních nástrojů (33.19) - vydavatelství nahraných zvukových a videokazet a disků (59.20) - ladění klavírů (95.29) @cs
scope note: Diese Klasse umfasst: - Herstellung von Saiteninstrumenten - Herstellung von Saiteninstrumenten mit Klaviatur einschließlich automatischer Klaviere - Herstellung von Orgeln (mit Klaviatur und Pfeifen), Harmonien und ähnlichen Instrumenten mit Klaviatur und durchschlagenden Metallzungen - Herstellung von Akkordeons und ähnlichen Instrumenten einschließlich Mundharmonikas - Herstellung von Blasinstrumenten - Herstellung von Schlaginstrumenten - Herstellung von elektronischen Musikinstrumenten - Herstellung von Spieldosen, Orchestrien, Drehorgeln usw. - Herstellung von Teilen und Zubehör für Musikinstrumente: • Metronome, Stimmgabeln, Stimmpfeifen, Karten, Scheiben und Walzen für mechanische Musikautomaten usw. Diese Klasse umfasst ferner: - Herstellung von Pfeifen, Signalhörnern und anderen mundgeblasenen Tonsignalinstrumenten Diese Klasse umfasst nicht: - Vervielfältigung von bespielten Ton- und Videobändern, CDs und DVDs (s. 18.2) - Herstellung von Mikrofonen, Verstärkern, Lautsprechern, Kopfhörern und ähnlichen Geräten (s. 26.40) - Herstellung von Plattenspielern, Tonbandgeräten und dergleichen (s. 26.40) - Herstellung von Musikspielzeuginstrumenten (s. 32.40) - Restaurierung von Orgeln und anderen historischen Musikinstrumenten (s. 33.19) - Verlag von bespielten Ton- und Videobändern, CDs und DVDs (s. 59.20) - Klavierstimmen (s. 95.29) @de
scope note: This class includes: - manufacture of stringed instruments - manufacture of keyboard stringed instruments, including automatic pianos - manufacture of keyboard pipe organs, including harmoniums and similar keyboard instruments with free metal reeds - manufacture of accordions and similar instruments, including mouth organs - manufacture of wind instruments - manufacture of percussion musical instruments - manufacture of musical instruments, the sound of which is produced electronically - manufacture of musical boxes, fairground organs, calliopes etc. - manufacture of instrument parts and accessories: • metronomes, tuning forks, pitch pipes, cards, discs and rolls for automatic mechanical instruments etc. This class also includes: - manufacture of whistles, call horns and other mouth-blown sound signalling instruments This class excludes: - reproduction of pre-recorded sound and video tapes and discs, see 18.2 - manufacture of microphones, amplifiers, loudspeakers, headphones and similar components, see 26.40 - manufacture of record players, tape recorders and the like, see 26.40 - manufacture of toy musical instruments, see 32.40 - restoring of organs and other historic musical instruments, see 33.19 - publishing of pre-recorded sound and video tapes and discs, see 59.20 - piano tuning, see 95.29 @en
scope note: Esta clase comprende: - la fabricación de instrumentos de cuerda - la fabricación de instrumentos de cuerda con teclado, incluidos los pianos automáticos - la fabricación de órganos de tubos, armonios y otros instrumentos similares de teclado y lengüetas metálicas libres - la fabricación de acordeones y otros instrumentos similares, incluidas las armónicas - la fabricación de instrumentos de viento - la fabricación de instrumentos musicales de percusión - la fabricación de instrumentos musicales cuyo sonido se produce electrónicamente - la fabricación de cajas de música, organillos, calíopes, etc. - la fabricación de piezas y accesorios de instrumentos: • metrónomos, diapasones, tarjetas, discos y rollos para instrumentos mecánicos automáticos, etc. Esta clase comprende también: - la fabricación de silbatos, cornetas y otros instrumentos de viento para señales Esta clase no comprende: - la reproducción de cintas de vídeo y sonido y de discos pregrabados (véase 18.2) - la fabricación de micrófonos, amplificadores, altavoces, auriculares y artículos similares (véase 26.40) - la fabricación de tocadiscos, magnetófonos y similares (véase 26.40) - la fabricación de instrumentos musicales de juguete (véase 32.40) - la restauración de órganos y otros instrumentos musicales históricos (véase 33.19) - la edición de cintas de vídeo y sonido y de discos pregrabados (véase 59.20) - la afinación de pianos (véase 95.29) @es
scope note: Cette classe comprend: - la fabrication d’instruments à cordes - la fabrication d’instruments à cordes à clavier, y compris les pianos automatiques - la fabrication d’orgues à tuyaux et à clavier, y compris les harmoniums et les instruments similaires à clavier et à anches libres métalliques - la fabrication d’accordéons et d’instruments similaires, y compris les harmonicas à bouche - la fabrication d’instruments à vent - la fabrication d’instruments de musique à percussion - la fabrication d’instruments de musique dont le son est produit électroniquement - la fabrication de boîtes à musique, d’orchestrions, d’orgues de Barbarie, etc. - la fabrication de parties et d’accessoires d’instruments de musique: • métronomes, diapasons, cartes, disques et rouleaux pour instruments mécaniques, etc. Cette classe comprend également: - la fabrication de sifflets, de cornes d’appel et d’autres instruments d’appel ou de signalisation à bouche Cette classe ne comprend pas: - la reproduction de bandes et de disques contenant des enregistrements sonores et vidéo préenregistrés, voir 18.2 - la fabrication de microphones, d’amplificateurs, de haut-parleurs, d’écouteurs et d’articles similaires, voir 26.40 - la fabrication d’électrophones, de magnétophones et d’appareils similaires, voir 26.40 - la fabrication d’instruments ayant le caractère de jouets, voir 32.40 - la restauration d’orgues et d’autres instruments de musique historiques, voir 33.19 - la publication de bandes et de disques contenant des enregistrements sonores et vidéo préenregistrés, voir 59.20 - l’accordage de piano, voir 95.29 @fr
scope note: Ovaj razred uključuje: - proizvodnju instrumenata sa žicama - proizvodnju klavijaturnih instrumenata sa žicama, uključujući automatske klavire - proizvodnju orgulja, uključujući harmonije i slične klavijaturne instrumente sa slobodnim metalnim piskovima - proizvodnju harmonika i sličnih instrumenata, uključujući usne harmonike - proizvodnju puhaćih instrumenata - proizvodnju udaraljki - proizvodnju glazbenih instrumenata čiji se zvuk proizvodi elektronički - proizvodnju glazbenih kutija, sajmišnih orgulja, kaliopa itd. - proizvodnju dijelova i pribora za instrumente: • metronoma, zvučnih vilica, pištaljki za davanje visine tona pjevačima, žica, diskova i valjaka za automatske mehaničke instrumente itd. Ovaj razred također uključuje: - proizvodnju zviždaljki, pozivnog roga i ostalih usnih puhačkih instrumenata za zvučne signale Ovaj razred isključuje: - umnožavanje nasnimljenih audiovrpca i videovrpca te diskova, vidi 18.2 - proizvodnju mikrofona, pojačala, zvučnika, slušalica i sličnih komponenata, vidi 26.40 - proizvodnju gramofona, magnetofona i slično, vidi 26.40 - proizvodnju glazbenih instrumenata igračaka, vidi 32.40 - restauracija orgulja i drugih historijskih glazbenih instrumenata, vidi 33.19 - izdavanje nasnimljenih audiovrpca, videovrpca i diskova, vidi 59.20 - ugađanje klavira, vidi 95.29
scope note: Į šią klasę įeina: - styginių instrumentų gamyba - klavišinių styginių instrumentų, įskaitant klavesinus, gamyba - vamzdinių klavišinių vargonų gamyba, įskaitant fisharmonijas ir panašius klavišinius instrumentus su laisvais metaliniais liežuvėliais - akordeonų ir panašių instrumentų, įskaitant lūpines armonikėles, gamyba - pučiamųjų instrumentų gamyba - mušamųjų muzikos instrumentų gamyba - muzikos instrumentų, kurių garsas sukuriamas elektroniniu būdu, gamyba - grojančių dėžučių, mugių vagonėlių, garinių vargonų ir kt. gamyba - instrumentų dalių ir pagalbinių reikmenų gamyba: • metronomų, kamertonų, vienatonių vamzdelių, automatinių mechaninių instrumentų kortų, diskų, velenėlių ir kt. Į šią klasę taip pat įeina: - švilpukų, ragų ir kitų burna pučiamų garsinio signalizavimo instrumentų gamyba Į šią klasę neįeina: - įrašytų garsajuosčių ir vaizdajuosčių, kompaktinių (CD) ir skaitmeninių vaizdo diskų (DVD) tiražavimas, žr. 18.2 - mikrofonų, stiprintuvų, garsiakalbių, ausinių ir panašių komponentų gamyba, žr. 26.40 - plokštelių grotuvų, magnetofonų ir panašių aparatų gamyba, žr. 26.40 - žaislinių muzikos instrumentų gamyba, žr. 32.40 - vargonų ir kitų istorinių muzikos instrumentų restauravimas, žr. 33.19 - įrašytų garsajuosčių ir vaizdajuosčių, kompaktinių (CD) ir skaitmeninių vaizdo diskų (DVD) leidyba, žr. 59.20 - pianinų derinimas, žr. 95.29 @lt
scope note: Bu sınıf aşağıdakileri kapsamaktadır; - telli müzik aletlerinin imalatı, - otomatik piyanolar da dahil klavyeli telli müzik aletlerinin imalatı, - armonyumlar ve benzer serbest metal dilli klavyeli müzik aletleri de dahil klavyeli borulu orgların imalatı, - ağız mızıkası da dahil akordiyon ve benzer müzik aletlerinin imalatı, - üflemeli (nefesli) müzik aletlerinin imalatı, - vurmalı müzik aletlerinin imalatı, - elektronik müzik aletlerinin imalatı (sesleri elektronik olarak üreten müzik aletleri), - müzik kutularının, panayır yeri orglarının, çoğunlukla sirklerde kullanılan ve buhar ile çalınan orgların vb. imalatı, - müzik aletlerinin parçalarının ve aksesuarlarının imalatı: • metronomlar, akort çatalları, akort düdükleri, otomatik çalışan müzik aletleri için kart ve diskler vb. Ayrıca bu sınıf aşağıdakileri de kapsamaktadır; - düdüklerin, çağrı borularının ve diğer üflemeli ses çıkaran sinyal aletlerinin imalatı. Kapsam dışı olanlar; - daha önceden kaydedilmiş orijinal ses ve video teyplerin, CD`lerin ve DVD`lerin çoğaltılması, bkz. 18.2, - mikrofonların, amfilerin, hoparlörlerin, kulaklıkların ve benzer parçaların imalatı, bkz. 26.40, - pikapların, ses kaydetme cihazlarının ve benzerlerinin imalatı, bkz. 26.40, - oyuncak müzik aletlerinin imalatı, bkz. 32.40, - orgların ve diğer tarihi müzik aletlerinin onarımı, bkz. 33.19, - önceden kaydedilmiş ses ve video teyplerinin,CD`lerin ve DVD`lerin yayımlanması, bkz. 59.20, - piyano akordu, bkz. 95.29. @tr
preferred label: Производство на музикални инструменти @bg
preferred label: Výroba hudebních nástrojů @cs
preferred label: Fremstilling af musikinstrumenter @da
preferred label: Herstellung von Musikinstrumenten @de
preferred label: Κατασκευή μουσικών οργάνων @el
preferred label: Fabricación de instrumentos musicales @es
preferred label: Muusikariistade tootmine @et
preferred label: Soitinten valmistus @fi
preferred label: Fabrication d'instruments de musique @fr
preferred label: Hangszergyártás
preferred label: Fabbricazione di strumenti musicali @it
preferred label: Muzikos instrumentų gamyba @lt
preferred label: Mūzikas instrumentu ražošana @lv
preferred label: Manifattura ta' strumenti mużikali @mt
preferred label: Vervaardiging van muziekinstrumenten @nl
preferred label: Produksjon av musikkinstrumenter @no
preferred label: Produkcja instrumentów muzycznych @pl
preferred label: Fabricação de instrumentos musicais @pt
preferred label: Fabricarea instrumentelor muzicale @ro
preferred label: Производство музыкальных инструментов @ru
preferred label: Výroba hudobných nástrojov @sk
preferred label: Proizvodnja glasbil @sl
preferred label: Tillverkning av musikinstrument @sv
preferred label: Müzik aletleri imalatı @tr
broader: Manufacture of musical instruments

Manufacture of sports goods
type: Concept
notation: 32.3
status: valid
status modified: 2013-10-18
accepted date: 2013-10-18
in scheme: Statistical Classification of Economic Activities in the European Community, Rev. 2 (2008)
scope note: Данный класс включает производство кукол, игрушек и игр (включая электронные игры), игрушечных моделей и детских автотранспортных средств (за исключением металлических велосипедов и трехколесных велосипедов). Этот класс включает: - производство кукол и кукольной одежды, принадлежностей и аксессуаров - производство прочих кукол - производство игрушечных животных - производство игрушечных музыкальных инструментов - производство игральных карт - производство настольных и подобных им игр - производство электронных игр: шахмат и т.д. - производство небольших игрушечных моделей и подобных развлекательных моделей, электрических поездов, строительных установок и т.д. - производство игровых автоматов, бильярдных принадлежностей, специальных столов для игр в казино и т.д. - производство изделий для развлечения, настольных или комнатных игр - производство игрушек с колесами для езды, включая пластиковые велосипеды и трехколесные велосипеды - производство головоломок и подобных изделий Этот класс исключает: - производство пультов управления для электронных игр, см. 26.40 - производство велосипедов, см. 30.92 - производство шуточных и мелких товаров, см. 32.99 - разработку и выпуск программ для видео игр, управляемых пультом, см. 58.21 @ru
preferred label: Производство на спортни стоки @bg
preferred label: Výroba sportovních potřeb @cs
preferred label: Fremstilling af sportsudstyr @da
preferred label: Herstellung von Sportgeräten @de
preferred label: Κατασκευή αθλητικών ειδών @el
preferred label: Fabricación de artículos de deporte @es
preferred label: Sporditarvete tootmine @et
preferred label: Urheiluvälineiden valmistus @fi
preferred label: Fabrication d'articles de sport @fr
preferred label: Sportszergyártás
preferred label: Fabbricazione di articoli sportivi @it
preferred label: Sporto reikmenų gamyba @lt
preferred label: Sporta preču ražošana @lv
preferred label: Manifattura ta' oġġetti ta' l-isport @mt
preferred label: Vervaardiging van sportartikelen @nl
preferred label: Produksjon av sportsartikler @no
preferred label: Produkcja sprzętu sportowego @pl
preferred label: Fabricação de artigos de desporto @pt
preferred label: Fabricarea articolelor pentru sport @ro
preferred label: Производство спортивных товаров @ru
preferred label: Výroba športových potrieb @sk
preferred label: Proizvodnja športne opreme @sl
preferred label: Tillverkning av sportartiklar @sv
preferred label: Spor malzemeleri imalatı @tr
broader: Other manufacturing
narrower: Manufacture of sports goods

Manufacture of sports goods
type: Concept
notation: 32.30
status: valid
status modified: 2013-10-18
accepted date: 2013-10-18
in scheme: Statistical Classification of Economic Activities in the European Community, Rev. 2 (2008)
scope note: - производство на изделия и оборудване за спорт, игри на открито или на закрито, от всякъв материал: • твърди, меки и надуваеми топки • ракети, хилки, бухалки и стикове • ски, автомати за ски и щеки • обувки за ски • сърф бордове и сърфове с платна • принадлежности за спортен риболов, вкл. кепчета за всякаква употреба • принадлежности за лов, алпинизъм и други • кожени спортни ръкавици и спортни шапки • надуваеми и ненадуваеми басейни • кънки за лед, ролкови кънки и други • лъкове и арбалети • изделия и оборудване за фитнес, гимнастика или атлетика - производство на платна за плавателни съдове - 13.92 - производство на спортно облекло - 14.13 - производство на сарашки и седларски изделия - 15.12 - производство на камшици и бичове - 15.12 - производство на спортни обувки - 15.20 - производство на огнестрелни оръжия и боеприпаси за лов и спорт - 25.40 - производство на щанги, използвани за вдигане на тежести - 25.99 - производство на спортни превозни средства, без шейни и подобни - раздели 29 и 30 - строителство на плавателни съдове за отдих - 30.12 - производство на билярдни маси - 32.40 - производство на тапи за уши и нос (например за предпазване при плуване или шум) - 32.99 - ремонт и поправка на спортни стоки - 95.29 @bg
scope note: Tato třída zahrnuje výrobu sportovních a atletických potřeb (kromě sportovních oděvů a obuvi) Z: - výrobu sportovních potřeb a vybavení pro sport pro hry v tělocvičně i venku, z jakéhokoliv materiálu: • tvrdé, měkké a nafukovací míče • rakety, pálky a golfové hole • lyže, vázání a hůlky • lyžařská obuv • malé plachetnice, vodní lyže, surfy, prkna na windsurfing • potřeby a vybavení pro sportovní rybaření včetně podběráků • lovecké potřeby, horolezecká výstroj atd. • kožené sportovní rukavice a sportovní pokrývky hlavy (kromě přileb) • plavecké bazény, brouzdaliště atd. • brusle, kolečkové brusle atd. • luky a kuše • vybavení tělocvičen, fitcenter nebo vybavení pro atletiku N: - výrobu plachet pro plachetnice (13.92) - výrobu sportovních oděvů (14.13) - výrobu sedlářských a brašnářských výrobků (15.12) - výrobu jezdeckých a jiných bičů (15.12) - výrobu sportovní obuvi (15.20) - výrobu sportovních zbraní a střeliva (25.40) - výrobu kovových závaží pro vzpírání (25.99) - výrobu sportovních vozidel kromě saní a podobně (viz oddíly 29 a 30) - stavbu sportovních člunů, plachetnic a jachet (30.12) - výrobu kulečníkových stolů (32.40) - výrobu ucpávek do uší a do nosu (např. na ochranu při plavání, proti hluku) (32.99) - výrobu bezpečnostních pokrývek hlavy (32.99) - opravy sportovních potřeb (95.29) @cs
scope note: Diese Klasse umfasst die Herstellung von Sport- und Athletikgeräten (außer Sportkleidung und Sportschuhen) Diese Klasse umfasst: - Herstellung von Sportgeräten und -ausrüstungen sowie von Geräten und Ausrüstungen für Freiluft- und Hallenspiele aus beliebigem Material: • harte, weiche und aufblasbare Bälle • Schläger aller Art • Skier, Bindungen und Stöcke • Skischuhe •.Segelbrettern und Surfbrettern • Geräte und Ausrüstungen für die Sportfischerei einschließlich Handnetzen • Geräte und Ausrüstungen für Jagd, Bergsteigerei usw. • Sporthandschuhe und Sportkopfbedeckungen aus Leder • Schwimmbecken, Planschbecken usw. • Schlittschuhe, Rollschuhe usw. • Bogen und Armbrüste • Geräte und Ausrüstungen für Turnhallen, Fitnessstudios sowie Leicht- und Schwerathletik Diese Klasse umfasst nicht: - Herstellung von Bootssegeln (s. 13.92) - Herstellung von Sportkleidung (s. 14.19) - Herstellung von Sattlerwaren (s. 15.12) - Herstellung von Reit- und anderen Peitschen (s. 15.12) - Herstellung von Sportschuhen (s. 15.20) - Herstellung von Sportwaffen und -munition (s. 25.40) - Herstellung von Gewichten aus Metall für Gewichtheben (s. 25.99) - Herstellung von Sportfahrzeugen außer Rodelschlitten und dergleichen (s. Abteilungen 29 und 30) - Boots- und Yachtbau (s. 30.12) - Herstellung von Billardtischen (s. 32.40) - Herstellung von Ohr- und Nasenstöpseln (z. B. zum Schutz beim Schwimmen, gegen Lärm) (s. 32.99) - Reparatur von Sportgeräten (s. 95.29) @de
scope note: This class includes the manufacture of sporting and athletic goods (except apparel and footwear). This class includes: - manufacture of articles and equipment for sports, outdoor and indoor games, of any material: • hard, soft and inflatable balls • rackets, bats and clubs • skis, bindings and poles • ski-boots • sailboards and surfboards • requisites for sport fishing, including landing nets • requisites for hunting, mountain climbing etc. • leather sports gloves and sports headgear • basins for swimming and padding pools etc. • ice skates, roller skates etc. • bows and crossbows • gymnasium, fitness centre or athletic equipment This class excludes: - manufacture of boat sails, see 13.92 - manufacture of sports apparel, see 14.19 - manufacture of saddlery and harness, see 15.12 - manufacture of whips and riding crops, see 15.12 - manufacture of sports footwear, see 15.20 - manufacture of sporting weapons and ammunition, see 25.40 - manufacture of metal weights as used for weightlifting, see 25.99 - manufacture of sports vehicles other than toboggans and the like, see divisions 29 and 30 - manufacture of boats, see 30.12 - manufacture of billiard tables, see 32.40 - manufacture of ear and noise plugs (e.g. for swimming and noise protection), see 32.99 - repair of sporting goods, see 95.29 @en
scope note: Esta clase comprende la fabricación de artículos de deporte (excepto prendas de vestir y calzado). Esta clase comprende: - la fabricación de artículos y equipos de deporte, juegos al aire libre y en recintos cerrados, de cualquier material: • pelotas duras, blandas e hinchables • raquetas, bates y palos • esquíes, fijaciones para esquíes y bastones • botas de esquí • tablas de vela y de surf • aparejos para la pesca deportiva, incluidos los salabres • artículos para la caza, la escalada, etc. • guantes y gorros de deporte de cuero • piletas para piscinas, etc. • patines de hielo y de ruedas, etc. • arcos y ballestas • aparatos de gimnasia, musculación y atletismo Esta clase no comprende: - la fabricación de velas para barcos (véase 13.92) - la fabricación de prendas de vestir para la práctica deportiva (véase 14.19) - la fabricación de artículos de guarnicionería y talabartería (véase 15.12) - la fabricación de látigos y fustas (véase 15.12) - la fabricación de calzado (véase 15.20) - la fabricación de armas y munición para la práctica deportiva (véase 25.40) - la fabricación de pesas metálicas como las utilizadas en la halterofilia (véase 25.99) - la fabricación de vehículos deportivos distintos de trineos y artículos similares (véanse las divisiones 29 y 30) - la fabricación de embarcaciones deportivas (véase 30.12) - la fabricación de mesas de billar (véase 32.40) - la fabricación de tapones para los oídos y la nariz (p. ej., para la práctica de la natación y la protección frente a ruidos) (véase 32.99) - la reparación de artículos de deporte (véase 95.29) @es
scope note: Cette classe comprend la fabrication d’articles de sport (à l’exception des articles d’habillement et chaussures). Cette classe comprend: - la fabrication d’articles et de matériels pour les sports et les jeux de plein air et de salle, en tout type de matériau: • balles et ballons durs, mous ou gonflables • raquettes, battes, clubs de golf • skis, fixations et bâtons pour skis • chaussures de ski • planches à voile et planches de surf • articles pour la pêche sportive, y compris les épuisettes • articles pour la chasse, l’alpinisme, etc. • gants et coiffures de sport en cuir • bassins pour piscines, pataugeoires, etc. • patins à glace, patins à roulettes, etc. • arcs et arbalètes • matériel pour gymnases, centres de santé ou d’athlétisme Cette classe ne comprend pas: - la fabrication de voiles pour bateaux, voir 13.92 - la fabrication de vêtements de sport, voir 14.19 - la fabrication d’articles de sellerie et de bourrellerie, voir 15.12 - la fabrication de fouets et de cravaches, voir 15.12 - la fabrication de chaussures de sport, voir 15.20 - la fabrication d’armes et de munitions pour la pratique du tir sportif, voir 25.40 - la fabrication de poids en métal utilisés pour la pratique de l’haltérophilie, voir 25.99 - la fabrication de véhicules de sport, à l’exclusion des toboggans, des luges et similaires, voir divisions 29 et 30 - la fabrication de bateaux, voir 30.12 - la fabrication de tables de billard, voir 32.40 - la fabrication de protections auditives (par exemple: contre le bruit ou pour la pratique de la natation), voir 32.99 - la réparation d’articles de sport, voir 95.29 @fr
scope note: Ovaj razred uključuje proizvodnju sportske i atletske opreme (osim odjeće i obuće). Ovaj razred uključuje: - proizvodnju predmeta i opreme za sport, igre na otvorenom i u zatvorenom prostoru, od bilo kojeg materijala: • tvrdih i mekanih lopti, lopti na napuhavanje • reketa, batina, palica za golf • skija, vezova i štapova • skijaških cipela (pancerica) • dasaka za jedrenje i surfanje • rekvizita za sportski ribolov, uključujući mreže • rekvizita za lov i alpinističko uspinjanje itd. • sportskih rukavica i sportskih pokrivala za glavu od kože • bazena za plivanje (prirodnih) i bazena na punjenje itd. • klizaljki, koturaljki itd. • lukova i strijela • gimnastičke opreme, opreme za fitnes-centre i atletske opreme Ovaj razred isključuje: - proizvodnju jedara za čamce, vidi 13.92 - proizvodnju sportske odjeće, vidi 14.19 - proizvodnju sedlarskih i remenarskih proizvoda, vidi 15.12 - proizvodnju držača za bičeve i štapove, vidi 15.12 - proizvodnju sportske obuće, vidi 15.20 - proizvodnju sportskog oružja i streljiva, vidi 25.40 - proizvodnju metalnih utega koji se koriste za dizanje u sportu, vidi 25.99 - proizvodnju sportskih vozila, osim tobogana i slično, vidi odjeljke 29 i 30 - proizvodnju čamaca, vidi 30.12 - proizvodnju biljarskih stolova, vidi 32.40 - proizvodnju ušnih i nosnih čepova (npr. za bazene i za zaštitu od buke), vidi 32.99 - popravak sportske opreme, vidi 95.29
scope note: Į šią klasę įeina sporto ir atletikos reikmenų gamyba (išskyrus drabužius ir avalynę). Į šią klasę įeina: - sporto, lauko ir kambario žaidimams skirtų daiktų ir įrangos iš bet kurių medžiagų gamyba: • kietų, minkštų ir pripučiamųjų kamuolių • rakečių, kriketo ir beisbolo lazdų, golfo lazdų ir pan. • slidžių, apkaustų ir atramų • slidžių batų • burlenčių ir banglenčių • sportinės žūklės reikmenų, įskaitant graibštukus • medžioklės, alpinizmo ir kt. reikmenų • sportinių odinių pirštinių ir galvos apdangalų • plaukimo ir irklavimo baseinų įrangos ir kt. • pačiūžų, riedučių ir kt. • lankų ir arbaletų • gimnastikos, kūno rengybos centrų ar atletikos įrangos Į šią klasę neįeina: - laivų burių gamyba, žr. 13.92 - sportinių drabužių gamyba, žr. 14.19 - balno reikmenų ir pakinktų gamyba, žr. 15.12 - botagų ir jodinėjimo botago kotų gamyba, žr. 15.12 - sportinės avalynės gamyba, žr. 15.20 - sportinių ginklų ir šaudmenų gamyba, žr. 25.40 - sunkiojoje atletikoje naudojamų metalinių svarmenų gamyba, žr. 25.99 - sportinių transporto priemonių, kitokių negu sportinės rogutės ir kt., gamyba, žr. 29 ir 30 skyrius - valčių gamyba, žr. 30.12 - biliardo stalų gamyba, žr. 32.40 - ausų ir nosies kaištukų (pvz., plaukiojimui ir nosies apsaugai) gamyba, žr. 32.99 - sporto reikmenų taisymas, žr. 95.29 @lt
scope note: Bu sınıf spor ve atletizm ile ilgili malzemelerin imalatını kapsamaktadır (giyim eşyaları ve ayakkabılar hariç). Bu sınıf aşağıdakileri kapsamaktadır; - kapalı ve açık alanlarda yapılan sporlar için herhangi bir malzemeden aletlerin ve donanımların imalatı: • sert, yumuşak ve şişirilebilir toplar, • raketler, beysbol ve kriket gibi oyunlarda kullanılan sopalar ve golf sopaları, • kayaklar, kayak bağlama gereçleri ve batonlar, • kayak ayakkabıları, • rüzgar sörfü ve sörf tahtaları • balık yakalamaya özgü ağ kepçeleri dahil, balıkçılık sporu için gerekli malzemeler, • avcılık, dağcılık vb. için gerekli malzemeler, • deri spor eldivenleri ve spor kaskları (başlıkları), • yüzme havuzları, şişirilebilir çocuk havuzları vb., • buz patenleri, tekerlekli patenler vb. • yaylar ve tatar yayları (arbaletler), • spor salonu, form tutma merkezi veya atletizm ekipmanı Kapsam dışı olanlar; - yelkenli teknelerin imalatı, bkz. 13.92, - spor giysilerinin imalatı, bkz. 14.13, - saraçlık ve koşum takımı imalatı , bkz. 15.12, - kırbaç ile binicilikte kullanılan ürünlerin imalatı, bkz. 15.12, - spor ayakkabıları imalatı, bkz. 15.20, - spor amaçlı silah ve cephane imalatı, bkz. 25.40, - halter sporunda ve ağırlık kaldırmada kullanılan metal ağırlıkların imalatı, bkz. 25.99, - spor taşıtlarının imalatı (kızak ve benzerleri hariç), bkz. bölüm 29 ve 30?, - tekne imalatı, bkz. 30.12, - bilardo masaları imalatı, bkz. 32.40, - kulak ve burun tıkaçlarının imalatı (örn. yüzme ve burnun korunması amacıyla), bkz. 32.99, - spor malzemelerinin onarımı, bkz. 95.29. @tr
preferred label: Производство на спортни стоки @bg
preferred label: Výroba sportovních potřeb @cs
preferred label: Fremstilling af sportsudstyr @da
preferred label: Herstellung von Sportgeräten @de
preferred label: Κατασκευή αθλητικών ειδών @el
preferred label: Fabricación de artículos de deporte @es
preferred label: Sporditarvete tootmine @et
preferred label: Urheiluvälineiden valmistus @fi
preferred label: Fabrication d'articles de sport @fr
preferred label: Sportszergyártás
preferred label: Fabbricazione di articoli sportivi @it
preferred label: Sporto reikmenų gamyba @lt
preferred label: Sporta preču ražošana @lv
preferred label: Manifattura ta' oġġetti ta' l-isport @mt
preferred label: Vervaardiging van sportartikelen @nl
preferred label: Produksjon av sportsartikler @no
preferred label: Produkcja sprzętu sportowego @pl
preferred label: Fabricação de artigos de desporto @pt
preferred label: Fabricarea articolelor pentru sport @ro
preferred label: Производство спортивных товаров @ru
preferred label: Výroba športových potrieb @sk
preferred label: Proizvodnja športne opreme @sl
preferred label: Tillverkning av sportartiklar @sv
preferred label: Spor malzemeleri imalatı @tr
broader: Manufacture of sports goods

Manufacture of games and toys
type: Concept
notation: 32.4
status: valid
status modified: 2013-10-18
accepted date: 2013-10-18
in scheme: Statistical Classification of Economic Activities in the European Community, Rev. 2 (2008)
scope note: Данный класс включает производство лабораторного оборудования, хирургических и медицинских инструментов, хирургических приборов, устройств и принадлежностей, стоматологического оборудования и принадлежностей, ортодонтальных и зубопротезных принадлежностей. Данный класс включает производство медицинской, стоматологической и подобной мебели, дополнительно оснащенной специфическими приспособлениями, такими как специальные гидравлические стоматологические кресла. Этот класс включает: - производство хирургических накидок, стерильных бинтов и салфеток - производство стоматологических наполнителей и цемента (за исключением стоматологических клеящих добавок), стоматологического воска и прочих стоматологических препаратов - производство цемента для восстановления костей - производство зубоврачебных лабораторных печей - производство лабораторного оборудования для ультразвуковой очистки - производство лабораторных стерилизаторов - производство дистилляционных аппаратов лабораторного типа и лабораторных центрифуг - производство медицинской, хирургической, стоматологической или ветеринарной мебели: • операционные столы • столы для осмотра • больничные кровати с механической регулировкой положений • стоматологические кресла - производство костяных пластин и шурупов, шприцов, игл, катетеров, канюль и т.д. - производство стоматологических инструментов (включая стоматологические кресла, в которые встроено стоматологическое оборудование) - производство искусственных зубов, мостов и т.п. в зубоврачебных лабораториях - производство ортопедических приспособлений и протезов - производство стеклянных глаз - производство медицинских термометров - производство офтальмологических товаров, очков для коррекции зрения, солнцезащитных очков, линз по рецепту врача, контактных линз, защитных очков Этот класс исключает: - производство зубопротезных клеящих веществ, см. 20.42 - производство медицинских пропитанных повязок и т.д., см. 21.20 - производство электромедицинского и электротерапевтического… @ru
preferred label: Производство на игри и детски играчки @bg
preferred label: Výroba her a hraček @cs
preferred label: Fremstilling af spil og legetøj @da
preferred label: Herstellung von Spielwaren @de
preferred label: Κατασκευή παιχνιδιών κάθε είδους @el
preferred label: Fabricación de juegos y juguetes @es
preferred label: Mängude ja mänguasjade tootmine @et
preferred label: Pelien ja leikkikalujen valmistus @fi
preferred label: Fabrication de jeux et jouets @fr
preferred label: Játékgyártás
preferred label: Fabbricazione di giochi e giocattoli @it
preferred label: Žaidimų ir žaislų gamyba @lt
preferred label: Spēļu un rotaļlietu ražošana @lv
preferred label: Manifattura ta' logħob u ġugarelli @mt
preferred label: Vervaardiging van spellen en speelgoed @nl
preferred label: Produksjon av spill og leker @no
preferred label: Produkcja gier i zabawek @pl
preferred label: Fabricação de jogos e de brinquedos @pt
preferred label: Fabricarea jocurilor şi jucăriilor @ro
preferred label: Производство игр и игрушек @ru
preferred label: Výroba hier a hračiek @sk
preferred label: Proizvodnja igrač in rekvizitov za igre in zabavo @sl
preferred label: Tillverkning av spel och leksaker @sv
preferred label: Oyun ve oyuncak imalatı @tr
broader: Other manufacturing
narrower: Manufacture of games and toys

Manufacture of games and toys
type: Concept
notation: 32.40
status: valid
status modified: 2013-10-18
accepted date: 2013-10-18
in scheme: Statistical Classification of Economic Activities in the European Community, Rev. 2 (2008)
scope note: Производство на кукли, детски играчки и игри (вкл. електронни), комплекти за сглобяване, детски автомобилчета (с изключение на металните велосипеди и велосипеди на три колела). - производство на кукли и принадлежности за кукли - производство играчки с механизми - производство на играчки животни - производство на играчки - музикални инструменти - производство на карти за игра - производство на картонени игри и подобни игри за маса - производство на електронни игри: шах и други - производство на умалени модели и подобни модели за забавление, играчки за конструиране, електрически влакчета и други - производство на билярди и техните принадлежности, специални маси за хазартни игри, игри, функциониращи чрез вкарване на монети и други - артикули за колективни игри - производство на играчки на колела, управлявани от деца, вкл. пластмасови детски велосипеди с две или три колела - производство на мозайки, картинни мозайки и подобни артикули - производство на видеоигри (използвани с телевизионен приемник или с вграден екран) - 26.40 - производство на велосипеди - 30.92 - производство на изделия за карнавали и празненства - 32.99 - издаване и разработване на софтуер за видеоигри (използвани с телевизионен приемник или с вграден екран) - 58.21, 62.01 @bg
scope note: Tato třída zahrnuje výrobu panenek, hraček a her, včetně elektronických her, zmenšených modelů, stavebnic, dětských vozítek (kromě kovových jízdních kol a tříkolek), hracích automatů na mince a kulečníkových stolů. Z: - výrobu panenek a loutek, jejich oblečení, díly a příslušenství - výrobu hracích figurek - výrobu zvířátek na hraní - výrobu hudebních nástrojů jako hraček - výrobu hracích karet - výrobu deskových a podobných her - výrobu elektronických her s pevně instalovaným (nevyměnitelným) softwarem, např. šachy - výrobu zmenšených modelů v přesném měřítku, elektrických vláčků, stavebnic, stavebnicových sad atd. - výrobu hracích automatů na mince, kulečníkových stolů, speciálních stolů pro kasinové hry atd. - výrobu stolních nebo společenských her pro zábavní parky - výrobu dětských kolových hraček používaných k jízdě, včetně jízdních kol a tříkolek z plastů - výrobu skládanek puzzle a podobných výrobků N: - výrobu konzolí pro videohry (26.40) - výrobu kolotočů, houpaček a podobných vybavení zábavních parků (28.99) - výrobu kovových dětských jízdních kol a tříkolek (30.92) - výrobu karnevalových a žertovných předmětů (32.99) - tvorbu a vydávání softwaru k videohrám (viz 58.21a 62.01) @cs
scope note: Diese Klasse umfasst die Herstellung von Puppen, Spielzeug und Spielen, auch elektronischen, Modellbau- und Bastelkästen und Spielfahrzeuge (ohne Fahrräder und Dreiräder aus Metall). Diese Klasse umfasst: - Herstellung von Puppen, Puppenbekleidung, -teile und –zubehör - Herstellung von Spielfiguren - Herstellung von Spielzeugtieren - Herstellung von Spielzeugmusikinstrumenten - Herstellung von Spielkarten - Herstellung von Brettspielen und ähnlichen Spielen - Herstellung von elektronischen Spielen: Schach usw. - Herstellung von maßstabgetreu verkleinerten Modellen und ähnlichen Hobbymodellen, elektrischen Eisenbahnen, Bausätzen, Baukastenspielzeug usw. - Herstellung von Flippern, Münzspielautomaten, Billardspielen, Glücksspieltischen usw. - Herstellung von Gesellschaftsspielen - Herstellung von Spielfahrzeugen, einschließlich Fahrrädern und Dreirädern aus Kunststoff - Herstellung von Puzzles und ähnlichen Artikeln Diese Klasse umfasst nicht: - Herstellung von Videospielgeräten (s. 26.40) - Herstellung von Fahrrädern (s. 30.92) - Herstellung von Dekorations- und Unterhaltungsartikeln (s. 32.99) - Schreiben und Veröffentlichen von Software für Videospielgeräte (s. 58.21, 62.01) @de
scope note: This class includes the manufacture of dolls, toys and games (including electronic games), scale models and children's vehicles (except metal bicycles and tricycles). This class includes: - manufacture of dolls and doll garments, parts and accessories - manufacture of action figures - manufacture of toy animals - manufacture of toy musical instruments - manufacture of playing cards - manufacture of board games and similar games - manufacture of electronic games: chess etc. - manufacture of reduced-size ("scale") models and similar recreational models, electrical trains, construction sets etc. - manufacture of coin-operated games, billiards, special tables for casino games, etc. - manufacture of articles for funfair, table or parlour games - manufacture of wheeled toys designed to be ridden, including plastic bicycles and tricycles - manufacture of puzzles and similar articles This class excludes: - manufacture of video game consoles, see 26.40 - manufacture of bicycles, see 30.92 - manufacture of articles for jokes and novelties, see 32.99 - writing and publishing of software for video game consoles, see 58.21, 62.01 @en
scope note: Esta clase comprende la fabricación de muñecos, juguetes y juegos (incluidos los juegos electrónicos), maquetas y vehículos para niños (excepto bicicletas y triciclos metálicos). Esta clase comprende: - la fabricación de muñecos y vestidos, componentes y accesorios para muñecos - la fabricación de figuras articuladas - la fabricación de animales de juguete - la fabricación de instrumentos musicales de juguete - la fabricación de naipes - la fabricación de juegos de mesa y similares - la fabricación de juegos electrónicos: ajedrez, etc. - la fabricación de maquetas y modelos a escala reducida similares, trenes eléctricos, juegos de construcción, etc. - la fabricación de juegos accionados con monedas, mesas de billar, mesas de juego de casino, etc. - la fabricación de artículos para juegos de sociedad y juegos de feria - la fabricación de juguetes con ruedas diseñados para montar en ellos, incluidas bicicletas y triciclos de plástico - la fabricación de rompecabezas y artículos similares Esta clase no comprende: - la fabricación de consolas de videojuegos (véase 26.40) - la fabricación de bicicletas (véase 30.92) - la fabricación de artículos de broma y de artículos promocionales y de regalo (véase 32.99) - la programación y edición de juegos para consolas de videojuegos (véanse 58.21 y 62.01) @es
scope note: Cette classe comprend la fabrication de poupées, de jouets et de jeux (y compris électroniques), maquettes et véhicules d’enfant (à l’exception des bicyclettes et des tricycles en métal). Cette classe comprend: - la fabrication de poupées et de vêtements et de pièces et accessoires pour poupées - la fabrication de figurines d’action - la fabrication de jouets représentant des animaux - la fabrication d’instruments de musique jouets - la fabrication de cartes à jouer - la fabrication de jeux de société et de jeux similaires - la fabrication de jeux électroniques: jeux d’échecs, etc. - la fabrication de modèles réduits et de modèles similaires pour le divertissement, de trains électriques, de jeux de construction, etc. - la fabrication de jeux à moteur ou à mouvement, de jeux fonctionnant au moyen de pièces de monnaie, de billards, de tables spéciales pour jeux de casino, etc. - la fabrication d’articles pour jeux de société - la fabrication de jouets à roues conçus pour être montés par les enfants, y compris les bicyclettes et tricycles en plastique - la fabrication de puzzles et d’articles similaires Cette classe ne comprend pas: - la fabrication de consoles de jeux vidéo, voir 26.40 - la fabrication de bicyclettes, voir 30.92 - la fabrication d’articles-surprises et d’autres gadgets, voir 32.99 - l’écriture et l’édition de logiciels pour consoles de jeux vidéo, voir 58.21 et 62.01 @fr
scope note: vaj razred uključuje proizvodnju lutaka, igračaka i igara (uključujući elektroničke), kutija s priborom za hobi te dječjih vozila (osim metalnih bicikla i tricikla). Ovaj razred uključuje: - proizvodnju lutaka i odjeće za lutke i pribor - proizvodnju akcijskih igračaka - proizvodnju igračaka sa životinjskim likovima - proizvodnju glazbenih instrumenata igračaka - proizvodnju igraćih karata - proizvodnju igara na pločama i sličnih vrsta igara - proizvodnju elektroničkih igara: šaha itd. - proizvodnju umanjenih modela (maketa) i sličnih rekreacijskih modela, električnih vlakova, setova za sastavljanje itd. - proizvodnju zabavnih automata, igara na automatima s ubačenim novcem, biljara, specijalnih stolova za kasino-igre itd. - proizvodnju predmeta za lunaparkove, stolne i sobne igre - proizvodnju igračaka s kotačima, za vožnju, uključujući plastične bicikle i tricikle - proizvodnju slagalica itd. Ovaj razred isključuje: - proizvodnju konzola za videoigre, vidi 26.40 - proizvodnju bicikla, vidi 30.92 - proizvodnju predmeta za trikove i šale, vidi 32.99 - pisanje i izdavanje softvera za računalne igre, vidi 58.21, 62.01
scope note: Į šią klasę įeina lėlių, žaislų ir žaidimų (įskaitant elektroninius žaidimus), modelių ir vaikiškų transporto priemonių (išskyrus metalinius dviratukus ir triratukus), gamyba. Į šią klasę įeina: - lėlių ir lėlių drabužėlių, dalių ir priedų gamyba - judančių žaislų gamyba - žaislinių gyvūnų gamyba - žaislinių muzikos instrumentų gamyba - lošimo kortų gamyba - lentos ir panašių žaidimų gamyba - elektroninių žaidimų gamyba: šachmatų ir kt. - sumažintų matmenų modelių ir panašių pramogoms skirtų modelių, elektrinių traukinių, konstravimo rinkinių ir kt., gamyba - moneta įjungiamų žaidimų, biliardų, specialiųjų kazino lošimo stalų ir kt., gamyba - pramogų, stalo ar kambario žaidimų reikmenų gamyba - pasivažinėjimui skirtų ratinių žaislų, įskaitant plastikinius dviračius ir triračius, gamyba - dėlionių ir panašių daiktų gamyba Į šią klasę neįeina: - kompiuterinių žaidimų pultų gamyba, žr. 26.40 - dviračių gamyba, žr. 30.92 - reikmenų pokštams krėsti ir smulkių daiktų dovanėlėms gamyba, žr. 32.99 - kompiuterinių žaidimų programinės įrangos kūrimas ir leidyba, žr. 58.21, 62.01 @lt
scope note: Bu sınıf, oyuncak bebekler, oyuncaklar, oyunlar (elektronik olanlar dahil), ölçekli modeller ve oyuncak arabaların (metal olan bisikletler ve üç tekerlekli bisikletler hariç) imalatını kapsamaktadır. Bu sınıf aşağıdakileri kapsamaktadır; - oyuncak bebeklerin, oyuncak bebek elbiseleri, parça ve aksesuarlarının imalatı, - hareket ettirilebilen oyuncak bebeklerin imalatı, - oyuncak hayvanların imalatı, - oyuncak müzik aletlerinin imalatı, - oyun kartlarının imalatı, - oyun tahtaları (satranç, dart, tavla tahtaları vb.) ile benzer oyunların imalatı, - elektronik oyunların imalatı: satranç vb., - elektrikli trenlerin, inşaat setlerinin vb.nin küçültülmüş boyutlu (ölçekli) modellerinin ve benzer eğlence kabilinden modellerin imalatı, - bozuk para ya da jeton ile çalışan oyun masaları, bilardo masaları, kumarhaneler için özel olarak tasarlanmış oyun masaları ve benzerlerinin imalatı, - lunapark, masa ve salon oyunları için gereçlerin imalatı, -binmek için tasarlanmış tekerlekli oyuncakların imalatı (plastik bisikletler ve üç tekerlekli bisikletler dahil) - yap boz (puzzle) ve benzeri ürünlerin imalatı. Kapsam dışı olanlar; - video oyun konsollarının imalatı, bkz. 26.40, - bisikletlerin imalatı, bkz. 30.92, - şaka ve benzeri eşyaların imalatı, bkz. 32.99, - video oyunu konsolları için program yazılması ve yayınlanması, bkz. 58.21, 62.01. @tr
preferred label: Производство на игри и детски играчки @bg
preferred label: Výroba her a hraček @cs
preferred label: Fremstilling af spil og legetøj @da
preferred label: Herstellung von Spielwaren @de
preferred label: Κατασκευή παιχνιδιών κάθε είδους @el
preferred label: Fabricación de juegos y juguetes @es
preferred label: Mängude ja mänguasjade tootmine @et
preferred label: Pelien ja leikkikalujen valmistus @fi
preferred label: Fabrication de jeux et jouets @fr
preferred label: Játékgyártás
preferred label: Fabbricazione di giochi e giocattoli @it
preferred label: Žaidimų ir žaislų gamyba @lt
preferred label: Spēļu un rotaļlietu ražošana @lv
preferred label: Manifattura ta' logħob u ġugarelli @mt
preferred label: Vervaardiging van spellen en speelgoed @nl
preferred label: Produksjon av spill og leker @no
preferred label: Produkcja gier i zabawek @pl
preferred label: Fabricação de jogos e de brinquedos @pt
preferred label: Fabricarea jocurilor şi jucăriilor @ro
preferred label: Производство игр и игрушек @ru
preferred label: Výroba hier a hračiek @sk
preferred label: Proizvodnja igrač in rekvizitov za igre in zabavo @sl
preferred label: Tillverkning av spel och leksaker @sv
preferred label: Oyun ve oyuncak imalatı @tr
broader: Manufacture of games and toys

Manufacture of medical and dental instruments and supplies
type: Concept
notation: 32.5
status: valid
status modified: 2013-10-18
accepted date: 2013-10-18
in scheme: Statistical Classification of Economic Activities in the European Community, Rev. 2 (2008)
scope note: Этот класс включает: - производство метел, кистей и щеток, включая щетки, являющиеся составными частями машин, ручных механических щеток для пола, швабр, метелок из перьев, малярных кистей, малярных валиков, резиновых скребков, прочих метел, щеток и т.п. - производство щеток для одежды и обуви @ru
preferred label: Производство на медицински и зъболекарски инструменти и средства @bg
preferred label: Výroba lékařských a dentálních nástrojů a potřeb @cs
preferred label: Fremstilling af medicinske og dentale instrumenter samt udstyr hertil @da
preferred label: Herstellung von medizinischen und zahnmedizinischen Apparaten und Materialien @de
preferred label: Κατασκευή ιατρικών και οδοντιατρικών οργάνων και προμηθειών @el
preferred label: Fabricación de instrumentos y suministros médicos y odontológicos @es
preferred label: Meditsiini- ja hambaraviinstrumentide ning materjalide tootmine @et
preferred label: Lääkintä- ja hammaslääkintäinstrumenttien ja -tarvikkeiden valmistus @fi
preferred label: Fabrication d'instruments et de fournitures à usage médical et dentaire @fr
preferred label: Orvosi eszköz gyártása
preferred label: Fabbricazione di strumenti e forniture mediche e dentistiche @it
preferred label: Medicinos ir odontologijos prietaisų, instrumentų ir reikmenų gamyba @lt
preferred label: Medicīnas un zobārstniecības instrumentu un piederumu ražošana @lv
preferred label: Manifattura ta' strumenti u provvisti mediċi u tad-dentistrija @mt
preferred label: Vervaardiging van medische en tandheelkundige instrumenten en benodigdheden @nl
preferred label: Produksjon av medisinske og tanntekniske instrumenter og utstyr @no
preferred label: Produkcja urządzeń, instrumentów i wyrobów medycznych i dentystycznych @pl
preferred label: Fabricação de instrumentos e material medico-cirúrgico @pt
preferred label: Fabricarea de dispozitive, aparate şi instrumente medicale şi stomatologice @ro
preferred label: Производство медицинских и стоматологических инструментов и принадлежностей @ru
preferred label: Výroba lekárskych a dentálnych nástrojov a potrieb @sk
preferred label: Proizvodnja medicinskih instrumentov, naprav in pripomočkov @sl
preferred label: Tillverkning av medicinsk och dental utrustning @sv
preferred label: Tıbbi ve dişçiliğe ait araç ve gereçlerin imalatı @tr
broader: Other manufacturing
narrower: Manufacture of medical and dental instruments and supplies

Manufacture of medical and dental instruments and supplies
type: Concept
notation: 32.50
status: valid
status modified: 2013-10-18
accepted date: 2013-10-18
in scheme: Statistical Classification of Economic Activities in the European Community, Rev. 2 (2008)
scope note: Производство на лабораторни уреди и апарати, хирургически, медицински и зъболекарски инструменти и апарати, апарати и артикули за оротопедия и ортодонтия. Производство на мебелировка за медицински, хирургически, зъболекарски или ветеринарни кабинети и зали, където допълнителните специфични функции на продукта определят неговото предназначение (например зъболекарски столове с вграденена хидравлична система). - производство на хирургически стерилни покривки за операции, хирургически тъкани и подобни стерилни конци (без катгути) - производство на зъболекарски цимент и други препарати за зъбни пломби (без прахове и пасти, улесняващи прилепването на зъбни протези); състави, наречени „зъболекарски восъци“ и други зъболекарски състави на базата на гипс - производство на цимент за възстановяване на костите - производство на пещи за зъботехнически лаборатории - производство на лабораторни машини за почистване с ултразвук - производство на лабораторни стерилизатори - производство на лабораторни центрофуги и апарати за дестилация - производство на мебелировка за медицински, хирургически, зъболекарски или ветеринарни кабинети и зали като: • операционни маси • легла за прегледи • болнични легла с механизми • зъболекарски столове - производство на планки и болтове, които остават постоянно в организма (например за да заместят част от кост или цяла кост), спринцовки, игли, катетри, канюли, тръбички и други - производство на инструменти и апарати за зъболечение (вкл. зъболекарските столове с вградени зъболекарски апарати) - изработване в зъботехнически лаборатории на изкуствени зъби, мостове и други - изработване на артикули и апарати за ортопедия или за фрактури - изработване на стъклени изкуствени очи за очно протезиране - производство на медицински термометри - производство на офталмологични стоки - слънчеви очила, очила, стъкла за очила, изработени по лекарско предписание, контактни лещи, защитни очила - производство на ортопедични обувки - производство на прахове и пасти, улесн… @bg
scope note: Tato třída zahrnuje výrobu laboratorních, chirurgických, zdravotnických a dentálních přístrojů a nástrojů, zařízení a pomůcek; výrobu ortodontických pomůcek, zubních náhrad a rovnátek. Zahrnuje také výrobu lékařského, dentálního a podobného nábytku, u něhož přídavné funkce určují účel využití, např. hydraulické funkce zubařského křesla. Z: - výrobu chirurgických roušek a sterilního šicího materiálu a sterilních tkanin - výrobu cementu pro zubní výplně (kromě fixačních prostředků pro zubní náhrady), zubního vosku a jiných dentálních technických formovacích a modelovacích materiálů - výrobu cementu pro kostní rekonstrukce - výrobu pecí pro zubní laboratoře - výrobu laboratorních ultrazvukových čisticích přístrojů - výrobu laboratorních sterilizačních přístrojů - výrobu laboratorních destilačních přístrojů a odstředivek - výrobu nábytku a vybavení lékařských a zubních ošetřoven, operačních sálů a prostor, veterinárních pracovišť: • operační stoly • stoly určené pro vyšetření • nemocniční postele s mechanickým zařízením • zubařská křesla - výrobu kostních destiček a šroubů, injekčních stříkaček, jehel, katétrů, kanyl atd. - výrobu dentálních nástrojů a přístrojů (včetně zubařských křesel s vestavěnými přístroji) - výrobu umělých zubů, můstků atd. v zubních laboratořích - výrobu ortopedických a protetických pomůcek - výrobu skleněných očí - výrobu lékařských teploměrů - výrobu výrobků pro oční lékařství, např. brýlových a slunečních skel, skel broušených dle lékařského předpisu, kontaktních čoček, ochranných brýlí N: - výrobu dentálních fixačních přípravků (20.42) - výrobu impregnované zdravotnické vaty, gázy a obvazů (21.20) - výrobu elektroléčebných a elektroterapeutických přístrojů (26.60) - výrobu kolečkových křesel a jiných vozítek pro postižené (30.92) - činnosti optiků (47.78) @cs
scope note: Diese Klasse umfasst die Herstellung von Laborgeräten, medizinischen und chirurgischen Instrumenten, chirurgischen Apparaten und Geräten, zahnmedizinischen Apparaten und Geräten, kieferorthopädischen Erzeugnissen, Zahnersatz und Zahnspangen. Sie umfasst auch die Herstellung von medizinischen, zahnmedizinischen und ähnlichen Möbeln, bei denen Zusatzfunktionen den Zweck des Möbels bestimmen, beispielsweise Zahnarztstühle mit eingebauter hydraulischer Funktion. Diese Klasse umfasst: - Herstellung von chirurgischen Abdecktüchern sowie sterilem Nahtmaterial und Gewebe - Herstellung von Zahnfüllungen und Zahnzement (außer Haftmitteln für Zahnersatz), Zahnwachs und andere zahntechnischen Modelliermassen - Herstellung von Knochenzement - Herstellung von zahnmedizinischen Laboröfen - Herstellung von Ultraschallreinigungsgeräten für Laboratorien - Herstellung von Laborsterilisiergeräten - Herstellung von Destilliergeräte und Zentrifugen für Laboratorien - Herstellung von Waren für die Einrichtung und Ausstattung von medizinischen, zahnmedizinischen oder veterinärmedizinischen Behandlungsräumen: • Operationstische • Untersuchungstische • Krankenhausbetten mit mechanischer Ausrüstung • Zahnarztstühle - Herstellung von Knochenplatten und –schrauben, Spritzen, Nadeln, Katheter, Kanülen usw. - Herstellung von zahnmedizinischen Apparaten (einschließlich Zahnarztstühle mit eingebauten zahnmedizinische Apparaten und Geräten) - Herstellung künstliche Zähne, Brücken usw. in Zahnlaboratorien - Herstellung von orthopädischen Artikeln und Prothesen - Herstellung von Glasaugen - Herstellung von medizinischen Thermometern - Herstellung von augenoptischen Erzeugnissen, wie Brillengläser, Sonnengläser, nach Verschreibung geschliffene Gläser, Kontaktlinsen, Schutzbrillen Diese Klasse umfasst nicht: - Herstellung von Haftmitteln für Zahnersatz (s. 20.42) - Herstellung von imprägnierter medizinischer Watte und Verbandszeug (s. 21.20) - Herstellung von Elektrotherapiegeräten und elektromedizinisc… @de
scope note: This class includes the manufacture of laboratory apparatus, surgical and medical instruments, surgical appliances and supplies, dental equipment and supplies, orthodontic goods, dentures and orthodontic appliances. Included is the manufacture of medical, dental and similar furniture, where the additional specific functions determine the purpose of the product, such as dentist's chairs with built-in hydraulic functions. This class includes: - manufacture of surgical drapes and sterile string and tissue - manufacture of dental fillings and cements (except denture adhesives), dental wax and other dental plaster preparations - manufacture of bone reconstruction cements - manufacture of dental laboratory furnaces - manufacture of laboratory ultrasonic cleaning machinery - manufacture of laboratory sterilisers - manufacture of laboratory type distilling apparatus, laboratory centrifuges - manufacture of medical, surgical, dental or veterinary furniture, such as: • operating tables • examination tables • hospital beds with mechanical fittings • dentists' chairs - manufacture of bone plates and screws, syringes, needles, catheters, cannulae, etc. - manufacture of dental instruments (including dentists' chairs incorporating dental equipment) - manufacture of artificial teeth, bridges, etc., made in dental labs - manufacture of orthopedic and prosthetic devices - manufacture of glass eyes - manufacture of medical thermometers - manufacture of ophthalmic goods, eyeglasses, sunglasses, lenses ground to prescription, contact lenses, safety goggles This class excludes: - manufacture of denture adhesives, see 20.42 - manufacture of medical impregnated wadding, dressings etc., see 21.20 - manufacture of electromedical and electrotherapeutic equipment, see 26.60 - manufacture of wheelchairs, see 30.92 - activities of opticians, see 47.78 @en
scope note: Esta clase comprende la fabricación de aparatos de laboratorio, instrumental quirúrgico y médico, aparatos y suministros quirúrgicos, equipos y suministros para odontología, artículos y aparatos de ortodoncia, y dentaduras postizas. También está incluida la fabricación de mobiliario de uso médico, odontológico y similares, en los que las funcionalidades específicas añadidas determinan su uso, como las sillas de dentista que incorporan funcionalidades hidráulicas. Esta clase comprende: - la fabricación de sábanas quirúrgicas e hilos y gasas estériles - la fabricación de productos de obturación dental y cemento dental (excepto adhesivos para dentaduras postizas), cera dental y otros preparados de yeso dental - la fabricación de cementos para la reconstrucción de huesos - la fabricación de hornos de laboratorio dental - la fabricación de equipos de limpieza por ultrasonido de laboratorio - la fabricación de esterilizadores de laboratorio - la fabricación de aparatos de destilación y centrifugadoras de laboratorio - la fabricación de mobiliario de uso médico, quirúrgico, odontológico o veterinario, como por ejemplo: · mesas de operaciones · mesas de reconocimiento · camas hospitalarias con accesorios mecánicos · sillas de dentista - la fabricación de placas y tornillos para huesos, jeringas, agujas, catéteres, cánulas, etc. - la fabricación de instrumental odontológico (incluidas sillas de dentista que incorporan equipo odontológico) - la fabricación de piezas dentales artificiales, puentes, etc. realizada en laboratorios odontológicos - la fabricación de aparatos ortopédicos y prótesis - la fabricación de ojos de cristal - la fabricación de termómetros médicos - la fabricación de artículos oftálmicos, gafas, gafas de sol, lentillas graduadas, lentes de contacto, gafas de seguridad Esta clase no comprende: - la fabricación de adhesivos para dentaduras (véase 20.42) - la fabricación de algodón, vendajes y similares impregnados con medicamentos (véase 21.20) - la fabricac… @es
scope note: Cette classe comprend la fabrication d’appareils de laboratoire, d’instruments chirurgicaux et médicaux, d’instruments et d’appareils nécessaires à l’exercice de l’art dentaire, de dentiers, d’articles et d’appareils nécessaires à la pratique de l’orthodontie. La fabrication de mobilier pour la médecine, l’art dentaire ou les activités similaires, dont les fonctions spécifiques déterminent la finalité du produit, telles que les fauteuils de dentiste avec fonctions hydrauliques intégrées. Cette classe comprend: - la fabrication de champs opératoires et de fils et compresses stériles - la fabrication de produits d’obturation dentaire et de ciments dentaires (à l’exception des préparations destinées à faciliter l’adhérence des dentiers), de cire dentaire et d’autres préparations à base de plâtre dentaire - la fabrication de ciments pour la réfection osseuse - la fabrication de fours de laboratoires dentaires - la fabrication d’appareils de nettoyage par ultrasons destinés à un usage en laboratoire - la fabrication de stérilisateurs de laboratoires - la fabrication d’équipements de distillation de laboratoire, de centrifugeuses de laboratoire - la fabrication de mobilier pour la médecine, la chirurgie, l’art dentaire ou l’art vétérinaire, tel que: • tables d’opération • tables d’examen • lits à mécanismes pour usages cliniques • fauteuils de dentistes - la fabrication de plaques et de vis pour la fixation des os, de seringues, d’aiguilles, de cathéters, de canules, etc. - la fabrication d’instruments nécessaires à l’exercice de l’art dentaire (y compris les fauteuils de dentistes incorporant des appareils pour l’art dentaire) - la production de dents artificielles, bridges etc., fabriqués en laboratoires dentaires - la fabrication de matériel orthopédique et prothétique - la fabrication d’yeux artificiels - la fabrication de thermomètres médicaux - la fabrication d’articles ophtalmologiques, lunettes correctrices, lunettes de soleil, lentilles sur prescription, verres d… @fr
scope note: Ovaj razred uključuje laboratorijske aparate i namještaj, kirurške i medicinske instrumente, stomatološku opremu i pomagala, ortodontska pomagala, zubala i ortodontski pribor. Uključena je proizvodnja medicinskog, stomatološkog i sličnog namještaja, pri čemu dopunske funkcije određuju svrhu proizvoda, na primjer zubarska stolica izrađena s hidrauličnom funkcijom. Ovaj razred uključuje: - proizvodnju kirurških ogrtača, sterilnih vrpci i tkanina - proizvodnju stomatološkog punila i cementa (osim stomatološkog ljepila ili cementa), stomatološkog voska i ostalih stomatoloških gipsanih pripravaka - proizvodnju cementa za rekonstrukciju kostiju - proizvodnju stomatoloških laboratorijskih peći - proizvodnju laboratorijskih ultrazvučnih uređaja za čišćenje - proizvodnju laboratorijskih sterilizatora - proizvodnju medicinskog, kirurškog, stomatološkog i veterinarskog namještaja kao što su: • stolovi za operacije • stolovi za pregled • bolnički kreveti s mehaničkim podešavanjima • zubarske stolice - proizvodnju pločica i šarafa koji se ugrađuju u slučaju prijeloma kostiju, šprica za injekcije, igala, katetera, kanila itd. - proizvodnju stomatoloških instrumenata (uključujući zubarske stolice kao dio zubarske opreme) - proizvodnju umjetnih zubiju, mostova itd., izrađenih u zubotehničkim laboratorijima - proizvodnju ortopedskih i protetičkih naprava - proizvodnju staklenih očiju - proizvodnju medicinskih termometara - proizvodnju oftalmoloških proizvoda, naočala, sunčanih naočala, leća izrađenih po receptu, kontaktnih leća, naočala za zaštitu - proizvodnju aparata za destiliranje, laboratorijskih centrifuga Ovaj razred isključuje: - proizvodnju ljepila za zubne proteze, vidi 20.42 - proizvodnju medicinski impregniranog punjenja, odjeće itd., vidi 21.20 - proizvodnju elektromedicinske i elektroterapeutske opreme, vidi 26.60 - proizvodnju invalidskih kolica, vidi 30.92 - djelatnosti optičara, vidi 47.78
scope note: Į šią klasę įeina laboratorinių aparatų, chirurginių ir medicininių instrumentų, chirurginių prietaisų ir medžiagų, odontologinės įrangos ir medžiagų, ortodontinių gaminių, dantų protezų ir ortodontinių prietaisų gamyba. Į šią klasę taip pat įeina medicininių, odontologinių ir panašių baldų gamyba, kurių papildomos specifinės funkcijos sąlygoja produktų, tokių kaip odontologinės kėdės su įrengtomis hidraulinėmis funkcijomis, paskirtį. Į šią klasę įeina: - chirurginių apklotų, sterilių raiščių ir audinių gamyba - odontologinių užpildų ir cementų (išskyrus dantų protezų klijus), dantų vaško ir kitų dantų gipso mišinių gamyba - cemento kaulams atkurti gamyba - odontologinių laboratorinių krosnių gamyba - laboratorinių ultragarsinių valymo mašinų gamyba - laboratorinių sterilizatorių gamyba - laboratorinių distiliavimo aparatų, laboratorinių centrifūgų gamyba - medicininių, chirurginių, odontologinių ir veterinarijos baldų gamyba, tokių kaip: • operacinių stalų • apžiūrėjimo stalų • ligoninių lovų su mechaniniais įtaisais • odontologinių kėdžių - kaulų plokštelių ir varžtų, švirkštų, adatų, kateterių, kaniulių ir kt., gamyba - odontologinių instrumentų (įskaitant odontologines kėdes su įmontuota odontologine įranga) gamyba - odontologinėse laboratorijose gaminamų dirbtinių dantų, tiltelių ir kt., gamyba - ortopedijos ir protezavimo įrangos gamyba - stiklinių akių gamyba - medicininių termometrų gamyba - okulistų reikmenų, akinių, akinių nuo saulės, korekcinių lęšių, kontaktinių lęšių, apsauginių akinių gamyba Į šią klasę neįeina: - odontologinių klijų gamyba, žr. 20.42 - įmirkytos vatos, tvarsliavos ir kt. gamyba, žr. 21.20 - elektromedicinos ir elektroterapijos įrangos gamyba, žr.26.60 - invalidų vežimėlių gamyba, žr. 30.92 - optikų veikla, žr. 47.78 @lt
scope note: Этот класс включает: - производство предохранительных средств защиты • производство огнестойкой и защитной одежды • ремней для линейных монтеров и прочих ремней для профессионального использования • производство пробковых средств защиты • производство касок из твердого пластика и прочих пластиковых принадлежностей для обеспечения личной безопасности (например, атлетических шлемов) • производство пожарных костюмов • производство металлических защитных головных уборов и прочих металлических принадлежностей для обеспечения личной безопасности • производство приспособлений для предохранения носа и ушей от попадания инородных предметов и жидкостей (например, для купания и защиты от шума) • производство противогазов - производство механических и других ручек и карандашей всех видов - производство карандашных грифелей - производство штампов и печатей всех видов, ручных печатных устройств и устройств для тиснения ярлыков, этикеток и бирок, ручных печатных устройств, готовых лент для пишущих машинок и штемпельных подушечек - производство глобусов - производство зонтов, солнцезащитных зонтов, тростей, палок - производство пуговиц, застежек-«молний», кнопок и застежек - производство зажигалок - производство изделий персонального использования: курительных трубок, расчесок, заколок для волос, пульверизаторов, термосов и прочих вакуумных сосудов для персонального или бытового использования, а также париков, накладных бород и бровей - производство различных предметов: свечей разных форм и т.п.; искусственных цветов, фруктов и листвы; мелких дешевых предметов; ручных сит, подушек для иголок; портновских манекенов; похоронных гробов и т.д. - производство цветочных корзин, букетов, венков, гирлянд и подобных изделий - набивку чучел Этот класс исключает: - производство фитилей,, см. 13.96 - производство спецодежды (например, лабораторных комбинезонов и спецодежды), см. 14.12 - производство мелких бумажных предметов, см. 17.29 @ru
scope note: Bu sınıf, laboratuar aletleri, tıbbi ve cerrahi aletler, cerrahi araç ve gereçler, dişçilikle ilgili araç ve gereçler, ortodonti ürünleri, takma dişler (protezler) ve ortodonti aletlerinin imalatını kapsamaktadır. Hidrolik işlevi olan dişçilik koltukları gibi spesifik amaçlı tıbbi, dişçilik ve benzer mobilyaların imalatı da bu sınıfta kapsanmaktadır. Bu sınıf aşağıdakileri kapsamaktadır; - cerrahi kumaş ile steril iplik ve bez imalatı, - dişçilikte kullanılan dolguların ve çimentoların (diş tedavisinde kullanılan tutkallar hariç), dişçilik mumlarının ve diş tedavisinde kullanılan diğer alçıların imalatı, - kemik çimentosu imalatı, - dişçilik laboratuar fırınlarının imalatı, - laboratuar ultrasonik temizleme makinelerinin imalatı, - laboratuar steril cihazları imalatı, - laboratuar tipi damıtma aletleri, laboratuar santrifüj makinelerinin imalatı, - tıbbi, cerrahi, dişçilik veya veterinerlikte kullanılan mobilyaların imalatı • ameliyat masaları • tetkik masaları • mekanik ayarlanabilen hastane yatakları • dişçi koltukları - kemik destekleyicileri ve vidaları, şırıngalar, iğneler sondalar, kanül (vücuttan su çekmeye ya da vücuda ilaç zerk etmeye yarayan tüp ve borular) vb. imalatı, - dişçilik aletlerinin imalatı (dişçilik donanımı ile birleştirilmiş dişçi koltukları dahil), - diş laboratuarlarında yapılan protez dişlerin, köprülerin vb. imalatı, - ortopedik ürünlerin ve protezlerin imalatı, - gözlük camlarının imalatı, - tıbbi termometrelerin imalatı, - göz tedavisi ile ilgili eşyaların, gözlüklerin, güneş gözlüklerinin, dereceli lenslerin, kontak lenslerin, dayanıklı camdan spor, koruma vb. gözlüklerin imalatı. Kapsam dışı olanlar; - dişçilikte kullanılan yapıştırıcıların imalatı, bkz. 20.42, - tıbbi olarak hazırlanmış pansuman pamuğu, sargı bezi ve benzerlerinin imalatı, bkz. 21.20, - elektro medikal ve elektroterapik donanımların imalatı, bkz. 26.60, - tekerlekli sandalyelerin imalatı, bkz. 30.92, - gözlükçülerin faaliyetleri, bkz. 47.78 @tr
preferred label: Производство на медицински и зъболекарски инструменти и средства @bg
preferred label: Výroba lékařských a dentálních nástrojů a potřeb @cs
preferred label: Fremstilling af medicinske og dentale instrumenter samt udstyr hertil @da
preferred label: Herstellung von medizinischen und zahnmedizinischen Apparaten und Materialien @de
preferred label: Κατασκευή ιατρικών και οδοντιατρικών οργάνων και προμηθειών @el
preferred label: Fabricación de instrumentos y suministros médicos y odontológicos @es
preferred label: Meditsiini- ja hambaraviinstrumentide ning materjalide tootmine @et
preferred label: Lääkintä- ja hammaslääkintäinstrumenttien ja -tarvikkeiden valmistus @fi
preferred label: Fabrication d'instruments et de fournitures à usage médical et dentaire @fr
preferred label: Orvosi eszköz gyártása
preferred label: Fabbricazione di strumenti e forniture mediche e dentistiche @it
preferred label: Medicinos ir odontologijos prietaisų, instrumentų ir reikmenų gamyba @lt
preferred label: Medicīnas un zobārstniecības instrumentu un piederumu ražošana @lv
preferred label: Manifattura ta' strumenti u provvisti mediċi u tad-dentistrija @mt
preferred label: Vervaardiging van medische en tandheelkundige instrumenten en benodigdheden @nl
preferred label: Produksjon av medisinske og tanntekniske instrumenter og utstyr @no
preferred label: Produkcja urządzeń, instrumentów i wyrobów medycznych i dentystycznych @pl
preferred label: Fabricação de instrumentos e material médico-cirúrgico @pt
preferred label: Fabricarea de dispozitive, aparate şi instrumente medicale stomatologice @ro
preferred label: Производство медицинских и стоматологических инструментов и принадлежностей @ru
preferred label: Výroba lekárskych a dentálnych nástrojov a potrieb @sk
preferred label: Proizvodnja medicinskih instrumentov, naprav in pripomočkov @sl
preferred label: Tillverkning av medicinsk och dental utrustning @sv
preferred label: Tıbbi ve dişçiliğe ait araç ve gereçlerin imalatı @tr
broader: Manufacture of medical and dental instruments and supplies

Manufacturing n.e.c.
type: Concept
notation: 32.9
status: valid
status modified: 2013-10-18
accepted date: 2013-10-18
in scheme: Statistical Classification of Economic Activities in the European Community, Rev. 2 (2008)
scope note: Данный раздел включает специализированный ремонт товаров, относящихся к производственному сектору, с целью дальнейшей реконструкции оборудования и приведения прочей продукции в рабочее состояние. Плановый технический уход и обслуживание (то есть обслуживание и ремонт) подобной продукции требуются для повышения производительности оборудования и зачастую, предохраняет оборудование от преждевременного ремонта. Данный раздел включает не только специализированный ремонт, технический уход и обслуживание оборудования. В значительной степени ремонт также выполняют производители оборудования и других товаров, и в этом случае предметы классифицируются, исходя из принципа добавленной стоимости, вследствие чего такая смешанная деятельность часто присваивается производству товара. По тем же самым принципам классифицированы торговля и ремонт. Реконструкция техники или оборудования отнесена к производственной деятельности и включена в прочие разделы данной секции. Ремонт, технический уход и обслуживание товаров для потребителей, подразумевают ремонт, технический уход и обслуживание бытовых приборов (например, ремонт мебели и предметов домашнего обихода (см. 95.24)). Данный раздел также включает специализированную установку оборудования. Однако установка оборудования, составляющего интегральную часть зданий или подобных структур, такая как, установка электрической проводки, эскалаторов и систем воздушного кондиционирования, отнесена в раздел строительства. Этот раздел исключает: - чистку производственного оборудования, см. 81.22 - ремонт, технический уход и обслуживание компьютеров и коммуникационного оборудования, см. 95.1 - ремонт, технический уход и обслуживание бытовых товаров, см. 95.2 @ru
preferred label: Разнообразни производства, некласифицирани другаде @bg
preferred label: Zpracovatelský průmysl j. n @cs
preferred label: Fremstillingsvirksomhed i.a.n. @da
preferred label: Herstellung von Erzeugnissen a. n. g. @de
preferred label: Μεταποιητικές δραστηριότητες π.δ.κ.α. @el
preferred label: Industrias manufactureras n.c.o.p. @es
preferred label: Mujal liigitamata tootmine @et
preferred label: Muualla luokittelematon valmistus @fi
preferred label: Activités manufacturières n.c.a. @fr
preferred label: M.n.s. egyéb feldolgozóipari tevékenység
preferred label: Industrie manifatturiere n.c.a. @it
preferred label: Niekur kitur nepriskirta gamyba @lt
preferred label: Citur neklasificēta ražošana @lv
preferred label: Manifattura, n.e.c. @mt
preferred label: Industrie, n.e.g. @nl
preferred label: Industriproduksjon ikke nevnt annet sted @no
preferred label: Produkcja wyrobów, gdzie indziej niesklasyfikowana @pl
preferred label: Indústrias transformadoras, n.e. @pt
preferred label: Alte activităţi industriale @ro
preferred label: Производство прочих готовых изделий, не включенных в другие категории @ru
preferred label: Výroba i. n. @sk
preferred label: Druge predelovalne dejavnosti @sl
preferred label: Övrig tillverkning @sv
preferred label: Başka yerde sınıflandırılmamış imalatlar @tr
broader: Other manufacturing
narrower: Manufacture of brooms and brushes
narrower: Other manufacturing n.e.c.

Manufacture of brooms and brushes
type: Concept
notation: 32.91
status: valid
status modified: 2013-10-18
accepted date: 2013-10-18
in scheme: Statistical Classification of Economic Activities in the European Community, Rev. 2 (2008)
scope note: - производство на четки (вкл. четки, представляващи части от машини), метли и ръчни механични подочистачки, метлички от пера, готови глави за четкарски артикули, четки за рисуване, бояджийски тампони и валяци (мечета), четки и метли-четки за почистване на повърхности или за домакинството - производство на четки за облекла или обувки @bg
scope note: Z: - výrobu košťat, kartáčů a štětců včetně těch, které jsou díly strojů, ručních mechanických smetáků, mopů a oprašovačů, malířských štětců, polštářků a válečků, pryžových stěrek atd. - výrobu kartáčů na obuv a oděv - výrobu kartáčků na zuby, kartáčů na vlasy a jiných toaletních kartáčnických výrobků @cs
scope note: Diese Klasse umfasst: - Herstellung von Besen, Bürsten und Pinseln einschließlich solcher, die Teile von Maschinen sind, handbetriebenen mechanischen Fußbodenkehrern, Mopps und Staubwedeln, Pinseln, Kissen und Rollen zum Anstreichen, Gummiwischern und -schrubbern usw. - Herstellung von Schuh- und Kleiderbürsten @de
scope note: This class includes: - manufacture of brooms and brushes, including brushes constituting parts of machines, hand-operated mechanical floor sweepers, mops and feather dusters, paint brushes, paint pads and rollers, squeegees and other brushes, brooms, mops etc. - manufacture of shoe and clothes brushes @en
scope note: Esta clase comprende: - la fabricación de escobas, brochas y cepillos (incluidas las escobillas que constituyen elementos de maquinaria), barredoras de suelo mecánicas para operación manual, fregonas, plumeros, brochas, rodillos para pintar, escobillas limpiacristales de caucho y otros cepillos, escobas, mopas, etc. - la fabricación de cepillos para la ropa y el calzado @es
scope note: Cette classe comprend: - la fabrication de balais, de pinceaux et de brosses, même constituant des parties de machines, de balais mécaniques pour emploi à la main, de balais à franges et de plumeaux, de brosses et de pinceaux à peindre, de rouleaux et de tampons à peindre, de raclettes en caoutchouc et d’autres brosses, balais, balayettes, etc. - la fabrication de brosses à habits et à chaussures @fr
scope note: Ovaj razred uključuje: - proizvodnju metli i četaka, uključujući one koje čine sastavni dio strojeva, ručnih mehaničkih naprava za čišćenje podova, četaka s resama, peruški, ličilačkih valjaka, brisača sa spužvastom glavom za pranje podova i drugih četaka, metli itd. - proizvodnju četaka za obuću i odjeću
scope note: Į šią klasę įeina: - šluotų ir šepečių, įskaitant šepečius, kaip sudėtines mašinų dalis, ranka valdomų mechaninių grindų valymo šepečių, plaušinių šluotų ir plunksninių dulkių šluotų, dažymo šepečių, dažymo padėklų ir volelių, drėgmės šalinimo volelių ir kitų šepečių, šluotų, plaušinių šluotų ir kt., gamyba - batų ir drabužių šepečių gamyba @lt
scope note: Данная группа включает специализированный ремонт товаров, выпускаемых в производственном секторе, включая реконструкцию продукции металлообработки (включая машиностроение), оборудования и т.п. Плановый технический уход и обслуживание (то есть обслуживание и ремонт) подобной продукции требуются для повышения производительности оборудования и зачастую, предохраняет оборудование от преждевременного ремонта. Этот класс исключает: - реконструкцию или полную модернизацию техники и оборудования, см. соответствующие классы в разделах 25-30 - чистку производственного оборудования, см. 81.22 - ремонт, технический уход и обслуживание компьютеров и коммуникационного оборудования, см. 95.1 - ремонт, технический уход и обслуживание бытовых товаров, см. 95.2 @ru
scope note: Bu sınıf aşağıdakileri kapsamaktadır; - makine aksamlarını oluşturan fırçalar, elle çalışan mekanik yer temizleyicileri, iplik veya bez parçalarından ya da tüylerden yapılmış ve sırığa bağlanmış temizlik araçları, boyama fırçaları, boyama yastık ve ruloları, kenarı lastikli silecekler ve diğer fırçalar, süpürgeler, yer silicileri ve benzerleri dahil süpürge ve fırça imalatı, - ayakkabı ve elbise fırçalarının imalatı. @tr
preferred label: Производство на метли и четки @bg
preferred label: Výroba košťat a kartáčnických výrobků @cs
preferred label: Fremstilling af koste og børster @da
preferred label: Herstellung von Besen und Bürsten @de
preferred label: Κατασκευή σκουπών και βουρτσών @el
preferred label: Fabricación de escobas, brochas y cepillos @es
preferred label: Harja-, pintsli- ja luuatootmine @et
preferred label: Luutien ja harjojen valmistus @fi
preferred label: Fabrication d'articles de brosserie @fr
preferred label: Seprű-, kefegyártás
preferred label: Fabbricazione di scope e spazzole @it
preferred label: Šluotų ir šepečių gamyba @lt
preferred label: Slotu un suku ražošana @lv
preferred label: Manifattura ta' xkupi u xkupilji @mt
preferred label: Vervaardiging van borstelwaren @nl
preferred label: Produksjon av koster og børster @no
preferred label: Produkcja mioteł, szczotek i pędzli @pl
preferred label: Fabricação de vassouras, escovas e pincéis @pt
preferred label: Fabricarea măturilor şi periilor @ro
preferred label: Производство метел и щеток @ru
preferred label: Výroba metiel a kief @sk
preferred label: Proizvodnja metel in krtač @sl
preferred label: Tillverkning av borstbinderiarbeten @sv
preferred label: Süpürge ve fırça imalatı @tr
broader: Manufacturing n.e.c.

Other manufacturing n.e.c.
type: Concept
notation: 32.99
status: valid
status modified: 2013-10-18
accepted date: 2013-10-18
in scheme: Statistical Classification of Economic Activities in the European Community, Rev. 2 (2008)
scope note: - производство на предпазни и защитни средства: • производство на огнеустойчиво и защитно облекло за пожарникари • производство на предназни и осигурителни колани • производство на предпазни спасителни средства от корк • производство на предпазни каски и други лични предпазни средства от пластмаса (например спортни каски) • производство на предпазни каски и други лични предпазни средства от метал • производство на тапи за уши и нос (например за предпазване при плуване или шум) • производство на газови маски (противогази) - производство на изделия за писане: химикалки, моливи и писалки от различни видове и принадлежности към тях - производство на графити за моливи - производство на ръчни датници, печати, номератори, клейма, ръчни печатарски комплекти и преси, тампони и ленти, напоени с мастило - производство на глобуси - производство на чадъри, слънчобрани, сенници, бастуни - производство на копчета, катарами, ципове и части за тях - производство на запалки - производство на изделия за лична употреба: термоси, лули, гребени, шноли, тоалетни пулверизатори, перуки, изкуствени бради, вежди - производство на разнообразни изделия: свещи, вощеници, изкуствени цветя, плодове и листа, изделия за карнавали и празненства, ръчни сита, манекени, погребални ковчези и други - производство на кошници, гирлянди, венци и подобни артикули с изкуствени цветя - дейности по препариране - производство на фитили за лампи - 13.96 - производство на работно и служебно облекло (например работни комбинезони, престилки,униформи) - 14.12 - производство на изделия за празненства и други развлечения, от хартия - 17.29 - търговия на едро и дребно с рязан цвят и живи растения – 46.22, 47.76 @bg
scope note: Z: - výrobu ochranných a bezpečnostních pomůcek: • žáruvzdorných ochranných oděvů • bezpečnostních pásů a jiných pásů pro profesionální účely • záchranných prostředků z korku • plastických tvrdých pokrývek hlavy a ostatních plastických pomůcek pro bezpečnost osob (např. atletických přileb) • ochranných požárních oděvů • kovových bezpečnostních pokrývek hlavy a ostatních kovových osobních ochranných prostředků • ucpávek do uší a do nosu (např. na ochranu při plavání, proti hluku) • plynových masek - výrobu psacího náčiní všeho druhu, také mechanického - výrobu grafitových tuh do tužek - výrobu datumových a číslovacích razítek a pečetidel, etiketovacích strojků, ručních tiskáren, preparovaných pásků pro psací stroje, inkoustových polštářků - výrobu globů - výrobu deštníků, slunečníků, berlí a sedacích holí - výrobu knoflíků, patentů, zipů - výrobu zapalovačů - výrobu předmětů pro osobní potřebu: • tabákových dýmek, hřebenů, sponek do vlasů, rozprašovačů parfému • vakuových lahví a jiných vakuových nádob pro osobní potřebu nebo pro domácnost • paruk, umělých vousů a umělého obočí - výrobu různých výrobků: • svíček a podobných voskových výrobků • umělých květin a listů, umělého ovoce • žertovních a karnevalových předmětů • ručních sít a řešet • krejčovských panen • rakví, pohřebních schránek atd. - výrobu umělých květinových košů, kytic, věnců a podobných výrobků - preparování zvířat N: - výrobu knotů do zapalovačů (13.99) - výrobu pracovních oděvů a stejnokrojů (např. laboratorních plášťů, overalů, uniforem) (14.12) - výrobu papírových dekorací (17.29) @cs
scope note: Diese Klasse umfasst: - Herstellung von Schutz- und Sicherheitsausrüstung • Herstellung von feuerbeständiger Schutzkleidung • Herstellung von Haltegurten und anderen Gurten für die Berufsausübung • Herstellung von Rettungsmitteln aus Kork • Herstellung von Schutzhelmen und sonstiger persönlicher Sicherheitsausrüstung (z. B. Sporthelmen) aus Kunststoffen • Herstellung von Brandschutzbekleidung • Herstellung von Sicherheitskopfbedeckungen und sonstiger persönlicher Schutzausrüstung aus Metall • Herstellung von Ohr- und Nasenstöpseln (z. B. zum Schutz beim Schwimmen, gegen Lärm) • Herstellung von Gasmasken - Herstellung von Schreibgeräten aller Art, auch mechanischen - Herstellung von Bleiminen für Stifte - Herstellung von Datums- oder Nummernstempeln und Petschaften, Geräten zum Drucken oder Prägen von Etiketten, Druckkästen für den Handgebrauch, präparierten Farbbändern für Schreibmaschinen, Stempelkissen - Herstellung von Globen - Herstellung von Regenschirmen, Sonnenschirmen, Gehstöcken, Sitzstöcken - Herstellung von Knöpfen, Druckknöpfen, Reißverschlüssen - Herstellung von Feuerzeugen - Herstellung von persönlichen Gebrauchsgegenständen: Tabakspfeifen, Parfümzerstäuber, Vakuumisolierflaschen und andere Vakuumisolierbehälter für den persönlichen Gebrauch oder für den Haushalt, Perücken, falsche Bärte und Augenbrauen - Herstellung von verschiedenen Waren: Kerzen und ähnliche Wachswaren; künstliche Blumen, Früchte und Blattwerk; Dekorations- und Unterhaltungsartikel; Handsiebe; Schneiderpuppen; Särge usw. - Herstellung von Blumenkörben, -sträußen, -kränzen und ähnlichen Waren - Präparieren von Tieren Diese Klasse umfasst nicht: - Herstellung von Feuerzeugdochten (s. 13.96) - Herstellung von Arbeits- und Berufskleidung (z. B. Laborkittel, Overalls, Uniformen) (s. 14.12) - Herstellung von Dekorationen aus Papier (s. 17.29) @de
scope note: This class includes: - manufacture of protective safety equipment • manufacture of fire-resistant and protective safety clothing • manufacture of linemen's safety belts and other belts for occupational use • manufacture of cork life preservers • manufacture of plastics hard hats and other personal safety equipment of plastics (e.g. athletic helmets) • manufacture of fire-fighting protection suits • manufacture of metal safety headgear and other metal personal safety devices • manufacture of ear and noise plugs (e.g. for swimming and noise protection) • manufacture of gas masks - manufacture of pens and pencils of all kinds whether or not mechanical - manufacture of pencil leads - manufacture of date, sealing or numbering stamps, hand-operated devices for printing, or embossing labels, hand printing sets, prepared typewriter ribbons and inked pads - manufacture of globes - manufacture of umbrellas, sun-umbrellas, walking sticks, seat-sticks - manufacture of buttons, press-fasteners, snap-fasteners, press-studs, slide fasteners - manufacture of cigarette lighters - manufacture of articles of personal use: smoking pipes, scent sprays, vacuum flasks and other vacuum vessels for personal or household use, wigs, false beards, eyebrows - manufacture of miscellaneous articles: candles, tapers and the like; artificial flowers, fruit and foliage; jokes and novelties; hand sieves and hand riddles; tailors' dummies; burial coffins etc. - manufacture of floral baskets, bouquets, wreaths and similar articles - taxidermy activities This class excludes: - manufacture of lighter wicks, see 13.96 - manufacture of workwear and service apparel (e.g. laboratory coats, work overalls, uniforms), see 14.12 - manufacture of paper novelties, see 17.29 @en
scope note: Esta clase comprende: - la fabricación de equipos protectores de seguridad • la fabricación de prendas ignífugas y prendas protectoras de seguridad • la fabricación de cinturones de suspensión y otros cinturones para uso profesional • la fabricación de salvavidas de corcho • la fabricación de cascos de plástico y otro equipo de seguridad personal de plástico (p. ej., cascos para actividades deportivas) • la fabricación de ropa de protección para la extinción de incendios • la fabricación de cascos metálicos de seguridad y otros dispositivos personales metálicos de seguridad • la fabricación de tapones para los oídos y la nariz (p. ej., para la práctica de la natación y la protección frente a ruidos) • la fabricación de máscaras de gas - la fabricación de plumas y lápices de todas clases, sean o no mecánicos - la fabricación de minas de lápiz - la fabricación de sellos, numeradores, fechadores, artículos para la impresión o la grabación manual de etiquetas, aparatos para la estampación a mano de textiles, cintas entintadas para máquinas de escribir y tampones impregnados - la fabricación de globos terráqueos - la fabricación de paraguas, sombrillas, bastones, asientos plegables portátiles - la fabricación de botones, corchetes, cierres automáticos, broches, cierres de cremallera - la fabricación de encendedores - la fabricación de artículos de uso personal: la fabricación de pipas, peines, pasadores y artículos similares, pulverizadores de tocador, termos y recipientes similares de uso doméstico o personal, pelucas, barbas y cejas postizas, etc. - la fabricación de artículos diversos: velas, cirios y artículos similares, frutas y flores artificiales, artículos de broma y artículos promocionales y de regalo, coladores y tamices de mano, maniquíes para modistos, ataúdes, etc. - la fabricación de centros de flores, ramos, coronas y artículos similares - las actividades de taxidermia Esta clase no comprende: - la fabricación de mechas de encendedores (véase 13.96) - la f… @es
scope note: Cette classe comprend: - la fabrication d’équipements de protection • la fabrication de vêtements de sécurité résistant au feu et de protection • la fabrication de ceintures de sécurité pour poseurs de rails et autres ceintures à usage professionnel • la fabrication de bouées de sauvetage en liège • la fabrication de casques en plastique et d’autres équipements personnels de sécurité en matières plastiques (par exemple: les casques de protection pour l’athlétisme) • la fabrication de vêtements de protection pour la lutte contre l’incendie • la fabrication de coiffures de sécurité et d’autres équipements personnels de sécurité en métal • la fabrication de protections auditives (par exemple: contre le bruit ou pour la pratique de la natation) • la fabrication de masques à gaz - la fabrication de stylos et de crayons de tous types, mécaniques ou non - la fabrication de mines pour crayons - la fabrication de dateurs, de cachets ou de numéroteurs, d’appareils manuels pour l’impression d’étiquettes, d’imprimeries à main, de rubans encreurs préparés pour machines à écrire et de tampons encreurs - la fabrication de globes - la fabrication de parapluies, d’ombrelles, de parasols, de cannes, de cannes-sièges - la fabrication de boutons, de boutons-pression et de fermetures à glissière - la fabrication de briquets - la fabrication d’articles à usage personnel: pipes, vaporisateurs de toilette, bouteilles isolantes et autres récipients isothermiques à usage personnel ou domestique, perruques, fausses barbes, faux sourcils - la fabrication de divers articles: bougies, chandelles, cierges et articles similaires, fleurs, fruits et feuillages artificiels, articles-surprises, tamis et cribles à main, mannequins pour tailleurs, cercueils, etc. - la fabrication de compositions florales, bouquets, couronnes et articles similaires - les activités des taxidermistes Cette classe ne comprend pas: - la fabrication de mèches pour briquets, voir 13.96 - la fabrication de vêtements de travail … @fr
scope note: Ovaj razred uključuje: - proizvodnju zaštitne sigurnosne opreme • proizvodnju vatrootporne i zaštitne sigurnosne odjeće • proizvodnju sigurnosnih pojaseva za potrebe sporta ili radnog mjesta • proizvodnju pojaseva za spašavanje • proizvodnju plastičnih pokrivala za glavu i ostale osobne sigurnosne opreme od plastike (npr. kaciga za atletičare) • proizvodnju zaštitnih odijela za vatrogasce • proizvodnju metalnih sigurnosnih kaciga i ostale zaštitne opreme za osobnu sigurnost • proizvodnju ušnih i nosnih čepova (npr. za bazene i zaštitu od buke) • proizvodnju gas-maski - proizvodnju pera i olovaka svih vrsta bez obzira na to jesu li mehaničke ili ne - proizvodnju uložaka za olovke - proizvodnju žigova za datiranje, pečaćenje, ili numeriranje, ručnih naprava za otiskivanje natpisa ili garnitura za ručno otiskivanje, vrpca za pisaće strojeve i jastučića za žigove - proizvodnju globusa - proizvodnju kišobrana, suncobrana, štapova za hodanje, nogu za stolice - proizvodnju dugmadi, drukera, patentnih zatvarača, nitna, velikih kopči - proizvodnju upaljača za cigarete - proizvodnju predmeta za osobnu upotrebu: lula, češljeva, ukosnica, mirisnih ukrasa, termoboca i drugih termoposuda za osobnu upotrebu ili za kućanstvo, vlasulja, lažnih brada, trepavica - proizvodnju raznovrsnih predmeta: svijeća, voštanica i slično, umjetnog cvijeća, voća i lišća, ukrasa, ručnih sita i rešeta, krojačkih lutaka, pogrebnih lijesova itd. - proizvodnju košara za cvijeće, buketa, vijenaca i sličnih proizvoda - djelatnosti prepariranja Ovaj razred isključuje: - proizvodnju fitilja za upaljače, vidi 13.96 - proizvodnju radnih odijela i radne odjeće (npr. laboratorijske kute, odijela, uniforme), vidi 14.12 - proizvodnju noviteta od papira, vidi 17.29
scope note: Į šią klasę įeina: - apsauginės saugos įrangos gamyba • ugniai atsparių ir apsauginių saugos drabužių gamyba • elektromonterių saugos diržų ir kitų profesinės paskirties diržų gamyba • gelbėjimosi liemenių iš kamštienos gamyba • kietų plastikinių šalmų ir kitų plastikinių asmeninių saugos priemonių (pvz., sportinių šalmų) gamyba • gaisrininkų apsauginių kostiumų gamyba • metalinių apsauginių galvos apdangalų ir kitų metalinių asmeninių apsaugos priemonių gamyba • ausų ir nosies kaištukų (plaukiojimui bei nosies apsaugai) gamyba • dujokaukių gamyba - mechaninių ar nemechaninių visų rūšių plunksnakočių ir pieštukų gamyba - pieštukų šerdelių gamyba - spaudų datai žymėti, antspaudui uždėti ar numeriui nurodyti, rankinių spausdinimo ar reljefinio įspaudavimo aparatų, rankinių spausdinimo įrenginių, rašomųjų mašinėlių juostelių, antspaudų pagalvėlių gamyba - gaublių gamyba - skėčių nuo lietaus ir saulės, lazdų, lazdų - sėdynių gamyba - sagų, spaudžių, kabių, sąsagų, užtrauktukų gamyba - žiebtuvėlių gamyba - asmeninio naudojimo dirbinių: pypkių, šukų, šukų plaukams prilaikyti, plaukų segtukų, kvepalų purkštukų, termosų ir kitų asmeninio ar buitinio naudojimo vakuuminių indų, perukų, dirbtinių barzdų ir antakių gamyba - įvairių dirbinių: žvakių, žvakučių ir panašių gaminių; dirbtinių gėlių, vaisių ir lapų; pokštų ir smulkmenų dovanėlėms; rankinių sietų ir rėčių; siuvėjų manekenų, laidojimo karstų ir kt., gamyba - gėlių krepšelių, puokščių, vainikų ir panašių dirbinių gamyba - iškamšų darymas Į šią klasę neįeina: - žvakių ir žibintų dagčių gamyba, žr. 13.96 - darbo drabužių ir aprangos (laboratorijų chalatų, darbinių kostiumų, uniformų) gamyba, žr. 14.12 - popierinių smulkmenų gamyba, žr. 17.29 @lt
scope note: Данный класс включает ремонт, технический уход и обслуживание металлоконструкций, обозначенных в разделе 25. Этот класс включает: - ремонт металлических цистерн, резервуаров и контейнеров - ремонт и обслуживание труб и трубопроводов - мобильный сварочный ремонт - ремонт стальных барабанов - ремонт паровых или прочих парогенераторов - ремонт и обслуживание вспомогательного оборудования для его использования с паровыми парогенераторами: • конденсаторов, подогревателей, пароперегревателей, паровых коллекторов и аккумуляторов - ремонт и обслуживание ядерных реакторов, за исключением изотопных сепараторов - ремонт и обслуживание деталей морских или энергетических котлов - ремонт радиаторов и котлов центрального отопления - ремонт огнестрельного оружия и артиллерийский орудий (включая ремонт спортивного и развлекательного оружия) - ремонт и обслуживание тележек в супермаркетах Этот класс исключает: - заточку инструментов, таких как пилы и топоры, см. 33.12 - ремонт центральных отопительных систем, см. 43.22 - ремонт механических замков, сейфов и т.д., см. 80.20 @ru
scope note: Bu sınıf aşağıdakileri kapsamaktadır: - koruyucu güvenlik malzemelerinin imalatı: • ateşe dayanıklı ve koruyucu güvenlik kıyafetlerinin imalatı, • telgraf, demiryolu vb. hat işçilerinin emniyet kemerleri ve mesleki kullanım için diğer emniyet kemerlerinin imalatı, • mantarlı can simitlerinin imalatı, • plastikten sert şapkaların (baret) ve plastikten diğer kişisel güvenlik gereçlerinin (örn. spor amaçlı kasklar vb.) imalatı, • yangından koruyucu elbiselerin imalatı, • metal güvenlik başlıkları ve diğer kişisel metal güvenlik tertibatlarının imalatı, • kulak ve burun tıkaçları (örn. yüzme ve gürültüden korunma amaçlı olanlar ) imalatı, • gaz maskelerinin imalatı. - mekanik olsun veya olmasın, her çeşit tükenmez ve kurşun kalem imalatı, - kurşun kalem içlerinin imalatı, - tarih verme, mühürleme veya numara verme kaşeleri, elle çalışan basım aletleri, kabartma etiketleri, el baskı setleri, hazır daktilo şeritleri ve ıstampaların imalatı - küre imalatı, - şemsiye, güneş şemsiyeleri, baston ve koltuklu bastonların imalatı, - düğmeler, kopçalar, çıtçıtlar, fermuarlar vb. imalatı, - çakmak imalatı, - kişisel kullanıma yönelik eşyaların imalatı ( pipolar, taraklar, tokalar, kokulu püskürtücüleri, kişisel ve evde kullanıma yönelik vakumlu termoslar ve diğer vakumlu kaplar, peruk, takma sakal, takma kaş), - çeşitli eşyaların imalatı (mumlar, ince mumlar ve benzerleri, yapma çiçek, meyve ve bitkiler, şaka ve benzeri eşyaların, el kalbur ve elekleri; terziler için mankenler, tabutlar vb.), - çiçek sepetleri, çiçek buketleri, çelenkler ve benzeri eşyaların imalatı - hayvan postu doldurma faaliyetleri. Kapsam dışı olanlar: - lamba fitillerinin imalatı, bkz. 13.99, - iş ve hizmet kıyafetleri imalatı (örn. laboratuar elbiseleri, iş önlükleri, üniformalar), bkz. 14.12, - kağıttan yapılmış küçük malzemelerin imalatı, bkz. 17.29. @tr
preferred label: Други разнообразни производства, некласифицирани другаде @bg
preferred label: Ostatní zpracovatelský průmysl j. n. @cs
preferred label: Anden fremstillingsvirksomhed i.a.n. @da
preferred label: Herstellung von sonstigen Erzeugnissen a. n. g. @de
preferred label: Άλλες μεταποιητικές δραστηριότητες π.δ.κ.α. @el
preferred label: Otras industrias manufactureras n.c.o.p. @es
preferred label: Muu mujal liigitamata tootmine @et
preferred label: Muu muualla luokittelematon valmistus @fi
preferred label: Autres activités manufacturières n.c.a. @fr
preferred label: Egyéb m.n.s feldolgozóipari tevékenység
preferred label: Altre industrie manifatturiere n.c.a. @it
preferred label: Kita, niekur kitur nepriskirta, gamyba @lt
preferred label: Citur neklasificēta ražošana @lv
preferred label: Manifatturar ieħor n.e.c. @mt
preferred label: Overige industrie, n.e.g. @nl
preferred label: Annen industriproduksjon ikke nevnt annet sted @no
preferred label: Produkcja pozostałych wyrobów, gdzie indziej niesklasyfikowana @pl
preferred label: Outras indústrias transformadoras, n.e. @pt
preferred label: Fabricarea altor produse manufacturiere n.c.a. @ro
preferred label: Производство прочей продукции, не включенной в другие категории @ru
preferred label: Ostatná výroba i. n. @sk
preferred label: Drugje nerazvrščene predelovalne dejavnosti @sl
preferred label: Diverse övrig tillverkning @sv
preferred label: Başka yerde sınıflandırılmamış diğer imalatlar @tr
broader: Manufacturing n.e.c.

Repair and installation of machinery and equipment
type: Concept
notation: 33
status: valid
status modified: 2013-10-18
accepted date: 2013-10-18
in scheme: Statistical Classification of Economic Activities in the European Community, Rev. 2 (2008)
scope note: специализиран ремонт (например среден или текущ) и техническо поддържане (например сервизно обслужване) на стоки, произведени в сектор "Преработваща промишленост". Ремонтът е дейност, при която машините или оборудването се привеждат в изправност. Текущото поддържане има за цел да предотврати повредите и да поддържа машините в добро работно състояние. Този раздел разглежда само специализирания ремонт и поддръжка. Когато единицата извършва комбинирани дейности по производство и ремонт, тя се класифицира по преобладаващата дейност. Същият принцип се прилага, когато при търговията се осъществява и ремонтна дейност. Възстановяването или реконструкцията на машините и оборудването се приемат за производство и се класифицират в други раздели на този сектор. Ремонтът и поддържането на артикули, използвани като инвестиционни и потребителски стоки, обикновено се класифицират в ремонта на стоки за бита и лични вещи (например поправка на офис мебели и мебели за дома - 95.24). В раздела е включено и специализираното инсталиране на машини. Инсталирането на оборудване, което е неделима част от сградата, като например асансьори и ескалатори или електрическа мрежа и климатични системи, се класифицира в сектор F „Строителство”. - специализирано почистване на промишлени съоръжения и машини - 81.22 - ремонт на компютърна и комуникационна техника - 95.1 - ремонт на лични и домакински вещи - 95.2 @bg
scope note: Tento oddíl zahrnuje odborné opravy výrobků, vyráběných ve zpracovatelském sektoru, prováděné za účelem obnovy funkčnosti strojů, zařízení a jiných výrobků. Tento oddíl rovněž zahrnuje provádění všeobecných nebo rutinních údržbářských prací (servisu) výrobků, pro zajištění optimálního fungování a zabránění provozním poruchám a zbytečným opravám těchto výrobků. Tento oddíl zahrnuje pouze odborné opravy a údržbářské práce. Významnou část oprav provádějí výrobci strojů, zařízení a jiných výrobků, v tom případě se činnost výrobních jednotek podílejících se na těchto opravách a údržbářských pracích klasifikuje dle principu tvorby přidané hodnoty, který tyto kombinované činnosti často přiřazuje k výrobním činnostem. Obdobné platí pro kombinaci obchodu a oprav. Přestavba nebo přepracování (generální opravy) strojů nebo zařízení se považují za výrobní činnosti a jsou zahrnuty v jiných třídách této sekce. Opravy a údržba výrobků, které mohou být používány jako výrobní prostředky nebo jako spotřební zboží, jsou obvykle klasifikovány jako opravy a údržba spotřebního zboží (např. opravy kancelářského a bytového nábytku - 95.24). Tento oddíl dále zahrnuje odbornou instalaci strojů. Instalace zařízení, která tvoří nedílnou součást budovy nebo podobné struktury, např. instalace elektrického vedení, instalace eskalátorů nebo instalace klimatizačního systému, je klasifikována ve stavebnictví. N: - čištění průmyslových strojů (81.22) - opravy a údržbu počítačů a komunikačních zařízení (95.1) - opravy a údržbu přístrojů převážně pro domácnost (95.2) @cs
scope note: Diese Abteilung umfasst die fachgerechte Instandsetzung von hergestellten Waren zur Wiederherstellung der Funktionstüchtigkeit dieser Maschinen, Ausrüstungsgegenstände und anderen Erzeugnisse. Die Erbringung von allgemeinen oder regelmäßigen Wartungsarbeiten an derartigen Erzeugnissen, durch die die optimale Funktion gewährleistet und Betriebsstörungen und unnötige Reparaturen vermieden werden sollen, fallen ebenfalls darunter. Diese Abteilung umfasst nur fachgerechte Instandsetzungs- und Wartungsarbeiten. Ein beträchtlicher Anteil der Reparaturen wird durch die Hersteller der Maschinen, Ausrüstungen und sonstigen Waren durchgeführt. In diesem Fall erfolgt die Klassifizierung der an diesen Reparatur- und Wartungsarbeiten beteiligten Einheiten nach dem Wertschöpfungsprinzip, das diese kombinierten Tätigkeiten häufig dem Hersteller der Waren zuordnet. Entsprechendes gilt für die Kombination von Handel und Reparatur. Der Umbau oder die Grundüberholung von Maschinen oder Ausrüstungen gilt als Herstellungstätigkeit und ist in anderen Klassen dieses Abschnitts enthalten. Die Reparatur und Instandhaltung von Waren, die sowohl als Investitionsgüter als auch als Gebrauchsgüter genutzt werden, wird üblicherweise als Reparatur und Instandhaltung von Gebrauchsgütern klassifiziert (z. B. Reparatur von Büro- und Wohnmöbeln (s. 95.24)). Des Weiteren ist in dieser Abteilung die fachgerechte Installation von Maschinen erfasst. Die Installation von Ausrüstungen, die einen festen Bestandteil eines Gebäudes oder eines Bauwerks bilden, beispielsweise die elektrische Verkabelung, der Einbau von Rolltreppen oder Klimaanlagen gehört zum Baugewerbe/Bau. Diese Abteilung umfasst nicht: - Reinigung von Industriemaschinen (s. 81.22) - Reparatur und Instandhaltung von Datenverarbeitungs- und Kommunikationsgeräten (s. 95.1) - Reparatur und Instandhaltung von Gebrauchsgütern (s. 95.2) @de
scope note: This division includes the specialised repair of goods produced in the manufacturing sector with the aim to restore machinery, equipment and other products to working order. The provision of general or routine maintenance (i.e. servicing) on such products to ensure they work efficiently and to prevent breakdown and unnecessary repairs is included. This division does only include specialised repair and maintenance activities. A substantial amount of repair is also done by manufacturers of machinery, equipment and other goods, in which case the classification of units engaged in these repair and manufacturing activities is done according to the value-added principle which would often assign these combined activities to the manufacture of the good. The same principle is applied for combined trade and repair. The rebuilding or remanufacturing of machinery and equipment is considered a manufacturing activity and included in other divisions of this section. Repair and maintenance of goods that are utilised as capital goods as well as consumer goods is typically classified as repair and maintenance of household goods (e.g. office and household furniture repair, see 95.24). Also included in this division is the specialised installation of machinery. However, the installation of equipment that forms an integral part of buildings or similar structures, such as installation of electrical wiring, installation of escalators or installation of air-conditioning systems, is classified as construction. This division excludes: - cleaning of industrial machinery, see 81.22 - repair and maintenance of computers and communications equipment, see 95.1 - repair and maintenance of household goods, see 95.2 @en
scope note: Esta división comprende la reparación especializada de bienes producidos en el sector manufacturero con el objetivo de procurar que la maquinaria, los equipos y otros productos vuelvan a funcionar. Se incluye asimismo la provisión de servicios de mantenimiento general o rutinario de estos productos para garantizar un funcionamiento eficaz y evitar las averías y las reparaciones innecesarias. Esta división sólo comprende las actividades de reparación y mantenimiento especializadas. Una parte sustancial de las reparaciones son efectuadas asimismo por los fabricantes de maquinaria, equipos y otros productos, en cuyo caso, la clasificación de las unidades dedicadas a estas actividades de reparación y fabricación se lleva a cabo de conformidad con el principio de valor añadido, que dará lugar con frecuencia a la asignación de estas actividades combinadas a la fabricación de artículos. El mismo principio se aplica a la actividad combinada de comercio y reparación. La reconstrucción o refabricación de maquinaria y equipos se considera una actividad de fabricación y se clasifica en otras divisiones de esta sección. La reparación y el mantenimiento de artículos que pueden ser utilizados como bienes de capital y como bienes de consumo suele clasificarse como reparación y mantenimiento de enseres domésticos (p. ej., reparación de mobiliario de oficina y doméstico, véase 95.24). Se incluye asimismo en esta división la instalación especializada de maquinaria. No obstante, la instalación de equipos que constituyen una parte integral de edificios o estructuras similares, como la instalación de cableado eléctrico, escaleras mecánicas o sistemas de aire acondicionado, se clasifica como construcción. Esta división no comprende: - la limpieza de maquinaria industrial (véase 81.22) - la reparación y el mantenimiento de ordenadores y equipos de comunicación (véase 95.1) - la reparación y el mantenimiento de enseres domésticos (véase 95.2) @es
scope note: Cette division comprend la réparation spécialisée d’articles produits dans le secteur de l’industrie manufacturière dans le but de remettre ces machines, les équipements et autres articles en ordre de fonctionnement. L’entretien général ou régulier (par exemple: les révisions) de ces articles afin de garantir qu’ils fonctionnent correctement et d’empêcher toute panne et toute intervention inutile est compris dans cette division. Elle ne comprend que les activités d’entretien et de réparation spécialisée. Un volume important des activités de réparation est également effectué par les fabricants de machines, équipements et autres articles et la classification des unités réalisant ces activités de réparation et de fabrication s’effectue alors sur la base du principe de la valeur ajoutée, ce qui aura souvent pour effet d’affecter ces activités combinées à la fabrication de l’article concerné. Il en va de même pour les activités combinées de commerce et de réparation. La reconstruction ou la refabrication de machines et d’équipements sont considérées comme des activités manufacturières et relèvent d’autres divisions de cette section. La réparation et l’entretien d’articles utilisés comme biens d’équipement et biens de consommation relèvent en général de la réparation de biens personnels et domestiques (par exemple: la réparation de mobilier domestique ou de bureau, voir 95.24). L’installation spécialisée de machines relève également de cette division. Néanmoins, les activités d’installation d’équipements faisant partie intégrante de bâtiments ou de structures similaires, telles que l’installation de câblages électriques, l’installation d’escaliers mécaniques ou l’installation de systèmes de conditionnement d’air sont classées dans la construction. Cette division ne comprend pas: - le nettoyage de machines industrielles, voir 81.22 - la réparation et l’entretien d’ordinateurs et d’équipements de communication, voir 95.1 - la réparation et l’entretien de biens domestiques, … @fr
scope note: Ovaj odjeljak uključuje specijalizirane popravke proizvoda proizvedenih u proizvodnom sektoru radi dovođenja strojeva, opreme i proizvoda u radno stanje. Ovdje je uključeno redovito i rutinsko održavanje (tj. servisiranje) da bi se osigurala učinkovitost strojeva te spriječili mogući kvarovi i nepotrebni popravci. Ovaj odjeljak uključuje samo specijalizirane popravke i djelatnosti održavanja. Veći dio popravaka obavljaju sami proizvođači strojeva, opreme i ostalih proizvoda, pri čemu je razvrstavanje jedinica koje obavljaju djelatnosti i proizvodnje i popravka učinjeno prema načelu dodane vrijednosti. Često će jedinice koje obavljaju obje djelatnosti biti razvrstane u proizvodnju dobara odnosno područje prerađivačke industrije. Isto načelo primjenjuje se u slučaju kada se kombiniraju djelatnosti trgovine i popravka. Rekonstrukcija ili daljnja obrada strojeva i opreme također se smatra prerađivačkom industrijom, a uključena je u ostalim odjeljcima ovog područja. Popravak i održavanje predmeta koji se koriste kao kapitalna dobra i ona koja se koriste kao potrošačka dobra razvrstavaju se u popravak i održavanje dobara za kućanstva (npr. popravak uredskog namještaja i namještaja za kućanstva, vidi 95.24). U ovaj odjeljak također je uključena specijalizirana instalacija strojeva. Ipak, instaliranje opreme koja čini sastavni dio objekta ili sličnih struktura kao što je instaliranje električnih žica za dizala ili instaliranje sustava za klimatizaciju, razvrstava se u građevinarstvo. Ovaj odjeljak isključuje: - čišćenje industrijskih strojeva, vidi 81.22 - popravak i održavanje računala i komunikacijske opreme, vidi 95.1 - popravak i održavanje kućanskih proizvoda, vidi 95.2
scope note: Į šį skyrių įeina specializuotas gaminių, pagamintų apdirbamosios gamybos sektoriuje, remontas, siekiant atkurti mašinų, įrangos ir kitų gaminių darbinę būklę. Taip pat įeina bendroji ar einamoji šių gaminių techninė priežiūra (t.y. kasdienė priežiūra), kuri turi užtikrinti efektyvų jų veikimą bei avarijų ir nereikalingų remontų prevenciją. Į šį skyrių įeina tik specializuotas remontas ir techninė priežiūra. Nemažai remonto darbų atlieka mašinų, įrangos ir kitų reikmenų gamintojai, tokiu atveju į šias remonto ir apdirbamosios gamybos veiklos rūšis įtrauktų verslo vienetų klasifikavimas yra atliekamas pagal pridėtosios vertės principą, pagal kurį šios suderintos veiklos rūšys dažnai priskiriamos gaminių gamybai. Tas pats principas taikomas ir suderintai su remontu prekybai. Mašinų ir įrangos rekonstravimas ar atgaminimas yra priskiriami apdirbamajai gamybai ir įeina į kitus šios sekcijos skyrius. Reikmenų, naudojamų kaip gamybos priemonės, kaip ir plataus vartojimo reikmenų taisymas ir techninė priežiūra paprastai klasifikuojami kaip namų ūkio reikmenų taisymas ir techninė priežiūra (pvz., įstaigų ir namų baldų taisymas, žr. 95.24). Į šį skyrių taip pat įeina specializuotas mašinų įrengimas. Tačiau įrangos, kuri yra neatsiejama pastatų ar panašių statinių dalis, pvz., elektros instaliacija, eskalatorių ar oro kondicionavimo sistemų montavimas, įrengimas yra priskiriamas statybai. Į šį skyrių neįeina: - pramoninių mašinų valymas, žr. 81.22 - kompiuterių ir ryšių įrangos taisymas ir techninė priežiūra, žr. 95.1 - namų ūkio reikmenų taisymas, žr. 95.2 @lt
scope note: Данный класс включает ремонт, технический уход и обслуживание промышленной техники и оборудования для заточки и установки производственных резаков, лезвий и полотен (пил); сварочные работы (например, общего направления или для автомобилей) в качестве ремонтных услуг; ремонт сельскохозяйственной и прочих видов тяжелой промышленной техники и оборудования (например, грузоподъемников и прочего ручного оборудования, механических станков, промышленного холодильного оборудования, строительного оборудования и оборудования для горнодобывающей промышленности), включая технику и оборудование раздела 28. Этот класс включает: - ремонт и обслуживание двигателей немоторных транспортных средств - ремонт, технический уход и обслуживание накачивающего, компрессорного и т.п. оборудования - ремонт и обслуживание пневматических приборов - ремонт клапанов - ремонт зубчатых приводов и приводных элементов - ремонт и обслуживание промышленных печей - ремонт, технический уход и обслуживание подъемного и погрузочно-разгрузочного оборудования - ремонт, технический уход и обслуживание промышленного холодильного оборудования и воздухоочистительного оборудования - ремонт, технический уход и обслуживание промышленного оборудования общего назначения - ремонт ручных инструментов с электрическим приводом - ремонт, технический уход и обслуживание металлорежущего оборудования и отливных машин, инструментов и аксессуаров - ремонт, технический уход и обслуживание прочих механических станков - ремонт, технический уход и обслуживание сельскохозяйственных тракторов - ремонт, технический уход и обслуживание сельскохозяйственной, лесохозяйственной техники и техники для транспортировки лесоматериалов - ремонт, технический уход и обслуживание металлургического оборудования - ремонт, технический уход и обслуживание техники для горнодобывающей промышленности, строительства и нефтегазодобывающей техники - ремонт, технический уход и обслуживание техники по выпуску продуктов питания, напитков и табачных изделий - ре… @ru
scope note: Bu bölüm, makine, donanım ve çalışır durumda olan diğer ürünlerin yenilenmesi amacıyla imalat sektöründe üretilmiş malların uzmanlaşmış onarımını kapsamaktadır. Bu ürünlerin daha etkin çalışmalarını sağlamak ve bozulmalarını önlemek amacıyla yapılan genel veya rutin bakımlar da (örn. müşteriye hizmet) bu gruba dahildir. Bu bölüm, sadece uzmanlaşmış bakım ve onarım faaliyetlerini kapsamaktadır. Onarımın önemli bölümü, makine, teçhizat ve diğer malların imalatçıları tarafından da yapılır; bu durumda bunların bakım ve onarımını yapan birimlerin sınıflandırılması, malın imalatı ile birleşik olan bu faaliyetlerin, çoğunlukla katma değer prensibine göre payının belirlenmesiyle yapılır. Aynı ilke, birleşik ticaret ve onarım için de uygulanır.Makine ve donanımların yeniden yapılandırılmaları veya yeniden üretilmeleri bir imalat faaliyeti olarak değerlendirilmekte olup, bu kısımda yer alan diğer bölümlerde kapsanmıştır. Tüketici mallarında olduğu gibi sermaye malları olarak kullanılan malların bakım ve onarımı, hane halkı mallarının bakım ve onarımı gibi sınıflandırılır (Örn. büro ve hane halkı mobilyalarının onarımı, bkz. 95.24). Kapsam dışı olanlar; - sanayi makinelerinin temizlenmesi, bkz. 81.22, - bilgisayar ve iletişim ekipmanlarının bakım ve onarımı, bkz. 95.1, - ev eşyalarının bakım ve onarımı, bkz. 95.2. @tr
preferred label: Ремонт и инсталиране на машини и оборудване @bg
preferred label: Opravy a instalace strojů a zařízení @cs
preferred label: Reparation og installation af maskiner og udstyr @da
preferred label: Reparatur und Installation von Maschinen und Ausrüstungen @de
preferred label: Επισκευή και εγκατάσταση μηχανημάτων και εξοπλισμού @el
preferred label: Reparación e instalación de maquinaria y equipo @es
preferred label: Masinate ja seadmete remont ja paigaldus @et
preferred label: Koneiden ja laitteiden korjaus, huolto ja asennus @fi
preferred label: Réparation et installation de machines et d'équipements @fr
preferred label: Ipari gép, berendezés, eszköz javítása
preferred label: Riparazione e installazione di macchine e apparecchiature @it
preferred label: Mašinų ir įrangos remontas ir įrengimas @lt
preferred label: Iekārtu un ierīču remonts un uzstādīšana @lv
preferred label: Tiswija u installazzjoni ta' makkinarju u tagħmir @mt
preferred label: Reparatie en installatie van machines en apparaten @nl
preferred label: Reparasjon og installasjon av maskiner og utstyr @no
preferred label: Naprawa i instalowanie maszyn i urządzeń @pl
preferred label: Reparação, manutenção e instalação de máquinas e equipamentos @pt
preferred label: Repararea, întreţinerea şi instalarea maşinilor şi echipamentelor @ro
preferred label: Ремонт и установка машин и оборудования @ru
preferred label: Oprava a inštalácia strojov a prístrojov @sk
preferred label: Popravila in montaža strojev in naprav @sl
preferred label: Reparation och installation av maskiner och apparater @sv
preferred label: Makine ve ekipmanların kurulumu ve onarımı @tr
broader: MANUFACTURING
narrower: Repair of fabricated metal products, machinery and equipment
narrower: Installation of industrial machinery and equipment

Repair of fabricated metal products, machinery and equipment
type: Concept
notation: 33.1
status: valid
status modified: 2013-10-18
accepted date: 2013-10-18
in scheme: Statistical Classification of Economic Activities in the European Community, Rev. 2 (2008)
scope note: специализиран ремонт и текущо поддържане (например сервизно обслужване) на стоки, произведени в сектор "Преработваща промишленост". Ремонтът е дейност, при която машините или оборудването се привеждат в изправност. Текущото поддържане има за цел да предотврати повредите и да поддържа машините в добро работно състояние. - възстановяване или реконструкция на машини и оборудване - раздели 25-30 - специализирано почистване на промишлени съоръжения и машини - 81.22 - ремонт на компютърна и комуникационна техника - 95.1 - ремонт на лични и домакински вещи - 95.2 @bg
scope note: Tato skupina zahrnuje odborné opravy prováděné za účelem obnovy funkčnosti kovodělných výrobků, strojů a zařízení a jiných výrobků. Tato skupina zahrnuje rovněž provádění všeobecných nebo pravidelných údržbářských prací (tj. servisu) na těchto výrobcích, které slouží k zajištění optimálního fungování a zabránění provozním poruchám a zbytečným opravám. N: - přestavbu a generální opravy strojů a zařízení (viz příslušnou třídu oddílů 25 až 31) - čištění průmyslových zařízení (81.22) - opravy a údržbu počítačů a komunikačních zařízení (95.1) - opravy a údržbu přístrojů převážně pro domácnost (95.2) @cs
scope note: Diese Gruppe umfasst die spezialisierte Reparatur von hergestellten Waren zur Wiederherstellung der Funktionstüchtigkeit dieser Metallerzeugnisse, Maschinen und Ausrüstungsgegenstände und anderer Erzeugnisse. Die Erbringung von allgemeinen oder regelmäßigen Wartungsarbeiten an derartigen Erzeugnissen, durch die die optimale Funktion gewährleistet und Betriebsstörungen und unnötige Reparaturen vermieden werden sollen, fallen ebenfalls darunter. Diese Gruppe umfasst nicht: - Umbau oder Grundüberholung von Maschinen oder Ausrüstungen (s. entsprechende Klasse der Abteilungen 25 bis 30) - Reinigung von Industriemaschinen (s. 81.22) - Reparatur und Instandhaltung von Datenverarbeitungs- und Kommunikationsgeräten (s. 95.1) - Reparatur und Instandhaltung von Gebrauchsgütern (s. 95.2) @de
scope note: This group includes the specialised repair of goods produced in the manufacturing sector with the aim to restore these metal products, machinery, equipment and other products to working order. The provision of general or routine maintenance (i.e. servicing) on such products to ensure they work efficiently and to prevent breakdown and unnecessary repairs is included. This group excludes: - rebuilding or remanufacturing of machinery and equipment, see corresponding class in divisions 25-30 - cleaning of industrial machinery, see 81.22 - repair and maintenance of computers and communications equipment, see 95.1 - repair and maintenance of household goods, see 95.2 @en
scope note: Este grupo comprende la reparación especializada de bienes producidos en el sector manufacturero con el objetivo de procurar que estos productos metálicos, maquinaria y equipos vuelvan a funcionar. Se incluye asimismo la provisión de servicios de mantenimiento general o rutinario de tales productos para garantizar un funcionamiento eficaz y evitar las averías y las reparaciones innecesarias. Este grupo no comprende: - la reconstrucción o refabricación de maquinaria y equipos (véase la clase correspondiente en las divisiones 25 a 30) - la limpieza de maquinaria industrial (véase 81.22) - la reparación y el mantenimiento de ordenadores y equipos de comunicación (véase 95.1) - la reparación y el mantenimiento de enseres domésticos (véase 95.2) @es
scope note: Ce groupe comprend la réparation spécialisée d’articles produits dans le secteur de l’industrie manufacturière dans le but de remettre ces machines, équipements et autres articles en métaux en ordre de fonctionnement. L’entretien général ou régulier (par exemple: les révisions) de ces articles afin de garantir qu’ils fonctionnent correctement et d’empêcher toute panne et toute intervention inutile est compris. Ce groupe ne comprend pas: - la reconstruction ou la refabrication de machines et d’équipements, voir les classes correspondantes dans les divisions 25-30 - le nettoyage de machines industrielles, voir 81.22 - la réparation et l’entretien d’ordinateurs et d’équipements de communication, voir 95.1 - la réparation et l’entretien de biens domestiques, voir 95.2 @fr
scope note: Ova skupina uključuje specijalizirane popravke proizvoda izrađenih u proizvodnom sektoru s ciljem dovođenja tih metalnih predmeta, strojeva i opreme u radno stanje. Ovdje je uključeno redovito i rutinsko održavanje tih strojeva (tj. servisiranje) kako bi se osigurala učinkovitost i spriječili mogući kvarovi i nepotrebni popravci. Ova skupina isključuje: - rekonstrukciju i doradu strojeva i opreme, vidi pripadajući razred u odjeljcima 25-31 - čišćenje industrijskih strojeva, vidi 81.22 - popravak i održavanje računala i komunikacijske oopreme, vidi 95.1 - popravak i održavanje predmeta za kućanstvo, vidi 95.2
scope note: Į šią grupę įeina specializuotas gaminių, pagamintų apdirbamosios gamybos sektoriuje, remontas, siekiant atkurti šių metalo gaminių, mašinų, įrangos ir kitų gaminių darbinę būklę. Taip pat įeina bendroji ar einamoji šių gaminių techninė priežiūra (t.y. kasdienė priežiūra), kuri turi užtikrinti efektyvų jų veikimą bei avarijų ir nereikalingų remontų prevenciją. Į šią grupę neįeina: - mašinų ir įrangos rekonstravimas ar atgaminimas, žr. atitinkamą 25 - 30 skyrių klasę - pramoninių mašinų valymas, žr. 81.22 - kompiuterių ir ryšių įrangos remontas ir techninė priežiūra, žr. 95.1 - namų apyvokos reikmenų remontas ir techninė priežiūra, žr. 95.2 @lt
scope note: Данный класс включает ремонт, технический уход и обслуживание товаров включенных в группы 26.5, 26.6 и 26.7, за исключением тех, которые относятся к бытовой технике. Этот класс включает: - ремонт, технический уход и обслуживание измерительного, тестирующего, навигационного и контрольного оборудования группы 26.5, такого как: • авиационные двигатели • испытательное оборудование для автомобилей • метеорологическая аппаратура • приборы для тестирования и проверки физических, электрических и химических свойств • метрологическая аппаратура • оборудование для выявления и мониторинга радиационного излучения - ремонт, технический уход и обслуживание иррадиационного, электромедицинского и электротерапевтического оборудования класса 26.60, такого как: • оборудование для получения магнитно-резонансного изображения • медицинское ультразвуковое оборудование • регуляторы скорости • слуховые аппараты • электрокардиографы • электромедицинское эндоскопическое оборудование • иррадиационные аппараты - ремонт, технический уход и обслуживание оптических инструментов и оборудования класса 26.70, для использования в коммерческих целях, таких как: • бинокли • микроскопы (за исключением электронных и фотонных микроскопов) • телескопы • призмы и линзы (за исключением офтальмологических) • фотографическое оборудование Этот класс исключает: - ремонт, технический уход и обслуживание фотокопировальных машин, см. 33.12 - ремонт, технический уход и обслуживание компьютеров и периферийного оборудования,, см. 95.11 - ремонт, технический уход и обслуживание компьютерных проекторов, см. 95.11 - ремонт, технический уход и обслуживание коммуникационного оборудования, см. 95.12 - ремонт, технический уход и обслуживание профессиональных теле- и видео камер, см. 95.12 - ремонт видеокамер для домашнего пользования, см. 95.21 - ремонт часов, см. 95.25 @ru
scope note: Bu grup, metal ürünlerin, makinelerin, donanımların ve çalışır durumda olan diğer ürünlerin yenilenmesi amacıyla imalat sektöründe üretilmiş malların uzmanlaşmış onarımını kapsamaktadır. Bu ürünlerin daha etkin çalışmalarını sağlamak ve bozulmalarını önlemek amacıyla yapılan genel veya rutin bakımlar da (örn. müşteriye hizmet) bu gruba dahildir. Kapsam dışı olanlar: - makine ve ekipmanların yeniden yapılandırılması veya yeniden üretilmesi, bkz. bölüm 25-31, - sanayi makinelerinin temizlenmesi, bkz. 81.22, - bilgisayar ve iletişim donanımlarının bakım ve onarımı, bkz. 95.1, - ev eşyalarının bakım ve onarımı, bkz. 95.2. @tr
preferred label: Ремонт на метални изделия, машини и оборудване @bg
preferred label: Opravy kovodělných výrobků, strojů a zařízení @cs
preferred label: Reparation af jern- og metalvarer, maskiner og udstyr @da
preferred label: Reparatur von Metallerzeugnissen, Maschinen und Ausrüstungen @de
preferred label: Επισκευή μεταλλικών προϊόντων, μηχανημάτων και ειδών εξοπλισμού @el
preferred label: Reparación de productos metálicos, maquinaria y equipo @es
preferred label: Metalltoodete, masinate ja seadmete remont @et
preferred label: Metallituotteiden, teollisuuden koneiden ja laitteiden korjaus ja huolto @fi
preferred label: Réparation d'ouvrages en métaux, de machines et d'équipements @fr
preferred label: Ipari gép, berendezés, eszköz javítása
preferred label: Riparazione di prodotti in metallo, macchine e apparecchiature @it
preferred label: Metalo gaminių, mašinų ir įrangos remontas @lt
preferred label: Metāla izstrādājumu, mehānismu un iekārtu remonts @lv
preferred label: Tiswija ta' prodotti, makkinarju u tagħmir tal-metall iffabbrikat @mt
preferred label: Reparatie van producten van metaal, machines en apparaten @nl
preferred label: Reparasjon av metallvarer, maskiner og utstyr @no
preferred label: Naprawa metalowych wyrobów gotowych, maszyn i urządzeń @pl
preferred label: Reparação de produtos metálicos, máquinas e equipamento @pt
preferred label: Repararea articolelor fabricate din metal, repararea maşinilor şi echipamentelor @ro
preferred label: Ремонт готовых металлических изделий, машин и оборудования @ru
preferred label: Oprava kovových konštrukcií, strojov a prístrojov @sk
preferred label: Popravila kovinskih izdelkov, strojev in naprav @sl
preferred label: Reparation av metallvaror, maskiner och apparater @sv
preferred label: Fabrikasyon metal ürünlerin, makinelerin ve ekipmanların onarımı @tr
broader: Repair and installation of machinery and equipment
narrower: Repair of fabricated metal products
narrower: Repair of machinery
narrower: Repair of electronic and optical equipment
narrower: Repair of electrical equipment
narrower: Repair and maintenance of ships and boats
narrower: Repair and maintenance of aircraft and spacecraft
narrower: Repair and maintenance of other transport equipment
narrower: Repair of other equipment

Repair of fabricated metal products
type: Concept
notation: 33.11
status: valid
status modified: 2013-10-18
accepted date: 2013-10-18
in scheme: Statistical Classification of Economic Activities in the European Community, Rev. 2 (2008)
scope note: - ремонт на цистерни, резервоари и контейнери от метал - ремонт и поддържане на тръби и тръбопроводи - ремонт на метални изделия чрез извършване на заварки на място - ремонт на варели, бидони, кофи, кутии и подобни съдове от стомана - ремонт и поддържане на парни котли - ремонт и поддържане на спомагателни устройства за парни котли: • кондензатори, икономайзери, прегреватели, паросъбиратели и акумулатори на пара - ремонт и поддържане на ядрени реактори (без машини и апарати за изотопно разделяне) - ремонт и поддържане на части за котли за плавателни средства или за електроцентрали - ремонт и поддържане на котли за централно отопление и радиатори с неелектрическо загряване - ремонт и поддържане на въоръжение и боеприпаси (вкл. на ловно и спортно оръжие) - ремонт и поддържане на колички за пазаруване - наточване на триони - 33.12 - ремонт на отоплителни системи - 43.22 - ремонт на огнеупорни каси и механични заключващи устройства - 80.20 @bg
scope note: Tato třída zahrnuje opravy a údržbu kovodělných výrobků převážně z oddílu 25. Z: - opravy kovových nádrží, zásobníků a kontejnerů - opravy a údržbu potrubí a potrubních vedení - opravy kovodělných výrobků mobilními svařovacími přístroji - opravy ocelových přepravních barelů - opravy a údržbu parních generátorů - opravy a údržbu pomocných zařízení k parním generátorům: • kondenzátorů, předehřívačů, přehřívačů, parních kolektorů a akumulátorů - opravy a údržbu jaderných reaktorů, kromě separátorů izotopů - opravy a údržbu dílů kotlů pro lodě a elektrárny - opravy plášťů kotlů pro ústřední topení a topných těles (radiátorů) - opravy a údržbu střelných a dělostřeleckých zbraní (včetně oprav sportovních a rekreačních zbraní) - opravy a údržbu nákupních vozíků N: - broušení čepelí nebo listů pil (33.12) - opravy systémů ústředních topení atd. (43.22) - opravy mechanických blokovacích zařízení, sejfů atd. (80.20) @cs
scope note: Diese Klasse umfasst die Reparatur und Instandhaltung von Metallerzeugnissen der Abteilung 25. Diese Klasse umfasst: - Reparatur von Tanks, Sammelbehältern und ähnlichen Behältern aus Metall - Reparatur und Instandhaltung von Rohrleitungen und Rohrfernleitungen - Reparaturen mit beweglichen Schweißgeräten - Reparatur von Transportfässern aus Stahl - Reparatur und Instandhaltung von Dampfkesseln (Dampferzeugern) - Reparatur und Instandhaltung von Hilfsapparaten für Dampfkessel: • Kondensatoren, Vorwärmer, Überhitzer, Dampfsammler und Druckspeicher - Reparatur und Instandhaltung von Teilen für Kernreaktoren, außer Isotopentrennern - Reparatur und Instandhaltung von Dampfkesseln für Schiffe und Kraftwerke - Reparatur an der Hülle von Zentralheizungskesseln und Heizkörpern - Reparatur und Instandhaltung von Schuss- und Artilleriewaffen (einschließlich Reparatur von Sport- und Freizeitgewehren) - Reparatur und Instandhaltung von Einkaufswagen Diese Klasse umfasst nicht: - Schärfen und von Klingen und Sägeblättern (s. 33.12) - Reparatur von Zentralheizungsanlagen usw. (s. 43.22) - Reparatur mechanischer Verriegelungseinrichtungen, Safes usw. (s. 80.20) @de
scope note: This class includes the repair and maintenance of fabricated metal products of division 25. This class includes: - repair of metal tanks, reservoirs and containers - repair and maintenance for pipes and pipelines - mobile welding repair - repair of steel shipping drums - repair and maintenance of steam or other vapour generators - repair and maintenance of auxiliary plant for use with steam generators: • condensers, economisers, superheaters, steam collectors and accumulators - repair and maintenance of nuclear reactors, except isotope separators - repair and maintenance of parts for marine or power boilers - platework repair of central heating boilers and radiators - repair and maintenance of fire arms and ordnance (including repair of sporting and recreational guns) - repair and maintenance of shopping carts This class excludes: - sharpening of blades and saws, see 33.12 - repair of central heating systems etc., see 43.22 - repair of mechanical locking devices, safes etc., see 80.20 @en
scope note: Esta clase comprende la reparación y el mantenimiento de los productos metálicos de la división 25. Esta clase comprende: - la reparación de cisternas, grandes depósitos y contenedores de metal - la reparación y el mantenimiento de tubos y tuberías - la reparación mediante soldadura móvil - la reparación de bidones y toneles de acero - la reparación y el mantenimiento de generadores de vapor de agua y otros generadores de vapor - la reparación y el mantenimiento de aparatos auxiliares para generadores de vapor: • condensadores, economizadores, recalentadores y acumuladores de vapor - la reparación y el mantenimiento de reactores nucleares, excepto separadores de isótopos - la reparación y el mantenimiento de piezas para calderas marinas y de potencia - la reparación de chapa de radiadores y calderas para la calefacción central - la reparación y el mantenimiento de armas de fuego y munición (incluida la reparación de armas para actividades deportivas y recreativas) - la reparación y el mantenimiento de carros de supermercado Esta clase no comprende: - el afilado de hojas y sierras (véase 33.12) - la reparación de sistemas de calefacción central, etc. (véase 43.22) - la reparación de cierres mecánicos, cajas fuertes, etc. (véase 80.20) @es
scope note: Cette classe comprend la réparation et l’entretien des ouvrages en métaux produits dans la division 25. Cette classe comprend: - la réparation de réservoirs, citernes et conteneurs métalliques - la réparation et l’entretien de conduites et pipelines - les services de réparation par soudure mobile - la réparation de fûts métalliques de transport - la réparation et l’entretien de générateurs produisant de la vapeur d’eau ou d’autres types de vapeur - la réparation et l’entretien d’appareils auxiliaires pour générateurs de vapeur: • condensateurs, économiseurs, surchauffeurs, collecteurs et accumulateurs de vapeur - la réparation et l’entretien de réacteurs nucléaires, à l’exception des séparateurs d’isotopes - la réparation et l’entretien de pièces destinées aux chaudières de navires ou de centrales électriques - la réparation de chaudières et de radiateurs de chauffage central - la réparation et l’entretien d’armes à feux et de pièces d’artillerie (y compris la réparation de fusils pour le tir sportif et de loisirs) - la réparation et l’entretien de chariots pour achats Cette classe ne comprend pas: - l’affûtage de lames et de scies, voir 33.12 - la réparation de systèmes de chauffage central, etc., voir 43.22 - la réparation de dispositifs de verrouillage mécanique, coffres-forts, etc., voir 80.20 @fr
scope note: Ovaj razred uključuje popravak i održavanje proizvoda od metala iz odjeljka 25. Ovaj razred uključuje: - popravak metalnih tankera, rezervoara i kontejnera - popravak i održavanje cijevi i cjevovoda - popravak mobilnih uređaja za zavarivanje - popravak čeličnih brodskih bačvi - popravak i održavanje parnih kotlova i drugih generatora pare - popravak i održavanje pomoćne opreme koja se upotrebljava s parnim generatorom: • kondenzatora, ekonomizera, supergrijača, sakupljača pare i akumulatora - popravak i održavanje nuklearnih reaktora, osim odjeljivača izotopa - popravak i održavanje dijelova brodskih ili drugih kotlova - popravak galvanizacijom kotlova za centralno grijanje i radijatora - popravak i održavanje vatrenog oružja i streljiva (uključujući popravak sportskih pištolja i pištolja za rekreaciju) - popravak i održavanje kolica za kupnju Ovaj razred isključuje: - oštrenje noževa i pila, vidi 33.12 - popravak sustava za centralno grijanje itd., vidi 43.22 - popravak mehaničkih uređaja za zaključavanje, sefova vidi 80.20
scope note: Į šią klasę įeina 25 skyriuje pagamintų metalo gaminių remontas ir techninė priežiūra. Į šią klasę įeina: - metalinių cisternų, rezervuarų ir talpyklų remontas - vamzdžių ir vamzdynų remontas ir techninė priežiūra - kilnojamos suvirinimo įrangos remontas - plieninių konteinerių remontas - vandens arba kitokių garų generatorių remontas ir techninė priežiūra - garų generatorių pagalbinės įrangos remontas ir techninė priežiūra: • kondensatorių, ekonomaizerių, perkaitintuvų, garų rinktuvų ir akumuliatorių - branduolinių reaktorių, išskyrus izotopų skirtuvus, remontas ir techninė priežiūra - laivų garo katilų ar energetinių katilų dalių remontas ir techninė priežiūra - centrinio šildymo katilų ir radiatorių lakštinio metalo darbų remontas - šaunamųjų ginklų ir amunicijos remontas ir techninė priežiūra (įskaitant sportinių ir pramoginių šautuvų remontą) - prekių vežimėlių remontas ir techninė priežiūra Į šią klasę neįeina: - geležčių ir pjūklų galandinimas, žr. 33.12 - centrinių šildymo sistemų ir kt. remontas, žr. 43.22 - mechaninių užraktų, seifų ir kt. remontas, žr. 80.20 @lt
scope note: Данный класс включает ремонт, технический уход и обслуживание товаров, включенных в раздел 27, за исключением группы 27.5 (бытовые приборы). Этот класс включает: - ремонт, технический уход и обслуживание электро-, распределительных трансформаторов и трансформаторов специального назначения - ремонт, технический уход и обслуживание электромоторов, генераторов и моторов генераторных установок - ремонт, технический уход и обслуживание коммутационной аппаратуры и щитов управления - ремонт, технический уход и обслуживание аппаратуры для управления производственным процессом и релейного управления - ремонт, технический уход и обслуживание первичных и накопительных батарей - ремонт, технический уход и обслуживание электроосветительного оборудования - ремонт, технический уход и обслуживание токонесущей и не токонесущей электропроводки Этот класс исключает: - ремонт, технический уход и обслуживание компьютеров и периферийного оборудования,, см. 95.11 - ремонт, технический уход и обслуживание телекоммуникационного оборудования, см. 95.12 - ремонт, технический уход и обслуживание бытовой электроники, см. 95.21 - ремонт часов, см. 95.25 @ru
scope note: Bu sınıf 25. bölümde üretilmiş fabrikasyon metal ürünlerin bakım ve onarımını kapsamaktadır. Bu sınıf aşağıdakileri kapsamaktadır: - metal tankların, rezervuarların ve muhafaza kapları (konteynerler dahil) onarımı, - boru ve boru hatlarının bakım ve onarımı, - seyyar kaynak makinelerinin onarımı, - çelik gemi bölümlerinin onarımı, - buhar kazanları veya buhar jeneratörlerinin bakım ve onarımı, - buhar jeneratörleriyle beraber kullanmak için yardımcı ünitelerin bakım ve onarımı: • kondansatör, ekonomizör, kızdırıcı, buhar toplayıcı ve buhar akümülatörler - nükleer reaktörlerin bakım ve onarımı (izotop ayırıcılar hariç), - gemi kazan veya güç kazan parçalarının bakım ve onarımı, - merkezi ısıtma kazanları ve radyatörlerin onarımı, - ateşli silahların ve savaş gereçlerinin bakım ve onarımı (spor ve eğlence amaçlı silahların onarımı dahil), - alışveriş arabalarının bakım ve onarımı. Kapsam dışı olanlar: - bıçak ağızlarının ve testerelerin bilenmesi, bkz. 33.12, - merkezi ısıtma sistemleri vb.nin onarımı, bkz. 43.22, - mekanik kilitleme düzenekleri, kasalar vb.nin onarımı, bkz. 80.20. @tr
preferred label: Ремонт на метални изделия @bg
preferred label: Opravy kovodělných výrobků @cs
preferred label: Reparation af jern- og metalvarer @da
preferred label: Reparatur von Metallerzeugnissen @de
preferred label: Επισκευή μεταλλικών προϊόντων @el
preferred label: Reparación de productos metálicos @es
preferred label: Metalltoodete remont @et
preferred label: Metallituotteiden korjaus ja huolto @fi
preferred label: Réparation d'ouvrages en métaux @fr
preferred label: Fémfeldolgozási termék javítása
preferred label: Riparazione di prodotti in metallo @it
preferred label: Metalo gaminių remontas @lt
preferred label: Metāla izstrādājumu remonts @lv
preferred label: Tiswija ta' prodotti tal-metall iffabbrikat @mt
preferred label: Reparatie van producten van metaal @nl
preferred label: Reparasjon av bearbeidede metallprodukter @no
preferred label: Naprawa metalowych wyrobów gotowych @pl
preferred label: Reparação de produtos metálicos @pt
preferred label: Repararea articolelor fabricate din metal @ro
preferred label: Ремонт готовых металлических изделий @ru
preferred label: Oprava kovových konštrukcií @sk
preferred label: Popravila kovinskih izdelkov @sl
preferred label: Reparation av metallvaror @sv
preferred label: Fabrikasyon metal ürünlerin onarımı @tr
broader: Repair of fabricated metal products, machinery and equipment

Repair of machinery
type: Concept
notation: 33.12
status: valid
status modified: 2013-10-18
accepted date: 2013-10-18
in scheme: Statistical Classification of Economic Activities in the European Community, Rev. 2 (2008)
scope note: Ремонт и поддържане на машини и оборудване, обхванати предимно в раздел 28. - ремонт и поддържане на двигатели с вътрешно горене, без авиационни, автомобилни и мотоциклетни - ремонт и поддържане на помпи, компресори и подобни съоръжения - ремонт и поддържане на хидравлични и пневматични двигатели - ремонт на арматурни изделия - ремонт на лагери, предавки и съединители - ремонт и поддържане на промишлени пещи - ремонт и поддържане на подемно-транспортни машини - ремонт и поддържане на промишлено хладилно и вентилационно оборудване - ремонт и поддържане на други професионални машини с общо предназначение - ремонт на преносими инструменти с вграден двигател - ремонт и поддържане на машини за обработка на метал - ремонт и поддържане на други обработващи машини - ремонт и поддържане на трактори за селското и горското стопанство - ремонт и поддържане на други машини за селското и горското стопанство - ремонт и поддържане на машини и оборудване за металургията и леярството - ремонт и поддържане на машини за добива и строителството и на оборудване за нефтените и газовите кладенци - ремонт и поддържане на машини и оборудване за преработка на храни, напитки и тютюн - ремонт и поддържане на машини за текстил, облекло, кожи и кожени изделия - ремонт и поддържане на машини за хартия, картон и изделия от хартия и картон - ремонт и поддържане на машини за каучук или пластмаси - ремонт и поддържане на други машини със специално предназначение, включени в раздел 28 - ремонт и поддържане на уреди и апарати за претегляне (различни от аналитичните везни) - ремонт и поддържане на автоматични машини за продажба на стоки - ремонт и поддържане на касови апарати - ремонт и поддържане на фотокопирни апарати - ремонт на механични и електронни сметачни машини - ремонт на пишещи машини - ремонт и поддържане на котли с огнище и готварски печки, които могат да бъдат използвани допълнително и за централно отопление - 43.22 - инсталиране, ремонт и поддържане на асансьори, ескалатори и движещи се пъ… @bg
scope note: Tato třída zahrnuje opravy a údržbu průmyslových strojů a zařízení, např. broušení nebo instalaci čepelí, břitů nebo listů pil v průmyslových nebo řemeslnických strojích; provádění svařovacích prací (např. na automobilech nebo při všeobecných opravách); opravy zemědělských a jiných těžkých a průmyslových strojů a zařízení (např. vidlicových vysokozdvižných vozíků a ostatních manipulačních zařízení, obráběcích strojů, průmyslových chladicích zařízení, stavebních a těžebních strojů) včetně strojů a zařízení z oddílu 28. Z: - opravy a údržbu motorů, kromě pro motorová vozidla - opravy a údržbu čerpadel, kompresorů a podobných zařízení - opravy a údržbu proudových strojů - opravy ventilů - opravy ozubených kol a hnacích prvků - opravy a údržbu průmyslových pecí - opravy a údržbu zdvihacích a manipulačních zařízení - opravy a údržbu průmyslových chladicích zařízení a zařízení na čištění vzduchu - opravy a údržbu velkých strojů a zařízení pro všeobecné účely - opravy ručních profi nástrojů a nářadí s motorem - opravy a údržbu obráběcích strojů a příslušenství pro třískové a beztřískové obrábění - opravy a údržbu mechanických strojně poháněných ručních profi nástrojů a nářadí - opravy a údržbu obráběcích strojů na řezání a tvarování kovů - opravy a údržbu ostatních obráběcích strojů - opravy a údržbu zemědělských traktorů - opravy a údržbu zemědělských a lesnických strojů, strojů na těžbu dřeva - opravy a údržbu hutnických strojů - opravy a údržbu hornických a stavebních strojů a strojů používaných na ropných a plynových polích - opravy a údržbu strojů pro výrobu potravin, nápojů a zpracování tabáku - opravy a údržbu strojů na výrobu textilu, oděvních výrobků a výrobků z usní - opravy a údržbu strojů a přístrojů na výrobu papíru a lepenky - opravy a údržbu strojů na výrobu a zpracování plastů a pryže - opravy a údržbu strojů pro speciální užití oddílu 28 - opravy a údržbu vážicích zařízení - opravy a údržbu prodejních automatů - opravy a údržbu registračních pokladen - opr… @cs
scope note: Diese Klasse umfasst die Reparatur und Instandhaltung von kommerziell genutzten Maschinen und Geräten, etwa das Schärfen und Einbauen von Klingen oder Sägeblättern von kommerziellen oder Industriemaschinen oder die Erbringung von Schweißarbeiten (z. B. an Fahrzeugen im Rahmen allgemeiner Reparaturleistungen); die Reparatur von landwirtschaftlichen Geräten und anderen schweren und industriellen Geräten und Ausrüstungen (z. B. Gabelstapler und sonstige Fördergeräte, Werkzeugmaschinen, kommerziell genutzte Kältemaschinen, Baugeräte, Bergbaugeräte) einschließlich Maschinen und Ausrüstungen der Abteilung 28. Diese Klasse umfasst: - Reparatur und Instandhaltung von Kraftmaschinen - Reparatur und Instandhaltung für Pumpen, Kompressoren und ähnliche Ausrüstungen - Reparatur und Instandhaltung von hydraulischen und pneumatischen Komponenten und Systemen - Reparatur von Ventilen - Reparatur und Instandhaltung von Lagern, Getrieben, Zahnrädern und Antriebselementen - Reparatur und Instandhaltung von Industrieöfen - Reparatur und Instandhaltung von Hebezeugen und Fördermitteln - Reparatur und Instandhaltung von kommerziellen Kälteanlagen und Luftreinigungsanlagen - Reparatur und Instandhaltung von nicht wirtschaftszweigspezifischen Maschinen (außer für den Haushalt) - Reparatur handgeführter Werkzeuge mit Motorantrieb - Reparatur und Instandhaltung von Werkzeugmaschinen und Zubehör für spanende und spanlose Metallbearbeitung - Reparatur und Instandhaltung sonstiger Werkzeugmaschinen - Reparatur und Instandhaltung von land- und forstwirtschaftliche Zugmaschinen - Reparatur und Instandhaltung von landwirtschaftlichen und forstwirtschaftlichen Maschinen - Reparatur und Instandhaltung von Maschinen für die Metallerzeugung, von Walzwerkseinrichtungen und Gießmaschinen - Reparatur und Instandhaltung von Bergbaumaschinen, Baumaschinen sowie Maschinen für den Einsatz auf Öl- und Gasfeldern - Reparatur- und Instandhaltungsarbeiten an Maschinen für die Nahrungs-, Futtermittel- und Geträn… @de
scope note: This class includes the repair and maintenance of industrial machinery and equipment like sharpening or installing commercial and industrial machinery blades and saws; the provision of welding (e.g. automotive, general) repair services; the repair of agricultural and other heavy and industrial machinery and equipment (e.g. forklifts and other materials handling equipment, machine tools, commercial refrigeration equipment, construction equipment and mining machinery), including machinery and equipment of division 28. This class includes: - repair and maintenance of non-motor vehicle engines - repair and maintenance of pumps, compressors and related equipment - repair and maintenance of fluid power machinery - repair of valves - repair of gearing and driving elements - repair and maintenance of industrial process furnaces - repair and maintenance of lifting and handling equipment - repair and maintenance of industrial refrigeration equipment and air purifying equipment - repair and maintenance of commercial-type general-purpose machinery - repair of power-driven hand-tools - repair and maintenance of metal cutting and metal forming machine tools and accessories - repair and maintenance of other machine tools - repair and maintenance of agricultural tractors - repair and maintenance of agricultural machinery and forestry and logging machinery - repair and maintenance of metallurgy machinery - repair and maintenance of mining, construction, and oil and gas field machinery - repair and maintenance of food, beverage, and tobacco processing machinery - repair and maintenance of textile apparel, and leather production machinery - repair and maintenance of papermaking machinery - repair and maintenance of plastic and rubber machinery - repair and maintenance of other special-purpose machinery of division 28 - repair and maintenance of weighing equipment - repair and maintenance of vending machines - repair and maintenance of cash registers - repair and maintenance of photoco… @en
scope note: Esta clase comprende la reparación y el mantenimiento de maquinaria y equipo industrial, como el afilado o la instalación de hojas y sierras en maquinaria de uso industrial y profesional, o la provisión de servicios de reparación mediante soldadura (p. ej., de automóviles); la reparación de maquinaria y equipos agrícolas, así como de otra maquinaria y equipos pesados e industriales (p. ej., carretillas elevadoras y otros equipos de manejo de materiales, máquinas herramienta, equipos de refrigeración industrial, equipos de construcción y maquinaria de industrias extractivas), incluidos la maquinaria y los equipos de la división 28. Esta clase comprende: - la reparación y el mantenimiento de motores, excepto de automoción - la reparación y el mantenimiento de bombas, compresores y equipos análogos - la reparación de válvulas - la reparación de órganos mecánicos de transmisión - la reparación y el mantenimiento de hornos de procesos industriales - la reparación y el mantenimiento de equipos de elevación y manipulación - la reparación y el mantenimiento de equipos de refrigeración industrial y de depuración del aire - la reparación y el mantenimiento de maquinaria industrial de uso general - la reparación de herramientas manuales eléctricas - la reparación y el mantenimiento de máquinas herramienta y sus accesorios empleados en el corte y el trabajo de los metales - la reparación y el mantenimiento de otras máquinas herramienta - la reparación y el mantenimiento de tractores agrícolas - la reparación y el mantenimiento de maquinaria agropecuaria y forestal - la reparación y el mantenimiento de maquinaria para la industria metalúrgica - la reparación y el mantenimiento de maquinaria para las industrias extractivas, la construcción y los yacimientos de petróleo y gas - la reparación y el mantenimiento de maquinaria para la industria de la alimentación, bebidas y tabaco - la reparación y el mantenimiento de maquinaria para las industrias textil, de la confección y del cuer… @es
scope note: Cette classe comprend la réparation et l’entretien des machines et le matériel d’usage industriel comme l’affûtage ou l’installation de lames et de scies, la fourniture de services de réparation par soudure (par exemple: pour les activités liées à l’automobile ou générales), la réparation de machines et équipements agricoles ou autres machines et équipements industriels et lourds (par exemple: chariots élévateurs et autres matériels de manutention, machines-outils, équipements de réfrigération commerciaux, équipements de construction et machines des industries extractives), y compris les machines et les équipements relevant de la division 28. Cette classe comprend: - la réparation et l’entretien de moteurs de véhicules autres qu’automobiles - la réparation et l’entretien de pompes, compresseurs et équipements similaires - la réparation et l’entretien de machines hydrauliques - la réparation de soupapes - la réparation d’organes mécaniques de transmission - la réparation et l’entretien de fours industriels - la réparation et l’entretien de matériel de levage et de manutention des matériaux - la réparation et l’entretien d’équipements industriels de réfrigération et de purification de l’air - la réparation et l’entretien de machines d’usage général de type commercial - la réparation de divers outillages portatifs à moteur incorporé - la réparation et l’entretien de machines-outils de découpe et de formage des métaux et de leurs accessoires - la réparation et l’entretien de diverses machines-outils - la réparation et l’entretien de tracteurs agricoles - la réparation et l’entretien de machines agricoles et forestières - la réparation et l’entretien de machines pour la métallurgie - la réparation et l’entretien de machines des industries extractives, pour la construction et les champs de pétrole et de gaz - la réparation et l’entretien de machines de transformation des aliments, des boissons et du tabac - la réparation et l’entretien de machines pour la production de vê… @fr
scope note: Ovaj razred uključuje popravak i održavanje industrijskih strojeva i opreme kao što su oštrenje i instaliranje komercijalnih i industrijskih strojnih lopatica i pila ili obavljanje usluga popravka lemilica (npr. samohodnih, običnih); popravak poljoprivrednih i ostalih teških i industrijskih strojeva i opreme (npr. viličara i ostale opreme za rukovanje materijalima, alatnih strojeva, opreme za komercijalne hladnjake, opreme za građevinarstvo i rudarske strojeve). Uključuje strojeve i opremu odjeljka 28. Ovaj razred uključuje: - popravak i održavanje ne samohodnih motora - popavak i održavanje crpki i pripadajuće opreme - popravak prijenosnih i upravljačkih elemenata - popravak cijevi - popravak zupčanika i dijelova za vožnju - popravak i održavanje industrijskih procesnih peći - popravak i održavanje opreme za rukovanje materijalima, uključujući dizala i pokretne stepenice - popravak i održavanje opreme za komercijalne hladnjake i opreme za pročišćavanje zraka - popravak i održavanje strojeva opće namjene komercijalnog tipa - popravak ostalih ručnih alata na električni pogon - popravak i održavanje strojnih alata te pribora za rezanje i oblikovanje metala - popravak i održavanje ostalih strojnih alata - popravak i održavanje poljoprivrednih traktora - popravak i održavanje poljoprivrednih strojeva i strojeva za šumarstvo i strojeva za rušenje stabala - popravak i održavanje strojeva za metalurgiju - popravak i održavanje strojeva za rudnike, za građevinarstvo te za naftna i plinska polja - popravak i održavanje strojeva za obradu hrane, pića i duhana - popravak i održavanje strojeva za proizvodnju tekstilne i kožne odjeće - popravak i održavanje strojeva za proizvodnju papira - popravak i održavanje strojeva za proizvodnju plastike i gume - popravak i održavanje ostalih strojeva za specijalne namjene iz odjeljka 28 - popravak i održavanje opreme za vaganje - popravak i održavanje aparata za prodaju robe - popravak i održavanje registar-blagajni - popravak i održavanj…
scope note: Į šią klasę įeina pramoninių mašinų ir įrangos remontas bei techninė priežiūra, pvz., komercinių ir pramoninių mašinų geležčių ir pjūklų galandimas ir pakeitimas; suvirinimas (pvz., automobilių, bendrosios paskirties); žemės ūkio, kitų sunkiųjų bei pramoninių mašinų ir įrangos (pvz., šakinių krautuvų ir kitos medžiagų kėlimo įrangos, staklių, komercinės šaldymo įrangos, statybos įrangos ir kasybos mašinų) remontas, įskaitant ir 28 skyriuje klasifikuojamas mašinas ir įrangą. Į šią klasę įeina: - variklių, išskyrus variklinių transporto priemonių variklius, remontas ir techninė priežiūra - siurblių, kompresorių ir susijusios įrangos remontas ir techninė priežiūra - hidraulinių mašinų remontas ir techninė priežiūra - vožtuvų remontas - pavarų ir vairo elementų remontas - technologinių krosnių remontas ir techninė priežiūra - medžiagų kėlimo ir tvarkymo įrangos - pramoninės šaldymo įrangos ir oro valymo įrangos remontas ir techninė priežiūra - komercinių bendrosios paskirties mašinų remontas ir techninė priežiūra - variklinių rankinių įrankių remontas - metalo pjaustymo ir formavimo staklių ir pagalbinių reikmenų remontas ir techninė priežiūra - kitų staklių remontas ir techninė priežiūra - žemės ūkio traktorių remontas ir techninė priežiūra - žemės ir miškų ūkio ir medienos ruošos mašinų remontas ir techninė priežiūra - metalurgijos mašinų remontas ir techninė priežiūra - kasybos, statybos, naftos ir dujų gavybos mašinų remontas ir techninė priežiūra - maisto, gėrimų ir tabako apdorojimo mašinų remontas ir techninė priežiūra - aprangos iš tekstilės ir odos gamybos mašinų remontas ir techninė priežiūra - popieriaus gamybos mašinų remontas ir techninė priežiūra - plastiko ir gumos mašinų remontas ir techninė priežiūra - kitų specialiųjų mašinų, pagamintų 28 skyriuje, remontas ir techninė priežiūra - svėrimo įrangos remontas ir techninė priežiūra - prekybos automatų remontas ir techninė priežiūra - kasos aparatų remontas ir techninė priežiūra - fotokopijavimo mašinų remon… @lt
scope note: Данный класс включает ремонт, технический уход и обслуживание кораблей и лодок. Однако реконструкция плавучих рыбозаводов или технический уход классифицированы в разделе 30. Этот класс включает: - ремонт, технический уход и обслуживание кораблей - ремонт, технический уход и обслуживание лодок Этот класс исключает: - заводскую реконструкцию судов, см. 30.1 - ремонт двигателей для кораблей и лодок, см. 33.12 - демонтаж судов, см. 38.31 @ru
scope note: Bu sınıf, bölüm 28`deki makine ve donanımlar da dahil, ticari ve endüstriyel makinelerin bıçak ağızlarının ve testerelerinin bilenmesi ya da kurulması; kaynağın onarım hizmetleri, tarımda kullanılan makine ve aletler ile diğer ağır ve endüstriyel makine ve aletlerin (örn. forkliftler ve diğer malzeme taşıma donanımları, takım tezgahları, ticari soğutma donanımları, inşaat araç ve gereçleri ile madencilik makineleri) onarılması gibi endüstriyel makine ve aletlerin bakım ve onarımı kapsamaktadır.Bu sınıf aşağıdakileri kapsamaktadır: - motorlu araç motorları dışındaki motorların bakım ve onarımı, - pompalar,kompresörler ve ilgili ekipmanların bakım ve onarımı, - akışkan gücü ile çalışan makinelerin bakım ve onarımı, - valfların (supapların) onarımı, - dişli takımları ve tahrik tertibatlarının onarımı, - sanayi ocakların bakım ve onarımı, - malzeme kaldırma ve taşıma donanımlarının bakım ve onarımı, (kaldırıcılar, hareketli yürüyen yollar dahil), - sanayi tipi soğutma ve hava temizleme ekipmanlarının bakım ve onarımı, - ticari tip genel amaçlı makinelerin bakım ve onarımı, - elektrik ile çalışan el aletlerinin onarımı, - metallerin kesilmesinde ve şekillendirilmesinde kullanılan takım tezgahları ve aksesuarlarının bakım ve onarımı, - diğer takım tezgahlarının bakım ve onarımı, - tarımsal traktörlerin bakım ve onarımı, - tarım, ormancılık ve tomrukçuluk makinelerinin bakım ve onarımı, - metalürji makinelerinin bakım ve onarımı, - madencilik, inşaat, petrol ve gaz sahalarında kullanılan makinelerin bakım ve onarımı, - gıda, içecek ve tütün işleme makinelerinin bakım ve onarımı, - tekstil giyim eşyaları ve deri üretim makinelerinin bakım ve onarımı, - kağıt yapma makinelerinin bakım ve onarımı, - plastik ve kauçuk makinelerinin bakım ve onarımı, - bölüm 28`de yer alan diğer özel amaçlı makinelerin bakım ve onarımı, - tartı aletlerinin bakım ve onarımı, - otomatik satış makinelerinin bakım ve onarımı, - yazarkasaların bakım ve onarımı, - fotokopi makinelerinin bakım ve onar… @tr
preferred label: Ремонт на машини и оборудване, с общо и специално предназначение @bg
preferred label: Opravy strojů @cs
preferred label: Reparation af maskiner @da
preferred label: Reparatur von Maschinen @de
preferred label: Επισκευή μηχανημάτων @el
preferred label: Reparación de maquinaria @es
preferred label: Masinate ja seadmete remont @et
preferred label: Teollisuuden koneiden ja laitteiden korjaus ja huolto @fi
preferred label: Réparation de machines et équipements mécaniques @fr
preferred label: Ipari gép, berendezés javítása
preferred label: Riparazione di macchinari @it
preferred label: Mašinų remontas @lt
preferred label: Iekārtu remonts @lv
preferred label: Tiswija ta' makkinarju @mt
preferred label: Reparatie van machines @nl
preferred label: Reparasjon av maskiner @no
preferred label: Naprawa maszyn @pl
preferred label: Reparação de máquinas @pt
preferred label: Repararea maşinilor @ro
preferred label: Ремонт машин и оборудования @ru
preferred label: Oprava strojov @sk
preferred label: Popravila strojev in naprav @sl
preferred label: Reparation av maskiner @sv
preferred label: Makinelerin onarımı @tr
broader: Repair of fabricated metal products, machinery and equipment

Repair of electronic and optical equipment
type: Concept
notation: 33.13
status: valid
status modified: 2013-10-18
accepted date: 2013-10-18
in scheme: Statistical Classification of Economic Activities in the European Community, Rev. 2 (2008)
scope note: Ремонт и поддържане на продукти, произведени в групи 26.5, 26.6 и 26.7, без битовите уреди - ремонт и поддържане на уреди и апарати за измерване, изпитване, навигация и управление на производствените процеси, включени в група 26.5: • бордни уреди за въздухоплавателни средства • технически средства за проверка на отработени газове от моторни превозни средства • уреди за метеорология • уреди и апарати за изпитване и проверка на физични, електрически и химични характеристики • уреди и апарати за геодезия, топография, земемерство, нивелиране и хидрография • апаратура за откриване и отчитане на радиационния фон - ремонт и поддържане на излъчващи електромедицински и терапевтични апарати, включени в клас 26.60: • ремонт и поддържане на апарати за образна диагностика чрез магнитен резонанс • ремонт и поддържане на медицинска ултразвукова апаратура • ремонт и поддържане на сърдечни стимулатори • ремонт и поддържане на слухови апарати • ремонт и поддържане на електрокардиографи • ремонт и поддържане на електромедицински ендоскопи • ремонт и поддържане на излъчващи електромедицински апарати - ремонт и поддържане на оптични уреди и елементи и фотографска техника, включени в клас 26.70, чиято употреба е предимно професионална: • бинокли • микроскопи (без оптични и протонни) • телескопи • призми и лещи (без контактни) • фотографска техника - ремонт на фотокопирни апарати - 33.12 - ремонт на компютъри и периферни устройства - 95.11 - ремонт на видеопрожекционни апарати за компютри - 95.11 - ремонт на телефонни апарати и други устройства за далекосъобщения - 95.12 - ремонт на професионални телевизионни и видеокамери - 95.12 - ремонт на непрофесионални видеокамери - 95.21 - ремонт на часовници - 95.25 @bg
scope note: Tato třída zahrnuje opravy a údržbu výrobků skupin 26.5, 26.6 a 26.7, kromě výrobků, které se považují za přístroje a zařízení převážně pro domácnost. Z: - opravy a údržbu měřicích, zkušebních a navigačních přístrojů skupiny 26.5: • přístrojů pro letecké motory • přístrojů pro měření emisí motorových vozidel • meteorologických přístrojů • přístrojů pro zkoušení a kontrolu fyzikálních, elektrických a chemických vlastností • geodetických přístrojů • detektorů záření a přístrojů pro monitorování záření - opravy a údržbu ozařovacích, elektroléčebných a elektroterapeutických přístrojů třídy 26.60: • tomografů magnetické rezonance • lékařských ultrazvukových přístrojů • kardiostimulátorů • sluchových pomůcek • elektrokardiografů • lékařských endoskopických přístrojů • ozařovacích přístrojů - opravy a údržbu optických přístrojů a zařízení třídy 26.70, pokud jsou převážně užívány pro komerční účely: • dalekohledů • mikroskopů (kromě elektronových nebo protonových) • teleskopů • hranolů a čoček (kromě pro oční lékařství) • fotografických přístrojů N: - opravy a údržbu fotokopírovacích přístrojů (33.12) - opravy a údržbu počítačů a periferních zařízení (95.11) - opravy a údržbu počítačových projektorů (95.11) - opravy a údržbu komunikačních zařízení (95.12) - opravy a údržbu komerčních televizních kamer a videokamer (95.12) - opravy videokamer domácího typu (95.21) - opravy hodin a hodinek (95.25) @cs
scope note: Diese Klasse umfasst die Reparatur und Instandhaltung von Waren der Gruppen 26.5, 26.6 und 26.7, außer denjenigen, die als Haushaltsgeräte angesehen werden. Diese Klasse umfasst: - Reparatur und Instandhaltung von Mess-, Navigations- Kontroll-, und Steuerungsinstrumente und –vorrichtungen der Gruppe 26.5, wie: • Flugtriebwerksinstrumente • Geräte für die Kraftfahrzeugabgasprüfung • meteorologische Instrumente • Geräte zur Prüfung und Kontrolle von physikalischen, elektrischen und chemischen Eigenschaften • Vermessungsinstrumente • Strahlungsdetektoren und Instrumente zur Strahlungsüberwachung - Reparatur und Instandhaltung von Bestrahlungs- und Elektrotherapiegeräten und elektromedizinischen Geräten der Klasse 26.60, wie: • Magnetresonanztomografiegeräte • medizinische Ultraschallgeräte • Herzschrittmacher • Hörgeräte • Elektrokardiografen • Elektroendoskopiegeräte • Bestrahlungsgeräte - Reparatur und Instandhaltung von optischen Instrumenten und Geräten der Klasse 26.70, sofern sie überwiegend für kommerzielle Zwecke genutzt werden, wie: • Ferngläser • Mikroskope (ohne Elektronen- oder Feldionenmikroskope) • Teleskope • Prismen und Linsen (ohne augenoptische Gläser) • fotografische Geräte Diese Klasse umfasst nicht: - Reparatur und Instandhaltung von Fotokopiergeräten (s. 33.12) - Reparatur und Instandhaltung von Datenverarbeitungsgeräten und peripheren Geräten (s. 95.11) - Reparatur und Instandhaltung von Projektoren (Beamern) (s. 95.11) - Reparatur und Instandhaltung von Kommunikationsgeräten (s. 95.12) - Reparatur und Instandhaltung von kommerziellen Fernseh- und Videokameras (s. 95.12) - Reparatur von Amateur-Videokameras (s. 95.21) - Reparatur von Uhren (s. 95.25) @de
scope note: This class includes the repair and maintenance of goods produced in groups 26.5, 26.6 and 26.7, except those that are considered household goods. This class includes: - repair and maintenance of the measuring, testing, navigating and control equipment of group 26.5, such as: • aircraft engine instruments • automotive emissions testing equipment • meteorological instruments • physical, electrical and chemical properties testing and inspection equipment • surveying instruments • radiation detection and monitoring instruments - repair and maintenance of irradiation, electromedical and electrotherapeutic equipment of class 26.60, such as: • magnetic resonance imaging equipment • medical ultrasound equipment • pacemakers • hearing aids • electrocardiographs • electromedical endoscopic equipment • irradiation apparatus - repair and maintenance of optical instruments and equipment of class 26.70, if the use is mainly commercial, such as: • binoculars • microscopes (except electron and proton microscopes) • telescopes • prisms and lenses (except ophthalmic) • photographic equipment This class excludes: - repair and maintenance of photocopy machines, see 33.12 - repair and maintenance of computers and peripheral equipment, see 95.11 - repair and maintenance of computer projectors, see 95.11 - repair and maintenance of communication equipment, see 95.12 - repair and maintenance of commercial TV and video cameras, see 95.12 - repair of household-type video cameras, see 95.21 - repair of watches and clocks, see 95.25 @en
scope note: Esta clase comprende la reparación y el mantenimiento de los bienes producidos en los grupos 26.5, 26.6 y 26.7, a excepción de aquellos que se consideran enseres domésticos. Esta clase comprende: - la reparación y el mantenimiento de los equipos de medición, comprobación, navegación y control del grupo 26.5, como: • instrumentos para motores de aviación • equipos de comprobación de emisiones de automoción • instrumentos meteorológicos • equipos de comprobación e inspección de propiedades físicas, eléctricas y químicas • instrumentos de geodesia • instrumentos de detección y vigilancia de radiaciones - la reparación de equipos de radiación, electromédicos y electroterapéuticos de la clase 26.60, como: • equipos de resonancia magnética • equipos médicos de ultrasonidos • marcapasos • audífonos • electrocardiógrafos • equipos endoscópicos electromédicos • aparatos de radiación - la reparación de equipos e instrumentos ópticos de la clase 26.70, si su uso es principalmente profesional, como: • prismáticos • microscopios (excepto microscopios de electrones y de protones) • telescopios • prismas y lentes (excepto oftálmicas) • equipo fotográfico Esta clase no comprende: - la reparación y el mantenimiento de fotocopiadoras (véase 33.12) - la reparación y el mantenimiento de ordenadores y periféricos (véase 95.11) - la reparación y el mantenimiento de proyectores informáticos (véase 95.11) - la reparación y el mantenimiento de equipos de comunicación (véase 95.12) - la reparación y el mantenimiento de cámaras de televisión y vídeo de uso profesional (véase 95.12) - la reparación de videocámaras de uso doméstico (véase 95.21) - la reparación de relojes de todo tipo (véase 95.25) @es
scope note: Cette classe comprend la réparation et l’entretien des articles produits dans les groupes 26.5, 26.6 et 26.7, à l’exception de ceux qui sont considérés comme des articles domestiques. Cette classe comprend: - la réparation et l’entretien d’équipements de mesure, d’essai, de navigation et de contrôle relevant du groupe 26.5, tels que: • instruments de moteurs d’aéronef • instruments de contrôle des émissions des véhicules à moteur • instruments météorologiques • instruments d’essai et de contrôle des propriétés physiques, électriques et chimiques • instruments de géodésie • détecteurs et moniteurs de radiation - la réparation et l'entretien d’équipements d’irradiation médicale, d’équipements électromédicaux et électrothérapeutiques relevant de la classe 26.60, tels que: • appareils d’imagerie par résonnance magnétique • appareils médicaux à ultrasons • stimulateurs cardiaques • appareils pour faciliter l’audition • électrocardiographes • appareils électromédicaux pour techniques endoscopiques • appareils pour irradiations - la réparation et l'entretien d’équipements et d’instruments optiques relevant de la classe 26.70 destinés à un usage commercial, tels que: • jumelles • microscopes (à l’exception des microscopes électroniques, protoniques) • télescopes • prismes et lentilles (sauf ophtalmiques) • matériel photographique Cette classe ne comprend pas: - la réparation de photocopieuses, voir 33.12 - la réparation et l’entretien d’ordinateurs et d’équipements périphériques, voir 95.11 - la réparation de vidéoprojecteurs, voir 95.11 - la réparation et l’entretien d’équipements de communication, voir 95.12 - la réparation de caméras vidéo et TV destinées à un usage commercial, voir 95.12 - la réparation de caméscopes destinés à un usage domestique, voir 95.21 - la réparation de montres et d’horloges, voir 95.25 @fr
scope note: Ovaj razred uključuje popravak i održavanje proizvoda proizvedenih u skupinama 26.5, 26.6 i 26.7, osim onih koji se smatraju proizvodima za kućanstvo. Ovaj razred uključuje popravak i održavanje mjerne, ispitne, navigacijske i kontrolne opreme skupine 26.5 kao što su: • zrakoplovni instrumenti • uređaji za testiranje automobilskih ispušnih plinova • meteorološki instrumenti • uređaji za testiranje i ispitivanje fizičkih, električnih i kemijskih svojstava • geodetski instrumenti • radijacijski detektori i nadzorni uređaji - popravak i održavanje uređaja za iradijaciju, elektromedicinskih i elektroterapeutskih uređaja iz razreda 26.60 kao što su: • uređaji za dijagnosticiranje magnetske rezonance • oprema za medicinski ultrazvuk • pejsmejkeri • pomoćni slušni uređaji • elektrokardiografi • elektromedicinska endoskopska oprema • uređaji za iradijaciju - popravak i održavanje optičkih instrumenata i opreme iz razreda 26.70, ako se radio komercijalnoj upotrebi kao što su: • dalekozori • mikroskopi (osim elektronskih, protonskih) • teleskopi • prizme i leće (osim oftalmoloških) • fotografski uređaji Ovaj razred isključuje: - popravak i održavanje fotokopirnih uređaja, vidi 33.12 - popravak i održavanje računala i periferne opreme, vidi 95.11 - popravak i održavanje računalnih projektora, vidi 95.11 - popravak i održavanje komunikacijske opreme, vidi 95.12 - popravak i održavanje komercijalnih televizora i videokamera, vidi 95.12 - popravak videokamera za kućanstva, vidi 95.21 - popravak satova, vidi 95.25
scope note: Į šią klasę įeina 26.5, 26.6 ir 26.7 grupėse pagamintų gaminių, išskyrus namų ūkio reikmenis, remontas ir techninė priežiūra. Į šią klasę įeina: - remontas ir techninė priežiūra matavimo, tikrinimo, bandymo ir navigacijos įrangos, pagamintos 26.5 grupėje, tokios kaip: • orlaivių variklių prietaisai • automobilių išmetamųjų dujų tikrinimo įranga • meteorologiniai prietaisai • fizikinių, elektrinių ir cheminių savybių tyrimo ir tikrinimo įranga • tyrinėjimų prietaisai arba aparatai • jonizuojančiosios spinduliuotės aptikimo ir stebėjimo prietaisai arba aparatai - remontas ir techninė priežiūra švitinimo, elektromedicininės ir elektroterapinės įrangos, pagamintos 26.60 klasėje, tokios kaip: • magnetinio rezonanso tomografai • medicininė ultragarsinė įranga • širdies stimuliatoriai • klausos aparatai • elektrokardiografai • elektromedicininės endoskopijos įranga • švitinimo aparatai - remontas ir techninė priežiūra optinių prietaisų ir įrangos, pagamintų 26.70 klasėje, jei jie daugiausiai naudojami komerciniais tikslais, tokių kaip: • binokliai • mikroskopai (išskyrus elektroninius ir protoninius) • teleskopai • prizmės ir lęšiai (išskyrus oftalmologinius) • fotografijos įranga Į šią klasę įeina 27 skyriuje pagamintų gaminių, išskyrus pagamintus 27.5 grupėje (buitiniai prietaisai ir aparatai), taisymas ir techninė priežiūra. Į šią klasę įeina: - galios, skirstomųjų ir specialiųjų transformatorių remontas ir techninė priežiūra - elektros variklių, generatorių ir variklių - generatorių agregatų remontas ir techninė priežiūra - perjungimo įrenginių ir skirstomųjų skydų aparatų remontas ir techninė priežiūra - relių ir pramoninių valdytuvų remontas ir techninė priežiūra - pirminių elementų ir akumuliatorių baterijų remontas ir techninė priežiūra - elektrinės apšvietimo įrangos remontas ir techninė priežiūra - elektros srovei laidžių ir nelaidžių įtaisų, skirtų elektros grandinėms įrengti, remontas ir techninė priežiūra Į šią klasę neįeina: - kompiuterių ir išorinės įrangos … @lt
scope note: Данный класс включает ремонт, технический уход и обслуживание воздушных и космических судов. Этот класс включает: - ремонт, технический уход и обслуживание воздушных судов (за исключением реконструкции, технического осмотра, капитального ремонта) - ремонт, технический уход и обслуживание двигателей воздушных судов Этот класс исключает: - реконструкцию, технический осмотр и капитальный ремонт воздушных судов, см. 30.30 @ru
scope note: Bu sınıf, 26.5, 26.6 ve 26.7 gruplarında üretilen malların bakım ve onarımını kapsamaktadır (hane halkı malları olarak değerlendirilenler hariç).Bu sınıf aşağıdakileri kapsamaktadır; - grup 26.5`teki ölçme, test, seyrüsefer ve kontrol donanımlarının bakım ve onarımını kapsamaktadır, örneğin; • uçak motoru ile ilgili aletler (göstergeler vb.) bakım ve onarımı, • otomotiv emisyonu test donanımlarının bakım ve onarımı, • meteoroloji aletlerinin bakım ve onarımı, • fiziksel, elektriksel ve kimyasal özellikleri test ve muayene eden donanımların bakım ve onarımı, • arazi ölçme aletlerinin bakım ve onarımı (seyrüsefer için olanlar da dahil), • radyasyon belirleme ve izleme donanımının bakım ve onarımı. - ayrıca bu sınıf, sınıf 26.60`ta yer alan ışınlama, elektro medikal ve elektrikle tedavi cihazlarının bakım ve onarımı, örneğin: • manyetik rezonans görüntüleme cihazlarının bakım ve onarımı, • medikal ültrason cihazının bakım ve onarımı, • kalp atış hızını ayarlayan cihazların bakım ve onarımı, • işitme cihazlarının bakım ve onarımı, • elektrokardiyografi cihazlarının bakım ve onarımı, • elektro medikal endoskopi cihazının bakım ve onarımı, • ışınlama cihazlarının bakım ve onarımı. - ayrıca bu sınıf, sınıf 26.70`te yer alan optik araç ve gereçlerin bakım ve onarımı: (eğer bunlar esas olarak ticari amaçla kullanılıyorsa) örneğin: • dürbünlerin bakım ve onarımı, • mikroskopların bakım ve onarımı (proton ve elektron mikroskoplar hariç), • teleskopların bakım ve onarımı, • prizmalar ve lenslerin (göz tedavisi ile ilgili olanlar hariç) bakım ve onarımı, • fotoğrafçılıkla ilgili aletlerin bakım ve onarımı. Kapsam dışı olanlar: - fotokopi makinelerinin bakım ve onarımı, bkz. 33.12, - bilgisayar ve çevre birimlerinin bakım ve onarımı, bkz. 95.11, - bilgisayar projektörlerinin bakım ve onarımı, bkz. 95.11, - iletişim donanımlarının bakım ve onarımı, bkz. 95.12, - ticari TV ve video kameralarının bakım ve onarımı, bkz. 95.12, - ev tipi video kameralarının onarımı, bkz. 95.21, - kol,… @tr
preferred label: Ремонт на електронни и оптични уреди и апарати @bg
preferred label: Opravy elektronických a optických přístrojů a zařízení @cs
preferred label: Reparation af elektronisk og optisk udstyr @da
preferred label: Reparatur von elektronischen und optischen Geräten @de
preferred label: Επισκευή ηλεκτρονικού και οπτικού εξοπλισμού @el
preferred label: Reparación de equipos electrónicos y ópticos @es
preferred label: Elektroonika- ja optikaseadmete remont @et
preferred label: Elektronisten ja optisten laitteiden korjaus ja huolto @fi
preferred label: Réparation de matériels électroniques et optiques @fr
preferred label: Elektronikus, optikai eszköz javítása
preferred label: Riparazione di apparecchiature elettroniche e ottiche @it
preferred label: Elektroninės ir optinės įrangos remontas @lt
preferred label: Elektronisko iekārtu un optisko ierīču remonts @lv
preferred label: Tiswija ta' tagħmir elettroniku u ottiku @mt
preferred label: Reparatie van elektronische en optische apparatuur @nl
preferred label: Reparasjon av elektronisk og optisk utstyr @no
preferred label: Naprawa urządzeń elektronicznych i optycznych @pl
preferred label: Reparação de equipamento electrónico e óptico @pt
preferred label: Repararea echipamentelor electronice şi optice @ro
preferred label: Ремонт электронного и оптического оборудования @ru
preferred label: Oprava elektronických a optických prístrojov @sk
preferred label: Popravila elektronskih in optičnih naprav @sl
preferred label: Reparation av elektronisk och optisk utrustning @sv
preferred label: Elektronik veya optik ekipmanların onarımı @tr
broader: Repair of fabricated metal products, machinery and equipment

Repair of electrical equipment
type: Concept
notation: 33.14
status: valid
status modified: 2013-10-18
accepted date: 2013-10-18
in scheme: Statistical Classification of Economic Activities in the European Community, Rev. 2 (2008)
scope note: Ремонт и поддържане на изделията от 27 раздел, без тези от група 27.5 (битови уреди). - ремонт и поддържане на трансформатори за разпределение на електрическа енергия, трансформатори за електродъгово заваряване и други трансформатори - ремонт и поддържане на електрически двигатели, генератори и моторгенераторни групи - ремонт и поддържане на комутационни апарати за енергетиката - ремонт и поддържане на електрически релета и табла за управление за електрическите разпределителни мрежи - ремонт и поддържане на акумулаторни батерии и акумулатори - ремонт и поддържане на лампи и осветители - ремонт и поддържане на токопреносни и нетокопреносни кабелни устройства за електрически мрежи - ремонт на компютри и периферни устройства - 95.11 - ремонт на телефонни апарати и други устройства за далекосъобщения - 95.12 - ремонт на битова електроника - 95.21 - ремонт на часовници - 95.25 @bg
scope note: Tato třída zahrnuje opravy a údržbu výrobků oddílu 27, kromě výrobků skupiny 27.5 (přístroje převážně pro domácnost). Z: - opravy a údržbu síťových, distribučních a speciálních transformátorů - opravy a údržbu elektromotorů, generátorů a generátorových soustrojí - opravy a údržbu elektrických rozvodných a kontrolních zařízení - opravy a údržbu elektrických stykačů a relé - opravy a údržbu baterií a akumulátorů - opravy a údržbu elektrických osvětlovacích zařízení - opravy a údržbu vodivého nebo nevodivého instalačního materiálu pro elektrické obvody N: - opravy a údržbu počítačů a periferních zařízení (95.11) - opravy a údržbu komunikačních zařízení (95.12) - opravy a údržbu spotřební elektroniky (95.21) - opravy hodin a hodinek (95.25) @cs
scope note: Diese Klasse umfasst die Reparatur und Instandhaltung von Waren der Abteilung 27, ohne diejenigen der Gruppe 27.5 (Haushaltsgeräte). Diese Klasse umfasst: - Reparatur und Instandhaltung von Leistungs-, Verteil- und sonstigen Transformatoren - Reparatur und Instandhaltung von elektrischen Motoren, Generatoren und Motorenaggregaten - Reparatur und Instandhaltung von Schaltanlagen und Schaltgeräten - Reparatur und Instandhaltung von Relais und industriellen Steuerungseinrichtungen - Reparatur und Instandhaltung von Batterien und Akkumulatoren - Reparatur und Instandhaltung von elektrischen Lampen und Leuchten - Reparatur und Instandhaltung von stromführendem Installationsmaterial und nicht stromführendem Installationsmaterial für die Installation von Stromkreisen Diese Klasse umfasst nicht: - Reparatur und Instandhaltung von Datenverarbeitungsgeräten und peripheren Geräten (s. 95.11) - Reparatur und Instandhaltung von Kommunikationsgeräten (s. 95.12) - Reparatur und Instandhaltung von Geräten der Unterhaltungselektronik (s. 95.21) - Reparatur von Uhren (s. 95.25) @de
scope note: This class includes the repair and maintenance of goods of division 27, except those in class group 27.5 (domestic appliances). This class includes: - repair and maintenance of power, distribution, and specialty transformers - repair and maintenance of electric motors, generators, and motor generator sets - repair and maintenance of switchgear and switchboard apparatus - repair and maintenance of relays and industrial controls - repair and maintenance of primary and storage batteries - repair and maintenance of electric lighting equipment - repair and maintenance of current-carrying wiring devices and non current-carrying wiring devices for wiring electrical circuits This class excludes: - repair and maintenance of computers and peripheral computer equipment, see 95.11 - repair and maintenance of telecommunications equipment, see 95.12 - repair and maintenance of consumer electronics, see 95.21 - repair of watches and clocks, see 95.25 @en
scope note: Esta clase comprende la reparación y el mantenimiento de los productos de la división 27, excepto de aquéllos incluidos en el grupo 27.5 (aparatos domésticos). Esta clase comprende: - la reparación y el mantenimiento de transformadores eléctricos y de distribución - la reparación y el mantenimiento de motores y generadores eléctricos y grupos electrógenos - la reparación y el mantenimiento de aparatos y cuadros de conmutación - la reparación y el mantenimiento de relés y controles industriales - la reparación y el mantenimiento de baterías primarias y de almacenamiento - la reparación y el mantenimiento de equipos de alumbrado eléctrico - la reparación y el mantenimiento de dispositivos de cableado portador o no de corriente para circuitos eléctricos Esta clase no comprende: - la reparación y el mantenimiento de ordenadores y periféricos (véase 95.11) - la reparación y el mantenimiento de equipos de telecomunicación (véase 95.12) - la reparación y el mantenimiento de productos de electrónica de consumo (véase 95.21) - la reparación de relojes (véase 95.25) @es
scope note: Cette classe comprend la réparation et l’entretien des articles produits dans la division 27, à l’exception de ceux relevant du groupe 27.5 (appareils électroménagers). Cette classe comprend: - la réparation et l’entretien des transformateurs de puissance, de distribution et de transformateurs spéciaux - la réparation et l’entretien de moteurs et de générateurs électriques et de groupes électrogènes à moteur - la réparation et l’entretien de commutateurs et de tableaux de distribution - la réparation et l’entretien de relais et de contrôles industriels - la réparation et l’entretien de piles et de batteries électriques - la réparation et l’entretien d’appareils d’éclairage électrique - la réparation et l’entretien de dispositifs de câblage porteurs et non porteurs de courant pour le câblage d’installations électriques Cette classe ne comprend pas: - la réparation et l’entretien d’ordinateurs et d’équipements périphériques, voir 95.11 - la réparation et l’entretien d’équipements de télécommunications, voir 95.12 - la réparation et l’entretien de produits électroniques grand public, voir 95.21 - la réparation de montres et d’horloges, voir 95.25 @fr
scope note: Ovaj razred uključuje popravak i održavanje proizvoda odjeljka 27, osim onih iz razreda skupine 27.5 (onih koji se upotrebljavaju u kućanstvu). Ovaj razred uključuje: - popravak i održavanje transformatora za električnu energiju, distribuciju i specijalnih transformatora - popravak i održavanje električnih motora, generatora i generatorskih setova motora - popravak i održavanje aparata sa sklopivim prekidačima i razvodnom pločom - popravak i održavanje releja i aparata za kontrolu industrijskih procesa - popravak i održavanje primarnih baterija i akumulatora - popravak i održavanje električne rasvjetne opreme - popravak i održavanje strujnih žičanih uređaja i nestrujnih žičanih uređaja za električne strujne krugove Ovaj razred isključuje: - popravak i održavanje računala i periferne računalne opreme, vidi 95.11 - popravak i održavanje telekomunikacijske opreme, vidi 95.12 - popravak i održavanje elektronike za široku potrošnju, vidi 95.21 - popravak satova, vidi 95.25
scope note: Į šią klasę įeina 27 skyriuje pagamintų gaminių, išskyrus pagamintus 27.5 grupėje (buitiniai prietaisai ir aparatai), taisymas ir techninė priežiūra. Į šią klasę įeina: - galios, skirstomųjų ir specialiųjų transformatorių remontas ir techninė priežiūra - elektros variklių, generatorių ir variklių - generatorių agregatų remontas ir techninė priežiūra - perjungimo įrenginių ir skirstomųjų skydų aparatų remontas ir techninė priežiūra - relių ir pramoninių valdytuvų remontas ir techninė priežiūra - pirminių elementų ir akumuliatorių baterijų remontas ir techninė priežiūra - elektrinės apšvietimo įrangos remontas ir techninė priežiūra - elektros srovei laidžių ir nelaidžių įtaisų, skirtų elektros grandinėms įrengti, remontas ir techninė priežiūra Į šią klasę neįeina: - kompiuterių ir išorinės įrangos remontas ir techninė priežiūra, žr. 95.11 - telekomunikacijų įrangos remontas ir techninė priežiūra, žr. 95.12 - buitinės elektroninės aparatūros remontas ir techninė priežiūra, žr. 95.21 - įvairių tipų laikrodžių taisymas, žr. 95.25 @lt
scope note: Данный класс включает ремонт, технический уход и обслуживание прочего транспортного оборудования раздела 30, за исключением мотоциклов и велосипедов. Этот класс включает: - ремонт, технический уход и обслуживание локомотивов и железнодорожных вагонов (за исключением реконструкции или капитального ремонта) - ремонт тележек, повозок и фургонов, запрягаемых животными Этот класс исключает: - капитальный ремонт и реконструкцию локомотивов и железнодорожных вагонов, см. 30.20 - ремонт, технический уход и обслуживание военных боевых автотранспортных средств, см. 30.40 - ремонт, технический уход и обслуживание магазинных тележек, см. 33.11 - ремонт, технический уход и обслуживание железнодорожных двигателей, см. 33.12 - ремонт, технический уход и обслуживание мотоциклов, см. 45.40 - ремонт велосипедов, см. 95.29 @ru
scope note: Bu sınıf, bölüm 27 deki ürünlerin (grup 27.5 altındaki sınıflarda yer alanlar (ev aletleri) hariç) bakım ve onarımını kapsamaktadır. Bu sınıf aşağıdakileri kapsamaktadır: - güç transformatörleri, dağıtım transformatörleri ve özel transformatörlerin bakım ve onarımı, - elektrik motorları, jeneratörler ve motor jeneratör setlerinin bakım ve onarımı, - elektrik bağlantı düzeneği (şalt cihazı) ve elektrikli kumanda panosu cihazlarının bakım ve onarımı, - röle (konvertisör) ve sanayi kontrol cihazlarının bakım ve onarımı, - pil, bataryan ve akümülatörlerin bakım ve onarımı, - elektrikli aydınlatma donanımlarının bakım ve onarımı, - elektrikli kablolama devreleri için akım taşısın ya da taşımasın kablolamada kullanılan cihazların bakım ve onarımı. Kapsam dışı olanlar: - bilgisayar ve çevre birimlerinin bakım ve onarımı, bkz. 95.11, - telekomünikasyon cihazlarının bakım ve onarımı, bkz. 95.12, - tüketici elektroniklerinin bakım ve onarımı, bkz. 95.21, - kol, duvar ve masa saatlerinin onarımı, bkz. 95.25. @tr
preferred label: Ремонт на електрически съоръжения @bg
preferred label: Opravy elektrických zařízení @cs
preferred label: Reparation af elektrisk udstyr @da
preferred label: Reparatur von elektrischen Ausrüstungen @de
preferred label: Επισκευή ηλεκτρικού εξοπλισμού· @el
preferred label: Reparación de equipos eléctricos @es
preferred label: Elektriseadmete remont @et
preferred label: Sähkölaitteiden korjaus ja huolto @fi
preferred label: Réparation d'équipements électriques @fr
preferred label: Ipari villamos gép, berendezés javítása
preferred label: Riparazione di apparecchiature elettriche @it
preferred label: Elektros įrangos remontas @lt
preferred label: Elektroierīču remonts @lv
preferred label: Tiswija ta' tagħmir elettriku @mt
preferred label: Reparatie van elektrische apparatuur @nl
preferred label: Reparasjon av elektrisk utstyr @no
preferred label: Naprawa urządzeń elektrycznych @pl
preferred label: Reparação de equipamento eléctrico @pt
preferred label: Repararea echipamentelor electrice @ro
preferred label: Ремонт электрического оборудования @ru
preferred label: Oprava elektrických prístrojov @sk
preferred label: Popravila električnih naprav @sl
preferred label: Reparation av elapparatur @sv
preferred label: Elektrikli donanımların onarımı @tr
broader: Repair of fabricated metal products, machinery and equipment

Repair and maintenance of ships and boats
type: Concept
notation: 33.15
status: valid
status modified: 2013-10-18
accepted date: 2013-10-18
in scheme: Statistical Classification of Economic Activities in the European Community, Rev. 2 (2008)
scope note: Ремонт и поддържане на плавателни съдове. Основният ремонт и възстановяването (реконструкцията) на плавателни съдове се класифицират в раздел 30. - ремонт и поддържане на кораби - ремонт и поддържане на плавателни съдове за отдих - преустройство на кораби в корабостроителниците - 30.1 - ремонт на двигатели за плавателни съдове - 33.12 - разрушаване на кораби - 38.31 @bg
scope note: Tato třída zahrnuje opravy a údržbu lodí a člunů. Průmyslová přestavba a generální opravy lodí jsou zahrnuty v oddílu 30. Z: - běžné opravy a údržbu lodí - opravy a údržbu rekreačních lodí N: - průmyslovou přestavbu a generální opravy lodí a člunů (30.1) - opravy lodních motorů a motorů pro čluny (33.12) - demontáž plavidel (sešrotování lodí) (38.31) @cs
scope note: Diese Klasse umfasst die Reparatur und Instandhaltung von Schiffen und Booten. Die Werksüberholung und der werksseitige Umbau von Schiffen fällt jedoch unter Abteilung 30. Diese Klasse umfasst: - Reparatur und laufende Instandhaltung von Schiffen - Reparatur und Instandhaltung von Vergnügungsschiffen Diese Klasse umfasst nicht: - Werksseitiger Schiffsumbau (s. 30.1) - Reparatur von Schiffs- und Bootsmotoren (s. 33.12) - Schiffsverschrottung (s. 38.31) @de
scope note: This class includes the repair and maintenance of ships and boats. However, the factory rebuilding or overhaul of ships is classified in division 30. This class includes: - repair and routine maintenance of ships - repair and maintenance of pleasure boats This class excludes: - factory conversion of ships, see 30.1 - repair of ship and boat engines, see 33.12 - ship scrapping, dismantling, see 38.31 @en
scope note: Esta clase comprende la reparación y el mantenimiento de barcos. No obstante, la reconstrucción o revisión de embarcaciones en fábrica se clasifica en la división 30. Esta clase comprende: - la reparación y el mantenimiento rutinario de barcos - la reparación y el mantenimiento de embarcaciones de recreo Esta clase no comprende: - la transformación de embarcaciones en fábrica (véase 30.1) - la reparación de motores de barcos (véase 33.12) - el desguace naval ( véase 38.31) @es
scope note: Cette classe comprend les activités de réparation navale. Néanmoins, la reconstruction ou la révision des navires et des bateaux relèvent de la classe 30. Cette classe comprend: - la réparation et l’entretien régulier des navires et bateaux - la réparation et l’entretien des bateaux de plaisance Cette classe ne comprend pas: - la conversion de navires et de bateaux en usine, voir 30.1 - la réparation de moteurs de bateaux et de navires, voir 33.12 - la démolition navale, voir 38.31 @fr
scope note: Ovaj razred uključuje popravak i održavanje čamaca i brodova. Ipak, tvornička rekonstrukcija i servis brodova razvrstani su u odjeljak 30. Ovaj razred uključuje: - popravak i redovito održavanje brodova - popravak i održavanje čamaca za razonodu Ovaj razred isključuje: - tvorničku rekonstrukciju brodova, vidi 30.1 - popravak motora brodova i čamaca, vidi 33.12 - skidanje hrđe s brodova, demontiranje, vidi 38.31
scope note: Į šią klasę įeina laivų ir katerių remontas ir techninė priežiūra. Tačiau pramoninė laivų rekonstrukcija ar kapitalinis remontas klasifikuojami 30 skyriuje. Į šią klasę įeina: - laivų remontas ir einamoji techninė priežiūra - pramoginių katerių remontas ir techninė priežiūra Į šią klasę neįeina: - pramoninis laivų perstatymas, žr. 30.1 - laivų ir katerių variklių remontas, žr. 33.12 - laivų pjaustymas, išmontavimas, žr. 38.31 @lt
scope note: Этот подкласс включает ремонт, технический уход и обслуживание оборудования, не включенного в другие категории. Этот класс включает: - ремонт рыболовных сетей, включая штопку - ремонт канатов, такелажа, парусов - ремонт мешков для хранения удобрений и химических составов - ремонт или реставрацию деревянных паллет, ящиков для упаковки товаров, бочек и т.п. - ремонт автоматов для игры в пинбол и прочих игровых автоматов, начинающих работать после опускания монеты - реставрацию органов и прочих исторических музыкальных инструментов Этот класс исключает: - ремонт бытовой, ресторанной и офисной мебели, см. 95.24 - ремонт велосипедов, см. 95.29 - ремонт и починку одежды, см. 95.29 @ru
scope note: Bu sınıf gemi ve teknelerin bakım ve onarımını kapsamaktadır. Bununla birlikte, gemilerin fabrikalarda yeniden inşa edilmesi ve bakım-onarım amacıyla elden geçirilmesi bölüm 30`da sınıflandırılmıştır. Bu sınıf aşağıdakileri kapsamaktadır: - gemilerin onarımı ve rutin bakımları - eğlence teknelerinin bakım ve onarımı. Kapsam dışı olanlar: - gemilerin fabrikalarda yeniden inşa edilmesi, bkz. 30.1, - gemi ve tekne motorlarının onarımı, bkz. 33.12, - gemilerin parçalanması, sökülmesi, bkz. 38.31. @tr
preferred label: Ремонт и поддържане на плавателни съдове @bg
preferred label: Opravy a údržba lodí a člunů @cs
preferred label: Reparation og vedligeholdelse af skibe og både @da
preferred label: Reparatur und Instandhaltung von Schiffen, Booten und Yachten @de
preferred label: Επισκευή και συντήρηση πλοίων και σκαφών @el
preferred label: Reparación y mantenimiento naval @es
preferred label: Laevade ja paatide remont ja hooldus @et
preferred label: Laivojen ja veneiden korjaus ja huolto @fi
preferred label: Réparation et maintenance navale @fr
preferred label: Hajó, csónak javítása
preferred label: Riparazione e manutenzione di navi e imbarcazioni @it
preferred label: Įvairių tipų laivų remontas ir techninė priežiūra @lt
preferred label: Kuģu un laivu remonts un apkope @lv
preferred label: Tiswija u manutenzjoni ta' vapuri u dgħajjes @mt
preferred label: Reparatie en onderhoud van schepen @nl
preferred label: Reparasjon og vedlikehold av skip og båter @no
preferred label: Naprawa i konserwacja statków i łodzi @pl
preferred label: Reparação e manutenção de embarcações @pt
preferred label: Repararea şi întreţinerea navelor şi bărcilor @ro
preferred label: Ремонт, техническое обслуживание кораблей и лодок @ru
preferred label: Oprava a údržba lodí a člnov @sk
preferred label: Popravila in vzdrževanje ladij in čolnov @sl
preferred label: Reparation och underhåll av fartyg och båtar @sv
preferred label: Gemi ve teknelerin bakım ve onarımı @tr
broader: Repair of fabricated metal products, machinery and equipment

Repair and maintenance of aircraft and spacecraft
type: Concept
notation: 33.16
status: valid
status modified: 2013-10-18
accepted date: 2013-10-18
in scheme: Statistical Classification of Economic Activities in the European Community, Rev. 2 (2008)
scope note: - ремонт и поддържане на въздухоплавателни средства (без основния ремонт, преустройството и възстановяването) - ремонт и поддържане на двигатели за въздухоплавателни средства - възстановяване на въздухоплавателни средства - 30.30 @bg
scope note: Z: - běžné opravy a údržbu letadel (kromě přestavby a generálních oprav prováděných výrobcem) - běžné opravy a údržbu leteckých motorů N: - průmyslovou přestavbu, renovace a generální opravy letadel nebo jejich motorů (30.30) @cs
scope note: Diese Klasse umfasst die Reparatur und Instandhaltung von Luft- und Raumfahrzeugen. Diese Klasse umfasst: - Reparatur und Instandhaltung von Luftfahrzeugen (ohne werksseitigen Umbau oder Überholung) - Reparatur und Instandhaltung von Flugtriebwerken Diese Klasse umfasst nicht: - Werksseitiger Umbau oder Überholung von Luftfahrzeugen (s. 30.30) @de
scope note: This class includes the repair and maintenance of aircraft and spacecraft. This class includes: - repair and maintenance of aircraft (except factory conversion, factory overhaul, factory rebuilding) - repair and maintenance of aircraft engines This class excludes: - factory overhaul and rebuilding of aircraft, see 30.30 @en
scope note: Esta clase comprende la reparación y el mantenimiento de aeronaves y naves espaciales. Esta clase comprende: - la reparación y el mantenimiento de aeronaves (a excepción de la transformación, la revisión o la reconstrucción en fábrica) - la reparación y el mantenimiento de motores de aviación Esta clase no comprende: - la revisión y reconstrucción de aeronaves en fábrica (véase 30.30) @es
scope note: Cette classe comprend les activités de réparation et d’entretien d’aéronefs et d’engins spatiaux. Cette classe comprend: - la réparation et l’entretien d’aéronefs (à l’exception de la conversion, de la révision et de la reconstruction en usine) - la réparation et l’entretien de moteurs d’aéronefs Cette classe ne comprend pas: - la révision et la reconstruction d’aéronefs en usine, voir 30.30 @fr
scope note: Ovaj razred uključuje popravak i održavanje zrakoplova i svemirskih letjelica. Ovaj razred uključuje: - popravak i održavanje zrakoplova (osim tvorničkih prenamjena, servisa, rekonstrukcija) - popravak i održavanje zrakoplovnih motora Ovaj razred isključuje: - tvornički pregled i rekonstrukciju zrakoplova, vidi 30.30
scope note: Į šią klasę įeina orlaivių ir erdvėlaivių remontas ir techninė priežiūra. Į šią klasę įeina: - orlaivių remontas ir techninė priežiūra (išskyrus pramoninį perstatymą, pramoninį kapitalinį remontą, pramoninę rekonstrukciją) - orlaivių variklių remontas ir techninė priežiūra Į šią klasę neįeina: - orlaivių pramoninis kapitalinis remontas ir pramoninė rekonstrukcija, žr. 30.30 @lt
scope note: Bu sınıf hava ve uzay araçlarının bakım ve onarımını kapsamaktadır. Bu sınıf aşağıdakileri kapsamaktadır: - hava taşıtlarının bakım ve onarımı (fabrikalarda yapılan dönüştürme, elden geçirme ve yeniden üretme hariç), - hava taşıtı motorlarının bakım ve onarımı. Kapsam dışı olanlar: - hava taşıtlarının fabrikalarda bakım ve onarım amacıyla elden geçirilmesi ve yeniden inşa edilmesi, bkz. 30.30. @tr
preferred label: Ремонт и поддържане на въздухоплавателни и космически средства @bg
preferred label: Opravy a údržba letadel a kosmických lodí @cs
preferred label: Reparation og vedligeholdelse af luft- og rumfartøjer @da
preferred label: Reparatur und Instandhaltung von Luft- und Raumfahrzeugen @de
preferred label: Επισκευή και συντήρηση αεροσκαφών και διαστημόπλοιων @el
preferred label: Reparación y mantenimiento aeronáutico y espacial @es
preferred label: Õhu- ja kosmosesõidukite remont ja hooldus @et
preferred label: Ilma- ja avaruusalusten korjaus ja huolto @fi
preferred label: Réparation et maintenance d'aéronefs et d'engins spatiaux @fr
preferred label: Repülőgép, űrhajó javítása
preferred label: Riparazione e manutenzione di aeromobili e veicoli spaziali @it
preferred label: Orlaivių ir erdvėlaivių remontas ir techninė priežiūra @lt
preferred label: Lidaparātu un kosmosa kuģu remonts un apkope @lv
preferred label: Tiswija u manutenzjoni ta' inġenji ta' l-ajru u inġenji ta' l-ispazju @mt
preferred label: Reparatie en onderhoud van lucht- en ruimtevaartuigen @nl
preferred label: Reparasjon og vedlikehold av luftfartøyer og romfartøyer @no
preferred label: Naprawa i konserwacja statków powietrznych i statków kosmicznych @pl
preferred label: Reparação e manutenção de aeronaves e de veículos espaciais @pt
preferred label: Repararea şi întreţinerea aeronavelor şi navelor spaţiale @ro
preferred label: Ремонт, техническое обслуживание воздушных судов и космических судов @ru
preferred label: Oprava a údržba lietadiel a kozmických lodí @sk
preferred label: Popravila in vzdrževanje zračnih in vesoljskih plovil @sl
preferred label: Reparation och underhåll av luftfartyg och rymdfarkoster @sv
preferred label: Hava ve uzay araçlarının bakım ve onarımı @tr
broader: Repair of fabricated metal products, machinery and equipment

Repair and maintenance of other transport equipment
type: Concept
notation: 33.17
status: valid
status modified: 2013-10-18
accepted date: 2013-10-18
in scheme: Statistical Classification of Economic Activities in the European Community, Rev. 2 (2008)
scope note: Ремонт и поддържане на други превозните средства от раздел 30, без мотоциклети и велосипеди. - ремонт и поддържане на локомотиви, мотриси и вагони (без основния ремонт, преустройството и възстановяването) - ремонт на превозни средства, теглени от животни - основен ремонт и възстановяване на локомотиви, мотриси и вагони - 30.20 - ремонт и поддържане на бойни бронирани транспортни машини - 30.40 - ремонт и поддържане на колички за пазаруване - 33.11 - ремонт и поддържане на двигатели за локомотиви и мотриси - 33.12 - техническо обслужване и ремонт на мотоциклети - 45.40 - ремонт на велосипеди - 95.29 @bg
scope note: Tato třída zahrnuje opravy a údržbu ostatních dopravních prostředků a zařízení oddílu 30, kromě motocyklů a jízdních kol. Z: - opravy a údržbu lokomotiv a kolejových vozidel (kromě přestavby a generálních oprav prováděných výrobcem) - opravy bryček a povozů tažených zvířaty N: - průmyslovou přestavbu a generální opravy lokomotiv a kolejových vozidel (30.20) - opravy a údržbu vojenských bojových vozidel (30.40) - opravy a údržbu nákupních vozíků (33.11) - opravy a údržbu motorů kolejových vozidel (33.12) - opravy a údržbu motocyklů (45.40) - opravy a údržbu jízdních kol (95.29) @cs
scope note: Diese Klasse umfasst die Reparatur und Instandhaltung von sonstigen Fahrzeugen der Abteilung 30, außer Kraft- und Fahrrädern. Diese Klasse umfasst: - Reparatur und Instandhaltung von Schienenfahrzeugen (ohne werksseitigen Umbau oder Überholung) - Reparatur von Gespannfahrzeugen, die von Tieren gezogen werden Diese Klasse umfasst nicht: - Werksseitiger Umbau oder Überholung von Schienenfahrzeugen (s. 30.20) - Reparatur und Instandhaltung von militärischen Kampffahrzeugen (s. 30.40) - Reparatur und Instandhaltung von Einkaufswagen (s. 33.11) - Reparatur und Instandhaltung von Schienenfahrzeugmotoren (s. 33.12) - Reparatur und Instandhaltung von Krafträdern (s. 45.40) - Reparatur von Fahrrädern (s. 95.29) @de
scope note: This class includes the repair and maintenance of other transport equipment of division 30, except motorcycles and bicycles. This class includes: - repair and maintenance of locomotives and railroad cars (except factory rebuilding or factory conversion) - repair of animal drawn buggies and wagons This class excludes: - factory overhaul and rebuilding of locomotives and railroad cars, see 30.20 - repair and maintenance of military fighting vehicles, see 30.40 - repair and maintenance of shopping carts, see 33.11 - repair and maintenance of railway engines, see 33.12 - repair and maintenance of motorcycles, see 45.40 - repair of bicycles, see 95.29 @en
scope note: Esta clase comprende la reparación y el mantenimiento de otro material de transporte de la división 30, a excepción de las motocicletas y bicicletas. Esta clase comprende: - la reparación y el mantenimiento de locomotoras y vagones ferroviarios (excepto las tareas de reconstrucción o transformación en fábrica) - la reparación de calesas y carros de tracción animal Esta clase no comprende: - la revisión y reconstrucción en fábrica de locomotoras y vagones ferroviarios (véase 30.20) - la reparación y mantenimiento de vehículos militares de combate (véase 30.40) - la reparación y el mantenimiento de carros de supermercado (véase 33.11) - la reparación de motores para ferrocarril (véase 33.12) - la reparación y el mantenimiento de motocicletas (véase 45.40) - la reparación de bicicletas (véase 95.29) @es
scope note: Cette classe comprend la réparation et l’entretien d’autres matériels de transport relevant de la division 30, à l’exception des motocycles et des bicyclettes. Cette classe comprend: - la réparation et l’entretien des locomotives et des wagons (à l’exception de la reconstruction ou de la conversion en usine) - la réparation de véhicules à traction animale Cette classe ne comprend pas: - la révision et la reconstruction de locomotives et de wagons en usine, voir 30.20 - la réparation et l’entretien de véhicules militaires de combat, voir 30.40 - la réparation et l’entretien de chariots pour achats, voir 33.11 - la réparation et l’entretien de moteurs pour véhicules ferroviaires, voir 33.12 - la réparation et l’entretien de motocycles, voir 45.40 - la réparation de bicyclettes, voir 95.29 @fr
scope note: Ovaj razred uključuje popravak i održavanje ostale prijevozne opreme iz odjeljka 30, osim motocikala i bicikala. Ovaj razred uključuje: - popravak i održavanje lokomotiva i tračnih vozila (osim tvorničkih rekonstrukcija i tvorničkih prenamjena) - popravak kola i vagona koje vuku životinje Ovaj razred isključuje: - tvornički pregled i rekonstrukcija lokomotiva i tračnih vozila, vidi 30.20 - popravak i održavanje vojnih borbenih vozila, vidi 30.40 - popravak i održavanje kolica za kupnju, vidi 33.11 - popravak i održavanje motora vlakova, vidi 33.12 - popravak i održavanje motocikala, vidi 45.40 - popravak bicikla, vidi 95.29
scope note: Į šią klasę įeina kitos 30 skyriuje pagamintos transporto įrangos, išskyrus motociklus ir dviračius, remontas ir techninė priežiūra. Į šią klasę įeina: - lokomotyvų ir vagonų remontas ir techninė priežiūra (išskyrus pramoninę rekonstrukciją ir pramoninį perstatymą) - gyvūnų traukiamų vežimų ir furgonų remontas Į šią klasę neįeina: - lokomotyvų ir vagonų pramoninis kapitalinis remontas ir rekonstrukcija, žr. 30.20 - karinių kovinių transporto priemonių remontas ir techninė priežiūra, žr. 30.40 - prekių vežimėlių remontas ir techninė priežiūra, žr. 33.11 - geležinkelio transporto priemonių variklių remontas ir techninė priežiūra, žr. 33.12 - motociklų remontas ir techninė priežiūra, žr. 45.40 - dviračių taisymas, žr. 95.29 @lt
scope note: Данный класс включает специализированную установку техники. Однако установка оборудования, которая формирует интегральную часть зданий или подобных структур, такая как, установка эскалаторов, электрической проводки, противовзломных систем или систем воздушного кондиционирования, классифицирована в разделах, посвященных строительству. Этот класс включает: - установку промышленного оборудования на промышленных предприятиях - сборку оборудования для контроля промышленных процессов - установку прочего промышленного оборудования, например: • коммуникационного оборудования • многофункциональных компьютеров • иррадиационного и электромедицинского оборудования и т.д. - демонтаж крупной техники и оборудования - сборку оборудования - монтаж/установку оборудования - установку оборудования для кегельбанов Этот класс исключает: - установку элеваторов, эскалаторов, автоматических дверей, вакуумных чистящих установок и т.д., см. 43.29 - установку дверей, лестниц, оборудования для магазинов, мебели и т.д., см. 43.32 - установку (настройку) персональных компьютеров, см. 62.09 @ru
scope note: Bu sınıf, bölüm 30`daki diğer ulaşım araçlarının bakım ve onarımını kapsamaktadır (motosikletler ve bisikletler hariç). Bu sınıf aşağıdakileri kapsamaktadır; - lokomotifler ve vagonlarının bakım ve onarımı (fabrikalarda yapılan dönüştürme ve yeniden inşa etme hariç), - at arabaları ve dört tekerlekli yük arabalarının bakım ve onarımı, Kapsam dışı olanlar: - lokomotiflerin ve vagonların fabrikalarda bakım ve onarım amacıyla elden geçirilmesi ve yeniden inşa edilmesi, bkz. 30.20, - askeri savaş araçlarının bakım ve onarımı bkz.30.40, - alışveriş arabalarının bakım ve onarımı, bkz. 33.11, - demiryolu araç motorlarının bakım ve onarımı, bkz. 33.12, - motosikletlerin bakım ve onarımı, bkz. 45.40, - bisikletlerin onarımı, bkz. 95.29. @tr
preferred label: Ремонт и поддържане на други превозни средства @bg
preferred label: Opravy a údržba ostatních dopravních prostředků a zařízení @cs
preferred label: Reparation og vedligeholdelse af andre transportmidler @da
preferred label: Reparatur und Instandhaltung von Fahrzeugen a. n. g. @de
preferred label: Επισκευή και συντήρηση άλλου εξοπλισμού μεταφορών @el
preferred label: Reparación y mantenimiento de otro material de transporte @es
preferred label: Muude transpordivahendite remont ja hooldus @et
preferred label: Muiden kulkuneuvojen korjaus ja huolto @fi
preferred label: Réparation et maintenance d'autres équipements de transport @fr
preferred label: Egyéb közlekedési eszköz javítása
preferred label: Riparazione e manutenzione di altri mezzi di trasporto @it
preferred label: Kitų transporto priemonių remontas ir techninė priežiūra @lt
preferred label: Cita veida transportlīdzekļu apkope un remonts @lv
preferred label: Tiswija u manutenzjoni ta' tagħmir ieħor għat-trasport @mt
preferred label: Reparatie en onderhoud van andere transportmiddelen @nl
preferred label: Reparasjon og vedlikehold av andre transportmidler @no
preferred label: Naprawa i konserwacja pozostałego sprzętu transportowego @pl
preferred label: Reparação e manutenção de outro equipamento de transporte @pt
preferred label: Repararea şi întreţinerea altor echipamentelor de transport n.c.a. @ro
preferred label: Ремонт, техническое обслуживание прочих видов транспортного оборудования @ru
preferred label: Oprava a údržba ostatných dopravných prostriedkov @sk
preferred label: Popravila in vzdrževanje drugih prevoznih sredstev @sl
preferred label: Reparation och underhåll av andra transportmedel @sv
preferred label: Diğer ulaşım araçlarının bakım ve onarımı @tr
broader: Repair of fabricated metal products, machinery and equipment

Repair of other equipment
type: Concept
notation: 33.19
status: valid
status modified: 2013-10-18
accepted date: 2013-10-18
in scheme: Statistical Classification of Economic Activities in the European Community, Rev. 2 (2008)
scope note: - поправка на рибарски мрежи, вкл. изкърпване - поправка на въжета, такелаж, корабни платна и покривала - поправка на чували за съхранение на торове и химикали - ремонт и възстановяване на дървени палета, корабни барабани и подобни изделия - ремонт на игри функциониращи чрез вкарване на монети - реставриране на органи и други старинни музикални инструменти - ремонт и реставриране на мебели - 95.24 - ремонт на велосипеди - 95.29 - поправка и корекция на облекло - 95.29 @bg
scope note: Tato třída zahrnuje opravy a údržbu přístrojů a zařízení, které nepatří do žádné jiné skupiny tohoto oddílu. Z: - opravy rybářských sítí, včetně spravování - opravy lan, lanoví, plachet, plachtovin a celt - opravy pytlů pro skladování hnojiv a chemikálií - opravy nebo obnova dřevěných palet, přepravních sudů nebo barelů a podobných výrobků - opravu hracích automatů a ostatních hracích automatů na mince - restaurování varhan a jiných historických hudebních nástrojů N: - opravy bytového nebo kancelářského nábytku, restaurování nábytku (95.24) - opravy jízdních kol (95.29) - opravy a úpravy oděvů (95.29) @cs
scope note: Diese Klasse umfasst die Reparatur und Instandhaltung von Ausrüstungen, die in keine andere Gruppe dieser Abteilung fallen. Diese Klasse umfasst: - Reparatur von Fischernetzen, einschließlich Ausbessern - Reparatur von Seilen, Leinen und Planen - Reparatur von Säcken zur Lagerung von Düngemitteln und Chemikalien - Reparatur oder Instandsetzung von Paletten, Transportfässern und ähnlichen Gegenständen aus Holz - Reparatur von Flippern und sonstiger Münzspielgeräten - Restaurierung von Orgeln und historischen Musikinstrumenten Diese Klasse umfasst nicht: - Reparatur von Wohn- oder Büromöbeln, Restaurierung von Möbeln (s. 95.24) - Reparatur von Fahrrädern (s. 95.29) - Reparatur und Änderung von Bekleidung (s. 95.29) @de
scope note: This class includes the repair and maintenance of equipment not covered in other groups of this division. This class includes: - repair of fishing nets, including mending - repair or ropes, riggings, canvas and tarpaulins - repair of fertiliser and chemical storage bags - repair or reconditioning of wooden pallets, shipping drums or barrels, and similar items - repair of pinball machines and other coin-operated games - restoring of organs and other historical musical instruments This class excludes: - repair of household and office type furniture, furniture restoration, see 95.24 - repair of bicycles, see 95.29 - repair and alteration of clothing, see 95.29 @en
scope note: Esta clase comprende la reparación y el mantenimiento de equipos no incluidos en otros grupos de la presente división. Esta clase comprende: - la reparación de redes para pescar, incluido su remiendo - la reparación de cuerdas, jarcias, velamen y lonas - la reparación de bolsas para el almacenamiento de fertilizantes y productos químicos - la reparación o reacondicionamiento de toneles, barriles y palets de madera, así como de artículos análogos - la reparación de máquinas pinball y otros juegos accionados con monedas - la restauración de órganos y otros instrumentos musicales históricos Esta clase no comprende: - la reparación de mobiliario doméstico y de oficina, la restauración de muebles (véase 95.24) - la reparación de bicicletas (véase 95.29) - la reparación y arreglo de prendas de vestir (véase 95.29) @es
scope note: Cette classe comprend la réparation et l’entretien d’équipements non couverts dans d’autres groupes de cette division. Cette classe comprend: - la réparation des filets de pêche, y compris le raccommodage - la réparation de cordes, gréements, toiles et toiles goudronnées - la réparation de sacs d’engrais et de stockage de produits chimiques - la réparation ou le reconditionnement de palettes en bois, de fûts ou de tonneaux de transport et d’articles similaires - la réparation de billards électriques et d’autres jeux fonctionnant au moyen de pièces de monnaie - la restauration d’orgues et d’autres instruments de musique historiques Cette classe ne comprend pas: - la réparation de mobilier domestique et de bureau, la restauration de meubles, voir 95.24 - la réparation de bicyclettes, voir 95.29 - la réparation et la transformation d’articles d’habillement, voir 95.29 @fr
scope note: Ovaj razred uključuje popravak i održavanje opreme koja nije pokrivena u ostalim skupinama ovog odjeljka. Ovaj razred uključuje: - popravak ribarskih mreža, uključujući krpanje - popravak užadi, snasti, platna za jedrenje i nepromočivih cerada - popravak vreća za čuvanje umjetnih gnojiva i kemikalija - popravak ili obnavljanje drvenih paleta, brodskih bačava i sličnih predmeta - popravak flipera i ostalih igraćih aparata na kovanice - restauriranje orgulja i ostalih povijesnih glazbenih instrumenata Ovaj razred isključuje: - popravak kućanskog i uredskog namještaja, restauriranje namještaja, vidi 95.24 - popravak bicikla, vidi 95.29 - popravak i prenamjenu odjeće, vidi 95.29
scope note: Į šią klasę įeina įrangos, neįtrauktos į kitas šio skyriaus klases, taisymas ir techninė priežiūra. Į šią klasę įeina: - tinklų žuvims gaudyti taisymas - virvių, laivavirvių, brezento ir tentų taisymas - trąšų ir chemikalų sandėliavimo talpyklų taisymas - medinių padėklų, vežimo statinių ar statinaičių ir panašių gaminių taisymas ar atnaujinimas - kiniško biliardo ir kitų moneta įjungiamų aparatų taisymas - vargonų ir kitų istorinių muzikos instrumentų restauravimas Į šią klasę neįeina: - namų ir įstaigų baldų taisymas, baldų atnaujinimas, žr. 95.24 - dviračių taisymas, žr. 95.29 - drabužių taisymas ir persiuvimas, žr. 95.29 @lt
scope note: Bu sınıf, bu bölümün diğer gruplarında kapsanmayan ekipmanların bakım ve onarımını kapsamaktadır. Bu sınıf aşağıdakileri kapsamaktadır; - balıkçılık ağlarının onarımı( örülmesi de dahil), - halatlar, gemi çarmık ve halatları ile yelken bezleri ve bez astarlı muşambaların onarılması, - gübre ve kimyasal maddeler için kullanılan çuvalların onarımı, - ahşap paletler, gemi fıçı veya varilleri ile benzer maddelerin onarımı ve yenilenmesi, - tilt oyunu makineleri ve madeni para ile çalışan diğer oyun makinelerinin onarımı, - orgların ve diğer tarihi müzik aletlerinin onarımı. Kapsam dışı olanlar: - ev ve büro tipi mobilyaların onarımı, mobilya restorasyonu, bkz. 95.24, - bisikletlerin onarımı, bkz. 95.29, - giysilerin onarımı ve yenilenmesi, bkz. 95.29. @tr
preferred label: Ремонт на друго оборудване @bg
preferred label: Opravy ostatních zařízení @cs
preferred label: Reparation af andet udstyr @da
preferred label: Reparatur von sonstigen Ausrüstungen @de
preferred label: Επισκευή άλλου εξοπλισμού @el
preferred label: Reparación de otros equipos @es
preferred label: Muude seadmete remont @et
preferred label: Muiden laitteiden korjaus ja huolto @fi
preferred label: Réparation d'autres équipements @fr
preferred label: Egyéb ipari eszköz javítása
preferred label: Riparazione di altre apparecchiature @it
preferred label: Kitos įrangos remontas @lt
preferred label: Citu ierīču remonts @lv
preferred label: Tiswija ta' tagħmir ieħor @mt
preferred label: Reparatie van andere apparatuur @nl
preferred label: Reparasjon av annet utstyr @no
preferred label: Naprawa pozostałych urządzeń @pl
preferred label: Reparação de outro equipamento @pt
preferred label: Repararea altor echipamente @ro
preferred label: Ремонт прочего оборудования @ru
preferred label: Oprava ostatných prístrojov @sk
preferred label: Popravila drugih naprav @sl
preferred label: Reparation av annan utrustning @sv
preferred label: Diğer ekipmanların onarımı @tr
broader: Repair of fabricated metal products, machinery and equipment

Installation of industrial machinery and equipment
type: Concept
notation: 33.2
status: valid
status modified: 2013-10-18
accepted date: 2013-10-18
in scheme: Statistical Classification of Economic Activities in the European Community, Rev. 2 (2008)
scope note: Данная группа включает выработку электроэнергии, ее передачу от генераторных систем к распределительным центрам и потребителю. @ru
preferred label: Инсталиране на машини и оборудване @bg
preferred label: Instalace průmyslových strojů a zařízení @cs
preferred label: Installation af industrimaskiner og -udstyr @da
preferred label: Installation von Maschinen und Ausrüstungen a. n. g. @de
preferred label: Εγκατάσταση βιομηχανικών μηχανημάτων και εξοπλισμού @el
preferred label: Instalación de máquinas y equipos industriales @es
preferred label: Tööstuslike masinate ja seadmete paigaldus @et
preferred label: Teollisuuden koneiden ja laitteiden ym. asennus @fi
preferred label: Installation de machines et d'équipements industriels @fr
preferred label: Ipari gép, berendezés üzembe helyezése
preferred label: Installazione di macchine e apparecchiature industriali @it
preferred label: Pramoninių mašinų ir įrangos įrengimas @lt
preferred label: Ražošanas iekārtu un ierīču uzstādīšana @lv
preferred label: Installazzjoni ta' makkinarju u tagħmir industrijali @mt
preferred label: Installatie van industriële machines, toestellen en werktuigen @nl
preferred label: Installasjon av industrimaskiner og -utstyr @no
preferred label: Instalowanie maszyn i urządzeń przemysłowych @pl
preferred label: Instalação de máquinas e de equipamentos industriais @pt
preferred label: Instalarea maşinilor şi echipamentelor industriale @ro
preferred label: Монтаж промышленной техники и оборудования @ru
preferred label: Inštalácia priemyselných strojov a prístrojov @sk
preferred label: Montaža industrijskih strojev in naprav @sl
preferred label: Installation av industrimaskiner och -utrustning @sv
preferred label: Sanayi makine ve ekipmanlarının kurulumu @tr
broader: Repair and installation of machinery and equipment
narrower: Installation of industrial machinery and equipment

Installation of industrial machinery and equipment
type: Concept
notation: 33.20
status: valid
status modified: 2013-10-18
accepted date: 2013-10-18
in scheme: Statistical Classification of Economic Activities in the European Community, Rev. 2 (2008)
scope note: Специализирано инсталиране на машини и оборудване. От друга страна, инсталирането на оборудване, което е неразделна част от сградата или от строителното съоръжение, като инсталирането на асансьори и ескалатори, или изграждането на електрически, сигнално-известителни или вентилационни инсталации, се класифицират в сектор F "Строителство". - инсталиране на машини и съоръжения в промишленото предприятие - сглобяване на оборудването за управление на производствените процеси - инсталиране на други машини и съоръжения, например: • далекосъобщителна техника • универсални (големи) и подобни компютри • електрически медицински и терапевтични апарати и оборудване - демонтиране на машини и оборудване - окомплектоване на машините - инсталиране на игри с автоматични кегли (боулинг) - инсталиране на асансьори, ескалатори, автоматични врати, системи за централно вакуумно почистване - 43.29 - монтаж на дограма, интериорни елементи, обзавеждане за магазини и други - 43.32 - инсталиране на персонални компютри - 62.09 @bg
scope note: Tato třída zahrnuje odborné instalace strojů. Instalace zařízení, která tvoří pevnou součást budovy nebo podobné struktury, např. instalace eskalátorů, elektrického vedení, systémů alarmů nebo klimatizačního zařízení, je zařazena ve stavebnictví. Z: - instalaci průmyslových strojů ve výrobních zařízeních - montáž regulačních zařízení výrobních procesů - instalaci ostatních průmyslových zařízení, např.: • komunikačních zařízení • sálových (mainframe) a podobných počítačů • kontrolních zařízení • ozařovacích, elekroléčebných a podobných přístrojů - rozsáhlá demontáž strojů a zařízení - činnost strojních zámečníků - seřizování strojů - instalaci bowlingových a kuželkářských drah N: - instalaci výtahů, pohyblivých schodišť, eskalátorů, automatických dveří, systémů odsávání prachu atd. (43.29) - instalaci dveří, schodišť, zařízení obchodů, montáž nábytku atd. (43.32) - instalaci (nastavení, seřizování) osobních počítačů (PC) (62.09) @cs
scope note: Diese Klasse umfasst die fachgerechte Installation von Maschinen. Die Installation von Ausrüstungen, die einen festen Bestandteil eines Gebäudes oder eines Bauwerkes bilden, beispielsweise die elektrische Verkabelung, der Einbau von Rolltreppen, Einbruchsicherungen oder Klimaanlagen gehören zum Baugewerbe/Bau. Diese Klasse umfasst: - Installation von Industriemaschinen in Fabrikationsanlagen - Montage von industriellen Prozesssteuerungseinrichtungen - Installation von sonstigem technischen Bedarf, z. B.: • nachrichtentechnische Anlagen • Großrechner (Mainframes) und ähnliche Computer • Bestrahlungs- und elektromedizinische Geräte - Abbau von Großmaschinen - Tätigkeit von Maschinenschlossern - Einrichten von Maschinen - Aufbau von Bowlingbahnen Diese Klasse umfasst nicht: - Installation von Aufzügen, Rolltreppen, Automatiktüren, Staubsaugersystemen usw. (s. 43.29) - Installation von Türen, Treppen, Ladeneinrichtungen, Möbeln usw. (s. 43.32) - Installieren (Einrichten) von Arbeitsplatzrechnern (PC) (s. 62.09) @de
scope note: This class includes the specialised installation of machinery. However, the installation of equipment that forms an integral part of buildings or similar structures, such as installation of escalators, electrical wiring, burglar alarm systems or air-conditioning systems, is classified as construction. This class includes: - installation of industrial machinery in industrial plant - assembling of industrial process control equipment - installation of other industrial equipment, e.g.: • communications equipment • mainframe and similar computers • irradiation and electromedical equipment etc. - dismantling large-scale machinery and equipment - activities of millwrights - machine rigging - installation of bowling alley equipment This class excludes: - installation of elevators, escalators, automated doors, vacuum cleaning systems etc., see 43.29 - installation of doors, staircases, shop fittings, furniture etc., see 43.32 - installation (setting-up) of personal computers, see 62.09 @en
scope note: Esta clase comprende la instalación especializada de maquinaria. No obstante, la instalación de equipos que constituyen una parte integral de edificios o estructuras similares, como la instalación de escaleras mecánicas, cableado eléctrico, sistemas de alarma contra robos o sistemas de aire acondicionado, se clasifica como construcción. Esta clase comprende: - la instalación de maquinaria industrial en plantas industriales - el montaje de equipos de control de procesos industriales - la instalación de otros equipos industriales, por ejemplo: • equipos de comunicaciones • mainframes y ordenadores similares • equipos de radiación y electromédicos, etc. - el desmontaje de maquinaria y equipos de gran escala - las actividades de los mecánicos comprobadores de maquinaria - el montaje de maquinaria - la instalación de equipos para boleras automáticas Esta clase no comprende: - la instalación de ascensores, escaleras mecánicas, puertas automáticas, sistemas de limpieza por vacío, etc. (véase 43.29) - la instalación de puertas, escaleras, muebles comerciales, mobiliario, etc. (véase 43.32) - la instalación (montaje) de ordenadores personales (véase 62.09) @es
scope note: Cette classe comprend l’installation spécialisée de machines. Néanmoins, les activités d’installation d’équipements faisant partie intégrante de bâtiments ou de structures similaires, telles que l’installation de câblages électriques, d’escaliers mécaniques, de systèmes antieffraction ou de systèmes de conditionnement d’air sont classées dans la construction. Cette classe comprend: - l’installation de machines industrielles dans un site industriel - l’assemblage d’équipements de contrôle des processus industriels - l’installation d’autres équipements industriels tels que: • équipements de communication • gros systèmes et ordinateurs similaires • équipements d’irradiation médicale et électromédicaux, etc. - le démantèlement de machines et d’équipements à usage général - les activités des installateurs de moulins - le gréage des machines - l’installation de jeux de quilles automatiques (bowlings) Cette classe ne comprend pas: - l’installation de monte-charge, d’escaliers mécaniques, de portes automatiques, d’aspirateurs à unité centrale, etc., voir 43.29 - l’installation de portes, d’escaliers, d’équipements pour magasins, de mobilier, etc., voir 43.32 - l'installation (configuration) d'ordinateurs personnels, voir 62.09 @fr
scope note: Ovaj razred uključuje specijalizirane instalacije strojeva. Ipak, instaliranje opreme koja čini sastavni dio zgrada i sličnih građevina kao što je instalacija dizala, električnih žica, alarmnog sustava ili klimatizacijskih uređaja, razvrstano je u građevinarstvo. Ovaj razred uključuje: - instaliranje industrijskih strojeva i postrojenja - sastavljanje kontrolne opreme za industrijske procese - instaliranje ostale industrijske opreme, npr.: • komunikacijske opreme • glavnih i sličnih računala • iradijacijske i elektromedicinske opreme itd. - demontiranje velikih strojeva i opreme - djelatnosti gradnje vodenica - montažu strojeva - instaliranje opreme za kuglane Ovaj razred isključuje: - postavljanje dizala, pokretnih stepenica, automatskih vrata, sustava za centralno usisavanje itd., vidi 43.29 - ugradnju vrata, stepenica, opreme za prodavaonice, namještaja itd., vidi 43.32 - instaliranje (postavljanje) osobnih računala, vidi 62.09
scope note: Į šią klasę įeina specializuotas mašinų įrengimas. Tačiau įrangos, kuri yra neatsiejama pastatų ar panašių statinių dalis, pvz., eskalatorių, elektros instaliacijos, įsilaužimo signalizavimo ar oro kondicionavimo sistemų, įrengimas yra priskiriamas statybai. Į šią klasę įeina: - pramoninių mašinų įrengimas pramonės įmonėse - pramoninių procesų valdymo įrangos montavimas - kitos pramoninės įrangos įrengimas pvz.: • ryšių įrangos • centrinių ir panašių kompiuterių • švitinimo ir elektromedicininės įrangos ir kt. - didelių mašinų ir įrangos išmontavimas - šaltkalvių montuotojų veikla - mašinų surinkimas - kėglių takų įrangos įrengimas Į šią klasę neįeina: - liftų, eskalatorių, automatinių durų, vakuuminių valymo sistemų ir kt. įrengimas, žr. 43.29 - durų, laiptų, parduotuvių įrangos, baldų ir kt. įrengimas, žr. 43.32 - asmeninių kompiuterių įrengimas (nustatymas), žr. 62.09 @lt
scope note: Этот класс включает: - работу генераторных установок по производству электроэнергии, включая тепловые, ядерные, гидроэлектрические и газовые турбины, дизельные и с возобновляемыми источниками энергии Этот класс исключает: - производство электроэнергии посредством сжигания отходов, см. 38.21 @ru
scope note: Bu sınıf, makinelerin özel montajını da kapsamaktadır. Fakat, elektrik kablolarının döşenmesi, yürüyen merdivenlerin montajı, hırsızlık alarm sistemlerinin ve iklimlendirme sistemlerinin montajı gibi, binaların veya benzer yapıların entegre bir parçasını oluşturan donanımların montajı, inşaat kısmında sınıflandırılır.Bu sınıf aşağıdakileri kapsamaktadır: - sanayi tesislerinde sanayi makinelerinin kurulumu, - sanayi işlem kontrol ekipmanlarının montajı, - diğer sanayi donanımlarının kurulumu, örneğin; • iletişim donanımları, • ana bilgisayar ve benzeri bilgisayarlar • ışınlama ve elektro medikal cihazlar vb., - büyük boyuttaki makine ve donanmaların sökülmesi, - değirmencilikte kullanılan makinelerin kurulumu, - makine montajı, - bowling salonu ekipmanlarının kurulumu Kapsam dışı olanlar: - asansörler, yürüyen merdivenler, otomatik kapılar, elektrikli süpürge sistemleri ve benzerlerinin kurulumu, bkz. 43.29, - kapılar, merdivenler, dükkan tertibatları, mobilyalar ve benzerlerinin kurulumu, bkz. 43.32, - kişisel bilgisayarların kurulumu bkz. 62.09. @tr
preferred label: Инсталиране на машини и оборудване @bg
preferred label: Instalace průmyslových strojů a zařízení @cs
preferred label: Installation af industrimaskiner og -udstyr @da
preferred label: Installation von Maschinen und Ausrüstungen a. n. g. @de
preferred label: Εγκατάσταση βιομηχανικών μηχανημάτων και εξοπλισμού @el
preferred label: Instalación de máquinas y equipos industriales @es
preferred label: Tööstuslike masinate ja seadmete paigaldus @et
preferred label: Teollisuuden koneiden ja laitteiden ym. asennus @fi
preferred label: Installation de machines et d'équipements industriels @fr
preferred label: Ipari gép, berendezés üzembe helyezése
preferred label: Installazione di macchine e apparecchiature industriali @it
preferred label: Pramoninių mašinų ir įrangos įrengimas @lt
preferred label: Ražošanas iekārtu un ierīču uzstādīšana @lv
preferred label: Installazzjoni ta' makkinarju u tagħmir industrijali @mt
preferred label: Installatie van industriële machines, toestellen en werktuigen @nl
preferred label: Installasjon av industrimaskiner og -utstyr @no
preferred label: Instalowanie maszyn i urządzeń przemysłowych @pl
preferred label: Instalação de máquinas e de equipamentos industriais @pt
preferred label: Instalarea maşinilor şi echipamentelor industriale @ro
preferred label: Монтаж промышленной техники и оборудования @ru
preferred label: Inštalácia priemyselných strojov a prístrojov @sk
preferred label: Montaža industrijskih strojev in naprav @sl
preferred label: Installation av industrimaskiner och -utrustning @sv
preferred label: Sanayi makine ve ekipmanlarının kurulumu @tr
broader: Installation of industrial machinery and equipment

Electricity, gas, steam and air conditioning supply
type: Concept
notation: 35
status: valid
status modified: 2013-10-18
accepted date: 2013-10-18
in scheme: Statistical Classification of Economic Activities in the European Community, Rev. 2 (2008)
scope note: Этот класс включает: - работу распределительных систем (электрических сетей, полюсов, счетчиков и кабелей), которые доставляют электроэнергию от распределительных систем конечному потребителю @ru
preferred label: Производство и разпределение на електрическа и топлинна енергия и на газообразни горива @bg
preferred label: Dodávání elektřiny, plynu, páry a klimatizovaného vzduchu @cs
preferred label: El-, gas- og fjernvarmeforsyning @da
preferred label: Energieversorgung @de
preferred label: Παροχή ηλεκτρικού ρεύματος, φυσικού αερίου, ατμού και κλιματισμού @el
preferred label: Suministro de energía eléctrica, gas, vapor y aire acondicionado @es
preferred label: Elektrienergia, gaasi, auru ja konditsioneeritud õhuga varustamine @et
preferred label: Sähkö-, kaasu-, lämpö- ja ilmastointihuolto @fi
preferred label: Production et distribution d'électricité, de gaz, de vapeur et d'air conditionné @fr
preferred label: Villamosenergia-, gáz-, gőzellátás, légkondicionálás
preferred label: Fornitura di energia elettrica, gas, vapore e aria condizionata @it
preferred label: Elektros, dujų, garo tiekimas ir oro kondicionavimas @lt
preferred label: Elektroenerģija, gāzes apgāde, siltumapgāde un gaisa kondicionēšana @lv
preferred label: Provvista ta' elettriku, gass, fwar u arja kkondizzjonata @mt
preferred label: Productie en distributie van elektriciteit, gas, stoom en gekoelde lucht @nl
preferred label: Elektrisitets-, gass-, damp- og varmtvannsforsyning @no
preferred label: Wytwarzanie i zaopatrywanie w energię elektryczną, gaz, parę wodną i powietrze do układów klimatyzacyjnych @pl
preferred label: Produção e distribuição de electricidade, gás, vapor e ar frio @pt
preferred label: Producţia şi furnizarea de energie electrică şi termică, gaze, apă caldă şi aer condiţionat @ro
preferred label: Электроснабжение, подача газа, пара и воздушное кондиционирование @ru
preferred label: Dodávka elektriny, plynu, pary a studeného vzduchu @sk
preferred label: Oskrba z električno energijo, plinom in paro @sl
preferred label: Försörjning av el, gas, värme och kyla @sv
preferred label: Elektrik, gaz, buhar ve havalandırma sistemi üretim ve dağıtımı @tr
broader: ELECTRICITY, GAS, STEAM AND AIR CONDITIONING SUPPLY
narrower: Electric power generation, transmission and distribution
narrower: Manufacture of gas; distribution of gaseous fuels through mains
narrower: Steam and air conditioning supply

Electric power generation, transmission and distribution
type: Concept
notation: 35.1
status: valid
status modified: 2013-10-18
accepted date: 2013-10-18
in scheme: Statistical Classification of Economic Activities in the European Community, Rev. 2 (2008)
scope note: производство на електрическа енергия, пренос по електроразпределителната мрежа до разпределителните центрове и от тях - до крайните потребители. @bg
scope note: Tato skupina zahrnuje hromadnou výrobu elektřiny, její přenos z výrobních zařízení do rozvodných stanic a rozvod konečným uživatelům. @cs
scope note: Diese Gruppe umfasst die Erzeugung großer Elektrizitätsmengen, deren Übertragung von den Erzeugungsanlagen an Verteilerstationen und die Verteilung an die Endverbraucher. @de
scope note: This group includes the generation of bulk electric power, transmission from generating facilities to distribution centres and distribution to end users. @en
scope note: Este grupo comprende la producción de energía eléctrica, el transporte desde las instalaciones de generación hasta los centros de distribución, y la distribución a los usuarios finales. @es
scope note: Ce groupe comprend la production de l’électricité en bloc, le transport de cette électricité des centrales jusqu’aux centres de distribution et la distribution jusqu’aux utilisateurs finals. @fr
scope note: Ova skupina uključuje proizvodnju električne energije, prijenos električne energije od kapaciteta koji ju proizvode do distributivnih centara te distribuciju krajnjim korisnicima.
scope note: Į šią grupę įeina elektros energijos gamyba, perdavimas nuo jos generavimo įrenginių į paskirstymo centrus ir paskirstymas galutiniams vartotojams. @lt
scope note: Этот класс включает: - продажу электроэнергии потребителям - деятельность посредников или агентов по продаже электроэнергии, произведенной другими единицами, по энергораспределительным сетям - контроль над подачей электроэнергии и пропускной способностью @ru
scope note: Bu grup, elektrik enerjisinin üretilmesini, üretim kaynaklarından dağıtım merkezlerine iletilmesini ve nihai kullanıcılara dağıtılmasını kapsamaktadır. @tr
preferred label: Производство, пренос и разпределение на електрическа енергия @bg
preferred label: Výroba, přenos a rozvod elektřiny @cs
preferred label: Elforsyning @da
preferred label: Elektrizitätsversorgung @de
preferred label: Παραγωγή, μετάδοση και διανομή ηλεκτρικής ενέργειας @el
preferred label: Producción, transporte y distribución de energía eléctrica @es
preferred label: Elektrienergia tootmine, ülekanne ja jaotus @et
preferred label: Sähkövoiman tuotanto, siirto ja jakelu @fi
preferred label: Production, transport et distribution d'électricité @fr
preferred label: Villamosenergia-termelés, -ellátás
preferred label: Produzione, trasmissione e distribuzione di energia elettrica @it
preferred label: Elektros energijos gamyba, perdavimas ir paskirstymas @lt
preferred label: Elektroenerģijas ražošana, apgāde un sadale @lv
preferred label: Ġenerazzjoni, trażmissjoni u tqassim ta' l-elettriku @mt
preferred label: Opwekking, transmissie en distributie van elektriciteit @nl
preferred label: Produksjon, overføring og distribusjon av elektrisitet @no
preferred label: Wytwarzanie, przesyłanie, dystrybucja i handel energią elektryczną @pl
preferred label: Produção, transporte e distribuição de energia eléctrica @pt
preferred label: Producţia, transportul şi distribuţia energiei electrice @ro
preferred label: Производство, передача и распределение электроэнергии @ru
preferred label: Výroba elektrickej energie, prenos a rozvod @sk
preferred label: Oskrba z električno energijo @sl
preferred label: Generering, överföring och distribution av elkraft @sv
preferred label: Elektrik enerjisinin üretimi, iletimi ve dağıtımı @tr
broader: Electricity, gas, steam and air conditioning supply
narrower: Production of electricity
narrower: Transmission of electricity
narrower: Distribution of electricity
narrower: Trade of electricity

Production of electricity
type: Concept
notation: 35.11
status: valid
status modified: 2013-10-18
accepted date: 2013-10-18
in scheme: Statistical Classification of Economic Activities in the European Community, Rev. 2 (2008)
scope note: - работа на съоръжения за производство на електрическа енергия, вкл. топлинни, ядрени, водни, газови и дизелови турбини, както и такива, използващи възобновяеми енергийни източници (биомаса, слънчева, геотермална и вятърна енергия) - производството на електрическа енергия при изгаряне на отпадъци - 38.21 @bg
scope note: Z: - provoz zařízení na výrobu elektřiny; elektrárny tepelné, jaderné, vodní, s plynovou turbínou, dieselovými agregáty a elektrárny využívající obnovitelné zdroje energií N: - získávání elektřiny při spalování odpadů (38.21) @cs
scope note: Diese Klasse umfasst: - Betrieb von Stromerzeugungsanlagen; dazu zählen fossilthermische Kraftwerke, Kernkraft-, Wasserkraft-, Gasturbinen- und Dieselkraftwerke sowie mit erneuerbaren Energieträgern betriebene Kraftwerke Diese Klasse umfasst nicht: - Erzeugung von Elektrizität durch das Verbrennen von Abfällen (s. 38.21) @de
scope note: This class includes: - operation of generation facilities that produce electric energy; including thermal, nuclear, hydroelectric, gas turbine, diesel and renewable This class excludes: - production of electricity through incineration of waste, see 38.21 @en
scope note: Esta clase comprende: - la explotación de las instalaciones de generación de energía eléctrica, incluidas las energías térmica, nuclear, hidroeléctrica, por turbina de gas, diesel y de fuentes renovables Esta clase no comprende: - la producción de electricidad a partir de la incineración de residuos (véase 38.21) @es
scope note: Cette classe comprend: - l’exploitation des installations de production d’électricité, y compris la production d’origine thermique, nucléaire, hydroélectrique, par turbine à gaz, par centrale diesel ou à partir d’autres sources d’énergie renouvelables Cette classe ne comprend pas: - la production d’électricité par l’incinération de déchets, voir 38.21 @fr
scope note: Ovaj razred uključuje: - rad kapaciteta koji imaju mogućnost proizvodnje električne energije uključujući termalnu, nuklearnu hidroelektričnu energiju, parne turbine te dizelsko gorivo i obnovljivu energiju Ovaj razred isključuje: - proizvodnju električne energije spaljivanjem otpada, vidi 38.21
scope note: Į šią klasę įeina: - elektros energiją gaminančių įrenginių, įskaitant šilumines ir branduolines elektrines, hidroelektrines, dujų turbinas, dyzelinius agregatus ir atnaujinamos energijos šaltinius, eksploatavimas Į šią klasę neįeina: - elektros gamyba deginant atliekas, žr. 38.21 @lt
scope note: Данная группа включает выработку газа и подачу природного или синтетического газа потребителю через газопровод. Деятельность специалистов в области поставок газопродукции или посредников, которые участвуют в организации продаж природного газа через распределительные системы, находящиеся под контролем третьих лиц, также включены в данную группу. Управление работой газопроводов, протянутых на далекие расстояния, соединяющие производителей с потребителями газа или проложенными между городскими центрами, не включено в данную группу и относится к прочим видам деятельности по транспортировке газа. @ru
scope note: Bu sınıf aşağıdakileri kapsamaktadır: - termal, nükleer, hidroelektrik, gaz türbini, dizel ve yenilenebilir enerji de dahil, elektrik enerjisi üretim tesislerinin işletilmesi. Kapsam dışı olanlar: - atıkların yakılması yoluyla elektrik üretilmesi, bkz. 38.2, @tr
preferred label: Производство на електрическа енергия @bg
preferred label: Výroba elektřiny @cs
preferred label: Produktion af elektricitet @da
preferred label: Elektrizitätserzeugung @de
preferred label: Παραγωγή ηλεκτρικού ρεύματος @el
preferred label: Producción de energía eléctrica @es
preferred label: Elektrienergia tootmine @et
preferred label: Sähkön tuotanto @fi
preferred label: Production d'électricité @fr
preferred label: Villamosenergia-termelés
preferred label: Produzione di energia elettrica @it
preferred label: Elektros gamyba @lt
preferred label: Elektroenerģijas ražošana @lv
preferred label: Produzzjoni ta' elettriku @mt
preferred label: Productie van elektriciteit @nl
preferred label: Produksjon av elektrisitet @no
preferred label: Wytwarzanie energii elektrycznej @pl
preferred label: Produção de electricidade @pt
preferred label: Producţia de energie electrică @ro
preferred label: Производство электроэнергии @ru
preferred label: Výroba elektriny @sk
preferred label: Proizvodnja električne energije @sl
preferred label: Generering av elektricitet @sv
preferred label: Elektrik enerjisi üretimi @tr
broader: Electric power generation, transmission and distribution

Transmission of electricity
type: Concept
notation: 35.12
status: valid
status modified: 2013-10-18
accepted date: 2013-10-18
in scheme: Statistical Classification of Economic Activities in the European Community, Rev. 2 (2008)
scope note: - работа на преносните системи от електрическата централа към разпределителната система @bg
scope note: Z: - provoz systémů pro přenos elektřiny z výrobního zařízení do rozvodných (distribučních) sítí @cs
scope note: Diese Klasse umfasst: - Betrieb von Übertragungssystemen, welche die Elektrizität von der Erzeugungsanlage zum Verteilungsnetz leiten @de
scope note: This class includes: - operation of transmission systems that convey the electricity from the generation facility to the distribution system @en
scope note: Esta clase comprende: - la explotación de los sistemas de transporte de la energía eléctrica desde la instalación de generación a la red de distribución @es
scope note: Cette classe comprend: - l’exploitation de systèmes de transmission qui transportent l’électricité du site de production au système de distribution @fr
scope note: Ovaj razred uključuje: - rad sustava za prijenos pomoću kojeg se prenosi električna energija od generatora prema sustavu distribucije
scope note: Į šią klasę įeina: - perdavimo sistemų, perduodančių elektrą iš jos generavimo įrenginių į skirstomąsias sistemas, eksploatavimas @lt
scope note: Этот класс включает: - производство газа, используемого для газоснабжения, путем подземной газификации угля, производство искусственных газов из сельскохозяйственной продукции или отходов - производство газообразного топлива с определенной удельной теплотой сгорания из газов различного типа (включая природный газ) путем их очистки, смешивания и других процессов Этот класс исключает: - выработку неочищенного природного газа, см. 06.20 - работу коксовых печей, см. 19.10 - производство рафинированных (светлых) нефтепродуктов, см. 19.20 - производство промышленных газов, см. 20.11 @ru
scope note: Bu sınıf aşağıdakileri kapsamaktadır: - elektrik enerjisini üretim kaynağından dağıtım sistemine aktaran iletim sistemlerinin işletilmesi. @tr
preferred label: Пренос на електрическа енергия @bg
preferred label: Přenos elektřiny @cs
preferred label: Transmission af elektricitet @da
preferred label: Elektrizitätsübertragung @de
preferred label: Μετάδοση ηλεκτρικού ρεύματος @el
preferred label: Transporte de energía eléctrica @es
preferred label: Elektrienergia ülekanne @et
preferred label: Sähkön siirto @fi
preferred label: Transport d'électricité @fr
preferred label: Villamosenergia-szállítás
preferred label: Trasmissione di energia elettrica @it
preferred label: Elektros perdavimas @lt
preferred label: Elektroenerģijas apgāde @lv
preferred label: Trażmissjoni ta' elettriku @mt
preferred label: Transmissie van elektriciteit @nl
preferred label: Overføring av elektrisitet @no
preferred label: Przesyłanie energii elektrycznej @pl
preferred label: Transporte de electricidade @pt
preferred label: Transportul energiei electrice @ro
preferred label: Передача электроэнергии @ru
preferred label: Prenos elektriny @sk
preferred label: Prenos električne energije @sl
preferred label: Överföring av elektricitet @sv
preferred label: Elektrik enerjisinin iletimi @tr
broader: Electric power generation, transmission and distribution

Distribution of electricity
type: Concept
notation: 35.13
status: valid
status modified: 2013-10-18
accepted date: 2013-10-18
in scheme: Statistical Classification of Economic Activities in the European Community, Rev. 2 (2008)
scope note: - работа на разпределителните системи (състоящи се от електропреносни линии, стълбове, уреди за измерване на електрическа енергия и проводници), които пренасят електрическа енергия, получена от електрическата централа или от преносната система до крайните потребители @bg
scope note: Z: - provoz rozvodných (distribučních) sítí (tj. systémů složených z vedení, sloupů, elektroměrů a elektroinstalace), které vedou elektřinu z výrobních zařízení nebo rozvodných (distribučních) sítí ke konečným uživatelům @cs
scope note: Diese Klasse umfasst: - Betrieb von Verteilungsnetzen (bestehend aus Leitungen, Leitungsmasten, Zählern und Kabel), welche die von der Erzeugungsanlage oder dem Übertragungssystem gelieferte Elektrizität zum Endverbraucher leiten @de
scope note: This class includes: - operation of distribution systems (i.e., consisting of lines, poles, meters, and wiring) that convey electric power received from the generation facility or the transmission system to the final consumer @en
scope note: Esta clase comprende: - la explotación de las redes de distribución (que constan de líneas, torres, contadores y cableado) que transportan la energía eléctrica recibida de la instalación de generación o el sistema de transporte hasta el consumidor @es
scope note: Cette classe comprend: - l’exploitation des systèmes de distribution (c’est-à-dire lignes, pylônes, compteurs et câbles) qui transportent le courant électrique reçu des installations de production ou du système de transmission au consommateur final @fr
scope note: Ovaj razred uključuje: - rad distribucijskih sustava (npr. sastoje se od linija, stupova, brojila i žica) koji dovode električnu energiju koju su dobili od kapaciteta koji ju je proizveo ili od sustava za prijenos krajnjem potrošaču
scope note: Į šią klasę įeina: - skirstomųjų sistemų (pvz., sistemų, sudarytų iš elektros linijų, atramų, skaitiklių ir elektros instaliacijos), perduodančių vartotojams elektros energiją, gautą iš generavimo įrenginių arba perdavimo sistemų, eksploatavimas @lt
scope note: Этот класс включает: - распределение и поставку газообразного топлива по сетям газоснабжения Этот класс исключает: - поставку газа по трубопроводу (на дальние расстояния), см. 49.50 @ru
scope note: Bu sınıf aşağıdakileri kapsamaktadır: - üretim kaynağından veya son kullanıcıya iletim sistemiyle taşınan elektrik enerjisi dağıtım sisteminin (örn.,elektrik hatları, elektrik direkleri, sayaçlar ve elektrik tesisatlarının oluşturulması) işletilmesi. @tr
preferred label: Разпределение на електрическа енергия @bg
preferred label: Rozvod elektřiny @cs
preferred label: Distribution af elektricitet @da
preferred label: Elektrizitätsverteilung @de
preferred label: Διανομή ηλεκτρικού ρεύματος @el
preferred label: Distribución de energía eléctrica @es
preferred label: Elektrienergia jaotus @et
preferred label: Sähkön jakelu @fi
preferred label: Distribution d'électricité @fr
preferred label: Villamosenergia-elosztás
preferred label: Distribuzione di energia elettrica @it
preferred label: Elektros paskirstymas @lt
preferred label: Elektroenerģijas sadale @lv
preferred label: Tqassim ta' elettriku @mt
preferred label: Distributie van elektriciteit @nl
preferred label: Distribusjon av elektrisitet @no
preferred label: Dystrybucja energii elektrycznej @pl
preferred label: Distribuição de electricidade @pt
preferred label: Distribuţia energiei electrice @ro
preferred label: Распределение электроэнергии @ru
preferred label: Rozvod elektriny @sk
preferred label: Distribucija električne energije @sl
preferred label: Distribution av elektricitet @sv
preferred label: Elektrik enerjisinin dağıtımı @tr
broader: Electric power generation, transmission and distribution

Trade of electricity
type: Concept
notation: 35.14
status: valid
status modified: 2013-10-18
accepted date: 2013-10-18
in scheme: Statistical Classification of Economic Activities in the European Community, Rev. 2 (2008)
scope note: - продажба на електрическа енергия на потребителите - дейности на посредници по продажба на електрическа енергия по електроразпределителни мрежи, управлявани от друг - управление на енергийните потоци при обмяната на мощности при пренос на електрическа енергия @bg
scope note: Z: - prodej elektřiny uživatelům - činnosti makléřů nebo obchodních agentů, kteří zprostředkovávají prodej elektřiny prostřednictvím rozvodných sítí provozovaných jinými subjekty - provoz burz, na nichž se obchoduje s elektrickou energií a s kapacitami přenosových sítí @cs
scope note: Diese Klasse umfasst: - Verkauf von Elektrizität an den Verbraucher - Tätigkeiten von Handelsmaklern oder Handelsvertretern, die den Verkauf von Elektrizität über Stromverteilungsnetze vermitteln, die von Dritten betrieben werden - Betrieb von Einrichtungen zum Austausch von Leistungs- und Übertragungskapazitäten für Elektrizität @de
scope note: This class includes: - sale of electricity to the user - activities of electric power brokers or agents that arrange the sale of electricity via power distribution systems operated by others - operation of electricity and transmission capacity exchanges for electric power @en
scope note: Esta clase comprende: - la venta al usuario de la energía eléctrica - las actividades de los intermediarios de la energía eléctrica que gestionan la venta de energía eléctrica a través de las redes de distribución operadas por otros - la explotación de los mercados de electricidad y capacidad de transporte para energía eléctrica @es
scope note: Cette classe comprend: - la vente d’électricité au consommateur - les activités des courtiers en courant électrique ou des agents qui organisent la vente d’électricité via des systèmes de distribution de courant exploités par d’autres - l’exploitation des échanges d’électricité et de capacité de transfert pour le courant électrique @fr
scope note: Ovaj razred uključuje: - prodaju električne energije korisnicima - djelatnosti brokera za električnu energiju i agenata koji ugovaraju prodaju električne energije distribucijskim sustavima kojim upravljaju drugi - djelatnost kapaciteta za električnu energiju i sustava prijenosa pomoću kojeg se transformira u električnu energiju
scope note: Į šią klasę įeina: - elektros pardavimas vartotojams - elektros energijos pardavimo brokerių ar agentų, atliekančių elektros pardavimą per kitų valdomas skirstomąsias sistemas, veikla - elektros ir praleidžiamosios galios biržų, prekiaujančių elektros energija, veikla @lt
scope note: Этот класс включает: - продажу газообразного топлива потребителям по трубопроводам - деятельность посредников и агентов, принимающих участие в организации продаж и распределении газа посредством газораспределительных систем, находящихся под контролем третьих лиц - потребление и транспортировку газообразного топлива Этот класс исключает: - оптовую торговлю газообразным топливом, см. 46.71 - розничную торговлю сжиженным газом в баллонах, см. 47.78 - прямую торговлю топливом, см. 47.99 @ru
scope note: Bu sınıf aşağıdakileri kapsamaktadır: - kullanıcılara elektrik satışı - diğer işletmeler tarafından işletilen güç dağıtım sistemleri aracılığı ile elektrik satışını düzenleyen elektrik komisyoncuları ve acentelerinin faaliyetleri - elektrik için elektrik ve iletim kapasitesi değiştirme faaliyetleri. @tr
preferred label: Търговия с електрическа енергия @bg
preferred label: Obchod s elektřinou @cs
preferred label: Handel med elektricitet @da
preferred label: Elektrizitätshandel @de
preferred label: Εμπόριο ηλεκτρικού ρεύματος @el
preferred label: Comercio de energía eléctrica @es
preferred label: Elektrienergia müük @et
preferred label: Sähkön kauppa @fi
preferred label: Commerce d'électricité @fr
preferred label: Villamosenergia-kereskedelem
preferred label: Commercio di energia elettrica @it
preferred label: Elektros pardavimas @lt
preferred label: Elektroenerģijas tirdzniecība @lv
preferred label: Negozju ta' elettriku @mt
preferred label: Handel in elektriciteit @nl
preferred label: Handel med elektrisitet @no
preferred label: Handel energią elektryczną @pl
preferred label: Comércio de electricidade @pt
preferred label: Comercializarea energiei electrice @ro
preferred label: Торговля электроэнергией @ru
preferred label: Predaj elektriny @sk
preferred label: Trgovanje z električno energijo @sl
preferred label: Elektrik enerjisinin ticareti @tr
broader: Electric power generation, transmission and distribution

Manufacture of gas; distribution of gaseous fuels through mains
type: Concept
notation: 35.2
status: valid
status modified: 2013-10-18
accepted date: 2013-10-18
in scheme: Statistical Classification of Economic Activities in the European Community, Rev. 2 (2008)
scope note: производство на газообразни горива и разпределение по газоразпределителните мрежи на природен или синтетичен газ до крайния потребител. Тази група включва също и дейността на търговци или посредници по продажба на природен газ по газоразпределителните мрежи, управлявани от друг. - експлоатация на магистрални газопроводи, които свързват производителите с газоразпределителното предприятие или с населеното място, класифицира се в тръбопроводния транспорт @bg
scope note: Tato skupina zahrnuje výrobu plynu a rozvod zemního plynu nebo syntetického plynu prostřednictvím potrubí konečným uživatelům. Zahrnuje také činnosti makléřů nebo obchodních agentů zprostředkujících prodej plynu prostřednictvím rozvodných sítí provozovaných jinými subjekty. Samostatný provoz dálkových potrubí, spojujících výrobce plynu s rozvodnými systémy nebo různými městskými oblastmi, nepatří do této skupiny, ale do dopravy dálkovým potrubím (49.50). @cs
scope note: Diese Gruppe umfasst die Erzeugung von Gas und die Verteilung von Erd- oder Synthesegas an den Verbraucher durch Rohrleitungen. Eingeschlossen sind Anbieter oder Makler, die den Verkauf von Gas über Gasverteilungsnetze vermitteln, die von Dritten betrieben werden. Der selbstständige Betrieb von Gas(fern)leitungen, die Gaserzeuger mit -verteilern oder verschiedene Ballungsgebiete miteinander verbinden, gehört nicht zu dieser Gruppe, sondern zum Transport in Rohrfernleitungen. @de
scope note: This group includes the manufacture of gas and the distribution of natural or synthetic gas to the consumer through a system of mains. Gas marketers or brokers, which arrange the sale of natural gas over distribution systems operated by others, are included. The separate operation of gas pipelines, typically done over long distances, connecting producers with distributors of gas, or between urban centres, is excluded from this group and classified with other pipeline transport activities. @en
scope note: Este grupo comprende la producción de gas y la distribución de gas natural o sintético hasta el consumidor a través de un sistema de tuberías. Comprende los proveedores o intermediarios de gas que conciertan la venta de gas natural por sistemas de distribución explotados por terceros. La explotación independiente de los gasoductos, que suele hacerse en redes de larga distancia, que conectan a productores y distribuidores de gas, o entre centros urbanos, queda excluida de este grupo y se incluye con otras actividades de transporte por tubería. @es
scope note: Ce groupe comprend la fabrication et la distribution du gaz naturel ou synthétique aux consommateurs au moyen d’un réseau de canalisations. Les marchands et négociants qui négocient la vente de gaz naturel par l’entremise de réseaux de distribution du gaz exploités par d’autres sont également compris. L’exploitation distincte de gazoducs, transportant du gaz généralement sur de longues distances et reliant les producteurs et les distributeurs du gaz ou différents centres urbains, n’est pas comprise dans ce groupe et relève des autres services de transport par conduites. @fr
scope note: Ova skupina uključuje proizvodnju plina i distribuciju prirodnog ili sintetičkog plina potrošačima sustavom glavnih plinovoda. Uključeni su trgovci plinom ili brokeri, koji organiziraju prodaju prirodnog plina preko distribucijskih sustava kojima upravljaju drugi Posebno rukovanje plinovodima na velike udaljenosti, koje povezuju proizvođače s distributerima plina ili između gradskih centara, isključeno je iz ove skupine i razvrstano u ostale djelatnosti prijevoza cjevovodom.
scope note: Į šią grupę įeina dujų gamyba ir gamtinių arba sintetinių dujų paskirstymas vartotojams dujotiekiais. Į šią grupę įeina dujų pardavimo brokerių arba agentų, atliekančių pardavimą per kitų valdomas dujų skirstomąsias sistemas, veikla. Į šią grupę neįeina atskirų magistralinių (paprastai ilgų nuotolių) dujotiekių, sujungiančių dujų gamintojus su dujų paskirstytojais, arba miestų centrus, eksploatavimas; ši veikla įeina į kitą transportavimo vamzdynais veiklą. @lt
scope note: Bu grup, gazın üretimi ve ana borular aracılığıyla tüketicilere doğal veya sentetik gaz dağıtımını içermektedir. Diğer işletmeler tarafından işletilen dağıtım sistemlerini kullanarak doğal gaz satışı gerçekleştiren gaz pazarlayıcı ve komisyoncuları da bu gruba dahildir. Tipik olarak uzak yerlere gerçekleştirilen ve gaz dağıtıcıları ile üreticileri veya kentleri birbirine bağlayan gaz boru hatlarının bağımsız faaliyetleri bu gruptan hariç tutulmakta ve diğer boru hattı dağıtım faaliyetlerinin içinde yer almaktadır. @tr
preferred label: Производство и разпределение на газообразни горива по газоразпределителните мрежи @bg
preferred label: Výroba plynu; rozvod plynných paliv prostřednictvím sítí @cs
preferred label: Gasforsyning @da
preferred label: Gasversorgung @de
preferred label: Παραγωγή φυσικού αερίου· διανομή αερίων καυσίμων με αγωγούς @el
preferred label: Producción de gas; distribución por tubería de combustibles gaseosos @es
preferred label: Gaasitootmine; gaaskütuste jaotus magistraalvõrkude kaudu @et
preferred label: Kaasun tuotanto; kaasumaisten polttoaineiden jakelu putkiverkossa @fi
preferred label: Production et distribution de combustibles gazeux @fr
preferred label: Gázellátás
preferred label: Produzione di gas; distribuzione di combustibili gassosi mediante condotte @it
preferred label: Dujų gamyba; dujinio kuro paskirstymas dujotiekiais @lt
preferred label: Gāzes ražošana; gāzveida kurināmā sadale, izmantojot cauruļvadus @lv
preferred label: Manifattura ta' gass; tqassim ta' fjuwil fi stat ta' gass permezz ta' mejns @mt
preferred label: Productie en distributie van gas @nl
preferred label: Produksjon av gass, og distribusjon av gass gjennom ledningsnett @no
preferred label: Wytwarzanie paliw gazowych; dystrybucja i handel paliwami gazowymi w systemie sieciowym @pl
preferred label: Produção de gás; distribuição de combustíveis gasosos por condutas @pt
preferred label: Producţia gazelor; distribuţia combustibililor gazoşi prin conducte @ro
preferred label: Производство и распределение газообразного топлива @ru
preferred label: Výroba plynu; rozvod plynných palív potrubím @sk
preferred label: Oskrba s plinastimi gorivi @sl
preferred label: Gasförsörjning; distribution av gasformiga bränslen via rörnät @sv
preferred label: Gaz imalatı; ana şebeke üzerinden gaz yakıtların dağıtımı @tr
broader: Electricity, gas, steam and air conditioning supply
narrower: Manufacture of gas
narrower: Distribution of gaseous fuels through mains
narrower: Trade of gas through mains

Manufacture of gas
type: Concept
notation: 35.21
status: valid
status modified: 2013-10-18
accepted date: 2013-10-18
in scheme: Statistical Classification of Economic Activities in the European Community, Rev. 2 (2008)
scope note: - производство на газ чрез карбонизиране на въглища или от вторични продукти на селското стопанство, или от отпадъци - производство на газообразни горива с определена калоричност чрез пречистване, смесване и друга преработка на различни видове газове, вкл. природен газ - добив на природен газ - 06.20 - експлоатация на коксови пещи - 19.10 - производство на рафинирани нефтопродукти - 19.20 - производство на промишлени газове - 20.11 @bg
scope note: Z: - výrobu plynu, pro účely zásobování plynem, zplyňováním uhlí, ze zemědělských vedlejších produktů nebo z odpadů - výrobu plynných paliv o specifické výhřevné hodnotě z plynů různého původu (včetně zemního plynu) čištěním, míšením a jinými procesy N: - těžbu zemního plynu (06.20) - provoz koksárenských pecí (19.10) - výrobu rafinovaných produktů (19.20) - výrobu technických plynů (20.11) @cs
scope note: Diese Klasse umfasst: - Erzeugung von Gas für Versorgungszwecke durch Verkokung von Kohle, aus landwirtschaftlichen Nebenerzeugnissen oder aus Reststoffen - Erzeugung von gasförmigen Brennstoffen mit einem spezifischen Heizwert aus Gasen verschiedenen Ursprungs (einschließlich Erdgas) durch Reinigung, Mischung und andere Verfahren Diese Klasse umfasst nicht: - Förderung von Erdgas (s. 06.20) - Betrieb von Koksöfen (s. 19.10) - Mineralölverarbeitung (s. 19.20) - Herstellung von Industriegasen (s. 20.11) @de
scope note: This class includes: - production of gas for the purpose of gas supply by carbonation of coal, from by-products of agriculture or from waste - manufacture of gaseous fuels with a specified calorific value, by purification, blending and other processes from gases of various types including natural gas This class excludes: - production of crude natural gas, see 06.20 - operation of coke ovens, see 19.10 - manufacture of refined petroleum products, see 19.20 - manufacture of industrial gases, see 20.11 @en
scope note: Esta clase comprende: - la producción de gas con fines de suministro de gas por carbonación de hulla o a partir de subproductos agrícolas o de desechos - la producción de combustibles gaseosos de valor calórico específico, mediante purificación, mezcla y otros procesos, a partir de gases de diversos orígenes, incluido el gas natural Esta clase no comprende: - la producción de gas natural crudo (véase 06.20) - la explotación de coquerías (véase 19.10) - la fabricación de productos de refino del petróleo (véase 19.20) - la fabricación de gases industriales (véase 20.11) @es
scope note: Cette classe comprend: - la production, pour les besoins de l’approvisionnement en gaz, de gaz obtenus par distillation du charbon ou à partir de sous-produits de l’agriculture ou de déchets - la production de combustibles gazeux d’une valeur calorifique déterminée par purification, mélange ou d’autres traitements de gaz d’origines diverses, y compris le gaz naturel Cette classe ne comprend pas: - la production de gaz naturel brut, voir 06.20 - l’exploitation de fours à coke, voir 19.10 - la fabrication de produits pétroliers raffinés, voir 19.20 - la fabrication de gaz industriels, voir 20.11 @fr
scope note: Ovaj razred uključuje: - proizvodnju plina karbonizacijom ugljena od poljoprivrednih nusproizvoda ili od ostataka s namjenom opskrbe plinom - proizvodnju plinovitih goriva s određenom kalorijskom vrijednosti, pročišćavanjem, miješanjem i drugim postupcima od plinova različitih vrsta, uključujući prirodni plin Ovaj razred isključuje: - proizvodnju sirovoga prirodnog plina, vidi 06.20 - djelatnosti koksara, vidi 19.10 - proizvodnju rafiniranih naftnih proizvoda, vidi 19.20 - proizvodnju industrijskih plinova, vidi 20.11
scope note: Į šią klasę įeina: - tinkamų vartoti dujų gamyba koksuojant akmens anglis, išgaunant jas iš šalutinių žemės ūkio produktų ar atliekų - apibrėžto šilumingumo dujinio kuro, gauto valant, maišant ar kitaip apdorojant įvairias dujas, įskaitant ir gamtines, gamyba Į šią klasę neįeina: - nevalytų gamtinių dujų gamyba, žr. 06.20 - koksavimo krosnių eksploatavimas, žr. 19.10 - rafinuotų naftos produktų gamyba, žr. 19.20 - pramoninių dujų gamyba, žr. 20.11 @lt
scope note: Этот класс включает: - производство, передача и распределение пара, горячей воды для отопления, энергоснабжения и прочих целей - производство и распределение охлажденного воздуха - производство и распределение охлажденной воды с целью охлаждения - производство льда в качестве продукта питания и в иных целях (напр., охлаждение) @ru
scope note: Bu sınıf aşağıdakileri kapsamaktadır: - kömürün karbonlaştırılması, tarımsal yan ürünler veya atıklardan gaz üretimi - doğal gaz dahil, çeşitli türdeki gazlardan arındırma, karıştırma ve diğer işlemlerle belirli kalorifik değerde gazlı yakıtların imalatı. Kapsam dışı olanlar: - ham doğal gaz üretimi, bkz. 06.20 - kok kömürü fırınlarının işletilmesi, bkz. 19.10 - rafine petrol ürünleri imalatı, bkz. 19.20 - endüstriyel gazların imalatı, bkz. 20.11 @tr
preferred label: Производство на газообразни горива @bg
preferred label: Výroba plynu @cs
preferred label: Fremstilling af gas @da
preferred label: Gaserzeugung @de
preferred label: Παραγωγή φυσικού αερίου @el
preferred label: Producción de gas @es
preferred label: Gaasitootmine @et
preferred label: Kaasun tuotanto @fi
preferred label: Production de combustibles gazeux @fr
preferred label: Gázgyártás
preferred label: Produzione di gas @it
preferred label: Dujų gamyba @lt
preferred label: Gāzes ražošana @lv
preferred label: Manifattura ta' gass @mt
preferred label: Productie van gas @nl
preferred label: Produksjon av gass @no
preferred label: Wytwarzanie paliw gazowych @pl
preferred label: Produção de gás @pt
preferred label: Producţia gazelor @ro
preferred label: Производство газа @ru
preferred label: Proizvodnja plina @sl
preferred label: Framställning av gas @sv
preferred label: Gaz imalatı @tr
broader: Manufacture of gas; distribution of gaseous fuels through mains

Distribution of gaseous fuels through mains
type: Concept
notation: 35.22
status: valid
status modified: 2013-10-18
accepted date: 2013-10-18
in scheme: Statistical Classification of Economic Activities in the European Community, Rev. 2 (2008)
scope note: - разпределение и снабдяване с всички видове газообразни горива по газоразпределителните мрежи - пренос на газ по магистрални газопроводи - 49.50 @bg
scope note: Z: - rozvod a dodání plynných paliv všeho druhu prostřednictvím potrubních sítí N: - dopravu plynu dálkovým potrubím (49.50) @cs
scope note: Diese Klasse umfasst: - Verteilung gasförmiger Brennstoffe aller Art durch Rohrleitungssysteme Diese Klasse umfasst nicht: - Transport von Gas in Rohrfernleitungen (s. 49.50) @de
scope note: This class includes: - distribution and supply of gaseous fuels of all kinds through a system of mains This class excludes: - (long-distance) transportation of gases by pipelines, see 49.50 @en
scope note: Esta clase comprende: - la distribución y el suministro de combustibles gaseosos de cualquier tipo por un sistema de tuberías Esta clase no comprende: - el transporte (de larga distancia) de gases por gasoductos (véase 49.50) @es
scope note: Cette classe comprend: - la distribution par conduites de combustibles gazeux de tous types Cette classe ne comprend pas: - le transport (sur de longues distances) de gaz naturel par conduites, voir 49.50 @fr
scope note: Ovaj razred uključuje: - distribuciju i opskrbu plinovitim gorivima svih vrsta distribucijskom mrežom Ovaj razred isključuje: - prijevoz plina plinovodima (na velike udaljenosti), vidi 49.50
scope note: Į šią klasę įeina: - įvairaus dujinio kuro paskirstymas ir tiekimas dujotiekiais Į šią klasę neįeina: - dujų transportavimas magistraliniais (ilgų nuotolių) vamzdynais, žr. 49.50 @lt
scope note: Данный раздел включает сбор, обработку и распределение воды для бытовых и промышленных нужд. Сбор воды из различных источников, а также ее распределение через различные источники также включены в данный раздел. @ru
scope note: Bu sınıf aşağıdakileri kapsamaktadır: - her çeşit gaz yakıtın, ana boru sistemiyle dağıtım ve temini Kapsam dışı olanlar: - gazların boru hatları ile (uzak yerlere) taşınması, bkz. 49.50 @tr
preferred label: Разпределение на газообразни горива по газоразпределителните мрежи @bg
preferred label: Rozvod plynných paliv prostřednictvím sítí @cs
preferred label: Distribution af gas @da
preferred label: Gasverteilung durch Rohrleitungen @de
preferred label: Διανομή αέριων καυσίμων μέσω αγωγών @el
preferred label: Distribución por tubería de combustibles gaseosos @es
preferred label: Gaaskütuste jaotus magistraalvõrkude kaudu @et
preferred label: Kaasumaisten polttoaineiden jakelu putkiverkossa @fi
preferred label: Distribution de combustibles gazeux par conduites @fr
preferred label: Gázelosztás
preferred label: Distribuzione di combustibili gassosi mediante condotte @it
preferred label: Dujinio kuro paskirstymas dujotiekiais @lt
preferred label: Gāzveida kurināmā sadale pa cauruļvadiem @lv
preferred label: Tqassim ta' fjuwil fi stat ta' gass permezz ta' mejns @mt
preferred label: Distributie van gasvormige brandstoffen via leidingen @nl
preferred label: Distribusjon av gass gjennom ledningsnett @no
preferred label: Dystrybucja paliw gazowych w systemie sieciowym @pl
preferred label: Distribuição de combustíveis gasosos por condutas @pt
preferred label: Distribuţia combustibililor gazoşi, prin conducte @ro
preferred label: Распределение газообразного топлива по трубопроводам @ru
preferred label: Rozvod plynných palív potrubím @sk
preferred label: Distribucija plinastih goriv po plinovodni mreži @sl
preferred label: Distribution av gasformiga bränslen via rörnät @sv
preferred label: Ana şebeke üzerinden gaz yakıtların dağıtımı @tr
broader: Manufacture of gas; distribution of gaseous fuels through mains

Trade of gas through mains
type: Concept
notation: 35.23
status: valid
status modified: 2013-10-18
accepted date: 2013-10-18
in scheme: Statistical Classification of Economic Activities in the European Community, Rev. 2 (2008)
scope note: - продажба на потребителите на газообразни горива по газоразпределителните мрежи - дейности на посредници по продажба на газообразни горива по газоразпределителните мрежи, управлявани от друг - смяна на газообразните горива и транспортната вместимост - търговия на едро с газообразни горива - 46.71 - търговия на дребно с бутилирани газообразни горива - 47.78 - директна продажба на газообразни горива - 47.99 @bg
scope note: Z: - prodej plynu prostřednictvím potrubních sítí uživatelům - činnosti makléřů nebo obchodních agentů zprostředkujících prodej plynu prostřednictvím potrubních rozvodných sítí provozovaných jinými subjekty - provoz burz, na nichž se obchoduje s plynnými palivy a s kapacitami přepravních potrubních sítí N: - velkoobchod s plynnými palivy (46.71) - maloobchod s plynem stlačeným v lahvích (47.78) - přímý prodej paliv (47.99) @cs
scope note: Diese Klasse umfasst: - Verkauf von Gas durch Rohrleitungen an den Verbraucher - Tätigkeiten von Handelsmaklern oder Handelsvertretern, die den Verkauf von Gas über Rohrleitungsnetze vermitteln, die von Dritten betrieben werden - Austausch von gasförmigen Brennstoffen und von Transportkapazitäten für solche Brennstoffe Diese Klasse umfasst nicht: - Großhandel mit gasförmigen Brennstoffen (s. 46.71) - Einzelhandel mit Flaschengas (s. 47.78) - Direktverkauf von Brennstoffen (s. 47.99) @de
scope note: This class includes: - sale of gas to the user through mains - activities of gas brokers or agents that arrange the sale of gas over gas distribution systems operated by others - commodity and transport capacity exchanges for gaseous fuels This class excludes: - wholesale of gaseous fuels, see 46.71 - retail sale of bottled gas, see 47.78 - direct selling of fuel, see 47.99 @en
scope note: Esta clase comprende: - la venta de gas al usuario por tuberías - las actividades de los intermediarios de gas que gestionan la venta de gas a través de las redes de distribución operadas por otros - la explotación de los mercados de gas y capacidad de transporte para combustibles gaseosos Esta clase no comprende: - el comercio al por mayor de combustibles gaseosos (véase 46.71) - el comercio al por menor de gas embotellado (véase 47.78) - la venta directa de combustible (véase 47.99) @es
scope note: Cette classe comprend: - la vente au consommateur de gaz acheminé par des conduites - les activités des courtiers en gaz ou des agents qui organisent la vente de gaz via des systèmes de distribution de gaz exploités par d’autres - les échanges de produits et de capacité de transfert pour les combustibles gazeux Cette classe ne comprend pas: - le commerce de combustibles gazeux, voir 46.71 - le commerce de détail de gaz en bonbonnes, voir 47.78 - la vente directe de combustibles, voir 47.99 @fr
scope note: Ovaj razred uključuje: - prodaju plina ostalim korisnicima distribucijskog sustava - djelatnosti brokera za plin i agenata koji ugovaraju prodaju plina distribucijskim sustavom kojim upravljaju drugi - robni i transportni kapacitet razmjene za plinovita goriva Ovaj razred isključuje: - trgovinu na veliko plinovitim gorivima, vidi 46.71 - trgovinu na malo plina u bocama, vidi 47.78 - izravnu prodaju gorivom, vidi 47.99
scope note: Į šią klasę įeina: - dujų pardavimas vartotojui dujotiekiais - dujų pardavimo brokerių arba agentų, atliekančių pardavimą per kitų valdomas dujų skirstomąsias sistemas, veikla - dujų ir transportavimo galios biržų, prekiaujančių dujiniu kuru, veikla Į šią klasę neįeina: - didmeninė prekyba dujiniu kuru, žr. 46.71 - mažmeninė prekyba dujų balionais, žr. 47.78 - tiesioginė prekyba degalais, žr. 47.99 @lt
scope note: Bu sınıf aşağıdakileri kapsamaktadır: - ana borularla kullanıcılara gaz satışı - diğer işletmeler tarafından işletilen gaz dağıtım sistemleri aracılığıyla, gaz satışını düzenleyen gaz komisyoncuları veya acentelerinin faaliyetleri - gazlı yakıtlar için mal ve ulaşım kapasitesinin değiştirilmesi. Kapsam dışı olanlar: - gaz yakıtların toptan satışı, bkz. 46.71 - şişelenmiş gazın perakende satışı, bkz. 47.78 - doğrudan yakıt satışı, bkz 47.99. @tr
preferred label: Търговия с газообразни горива по газоразпределителните мрежи @bg
preferred label: Obchod s plynem prostřednictvím sítí @cs
preferred label: Handel med gas gennem rørledninger @da
preferred label: Gashandel durch Rohrleitungen @de
preferred label: Εμπόριο αέριων καυσίμων μέσω αγωγών @el
preferred label: Comercio de gas por tubería @es
preferred label: Gaasimüük magistraalvõrkude kaudu @et
preferred label: Kaasun kauppa putkiverkossa @fi
preferred label: Commerce de combustibles gazeux par conduites @fr
preferred label: Gázkereskedelem
preferred label: Commercio di gas distribuito mediante condotte @it
preferred label: Dujų pardavimas dujotiekiais @lt
preferred label: Gāzes realizācija pa cauruļvadiem @lv
preferred label: Negozju ta' gass permezz ta' mejns @mt
preferred label: Handel in gas via leidingen @nl
preferred label: Handel med gass gjennom ledningsnett @no
preferred label: Handel paliwami gazowymi w systemie sieciowym @pl
preferred label: Comércio de gás por condutas @pt
preferred label: Comercializarea combustibililor gazoşi, prin conducte @ro
preferred label: Продажа газообразного топлива по трубопроводам @ru
preferred label: Predaj plynu prepravovaného potrubím @sk
preferred label: Trgovanje s plinastimi gorivi po plinovodni mreži @sl
preferred label: Handel med gas via rörnät @sv
preferred label: Ana şebeke üzerinden gaz ticareti @tr
broader: Manufacture of gas; distribution of gaseous fuels through mains

Steam and air conditioning supply
type: Concept
notation: 35.3
status: valid
status modified: 2013-10-18
accepted date: 2013-10-18
in scheme: Statistical Classification of Economic Activities in the European Community, Rev. 2 (2008)
scope note: Данный класс включает сбор воды, обработку и ее дальнейшее распределение для бытовых и промышленных нужд. Сбор воды из различных источников, а также ее распределение через различные источники также включены в данный раздел. Работа оросительных каналов также включена в данный класс; однако предоставление услуг по орошению или поливу при помощи поливных машин и подобной сельскохозяйственной техники в данный класс не включено. Этот класс включает: - водосбор из рек, озер, скважин и т.д. - сбор дождевой воды - очищение воды для водоснабжения - обработку воды для промышленных и прочих нужд - опреснение морской воды или подземных вод для производства основной продукции - распределение воды через водопроводы, транспортом или прочими средствами - работу оросительных каналов Этот класс исключает: - работу оросительного оборудования для сельскохозяйственных целей, см. 01.61 - очистку отработанной воды в целях предотвращения загрязнения окружающей среды, см. 37.00 - поставку воды по трубопроводу (на дальние расстояния), см. 49.50 @ru
preferred label: Производство и разпределение на топлинна енергия @bg
preferred label: Dodávání páry a klimatizovaného vzduchu @cs
preferred label: Fjernvarmeforsyning @da
preferred label: Wärme- und Kälteversorgung @de
preferred label: Παροχή ατμού και κλιματισμού @el
preferred label: Suministro de vapor y aire acondicionado @es
preferred label: Auru ja konditsioneeritud õhuga varustamine @et
preferred label: Lämmön ja kylmän tuotanto ja jakelu @fi
preferred label: Production et distribution de vapeur et d'air conditionné @fr
preferred label: Gőzellátás, légkondicionálás
preferred label: Fornitura di vapore e aria condizionata @it
preferred label: Garo tiekimas ir oro kondicionavimas @lt
preferred label: Tvaika piegāde un gaisa kondicionēšana @lv
preferred label: Provvista ta' fwar u arja kkondizzjonata @mt
preferred label: Productie en distributie van stoom en gekoelde lucht @nl
preferred label: Damp- og varmtvannsforsyning @no
preferred label: Zaopatrywanie w parę wodną i powietrze do układów klimatyzacyjnych @pl
preferred label: Produção e distribuição de vapor e ar frio @pt
preferred label: Furnizarea de abur şi aer condiţionat @ro
preferred label: Системы подачи пара и кондиционирования воздуха @ru
preferred label: Dodávka pary a rozvod studeného vzduchu @sk
preferred label: Oskrba s paro in vročo vodo @sl
preferred label: Försörjning av värme och kyla @sv
preferred label: Buhar ve iklimlendirme temini @tr
broader: Electricity, gas, steam and air conditioning supply
narrower: Steam and air conditioning supply

Steam and air conditioning supply
type: Concept
notation: 35.30
status: valid
status modified: 2013-10-18
accepted date: 2013-10-18
in scheme: Statistical Classification of Economic Activities in the European Community, Rev. 2 (2008)
scope note: - производство, събиране и разпределение на пара и топла вода за отопление, за производство на енергия и други цели - производство и разпределение на охладен въздух - производство и разпределение на охладителни течности за климатизация - производство на лед за хранителни продукти или за друго предназначение (например за охлаждане) @bg
scope note: Z: - výrobu, sběr a rozvod páry a teplé vody pro vytápění, pro získávání energie a jiné účely - výrobu a rozvod chlazeného vzduchu - výrobu a rozvod chlazené vody pro chladicí účely - výrobu ledu pro potravinářství nebo pro jiné účely (např. chlazení) @cs
scope note: Diese Klasse umfasst: - Erzeugung, Sammlung und Verteilung von Dampf und Warmwasser zum Heizen, zur Energiegewinnung und zu anderen Zwecken - Erzeugung und Verteilung von gekühlter Luft - Erzeugung und Verteilung von Kühlwasser - Erzeugung von Eis für Ernährungs- und andere Zwecke (z. B. zur Kühlung) @de
scope note: This class includes: - production, collection and distribution of steam and hot water for heating, power and other purposes - production and distribution of cooled air - production and distribution of chilled water for cooling purposes - production of ice, for food and non-food (e.g. cooling) purposes @en
scope note: Esta clase comprende: - la producción, captación y distribución de vapor y agua caliente para calefacción, energía u otros fines - la producción y distribución de aire refrigerado - la producción y distribución de agua fría con fines de refrigeración - la producción de hielo, incluyendo tanto para consumo humano como con otros fines (por ejemplo, refrigeración) @es
scope note: Cette classe comprend: - la production, la collecte et la distribution de vapeur et d’eau chaude pour le chauffage, la force motrice et d’autres usages - la production et la distribution d’air réfrigéré - la production et la distribution d’eau froide pour le refroidissement - la production de glace pour des usages alimentaires ou autres (par exemple, pour le refroidissement) @fr
scope note: Ovaj razred uključuje: - proizvodnju, skupljanje i distribuciju pare i tople vode za grijanje, pogonske i ostale svrhe - proizvodnju i distribuciju rashlađenim zrakom - proizvodnju i distribuciju rashlađenom vodom za potrebe hlađenja - proizvodnju leda, za potrebe hlađenja hrane i ostale potrebe (npr. hlađenje)
scope note: Į šią klasę įeina: - garo ir karšto vandens gamyba, surinkimas ir paskirstymas šildymo, energijos ir kitais tikslais - atvėsinto oro gamyba ir paskirstymas - atvėsinto vandens gamyba ir paskirstymas vėsinimo tikslais - ledo, skirto maistui ir kitiems tikslams, pvz., aušinimui, gamyba @lt
scope note: Данный раздел включает работу по очистке и обработке сточных систем и канализации, где происходит сбор, очистка, обработка и распределение нечистот. @ru
scope note: Bu sınıf aşağıdakileri kapsamaktadır: - ısınma, güç ve diğer amaçlar için su buharı ve sıcak suların üretimi, toplanması ve dağıtılması - soğutulmuş havanın üretimi ve dağıtımı - soğutma amaçlı soğuk su üretimi ve dağıtımı - buz üretimi, yemek amacıyla olsun olmasın (soğutma vb.) @tr
preferred label: Производство и разпределение на топлинна енергия @bg
preferred label: Dodávání páry a klimatizovaného vzduchu @cs
preferred label: Fjernvarmeforsyning @da
preferred label: Wärme- und Kälteversorgung @de
preferred label: Παροχή ατμού και κλιματισμού @el
preferred label: Suministro de vapor y aire acondicionado @es
preferred label: Auru ja konditsioneeritud õhuga varustamine @et
preferred label: Lämmön ja kylmän tuotanto ja jakelu @fi
preferred label: Production et distribution de vapeur et d'air conditionné @fr
preferred label: Gőzellátás, légkondicionálás
preferred label: Fornitura di vapore e aria condizionata @it
preferred label: Garo tiekimas ir oro kondicionavimas @lt
preferred label: Tvaika piegāde un gaisa kondicionēšana @lv
preferred label: Provvista ta' fwar u arja kkondizzjonata @mt
preferred label: Productie en distributie van stoom en gekoelde lucht @nl
preferred label: Damp- og varmtvannsforsyning @no
preferred label: Zaopatrywanie w parę wodną i powietrze do układów klimatyzacyjnych @pl
preferred label: Produção e distribuição de vapor e ar frio @pt
preferred label: Furnizarea de abur şi aer condiţionat @ro
preferred label: Системы подачи пара и кондиционирования воздуха @ru
preferred label: Dodávka pary a rozvod studeného vzduchu @sk
preferred label: Oskrba s paro in vročo vodo @sl
preferred label: Försörjning av värme och kyla @sv
preferred label: Buhar ve iklimlendirme temini @tr
broader: Steam and air conditioning supply

Water collection, treatment and supply
type: Concept
notation: 36
status: valid
status modified: 2013-10-18
accepted date: 2013-10-18
in scheme: Statistical Classification of Economic Activities in the European Community, Rev. 2 (2008)
scope note: Разделът включва събиране, пречистване и доставяне на води за битови и производствени нужди. Включени са дейностите по добиване и събиране на природни води от всякакви източници, както и дейностите по доставяне на води независимо от техническите средства и начини. Експлоатацията на каналите за напояване също се включва тук, но не и предоставянето на поливни услуги чрез пръскачки, дъждовални машини и подобни спомагателни селскостопански услуги. @bg
scope note: Tento oddíl zahrnuje shromažďování, úpravu a rozvod vody pro domácnosti a průmyslovou potřebu. Zahrnuje shromažďování vody z různých zdrojů, rovněž distribuce vody různými způsoby. @cs
scope note: Diese Abteilung umfasst die Versorgung von Haushalten und kommerziellen Abnehmern mit Wasser, das auf unterschiedliche Art gewonnen und verteilt werden kann. @de
scope note: This division includes the collection, treatment and distribution of water for domestic and industrial needs. Collection of water from various sources, as well as distribution by various means is included. @en
scope note: Esta división comprende la captación, el tratamiento y la distribución de agua para necesidades domésticas e industriales. Comprende la captación de agua de diversas fuentes, así como la distribución por distintos medios. @es
scope note: Cette division comprend les activités de captage, de traitement et de distribution d’eau pour les besoins des ménages et des industries. Le captage d’eau de plusieurs origines et la distribution par différents moyens sont également compris. @fr
scope note: Ovaj odjeljak uključuje skupljanje, obradu i opskrbu vodom za potrebe kućanstva i industrijske potrebe. Uključeno je skupljanje vode iz različitih izvora, kao i distribucija različitim sredstvima.
scope note: Į šį skyrių įeina buitinėms ir gamybinėms reikmėms skirto vandens surinkimas, paruošimas ir paskirstymas. Į šį skyrių taip pat įeina vandens surinkimas iš įvairių šaltinių ir paskirstymas naudojant įvairias priemones. @lt
scope note: Этот класс включает: - работу сточных систем или станций по обработке сточных вод - сбор и транспортировку бытовых или промышленных отходов воды однократного или многократного использования, а также дождевой воды через канализационную систему, сборники, резервуары и прочие средства транспортировки (транспортные средства для сбора нечистот и т.д.) - опорожнение и очищение выгребных ям, отстойников и септиков, обслуживание химических туалетов - обработку водоотходов (включая бытовые и промышленные водоотходы, воду из плавательных бассейнов и т.д.) при помощи механической, химической и биологической обработки, такой как добавление химикатов, фильтрация, седиментация и т.д. - технический уход и чистка канализации и дренажных каналов, включая прочистку канализационных труб гибкими стержнями Этот класс исключает: - дезинфекцию поверхностных и грунтовых вод в местах загрязнения, см. 39.00 - очистку и пробивку дренажных труб в зданиях, см. 43.22 @ru
scope note: Bu bölüm, suyun evsel ve endüstriyel ihtiyaçlar doğrultusunda toplanmasını, arıtılmasını ve dağıtımını kapsamaktadır. Suyun çeşitli kaynaklardan toplanmasının yanı sıra çeşitli yöntemlerle dağıtılması da bu bölüme dahildir. @tr
preferred label: Събиране, пречистване и доставяне на води @bg
preferred label: Shromažďování, úprava a rozvod vody @cs
preferred label: Vandforsyning @da
preferred label: Wasserversorgung @de
preferred label: Συλλογή, επεξεργασία και παροχή νερού @el
preferred label: Captación, depuración y distribución de agua @es
preferred label: Veekogumine, -töötlus ja -varustus @et
preferred label: Veden otto, puhdistus ja jakelu @fi
preferred label: Captage, traitement et distribution d'eau @fr
preferred label: Víztermelés, -kezelés, -ellátás
preferred label: Raccolta, trattamento e fornitura di acqua @it
preferred label: Vandens rinkimas, valymas ir tiekimas @lt
preferred label: Ūdens ieguve, attīrīšana un apgāde @lv
preferred label: Ġbir, trattament u provvista ta' l-ilma @mt
preferred label: Winning, behandeling en distributie van water @nl
preferred label: Uttak fra kilde, rensing og distribusjon av vann @no
preferred label: Pobór, uzdatnianie i dostarczanie wody @pl
preferred label: Captação, tratamento e distribuição de água @pt
preferred label: Captarea, tratarea şi distribuţia apei @ro
preferred label: Сбор, обработка и распределение воды @ru
preferred label: Zber, úprava a dodávka vody @sk
preferred label: Zbiranje, prečiščevanje in distribucija vode @sl
preferred label: Vattenförsörjning @sv
preferred label: Suyun toplanması, arıtılması ve dağıtılması @tr
broader: WATER SUPPLY; SEWERAGE, WASTE MANAGEMENT AND REMEDIATION ACTIVITIES
narrower: Water collection, treatment and supply

Water collection, treatment and supply
type: Concept
notation: 36.0
status: valid
status modified: 2013-10-18
accepted date: 2013-10-18
in scheme: Statistical Classification of Economic Activities in the European Community, Rev. 2 (2008)
scope note: Данный раздел включает сбор, обработку и распределение отходов. Сюда также входит местное удаление отходов и работу перерабатывающих приспособлений (то есть получение реверсируемых материалов из общего числа отходов). @ru
preferred label: Събиране, пречистване и доставяне на води @bg
preferred label: Shromažďování, úprava a rozvod vody @cs
preferred label: Vandforsyning @da
preferred label: Wasserversorgung @de
preferred label: Συλλογή, επεξεργασία και παροχή νερού @el
preferred label: Captación, depuración y distribución de agua @es
preferred label: Veekogumine, -töötlus ja -varustus @et
preferred label: Veden otto, puhdistus ja jakelu @fi
preferred label: Captage, traitement et distribution d'eau @fr
preferred label: Víztermelés, -kezelés, -ellátás
preferred label: Raccolta, trattamento e fornitura di acqua @it
preferred label: Vandens rinkimas, valymas ir tiekimas @lt
preferred label: Ūdens ieguve, attīrīšana un apgāde @lv
preferred label: Ġbir, trattament u provvista ta' l-ilma @mt
preferred label: Winning, behandeling en distributie van water @nl
preferred label: Uttak fra kilde , rensing og distribusjon av vann @no
preferred label: Pobór, uzdatnianie i dostarczanie wody @pl
preferred label: Captação, tratamento e distribuição de água @pt
preferred label: Captarea, tratarea şi distribuţia apei @ro
preferred label: Сбор, обработка и распределение воды @ru
preferred label: Zber, úprava a dodávka vody @sk
preferred label: Zbiranje, prečiščevanje in distribucija vode @sl
preferred label: Vattenförsörjning @sv
preferred label: Suyun toplanması, arıtılması ve dağıtılması @tr
broader: Water collection, treatment and supply
narrower: Water collection, treatment and supply

Water collection, treatment and supply
type: Concept
notation: 36.00
status: valid
status modified: 2013-10-18
accepted date: 2013-10-18
in scheme: Statistical Classification of Economic Activities in the European Community, Rev. 2 (2008)
scope note: - водовземане и събиране на води от реки, езера, извори, кладенци и други източници - събиране на дъждовна вода - пречистване и обеззаразяване на води, предназначени за питейно-битови цели - пречистване на води за промишлени и други цели - обезсоляване на морска вода или подземни води, когато целта е получаване на вода - доставяне на води до потребителите чрез водопроводи, автомобили-цистерни или чрез други средства - експлоатация на канали за напояване - експлоатация на машини и оборудване за поливане/напояване в селското стопанство - 01.61 - обработване на отпадъчни води, с цел предотвратяване на замърсяване на околната среда – 37.00 - пренос на вода по магистрални тръбопроводи – 49.50 @bg
scope note: Tato třída zahrnuje činnosti spojené se zásobováním vodou průmyslu a domácnosti. Vodu lze získávat a rozvádět různými způsoby. Třída zahrnuje také provoz zavlažovacích kanálů, nezahrnuje však provoz rozstřikovacích zařízení a podobných podpůrných služeb pro zemědělství. Z: - získávání vody z řek, jezer, pramenů atd. - shromažďování dešťové vody - čištění vody pro účely zásobování vodou - úpravu vody pro průmyslové a jiné účely - odsolování mořské vody nebo spodních vod, pokud je hlavním účelem získání vody - rozvod vody prostřednictvím potrubí, cisternovými vozy nebo jinými způsoby - provoz zavlažovacích kanálů N: - provoz zavlažovacích zařízení používaných pro zemědělské účely (01.61) - úpravu odpadních vod pro účely ochrany životního prostředí (37.00) - dopravu vody dálkovým potrubím (49.50) @cs
scope note: Diese Klasse umfasst Tätigkeiten zur Versorgung von Haushalten und kommerziellen Abnehmern mit Wasser. Das Wasser kann auf unterschiedliche Weise gewonnen und verteilt werden. Eingeschlossen ist der Betrieb von Bewässerungskanälen; nicht eingeschlossen sind der Betrieb von Sprinkleranlagen und ähnliche Hilfsdienstleistungen für die Landwirtschaft. Diese Klasse umfasst: - Wassergewinnung aus Flüssen, Seen, Brunnen usw. - Sammeln von Regenwasser - Reinigen von Wasser zum Zwecke der Wasserversorgung - Aufbereitung von Wasser für industrielle und andere Zwecke - Meer- und Grundwasserentsalzung, hauptsächlich zur Wassergewinnung - Verteilung von Wasser mittels Rohrleitungen, Lastkraftwagen oder auf andere Weise - Betrieb von Bewässerungskanälen Diese Klasse umfasst nicht: - Betrieb von landwirtschaftlichen Bewässerungsanlagen (s. 01.61) - Abwasseraufbereitung zum Zwecke des Umweltschutzes (s. 37.00) - Transport von Wasser in Rohrfernleitungen (s. 49.50) @de
scope note: This class includes water collection, treatment and distribution activities for domestic and industrial needs. Collection of water from various sources, as well as distribution by various means is included. The operation of irrigation canals is also included; however the provision of irrigation services through sprinklers, and similar agricultural support services, is not included. This class includes: - collection of water from rivers, lakes, wells etc. - collection of rain water - purification of water for water supply purposes - treatment of water for industrial and other purposes - desalting of sea or ground water to produce water as the principal product of interest - distribution of water through mains, by trucks or other means - operation of irrigation canals This class excludes: - operation of irrigation equipment for agricultural purposes, see 01.61 - treatment of wastewater in order to prevent pollution, see 37.00 - (long-distance) transport of water via pipelines, see 49.50 @en
scope note: Esta clase comprende la captación, el tratamiento y la distribución de agua para necesidades domésticas e industriales. Comprende la captación de agua de diversas fuentes, así como la distribución por distintos medios. Comprende también la explotación de canales de riego; ahora bien, no comprende la prestación de servicios de riego por aspersión automática y otros servicios de apoyo a la agricultura similares. Esta clase comprende: - la captación de agua de ríos, lagos, pozos, etc. - la captación de agua de lluvia - la purificación de aguas para el suministro de agua - el tratamiento de aguas para uso industrial y otros usos - la desalinización de agua de mar o de aguas subterráneas para obtener agua como producto principal - la distribución de agua por tuberías, realizada en camión u otros medios - la explotación de canales de riego Esta clase no comprende: - la explotación de equipos de riego para fines agrícolas (véase 01.61) - el tratamiento de aguas residuales para impedir la contaminación (véase 37.00) - el transporte (de larga distancia) de gases por tubería (véase 49.50) @es
scope note: Cette classe comprend les activités de captage, de traitement et de distribution d’eau pour les besoins des ménages et des industries. Le captage d’eau de plusieurs origines et la distribution par différents moyens sont également compris. L’exploitation de canaux d’irrigation est également comprise, mais la fourniture de services d’irrigation comme l’arrosage automatique et d’autres services similaires de soutien à l’activité agricole, n’est pas comprise. Cette classe comprend: - le captage d’eau à partir de rivières, de lacs et de puits, etc. - la collecte d’eau de pluie - le traitement de l’eau aux fins de la distribution d’eau - le traitement de l’eau pour des usages industriels ou autres - le dessalement de l’eau de mer ou d’eaux souterraines, pour autant que la production d’eau constitue l’activité principale - la distribution de l’eau par conduites, camions ou autres moyens de transport - l’exploitation de canaux d’irrigation Cette classe ne comprend pas: - l’exploitation d’appareils d’irrigation à des fins agricoles, voir 01.61 - le traitement des eaux usées à des fins de prévention de la pollution, voir 37.00 - le transport (sur de longues distances) d’eau par conduites, voir 49.50 @fr
scope note: Ovaj razred uključuje djelatnost skupljanja, obrade i opskrbe za potrebe kućanstva i industrije. Uključeno je skupljanje vode iz različitih izvora, kao i opskrba vodom različitim sredstvima. Također je uključen rad kanala za navodnjavanje. Međutim nije uključeno pružanje usluga navodnjavanja putem sustava za raspršivanje vode i slične pomoćne usluge u poljoprivredi. Ovaj razred uključuje: - skupljanje vode iz rijeka, jezera, izvora itd. - skupljanje kišnice - pročišćavanje vode za vodoopskrbu - obradu vode za industrijske i ostale potrebe - desalinizaciju morske vode ili podzemnih voda za potrebe proizvodnje vode kao proizvoda od najveće važnosti - opskrbu vodom glavnim cjevovodima, kamionima ili drugim sredstvima - rad kanala za navodnjavanje Ovaj razred isključuje: - rad opreme za navodnjavanje za potrebe poljoprivrede, vidi 01.61 - obradu otpadnih voda radi sprečavanja zagađenja, vidi 37.00 - cjevovodni transport (na velike udaljenosti), vidi 49.50
scope note: Į šią klasę įeina vandens surinkimas, paruošimas ir paskirstymas buitinėms ir gamybinėms reikmėms. Čia įeina vandens surinkimas iš įvairių šaltinių taip pat paskirstymas naudojant įvairias priemones. Į šią klasę taip pat įeina drėkinimo kanalų eksploatavimas, nors drėkinimo, naudojant purkštuvus, ir panašių žemės ūkio paslaugų veikla nėra įtraukta. Į šią klasę įeina: - vandens surinkimas iš upių, ežerų, šulinių ir kt. - lietaus vandens surinkimas - vandens valymas vandens tiekimo tikslais - vandens paruošimas pramonės ir kitokiems tikslams - tinkamo vartoti vandens gamyba, gėlinant jūros arba gruntinį vandenį - vandens paskirstymas vamzdynais, vandenvežiais arba kitokiomis priemonėmis - drėkinimo kanalų eksploatavimas Į šią klasę neįeina: - žemės ūkio drėkinimo įrangos eksploatavimas, žr. 01.61 - nuotekų valymas, siekiant išvengti aplinkos užteršimo, žr. 37.00 - vandens transportavimas magistraliniais (ilgų nuotolių) vamzdynais, žr. 49.50 @lt
scope note: Данная группа включает забор бытовых и промышленных отходов из мест накопления, мусорных контейнеров, передвижных мусорных контейнеров, баков, емкостей и т.д. Она включает сбор неопасных и опасных отходов, например, бытовых отходов, таких как элементы питания, использованные пищевые масла и жиры, отработанные технические и моторные масла, а также строительные отходы и отходы разложения. @ru
scope note: Bu sınıf, suyun evsel ve endüstriyel ihtiyaçlar doğrultusunda toplanmasını, arıtılmasını ve dağıtımını kapsamaktadır. Suyun çeşitli kaynaklardan toplanmasının yanı sıra çeşitli yöntemlerle dağıtılması da bu sınıfa dahildir. Sulama kanallarının işletilmesi de bu sınıfa dahildir, ancak yağmurlama v.b. sulama hizmetleri ve benzeri tarımsal destek hizmetleri dahil edilmemiştir. Bu sınıf aşağıdakileri kapsamaktadır: - ırmaklardan, göllerden, su kuyularından vb. kaynaklardan su toplanması - yağmur sularının toplanması - su temini amacıyla suyun arıtılması - suyun endüstriyel ve diğer amaçlar için arıtılması - deniz ya da yer altı suyunu tuzdan arındırarak ihtiyaç duyulan suyun üretilmesi - suyun şebekeler, tankerler ya da diğer araçlar vasıtasıyla dağıtımı - sulama kanallarının işletilmesi Kapsam dışı olanlar: - tarımsal amaçlı sulama ekipmanlarının işletilmesi, bkz. 01.61 - kirliliği önlemek için atıksuların arıtılması, bkz. 37.00 - suyun, su boruları aracılığıyla (uzak mesafelere) nakledilmesi, bkz. 49.50 @tr
preferred label: Събиране, пречистване и доставяне на води @bg
preferred label: Shromažďování, úprava a rozvod vody @cs
preferred label: Vandforsyning @da
preferred label: Wasserversorgung @de
preferred label: Συλλογή, επεξεργασία και παροχή νερού @el
preferred label: Captación, depuración y distribución de agua @es
preferred label: Veekogumine, -töötlus ja -varustus @et
preferred label: Veden otto, puhdistus ja jakelu @fi
preferred label: Captage, traitement et distribution d'eau @fr
preferred label: Víztermelés, -kezelés, -ellátás
preferred label: Raccolta, trattamento e fornitura di acqua @it
preferred label: Vandens rinkimas, valymas ir tiekimas @lt
preferred label: Ūdens ieguve, attīrīšana un apgāde @lv
preferred label: Ġbir, trattament u provvista ta' l-ilma @mt
preferred label: Winning, behandeling en distributie van water @nl
preferred label: Uttak fra kilde, rensing og distribusjon av vann @no
preferred label: Pobór, uzdatnianie i dostarczanie wody @pl
preferred label: Captação, tratamento e distribuição de água @pt
preferred label: Captarea, tratarea şi distribuţia apei @ro
preferred label: Сбор, обработка и распределение воды @ru
preferred label: Zber, úprava a dodávka vody @sk
preferred label: Zbiranje, prečiščevanje in distribucija vode @sl
preferred label: Vattenförsörjning @sv
preferred label: Suyun toplanması, arıtılması ve dağıtılması @tr
broader: Water collection, treatment and supply

Sewerage
type: Concept
notation: 37
status: valid
status modified: 2013-10-18
accepted date: 2013-10-18
in scheme: Statistical Classification of Economic Activities in the European Community, Rev. 2 (2008)
scope note: Този раздел включва експлоатация на канализационни системи и пречиствателни станции и съоръжения, чрез които отпадъчните води се събират, пречистват и заустват. @bg
scope note: Tento oddíl zahrnuje provoz kanalizačních sítí nebo čističek odpadních vod za účelem shromažďování, úpravy a odstraňování odpadních vod. @cs
scope note: Diese Abteilung umfasst den Betrieb von Kanalnetzen oder Kläranlagen zur Sammlung, Behandlung und Beseitigung von Abwasser. @de
scope note: This division includes the operation of sewer systems or sewage treatment facilities that collect, treat, and dispose of sewage. @en
scope note: Esta división comprende la explotación de sistemas de alcantarillado o instalaciones de tratamiento de aguas residuales que recogen, tratan y eliminan éstas @es
scope note: Cette division comprend l’exploitation de réseaux d’assainissement ou d’installations de traitement des déchets procédant à la collecte, au traitement et à l’élimination des déchets. @fr
scope note: Ovaj odjeljak uključuje rad kanalizacijskih sustava ili uređaje za obradu otpadnih voda s pomoću kojih se skupljaju, obrađuju, opskrbljuju i ispuštaju otpadne vode.
scope note: Į šį skyrių įeina nuotakynų ar nuotekų valymo įrenginių, surenkančių, valančių ir šalinančių nuotekas, eksploatavimas. @lt
scope note: Этот класс включает: - сбор неопасных твердых бытовых и промышленных отходов (то есть, мусорных отходов) в местах накопления, мусорных контейнерах, передвижных мусорных контейнерах, баках, емкостях и т.д. и смешанных реверсируемых материалов - сбор реверсируемых материалов - сбор мусора из мусорных урн в общественных местах Этот класс также включает: - сбор строительных отходов и отходов разложения - сбор и вывоз строительного мусора, такого как кисти и прочий строительный мусор - сбор отходов от выпуска текстильных изделий - деятельность по вывозу отходов к местам переработки для неопасных отходов Этот класс исключает: - сбор опасных отходов, см. 38.12 - работу мусорных свалок и закапывание неопасных отходов, см. 38.21 - работу мусорных свалок, где реверсируемые материалы, такие как бумага, пластик и т.д. делятся на особые категории, см. 38.32 @ru
scope note: Bu bölüm atık suyu toplayan, arıtan ve bertaraf eden kanalizasyon sistemleri ve atık su arıtma tesislerinin işletimini kapsamaktadır. @tr
preferred label: Събиране, отвеждане и пречистване на отпадъчни води @bg
preferred label: Činnosti související s odpadními vodami @cs
preferred label: Opsamling og behandling af spildevand @da
preferred label: Abwasserentsorgung @de
preferred label: Επεξεργασία λυμάτων @el
preferred label: Recogida y tratamiento de aguas residuales @es
preferred label: Kanalisatsioon @et
preferred label: Viemäri- ja jätevesihuolto @fi
preferred label: Collecte et traitement des eaux usées @fr
preferred label: Szennyvíz gyűjtése, kezelése
preferred label: Gestione delle reti fognarie @it
preferred label: Nuotekų valymas @lt
preferred label: Notekūdeņu savākšana un attīrīšana @lv
preferred label: Sistema ta' drenaġġi @mt
preferred label: Afvalwaterafvoer @nl
preferred label: Oppsamling og behandling av avløpsvann @no
preferred label: Odprowadzanie i oczyszczanie ścieków @pl
preferred label: Recolha e tratamento de águas residuais @pt
preferred label: Colectarea şi epurarea apelor uzate @ro
preferred label: Канализационная система @ru
preferred label: Čistenie a odvod odpadových vôd @sk
preferred label: Ravnanje z odplakami @sl
preferred label: Avloppsrening @sv
preferred label: Kanalizasyon @tr
broader: WATER SUPPLY; SEWERAGE, WASTE MANAGEMENT AND REMEDIATION ACTIVITIES
narrower: Sewerage

Sewerage
type: Concept
notation: 37.0
status: valid
status modified: 2013-10-18
accepted date: 2013-10-18
in scheme: Statistical Classification of Economic Activities in the European Community, Rev. 2 (2008)
scope note: Этот класс включает сбор твердых и не твердых опасных отходов, таких как, взрывчатые вещества, окисляющиеся, воспламеняемые, токсичные, вызывающие раздражение, вредные, канцерогенные, едкие, вызывающие заражение или прочие вещества и препараты, вредные для здоровья человека и окружающей среды. Они также могут проходить идентификацию, обработку, упаковку, на упаковке наклеиваются этикетки с целью транспортировки. Этот класс включает: - сбор опасных отходов: • отработанного моторного или машинного масла • биологически опасных отходов • ядерных отходов • отработанных батарей и т.д. - деятельность станций, перерабатывающих опасные отходы Этот класс исключает: - обработку и очистку зараженных зданий, стройплощадок, почвы, подземных вод, например, удаление асбеста, см. 39.00 @ru
preferred label: Събиране, отвеждане и пречистване на отпадъчни води @bg
preferred label: Činnosti související s odpadními vodami @cs
preferred label: Opsamling og behandling af spildevand @da
preferred label: Abwasserentsorgung @de
preferred label: Επεξεργασία λυμάτων @el
preferred label: Recogida y tratamiento de aguas residuales @es
preferred label: Kanalisatsioon @et
preferred label: Viemäri- ja jätevesihuolto @fi
preferred label: Collecte et traitement des eaux usées @fr
preferred label: Szennyvíz gyűjtése, kezelése
preferred label: Gestione delle reti fognarie @it
preferred label: Nuotekų valymas @lt
preferred label: Notekūdeņu savākšana un attīrīšana @lv
preferred label: Sistema ta' drenaġġi @mt
preferred label: Afvalwaterafvoer @nl
preferred label: Oppsamling og behandling av avløpsvann @no
preferred label: Odprowadzanie i oczyszczanie ścieków @pl
preferred label: Recolha e tratamento de águas residuais @pt
preferred label: Colectarea şi epurarea apelor uzate @ro
preferred label: Канализационная система @ru
preferred label: Čistenie a odvod odpadových vôd @sk
preferred label: Ravnanje z odplakami @sl
preferred label: Avloppsrening @sv
preferred label: Kanalizasyon @tr
broader: Sewerage
narrower: Sewerage

Sewerage
type: Concept
notation: 37.00
status: valid
status modified: 2013-10-18
accepted date: 2013-10-18
in scheme: Statistical Classification of Economic Activities in the European Community, Rev. 2 (2008)
scope note: - експлоатация на канализационни системи и пречиствателни станции и съоръжения - събиране и отвеждане на битови или промишлени отпадъчни води от един или повече потребители, както и на дъждовни води, посредством канализационни проводи и колектори, чрез автомобили-цистерни за отпадъчни води и други транспортни средства - изпразване и почистване на септични резервоари, шахти и ями; поддържане на химически тоалетни - пречистване на отпадъчни води (битови и промишлени отпадъчни води, води от плувни басейни и т.н.) посредством физически, химически и биологически процеси, такива като разреждане, прецеждане, филтриране, утаяване и други - почистване и поддържане на проводимостта на канализационни и отводнителни проводи и канали - очистване или обеззаразяване на повърхностни или подземни води на мястото на замърсяването – 39.00 - почистване и отпушване на канализационни тръби в сградни инсталации - 43.22 @bg
scope note: Z: - provoz kanalizačních sítí nebo čisticích zařízení odpadních vod - shromažďování a odvoz odpadních vod z domácností nebo průmyslu od jednoho nebo několika uživatelů, také shromažďování dešťové vody v kanalizačních sítích, sběrných nádržích, nádobách a jiných dopravních prostředcích (cisternách na odpadní vody atd.) - vyprazdňování a čištění septiků, žump, vyhnívacích nádrží a vsakovacích jímek; servis chemických toalet - úpravu odpadních vod (z domácností, průmyslu, z bazénů atd.) fyzikálními, chemickými a biologickými procesy jako je ředění, prosévání, filtrování, usazování atd. - údržbu a čištění kanalizací, stok, také pomocí tyčí N: - dekontaminaci povrchových a podzemních vod v místě znečištění (39.00) - čištění a pročištění potrubí odpadních vod v budovách (43.22) @cs
scope note: Diese Klasse umfasst: - Betrieb von Abwasserkanälen oder Kläranlagen - Sammlung und Abtransport von Abwässern aus Haushalten und Unternehmen, sowie Sammlung und Transport von Regenwasser in Kanalisationsnetzen, Sammelbecken, Behältern und Transportmitteln (Abwassertankwagen usw.) - Leeren und Reinigen von Senkgruben, Faulbecken und Sickergruben sowie chemischen Toiletten - Behandlung von Abwässern (aus Haushalten und Unternehmen, aus Schwimmbecken usw.) durch physikalische, chemische und biologische Verfahren wie Verdünnen, Sieben, Filtern, Absetzverfahren usw. - Wartung und Reinigung von Abwasserkanälen, auch mittels Stangen Diese Klasse umfasst nicht: - Dekontaminierung von Oberflächen- und Grundwasser am Ort der Verschmutzung (s. 39.00) - Reinigen von und Beseitigung von Verstopfungen in Entwässerungsrohren in Gebäuden (s. 43.22) @de
scope note: This class includes: - operation of sewer systems or sewer treatment facilities - collecting and transporting of human or industrial wastewater from one or several users, as well as rain water by means of sewerage networks, collectors, tanks and other means of transport (sewage vehicles etc.) - emptying and cleaning of cesspools and septic tanks, sinks and pits from sewage; servicing of chemical toilets - treatment of wastewater (including human and industrial wastewater, water from swimming pools etc.) by means of physical, chemical and biological processes like dilution, screening, filtering, sedimentation etc. - maintenance and cleaning of sewers and drains, including sewer rodding This class excludes: - decontamination of surface water and groundwater at the place of pollution, see 39.00 - cleaning and deblocking of drainpipes in buildings, see 43.22 @en
scope note: Esta clase comprende: - la explotación de sistemas de alcantarillado o instalaciones de tratamiento de aguas residuales - la recogida y transporte de aguas residuales urbanas e industriales, así como del agua de lluvia por medio de redes de alcantarillado, colectores, cisternas y otros medios de transporte (vehículos para aguas residuales, etc.) - el vaciado y limpieza de fosas y pozos sépticos, cloacas y fosos de aguas residuales, utilización de retretes químicos - el tratamiento de aguas residuales (incluyendo aguas residuales urbanas, industriales, de piscinas, etc.) mediante procesos físicos, químicos y biológicos, como la dilución, cribado, filtrado, sedimentación, etc. - el mantenimiento y la limpieza de alcantarillas y sumideros, incluyendo el desatasco de alcantarillas Esta clase no comprende: - la descontaminación de aguas superficiales y subterráneas en el lugar contaminado (véase 39.00) - la limpieza y desatasco de cañerías en edificios (véase 43.22) @es
scope note: Cette classe comprend: - l’exploitation de réseaux d’assainissement ou d’installations de traitement des déchets - la collecte et le transport des eaux résiduaires humaines ou industrielles provenant d’un ou de plusieurs utilisateurs et des eaux de pluie au moyen de réseaux d’assainissement, de collecteurs, de fosses et d’autres moyens de transports (camions de vidange, etc.) - la vidange et le nettoyage des puisards, des fosses septiques, des puits et des fosses, l’entretien des toilettes chimiques - le traitement des eaux usées (humaines ou industrielles, eaux usées des piscines, etc.) au moyen de procédés physiques, chimiques et biologiques, tels que la dilution, le criblage, la filtration, la sédimentation, etc. - l’entretien et le nettoyage des égouts et des canalisations, y compris le curetage des égouts Cette classe ne comprend pas: - la décontamination des eaux de surface et des eaux souterraines polluées, in situ, voir 39.00 - le nettoyage et le débouchage de tuyaux d’écoulement dans des bâtiments, voir 43.22 @fr
scope note: Ovaj razred uključuje: - rad sustava kanalizacijskih voda ili uređaja za obradu otpadnih voda - skupljanje i transport kako otpadnih voda iz kućanstava i industrije, tako i kišnice kanalizacijskom mrežom, kolektorima, tankovima ili drugim prijevoznim sredstvima (komunalnim vozilima itd.) te njihovu obradu i odvoz - pražnjenje i čišćenje septičkih jama i tankova, odvoda i jama od blata; servisiranje kemijskih zahoda - obradu otpadnih voda fizičkim, kemijskim, odnosno biološkim postupcima kao što su razrjeđivanje, procjeđivanje, taloženje itd. - održavanje i čišćenje kanalizacije i odvodnih jaraka za otjecanje kišnice, uključujući deblokiranje odvoda Ovaj razred isključuje: - dekontaminaciju površinskih i podzemnih voda na mjestu onečišćenja, vidi 39.00 - čišćenje i odčepljivanje kanalizacijskih cijevi u zgradama, vidi 43.22
scope note: Į šią klasę įeina: - nuotakynų ar nuotekų valymo įrenginių eksploatavimas - buitinių nuotekų iš vieno ar daugiau vartotojų, taip pat lietaus vandens, surinkimas ir transportavimas nuotakynais, kolektoriais (rinktuvais), cisternomis ir kitokiomis transporto priemonėmis (asenizacijos mašinomis ir kt.) - nuotekų rezervuarų ir pūdomųjų nusodintuvų, rinktuvų ir duobių tuštinimas ir valymas; cheminių tualetų kasdieninė priežiūra - nuotekų (įskaitant buitines ir pramonines nuotekas, plaukymo baseinų vandenį ir kt.) valymas, naudojant fizikinius, cheminius ir biologinius procesus, tokius kaip skiedimą, košimą, filtravimą, nusodinimą ir kt. - nuotakų ir išvadų priežiūra ir valymas, įskaitant valymą lynu Į šią klasę neįeina: - paviršinio ir gruntinio vandens sanitarinis švarinimas taršos vietoje, žr. 39.00 - pastatų vandens nutekamųjų vamzdžių valymas ir kamščių pašalinimas, žr. 43.22 @lt
scope note: Данная группа включает распределение и обработку отходов до переработки различными способами, такими как, обработка органических отходов для определенной переработки; обработка и распределение инфицирующих биологических отходов или трупов животных и т.п. отходов; радиоактивных отходов из госпиталей и т.д.; сброс мусора в водные резервуары или закапывание мусора в почву; захоронение мусора; распределение пришедшей в негодность техники и оборудования, такого как холодильники, для устранения вредных отходов; утилизация отходов методом сжигания. Включает в себя применение мусора в качестве топливного материала. Этот класс исключает: - обработку и утилизацию сточных вод, см. 37.00 - восстановление материалов, см. 38.3 @ru
scope note: Bu sınıf aşağıdakileri kapsamaktadır: - kanalizasyon sistemlerinin veya atık su arıtma tesislerinin işletimi - kanalizasyon şebekeleri, kollektörler, tanklar ve diğer nakliye araçları (vidanjör vb.) aracılığı ile bir veya daha fazla kullanıcıdan kaynaklanan endüstriyel ya da evsel atık suların ve yağmur sularının toplanması ve taşınması - fosseptiklerin, septik tankların, havuzların ve çukurların boşaltılması ve temizlenmesi, seyyar (portatif) tuvalet hizmetleri - atık suların (evsel ya da endüstriyel atık sular ile yüzme havuzlarının suları vb.)seyreltme, çökeltme, filtreleme, sedimantasyon vb. gibi fiziksel, kimyasal ve biyolojik işlemler aracılığıyla arıtılması - kanalizasyon ve pis su kanallarının bakımı ve temizlenmesi, kanallarda biriken yağ ve kumun boşaltılması dahil. Kapsam dışı olanlar: - yüzey ve yeraltı sularının kirliliğin oluştuğu yerde arındırılması, bkz. 39.00 - binalardaki drenaj borularının temizlenmesi ve tıkanıklığın giderilmesi, bkz. 43.22 @tr
preferred label: Събиране, отвеждане и пречистване на отпадъчни води @bg
preferred label: Činnosti související s odpadními vodami @cs
preferred label: Opsamling og behandling af spildevand @da
preferred label: Abwasserentsorgung @de
preferred label: Επεξεργασία λυμάτων @el
preferred label: Recogida y tratamiento de aguas residuales @es
preferred label: Kanalisatsioon @et
preferred label: Viemäri- ja jätevesihuolto @fi
preferred label: Collecte et traitement des eaux usées @fr
preferred label: Szennyvíz gyűjtése, kezelése
preferred label: Gestione delle reti fognarie @it
preferred label: Nuotekų valymas @lt
preferred label: Notekūdeņu savākšana un attīrīšana @lv
preferred label: Sistema ta' drenaġġi @mt
preferred label: Afvalwaterafvoer @nl
preferred label: Oppsamling og behandling av avløpsvann @no
preferred label: Odprowadzanie i oczyszczanie ścieków @pl
preferred label: Recolha e tratamento de águas residuais @pt
preferred label: Colectarea şi epurarea apelor uzate @ro
preferred label: Канализационная система @ru
preferred label: Čistenie a odvod odpadových vôd @sk
preferred label: Ravnanje z odplakami @sl
preferred label: Avloppsrening @sv
preferred label: Kanalizasyon @tr
broader: Sewerage

Waste collection, treatment and disposal activities; materials recovery
type: Concept
notation: 38
status: valid
status modified: 2013-10-18
accepted date: 2013-10-18
in scheme: Statistical Classification of Economic Activities in the European Community, Rev. 2 (2008)
scope note: Този раздел включва събиране, обработване и обезвреждане на отпадъци с цел тяхното окончателно отстраняване. Включени са и дейностите по отделяне и сортиране на годни за рециклиране отпадъчни материали, както и дейността по тяхното преработване, с цел извличане/получаване на рециклирани суровини. @bg
scope note: Tento oddíl zahrnuje shromažďování, sběr, úpravu a odstraňování (likvidaci) odpadů. Zahrnuje také svoz komunálních odpadů a provoz zařízení na recyklaci odpadů (tzn. zařízení, která z toků odpadů vytřiďují materiál k dalšímu využití). @cs
scope note: Diese Abteilung umfasst die Sammlung, Behandlung und Beseitigung von Abfallstoffen. Dazu zählt auch die kommunale Beförderung von Abfallstoffen und der Betrieb von Anlagen der stofflichen Rückgewinnung (d. h. von Anlagen, die Wertstoffe aus Abfallströmen heraussortieren). @de
scope note: This division includes the collection, treatment, and disposal of waste materials. This also includes local hauling of waste materials and the operation of materials recovery facilities (i.e. those that sort recoverable materials from a waste stream). @en
scope note: Esta división comprende la recogida, el tratamiento y la eliminación de materiales de desecho. Comprende también llos servicios de recogida de basuras y la explotación de los centros de valorización de materiales (es decir, los que separan los materiales recuperables del conjunto de residuos). @es
scope note: Cette division comprend les activités de collecte, de traitement et d’élimination des déchets. Elle comprend également le transport local des déchets et l’exploitation d’installations de récupération (c’est-à-dire les installations de tri des déchets récupérables dans le flux des déchets). @fr
scope note: Ovaj odjeljak uključuje skupljanje otpada, obradu i odlaganje otpada. On također uključuje lokalni prijevoz otpadnog materijala i obnavljanje materijala s pomoću uređaja (npr. onih uređaja kojim se razvrstavaju materijali koji se mogu obnoviti iz tokova otpada).
scope note: Į šį skyrių įeina atliekų surinkimas, apdorojimas ir šalinimas. Į šį skyrių taip pat įeina vietinis atliekų transportavimas ir medžiagų atgavimo įrenginių, (t.y. atskiriančių perdirbtines medžiagas nuo atliekų srauto) eksploatavimas. @lt
scope note: Этот класс включает удаление и обработку твердых или нетвердых неопасных отходов до удаления: - работу мусорных свалок и закапывание неопасных отходов - удаление неопасных отходов путем сжигания или прочими методами, с выработкой электроэнергии или пара или без, компоста, заменяющих топливо веществ, биогаза и прочих побочных продуктов для дальнейшего использования и т.д. - обработку органических отходов для последующей утилизации Этот класс исключает: - сжигание опасных отходов, см. 38.22 - работу мусорных свалок, где реверсируемые материалы, такие как бумага, пластик, использованные консервные банки и металлические отходы и т.д., делятся на особые категории, см. 38.32 - дезинфекцию, очистку почвы, воды, удаление токсичных веществ, см. 39.00 @ru
scope note: Bu bölüm atık maddelerin toplanması, ıslah ve bertarafını kapsamaktadır. Bu bölüm ayrıca atıkların yerel taşımacılığını ve geri kazanım tesislerinin (atıkların türlerine göre tasnif ederek geri kazanılabilir maddeleri ayrıştıran tesislerin) işletilmesini de kapsamaktadır @tr
preferred label: Събиране и обезвреждане на отпадъци; рециклиране на материали @bg
preferred label: Sběr, příprava k likvidaci a likvidace odpadů; zpracování odpadů k dalšímu využití @cs
preferred label: Indsamling, behandling og bortskaffelse af affald; genbrug @da
preferred label: Sammlung, Behandlung und Beseitigung von Abfällen; Rückgewinnung @de
preferred label: Συλλογή, επεξεργασία και διάθεση αποβλήτων· ανάκτηση υλικών @el
preferred label: Recogida, tratamiento y eliminación de residuos; valorización @es
preferred label: Jäätmekogumine, -töötlus ja -kõrvaldus; materjalide taaskasutusele võtmine @et
preferred label: Jätteen keruu, käsittely ja loppusijoitus; materiaalien kierrätys @fi
preferred label: Collecte, traitement et élimination des déchets; récupération @fr
preferred label: Hulladékgazdálkodás
preferred label: Attività di raccolta, trattamento e smaltimento dei rifiuti; recupero dei materiali @it
preferred label: Atliekų rinkimas, tvarkymas ir šalinimas; medžiagų panaudojimas @lt
preferred label: Atkritumu savākšana, apstrāde un izvietošana; materiālu pārstrāde @lv
preferred label: Attivitajiet ta' ġbir u trattament ta' skart u disponiment minnu; irkupru ta' materjal @mt
preferred label: Inzameling, verwerking en verwijdering van afval; terugwinning @nl
preferred label: Innsamling, behandling, disponering og gjenvinning av avfall @no
preferred label: Działalność związana ze zbieraniem, przetwarzaniem i unieszkodliwianiem odpadów; odzysk surowców @pl
preferred label: Recolha, tratamento e eliminação de resíduos; recuperação de materiais @pt
preferred label: Colectarea, tratarea şi eliminarea deşeurilor; activităţi de recuperare a materialelor reciclabile @ro
preferred label: Сбор, обработка и удаление отходов; утилизация отходов @ru
preferred label: Zber, spracúvanie a likvidácia odpadov; recyklácia materiálov @sk
preferred label: Zbiranje in odvoz odpadkov ter ravnaje z njimi; pridobivanje sekundarnih surovin @sl
preferred label: Avfallshantering; återvinning @sv
preferred label: Atığın toplanması, ıslahı ve bertarafı faaliyetleri; maddelerin geri kazanımı @tr
broader: WATER SUPPLY; SEWERAGE, WASTE MANAGEMENT AND REMEDIATION ACTIVITIES
narrower: Waste collection
narrower: Waste treatment and disposal
narrower: Materials recovery

Waste collection
type: Concept
notation: 38.1
status: valid
status modified: 2013-10-18
accepted date: 2013-10-18
in scheme: Statistical Classification of Economic Activities in the European Community, Rev. 2 (2008)
scope note: Тази група включва събиране и транспортиране на битови и промишлени отпадъци чрез различни схеми на събиране, техника и съдове. Включва се събирането на всякакви отпадъци – както на неопасни, така и на опасни отпадъци, например битови отпадъци, негодни за употреба батерии или акумулатори, кухненски отпадъци като използвани хранителни масла и мазнини, отпадъчни нефтопродукти и отработени масла от кораби или от автомобили, както и строителни отпадъци. @bg
scope note: Tato skupina zahrnuje shromažďování a sběr odpadů z domácnosti a z výkonu zaměstnání v nádobách určených pro komunální odpad: popelnice, pojízdné nádoby, kontejnery atd. Patří sem i nebezpečné odpady. Tato skupina zahrnuje, např. odpad z domácnosti, použité baterie, použité kuchyňské oleje a tuky, starý olej z lodí a automobilů, stavební suť a odpady ze stavebních demolic. @cs
scope note: Diese Gruppe umfasst die Sammlung von Haushalts-, Industrie- und Gewerbeabfällen in Mülltonnen, fahrbaren Behältern, Containern usw. Es handelt sich sowohl um nicht gefährliche als auch um gefährliche Abfälle. Eingeschlossen sind z. B. Haushaltsabfälle, Altbatterien, verbrauchte Speiseöle und –fette, Altöle aus Schiffen und Reparaturwerkstätten sowie Bauschutt und Abbruchmaterial. @de
scope note: This group includes the collection of waste from households and businesses by means of refuse bins, wheeled bins, containers, etc. It includes collection of non-hazardous and hazardous waste e.g. waste from households, used batteries, used cooking oils and fats, waste oil from ships and used oil from garages, as well as construction and demolition waste. @en
scope note: Este grupo comprende la recogida de residuos procedentes de hogares y empresas por medio de cubos de basura, contenedores, etc. Comprende la recogida de residuos peligrosos y no peligrosos, por ejemplo, los procedentes de los hogares, las pilas gastadas, los aceites y grasas para cocinar usados, el aceite usado de barcos y de garajes, así como los desechos de las actividades de construcción y demolición. @es
scope note: Ce groupe comprend l’enlèvement de déchets des ménages et des entreprises au moyen de poubelles, de bacs à roulettes, de conteneurs, etc. Il comprend la collecte des déchets non dangereux et dangereux, comme les déchets ménagers, les piles usagées, les huiles et graisses de cuisson usagées, les huiles usagées de navires ou de garages, ainsi que les déchets de construction et de démolition. @fr
scope note: Ova skupina uključuje skupljanje otpada iz kućanstava i poslovnih subjekata sredstvima kao što su kante za smeće, kante za smeće na kotače, kontejneri itd. Uključuje skupljanje opasnog i neopasnog otpada npr. otpada iz kućanstava, iskorištenih baterija, iskorištenog ulja i masti od kuhanja, iskorištenog ulja s brodova ili iz garaža, kao i građevinskog otpada i otpada od rušenja.
scope note: Į šią grupę įeina namų ūkių ir įmonių atliekų surinkimas, naudojant šiukšliadėžes, ratines šiukšliadėžes, konteinerius ir kt. Ši grupė apima nepavojingų ir pavojingų atliekų, pvz., atliekų iš namų ūkių, panaudotų baterijų, vartoto aliejaus ir riebalų, skystų tepalų atliekų iš laivų, vartoto tepalo iš garažų, taip pat statybos ir nugriovimo atliekų, surinkimą. @lt
scope note: Данный класс включает распределение и обработку твердых и не твердых опасных отходов, таких как, взрывчатые вещества, окисляющиеся, воспламеняемые, токсичные, вызывающие раздражение, вредные, канцерогенные, едкие, вызывающие заражение или прочие вещества и препараты, вредные для здоровья человека и окружающей среды. Этот класс включает: - деятельность станций, перерабатывающих опасные отходы - обработку и уничтожение зараженных животных (мертвых или живых) и других зараженных отходов - сжигание опасных отходов - извлечение вредных отходов из отработанной техники, такой как холодильники - обработку, утилизацию и хранение радиоактивных ядерных отходов, включая: • обработку и удаление радиоактивных отходов, то есть разлагающихся во время транспортировки из больниц • инкапсуляцию, подготовку и прочие виды обработки ядерных отходов для хранения Этот класс исключает: - повторную переработку ядерного топлива, см. 20.13 - сжигание неопасных отходов, см. 38.21 - дезинфекцию, очистку почвы, воды, удаление токсичных веществ, см. 39.00 @ru
scope note: Bu grup, çöplerin hane ve işyerlerinden, çöp tenekeleri, tekerlekli bidon, konteyner v.b. vasıtalarla toplanmasını kapsamaktadır. Hanelerden gelen atıklar, kullanılmış piller, kullanılmış yemeklik sıvı yağlar ve katı yağlar, gemilerden gelen atık yağlar ve yağ değişim servislerinden alınan kullanılmış yağlar ile inşaat ve yıkım atıkları gibi tehlikeli ve tehlikesiz atıkların toplanmasını içermektedir. @tr
preferred label: Събиране на отпадъци @bg
preferred label: Sběr odpadů @cs
preferred label: Indsamling af affald @da
preferred label: Sammlung von Abfällen @de
preferred label: Συλλογή αποβλήτων @el
preferred label: Recogida de residuos @es
preferred label: Jäätmekogumine @et
preferred label: Jätteen keruu @fi
preferred label: Collecte des déchets @fr
preferred label: Hulladékgyűjtés
preferred label: Raccolta dei rifiuti @it
preferred label: Atliekų rinkimas @lt
preferred label: Atkritumu savākšana @lv
preferred label: Ġbir ta' skart @mt
preferred label: Inzameling van afval @nl
preferred label: Innsamling av avfall @no
preferred label: Zbieranie odpadów @pl
preferred label: Recolha de resíduos @pt
preferred label: Colectarea deşeurilor @ro
preferred label: Сбор отходов @ru
preferred label: Zber odpadu @sk
preferred label: Zbiranje in odvoz odpadkov @sl
preferred label: Insamling av avfall @sv
preferred label: Atıkların toplanması @tr
broader: Waste collection, treatment and disposal activities; materials recovery
narrower: Collection of non-hazardous waste
narrower: Collection of hazardous waste

Collection of non-hazardous waste
type: Concept
notation: 38.11
status: valid
status modified: 2013-10-18
accepted date: 2013-10-18
in scheme: Statistical Classification of Economic Activities in the European Community, Rev. 2 (2008)
scope note: - събиране на неопасни твърди отпадъци (например битови отпадъци) по райони или квартали, от домакинства, административни и обществени сгради, от търговски обекти и производствени предприятия, посредством контейнери, кофи и други съдове, както и тяхното транспортиране с коли за смет и други транспортни средства. Отпадъците могат да съдържат и смесени (несортирани) материали, годни за рециклиране или регенериране. - събиране на годни за рециклиране материали - събиране на отпадъци на обществени места чрез кошчета и подобни съдове за отпадъци - събиране и транспортиране на строителни отпадъци - от ново строителство, реконструкция или от разрушаване на сгради и съоръжения- събиране и отстраняване на отпадъци като камъни, отломки, клони, съчки и подобни - събиране на технологични отпадъци от те - събиране на опасни отпадъци - 38.12 - експлоатация на депа (площадки за депониране) на неопасни отпадъци – 38.21 - експлоатация на площадки и съоръжения, където се сортират годни за рециклиране смесени материали като хартия, пластмаси и други – 38.32 @bg
scope note: Z: - sběr pevných odpadů, kromě nebezpečných, na komunální úrovni, např. sběr odpadů z domácností, z průmyslu, ze živností v nádobách určených pro odpad: popelnice, pojízdné nádoby, kontejnery atd.; tyto odpady mohou obsahovat smíšené využitelné materiály - sběr recyklovatelných odpadů - sběr z veřejných odpadkových košů ZT: - sběr stavebního a demoličního odpadu - sběr a přeprava úlomků, např. křoví, štěrků, sutí - sběr odpadů z textilních továren - provoz stanic pro překládku odpadů, kromě nebezpečných N: - sběr nebezpečných odpadů (38.12) - provoz skládek odpadů, kromě nebezpečných (38.21) - provoz zařízení, v nichž dochází k vytřiďování smíšených využitelných látek, např. papíru, plastů apod. z toků odpadů, do určitých rozdílných kategorií (38.32) @cs
scope note: Diese Klasse umfasst: - Sammlung von nicht gefährlichen festen Abfällen (Müll) auf kommunaler Ebene; z. B. Sammlung von Haushalts-, Industrie- und Gewerbeabfällen in Mülltonnen, fahrbaren Behältern, Containern usw. Diese Abfälle können gemischte verwertbare Stoffe enthalten. - Sammlung von recyclingfähigen Stoffen - Leeren von Abfallkörben an öffentlichen Plätzen Diese Klasse umfasst ferner: - Sammlung von Bauschutt und Abbruchmaterial - Sammlung und Beseitigung von Abbruchstoffen, Schutt und Gebüsch - Sammlung von Abfällen aus Textilfabriken - Betrieb von Umladestationen für nicht gefährliche Abfälle Diese Klasse umfasst nicht: - Sammlung gefährlicher Abfälle (s. 38.12) - Betrieb von Deponien für nicht gefährliche Abfälle (s. 38.21) - Betrieb von Anlagen, in denen gemischte verwertbare Stoffe wie Papier, Kunststoffe u. Ä. nach Kategorien sortiert werden (s. 38.32) @de
scope note: This class includes: - collection of non-hazardous solid waste (i.e. garbage) within a local area, such as collection of waste from households and businesses by means of refuse bins, wheeled bins, containers etc may include mixed recoverable materials - collection of recyclable materials - collection of refuse in litter-bins in public places This class also includes: - collection of construction and demolition waste - collection and removal of debris such as brush and rubble - collection of waste output of textile mills - operation of waste transfer facilities for non-hazardous waste This class excludes: - collection of hazardous waste, see 38.12 - operation of landfills for the disposal of non-hazardous waste, see 38.21 - operation of facilities where commingled recoverable materials such as paper, plastics, etc. are sorted into distinct categories, see 38.32 @en
scope note: Esta clase comprende: - la recogida de residuos sólidos no peligrosos (es decir, basuras) en un área local, como por ejemplo la recogida de residuos procedentes de hogares y empresas por medio de cubos de basura, contenedores, etc. Puede incluir materiales recuperables mezclados. - la recogida de materiales reciclables - la recogida de la basura de los contenedores y papeleras colocados en lugares públicos Esta clase comprende también: - la recogida de residuos de construcción y demolición - la recogida y retirada de residuos como hojarasca y escombros - la recogida de los residuos de productos en las fábricas textiles - la explotación de los centros de transferencia de residuos no peligrosos Esta clase no comprende: - la recogida de desechos peligrosos (véase 38.12) - la explotación de vertederos para la eliminación de desechos no peligrosos (véase 38.21) - la explotación de instalaciones donde se clasifican por categorías los materiales recuperables mezclados, como papel, plásticos, envases de bebidas y metales (véase 38.32) @es
scope note: Cette classe comprend: - la collecte des déchets solides non dangereux (par exemple: les ordures) au niveau local, comme l’enlèvement de déchets des ménages et des entreprises au moyen de poubelles, de bacs à roulettes, de conteneurs, etc., et peut comprendre les matériaux mixtes récupérables - la collecte de matériaux recyclables - l’enlèvement des détritus collectés dans les boîtes à ordures dans les lieux publics Cette classe comprend également: - l’enlèvement de déchets de construction et de démolition - la collecte et l’enlèvement de décombres - l’enlèvement des déchets de production des usines de textiles - l’exploitation d’installations de transfert de déchets non dangereux Cette classe ne comprend pas: - la collecte de déchets dangereux, voir 38.12 - l’exploitation de décharges pour l’élimination de déchets non dangereux, voir 38.21 - l’exploitation d’installations de tri de matériaux de récupération non triés, tels que papier, plastique, etc., voir 38.32 @fr
scope note: Ovaj razred uključuje: - skupljanje neopasnoga čvrstog otpada (npr. smeća) unutar lokalnog područja, kao što je skupljanje otpada iz kućanstava i poslovnih subjekata sredstvima kao što su kante za smeće, kante za smeće na kotače, kontejneri itd. Može uključivati različite vrste smeća koja se mogu obnavljati - skupljanje predmeta za reciklažu - skupljanje otpada iz kanti za smeće na javnim mjestima Ovaj razred također uključuje: - skupljanje građevinskog otpada i otpada od rušenja - skupljanje i uklanjanje naplavina, kao što su granje i šljunak - skupljanje otpada kao outputa tekstilne tvornice - rad objekata za odvoz otpada koji se bave neopasnim otpadom Ovaj razred isključuje: - skupljanje opasnog otpada, vidi 38.12 - rad odlagališta za raspolaganje neopasnim otpadom, vidi 38.21 - rad reciklažnih dvorišta u koja se dovozi materijal za obnavljanje kao što su papir, plastika, itd. te se razvrstava u prepoznatljive kategorije, vidi 38.32
scope note: Į šią klasę įeina: - nepavojingų kietųjų atliekų (t.y. šiukšlių) surinkimas tam tikroje vietoje, toks kaip namų ūkių ir įmonių atliekų surinkimas, naudojant šiukšliadėžes, ratines šiukšliadėžes, konteinerius ir kt. Gali apimti atgavimui tinkamų medžiagų mišinius - grąžintinam perdirbimui tinkamų medžiagų surinkimas - atliekų surinkimas į šiukšliadėžes viešose vietose Į šią klasę taip pat įeina: - statybinių ir nugriovimo atliekų surinkimas - nuolaužų, tokių kaip išvartų ir sugriautų pastatų plytų nuolaužų surinkimas ir šalinimas - tekstilės fabrikų atliekų surinkimas - nepavojingų atliekų šalinimo įrenginių eksploatavimas Į šią klasę neįeina: - pavojingų atliekų surinkimas, žr. 38.12 - sąvartynų nepavojingoms atliekoms šalinti eksploatavimas, žr. 38.21 - įrenginių, kuriuose įvairių atgavimui tinkamų medžiagų, tokių kaip popierius, plastikai ir kt., mišinys yra rūšiuojamas į tam tikras kategorijas, eksploatavimas, žr. 38.32 @lt
scope note: Bu sınıf aşağıdakileri kapsamaktadır: - tehlikesiz katı atıkların (çöplerin) hane ve işyerlerinden çöp tenekesi, tekerlekli bidon, konteyner v.b yöntemlerle toplanması (geri kazanılabilir maddeler karışık halde bulunabilir). - geri dönüştürülebilir maddelerin toplanması - halka açık yerlerde bulunan çöp kutularındaki çöplerin toplanması Ayrıca bu sınıf aşağıdakileri de kapsamaktadır: - inşaat ve yıkım atıklarının toplanması - çalı, çırpı ve moloz gibi enkazların toplanması ve kaldırılması - tekstil fabrikalarından çıkan atıkların toplanması - tehlikesiz atık transfer istasyonlarının işletilmesi Kapsam dışı olanlar: - tehlikeli atıkların toplanması, bkz. 38.12 - tehlikesiz atıkların bertarafı için depolama alanlarının işletilmesi, bkz. 38.21 - kağıt, plastik v.s. gibi karışık geri kazanılabilir maddelerin ayrıştırıldığı tesislerin işletilmesi, bkz. 38.32 , bkz. 38.32 @tr
preferred label: Събиране на неопасни отпадъци @bg
preferred label: Sběr odpadů, kromě nebezpečných @cs
preferred label: Indsamling af ikke-farligt affald @da
preferred label: Sammlung nicht gefährlicher Abfälle @de
preferred label: Συλλογή μη επικίνδυνων αποβλήτων @el
preferred label: Recogida de residuos no peligrosos @es
preferred label: Tavajäätmete kogumine @et
preferred label: Tavanomaisen jätteen keruu @fi
preferred label: Collecte des déchets non dangereux @fr
preferred label: Nem veszélyes hulladék gyűjtése
preferred label: Raccolta di rifiuti non pericolosi @it
preferred label: Nepavojingųjų atliekų rinkimas @lt
preferred label: Atkritumu savākšana (izņemot bīstamos atkritumus) @lv
preferred label: Ġbir ta' skart mhux perikoluż @mt
preferred label: Inzameling van ongevaarlijk afval @nl
preferred label: Innsamling av ikke-farlig avfall @no
preferred label: Zbieranie odpadów innych niż niebezpieczne @pl
preferred label: Recolha de resíduos não perigosos @pt
preferred label: Colectarea deşeurilor nepericuloase @ro
preferred label: Сбор неопасных отходов @ru
preferred label: Zber iného ako nebezpečného odpadu @sk
preferred label: Zbiranje in odvoz nenevarnih odpadkov @sl
preferred label: Insamling av icke-farligt avfall @sv
preferred label: Tehlikesiz atıkların toplanması @tr
broader: Waste collection

Collection of hazardous waste
type: Concept
notation: 38.12
status: valid
status modified: 2013-10-18
accepted date: 2013-10-18
in scheme: Statistical Classification of Economic Activities in the European Community, Rev. 2 (2008)
scope note: Дейности, свързани със събиране и транспортиране на твърди, течни, гелообразни и други форми на опасни отпадъци, т.е. отпадъци, които съдържат вещества, опасни за човешкото здраве и околната среда, например вещества експлозивни, оксидиращи, леснозапалими, силно токсични, канцерогенни, корозивни, инфекциозни, радиоактивни и други. Включват се и дейностите, съпътстващи транспортирането на опасните отпадъци като маркиране, обработване, опаковане и етикетиране. - събиране на опасни отпадъци като: • отработени масла от машини, кораби или автомобили • биологически опасни отпадъци • радиоактивни отпадъци • негодни за употреба батерии и акумулатори - експлоатация на площадки и съоръжения за временно съхранение, обработване и претоварване на опасни отпадъци - отстраняване на замърсявания при мястото на образуването им - например в сгради, площадки за добив, почви или подземни води, отстраняване на азбест – 39.00 @bg
scope note: Tato třída zahrnuje sběr pevných i nepevných nebezpečných odpadů, tj. s nebezpečím výbuchu, mimořádně hořlavých, vznětlivých, jedovatých, dráždivých, žíravých, infekčních, karcinogenních a jinak škodlivých pro člověka a životní prostředí. Tato činnost může zahrnovat identifikaci, úpravu, balení a označování odpadů za účelem přepravy. Z: - sběr nebezpečných odpadů: • starých olejů z lodí a garáží • biologického odpadu • radioaktivního odpadu • použitých baterií atd. - provoz stanic pro překládku nebezpečného odpadu N: - sanace a čištění kontaminovaných budov, těžebních lokalit, půdy a podzemních vod, např. odstraňování azbestu (viz 39.00) @cs
scope note: Diese Klasse umfasst die Sammlung von (festen und nichtfesten) gefährlichen Abfällen mit explosionsgefährlicher, brandfördernder, entzündlicher, giftiger, reizender, krebserzeugender, ätzender, ansteckender oder anderweitig schädlicher Wirkung auf Mensch und Umwelt. Dies kann die Ermittlung, Behandlung, Verpackung und Kennzeichnung von Abfällen zum Zwecke des Transports beinhalten. Diese Klasse umfasst: - Sammlung gefährlicher Abfälle, z. B. • Altöl aus Schiffen und Reparaturwerkstätten • biogefährliche Abfälle • radioaktive Abfälle • Altbatterien usw. - Betrieb von Umladestationen für Sondermüll Diese Klasse umfasst nicht: - Sanierung und Säuberung von kontaminierten Gebäuden, Bergwerksstandorten, Böden und Grundwasser (z. B. Asbestbeseitigung) (s. 39.00) @de
scope note: This class includes the collection of solid and non-solid hazardous waste, i.e. explosive, oxidizing, flammable, toxic, irritant, carcinogenic, corrosive, infectious and other substances and preparations harmful for human health and environment. It may also entail identification, treatment, packaging and labeling of waste for the purposes of transport. This class includes: - collection of hazardous waste, such as: • used oil from shipment or garages • bio-hazardous waste • nuclear waste • used batteries etc. - operation of waste transfer stations for hazardous waste This class excludes: - remediation and clean up of contaminated buildings, mine sites, soil, ground water, e.g. asbestos removal, see 39.00 @en
scope note: Esta clase comprende la recogida de residuos peligrosos sólidos o no, es decir, que contienen substancias o preparados explosivos, oxidantes, inflamables, tóxicos, irritantes, cancerígenos, corrosivos, infecciosos o de otro tipo que sean perjudiciales para la salud humana y el medio ambiente. Puede conllevar también la identificación, el tratamiento, el embalaje y el etiquetado de los residuos para su transporte. Esta clase comprende: - la recogida de residuos peligrosos, como: • el aceite usado de barcos o garajes • los residuos biológicos peligrosos • los residuos nucleares • las pilas gastadas, etc. - la explotación de centros de transferencia de residuos peligrosos Esta clase no comprende: - la descontaminación y limpieza de edificios, minas, suelos o aguas subterráneas contaminados, por ejemplo, la eliminación de amianto (véase 39.00) @es
scope note: Cette classe comprend l’enlèvement de déchets dangereux, solides ou autres, c’est-à-dire les déchets contenant des substances dangereuses pour la santé humaine et pour l’environnement, telles que des substances explosives, oxydantes, inflammables, toxiques, irritantes, nocives, cancérogènes, corrosives, infectieuses ou autres. Elle comprend également les activités d’identification, de traitement, d’emballage et d’étiquetage des déchets pour le transport. Cette classe comprend: - la collecte de déchets dangereux, tels que: • huiles usagées de navires ou de garages • déchets biologiques dangereux • déchets nucléaires • piles usagées, etc. - l’exploitation d’installations de transfert de déchets dangereux Cette classe ne comprend pas: - l’assainissement et le nettoyage de bâtiments, des sites miniers, des sols ou des eaux souterraines contaminés, par exemple, le désamiantage, voir 39.00 @fr
scope note: Ovaj razred uključuje skupljanje čvrstog i ostaloga opasnog otpada, npr. eksplozivnog, reaktivnog, zapaljivog, otrovnog, iritirajućeg, štetnog, kancerogenog, korozivnog, infektivnog otpada ili ostalih supstancija i pripravaka štetnih za ljudsko zdravlje i okoliš. Podrazumijeva utvrđivanje, obradu, pakiranje i etiketiranje otpada za potrebe prijevoza. Ovaj razred uključuje: - skupljanje opasnog otpada kao što su: • iskorištena ulja s brodova ili iz garaža • bioopasni otpad • nuklearni otpad • iskorištene baterije itd. - rad reciklažnih dvorišta za skupljanje opasnog otpada Ovaj razred isključuje: - saniranje i čišćenje kontaminiranih zgrada, miniranih područja, podzemnih voda, npr. uklanjanje azbesta, vidi 39.00
scope note: Į šią klasę įeina kietųjų ir nekietųjų pavojingų atliekų, t.y. sprogiųjų, oksiduojančiųjų, degiųjų, toksiškųjų, dirginančiųjų, kancerogeninių, korozinių, užkrečiamųjų arba kitokių medžiagų ir preparatų, kurie yra žalingi žmogaus sveikatai ir aplinkai, surinkimas. Be to, transportavimo tikslais gali būti atliekami atliekų identifikavimas, apdorojimas, pakavimas ir ženklinimas. Į šią klasę įeina: - pavojingų atliekų, tokių kaip: • vartotų tepalų iš laivų arba garažų • biologiškai pavojingų atliekų • branduolinių atliekų • panaudotų baterijų ir kt., surinkimas - pavojingų atliekų perkrovimo stočių eksploatavimas Į šią klasę neįeina: - užterštų pastatų, kasybos vietų, dirvožemio, gruntinio vandens regeneravimas ir valymas, pvz., asbesto pašalinimas, žr. 39.00 @lt
scope note: Этот класс включает демонтаж после любых типов аварий (автомобили, корабли, компьютеры, телевизоры и прочее оборудование) для утилизации отходов производства. Этот класс исключает: - извлечение вредных отходов из отработанной техники, такой как холодильники, см. 38.22 - демонтаж автомобилей, кораблей, компьютеров, телевизоров и прочего оборудования для извлечения годных к повторному употреблению частей, см. секцию G @ru
scope note: Bu sınıf, patlayıcı, oksitleyici, yanıcı, zehirli, tahriş edici, zararlı, kanserojen, aşındırıcı, bulaşıcı veya çevre ve insan sağlığı için zararlı diğer maddeler ve preparatlar gibi katı olan-olmayan tehlikeli atıkların toplanmasını kapsamaktadır. Ayrıca, atıkların taşınması için tanımlanması, ıslah edilmesi, paketlenmesi ve etiketlenmesi faaliyetleri de dahildir.Bu sınıf aşağıdakileri kapsamaktadır: - tehlikeli atıkların toplanması, örneğin: • nakliye gemileri veya yağ değişim servislerinden kaynaklanan kullanılmış yağlar • biyo-tehlikeli atıklar • nükleer atıklar • kullanılmış piller v.b. - tehlikeli atık transfer istasyonlarının işletilmesi Kapsam dışı olanlar: - kirletilmiş binaların, maden sahalarının, toprak ve yeraltı sularının iyileştirilmesi ve temizlenmesi, örn. Asbest temizliği, bkz. 39.00. @tr
preferred label: Събиране на опасни отпадъци @bg
preferred label: Sběr nebezpečných odpadů @cs
preferred label: Indsamling af farligt affald @da
preferred label: Sammlung gefährlicher Abfälle @de
preferred label: Συλλογή επικίνδυνων αποβλήτων @el
preferred label: Recogida de residuos peligrosos @es
preferred label: Ohtlike jäätmete kogumine @et
preferred label: Ongelmajätteen keruu @fi
preferred label: Collecte des déchets dangereux @fr
preferred label: Veszélyes hulladék gyűjtése
preferred label: Raccolta di rifiuti pericolosi @it
preferred label: Pavojingųjų atliekų rinkimas @lt
preferred label: Bīstamo atkritumu savākšana @lv
preferred label: Ġbir ta' skart perikoluż @mt
preferred label: Inzameling van gevaarlijk afval @nl
preferred label: Innsamling av farlig avfall @no
preferred label: Zbieranie odpadów niebezpiecznych @pl
preferred label: Recolha de resíduos perigosos @pt
preferred label: Colectarea deşeurilor periculoase @ro
preferred label: Сбор опасных отходов @ru
preferred label: Zber nebezpečného odpadu @sk
preferred label: Zbiranje in odvoz nevarnih odpadkov @sl
preferred label: Insamling av farligt avfall @sv
preferred label: Tehlikeli atıkların toplanması @tr
broader: Waste collection

Waste treatment and disposal
type: Concept
notation: 38.2
status: valid
status modified: 2013-10-18
accepted date: 2013-10-18
in scheme: Statistical Classification of Economic Activities in the European Community, Rev. 2 (2008)
scope note: Тази група включва обработване и обезвреждане на всякакви отпадъци независимо от способите и операциите, които се прилагат - например обработване на органични отпадъци с цел отстраняването им; обработване и обезвреждане на токсични животни и други замърсени отпадъци; обработване и обезвреждане на слаборадиоактивни отпадъци от болници; депониране на отпадъци - наземно или във вода; заравяне или погребване на отпадъци в земята; премахване на излезли от употреба вещи, например хладилници, с цел обезвреждане на съдържащите се в тях опасни материали; обезвреждане на отпадъци чрез изгаряне, вкл. оползотворяване на получената енергия от процеса на изгаряне на отпадъците. - обработване на отпадъчни води - 37.00 - рециклиране на материали от отпадъци - 38.3 @bg
scope note: Tato skupina zahrnuje potřebnou úpravu různých odpadů k jejich odstranění, např. organických odpadů, živých nebo mrtvých zvířat kontaminovaných toxickými látkami a jiných kontaminovaných odpadů, slabě radioaktivních odpadů z nemocnic, rozličnými procesy a jejich odstraňování (likvidaci); přepravu a vyklápění odpadů na skládku nebo do vody; uložení odpadů do hloubky pod zemí; ekologicky šetrnou likvidaci starých výrobků, např. chladniček; spalování odpadů. Zahrnuje také získávání energie spalováním odpadů. N: - úpravu a odstraňování odpadních vod (37.00) - recyklaci využitelných látek (38.3) @cs
scope note: Diese Gruppe umfasst die Beseitigung von verschiedenen Abfällen mittels unterschiedlicher Verfahren und die dafür erforderliche Vorbehandlung, z. B.: Behandlung organischer Abfälle zum Zwecke der Entsorgung; Behandlung und Entsorgung von kontaminierten lebenden oder toten Tieren und von kontaminierten Abfällen sowie von schwach radioaktiven Abfällen aus Krankenhäusern usw.; Verbringung von Abfällen zu Land und Versenkung oder Einleitung in Gewässer; Vergraben oder Unterpflügen von Abfällen; umweltverträgliche Entsorgung von Altwaren wie Kühlschränken; Abfallverbrennung. Inbegriffen ist auch die Energiegewinnung durch Abfallverbrennung. Diese Gruppe umfasst nicht: - Behandlung und Entsorgung von Abwässern (s. 37.00) - Rückgewinnung von Wertstoffen (s. 38.3) @de
scope note: This group includes the disposal and treatment prior to disposal of various forms of waste by different means, such as treatment of organic waste with the aim of disposal; treatment and disposal of toxic live or dead animals and other contaminated waste; treatment and disposal of transition radioactive waste from hospitals, etc.; dumping of refuse on land or in water; burial or ploughing-under of refuse; disposal of used goods such as refrigerators to eliminate harmful waste; disposal of waste by incineration or combustion. Included is also energy recovery resulting from waste incineration process. This group excludes: - treatment and disposal of wastewater, see 37.00 - materials recovery, see 38.3 @en
scope note: Se incluye en este grupo la eliminación y el tratamiento previo a ésta de diversos tipos de residuos por distintos medios, como el tratamiento de residuos orgánicos con el fin de eliminarlos; el tratamiento y la eliminación de animales tóxicos vivos o muertos y otros residuos contaminados; el tratamiento y la eliminación de residuos radiactivos de transición procedentes de hospitales, etc.; el vertido de desperdicios en tierra o en el mar; su enterramiento; la eliminación de bienes usados, como frigoríficos, con el fin de eliminar los residuos nocivos; la eliminación de residuos por incineración o combustión. Comprende también la recuperación de la energía producida en el proceso de incineración de residuos. Este grupo no comprende: - el tratamiento y la eliminación de aguas residuales (véase 37.00) - las actividades de valorización (véase 38.3) @es
scope note: Ce groupe comprend l’élimination et le traitement avant élimination de différentes formes de déchets par différentes méthodes, telles que le traitement des déchets organiques dans le but de les éliminer, le traitement et l’élimination d’animaux toxiques vivants ou morts et d’autres déchets contaminés, le traitement et l’élimination des déchets radioactifs transitoires des hôpitaux, etc., le déchargement, l’immersion et l’enfouissement des déchets, l’élimination de biens usés tels que les réfrigérateurs pour éliminer des déchets dangereux; l’élimination des déchets par incinération ou par combustion. La récupération d’énergie produite lors du processus d’incinération des déchets est également comprise. Ce groupe ne comprend pas: - le traitement et l’élimination des eaux usées, voir 37.00 - la récupération des matériaux, voir 38.3 @fr
scope note: Ova skupina uključuje odlaganje i obradu otpada različitih oblika otpada prije odlaganja otpada različitim sredstvima, kao što je obrada organskog otpada radi odlaganja; obrada i odlaganje toksičnih živih ili mrtvih životinja i ostaloga kontaminiranog otpada; obrada i odlaganje prijelaznog radioaktivnog otpada iz bolnica, itd.; izbacivanje smeća na zemlji ili u vodi; ukopavanje ili zaoravanje smeća; odlaganje dotrajalih proizvoda kao što su hladnjaci kako bi se eliminirao utjecaj štetnog otpada; odlaganje otpada spaljivanjem ili izgaranjem. Također je uključeno obnavljanje energije koja nastaje u postupku spaljivanja otpada. Ova skupina isključuje: - obradu i uklanjanje otpadnih voda, vidi razred 37.00 - obnavljanje materijala, vidi 38.3
scope note: Į šią grupę įeina įvairių atliekų išankstinis apdorojimas prieš šalinimą ir šalinimas naudojant įvairias priemones, tokias kaip organinių atliekų apdorojimas šalinimo tikslais; užkrėstų gyvų ar kritusių gyvūnų ir kitokių užterštų atliekų apdorojimas ir šalinimas; ligoninių ir kitų pereinamųjų radioaktyviųjų atliekų apdorojimas ir šalinimas ir t.t.; atliekų išvertimas ant žemės ar į vandenį; atliekų užkasimas ar aparimas; naudotų daiktų, tokių kaip šaldytuvai, šalinimas, siekiant sunaikinti kenksmingas atliekas; atliekų šalinimas deginant. Į šią grupę taip pat įeina energijos atgavimas, deginant atliekas. Į šią grupę neįeina: - nuotekų apdorojimas ir šalinimas žr. klasę 37.00 - medžiagų atgavimas, žr. 38.3 @lt
scope note: Данный класс включает переработку металлических и неметаллических отходов и прочих предметов во вторичное сырье, как правило, посредством механической или химической трансформационной переработки. Также сюда входит восстановление материалов из отходов в виде 1) отделения и сортирования вторичного сырья от невредных отходов (например, мусора) или 2) отделения и сортирования смешанного вторичного сырья, такого как бумага, пластмасса, использованные консервные банки и металлические изделия, по определенным категориям. Примерами механической или химической трансформационной переработки являются следующие процессы: - механическое дробление металлоотходов от бывших в употреблении автомобилей, стиральных машин, велосипедов и т.д. - механическое сжатие крупных металлических предметов, таких как железнодорожные вагоны - измельчение металоотходов, списанных транспортных средств и т.д. - прочие методы механической переработки, такие как резка, прессовка с целью сокращения размера - повторное использование металла из фотографических отходов, например, фиксирующего раствора или фотографической пленки и бумаги - повторное использование резины, напр., бывших в употреблении шин с целью производства вторичного сырья - сортировку и прессовку пластикого материала с целью производства вторичного сырья для труб, цветочных горшков, поддонов и пр. - переработку (чистку, плавление, измельчение) пластмассы или резиновых отходов на гранулы - дробление, очистку и сортировку стекла - дробление, очистку и сортировку прочих отходов, таких как строительный мусор, с целью производства вторичного сырья - переработку использованного масла для жарки и жиров во вторичное сырье - переработку прочих отходов продуктов питания, напитков и табачных изделий, а также остаточных веществ во вторичное сырье Этот класс исключает: - производство новых видов конечного продукта из вторичного сырья (независимо от типа производства), такого как нить для пряжи из отдельных волокон, изготовление бумажной массы из макул… @ru
scope note: Bu grup, çeşitli yöntemlerle farklı hallerdeki atıkların bertarafını ve bertarafından önce gerçekleştirilen ıslah işlemlerini içermektedir. Örneğin; organik atıkların bertaraf amaçlı ıslahı, enfekte olmuş canlı veya ölü hayvanlar ile diğer kontamine olmuş atıkların bertarafı ve ıslahı, hastanelerden v.s. kaynaklanan geçiş radyoaktif atıkların ıslahı ve bertarafı, atığın araziye veya suya boşaltımı, atığın gömülmesi, zararlı atıkları bertaraf etmek amacı ile kullanılmış ürünlerin (örneğin buzdolabı) bertarafı, atığın özel yakma yöntemleri ile bertarafı. Atık yakma proseslerinden kaynaklanan enerji geri kazanımı da bu bölüme dahildir. Kapsam dışı olanlar: - atık suların arıtılması ve bertarafı, bkz.37.00, - maddelerin geri kazanımı, bkz. 38.3 @tr
preferred label: Обработване и обезвреждане на отпадъци @bg
preferred label: Příprava k likvidaci a likvidace odpadů @cs
preferred label: Behandling og bortskaffelse af affald @da
preferred label: Abfallbehandlung und beseitigung @de
preferred label: Επεξεργασία και διάθεση αποβλήτων @el
preferred label: Tratamiento y eliminación de residuos @es
preferred label: Jäätmetöötlus ja -kõrvaldus @et
preferred label: Jätteen käsittely ja loppusijoitus @fi
preferred label: Traitement et élimination des déchets @fr
preferred label: Hulladékkezelés, -ártalmatlanítás
preferred label: Trattamento e smaltimento dei rifiuti @it
preferred label: Atliekų tvarkymas ir šalinimas @lt
preferred label: Atkritumu apstrāde un izvietošana @lv
preferred label: Trattament ta' skart u disponiment minnu @mt
preferred label: Verwerking en verwijdering van afval @nl
preferred label: Behandling og disponering av avfall @no
preferred label: Przetwarzanie i unieszkodliwianie odpadów @pl
preferred label: Tratamento e eliminação de resíduos @pt
preferred label: Tratarea şi eliminarea deşeurilor @ro
preferred label: Обработка и удаление отходов @ru
preferred label: Spracúvanie a likvidácia odpadu @sk
preferred label: Ravnanje z odpadki @sl
preferred label: Behandling och bortskaffande av avfall @sv
preferred label: Atıkların ıslahı ve bertarafı @tr
broader: Waste collection, treatment and disposal activities; materials recovery
narrower: Treatment and disposal of non-hazardous waste
narrower: Treatment and disposal of hazardous waste

Treatment and disposal of non-hazardous waste
type: Concept
notation: 38.21
status: valid
status modified: 2013-10-18
accepted date: 2013-10-18
in scheme: Statistical Classification of Economic Activities in the European Community, Rev. 2 (2008)
scope note: Дейности по обработване и обезвреждане на твърди и други форми на неопасни отпадъци, с цел тяхното отстраняване. - експлоатация на депа или площадки за депониране, предназначени за обезвреждане на неопасни отпадъци - обезвреждане на неопасни отпадъци чрез изгаряне или по друг начин, съпътствано или не от добиване на електрическа или топлинна енергия, компост, заместители на горива, биогаз, пепел или други странични продукти, годни за последващо използване - обработване на органични отпадъци с цел отстраняването им - изгаряне на опасни отпадъци – 38.22 - експлоатация на площадки и съоръжения, където се сортират годни за рециклиране смесени материали като хартия, пластмаси, метали и други – 38.32 - отстраняване на замърсявания при мястото на образуването им, например в сгради, площадки, почви и води; обезвреждане на токсични материали – 39.00 @bg
scope note: Z: - přípravu pevných i nepevných odpadů, kromě nebezpečných a jejich odstraňování činnostmi: • provozem skládek odpadů, kromě nebezpečných • spalováním nebo jinými procesy, které mohou být spojené i s výrobou elektřiny, páry, náhradních paliv, bioplynu, popela nebo jiných vedlejších produktů pro další využití atd. • přípravou organických odpadů za účelem jejich odstraňování • kompostováním organických odpadů N: - spalování nebezpečných odpadů (38.22) - provoz zařízení, v nichž dochází k vytřiďování smíšených využitelných látek, např. papíru, plastů, prázdných plechovek od nápojů a kovů, do určitých rozdílných kategorií (38.32) - dekontaminaci a čištění půdy nebo vody; odmořování popř. redukce toxických látek (39.00) @cs
scope note: Diese Klasse umfasst die Vorbehandlung und Beseitigung (fester und nichtfester) nicht gefährlicher Abfälle durch: - Betrieb von Deponien - Verbrennen oder andere Verfahren, mit oder ohne damit verbundene Erzeugung von Elektrizität, Dampf, Kompost, Ersatzbrennstoffen, Biogas, Asche oder anderen Nebenprodukten zur Weiterverwendung usw. - Vorbehandlung organischer Abfälle zum Zwecke der Beseitigung Diese Klasse umfasst nicht: - Verbrennung von Sondermüll (s. 38.22) - Betrieb von Anlagen, in denen vermischte Wertstoffe wie z. B. Papier, Kunststoffe, leere Getränkedosen und Metalle sortiert werden (s. 38.32) - Dekontaminierung und Säuberung von Böden oder Wasser; Entseuchung bzw. Vorbehandlung toxischer Stoffe (s. 39.00) @de
scope note: This class includes the disposal and treatment prior to disposal of solid or non-solid non-hazardous waste: - operation of landfills for the disposal of non-hazardous waste - disposal of non-hazardous waste by combustion or incineration or other methods, with or without the resulting production of electricity or steam, compost, substitute fuels, biogas, ashes or other by-products for further use etc. - treatment of organic waste for disposal This class excludes: - incineration and combustion of hazardous waste, see 38.22 - operation of facilities where commingled recoverable materials such as paper, plastics, used beverage cans and metals, are sorted into distinct categories, see 38.32 - decontamination, clean up of land, water; toxic material abatement, see 39.00 @en
scope note: Esta clase comprende la eliminación y el tratamiento previo a ésta de los residuos no peligrosos sólidos o no: - la explotación de vertederos para la eliminación de residuos no peligrosos - la eliminación de residuos no peligrosos por combustión, incineración u otros medios, con o sin producción de electricidad o vapor, compost, combustibles de sustitución, biogases, cenizas u otros subproductos para uso ulterior, etc. - el tratamiento de residuos orgánicos para su eliminación Esta clase no comprende: - la incineración y combustión de residuos peligrosos (véase 38.22) - la explotación de instalaciones donde se clasifican por categorías los materiales recuperables mezclados, como papel, plásticos, envases de bebidas y metales (véase 38.32) - la descontaminación y limpieza de tierras y aguas; la eliminación de materiales tóxicos (véase 39.00) @es
scope note: Cette classe comprend l’élimination et le traitement avant élimination de déchets non dangereux, solides ou autres: - l’exploitation de décharges pour l’élimination de déchets non dangereux - l’élimination de déchets non dangereux par combustion ou incinération ou d’autres méthodes, avec ou sans production d’électricité ou de vapeur, de carburants de substitution, de biométhane, de cendres et d’autres sous-produits destinés à un usage ultérieur, etc. - le traitement des déchets organiques dans le but de les éliminer Cette classe ne comprend pas: - l’incinération et la combustion de déchets dangereux, voir 38.22 - l’exploitation d’installations de tri de matériaux de récupération non triés, tels que papier, plastique, boîtes à boisson et métaux usagés, voir 38.32 - la décontamination, le nettoyage des terres, de l’eau, la réduction des matières toxiques, voir 39.00 @fr
scope note: Ovaj razred uključuje odlaganje i obradu otpada prije odlaganja čvrstog i drugoga neopasnog otpada: - rad odlagališta neopasnog otpada - odlaganje neopasnog otpada spaljivanjem, izgaranjem ili nekom drugom metodom, kojoj je rezultat proizvodnja električne energije ili pare, zamjensko gorivo, bioplin, pepeo ili neki drugi oblik nusproizvoda za daljnju uporabu itd. - obradu organskog otpada Ovaj razred isključuje: - spaljivanje i izgaranje opasnog otpada, vidi 38.22 - rad reciklažnih dvorišta u koja se dovoze materijali za obnavljanje kao što su papir, plastika, upotrijebljene konzerve od pića i metali te se razvrstavaju prema prepoznatljivim kategorijama, vidi 38.32 - dekontaminiranje, čišćenje zemlje i vodene površine; smanjenje toksičnih materijala, vidi 39.00
scope note: Į šią klasę įeina kietųjų ir nekietųjų nepavojingų atliekų šalinimas ir apdorojimas: - sąvartynų nepavojingoms atliekoms šalinti eksploatavimas - nepavojingų atliekų šalinimas deginant arba kitais būdais, kai gaminama arba negaminama elektra arba garas, kompostas, pakaitinis kuras, biodujos, pelenai arba kiti šalutiniai produktai paskesniam panaudojimui ir t.t. - organinių atliekų apdorojimas šalinimo tikslais Į šią klasę neįeina: - pavojingų atliekų šalinimas deginant, žr. 38.22 - įrenginių, kuriuose įvairių atgavimui tinkamų medžiagų, tokių kaip popierius, plastikai ir kt., mišinys yra rūšiuojamas į tam tikras kategorijas, eksploatavimas, žr. 38.32 - dirvožemio, vandens sanitarinis švarinimas, valymas, toksinių medžiagų mažinimas, žr. 39.00 @lt
scope note: Данный раздел включает предоставление услуг по восстановлению, т.е. очистке загрязненных помещений и участков, почв, поверхностных и грунтовых вод. @ru
scope note: Bu sınıf, katı halde olan ya da olmayan tehlikesiz atıkların bertarafını ya da bertaraf işlemlerinden önce ıslahını kapsamaktadır: - tehlikesiz atıkların bertarafı için depolama alanlarının işletilmesi - tehlikesiz atıkların, elektrik veya buhar, kompost gübre, ikame yakıt, biyogaz, kül veya ileride kullanılması mümkün diğer yan ürünlerin üretimi ile sonuçlansın ya da sonuçlanmasın özel yakma fırınlarında veya diğer yöntemlerle bertaraf edilmesi - bertaraf amacıyla organik atıkların ıslahı Kapsam dışı olanlar: - tehlikeli atıkların özel atık yakma fırınlarında yakılması, bkz. 38.22 - karışık geri kazanılabilir maddelerin örneğin; kağıt, plastik, kullanılmış içecek kutuları ve metallerin tasnif edildiği yani ayrıştırıldığı tesislerin işletilmesi, bkz. 38.32 - kirliliği önleme, toprak ve suyun temizlenmesi; zehirli maddeleri azaltma, bkz. 39.00 @tr
preferred label: Обработване и обезвреждане на неопасни отпадъци @bg
preferred label: Příprava k likvidaci a likvidace odpadů, kromě nebezpečných @cs
preferred label: Behandling og bortskaffelse af ikke-farligt affald @da
preferred label: Behandlung und Beseitigung nicht gefährlicher Abfälle @de
preferred label: Επεξεργασία και διάθεση μη επικίνδυνων αποβλήτων @el
preferred label: Tratamiento y eliminación de residuos no peligrosos @es
preferred label: Tavajäätmete töötlus ja kõrvaldus @et
preferred label: Tavanomaisen jätteen käsittely ja loppusijoitus @fi
preferred label: Traitement et élimination des déchets non dangereux @fr
preferred label: Nem veszélyes hulladék kezelése, ártalmatlanítása
preferred label: Trattamento e smaltimento di rifiuti non pericolosi @it
preferred label: Nepavojingųjų atliekų tvarkymas ir šalinimas @lt
preferred label: Atkritumu apstrāde un izvietošana (izņemot bīstamos atkritumus) @lv
preferred label: Trattament ta' skart mhux perikoluż u disponiment minnu @mt
preferred label: Verwerking en verwijdering van ongevaarlijk afval @nl
preferred label: Behandling og disponering av ikke-farlig avfall @no
preferred label: Przetwarzanie i unieszkodliwianie odpadów innych niż niebezpieczne @pl
preferred label: Tratamento e eliminação dos resíduos não perigosos @pt
preferred label: Tratarea şi eliminarea deşeurilor nepericuloase @ro
preferred label: Обработка и удаление неопасных отходов @ru
preferred label: Spracúvanie a likvidácia iného ako nebezpečného odpadu @sk
preferred label: Ravnanje z nenevarnimi odpadki @sl
preferred label: Behandling och bortskaffande av icke-farligt avfall @sv
preferred label: Tehlikesiz atıkların ıslahı ve bertaraf edilmesi @tr
broader: Waste treatment and disposal

Treatment and disposal of hazardous waste
type: Concept
notation: 38.22
status: valid
status modified: 2013-10-18
accepted date: 2013-10-18
in scheme: Statistical Classification of Economic Activities in the European Community, Rev. 2 (2008)
scope note: Дейности по обработване и обезвреждане на твърди и други форми на опасни отпадъци, т.е. отпадъци, които съдържат вещества, опасни за човешкото здраве и околната среда - например вещества експлозивни, оксидиращи, леснозапалими, силно токсични, канцерогенни, корозивни, инфекциозни, радиоактивни и други. - експлоатация на съоръжения и инсталации за обработване на опасни отпадъци - обезвреждане на токсични животни, живи или животински трупове и други замърсени отпадъци - изгаряне на опасни отпадъци - премахване на опасни материали и компоненти, съдържащи се в излезли от употреба вещи и оборудване, например хладилници - обработване, обезвреждане и складиране на радиоактивни отпадъци: • обработване и отстраняване на слаборадиоактивни отпадъци, които се разпадат в периода на транспортиране или временно съхранение - отпадъци от болници и подобни с медицински произход • манипулиране, кондициониране, капсуловане и други дейности преди окончателно погребване или складиране на радиоактивни отпадъци - дейности, свързани с неизползвани (необлъчени) горивни елементи за ядрени реактори – 20.13 - изгаряне на неопасни отпадъци – 38.21 - отстраняване на замърсявания при мястото на образуването им - например в сгради, почви и води; обезвреждане на токсични материали – 39.00 @bg
scope note: Tato třída zahrnuje potřebnou přípravu k odstranění pevných i nepevných nebezpečných odpadů s nebezpečím výbuchu, mimořádně hořlavých, vznětlivých, jedovatých, dráždivých, žíravých, infekčních, karcinogenních a jinak škodlivých pro člověka a životní prostředí a jejich odstraňování (likvidaci). Z: - provoz zařízení pro úpravu nebezpečných odpadů - úpravu živých nebo mrtvých zvířat kontaminovaných toxickými látkami a jiných kontaminovaných odpadů a jejich odstraňování - spalování nebezpečných odpadů - úpravu použitých výrobků, např. chladniček k odstranění škodlivých odpadů - úpravu, odstranění a skladování radioaktivních odpadů: • úprava slabě radioaktivních odpadů z nemocnic pro odvoz k odstranění • zapouzdření, příprava a jiná úprava jaderných odpadů za účelem jejich uložení N: - recyklaci jaderných paliv (20.13) - spalování odpadů, kromě nebezpečných (38.21) - dekontaminaci a čištění půdy nebo vody; redukce toxických látek (39.00) @cs
scope note: Diese Klasse umfasst die Vorbehandlung und Beseitigung von (festen und nichtfesten) gefährlichen Abfällen mit explosionsgefährlicher, brandfördernder, entzündlicher, giftiger, reizender, gesundheitsschädlicher, Krebs erzeugender, ätzender, ansteckender oder anderweitig schädlicher Wirkung auf Mensch und Umwelt. Diese Klasse umfasst: - Betrieb von Anlagen zur Behandlung gefährlicher Abfälle - Behandlung und Entsorgung von kontaminierten lebenden oder toten Tieren und von kontaminierten Abfällen - Verbrennung gefährlicher Abfälle - umweltverträgliche Entsorgung von Altwaren wie Kühlschränken - Behandlung, Beseitigung und Lagerung radioaktiver Abfälle, einschließlich: • Behandlung und Entsorgung von schwach radioaktiven Abfällen aus Krankenhäusern • Umhüllung und Vorbehandlung von radioaktiven Abfällen zum Zwecke ihrer Lagerung Diese Klasse umfasst nicht: - Wiederaufbereitung von Kernbrennstoffen (s. 20.13) - Verbrennung nicht gefährlicher Abfälle (s. 38.21) - Dekontaminierung und Säuberung von Böden oder Wasser; Verringerung der Toxizität von Giftstoffen (s. 39.00) @de
scope note: This class includes the disposal and treatment prior to disposal of solid or non-solid hazardous waste, including waste that if explosive, oxidising, flammable, toxic, irritant, carcinogenic, corrosive, infectious and other substances and preparations harmful for human health and environment. This class includes: - operation of facilities for treatment of hazardous waste - treatment and disposal of toxic live or dead animals and other contaminated waste - incineration of hazardous waste - disposal of used goods such as refrigerators to eliminate harmful waste - treatment, disposal and storage of radioactive nuclear waste including: • treatment and disposal of transition radioactive waste, i.e. decaying within the period of transport, from hospitals • encapsulation, preparation and other treatment of nuclear waste for storage This class excludes: - reprocessing of nuclear fuels, see 20.13 - incineration of non-hazardous waste, see 38.21 - decontamination, clean up of land, water; toxic material abatement, see 39.00 @en
scope note: Esta clase comprende la eliminación y el tratamiento previo a ésta de residuos peligrosos sólidos o no, incluidos los que contienen substancias o preparados explosivos, oxidantes, inflamables, tóxicos, irritantes, cancerígenos, corrosivos, infecciosos o de otro tipo que sean perjudiciales para la salud humana y el medio ambiente. Esta clase comprende: - la explotación de instalaciones de tratamiento de residuos peligrosos - el tratamiento y la eliminación de animales tóxicos vivos o muertos u otros residuos contaminados - la incineración de residuos peligrosos - la eliminación de bienes usados, como frigoríficos, con el fin de eliminar los residuos nocivos - el tratamiento, la eliminación y el almacenamiento de residuos nucleares radiactivos, incluidos: • el tratamiento y la eliminación de residuos radiactivos de transición, es decir, que se degradan durante el transporte desde los hospitales • la encapsulación, preparación y otro tipo de tratamiento de los residuos nucleares para su almacenamiento Esta clase no comprende: - el reprocesado de combustibles nucleares (véase 20.13) - la incineración de residuos no peligrosos (véase 38.21) - la descontaminación y limpieza de tierras y aguas; la eliminación de materiales tóxicos (véase 39.00) @es
scope note: Cette classe comprend l’élimination et le traitement avant élimination de déchets dangereux, solides ou autres, c’est-à-dire les déchets contenant des substances dangereuses pour la santé humaine et pour l’environnement, telles que des substances explosives, oxydantes, inflammables, toxiques, irritantes, nocives, cancérogènes, corrosives, infectieuses ou autres. Cette classe comprend: - l’exploitation d’installations de traitement de déchets dangereux - le traitement et l’élimination d’animaux toxiques vivants ou morts et d’autres déchets contaminés - l’incinération de déchets dangereux - l’élimination de biens usés tels que les réfrigérateurs pour éliminer des déchets dangereux - le traitement, l’élimination et le stockage de déchets radioactifs nucléaires, y compris: • traitement et élimination des déchets radioactifs transitoires des hôpitaux, c’est-à-dire qui se dégraderont au cours du transport • conditionnement, préparation et autre traitement des déchets nucléaires avant leur stockage Cette classe ne comprend pas: - le retraitement des combustibles nucléaires, voir 20.13 - l’incinération de déchets non dangereux, voir 38.21 - la décontamination, le nettoyage des terres, de l’eau, la réduction des matières toxiques, voir 39.00 @fr
scope note: Ovaj razred uključuje obradu i odlaganje čvrstog ili ostaloga opasnog otpada prije odlaganja, npr. eksplozivnog, oksidirajućeg, zapaljivog, otrovnog, iritirajućeg, kancerogenog, korozivnog, infektivnog otpada ili ostalih supstancija i pripravaka štetnih za ljudsko zdravlje i okoliš. Ovaj razred uključuje: - rad uređaja za obradu opasnog otpada - obradu i odlaganje toksičnih živih ili mrtvih životinja i drugoga kontaminiranog otpada - spaljivanje opasnog otpada - odlaganje dotrajalih proizvoda kao što su hladnjaci kako bi se eliminirao utjecaj štetnog otpada - obradu, odlaganje i skladištenje radioaktivnoga nuklearnog otpada uključujući: • obradu i odlaganje prijelaznoga radioaktivnog otpada, tj. radioaktivni otpad koji se razgrađuje unutar razdoblja • prijevoz iz bolnica • enkapsulaciju, pripremanje i ostalu obradu nuklearnog otpada za skladištenje Ovaj razred isključuje: - ponovnu obradu nuklearnoga goriva, vidi 20.13 - spaljivanje neopasnog otpada, vidi 38.21 - dekontaminiranje, čišćenje zemlje i vode; smanjenje toksičnog materijala, vidi 39.00
scope note: Į šią klasę įeina kietųjų ir nekietųjų pavojingų atliekų, įskaitant sprogiąsias, oksiduojančiąsias, degiąsias, toksines, dirginančias, kenksmingas, kancerogenines, korozines, užkrečiamąsias ir kitokias medžiagas ir preparatus, kurie yra žalingi žmogaus sveikatai ir aplinkai, šalinimas ir išankstinis apdorojimas prieš šalinimą Į šią klasę įeina: - pavojingų atliekų apdorojimo įrenginių eksploatavimas - užkrėstų gyvų ar kritusių gyvūnų ir kitų užterštų atliekų apdorojimas ir šalinimas - pavojingų atliekų deginimas - naudotų daiktų, tokių kaip šaldytuvai, šalinimas, siekiant panaikinti kenksmingas atliekas - radioaktyviųjų branduolinių atliekų apdorojimas, šalinimas ir saugojimas, įskaitant: • ligoninių tarpinių radioaktyviųjų atliekų, t.y. skylančių transportavimo metu, apdorojimas ir šalinimas • branduolinių atliekų įdėjimas į kapsules, paruošimas ir kitoks apdorojimas saugojimo tikslais Į šią klasę neįeina: - branduolinio kuro regeneravimas, žr. 20.13 - nepavojingų atliekų deginimas, žr. 38.21 - dirvožemio, vandens taršos šalinimas, valymas toksinių medžiagų mažinimas, žr. 39.00 @lt
scope note: Bu sınıf, patlayıcı, oksitleyici, yanıcı, zehirli, tahriş edici, kanserojen, aşındırıcı, bulaşıcı, insan sağlığı ve çevre için zararlı olan diğer madde ve preparat atıklarını içeren katı halde olan veya olmayan tehlikeli atıkların bertaraf öncesi ıslahını ve bertarafını kapsamaktadır. Bu sınıf aşağıdakileri kapsamaktadır: - tehlikeli atıkların ıslahını yapan tesislerin işletilmesi - canlı ya da ölü enfekte olmuş hayvanların ve diğer kontamine olmuş atıkların ıslahı ve bertarafı - tehlikeli atıkların özel yakma fırınlarında yakılması - zararlı atıklarının yok edilmesi amacı ile kullanılmış malların (örneğin buzdolabı) bertarafı - radyoaktif nükleer atıkların ıslahı, bertarafı ve depolanması: • geçişli radyoaktif atıkların arıtımı ve bertarafı, örneğin hastanelerden alınan ve taşınma süresi içinde bozulanlar • depolama amacıyla nükleer atıkların kapsüllenmesi, hazırlanması ve diğer ıslah faaliyetleri Kapsam dışı olanlar: - nükleer yakıtların yeniden işleme tabi tutulması, bkz. 20.13 - tehlikesiz atıkların yakılması, bkz. 38.21. - kirliliği önleme, toprak ve suyun temizlenmesi; zehirli maddeleri azaltma, bkz. 39.00 @tr
preferred label: Обработване и обезвреждане на опасни отпадъци @bg
preferred label: Příprava k likvidaci a likvidace nebezpečných odpadů @cs
preferred label: Behandling og bortskaffelse af farligt affald @da
preferred label: Behandlung und Beseitigung gefährlicher Abfälle @de
preferred label: Επεξεργασία και διάθεση επικίνδυνων αποβλήτων @el
preferred label: Tratamiento y eliminación de residuos peligrosos @es
preferred label: Ohtlike jäätmete töötlus ja kõrvaldus @et
preferred label: Ongelmajätteen käsittely, loppusijoitus ja hävittäminen @fi
preferred label: Traitement et élimination des déchets dangereux @fr
preferred label: Veszélyes hulladék kezelése, ártalmatlanítása
preferred label: Trattamento e smaltimento di rifiuti pericolosi @it
preferred label: Pavojingųjų atliekų tvarkymas ir šalinimas @lt
preferred label: Bīstamo atkritumu apstrāde un izvietošana @lv
preferred label: Trattament ta' skart perikoluż u disponiment minnu @mt
preferred label: Behandeling en verwijdering van gevaarlijk afval @nl
preferred label: Behandling og disponering av farlig avfall @no
preferred label: Przetwarzanie i unieszkodliwianie odpadów niebezpiecznych @pl
preferred label: Tratamento e eliminação dos resíduos perigosos @pt
preferred label: Tratarea şi eliminarea deşeurilor periculoase @ro
preferred label: Обработка и удаление опасных отходов @ru
preferred label: Spracúvanie a likvidácia nebezpečného odpadu @sk
preferred label: Ravnanje z nevarnimi odpadki @sl
preferred label: Behandling och bortskaffande av farligt avfall @sv
preferred label: Tehlikeli atıkların ıslahı ve bertaraf edilmesi @tr
broader: Waste treatment and disposal

Materials recovery
type: Concept
notation: 38.3
status: valid
status modified: 2013-10-18
accepted date: 2013-10-18
in scheme: Statistical Classification of Economic Activities in the European Community, Rev. 2 (2008)
scope note: Этот класс включает: - очистку почв и грунтовых вод на месте загрязнения, как на месте работ, так и за их пределами, с использованием, например, механических, химических или биологических методов - очистку промышленных установок или центров, включая ядерные установки и участки - обеззараживание и очистку поверхностных вод после случайных загрязнений, например, посредством сбора загрязнителей или использования соответствующих химикатов - очистку разливов нефти и прочих загрязнений на земле, поверхностных водах, в океане и море, включая прибрежную зону - смягчение действия асбеста, свинцовых белил и прочих токсичных материалов - другие специализированные мероприятия по охране окружающей среды Этот класс исключает: - борьбу с сельскохозяйственными вредителями, см. 01.61 - очищение воды для водоснабжения, см. 36.00 - обработку и удаление неопасных отходов, см. 38.21 - обработку и удаление опасных отходов, см. 38.22 - подметание и полив улиц, см. 81.29 @ru
preferred label: Рециклиране на материали @bg
preferred label: Zpracování odpadů k dalšímu využití @cs
preferred label: Genbrug @da
preferred label: Rückgewinnung @de
preferred label: Ανάκτηση υλικών @el
preferred label: Valorización @es
preferred label: Materjalide taaskasutusele võtmine @et
preferred label: Materiaalien kierrätys @fi
preferred label: Récupération @fr
preferred label: Hulladékanyag hasznosítása
preferred label: Recupero dei materiali @it
preferred label: Medžiagų atgavimas @lt
preferred label: Otrreizējā pārstrāde @lv
preferred label: Irkupru ta' materjal @mt
preferred label: Terugwinning @nl
preferred label: Materialgjenvinning @no
preferred label: Odzysk surowców @pl
preferred label: Recuperação de materiais @pt
preferred label: Recuperare materialelor @ro
preferred label: Восстановление материалов @ru
preferred label: Recyklácia materiálov @sk
preferred label: Pridobivanje sekundarnih surovin @sl
preferred label: Återvinning @sv
preferred label: Materyallerin geri kazanımı @tr
broader: Waste collection, treatment and disposal activities; materials recovery
narrower: Dismantling of wrecks
narrower: Recovery of sorted materials

Dismantling of wrecks
type: Concept
notation: 38.31
status: valid
status modified: 2013-10-18
accepted date: 2013-10-18
in scheme: Statistical Classification of Economic Activities in the European Community, Rev. 2 (2008)
scope note: - дейности по разкомплектоване на отпадъци от вида на превозни средства и оборудване (автомобили, кораби, компютри, телевизори и друго излязло от употреба оборудване), когато целта е отделяне на отпадъчни материали, годни за последващо рециклиране. - унищожаване на излезли от употреба вещи и оборудване с цел обезвреждане на съдържащи се в тях опасни отпадъци – 38.22 - разкомплектоване на излезли от употреба автомобили, компютри и друго оборудване с цел продажба на годни за повторна употреба части – сектор G @bg
scope note: Tato třída zahrnuje demontáž všech druhů vraků a jiných použitých výrobků (automobilů, lodí, počítačů, televizorů a jiných přístrojů a zařízení) pro účely recyklace využitelných látek. N: - úpravu použitých výrobků, např. chladniček k odstranění škodlivých odpadů (38.22) - demontáž automobilů, lodí, počítačů, televizorů a jiných přístrojů a zařízení za účelem získání jednotlivých dílů pro další prodej (viz sekce G) @cs
scope note: Diese Klasse umfasst das Zerlegen aller Arten von Wracks und anderer Altwaren (Kraftwagen, Schiffe, Computer, Fernseh- und andere Geräte) zur Materialrückgewinnung. Diese Klasse umfasst nicht: - umweltverträgliche Entsorgung von Altwaren wie Kühlschränken (s. 38.22) - Zerlegen von Kraftwagen, Schiffen, Computern, Fernseh- und anderen Geräten zur Gewinnung von wiederverkäuflichen Einzelteilen (s. Abschnitt G) @de
scope note: This class includes dismantling of wrecks of any type (automobiles, ships, computers, televisions and other equipment) for materials recovery. This class excludes: - disposal of used goods such as refrigerators to eliminate harmful waste, see 38.22 - dismantling of automobiles, ships, computers, televisions and other equipment to obtain re-sell usable parts, see section G @en
scope note: Esta clase comprende el desguace de todo tipo de equipos (automóviles, barcos, ordenadores, televisores, etc.) para la recuperación de materiales. Esta clase no comprende: - la eliminación de bienes usados, como frigoríficos, para eliminar los residuos nocivos (véase 38.22) - el desguace de automóviles, barcos, ordenadores, televisores y otros equipos para obtener y revender piezas que pueden volver a usarse (véase la sección G) @es
scope note: Cette classe comprend le démantèlement d’épaves de tout type (automobiles, navires, ordinateurs, télévisions et autres matériels) à des fins de récupération. Cette classe ne comprend pas: - la destruction de biens hors d’usage (par exemple: des réfrigérateurs) afin d’éliminer des déchets nocifs, voir 38.22 - le démantèlement d’automobiles, de navires, d’ordinateurs, de télévisions et d’autres matériels à des fins de récupération de pièces pour les revendre, voir section G @fr
scope note: Ovaj razred uključuje rastavljanje olupina bilo kojeg tipa (automobila, brodova, računala, televizora i ostale opreme) radi obnavljanja materijala. Ovaj razred isključuje: - odlaganje rabljenih proizvoda kao što su hladnjaci kako bi se uklonio opasan otpad, vidi 38.22 - rastavljanje automobila, brodova, računala, televizora i druge opreme kako bi se dobili upotrebljivi dijelovi pogodni za ponovnu prodaju, vidi područje G.
scope note: Į šią klasę įeina bet kokių duženų (automobilių, laivų, kompiuterių, televizorių ir kitos įrangos) išmontavimas medžiagų atgavimo tikslais. Į šią klasę neįeina: - naudotų daiktų, tokių kaip šaldytuvai, šalinimas, siekiant sunaikinti kenksmingąsias atliekas, žr. 38.22 - automobilių, laivų, kompiuterių, televizorių ir kitos įrangos išmontavimas, siekiant gauti perpardavimui tinkamas dalis, žr. sekciją G @lt
scope note: В данный раздел входит общее строительство зданий всех видов. Сюда относятся новое строительство, ремонтные работы, дополнительные работы и работы по корректировке, возведение зданий из сборных конструкций на месте ведения работ, а также строительство временных сооружений. Включено и строительство целых жилых комплексов, офисных зданий, магазинов и прочих общественных и коммунальных или сельскохозяйственных сооружений и т.д. @ru
scope note: Bu sınıf, her çeşit hurda haline gelmiş olan maddelerin (otomobil, gemi, bilgisayar, televizyon ve diğer donanımlar), materyallerin geri kazanımı amacıyla parçalara ayrılmasını kapsamaktadır. Kapsam dışı olanlar: - zararlı atıklarının yok edilmesi amacı ile kullanılmış malların (örneğin buzdolabı) bertarafı, bkz. 38.22 - satmak için kullanılabilir parçalar oluşturmak amacıyla otomobil, gemi, bilgisayar, televizyon ve diğer donanımların sökülmesi, bkz. kısım G @tr
preferred label: Разкомплектоване на отпадъци @bg
preferred label: Demontáž vraků a vyřazených strojů a zařízení @cs
preferred label: Demontering af udtjente køretøjer, skibe, maskiner mv. @da
preferred label: Zerlegen von Schiffs- und Fahrzeugwracks und anderen Altwaren @de
preferred label: Αποσυναρμολόγηση παλαιών ειδών @el
preferred label: Separación y clasificación de materiales @es
preferred label: Vrakkide demonteerimine @et
preferred label: Romujen purkaminen @fi
preferred label: Démantèlement d'épaves @fr
preferred label: Használt eszköz bontása
preferred label: Demolizione di carcasse @it
preferred label: Mašinų duženų išmontavimas @lt
preferred label: Nolietotu iekārtu, ierīču un mašīnu izjaukšana @lv
preferred label: Żarmar ta' tifrik @mt
preferred label: Sloop van wrakken @nl
preferred label: Demontering av vrakede gjenstander @no
preferred label: Demontaż wyrobów zużytych @pl
preferred label: Desmantelamento de equipamentos e bens em fim de vida @pt
preferred label: Demontarea (dezasamblarea) maşinilor şi a echipamentelor scoase din uz pentru recuperarea materialelor @ro
preferred label: Ликвидация обломков @ru
preferred label: Demontáž vrakov @sk
preferred label: Demontaža odpadnih naprav @sl
preferred label: Demontering av uttjänta fordon och maskiner @sv
preferred label: Hurdaların parçalara ayrılması @tr
broader: Materials recovery

Recovery of sorted materials
type: Concept
notation: 38.32
status: valid
status modified: 2013-10-18
accepted date: 2013-10-18
in scheme: Statistical Classification of Economic Activities in the European Community, Rev. 2 (2008)
scope note: Преработване на метални и неметални отпадъци в суровини, годни за последваща употреба в различни производства, което обикновено изисква процес на механично или химично преобразуване на отпадъците.Включва също и добиването на годни за рециклиране отпадъчни материали от потоците на събираните неопасни отпадъци чрез тяхното извличане и сортиране, както и разделяне и сортиране на смесени рециклируеми материали - например хартия, пластмаси, опаковки от напитки и метални отпадъци. процеси на механично или химическо преобразуване на отпадъците като: - механично натрошаване на метални отпадъци, например излезли от употреба перални машини, мотоциклети и други подобни - пресоване на едрогабаритни метални отпадъци, например железопътни вагони - разкъсване или раздробяване (шредиране) на метални отпадъци, стари автомобили и други - други методи на механично преработване на отпадъците с цел намаляване обема или размера чрез нарязване или смачкване - извличане на метали от фотографски отпадъци като фиксажен разтвор или фотографски филми и хартия - регенериране на каучук, например от отпадъчни автомобилни гуми, с цел повторно получаване на суровини - сортиране и пресоване на пластмасови отпадъци с цел получаване на суровини за производство на тръби, саксии, палети и подобни - преработване на пластмасови или каучукови отпадъци във вид на гранули (чрез почистване, стопяване и смилане) - натрошаване, почистване и сортиране на стъклени отпадъци - натрошаване, почистване и сортиране на други отпадъци (например строителни отпадъци), с цел повторно оползотворяване - преработване на използвани хранителни масла и мазнини (като кухненски отпадъци) с цел получаване на суровинни материали - преработване на други отпадъци и остатъци от храни, напитки и тютюн с цел получаване на суровинни материали - производство на нови крайни продукти, когато се използват рециклирани от отпадъци суровини (собствено производство или не) - например производство на метали от метални отпадъци, на прежда от тексти… @bg
scope note: Tato třída zahrnuje zpracování kovových a nekovových použitých materiálů, zbytkových látek a výrobků na druhotné suroviny, zpravidla použitím mechanického nebo chemického procesu přeměny. Příklady používaných mechanických nebo chemických zpracovatelských procesů: - mechanické drcení kovového odpadu z použitých motorových vozidel, praček, jízdních kol atd. - rozlisování velkých kovových částí popř. výrobků, např. železničních vagonů - rozřezání kovových odpadů, vraků vozidel atd. - jiné metody mechanické úpravy, tj. řezání nebo lisování za účelem zmenšení objemu - zpětné získávání kovů z fotografického odpadu, tj. fixačních roztoků, filmů a fotografického papíru - zpětné získávání pryže (regenerace), např. z použitých pneumatik, za účelem získávání druhotných surovin - třídění a lisování plastů za účelem získávání druhotných surovin pro výrobu trubek, květináčů, palet apod. - zpracování (čištění, tavení, mletí) plastových nebo pryžových odpadů na granuláty - drcení, čistění a třídění skla - drcení, čistění a třídění jiných odpadů, např. materiálu z demolic staveb, za účelem získávání druhotných surovin - zpracování použitých kuchyňských olejů a tuků na druhotné suroviny - zpracování ostatních odpadů a zbytkových látek z potravin, nápojů a tabáku na druhotné suroviny Zahrnuje také recyklaci využitelných látek z toků odpadů: 1.) vytřiďováním využitelných látek z toků odpadů, kromě nebezpečných (tzn. z komunálního odpadu) nebo 2.) vytřiďováním ze smíšených využitelných látek, např. papíru, plastů, prázdných plechovek od nápojů a kovů, do určitých rozdílných kategorií. N: - výrobu nových konečných produktů z druhotných surovin (vlastní výroby nebo od jiných výrobců), např. spřádání příze z recyklovaných vláken, výrobu papíroviny z papírového odpadu, protektorování pneumatik nebo výrobu kovů z kovového odpadu (viz příslušné třídy v sekci C – zpracovatelský průmysl) - recyklaci jaderných paliv (20.13) - tavení železného šrotu (24.10) - zpětné získávání látek při spalování … @cs
scope note: Diese Klasse umfasst die Verarbeitung von metallischen und nichtmetallischen Altmaterialien, Reststoffen und Erzeugnissen zu Sekundärrohstoffen, in der Regel unter Einsatz eines mechanischen oder chemischen Umwandlungsverfahrens. Eingeschlossen ist die Materialrückgewinnung aus Abfallströmen durch: 1. Aussortieren von Wertstoffen aus Strömen nicht gefährlichen Abfalls (d. h. aus dem Müll) oder 2. Sortierung von vermischten Wertstoffen (z. B. Papier, Kunststoffe, leere Getränkedosen und Metalle) in bestimmte Kategorien. Beispiele für die angewandten mechanischen oder chemischen Verarbeitungsprozesse: - mechanisches Zerkleinern von Metallschrott aus gebrauchten Kraftwagen, Waschmaschinen, Fahrrädern usw. - Zusammenpressen großer Metallteile bzw. -erzeugnisse, wie Eisenbahnwagons - Schreddern von metallischen Altmaterialien, Fahrzeugwracks usw. - andere mechanische Behandlungsmethoden wie Schneiden oder Pressen zur Reduzierung des Volumens - Rückgewinnung von Metallen aus fotografischen Abfällen wie Fixierlösung, Filme und Fotopapier - Rückgewinnung von Gummi, z. B. aus gebrauchten Reifen, zur Gewinnung von Sekundärrohstoffen - Sortieren und Pressen von Kunststoffen zur Gewinnung von Sekundärrohstoffen für die Herstellung von Rohren, Blumentöpfen, Paletten u. Ä. - Verarbeitung (Reinigen, Schmelzen, Mahlen) von Kunststoff- oder Gummiabfällen zu Granulaten - Zerkleinern, Reinigen und Sortieren von Glas - Zerkleinern, Reinigen und Sortieren von anderen Altmaterialien und Reststoffen, z. B. Abbruchmaterial, zur Gewinnung von Sekundärrohstoffen - Verarbeitung gebrauchter Speiseöle und -fette zu Sekundärrohstoffen - Verarbeitung sonstiger Abfälle und Reststoffe aus Nahrungsmitteln, Getränken und Tabak zu Sekundärrohstoffen Diese Klasse umfasst nicht: - Herstellung von neuen Endprodukten aus (selbst oder nicht selbsthergestellten) Sekundärrohstoffen, z. B. Spinnen von Garn aus wiedergewonnenen Fasern, Erzeugen von Papiermasse aus Papierabfall, Runderneuern von Reifen oder Erz… @de
scope note: This class includes the processing of metal and non-metal waste and scrap and other articles into secondary raw materials, usually involving a mechanical or chemical transformation process. Also included is the recovery of materials from waste streams in the form of (1) separating and sorting recoverable materials from non-hazardous waste streams (i.e. garbage) or (2) the separating and sorting of commingled recoverable materials, such as paper, plastics, used beverage cans and metals, into distinct categories. Examples of the mechanical or chemical transformation processes that are undertaken are: - mechanical crushing of metal waste from used cars, washing machines, bikes etc. - mechanical reduction of large iron pieces such as railway wagons - shredding of metal waste, end-of-life vehicles etc. - other methods of mechanical treatment as cutting, pressing to reduce the volume - reclaiming metals out of photographic waste, e.g. fixer solution or photographic films and paper - reclaiming of rubber such as used tyres to produce secondary raw material - sorting and pelleting of plastics to produce secondary raw material for tubes, flower pots, pallets and the like - processing (cleaning, melting, grinding) of plastic or rubber waste to granulates - crushing, cleaning and sorting of glass - crushing, cleaning and sorting of other waste such as demolition waste to obtain secondary raw material - processing of used cooking oils and fats into secondary raw materials - processing of other food, beverage and tobacco waste and residual substances into secondary raw materials This class excludes: - manufacture of new final products from (whether or not self-manufactured) secondary raw materials, such as spinning yarn from garnetted stock, making pulp from paper waste, retreading tyres or production of metal from metal scrap, see corresponding classes in section C (Manufacturing) - reprocessing of nuclear fuels, see 20.13 - remelting ferrous waste and scrap, see 24.10 - materi… @en
scope note: Esta clase comprende el procesado de residuos y chatarra metálicos y no metálicos para su transformación en materias primas secundarias, generalmente mediante un proceso mecánico o químico. También comprende la recuperación de materiales procedentes de los ciclos de tratamiento de residuos por medio de (1) la separación y clasificación de materiales recuperables procedentes de los ciclos de tratamiento de residuos no peligrosos (es decir, basura) o (2) la separación y clasificación de materiales recuperables mezclados, como papel, plásticos, latas de bebidas usadas y metales, en distintas categorías. Algunos ejemplos de procesos de transformación mecánica o química que se efectúan son: - el molido mecánico de los residuos metálicos procedentes de vehículos usados, lavadoras, bicicletas, etc. - la reducción mecánica de grandes piezas de hierro, como vagones de ferrocarril - la trituración de residuos de metal, vehículos para desguace, etc. - otros métodos de tratamiento mecánico, como el corte y la compresión para reducir el volumen - la regeneración de metales a partir de los residuos fotográficos, por ejemplo, del baño fijador o las películas y el papel fotográficos. - la recuperación del caucho, por ejemplo, neumáticos usados, para producir materias primas secundarias - la clasificación y prensado de plásticos para producir materias primas secundarias para tubos, tiestos, paletas y similares - la transformación (limpieza, fundición, trituración) de residuos de plástico o caucho en granulos - la trituración, lavado y clasificación de vidrio - la trituración, lavado y clasificación de otros residuos, como los de demolición, para obtener materias primas secundarias - el procesado de aceites y grasas usados para cocinar para su transformación en materias primas secundarias - la transformación de otros residuos procedentes de alimentos, bebidas y tabaco en materias primas secundarias Esta clase no comprende: - la fabricación de productos finales nuevos (de producción p… @es
scope note: Cette classe comprend la transformation de déchets et de débris métalliques et non métalliques en matières premières secondaires en mettant généralement en œuvre des processus de transformation mécanique ou chimique. Cette classe comprend également la récupération de matériaux se trouvant dans les flux de déchets, en séparant et en triant les matériaux récupérables dans les flux de déchets non dangereux (les ordures) ou en séparant et en triant les matériaux de récupération non triés, tels que papier, plastique, boîtes à boisson et métaux usagés. Les processus de transformation mécanique ou chimique concernés sont notamment: - le broyage, par des procédés mécaniques, d’objets métalliques tels que vieilles voitures, machines à laver hors d’usage, vieux vélos, etc. - la réduction, par des procédés mécaniques, d’objets métalliques volumineux tels que les wagons de chemin de fer - le déchirage de déchets métalliques, de véhicules en fin de vie, etc. - d’autres méthodes de traitement mécanique telles que le découpage et le pressage pour réduire le volume - la récupération de métaux à partir de déchets photographiques, par exemple: les bains de fixation ou des films ou papiers photographiques - la récupération du caoutchouc (par exemple, sous forme de pneumatiques usagés) pour produire des matières premières secondaires - le triage et le pastillage de matières plastiques en vue d’obtenir des matières premières secondaires utilisables pour la fabrication de tubes, de pots de fleurs, de palettes, etc. - la transformation (nettoyage, fusion, broyage) de déchets de plastique ou de caoutchouc en granulés - le broyage, le nettoyage et le triage du verre - le broyage, le nettoyage et le triage d’autres déchets (par exemple, décombres et gravats) en vue d’obtenir des matières premières secondaires - la transformation d’huiles et de graisses alimentaires usées en matières premières secondaires - la transformation d’autres déchets et résidus d’aliments, de boissons et de tabac en m… @fr
scope note: Ovaj razred uključuje obradu metalnog i nemetalnog otpada i ostataka te predmeta u sekundarne sirovine, obično uključuje mehaničke ili kemijske procese pretvorbe. Također je uključena oporaba materijala iz tokova otpada u obliku (1) izdvajanja i razvrstavanja obnovljivih materijala iz neopasnih tokova otpada (npr. smeća) ili (2) izdvajanja i razvrstavanja pomiješanih obnovljivih materijala kao što su papir, plastika, upotrijebljene konzerve od pića i metali, u različite kategorije. Primjeri mehaničkih ili kemijskih transformacijskih procesa koji se poduzimaju su: - mehaničko prešanje metalnog otpada kao što su vozila, strojevi za pranje rublja, bicikli itd. - mehanička redukcija velikih komada željeza kao što su željeznički vagoni - usitnjavanje rezanjem metalnog otpada, stara vozila itd. - ostale metode mehaničke obrade, npr. rezanje i prešanje kako bi se smanjio obujam - obnavljanje metala iz fotografskog otpada, npr. fiksir-otopine ili fotografskih filmova i fotografskog papira - protektiranje gume iz rabljenih vanjskih guma za proizvodnju sekundardnih sirovina - razvrstavanje i prešanje plastike za proizvodnju sekundarnih sirovina za cijevi, tegle za cvijeće, palete i slično - obrada (čišćenje, otapanje, mljevenje) otpada od plastike ili gume u granule - drobljenje, čišćenje i izdvajanje stakla - drobljenje, čišćenje i izdvajanje ostalih otpadaka, npr. ostataka od rušenja za dobivanje sekundarnih sirovina - prerada uporabljenih ulja i masti za kuhanje u sekundarne sirovine - prerada ostale otpadne hrane, pića i duhana te rezidualnih supstancija u sekundarne sirovine Ovaj razred isključuje: - proizvodnju novih gotovih proizvoda iz sekundarnih sirovina (bez obzira na to jesu li vlastito proizvedeni ili nisu), npr. predenje vlakana iz nagomilanih zaliha, proizvodnja papira od starog papira; protektiranje gume ili proizvodnja metala od otpada metala, vidi odgovarajuće razrede u području C (Prerađivačka industrija) - ponovnu obradu nuklearnoga goriva, vidi 20.13 - ob…
scope note: Į šią klasę įeina metalų ir nemetalų atliekų, laužo ir kitų gaminių perdirbimas į antrines žaliavas. Taip pat įeina medžiagų atgavimas iš atliekų srauto toks kaip (1) atskyrimas ir rūšiavimas atgavimui tinkamų medžiagų iš nepavojingų atliekų srauto (pvz., šiukšlių) ar (2) atgavimui tinkamų medžiagų, tokių kaip popierius, plastmasė, skardinės ir metalas, mišinio suskaidymas ir rūšiavimas pagal medžiagų rūšis. Mechaninio arba cheminio perdirbimo pavyzdžiai yra: - naudotų automobilių, skalbimo mašinų, motociklų ir kt. metalo laužo mechaninis trupinimas - didelių geležies gaminių, tokių kaip geležinkelio vagonai, mechaninis dalijimas į mažesnes dalis - metalo atliekų, nebetinkamų naudoti transporto priemonių ir kt. smulkinimas - kiti mechaninio apdorojimo būdai, tokie kaip pjaustymas, presavimas, siekiant sumažinti turį - metalų regeneravimas iš fotografijos atliekų, pvz., fiksažo tirpalo arba fotografijų juostų ir popieriaus - gumos, pvz., iš panaudotų padangų regeneravimas, siekiant pagaminti antrines žaliavas - plastikų rūšiavimas ir granuliavimas, siekiant pagaminti antrines žaliavas, skirtas vamzdžiams, gėlių vazonėliams, padėklams ir kt. gaminti - plastikų ir gumos atliekų perdirbimas (valymas, lydymas, smulkinimas) į granules - stiklo trupinimas, valymas ir rūšiavimas - kitokių atliekų, tokių kaip nugriovimo atliekų, trupinimas, valymas ir rūšiavimas antrinėms žaliavoms gauti - vartoto aliejaus ir riebalų perdirbimas į antrines žaliavas - kitų maisto, gėrimo ir tabako atliekų ir liekamųjų medžiagų perdirbimas į antrines žaliavas Į šią klasę neįeina: - naujų gatavų produktų iš antrinių žaliavų (nesvarbu, savos gamybos ar ne), tokių kaip verpalų verpimas iš atnaujinto pluošto, plaušienos gamyba iš popieriaus atliekų, padangų restauravimas arba metalo gamyba iš metalo laužo, žr. atitinkamas sekcijos C (Apdirbamoji gamyba) klases - branduolinio kuro regeneravimas, žr. 20.13 - geležies atliekų ir metalo laužo perlydymas, žr. 24.10 - medžiagų atgavimas deginant atlieka… @lt
scope note: Bu sınıf metal veya metal olmayan atıklar, hurdalar ve diğer parçaların, genellikle mekanik veya kimyasal değişim işlemleri ile, ikincil hammaddelere dönüştürülmesi işlemlerini kapsamaktadır. Ayrıca bu sınıfa, (1) tehlikesiz atıkların içinden (örn. çöp kutularından) yeniden kazanılabilir maddelerin ayrıştırılarak ve tasnif edilerek ya da (2) kağıt, plastik, kullanılmış teneke içecek kutuları ile metaller gibi karışık halde olan geri kazanılabilir maddelerin, sınıflarına göre ayrıştırılarak ve tasnif edilerek geri kazanımı dahildir.Mekanik veya kimyasal dönüştürme işlemleri için örnekler şu şekildedir: - kullanılmış arabalar, çamaşır makineleri, bisikletler ve benzeri metal atıkların mekanik olarak ezilmesi - tren vagonları gibi büyük demir parçaların mekanik olarak ufaltılması - metal atıkların, kullanım süresi dolmuş araçların vb. parçalanması - hacmi azaltmak için yapılan kesme, presleme gibi diğer mekanik işlemler - sabitleştirme solüsyonu ya da fotoğrafik filmler ve kağıtlar gibi fotoğrafçılığa ait atıklarda bulunan metallerin işlenmesi - ikincil hammadde üretmek için kullanılmış tekerlek gibi lastik maddelerin işlenmesi - hortum, çiçek saksısı, palet ve benzerleri için ikincil hammadde üretmek üzere plastiklerin sınıflandırılması ve topak haline getirilmesi - plastik ve lastik atıkların granüllere dönüştürülmesi (temizleme, eritme, öğütme) - camın sıkıştırılarak ezilmesi, temizlenmesi ve ayrıştırılması - ikincil hammadde elde etmek üzere yıkım atığı gibi diğer atıkların sıkıştırılarak ezilmesi, temizlenmesi ve ayrıştırılması - kullanılmış yemeklik sıvı ve katı yağların ikincil hammaddelere dönüştürülmesi işlemleri - diğer yiyecek, içecek ve tütün mamulleri atıklarının ve artık maddelerinin ikincil hammaddelere dönüştürülmesi işlemleri Kapsam dışı olanlar: - ikincil hammaddelerden yeni ürün üretimi (kendi imalatı olsun veya olmasın); örneğin tarak makinesinden artan ipliğin eğirilmesi, kağıt atıklarından kağıt hamuru yapılması, lastik tekerleklere kaplama yapmak… @tr
preferred label: Рециклиране на сортирани отпадъци @bg
preferred label: Zpracování vytříděných surovin k dalšímu využití @cs
preferred label: Genbrug af sorterede materialer @da
preferred label: Rückgewinnung sortierter Werkstoffe @de
preferred label: Ανάκτηση διαλεγμένου υλικού @el
preferred label: Valorización de materiales ya clasificados @es
preferred label: Sorteeritud materjali taaskasutusele võtmine @et
preferred label: Lajiteltujen materiaalien kierrätys @fi
preferred label: Récupération de déchets triés @fr
preferred label: Hulladék újrahasznosítása
preferred label: Recupero dei materiali selezionati @it
preferred label: Išrūšiuotų medžiagų atgavimas @lt
preferred label: Šķirotu materiālu pārstrāde @lv
preferred label: Irkupru ta' materjal magħżul @mt
preferred label: Terugwinning van gesorteerd materiaal @nl
preferred label: Sortering og bearbeiding av avfall for materialgjenvinning @no
preferred label: Odzysk surowców z materiałów segregowanych @pl
preferred label: Recuperação de desperdícios e resíduos, seleccionados @pt
preferred label: Recuperarea materialelor reciclabile sortate @ro
preferred label: Утилизация отсортированных материалов @ru
preferred label: Recyklácia triedených materiálov @sk
preferred label: Pridobivanje sekundarnih surovin iz ostankov in odpadkov @sl
preferred label: Återvinning av källsorterat material @sv
preferred label: Tasnif edilmiş materyallerin geri kazanımı @tr
broader: Materials recovery

Remediation activities and other waste management services
type: Concept
notation: 39
status: valid
status modified: 2013-10-18
accepted date: 2013-10-18
in scheme: Statistical Classification of Economic Activities in the European Community, Rev. 2 (2008)
scope note: Този раздел включва дейности по отстраняване на замърсявания и възстановяване, т.е. почистване или очистване на замърсени сгради, площадки, почви, повърхностни или подземни води. @bg
scope note: Tato sekce zahrnuje činnosti související s odpady a činnostmi sanačními, tzn. čištění kontaminovaných budov, průmyslových závodů nebo areálů, území, půdy nebo povrchových a podzemních vod. @cs
scope note: Dieser Abschnitt umfasst Dienstleistungen zur Beseitigung von Umweltverschmutzungen, d. h. die Säuberung von kontaminierten Gebäuden, Standorten und Böden sowie von Oberflächen- und Grundwasser. @de
scope note: This division includes the provision of remediation services, i.e. the cleanup of contaminated buildings and sites, soil, surface or ground water. @en
scope note: Esta división comprende la prestación de servicios de descontaminación, es decir, la limpieza de lugares, edificios, suelos, superficies o aguas subterráneas contaminados. @es
scope note: Cette division comprend la fourniture de services d’assainissement et de nettoyage de bâtiments, de sites, de sols, d’eaux de surface ou d’eaux souterraines contaminés. @fr
scope note: Ovaj odjeljak uključuje pružanje usluga sanacije, npr. čišćenje kontaminiranih zgrada i lokacija, tla, površinskih ili podzemnih voda.
scope note: Į šį skyrių įeina regeneravimo paslaugų teikimas, t.y. užterštų pastatų ir statybviečių, dirvožemio, paviršinio ar gruntinio vandens taršos šalinimas. @lt
scope note: Этот класс включает: - разработку проектов по строительству жилых и нежилых зданий посредством объединения финансовых, технических и физических средств для реализации проекта с целью дальнейшей продажи Этот класс исключает: - строительство зданий, см. 41.20 - архитектурные и инженерные работы, см. 71.1 - услуги по управлению строительным проектом, см. 71.1 @ru
scope note: Bu bölüm, iyileştirme hizmetlerini kapsamaktadır, örn. kontamine olmuş binaların, alanların, toprak, yüzey ve yeraltı sularının temizlenmesi. @tr
preferred label: Възстановяване и други услуги по управление на отпадъци @bg
preferred label: Sanace a jiné činnosti související s nakládáním s odpady @cs
preferred label: Rensning af jord og grundvand og anden form for forureningsbekæmpelse @da
preferred label: Beseitigung von Umweltverschmutzungen und sonstige Entsorgung @de
preferred label: Δραστηριότητες εξυγίανσης και άλλες υπηρεσίες για τη διαχείριση αποβλήτων @el
preferred label: Actividades de descontaminación y otros servicios de gestión de residuos @es
preferred label: Saastekäitlus ja muud jäätmekäitlustegevused @et
preferred label: Maaperän ja vesistöjen kunnostus ja muut ympäristönhuoltopalvelut @fi
preferred label: Dépollution et autres services de gestion des déchets @fr
preferred label: Szennyeződésmentesítés, egyéb hulladékkezelés
preferred label: Attività di risanamento e altri servizi di gestione dei rifiuti @it
preferred label: Regeneravimas ir kita atliekų tvarkyba @lt
preferred label: Sanitārija un citi atkritumu apsaimniekošanas pakalpojumi @lv
preferred label: Attivitajiet ta' rimedjazzjoni u servizzi oħra ta' ġestjoni ta' skart @mt
preferred label: Sanering en ander afvalbeheer @nl
preferred label: Miljørydding, miljørensing og lignende virksomhet @no
preferred label: Działalność związana z rekultywacją i pozostałe usługi związane z gospodarką odpadami @pl
preferred label: Actividades de despoluição e outros serviços de gestão de resíduos @pt
preferred label: Activităţi şi servicii de decontaminare @ro
preferred label: Рекультивация и прочие услуги в области удаления отходов @ru
preferred label: Ozdravovacie činnosti a ostatné činnosti nakladania s odpadom @sk
preferred label: Saniranje okolja in drugo ravnanje z odpadki @sl
preferred label: Sanering, efterbehandling av jord och vatten samt annan verksamhet för föroreningsbekämpning @sv
preferred label: İyileştirme faaliyetleri ve diğer atık yönetimi hizmetleri @tr
broader: WATER SUPPLY; SEWERAGE, WASTE MANAGEMENT AND REMEDIATION ACTIVITIES
narrower: Remediation activities and other waste management services

Remediation activities and other waste management services
type: Concept
notation: 39.0
status: valid
status modified: 2013-10-18
accepted date: 2013-10-18
in scheme: Statistical Classification of Economic Activities in the European Community, Rev. 2 (2008)
scope note: Данная группа включает полный спектр услуг по строительству жилых и нежилых помещений как за свой счет или на основе выплаты гонорара, так и в соответствии с договором. Возможна передача части или всех работ субподрядным организациям. Если выполняется только специализированная часть строительных работ, то данная деятельность рассматривается в разделе 43. @ru
preferred label: Възстановяване и други услуги по управление на отпадъци @bg
preferred label: Sanace a jiné činnosti související s nakládáním s odpady @cs
preferred label: Rensning af jord og grundvand og anden form for forureningsbekæmpelse @da
preferred label: Beseitigung von Umweltverschmutzungen und sonstige Entsorgung @de
preferred label: Δραστηριότητες εξυγίανσης και άλλες υπηρεσίες για τη διαχείριση αποβλήτων @el
preferred label: Actividades de descontaminación y otros servicios de gestión de residuos @es
preferred label: Saastekäitlus ja muud jäätmekäitlustegevused @et
preferred label: Maaperän ja vesistöjen kunnostus ja muut ympäristönhuoltopalvelut @fi
preferred label: Dépollution et autres services de gestion des déchets @fr
preferred label: Szennyeződésmentesítés, egyéb hulladékkezelés
preferred label: Attività di risanamento e altri servizi di gestione dei rifiuti @it
preferred label: Regeneravimas ir kita atliekų tvarkyba @lt
preferred label: Sanitārija un citi atkritumu apsaimniekošanas pakalpojumi @lv
preferred label: Attivitajiet ta' rimedjazzjoni u servizzi oħra ta' ġestjoni ta' skart @mt
preferred label: Sanering en ander afvalbeheer @nl
preferred label: Miljørydding, miljørensing og lignende virksomhet @no
preferred label: Działalność związana z rekultywacją i pozostałe usługi związane z gospodarką odpadami @pl
preferred label: Actividades de despoluição e outros serviços de gestão de resíduos @pt
preferred label: Activităţi şi servicii de decontaminare @ro
preferred label: Рекультивация и прочие услуги в области удаления отходов @ru
preferred label: Ozdravovacie činnosti a ostatné činnosti nakladania s odpadom @sk
preferred label: Saniranje okolja in drugo ravnanje z odpadki @sl
preferred label: Sanering, efterbehandling av jord och vatten samt annan verksamhet för föroreningsbekämpning @sv
preferred label: İyileştirme faaliyetleri ve diğer atık yönetimi hizmetleri @tr
broader: Remediation activities and other waste management services
narrower: Remediation activities and other waste management services

Remediation activities and other waste management services
type: Concept
notation: 39.00
status: valid
status modified: 2013-10-18
accepted date: 2013-10-18
in scheme: Statistical Classification of Economic Activities in the European Community, Rev. 2 (2008)
scope note: - отстраняване на замърсявания на почви и подземни води на мястото на замърсяването, веднага или впоследствие, с помощта на механични, химични или биологически методи - отстраняване на замърсявания с местонахождение в производствени сгради, заводи, площадки, вкл. атомни предприятия и техните площадки - отстраняване на замърсявания на повърхностни води след инцидентно замърсяване - например чрез механично събиране на замърсителите или чрез химични методи - почистване на нефтени разливи на сушата, по повърхностни води, в океани и морета, вкл. крайбрежните райони - отстраняване на азбест, на покрития с оловни бои, обезвреждане на токсични материали и други - други специализирани дейности по управление на замърсяванията - дейности, свързани с борбата срещу вредители в селското стопанство - 01.61 - обработване на водите с цел водоснабдяване – 36.00 - обработване и обезвреждане на неопасни отпадъци – 38.21 - обработване и обезвреждане на опасни отпадъци – 38.22 - поддържане на чистотата на улици, площади и подобни открити места – 81.29 @bg
scope note: Z: - dekontaminaci půdy a podzemních vod v místě znečištění nebo jinde, použitím, např. mechanických, chemických nebo biologických procesů - dekontaminaci budov, průmyslových závodů nebo areálů, včetně jaderných - dekontaminaci a čištění povrchových vod po znečištění, např. sběrem škodlivin nebo použitím chemikálií - odstraňování ropného znečištění a jiných znečištění na pevnině, vodě, oceánu nebo mořích včetně pobřežních oblastí - odmořování nebo redukce azbestu, olověných barev a ostatních toxických látek - ostatní speciální opatření na ochranu životního prostředí (boj proti znečištění) N: - hubení škůdců v zemědělství (01.61) - čištění vody za účelem zásobování vodou (36.00) - úpravu odpadů a jejich odstraňování (38.2) - zametání a čištění ulic atd. (81.29) @cs
scope note: Diese Klasse umfasst: - Dekontaminierung von Böden und Grundwasser am Ort der Verschmutzung oder anderweitig, z. B. unter Anwendung mechanischer, chemischer oder biologischer Verfahren - Dekontaminierung von Industrieanlagen oder –standorten, einschließlich Nuklearanlagen und –standorten - Dekontaminierung und Reinigung von Oberflächenwasser nach Verschmutzung, z. B. durch Einsammlung der Schadstoffe oder Einsatz von Chemikalien - Beseitigung von Öl- und anderen Verschmutzungen zu Land und zu Wasser - Entseuchung bzw. Vorbehandlung von toxischen Stoffen wie Asbest, Bleifarbe usw. - sonstige spezielle Umweltschutzmaßnahmen Diese Klasse umfasst nicht: - Schädlingsbekämpfung in der Landwirtschaft (s. 01.61) - Reinigen von Wasser zum Zwecke der Wasserversorgung (s. 36.00) - Behandlung und Beseitigung nicht gefährlicher Abfälle (s. 38.21) - Behandlung und Beseitigung gefährlicher Abfälle (s. 38.22) - Kehren und Reinigen von Straßen usw. (s. 81.29) @de
scope note: This class includes: - decontamination of soils and groundwater at the place of pollution, either in situ or ex situ, using e.g. mechanical, chemical or biological methods - decontamination of industrial plants or sites, including nuclear plants and sites - decontamination and cleaning up of surface water following accidental pollution, e.g. through collection of pollutants or through application of chemicals - cleaning up oil spills and other pollutions on land, in surface water, in ocean and seas, including coastal areas - asbestos, lead paint, and other toxic material abatement - other specialised pollution-control activities This class excludes: - pest control in agriculture, see 01.61 - purification of water for water supply purposes, see 36.00 - treatment and disposal of non-hazardous waste, see 38.21 - treatment and disposal of hazardous waste, see 38.22 - outdoor sweeping and watering of streets etc., see 81.29 @en
scope note: Esta clase comprende: - la descontaminación de suelos y aguas subterráneas en el lugar de la contaminación, bien in situ, bien ex situ, con métodos mecánico-químicos o biológicos - la descontaminación de centros o plantas industriales, incluidas las plantas y centrales nucleares - la descontaminación y limpieza de aguas superficiales tras una contaminación accidental, por ejemplo mediante recogida de contaminantes o aplicación de sustancias químicas - la limpieza de vertidos de petróleo en tierra, aguas superficiales, océanos y mares (incluidas las costas) - la eliminación de amianto, pintura con plomo y otros materiales tóxicos - otras actividades especializadas de control de la contaminación Esta clase no comprende: - la lucha contra las plagas agropecuarias (véase 01.61) - la purificación de aguas para el suministro de agua (véase 36.00) - el tratamiento y eliminación de residuos no peligrosos (véase 38.21) - el tratamiento y eliminación de residuos peligrosos (véase 38.22) - el barrido y riego exterior de calles, etc., (véase 81.29) @es
scope note: Cette classe comprend: - la décontamination des sols et des eaux souterraines pollués, in situ ou ex situ, par exemple: à l’aide de méthodes mécaniques/chimiques ou biologiques - la décontamination d’usines ou de sites, y compris des usines et des sites nucléaires - la décontamination et la dépollution des eaux superficielles à la suite de pollutions accidentelles, par exemple: par l’enlèvement de polluants ou l’application de produits chimiques - le nettoyage des rejets d’hydrocarbures sur terre, dans les eaux superficielles, dans l’océan ou dans la mer, y compris les zones côtières - le désamiantage, l’enlèvement des peintures à base de plomb, la réduction des matières toxiques, etc. - les autres activités spécialisées de lutte contre la pollution Cette classe ne comprend pas: - la lutte contre les animaux nuisibles dans l’agriculture, voir 01.61 - le traitement de l’eau aux fins de la distribution d’eau, voir 36.00 - le traitement et l’élimination des déchets non dangereux, voir 38.21 - le traitement et l’élimination des déchets dangereux, voir 38.22 - le balayage et l’arrosage des chaussées, etc. voir 81.29 @fr
scope note: Ovaj razred uključuje: - dekontaminiranje tla i podzemnih voda na mjestu onečišćenja ili izvan njega, uporabom npr. mehaničkih, kemijskih ili bioloških metoda - dekontaminiranje industrijskih postrojenja ili lokacija uključujući nuklearna postrojenja i lokacije - dekontaminiranje i čišćenje površinskih voda nakon onečišćenja izazvanoga nesrećom, npr. skupljanjem zagađivala ili primjenom kemikalija - čišćenje prolivenih ulja i drugih onečišćenja na tlu, na površinskim vodama, u oceanima i morima, uključujući priobalje - smanjenje azbesta, boja koje sadrže olovo i ostalih toksičnih tvari - ostale specijalizirane djelatnosti u vezi s kontrolom zagađenja Ovaj razred isključuje: - kontrolu štetočina u poljoprivredi, vidi 01.61 - pročišćavanje voda za potrebe opskrbe, vidi 36.00 - obradu i odlaganje neopasnog otpada, vidi 38.21 - obradu i odlaganje opasnog otpada, vidi 38.22 - čišćenje i pranje ulica, vidi 81.29
scope note: Į šią klasę įeina: - dirvožemio ir gruntinio vandens taršos šalinimas užteršimo vietoje, taip pat ir tam skirtose vietose mechaniniais, cheminiais ar biologiniais metodais - pramonės gamyklų arba statybviečių, įskaitant branduolines jėgaines ir aikšteles, dezaktyvavimas - paviršinio vandens, užteršto atsitiktiniais teršalais, taršos šalinimas ir valymas surenkant teršalus ir naudojant cheminius preparatus - ant žemės, vandens paviršiaus, į vandenynus ir jūras bei pakrantėse išsiliejusios naftos ir kitų teršalų valymas - asbesto, švino baltalo dažų ir kitų toksinių medžiagų šalinimas - kita specializuota kovos su tarša veikla Į šią klasę neįeina: - kova su žemės ūkio kenkėjais, žr. 01.61 - vandens valymas vandens tiekimo tikslais, žr. 36.00 - nepavojingų atliekų apdorojimas ir šalinimas, žr. 38.21 - pavojingų atliekų apdorojimas ir šalinimas, žr. 38.22 - gatvių ir kt. valymas ir laistymas, žr. 81.29 @lt
scope note: Этот класс включает: - строительство всех типов жилых домов: • одноквартирных домов • многоквартирных домов, в том числе многоэтажных зданий - строительство всех типов нежилых зданий: • зданий для промышленного использования, например, фабрик, мастерских, сборочных цехов и т.д. • больниц, школ, офисных зданий • гостиниц, магазинов, торговых пассажей, ресторанов • зданий аэропортов • крытых спортивных комплексов • гаражей, включая подземные парковочные площадки • складов • зданий для религиозных целей - монтаж и установку сборных конструкций на участках Этот класс также включает: - реконструкция или реставрация существующих жилых строений Этот класс исключает: - строительство промышленных сооружений, за исключением зданий, см. 42.99 - архитектурные и инженерные работы, см. 71.1 - услуги по управлению строительным проектом, см. 71.1 @ru
scope note: Bu sınıf aşağıdakileri kapsamaktadır: - mekanik, kimyasal veya biyolojik vb. yöntemler kullanılarak, kirletilmiş toprak ve yeraltı sularının yerinde ya da başka yerde temizlenmesi, - nükleer binalar ve alanlar da dahil, sanayi tesisleri ve alanlarının temizlenmesi, - kaza sonucu kirletilmiş yüzey sularının kirliliğinin, kirletici maddelerin toplanması veya kimyasal maddelerin uygulanması gibi yöntemler ile giderilmesi ve temizlenmesi, - kıyı bölgeleri de dahil, toprak, yüzey suları, okyanus ve denizlerde olan petrol döküntülerinin ve diğer kirleticilerin temizlenmesi, - asbest, kurşun boyalar ve diğer zehirli maddelerin azaltılması, - diğer uzmanlık gerektiren kirlilik kontrol faaliyetleri Kapsam dışı olanlar: - tarımla ilgili zararlıların kontrolü, bkz. 01.61, - su temini amacıyla suyun arıtılması, bkz. 36.00, - tehlikesiz atıkların ıslah ve bertaraf edilmesi, bkz. 38.21, - tehlikeli atıkların ıslah ve bertaraf edilmesi, bkz. 38.22, - sokakların süpürülmesi ve yıkanması, bkz. 81.29 @tr
preferred label: Възстановяване и други услуги по управление на отпадъци @bg
preferred label: Sanace a jiné činnosti související s nakládáním s odpady @cs
preferred label: Rensning af jord og grundvand og anden form for forureningsbekæmpelse @da
preferred label: Beseitigung von Umweltverschmutzungen und sonstige Entsorgung @de
preferred label: Δραστηριότητες εξυγίανσης και άλλες υπηρεσίες για τη διαχείριση αποβλήτων @el
preferred label: Actividades de descontaminación y otros servicios de gestión de residuos @es
preferred label: Saastekäitlus ja muud jäätmekäitlustegevused @et
preferred label: Maaperän ja vesistöjen kunnostus ja muut ympäristönhuoltopalvelut @fi
preferred label: Dépollution et autres services de gestion des déchets @fr
preferred label: Szennyeződésmentesítés, egyéb hulladékkezelés
preferred label: Attività di risanamento e altri servizi di gestione dei rifiuti @it
preferred label: Regeneravimas ir kita atliekų tvarkyba @lt
preferred label: Sanitārija un citi atkritumu apsaimniekošanas pakalpojumi @lv
preferred label: Attivitajiet ta' rimedjazzjoni u servizzi oħra ta' ġestjoni ta' skart @mt
preferred label: Sanering en ander afvalbeheer @nl
preferred label: Miljørydding, miljørensing og lignende virksomhet @no
preferred label: Działalność związana z rekultywacją i pozostałe usługi związane z gospodarką odpadami @pl
preferred label: Actividades de despoluição e outros serviços de gestão de resíduos @pt
preferred label: Activităţi şi servicii de decontaminare @ro
preferred label: Рекультивация и прочие услуги в области удаления отходов @ru
preferred label: Ozdravovacie činnosti a ostatné činnosti nakladania s odpadom @sk
preferred label: Saniranje okolja in drugo ravnanje z odpadki @sl
preferred label: Sanering, efterbehandling av jord och vatten samt annan verksamhet för föroreningsbekämpning @sv
preferred label: İyileştirme faaliyetleri ve diğer atık yönetimi hizmetleri @tr
broader: Remediation activities and other waste management services

Construction of buildings
type: Concept
notation: 41
status: valid
status modified: 2013-10-18
accepted date: 2013-10-18
in scheme: Statistical Classification of Economic Activities in the European Community, Rev. 2 (2008)
scope note: Този раздел включва общо строителство на жилищни, селскостопански, офис и други сгради. Включва още ремонт, поддържане и реконструкция на сгради, монтаж на сглобяеми строителни елементи и временни постройки върху строителната площадка. @bg
scope note: Tato sekce zahrnuje výstavbu budov všeho druhu. Patří sem práce na nových stavbách, opravy budov, provádění nástaveb a přestaveb, výstavba prefabrikovaných objektů v rámci zařízení staveniště a staveb dočasného charakteru. Výstavba budov zahrnuje výstavbu kompletních bytových, kancelářských, obchodních a ostatních veřejných budov, zemědělských budov, sportovních hal a tělocvičen atd. @cs
scope note: Diese Abteilung umfasst die Errichtung von Gebäuden aller Art. Dazu zählen Neubau, Instandsetzung, An- und Umbau, die Errichtung von vorgefertigten Gebäuden oder Bauwerken auf dem Baugelände sowie provisorischer Bauten. Es handelt sich um den Bau von kompletten Wohn-, Büro- und Geschäftsgebäuden, öffentlichen Gebäuden, Gebäuden der Versorgungswirtschaft, landwirtschaftlichen Gebäuden usw. @de
scope note: This division includes general construction of buildings of all kinds. It includes new work, repair, additions and alterations, the erection of pre-fabricated buildings or structures on the site and also construction of temporary nature. Included is the construction of entire dwellings, office buildings, stores and other public and utility buildings, farm buildings, etc. @en
scope note: Esta división comprende la construcción general de edificios de todo tipo. Comprende las obras nuevas, la reparación, las ampliaciones y reformas, la construcción in situ de edificios y estructuras prefabricados, así como las construcciones de carácter temporal. Comprende también la construcción de viviendas, edificios de oficinas, y establecimientos comerciales completos, así como de otros edificios públicos, construcciones agrarias, etc. @es
scope note: Cette division comprend la construction générale de bâtiments de toute nature. Elle comprend les nouveaux chantiers, les réparations, les extensions et les transformations, le montage de bâtiments préfabriqués ou de structures sur le site ainsi que la construction de nature temporaire. Elle comprend la construction d’habitations, de bureaux, de magasins et d’autres bâtiments publics, utilitaires, agricoles, etc. @fr
scope note: Ovaj odjeljak uključuje gradnju svih vrsta zgrada kao što su stambene i uredske zgrade, zgrade za trgovinu, komunalne i druge zgrade javne namjene, poljoprivredne zgrade, itd. Uključuje radove na novim građevinama, popravke, nadogradnju i preinake, podizanje montažnih zgrada na gradilištu od prethodno izrađenih dijelova i također gradnju privremenih zgrada.
scope note: Į šį skyrių įeina bendroji visų rūšių pastatų statyba. Tai gali būti nauja statyba, remontas, priestatų statyba, rekonstrukcija, surenkamųjų pastatų ar statybinių konstrukcijų montavimas statybvietėse, taip pat laikino pobūdžio statinių statyba. Taip pat įeina gyvenamųjų būstų, įstaigų pastatų, parduotuvių ir kitokių viešųjų bei komunalinių pastatų, žemės ūkio pastatų ir kt. statyba. @lt
scope note: Bu bölüm, genel bina inşaatlarının tüm çeşitlerini kapsamaktadır. Yeni bina, onarım, ilaveler ve değişiklikler için gerekli inşaatın yanı sıra prefabrikler ile şantiye binalarının montajını da kapsamaktadır. Konutların komple inşaatı, ofis binaları, dükkanlar ve diğer kamu ve kamu kurumu binaları, çiftlik binaları ve benzeri de burada kapsanmaktadır. @tr
preferred label: Строителство на сгради @bg
preferred label: Výstavba budov @cs
preferred label: Opførelse af bygninger @da
preferred label: Hochbau @de
preferred label: Κατασκευές κτιρίων @el
preferred label: Construcción de edificios @es
preferred label: Hoonete ehitus @et
preferred label: Talonrakentaminen @fi
preferred label: Construction de bâtiments @fr
preferred label: Épületek építése
preferred label: Costruzione di edifici @it
preferred label: Pastatų statyba @lt
preferred label: Ēku būvniecība @lv
preferred label: Kostruzzjoni ta' binjiet @mt
preferred label: Bouw van gebouwen @nl
preferred label: Oppføring av bygninger @no
preferred label: Roboty budowlane związane ze wznoszeniem budynków @pl
preferred label: Construção de edifícios @pt
preferred label: Construcţii de clădiri @ro
preferred label: Строительство зданий и сооружений @ru
preferred label: Gradnja stavb @sl
preferred label: Byggande av hus @sv
preferred label: Bina inşaatı @tr
broader: CONSTRUCTION
narrower: Development of building projects
narrower: Construction of residential and non-residential buildings

Development of building projects
type: Concept
notation: 41.1
status: valid
status modified: 2013-10-18
accepted date: 2013-10-18
in scheme: Statistical Classification of Economic Activities in the European Community, Rev. 2 (2008)
scope note: Этот класс включает: - строительство автострад, улиц, дорог, прочих транспортных и пешеходных дорожек - укладку поверхности улиц, дорог, автострад, мостов или туннелей: • асфальтирование дорог • покраску и маркировку дорог • установку аварийных заграждений, светофоров и прочего подобного оборудования - строительство взлетно-посадочных полос Этот класс исключает: - установку освещения и электрического сигнального оборудования, см. 43.21 - архитектурные и инженерные работы, см. 71.1 - услуги по управлению строительным проектом, см. 71.1 @ru
preferred label: Дейности по реализиране на инвестиционни проекти за сгради @bg
preferred label: Developerská činnost @cs
preferred label: Gennemførelse af byggeprojekter @da
preferred label: Erschließung von Grundstücken; Bauträger @de
preferred label: Ανάπτυξη οικοδομικών σχεδίων @el
preferred label: Promoción inmobiliaria @es
preferred label: Hoonestusprojektide arendus @et
preferred label: Rakennuttaminen ja rakennushankkeiden kehittäminen @fi
preferred label: Promotion immobilière @fr
preferred label: Épületépítési projekt szervezése
preferred label: Sviluppo di progetti immobiliari @it
preferred label: Statybų plėtra @lt
preferred label: Būvniecības projektu izstrādāšana @lv
preferred label: Żvilupp ta' proġetti tal-bini @mt
preferred label: Ontwikkeling van bouwprojecten @nl
preferred label: Utvikling av byggeprosjekter @no
preferred label: Realizacja projektów budowlanych związanych ze wznoszeniem budynków @pl
preferred label: Desenvolvimento de projectos de edifícios @pt
preferred label: Dezvoltare (promovare) imobiliară @ro
preferred label: Разработка строительных проектов @ru
preferred label: Vypracovanie stavebných projektov @sk
preferred label: Organizacija izvedbe stavbnih projektov @sl
preferred label: Utformning av byggprojekt @sv
preferred label: İnşaat projelerinin geliştirilmesi @tr
broader: Construction of buildings
narrower: Development of building projects

Development of building projects
type: Concept
notation: 41.10
status: valid
status modified: 2013-10-18
accepted date: 2013-10-18
in scheme: Statistical Classification of Economic Activities in the European Community, Rev. 2 (2008)
scope note: - дейности по реализиране на инвестиционни проекти за жилищни и нежилищни сгради, предназначени за по-късна продажба чрез събиране на финансови, технически и човешки ресурси - строителство на сгради - 41.20 - архитектурни и инженерни дейности, свързани със строителството - 71.1 - управление на проекти, свързани със строителството на сгради - 71.1 @bg
scope note: Z: - realizaci bytových a nebytových stavebních projektů (záměrů), jestliže jsou tyto stavby určeny k pozdějšímu prodeji, a to formou zajištění finančních, technických a hmotných zdrojů N: - výstavbu budov (41.20) - činnosti architektonických a inženýrských kanceláří (71.1) - služby projektového řízení stavebních projektů (71.1) @cs
scope note: Diese Klasse umfasst: - Realisierung von Wohnungsbauvorhaben und anderen Bauvorhaben zum späteren Verkauf durch Sicherstellung der Finanzierung und technischen Ausführung Diese Klasse umfasst nicht: - Bau von Gebäuden (s. 41.20) - Tätigkeiten von Architektur- und Ingenieurbüros (s. 71.1) - Projektmanagement für Bauvorhaben (s. 71.1) @de
scope note: This class includes: - development of building projects for residential and non-residential buildings by bringing together financial, technical and physical means to realise the building projects for later sale This class excludes: - construction of buildings, see 41.20 - architectural and engineering activities, see 71.1 - project management services related to building projects, see 71.1 @en
scope note: Esta clase comprende: - la promoción de proyectos de construcción de edificios residenciales y no residenciales mediante la consecución de los medios financieros, técnicos y físicos necesarios para la realización de tales proyectos con vistas a su venta posterior Esta clase no comprende: - la construcción de edificios (véase 41.20) - las actividades de arquitectura e ingeniería (véase 71.1) - los servicios de dirección de obras relacionados con proyectos de edificación (véase 71.1) @es
scope note: Cette classe comprend: - les activités de promotion immobilière pour la construction d’immeubles résidentiels ou d’autres types de constructions en réunissant les moyens financiers, techniques et humains nécessaires à la réalisation de projets immobiliers destinés ultérieurement à la vente Cette classe ne comprend pas: - la construction de bâtiments, voir 41.20 - les activités d’architecture et d’ingénierie, voir 71.1 - les activités de gestion de projets liées à des projets immobiliers, voir 71.1 @fr
scope note: Ovaj razred uključuje: - organizaciju izvedbe projekata za stambene i nestambene zgrade okupljanjem financijskih, tehničkih i fizičkih sredstva za realizaciju projekta radi kasnije prodaje građevine Ovaj razred isključuje: - gradnju zgrada, vidi 41.20 - arhitektonske i inženjerske usluge (urbanističko planiranje, projektiranje građevina i dr.), vidi 71.1 - usluge vođenja i nadzora izvedbe projekata za zgrade, vidi 71.1
scope note: Į šią klasę įeina: - gyvenamųjų ir negyvenamųjų pastatų statybos projektų įgyvendinimas, sutelkiant finansines, technines ir fizines priemones, reikalingas statybų projektams įgyvendinti pardavimo tikslais. Į šią klasę neįeina: - pastatų statyba, žr. 41.20 - architektūrinė ir inžinerinė veikla, žr. 71.1 - projektų vadyba, susijusi su statybų projektais, žr. 71.1 @lt
scope note: Этот класс включает: - строительство железных дорог и метро Этот класс исключает: - установку освещения и электрического сигнального оборудования, см. 43.21 - архитектурные и инженерные работы, см. 71.1 - услуги по управлению строительным проектом, см. 71.1 @ru
scope note: Bu sınıf aşağıdakileri kapsamaktadır; - daha sonra satışa yönelik olarak bina projelerinin gerçekleştirilmesi amacıyla mali, teknik ve fiziksel araçların bir araya getirilmesi suretiyle konut veya diğer amaçlı kullanıma yönelik bina projelerinin geliştirilmesi. Kapsam dışı olanlar; - bina inşaatı, bkz. 41.20 - mimarlık ve mühendislik faaliyetleri, bkz. 71.1, - bina projeleri ile bağlantılı proje yönetimi hizmetleri, bkz. 71.1. @tr
preferred label: Дейности по реализиране на инвестиционни проекти за сгради @bg
preferred label: Developerská činnost @cs
preferred label: Gennemførelse af byggeprojekter @da
preferred label: Erschließung von Grundstücken; Bauträger @de
preferred label: Ανάπτυξη οικοδομικών σχεδίων @el
preferred label: Promoción inmobiliaria @es
preferred label: Hoonestusprojektide arendus @et
preferred label: Rakennuttaminen ja rakennushankkeiden kehittäminen @fi
preferred label: Promotion immobilière @fr
preferred label: Épületépítési projekt szervezése
preferred label: Sviluppo di progetti immobiliari @it
preferred label: Statybų plėtra @lt
preferred label: Būvniecības projektu izstrādāšana @lv
preferred label: Żvilupp ta' proġetti tal-bini @mt
preferred label: Ontwikkeling van bouwprojecten @nl
preferred label: Utvikling av byggeprosjekter @no
preferred label: Realizacja projektów budowlanych związanych ze wznoszeniem budynków @pl
preferred label: Desenvolvimento de projectos de edifícios @pt
preferred label: Dezvoltare (promovare) imobiliară @ro
preferred label: Разработка строительных проектов @ru
preferred label: Vypracovanie stavebných projektov @sk
preferred label: Organizacija izvedbe stavbnih projektov @sl
preferred label: Utformning av byggprojekt @sv
preferred label: İnşaat projelerinin geliştirilmesi @tr
broader: Development of building projects

Construction of residential and non-residential buildings
type: Concept
notation: 41.2
status: valid
status modified: 2013-10-18
accepted date: 2013-10-18
in scheme: Statistical Classification of Economic Activities in the European Community, Rev. 2 (2008)
scope note: Тази група включва изграждане на жилищни и нежилищни сгради за собствена сметка (предназначени за продажба) или срещу заплащане. Част или дори целият строителен процес може да бъде възложен на външен изпълнител срещу заплащане (по договор или еднократно). Ако от строителния процес са реализирани само специализираните дейности, дейността на единицата се класифицира в раздел 43. @bg
scope note: Tato skupina zahrnuje kompletní výstavbu bytových a nebytových budov prováděnou na vlastní účet (za účelem prodeje) nebo na základě smlouvy či dohody. Stavební práce mohou být částečně nebo jako celek zadány subdodavatelům (tzv. outsourcing). Jsou-li prováděny pouze specializované stavební činnosti, zatřiďují se do oddílu 43. @cs
scope note: Diese Gruppe umfasst die vollständige Errichtung von Wohn- und Nichtwohngebäuden auf eigene Rechnung oder im Lohnauftrag. Die Bauarbeiten können zum Teil oder auch zur Gänze an Subunternehmer vergeben werden. Werden nur spezialisierte Bautätigkeiten ausgeführt, so fallen diese unter Abteilung 43. @de
scope note: This group includes the construction of complete residential or non-residential buildings, on own account for sale or on a fee or contract basis. Outsourcing parts or even the whole construction process is possible. If only specialised parts of the construction process are carried out, the activity is classified in division 43. @en
scope note: Este grupo comprende la construcción de edificios residenciales y no residenciales completos, por cuenta propia para su venta o por cuenta de terceros. Puede subcontratarse partes del trabajo, e incluso el proceso de construcción en su totalidad. Si sólo se llevan a cabo partes especializadas del proceso de construcción, la actividad se clasifica en la división 43. @es
scope note: Ce groupe comprend la construction d’immeubles résidentiels ou d’autres types de constructions, réalisés pour compte propre en vue d’une vente ultérieure, ou pour le compte de tiers. Des portions de travaux ou parfois la totalité des travaux peuvent être confiées à des sous-traitants. Si elles sont uniquement réalisées dans le cadre du processus de construction, les activités de construction spécialisée relèvent de la division 43. @fr
scope note: Ova skupina uključuje cjelovitu gradnju stambenih i nestambenih zgrada, za vlastiti račun radi kasnije prodaje ili uz naplatu ili na osnovi ugovora za račun drugih. Dio gradnje ili čak čitava gradnja može se dati na izvođenje drugim izvođačima. Ako se izvode samo specijalizirani radovi građevinskog procesa, djelatnost se razvrstava u odjeljak 43.
scope note: Į šią grupę įeina užbaigta gyvenamųjų ir negyvenamųjų pastatų statyba pardavimui savo lėšomis arba už atlygį ar pagal sutartį. Dalį darbų arba netgi visus statybos darbus gali atlikti subrangovas. Tuo atveju, jeigu yra atliekami tik tam tikri specifiniai statybos darbai, veikla yra klasifikuojama 43 skyriuje. @lt
scope note: Этот класс включает: - строительство мостов, включая мосты для разноуровневых автомагистралей - строительство туннелей Этот класс исключает: - установку освещения и электрического сигнального оборудования, см. 43.21 - архитектурные и инженерные работы, см. 71.1 - услуги по управлению строительным проектом, см. 71.1 @ru
scope note: Bu grup, kendi adına satış veya bir ücret ya da sözleşmeye dayalı olarak, ikamet veya ikamet amaçlı olmayan binaların tamamının inşaatını kapsamaktadır. Kısımların veya tüm inşaat işleminin taşeronlara yaptırılması mümkündür. Eğer inşaat sürecinin yalnızca uzmanlaşmış kısımları yürütülüyorsa bu faaliyet, bölüm 43 içerisinde sınıflandırılmaktadır. @tr
preferred label: Строителство на жилищни и нежилищни сгради @bg
preferred label: Výstavba bytových a nebytových budov @cs
preferred label: Opførelse af bygninger @da
preferred label: Bau von Gebäuden @de
preferred label: Κατασκευή κτιρίων για κατοικίες και μη @el
preferred label: Construcción de edificios @es
preferred label: Elamute ja mitteeluhoonete ehitus @et
preferred label: Asuin- ja muiden rakennusten rakentaminen @fi
preferred label: Construction de bâtiments résidentiels et non résidentiels @fr
preferred label: Lakó- és nem lakó épület építése
preferred label: Costruzione di edifici residenziali e non residenziali @it
preferred label: Gyvenamųjų ir negyvenamųjų pastatų statyba @lt
preferred label: Dzīvojamo un nedzīvojamo ēku būvniecība @lv
preferred label: Kostruzzjoni ta' binjiet residenzjali u mhux residenzjali @mt
preferred label: Burgerlijke en utiliteitsbouw @nl
preferred label: Oppføring av bygninger @no
preferred label: Roboty budowlane związane ze wznoszeniem budynków mieszkalnych i niemieszkalnych @pl
preferred label: Construção de edifícios residenciais e não residenciais @pt
preferred label: Lucrări de construcţii a clădirilor rezidenţiale şi nerezidenţiale @ro
preferred label: Строительство жилых и нежилых зданий @ru
preferred label: Výstavba obytných a neobytných budov @sk
preferred label: Gradnja stanovanjskih in nestanovanjskih stavb @sl
preferred label: Byggande av bostadshus och andra byggnader @sv
preferred label: İkamet veya ikamet amaçlı olmayan binaların inşaatı @tr
broader: Construction of buildings
narrower: Construction of residential and non-residential buildings

Construction of residential and non-residential buildings
type: Concept
notation: 41.20
status: valid
status modified: 2013-10-18
accepted date: 2013-10-18
in scheme: Statistical Classification of Economic Activities in the European Community, Rev. 2 (2008)
scope note: - общо изграждане на жилищни сгради: • сгради с едно жилище • сгради с две и повече жилища, вкл. многоетажни сгради - общо изграждане на нежилищни сгради: • производствени сгради - фабрики, цехове, заводи и други • лечебни заведения, училища, офис сгради • хотели, ресторанти, универсални магазини, търговски центрове • сгради на летища • закрити съоръжения за спорт и развлечение • надземни и подземни гаражи и паркинги • складове • сгради с култово и религиозно предназначение - монтаж на сглобяеми строителни елементи (панели) от цимент, бетон или изкуствен камък върху строителната площадка - монтаж на сглобяеми постройки и конструкции от метал, дърво и пластмаси - ремонт или реконструкция на съществуващи жилищни сгради - строителство на промишлени съоръжения (без сградите) – 42.99 - архитектурни и инженерни дейности, свързани със строителството - 71.1 - управление на проекти, свързани със строителството - 71.1 @bg
scope note: Z: - výstavbu bytových budov všeho druhu: • rodinných domků • bytových domů včetně výškových budov - výstavbu nebytových budov všeho druhu: • průmyslových budov jako továren, dílen, montážních závodů • nemocnic, škol, kancelářských budov • hotelů, obchodů, nákupních center, restaurací • letištních budov • sportovních hal a tělocvičen • nadzemních a podzemních garáží • skladů • kostelů a jiných sakrálních staveb - výstavbu (montáž) prefabrikovaných objektů na staveništi ZT: - přestavbu a renovaci stávajících bytových objektů N: - výstavbu průmyslových objektů kromě budov (42.99) - činnosti architektonických a inženýrských kanceláří (71.1) - služby projektového řízení stavebních záměrů (71.1) @cs
scope note: Diese Klasse umfasst: - Errichtung von Wohngebäuden aller Art: • Einfamilienhäuser • Mehrfamilienhäuser einschließlich Hochhäuser - Errichtung von Nichtwohngebäuden aller Art: • kommerzielle Gebäude wie Fabriken, Werkstätten, Montagewerke • Krankenhäuser, Schulen, Bürogebäude • Hotels, Geschäftslokale, Einkaufszentren, Gaststätten • Flughafengebäude • Sporthallen • Parkhäuser und Tiefgaragen • Lagerhäuser • Kirchen und andere Sakralbauten - Errichtung von Fertigteil-Bauten auf der Baustelle Diese Klasse umfasst ferner: - Umbau oder Renovierung bestehender Wohnanlagen Diese Klasse umfasst nicht: - Bau von Industrieanlagen, die keine Gebäude sind (s. 42.99) - Tätigkeiten von Architektur- und Ingenieurbüros (s. 71.1) - Projektmanagement für Bauvorhaben (s. 71.1) @de
scope note: This class includes: - construction of all types of residential buildings: • single-family houses • multi-family buildings, including high-rise buildings - construction of all types of non-residential buildings: • buildings for industrial production, e.g. factories, workshops, assembly plants etc. • hospitals, schools, office buildings • hotels, stores, shopping malls, restaurants • airport buildings • indoor sports facilities • parking garages, including underground parking garages • warehouses • religious buildings - assembly and erection of prefabricated constructions on the site This class also includes: - remodelling or renovating existing residential structures This class excludes: - construction of industrial facilities, except buildings, see 42.99 - architectural and engineering activities, see 71.1 - project management for construction, see 71.1 @en
scope note: Esta clase comprende: - la construcción de todo tipo de edificios residenciales: • viviendas unifamiliares • edificios de varias viviendas, incluidos rascacielos - la construcción de todo tipo de edificios no residenciales: • edificios para la producción industrial, como fábricas, talleres, plantas de montaje, etc. • hospitales, centros de enseñanza, edificios de oficinas • hoteles, establecimientos y centros comerciales, restaurantes • edificios aeroportuarios • instalaciones deportivas cubiertas • aparcamientos, incluidos los subterráneos • almacenes • edificios religiosos - el montaje in situ de construcciones prefabricadas Esta clase comprende también: - la remodelación y la renovación de estructuras residenciales ya existentes Esta clase no comprende: - la construcción de instalaciones industriales, excepto edificios (véase 42.99) - las actividades de arquitectura e ingeniería (véase 71.1) - la dirección de obras de construcción (véase 71.1) @es
scope note: Cette classe comprend: - la construction de bâtiments résidentiels de tous types • maisons unifamiliales • immeubles à appartements, y compris tours d’habitations - la construction de bâtiments non résidentiels de tous types: • bâtiments destinés à abriter des activités de production industrielle, par exemple: usines, ateliers, usines d’assemblage, etc. • hôpitaux, écoles, bureaux • hôtels, magasins, centres commerciaux, restaurants • bâtiments aéroportuaires • salles de sport • parkings couverts et souterrains • entrepôts • bâtiments religieux - l’assemblage et la construction d’ouvrages préfabriqués sur les chantiers Cette classe comprend également: - le remaniement ou la rénovation de structures résidentielles existantes Cette classe ne comprend pas: - la construction d’installations industrielles, à l’exception des bâtiments, voir 42.99 - les activités d’architecture et d’ingénierie, voir 71.1 - la gestion de projets de construction, voir 71.1 @fr
scope note: Ovaj razred uključuje: - gradnju svih vrsta stambenih zgrada: • obiteljskih kuća • zgrada s više stanova, uključujući nebodere - gradnju svih vrsta nestambenih zgrada: • zgrada za industrijsku proizvodnju, npr. tvornica, radionica, montažnih proizvodnih hala itd. • bolnica, škola, uredskih zgrada • hotela, zgrada za trgovine, trgovačkih centara, restorana • zgrada u zračnim lukama • zgrada za sportove koji se održavaju u zatvorenom prostoru • zgrada za parkiranje motornih vozila (nadzemne i podzemne garaže) • skladišta • zgrada za vjerske obrede - podizanje montažnih zgrada na gradilištu od prethodno izrađenih dijelova Ovaj razred također uključuje: - preinake ili renoviranje postojećih zgrada Ovaj razred isključuje: - gradnju industrijskih građevina, osim zgrada, vidi 42.99 - arhitektonske i inženjerske usluge (urbanističko planiranje, projektiranje građevina i dr.), vidi 71.1 - usluge vođenja i nadzora izvedbe građevinskih projekata, vidi 71.1
scope note: Į šią klasę įeina: - visų tipų gyvenamųjų pastatų statyba: • vienašeimiai namai • daugiabučiai pastatai, įskaitant aukštybinius pastatus - visų tipų negyvenamųjų pastatų statyba: • gamybinės paskirties pastatai, pvz., gamyklos, dirbtuvės, surinkimo gamyklos ir kt. • ligoninės, mokyklos, įstaigos • viešbučiai, parduotuvės, prekybos centrai, restoranai • oro uostų pastatai • vidaus sporto įrenginiai • dengtos automobilių stovėjimo aikštelės, įskaitant požemines automobilių stovėjimo aikšteles • prekių sandėliai • religinio kulto pastatai - surenkamųjų konstrukcijų surinkimas ir montavimas statybvietėje Į šią klasę taip pat įeina: - esamų gyvenamųjų pastatų ir statinių rekonstravimas ar renovavimas Į šią klasę neįeina: - pramoninių įrenginių, išskyrus pastatus, statyba, žr. 42.99 - architektūrinė ir inžinerinė veikla, žr. 71.1 - statybų projektų vadyba, žr. 71.1 @lt
scope note: Bu sınıf aşağıdakileri kapsamaktadır; - ikamet amaçlı her çeşit binanın inşaatı: • müstakil konutlar, • birden çok ailenin oturduğu binalar, gökdelenler dahil. - konut amaçlı olmayan kullanıma yönelik her çeşit binanın inşaatı: • fabrikalar, atölyeler, montaj fabrikaları vb. sanayi üretimini amaçlayan binalar, • hastaneler, okullar, iş hanları • oteller, mağazalar, alışveriş merkezleri, lokantalar, • havaalanı binaları, • kapalı spor tesisleri, • yeraltı otoparkları da dahil olmak üzere, otoparklar, • depolar, • dini yapılar. - prefabrik inşaatların alanda birleştirilmesi ve kurulması. Ayrıca bu sınıf aşağıdakileri de kapsamaktadır; - mevcut konut amaçlı kullanılan yapıların yeniden düzenlenmesi veya yenilenmesi. Kapsam dışı olanlar; - binalar hariç olmak üzere, sanayi tesislerinin inşaatı, bkz. 42.99, - mimarlık ve mühendislik faaliyetleri, bkz. 71.1, - inşaat için proje yönetimi, bkz. 71.1. @tr
preferred label: Строителство на жилищни и нежилищни сгради @bg
preferred label: Výstavba bytových a nebytových budov @cs
preferred label: Opførelse af bygninger @da
preferred label: Bau von Gebäuden @de
preferred label: Κατασκευή κτιρίων για κατοικίες και μη @el
preferred label: Construcción de edificios @es
preferred label: Elamute ja mitteeluhoonete ehitus @et
preferred label: Asuin- ja muiden rakennusten rakentaminen @fi
preferred label: Construction de bâtiments résidentiels et non résidentiels @fr
preferred label: Lakó- és nem lakó épület építése
preferred label: Costruzione di edifici residenziali e non residenziali @it
preferred label: Gyvenamųjų ir negyvenamųjų pastatų statyba @lt
preferred label: Dzīvojamo un nedzīvojamo ēku būvniecība @lv
preferred label: Kostruzzjoni ta' binjiet residenzjali u mhux residenzjali @mt
preferred label: Burgerlijke en utiliteitsbouw @nl
preferred label: Oppføring av bygninger @no
preferred label: Roboty budowlane związane ze wznoszeniem budynków mieszkalnych i niemieszkalnych @pl
preferred label: Construção de edifícios residenciais e não residenciais @pt
preferred label: Lucrări de construcţii a clădirilor rezidenţiale şi nerezidenţiale @ro
preferred label: Строительство жилых и нежилых зданий @ru
preferred label: Výstavba obytných a neobytných budov @sk
preferred label: Gradnja stanovanjskih in nestanovanjskih stavb @sl
preferred label: Byggande av bostadshus och andra byggnader @sv
preferred label: İkamet veya ikamet amaçlı olmayan binaların inşaatı @tr
broader: Construction of residential and non-residential buildings

Civil engineering
type: Concept
notation: 42
status: valid
status modified: 2013-10-18
accepted date: 2013-10-18
in scheme: Statistical Classification of Economic Activities in the European Community, Rev. 2 (2008)
scope note: Този раздел включва общо изграждане на строителни съоръжения. Включва още ремонт, поддържане и реконструкция на съоръжения, монтаж на сглобяеми строителни елементи и временни постройки върху строителната площадка. Включва изграждане на автомагистрали, пътища, мостове, тунели, релсови пътища, самолетни писти, пристанища, водни пътища и язовири, напоителни канали и други водоразпределителни съоръжения, съоръжения с производствено предназначение, тръбопроводи и електропроводи, съоръжения за спорт и развлечение и други. Тези дейности могат да бъдат реализирани за собствена сметка или срещу заплащане. Част или дори цялата строителна дейност може да бъде възложена на външен изпълнител срещу заплащане (по договор или еднократно). @bg
scope note: Tento oddíl zahrnuje výstavbu inženýrských děl. Patří sem práce na nových stavbách, jejich opravy, provádění nástaveb a přestaveb, výstavba prefabrikovaných objektů v rámci zařízení staveniště a staveb dočasného charakteru. Jedná se o velké stavby jako dálnice, silnice, mosty, tunely, železniční trati, vzletové a přistávací dráhy, přístavy a jiné vodní stavby, zavlažovací zařízení, kanalizace, průmyslová zařízení, potrubí a elektrická vedení, otevřené sportovní stadiony a hřiště atd. Práce mohou být prováděny na vlastní účet nebo na základě smlouvy či dohody. Část prací, někdy také veškeré práce, mohou být zadány subdodavatelům (tzv. outsourcing). @cs
scope note: Diese Abteilung umfasst den Bau von Tiefbauten. Dazu zählen Neubau, Instandsetzung, An- und Umbau, die Errichtung von vorgefertigten Bauwerken auf dem Baugelände sowie provisorischer Bauten. Es handelt sich um große bauliche Anlagen wie Autobahnen, Straßen, Brücken, Tunnel, Bahnverkehrsstrecken, Rollbahnen, Häfen und andere Wasserbauten, Bewässerungsanlagen, Kanalisationen, Industrieanlagen, Rohrleitungen und elektrische Kabelnetze, Sportanlagen usw. Die Arbeiten können auf eigene Rechnung oder im Lohnauftrag ausgeführt werden. Ein Teil der Arbeiten, manchmal auch die gesamte praktische Arbeit, kann an Subunternehmer vergeben werden. @de
scope note: This division includes general construction for civil engineering objects. It includes new work, repair, additions and alterations, the erection of pre-fabricated structures on the site and also construction of temporary nature. Included is the construction of heavy constructions such as motorways, streets, bridges, tunnels, railways, airfields, harbours and other water projects, irrigation systems, sewerage systems, industrial facilities, pipelines and electric lines, outdoor sports facilities, etc. This work can be carried out on own account or on a fee or contract basis. Portions of the work and sometimes even the whole practical work can be subcontracted out. @en
scope note: Esta división comprende la construcción general de obras de ingeniería civil. Comprende las obras nuevas, la reparación, las ampliaciones y reformas, la construcción in situ de estructuras prefabricadas, así como las construcciones de carácter temporal. Comprende la construcción de grandes obras como autopistas, carreteras, calles, puentes, túneles, líneas férreas, aeropuertos, puertos y otras obras hidráulicas, sistemas de riego y alcantarillado, instalaciones industriales, oleoductos, gasoductos y líneas eléctricas, instalaciones deportivas al aire libre, etc. Estas obras pueden realizarse por cuenta propia o por cuenta de terceros. Pueden subcontratarse partes del trabajo e incluso, en ocasiones, el trabajo en su integridad. @es
scope note: Cette division comprend la construction générale d’ouvrages de génie civil. Elle comprend les nouveaux chantiers, les réparations, les extensions et les transformations, le montage de structures préfabriquées sur le site ainsi que la construction de nature temporaire. Elle comprend la construction d’ouvrages lourds tels que autoroutes, routes, ponts, tunnels, voies ferroviaires, champs d’aviation, ports et autres projets maritimes et fluviaux, systèmes d’irrigation, systèmes d’assainissement, installations industrielles, oléoducs et lignes électriques, installations sportives, etc. Ces travaux peuvent être réalisés pour compte propre ou pour le compte de tiers. Des portions de travaux ou parfois la totalité des travaux pratiques peuvent être confiées à des sous-traitants. @fr
scope note: Ovaj odjeljak uključuje opće radove na građevinama niskogradnje. Uključuje radove na novim građevinama, popravke, nadogradnju i preinake, gradnju građevina niskogradnje od prethodno izrađenih dijelova i gradnju privremenih građevina niskogradnje. Uključena je gradnja masivnih građevina kao što su autoceste, ulice, mostovi, tuneli, željezničke pruge, uzletišta za avione, morske i druge luke, sustavi za navodnjavanje i druge vodne građevine, industrijske građevine, kanalizacijski sustavi, cjevovodi i električni vodovi, sportske građevine itd. Ovi se radovi mogu obavljati za vlastiti račun ili uz naplatu ili na osnovi ugovora za račun drugih. Dio radova, a katkada i cjelokupni radovi, mogu se dati na izvođenje podizvođačima.
scope note: Į šį skyrių įeina inžinerinių statinių bendroji statyba. Čia įeina nauja statyba, remontas, išplėtimas ir rekonstravimas, surenkamųjų konstrukcijų montavimas statybvietėje, taip pat laikino pobūdžio statinių statyba. Į šį skyrių įeina stambių inžinerinių statinių ir tiesinių, tokių kaip automagistralės, gatvės, tiltai, tuneliai, geležinkeliai, aerodromai, uostai ir kitokie hidrotechniniai statiniai, drėkinimo sistemos, nuotakynai, pramoniniai įrenginiai, vamzdynai ir elektros linijos, atvirieji sporto įrenginiai ir kt., statymas ir tiesimas. Statybos darbai gali būti atliekami savo lėšomis arba už atlygį ar pagal sutartį. Dalį darbų, kartais ir visus, gali atlikti subrangovas. @lt
scope note: Этот класс включает строительство распределительных линий для транспортировки жидких материалов, а также сопутствующих зданий и сооружений, являющихся неотъемлемой частью подобных систем. Этот класс включает: - строительство объектов гражданского строительства: • магистральных и городских трубопроводов • строительство водопроводных магистралей и линий • оросительных систем (каналов) • резервуаров - строительство: • канализационных систем, включая их ремонт • водоочистных сооружений • насосных станций Этот класс также включает: - бурение водяных скважин Этот класс исключает: - услуги по управлению проектом гражданского строительства, см. 71.12 @ru
scope note: Bu bölüm bina dışı yapıların inşaatı hedeflerine yönelik olarak genel inşaatı kapsamaktadır. Yeni çalışma, onarım, eklentiler ve değişiklikler, prefabrik yapıların alanda kurulumu ve geçici türdeki inşaatı da kapsamaktadır. Otoyollar, caddeler, köprüler, tüneller, demiryolları, havaalanları, limanlar ve diğer su projeleri, sulama sistemleri, kanalizasyon sistemleri, sanayi tesisleri, boru hatları ve elektrik hatları, açık hava spor tesisleri vb. gibi ağır inşaatlar da buna dahil olmaktadır. Bu çalışma kendi hesabına, bir ücret karşılığında veya bir sözleşme temelinde gerçekleştirebilir. İşin bazı kısımları ve bazen tamamı taşeronlukla yürütülebilir. @tr
preferred label: Строителство на съоръжения @bg
preferred label: Inženýrské stavitelství @cs
preferred label: Anlægsarbejder @da
preferred label: Tiefbau @de
preferred label: Έργα πολιτικού μηχανικού @el
preferred label: Ingeniería civil @es
preferred label: Rajatiste ehitus @et
preferred label: Maa- ja vesirakentaminen @fi
preferred label: Génie civil @fr
preferred label: Egyéb építmény építése
preferred label: Ingegneria civile @it
preferred label: Inžinerinių statinių statyba @lt
preferred label: Inženierbūvniecība @lv
preferred label: Inġinerija ċivili @mt
preferred label: Weg- en waterbouw @nl
preferred label: Anleggsvirksomhet @no
preferred label: Roboty związane z budową obiektów inżynierii lądowej i wodnej @pl
preferred label: Engenharia civil @pt
preferred label: Lucrări de geniu civil @ro
preferred label: Гражданское строительство @ru
preferred label: Inžinierske stavby @sk
preferred label: Gradnja inženirskih objektov @sl
preferred label: Anläggningsarbeten @sv
preferred label: Bina dışı yapıların inşaatı @tr
broader: CONSTRUCTION
narrower: Construction of roads and railways
narrower: Construction of utility projects
narrower: Construction of other civil engineering projects

Construction of roads and railways
type: Concept
notation: 42.1
status: valid
status modified: 2013-10-18
accepted date: 2013-10-18
in scheme: Statistical Classification of Economic Activities in the European Community, Rev. 2 (2008)
scope note: Этот класс включает строительство распределительных линий для подачи электроэнергии, а также линий телекоммуникаций и строительство зданий и сооружений, являющихся неотъемлемой частью данных систем. Этот класс включает: - строительство объектов гражданского строительства: • магистральных и городских коммуникационных и электрических линий • электростанций Этот класс исключает: - услуги по управлению проектом гражданского строительства, см. 71.12 @ru
preferred label: Строителство на пътища, вкл. релсови @bg
preferred label: Výstavba silnic a železnic @cs
preferred label: Anlæg af veje og jernbaner @da
preferred label: Bau von Straßen und Bahnverkehrsstrecken @de
preferred label: Κατασκευή δρόμων και σιδηροδρομικών γραμμών @el
preferred label: Construcción de carreteras y vías férreas, puentes y túneles @es
preferred label: Teede ja raudteede ehitus @et
preferred label: Teiden ja rautateiden rakentaminen @fi
preferred label: Construction de routes et de voies ferrées @fr
preferred label: Út, vasút építése
preferred label: Costruzione di strade e ferrovie @it
preferred label: Kelių ir geležinkelių tiesimas @lt
preferred label: Ceļu un dzelzceļu būvniecība @lv
preferred label: Kostruzzjoni ta' toroq u binarji tal-ferrovija @mt
preferred label: Bouw van wegen en spoorwegen @nl
preferred label: Bygging av veier og jernbaner @no
preferred label: Roboty związane z budową dróg kołowych i szynowych @pl
preferred label: Construção de estradas e caminhos-de-ferro @pt
preferred label: Lucrări de construcţii a drumurilor şi a căilor ferate @ro
preferred label: Строительство автомобильных и железных дорог @ru
preferred label: Výstavba ciest a železníc @sk
preferred label: Gradnja cest in železnic @sl
preferred label: Anläggning av vägar och järnvägar @sv
preferred label: Kara ve demir yollarının inşaatı @tr
broader: Civil engineering
narrower: Construction of roads and motorways
narrower: Construction of railways and underground railways
narrower: Construction of bridges and tunnels

Construction of roads and motorways
type: Concept
notation: 42.11
status: valid
status modified: 2013-10-18
accepted date: 2013-10-18
in scheme: Statistical Classification of Economic Activities in the European Community, Rev. 2 (2008)
scope note: - строителство на автомагистрали, улици, шосета и други пътища за автомобили и пешеходци - изпълнение на основа на пътна настилка на пътища, мостове или тунели: • полагане на асфалт на пътища • полагане на пътна маркировка на пътища • инсталиране на предпазни огради, пътни знаци и други пътни принадлежности - строителство на самолетни писти - инсталиране на улично осветление и пътна сигнализация - 43.21 - архитектурни и инженерни дейности, свързани със строителството - 71.1 - управление на проекти, свързани със строителството - 71.1 @bg
scope note: Z: - výstavbu dálnic, silnic, místních komunikací a cest (i chodníků, cyklistických stezek apod.) - úpravu povrchů vozovek (silnic, mostů, tunelů): • asfaltování vozovek • vodorovné značení vozovek apod. • instalaci svodidel, svislého dopravního značení (informačních a orientačních tabulí) apod. - výstavbu vzletových a přistávacích drah N: - montáž osvětlení komunikací a montáž elektrické signalizace (43.21) - činnosti architektonických a inženýrských kanceláří (71.1) - služby projektového řízení staveb (71.1) @cs
scope note: Diese Klasse umfasst: - Bau von Autobahnen, Landstraßen, Straßen und Wegen - Belagsarbeiten an Straßen, Brücken und Tunneln: • Asphaltieren von Straßen • Markierung von Straßen u. Ä. • Anbringen von Leitplanken, Verkehrszeichen u. Ä. - Bau von Rollbahnen Diese Klasse umfasst nicht: - Montage von Straßenbeleuchtungen und elektrischen Signalen (s. 43.21) - Tätigkeiten von Architektur- und Ingenieurbüros (s. 71.1) - Projektmanagement für Bauvorhaben (s. 71.1) @de
scope note: This class includes: - construction of motorways, streets, roads, other vehicular and pedestrian ways - surface work on streets, roads, highways, bridges or tunnels: • asphalt paving of roads • road painting and other marking • installation of crash barriers, traffic signs and the like - construction of airfield runways This class excludes: - installation of street lighting and electrical signals, see 43.21 - architectural and engineering activities, see 71.1 - project management for construction, see 71.1 @en
scope note: Esta clase comprende: - la construcción de autopistas, calles, carreteras y otras vías de circulación de vehículos y peatones - las obras de superficie en calles, carreteras, autopistas, puentes y túneles: • asfaltado de carreteras • pintura y otra señalización de carreteras • la instalación de quitamiedos, señales de tráfico y similares - la construcción de pistas de aterrizaje Esta clase no comprende: - la instalación de alumbrado y señales eléctricas en calles (véase 43.21) - las actividades de arquitectura e ingeniería (véase 71.1) - la dirección de obras de construcción (véase 71.1) @es
scope note: Cette classe comprend: - la construction d’autoroutes, de rues, de chaussées et d’autres voies pour véhicules et piétons - les travaux de revêtement de chaussées, ponts ou tunnels: • asphaltage des chaussées • marquage à la peinture des chaussées et autres travaux de marquage • installation de barrières de sécurité, de panneaux de circulation, etc. - la construction de pistes d’atterrissage Cette classe ne comprend pas: - l’installation d’appareils d’éclairage de rue et de signaux électriques, voir 43.21 - les activités d’architecture et d’ingénierie, voir 71.1 - la gestion de projets de construction, voir 71.1 @fr
scope note: Ovaj razred uključuje: - gradnju autocesta, ulica, cesta i ostalih prometnica i pješačkih putova - radove na gradnji površinskog sloja ulica, cesta, autocesta, mostova i tunela: • asfaltiranje pločnika na cestama • bojanje i ostalo označavanje cesta • postavljanje odbojnika, prometnih znakova i slično - gradnju uzletišta u zračnim lukama Ovaj razred isključuje: - postavljanje ulične rasvjete i električne signalizacije, vidi 43.21 - arhitektonske i inženjerske usluge (urbanističko planiranje, projektiranje građevina i dr.), vidi 71.1 - usluge vođenja i nadzora izvedbe građevinskih projekata, vidi 71.1
scope note: Į šią klasę įeina: - automagistralių, gatvių, kelių, kitų transporto priemonių kelių ir pėsčiųjų takų tiesimas - gatvių, kelių, greitkelių, tiltų ar tunelių paviršiaus darbai: • kelių asfaltavimas • kelių ženklinimas ir kitas žymėjimas • apsauginių atitvarų, kelio ženklų ir pan. įrengimas - aerodromų takų tiesimas Į šią klasę neįeina: - gatvių apšvietimo ir elektrinių signalų įrengimas, žr. 43.21 - architektūrinė ir inžinerinė veikla, žr. 71.1 - statybų projektų vadyba, žr. 71.1 @lt
scope note: Bu sınıf aşağıdakileri kapsamaktadır; - otoyollar, şehir içi yollar ve kara yolları, ile diğer taşıt ve yaya yollarının inşaatı, - şehir içi yollar, kara yolları, otobanlar, köprüler ve tünellerdeki yüzey işleri: • yolların asfaltlanması, • yolların boyanması ve diğer işaretlemeler, • yol kenarlarındaki koruyucu bariyerler, trafik işaret ve levhalarının ve benzerlerinin kurulumu, - havaalanı pisti inşaatı. Kapsam dışı olanlar; - sokak aydınlatmasının ve elektrikli sinyalizasyon sistemlerinin kurulumu, bkz. 43.21, - mimarlık ve mühendislik faaliyetleri, bkz. 71.1, - inşaatın proje yönetimi, bkz. 71.1. @tr
preferred label: Строителство на автомагистрали, пътища и самолетни писти @bg
preferred label: Výstavba silnic a dálnic @cs
preferred label: Anlæg af veje og motorveje @da
preferred label: Bau von Straßen @de
preferred label: Κατασκευή δρόμων και αυτοκινητοδρόμων @el
preferred label: Construcción de carreteras y autopistas @es
preferred label: Teede ja kiirteede ehitus @et
preferred label: Teiden ja moottoriteiden rakentaminen @fi
preferred label: Construction de routes et autoroutes @fr
preferred label: Út, autópálya építése
preferred label: Costruzione di strade e autostrade @it
preferred label: Kelių ir automagistralių tiesimas @lt
preferred label: Ceļu un maģistrāļu būvniecība @lv
preferred label: Kostruzzjoni ta' toroq u awtostradi @mt
preferred label: Bouw van autowegen en andere wegen @nl
preferred label: Bygging av veier og motorveier @no
preferred label: Roboty związane z budową dróg i autostrad @pl
preferred label: Construção de estradas e auto-estradas @pt
preferred label: Lucrări de construcţii a drumurilor şi autostrăzilor @ro
preferred label: Строительство дорог и шоссе @ru
preferred label: Výstavba ciest a diaľnic @sk
preferred label: Gradnja cest @sl
preferred label: Anläggning av vägar och motorvägar @sv
preferred label: Kara yolları ve otoyolların inşaatı @tr
broader: Construction of roads and railways

Construction of railways and underground railways
type: Concept
notation: 42.12
status: valid
status modified: 2013-10-18
accepted date: 2013-10-18
in scheme: Statistical Classification of Economic Activities in the European Community, Rev. 2 (2008)
scope note: - строителство на подземни и надземни релсови пътища - инсталиране на улично осветление и пътна сигнализация - 43.21 - архитектурни и инженерни дейности, свързани със строителството - 71.1 - управление на проекти, свързани със строителството - 71.1 @bg
scope note: Z: - výstavbu železnic a podzemních drah N: - montáž osvětlení a elektrické signalizace (43.21) - činnosti architektonických a inženýrských kanceláří (71.1) - služby projektového řízení staveb (71.1) @cs
scope note: Diese Klasse umfasst: - Bau von Bahnverkehrsstrecken Diese Klasse umfasst nicht: - Montage von Beleuchtungen und elektrischen Signalen (s. 43.21) - Tätigkeiten von Architektur- und Ingenieurbüros (s. 71.1) - Projektmanagement für Bauvorhaben (s. 71.1) @de
scope note: This class includes: - construction of railways and subways This class excludes: - installation of lighting and electrical signals, see 43.21 - architectural and engineering activities, see 71.1 - project management for construction, see 71.1 @en
scope note: Esta clase comprende: - la construcción de vías férreas de superficie y subterráneas Esta clase no comprende: - la instalación de alumbrado y señales eléctricas (véase 43.21) - las actividades de arquitectura e ingeniería (véase 71.1) - la dirección de obras de construcción (véase 71.1) @es
scope note: Cette classe comprend: - la construction de voies ferrées de surface et souterraines Cette classe ne comprend pas: - l’installation d’appareils d’éclairage et de signaux électriques, voir 43.21 - les activités d’architecture et d’ingénierie, voir 71.1 - la gestion de projets de construction, voir 71.1 @fr
scope note: Ovaj razred uključuje: - gradnju željezničkih pruga i podzemnih željeznica Ovaj razred isključuje: - postavljanje rasvjete i električne signalizacije, vidi 43.21 - arhitektonske i inženjerske usluge (urbanističko planiranje, projektiranje građevina i dr.), vidi 71.1 - usluge vođenja i nadzora izvedbe građevinskih projekata, vidi 71.1
scope note: Į šią klasę įeina: - geležinkelių ir metropolitenų tiesyba Į šią klasę neįeina: - gatvių apšvietimo ir elektrinių signalų įrengimas, žr. 43.21 - architektūrinė ir inžinerinė veikla, žr. 71.1 - statybų projektų vadyba, žr. 71.1 @lt
scope note: Этот класс включает: - строительство: • водных путей, портов и речных сооружений, морских вокзалов, шлюзов и т.д. • дамб и плотин - дноочистительные работы Этот класс исключает: - услуги по управлению проектом гражданского строительства, см. 71.12 @ru
scope note: Bu sınıf aşağıdakileri kapsamaktadır; - demir yolları ve metroların inşaatı. Kapsam dışı olanlar; - aydınlatma ve elektrikli sinyalizasyon sistemlerinin kurulumu, bkz. 43.21, - mimarlık ve mühendislik faaliyetleri, bkz. 71.1, - inşaatın proje yönetimi, bkz. 71.1. @tr
preferred label: Строителство на подземни и надземни релсови пътища @bg
preferred label: Výstavba železnic a podzemních drah @cs
preferred label: Anlæg af jernbaner og undergrundsbaner @da
preferred label: Bau von Bahnverkehrsstrecken @de
preferred label: Κατασκευή σιδηροδρομικών γραμμών και υπόγειων σιδηροδρόμων @el
preferred label: Construcción de vías férreas de superficie y subterráneas @es
preferred label: Raudteede ja metroo ehitus @et
preferred label: Rautateiden ja metrolinjojen rakentaminen @fi
preferred label: Construction de voies ferrées de surface et souterraines @fr
preferred label: Vasút építése
preferred label: Costruzione di linee ferroviarie e metropolitane @it
preferred label: Geležinkelių ir požeminių geležinkelių tiesimas @lt
preferred label: Dzelzceļu un metro būvniecība @lv
preferred label: Kostruzzjoni ta' binarji tal-ferrovija u binarji tal-ferrovija taħt l-art @mt
preferred label: Bouw van boven- en ondergrondse spoorwegen @nl
preferred label: Bygging av jernbaner og undergrunnsbaner @no
preferred label: Roboty związane z budową dróg szynowych i kolei podziemnej @pl
preferred label: Construção de vias férreas @pt
preferred label: Lucrări de construcţii a căilor ferate de suprafaţă şi subterane. @ro
preferred label: Строительство железных дорог и метро @ru
preferred label: Výstavba železníc a podzemných železníc @sk
preferred label: Gradnja železnic in podzemnih železnic @sl
preferred label: Anläggning av järnvägar och tunnelbanor @sv
preferred label: Demir yolları ve metroların inşaatı @tr
broader: Construction of roads and railways

Construction of bridges and tunnels
type: Concept
notation: 42.13
status: valid
status modified: 2013-10-18
accepted date: 2013-10-18
in scheme: Statistical Classification of Economic Activities in the European Community, Rev. 2 (2008)
scope note: - строителство на мостове - строителство на тунели - инсталиране на улично осветление и пътна сигнализация - 43.21 - архитектурни и инженерни дейности, свързани със строителството - 71.1 - управление на проекти, свързани със строителството - 71.1 @bg
scope note: Z: - výstavbu mostů, nadúrovňových komunikací (např. visutých dálnic) - výstavbu tunelů N: - montáž osvětlení a elektrické signalizace (43.21) - činnosti architektonických a inženýrských kanceláří (viz 71.1) - služby projektového řízení staveb (71.1) @cs
scope note: Diese Klasse umfasst: - Bau von Brücken, auch für Hochstraßen - Bau von Tunneln Diese Klasse umfasst nicht: - Montage von Beleuchtungen und elektrischen Signalen (s. 43.21) - Tätigkeiten von Architektur- und Ingenieurbüros (s. 71.1) - Projektmanagement für Bauvorhaben (s. 71.1) @de
scope note: This class includes: - construction of bridges, including those for elevated highways - construction of tunnels This class excludes: - installation of lighting and electrical signals, see 43.21 - architectural and engineering activities, see 71.1 - project management for construction, see 71.1 @en
scope note: Esta clase comprende: - la construcción de puentes, incluidos los que soportan carreteras elevadas - la construcción de túneles Esta clase no comprende: - la instalación de alumbrado y señales eléctricas (véase 43.21) - las actividades de arquitectura e ingeniería (véase 71.1) - la dirección de obras de construcción (véase 71.1) @es
scope note: Cette classe comprend: - la construction de ponts, y compris ceux destinés à supporter des routes surélevées - la construction de tunnels Cette classe ne comprend pas: - l’installation d’appareils d’éclairage et de signaux électriques, voir 43.21 - les activités d’architecture et d’ingénierie, voir 71.1 - la gestion de projets de construction, voir 71.1 @fr
scope note: Ovaj razred uključuje: - gradnju mostova, uključujući vijadukte i uzdignute autoceste (na stupovima) - gradnju tunela Ovaj razred isključuje: - postavljanje rasvjete i električne signalizacije, vidi 43.21 - arhitektonske i inženjerske usluge (urbanističko planiranje, projektiranje građevina i dr.), vidi 71.1 - usluge vođenja i nadzora izvedbe građevinskih projekata, vidi 71.1
scope note: Į šią klasę įeina: - tiltų statyba, įskaitant estakadinių kelių tiesybą - tunelių statyba Į šią klasę neįeina: - gatvių apšvietimo ir elektrinių signalų instaliavimas, žr. 43.21 - architektūrinė ir inžinerinė veikla, žr. 71.1 - statybų projektų vadyba, žr. 71.1 @lt
scope note: Этот класс включает: - строительство промышленных сооружений, за исключением зданий: • нефтеперерабатывающих заводов • химических заводов - строительные работы, кроме строительства зданий, например: • открытых спортивных комплексов Этот класс также включает: - разделение земель с благоустройством территории (например, строительство дополнительных дорог, коммунальной инфраструктуры и т.д.) Этот класс исключает: - установку промышленного оборудования, см. 33.20 - разделение земель без благоустройства территории, см. 68.10 - услуги по управлению проектом гражданского строительства, см. 71.12 @ru
scope note: Bu sınıf aşağıdakileri kapsamaktadır; - farklı seviyeli yollar dahil köprülerin inşaatı, - tünellerin inşaatı. Kapsam dışı olanlar; - aydınlatma ve elektrikli sinyalizasyon sistemlerinin tesisatı, bkz. 43.21, - mimarlık ve mühendislik faaliyetleri, bkz. 71.1, - inşaatın proje yönetimi, bkz. 71.1. @tr
preferred label: Строителство на мостове и тунели @bg
preferred label: Výstavba mostů a tunelů @cs
preferred label: Anlæg af broer og tunneller @da
preferred label: Brücken- und Tunnelbau @de
preferred label: Κατασκευή γεφυρών και σηράγγων @el
preferred label: Construcción de puentes y túneles @es
preferred label: Silla- ja tunneliehitus @et
preferred label: Siltojen ja tunneleiden rakentaminen @fi
preferred label: Construction de ponts et tunnels @fr
preferred label: Híd, alagút építése
preferred label: Costruzione di ponti e gallerie @it
preferred label: Tiltų ir tunelių statyba @lt
preferred label: Tiltu un tuneļu būvniecība @lv
preferred label: Kostruzzjoni ta' pontijiet u mini @mt
preferred label: Bouw van bruggen en tunnels @nl
preferred label: Bygging av bruer og tunneler @no
preferred label: Roboty związane z budową mostów i tuneli @pl
preferred label: Construção de pontes e túneis @pt
preferred label: Construcţia de poduri şi tuneluri @ro
preferred label: Строительство мостов и туннелей @ru
preferred label: Výstavba mostov a tunelov @sk
preferred label: Gradnja mostov in predorov @sl
preferred label: Anläggning av broar och tunnlar @sv
preferred label: Köprüler ve tünellerin inşaatı @tr
broader: Construction of roads and railways

Construction of utility projects
type: Concept
notation: 42.2
status: valid
status modified: 2013-10-18
accepted date: 2013-10-18
in scheme: Statistical Classification of Economic Activities in the European Community, Rev. 2 (2008)
scope note: Данный раздел включает специализированные строительные работы (специализированных профессий), например, строительство некоторых частей зданий и объектов гражданского строительства или подготовка к строительству. Обычно подобные виды работ основаны на одном аспекте, объединяющем различные сооружения, требующие специальных навыков или оборудования для выполнения таких работ как укладка свай, строительные работы нулевого уровня, монтаж внутренних коммуникаций, бетонные работы, укладка кирпичей, возведение подмостков, кровельные работы и т.д. Также сюда относится возведение стальных конструкций при условии, что детали выпускает не та же самая организация. Специализированные строительные работы в основном выполняются на основе субподряда, но в особенности при осуществлении ремонтных работ выполняются непосредственно для владельца имущества. Также сюда относится полная отделка зданий. Также включена и установка всех видов коммуникаций, благодаря которым сооружение становится функциональным. Подобные работы обычно выполняются на стройплощадках, хотя некоторая часть работ может выполняться в специализированных мастерских. Сюда относятся также слесарные работы, а также работы по установке отопительных и кондиционерных систем, антенн, систем сигнализации и прочие электротехнические работы, работы по установке систем пожарной сигнализации, лифтов, эскалаторов и т.д. Сюда относятся также работы по водо-, тепло- и звукоизоляции, обшивке листовым металлом, установке торговых холодильных установок, установке освещения и сигнальных систем для автомобильных и железных дорог, аэропортов, портов и т.д. А также сюда относятся ремонтные работы ко всем типам вышеперечисленных работ. Работы по полной отделке зданий включают работы, имеющие отношение к отделке, такие как полировка, штукатурные, малярные работы, плиточное покрытие полов и стен или покрытие такими отделочными материалами как паркет, ковролан, обои и т.д., а также циклование полов, отделочные плотничные работы, звукоизолирующ… @ru
preferred label: Строителство на преносни и разпределителни проводи и мрежи @bg
preferred label: Výstavba inženýrských sítí @cs
preferred label: Anlæg af ledningsnet @da
preferred label: Leitungstiefbau und Kläranlagenbau @de
preferred label: Κατασκευή κοινωφελών έργων @el
preferred label: Construcción de redes @es
preferred label: Tehnovõrgutrasside ehitus @et
preferred label: Yleisten jakeluverkkojen rakentaminen @fi
preferred label: Construction de réseaux et de lignes @fr
preferred label: Közműépítés
preferred label: Costruzione di infrastutture @it
preferred label: Komunalinių statinių statyba @lt
preferred label: Pilsētsaimniecības infrastruktūras objektu būvniecība @lv
preferred label: Kostruzzjoni ta' proġetti ta' utilità pubblika @mt
preferred label: Bouw van civieltechnische werken ten behoeve van nutsbedrijven @nl
preferred label: Bygging av vann- og kloakkanlegg, og anlegg for elektrisitet og telekommunikasjon @no
preferred label: Roboty związane z budową rurociągów, linii telekomunikacyjnych i elektroenergetycznych @pl
preferred label: Construção de redes de transporte de água, de distribuição de energia, de telecomunicações e de outras redes @pt
preferred label: Lucrări de construcţii a proiectelor utilitare @ro
preferred label: Строительство инженерных сооружений @ru
preferred label: Výstavba verejných sietí @sk
preferred label: Gradnja objektov oskrbne infrastrukture @sl
preferred label: Allmännyttiga anläggningsarbeten @sv
preferred label: Hizmet projelerinin inşaatı @tr
broader: Civil engineering
narrower: Construction of utility projects for fluids
narrower: Construction of utility projects for electricity and telecommunications

Construction of utility projects for fluids
type: Concept
notation: 42.21
status: valid
status modified: 2013-10-18
accepted date: 2013-10-18
in scheme: Statistical Classification of Economic Activities in the European Community, Rev. 2 (2008)
scope note: Изграждане на преносни и разпределителни проводи и принадлежащите им сгради и съоръжения, които са неразделна част от тези системи. - изграждане на съоръжения за: • преносни и разпределителни тръбопроводи • водоснабдителни системи • напоителни канали • водохранилища - изграждане на: • канализационни системи, вкл. ремонта им • съоръжения за отстраняване на отпадъчни води • помпени станции - пробиване на кладенци за вода - управление на проекти, свързани със строителството на съоръжения - 71.12 @bg
scope note: Tato třída zahrnuje výstavbu vedení pro kapaliny a plyny a souvisejících staveb a zařízení, které jsou jejich nedílnou součástí. Z: - výstavbu: • dálkových a komunálních potrubních vedení • vodovodů • zavlažovacích systémů (vodních kanálů) • sběrných nádrží • kanalizačních sítí (včetně údržby) • čistících kanalizačních stanic • čerpacích stanic ZT: - výstavbu studní N: - služby projektového řízení inženýrských děl (71.12) @cs
scope note: Diese Klasse umfasst den Bau von Leitungen und von Bauwerken, die zu Versorgungsanlagen gehören. Diese Klasse umfasst: - Bau von: • Rohrfernleitungen und städtischen Rohrleitungen • Wasserleitungen • Bewässerungssystemen (Kanälen) • Sammelbecken - Bau von: • Kanalnetzen (einschließlich Reparatur) • Abwasserbeseitigungsanlagen • Pumpstationen Diese Klasse umfasst ferner: - Brunnenbau Diese Klasse umfasst nicht: - Projektmanagement für Tiefbautätigkeiten (s. 71.12) @de
scope note: This class includes the construction of distribution lines for transportation of fluids and related buildings and structures that are integral part of these systems. This class includes: - construction of civil engineering constructions for: • long-distance and urban pipelines • water main and line construction • irrigation systems (canals) • reservoirs - construction of: • sewer systems, including repair • sewage disposal plants • pumping stations This class also includes: - water well drilling This class excludes: - project management activities related to civil engineering works, see 71.12 @en
scope note: Esta clase comprende la construcción de redes de distribución para el transporte de fluidos y de los edificios y estructuras que son parte integral de estos sistemas. Esta clase comprende: - la construcción de obras de ingeniería civil para: • gasoductos y oleoductos de larga distancia y redes urbanas para la distribución de gas o petróleo • redes de suministro de agua • sistemas de riego (canales) • grandes depósitos - la construcción de: • sistemas de alcantarillado, incluida su reparación • plantas de tratamiento de aguas residuales • estaciones de bombeo Esta clase comprende también: - la perforación de pozos hidráulicos Esta clase no comprende: - la dirección de obras de ingeniería civil (véase 71.12) @es
scope note: Cette classe comprend la construction de lignes de distribution pour le transport de fluides et des bâtiments et structures faisant partie intégrante de ces systèmes. Cette classe comprend: - la construction d’ouvrages de génie civil pour: • des conduites couvrant de longues distances et urbaines • des conduites d’eau et la construction de lignes • des systèmes d’irrigation (canaux) • des réservoirs - la construction de: • réseaux d’assainissement, y compris leur réparation • stations d’épuration • stations de pompage Cette classe comprend également: - le forage de puits d’eau Cette classe ne comprend pas: - la gestion de projets d’ouvrages de génie civil, voir 71.12 @fr
scope note: Ovaj razred uključuje gradnju cjevovoda za distribuciju tekućina i plinova te odgovarajućih zgrada i drugih građevina koje su sastavni dio ovih sustava. Ovaj razred uključuje: - gradnju: • međugradskih i gradskih cjevovoda • vodovoda • sustava za navodnjavanje (kanala) • rezervoara • kanalizacijskih sustava • građevina za pročišćavanje otpadnih voda • crpnih stanica Ovaj razred također uključuje: - bušenje izvora vode Ovaj razred isključuje: - usluge vođenja i nadzora izvedbe građevinskih projekata koje se odnose na radove u niskogradnji, vidi 71.12
scope note: Į šią klasę įeina skirstomųjų takių medžiagų transportavimo vamzdynų tiesyba ir su jomis susijusių pastatų ir statinių, kurie yra neatskiriama šių sistemų dalis, statyba. Į šią klasę įeina: - inžinerinių statinių statyba: • ilgų nuotolių ir miesto vamzdynų • vandentiekio magistralių ir linijų konstrukcijų • drėkinimo sistemų (kanalų) • rezervuarų - statyba: • nuotakynų sistemų, įskaitant remontą • nuotekų šalinimo įrenginių • siurblinių Į šią klasę taip pat įeina: - vandens šulinių gręžimas Į šią klasę neįeina: - inžinerinių statinių projektų vadyba, žr. 71.12 @lt
scope note: Данная группа включает работы по подготовке стройплощадки для выполнения последующих строительных работ, включая удаление ранее существующих конструкций и сооружений. @ru
scope note: Bu sınıf, sıvıların taşınması için, dağıtım hatları ve bu sistemlerin gerekli parçaları olan bunlarla ilgili inşaat ve yapıları kapsamaktadır.Bu sınıf aşağıdakileri kapsamaktadır; - aşağıdakiler için bina dışı yapıların inşaatı: • uzun mesafeli ve kentsel boru hatları, • ana su borusu ve hattı inşaatı, • sulama sistemleri (kanallar), • su depoları (rezervuarlar). - aşağıdakilerin inşaatı: • onarım dahil kanalizasyon sistemleri, • kanalizasyon bertaraf tesisleri, • pompa istasyonları. Ayrıca bu sınıf aşağıdakileri de kapsamaktadır; - su kuyusu kazılması. Kapsam dışı olanlar; - bina dışı yapıların inşaat işleri ile ilgili proje yönetimi faaliyetleri, bkz. 71.12 @tr
preferred label: Строителство на преносни и разпределителни тръбопроводи @bg
preferred label: Výstavba inženýrských sítí pro kapaliny @cs
preferred label: Anlæg af ledningsnet til væsker @da
preferred label: Rohrleitungstiefbau, Brunnenbau und Kläranlagenbau @de
preferred label: Κατασκευή κοινωφελών έργων σχετικών με υγρά @el
preferred label: Construcción de redes para fluidos @es
preferred label: Vee-, gaasi- ja kanalisatsioonitrasside ehitus @et
preferred label: Yleisten jakeluverkkojen rakentaminen nestemäisiä ja kaasumaisia aineita varten @fi
preferred label: Construction de réseaux pour fluides @fr
preferred label: Folyadék szállítására szolgáló közmű építése
preferred label: Costruzione di infrastrutture per il trasporto di fluidi @it
preferred label: Komunalinių nuotekų statinių statyba @lt
preferred label: Ūdensapgādes sistēmu būvniecība @lv
preferred label: Kostruzzjoni ta' proġetti ta' utilità pubblika fir-rigward ta' fluwidi @mt
preferred label: Bouw van civieltechnische werken voor vloeistoffen @nl
preferred label: Bygging av vann- og kloakkanlegg @no
preferred label: Roboty związane z budową rurociągów i sieci rozdzielczych @pl
preferred label: Construção de de redes de transporte de água e de outros fluídos @pt
preferred label: Lucrări de construcţii a proiectelor utilitare pentru fluide @ro
preferred label: Строительство распределительных инженерных объектов @ru
preferred label: Výstavba rozvodov (pre plyn a kvapaliny) @sk
preferred label: Gradnja objektov oskrbne infrastrukture za tekočine in pline @sl
preferred label: Allmännyttiga anläggningsarbeten för värme, vatten och avlopp @sv
preferred label: Sıvılar için hizmet projelerinin inşaatı @tr
broader: Construction of utility projects

Construction of utility projects for electricity and telecommunications
type: Concept
notation: 42.22
status: valid
status modified: 2013-10-18
accepted date: 2013-10-18
in scheme: Statistical Classification of Economic Activities in the European Community, Rev. 2 (2008)
scope note: Изграждане на преносни и разпределителни електрически и далекосъобщителни мрежи и принадлежащите им сгради и съоръжения, които са неразделна част от тези системи. - изграждане на съоръжения за: • преносни и разпределителни електрически и далекосъобщителни мрежи • електроцентрали - управление на проекти, свързани със строителството на съоръжения - 71.12 @bg
scope note: Tato třída zahrnuje výstavbu vedení pro rozvod elektřiny a telekomunikačních vedení a souvisejících staveb a zařízení, které jsou jejich nedílnou součástí. Z: - výstavbu inženýrských děl pro: • kabelové sítě elektrického a telekomunikačního vedení (městské i dálkové) • elektrárny N: - služby projektového řízení inženýrských děl (71.12) @cs
scope note: Diese Klasse umfasst den Bau von Leitungen zur Verteilung von elektrischem Strom und von Fernmeldeleitungen sowie den Bau der damit untrennbar verbundenen Gebäude und Bauwerke. Diese Klasse umfasst: - Bau von Tiefbauwerken für: • Strom- und Kommunikationsleitungsnetzen (innerstädtische und über Land) • Kraftwerken Diese Klasse umfasst nicht: - Projektmanagement für Tiefbautätigkeiten (s. 71.12) @de
scope note: This class includes the construction of distribution lines for electricity and telecommunications and related buildings and structures that are integral part of these systems. This class includes: - construction of civil engineering constructions for: • long-distance and urban communication and power lines • power plants This class excludes: - project management activities related to civil engineering works, see 71.12 @en
scope note: Esta clase comprende la construcción de redes de distribución de electricidad y de telecomunicaciones y de edificios y estructuras que son parte integral de estos sistemas. Esta clase comprende: - la construcción de obras de ingeniería civil para: • redes eléctricas y de comunicación urbanas y de larga distancia • centrales de eléctricas Esta clase no comprende: - la dirección de obras de ingeniería civil (véase 71.12) @es
scope note: Cette classe comprend la construction de lignes de distribution pour l’électricité et les télécommunications et des bâtiments et structures faisant partie intégrante de ces systèmes. Cette classe comprend: - la construction d’ouvrages de génie civil pour: • des lignes de communication et de transport d’énergie électrique à longue distance et urbaines • des centrales électriques Cette classe ne comprend pas: - la gestion de projets d’ouvrages de génie civil, voir 71.12 @fr
scope note: Ovaj razred uključuje gradnju vodova za distribuciju električne struje i telekomunikacije te odgovarajućih zgrada i drugih građevina koje su sastavni dio ovih sustava. Ovaj razred uključuje: - gradnju : • međugradskih i gradskih komunikacijskih i elektroenergetskih vodova • elektrana Ovaj razred isključuje: - usluge vođenja i nadzora izvedbe građevinskih projekata koje se odnose na radove u niskogradnji, vidi 71.12
scope note: Į šią klasę įeina skirstomųjų energijos ir ryšių linijų tiesyba ir su jomis susijusių pastatų ir statinių, kurie yra neatskiriama šių sistemų dalis, statyba. Į šią klasę įeina: - inžinerinių statinių statyba: • ilgų nuotolių ir miesto ryšių ir energijos linijų • elektrinių Į šią klasę neįeina: - inžinerinių statinių projektų vadyba, žr. 71.12 @lt
scope note: Этот класс включает: - разборка или слом зданий и прочих сооружений @ru
scope note: Bu sınıf, elektrik ve telekomünikasyon ile bu sistemlerin gerekli parçaları olan bunlarla ilgili inşaat ve yapılar için dağıtım hatlarının inşasını kapsamaktadır. Bu sınıf aşağıdakileri kapsamaktadır; - Aşağıdakiler için bina dışı yapıların inşaatı: • uzun mesafeli ve kentsel haberleşme ve yüksek gerilim hatları, • elektrik santralleri. Kapsam dışı olanlar; - bina dışı yapıların inşaat işleri ile ilgili proje yönetimi faaliyetleri, bkz. 71.12 @tr
preferred label: Строителство на преносни и разпределителни електрически и далекосъобщителни мрежи @bg
preferred label: Výstavba inženýrských sítí pro elektřinu a telekomunikace @cs
preferred label: Anlæg af ledningsnet til elektricitet og telekommunikation @da
preferred label: Kabelnetzleitungstiefbau @de
preferred label: Κατασκευή κοινωφελών έργων ηλεκτρικού ρεύματος και τηλεπικοινωνιών @el
preferred label: Construcción de redes eléctricas y de telecomunicaciones @es
preferred label: Elektri- ja sidevõrkude ehitus @et
preferred label: Sähkö- ja tietoliikenneverkkojen rakentaminen @fi
preferred label: Construction de réseaux électriques et de télécommunications @fr
preferred label: Elektromos, híradástechnikai célú közmű építése
preferred label: Costruzione di infrastrutture per l'energia elettrica e le telecomunicazioni @it
preferred label: Komunalinių elektros ir telekomunikacijos statinių statyba @lt
preferred label: Elektroapgādes un telekomunikāciju sistēmu būvniecība @lv
preferred label: Kostruzzjoni ta' proġetti ta' utilità pubblika fir-rigward ta' elettriku u telekomunikazzjoni @mt
preferred label: Bouw van civieltechnische werken voor elektriciteit en telecommunicatie @nl
preferred label: Bygging av anlegg for elektrisitet og telekommunikasjon @no
preferred label: Roboty związane z budową linii telekomunikacyjnych i elektroenergetycznych @pl
preferred label: Construção de redes de transporte e distribuição de electricidade e redes de telecomunicações @pt
preferred label: Lucrări de construcţii a proiectelor utilitare pentru electricitate şi telecomunicaţii @ro
preferred label: Строительство распределительных объектов для обеспечения электроэнергией и телекоммуникациями @ru
preferred label: Výstavba elektrických a telekomunikačných sietí @sk
preferred label: Gradnja objektov oskrbne infrastrukture za elektriko in telekomunikacije @sl
preferred label: Anläggningsarbeten för el och telekommunikation @sv
preferred label: Elektrik ve telekomünikasyon için hizmet projelerinin inşaatı @tr
broader: Construction of utility projects

Construction of other civil engineering projects
type: Concept
notation: 42.9
status: valid
status modified: 2013-10-18
accepted date: 2013-10-18
in scheme: Statistical Classification of Economic Activities in the European Community, Rev. 2 (2008)
scope note: Этот класс включает: - очистку территории строительства - подготовку почвы: экскавация, закапывание мусора, планировка и земляные работы на стройплощадке, рытье траншей, удаление пород и т.д. - подготовку площадки для горных работ: • устранение покрывающих пластов и прочие работы по разработке и подготовке участков к добыче полезных ископаемых, за исключением месторождений нефти и газа Этот класс также включает: - строительство дренажной системы на участке - дренаж сельскохозяйственных земель или лесных массивов Этот класс исключает: - бурение добывающих нефтяных и газовых скважин, см. 06.10, 06.20 - очистку почвы, см. 39.00 - бурение водяных скважин, см. 42.21 - проходку шахтного ствола, см. 43.99 @ru
preferred label: Строителство на други съоръжения @bg
preferred label: Výstavba ostatních staveb @cs
preferred label: Anden anlægsvirksomhed @da
preferred label: Sonstiger Tiefbau @de
preferred label: Κατασκευή άλλων έργων πολιτικού μηχανικού @el
preferred label: Construcción de otros proyectos de ingeniería civil @es
preferred label: Muude rajatiste ehitus @et
preferred label: Muu maa- ja vesirakentaminen @fi
preferred label: Construction d'autres ouvrages de génie civil @fr
preferred label: M.n.s.Egyéb építmény építése m.n.s.
preferred label: Costruzione di altre opere di ingegneria civile @it
preferred label: Kitų inžinerinių statinių statyba @lt
preferred label: Pārējā inženierbūvniecība @lv
preferred label: Kostruzzjoni ta' proġetti oħra ta' inġinerija ċivili @mt
preferred label: Bouw van andere civieltechnische werken @nl
preferred label: Bygging av andre anlegg @no
preferred label: Roboty związane z budową pozostałych obiektów inżynierii lądowej i wodnej @pl
preferred label: Construção de outros projectos de engenharia civil @pt
preferred label: Lucrări de construcţii a altor proiecte inginereşti @ro
preferred label: Строительство прочих инженерных сооружений @ru
preferred label: Výstavba ostatných inžinierskych stavieb @sk
preferred label: Gradnja drugih inženirskih objektov @sl
preferred label: Andra anläggningsarbeten @sv
preferred label: Bina dışı diğer yapılara ait projelerin inşaatı @tr
broader: Civil engineering
narrower: Construction of water projects
narrower: Construction of other civil engineering projects n.e.c.

Construction of water projects
type: Concept
notation: 42.91
status: valid
status modified: 2013-10-18
accepted date: 2013-10-18
in scheme: Statistical Classification of Economic Activities in the European Community, Rev. 2 (2008)
scope note: - строителство на: • водни пътища, пристанища и брегови съоръжения, шлюзове • язовири, хидромелиоративни системи и други хидромеханични съоръжения - драгажни работи - управление на проекти, свързани със строителството на съоръжения - 71.12 @bg
scope note: Z: - výstavbu: • vodních cest, přístavů (včetně rekreačních a sportovních přístavů), říčních staveb, plavebních komor atd. • přehrad a hrází - bagrovací práce na vodních cestáchZ: - výstavbu: • vodních cest, přístavů (včetně rekreačních a sportovních přístavů), říčních staveb, plavebních komor atd. • přehrad a hrází - bagrovací práce na vodních cestách N: - služby projektového řízení inženýrských děl (71.12) @cs
scope note: Diese Klasse umfasst: - Bau von: • Wasserstraßen, Häfen (einschließlich Yachthäfen), Flussbauten, Schleusen usw. • Talsperren und Deichen - Ausbaggern von Wasserstraßen Diese Klasse umfasst nicht: - Projektmanagement für Tiefbautätigkeiten (s. 71.12) @de
scope note: This class includes: - construction of: • waterways, harbour and river works, pleasure ports (marinas), locks, etc. • dams and dykes - dredging of waterways This class excludes: - project management activities related to civil engineering works, see 71.12 @en
scope note: Esta clase comprende: - la construcción de: • canales navegables, puertos, obras fluviales, puertos deportivos, esclusas, etc. • presas y diques - dragado de vías navegables Esta clase no comprende: - la dirección de obras de ingeniería civil (véase 71.12) @es
scope note: Cette classe comprend: - la construction de: • voies navigables, ports, ouvrages fluviaux, ports de plaisance (marinas), écluses, etc. • barrages et digues - le dragage des voies navigables Cette classe ne comprend pas: - la gestion de projets d’ouvrages de génie civil, voir 71.12 @fr
scope note: Ovaj razred uključuje: - gradnju: • vodenih putova, operativnih obala i građevina za osiguranje obala u lukama i pristaništima, luka za nautički turizam (marina), građevina za regulaciju prometa na rijekama, ustava, itd. • brana i nasipa - jaružanje vodenih puteva Ovaj razred isključuje: - usluge vođenja i nadzora izvedbe građevinskih projekata koje se odnose na radove u niskogradnji, vidi 71.12
scope note: Į šią klasę įeina: - statyba: • vandens kelių, uostų ir upių statinių, pramoginių laivų uostų (valčių prieplaukų), šliuzų ir kt. • užtvankų ir pylimų - vandens kelių dugno gilinimas Į šią klasę neįeina: - inžinerinių statinių projektų vadyba, žr. 71.12 @lt
scope note: Этот класс включает: - пробное бурение, разведочное бурение и взятие образцов породы для строительных, геофизических, геологических или других подобных целей Этот класс исключает: - бурение добывающих нефтяных и газовых скважин, см. 06.10, 06.20 - вспомогательные работы по пробному и разведочному бурению при выполнении горных работ, см. 09.90 - бурение водяных скважин, см. 42.21 - проходку шахтного ствола, см. 43.99 - исследование нефтяных и газовых месторождений, геофизическую, геологическую и сейсмическую разведку, см. 71.12 @ru
scope note: Bu sınıf aşağıdakileri kapsamaktadır; - aşağıdakilerin inşaatı: • su yolları, liman ve ırmak işleri, kıyı düzenlemeleri, yat limanları, barınaklar, havuzlar, vb., • barajlar ve bentlerin inşaatı, - su ve su zemininin taranması ve temizlenmesi (deniz, nehir, göl vb.). Kapsam dışı olanlar; - bina dışı yapıların inşaat işleri ile ilgili proje yönetimi faaliyetleri, bkz. 71.12 @tr
preferred label: Строителство на хидротехнически съоръжения @bg
preferred label: Výstavba vodních děl @cs
preferred label: Udførelse af vandbygningsanlæg @da
preferred label: Wasserbau @de
preferred label: Κατασκευή υδραυλικών και λιμενικών έργων @el
preferred label: Obras hidráulicas @es
preferred label: Vesiehitus @et
preferred label: Vesirakentaminen @fi
preferred label: Construction d'ouvrages maritimes et fluviaux @fr
preferred label: Vízi létesítmény építése
preferred label: Costruzione di opere idrauliche @it
preferred label: Vandens statinių statyba @lt
preferred label: Hidrotehnisko objektu būvniecība @lv
preferred label: Kostruzzjoni ta' proġetti ta' l-ilma @mt
preferred label: Waterbouw @nl
preferred label: Bygging av havne- og damanlegg @no
preferred label: Roboty związane z budową obiektów inżynierii wodnej @pl
preferred label: Engenharia hidráulica @pt
preferred label: Construcţii hidrotehnice @ro
preferred label: Строительство водных сооружений @ru
preferred label: Výstavba vodných diel @sk
preferred label: Gradnja vodnih objektov @sl
preferred label: Vattenbyggnad @sv
preferred label: Su projeleri inşaatı @tr
broader: Construction of other civil engineering projects

Construction of other civil engineering projects n.e.c.
type: Concept
notation: 42.99
status: valid
status modified: 2013-10-18
accepted date: 2013-10-18
in scheme: Statistical Classification of Economic Activities in the European Community, Rev. 2 (2008)
scope note: - строителство на промишлени съоръжения (без сградите), като: • рафинерии • съоръжения за химията - строителство на: • открити съоръжения за спорт и развлечение - разделяне и подобрение на терена за строителство (разширяване на пътища, подобряване на инфраструктурата и други) - инсталиране на машини и оборудване – 33.20 - разделяне на земята на парцели, без подобрение на терена - 68.10 - управление на проекти, свързани със строителството на съоръжения - 71.12 @bg
scope note: Z: - výstavbu průmyslových zařízení (kromě budov) jako: • rafinerií • chemických továren - výstavbu stavebních děl, která nejsou budovami, jako: • otevřených sportovních stadionů a hřišť ZT: - rozdělování ploch pozemků při zlepšení infrastruktury (např. výstavbou přídavných komunikací a zásobovacích zařízení) N: - instalaci průmyslových strojů a zařízení (33.20) - rozdělování ploch pozemků bez zlepšení infrastruktury (68.10) - služby projektového řízení inženýrských děl (71.12) @cs
scope note: Diese Klasse umfasst: - Bau von Industrieanlagen (außer Gebäuden) wie: • Raffinerien • Chemiefabriken - Errichtung von Bauwerken, die keine Gebäude sind, wie: • Sportanlagen Diese Klasse umfasst ferner: - Flächenaufteilung mit Infrastrukturverbesserungen (z. B. Bau von zusätzlichen Straßen und Versorgungsanlagen) Diese Klasse umfasst nicht: - Installation von Maschinen und Ausrüstungen (s. 33.20) - Flächenaufteilung ohne Infrastrukturverbesserungen (s. 68.10) - Projektmanagement für Tiefbautätigkeiten (s. 71.12) @de
scope note: This class includes: - construction of industrial facilities, except buildings, such as: • refineries • chemical plants - construction work, other than buildings, such as: • outdoor sports facilities This class also includes: - land subdivision with land improvement (e.g. adding of roads, utility infrastructure etc.) This class excludes: - installation of industrial machinery and equipment, see 33.20 - land subdivision without land improvement, see 68.10 - project management activities related to civil engineering works, see 71.12 @en
scope note: Esta clase comprende: - la construcción de instalaciones industriales, excepto edificios, como: • refinerías • plantas químicas - las obras de construcción, excepto de edificios, como: • instalaciones deportivas al aire libre Esta clase comprende también: - la parcelación con mejora de terrenos (p. ej., adición de carreteras, infraestructuras para redes de abastecimiento, etc.) Esta clase no comprende: - la instalación de maquinaria y equipo industrial (véase 33.20) - la parcelación de terrenos sin mejora (véase 68.10) - la dirección de obras de ingeniería civil (véase 71.12) @es
scope note: Cette classe comprend: - la construction d’installations industrielles, à l’exception des bâtiments, telles que: • raffineries • usines chimiques - les travaux de construction, autres que de bâtiments, tels que: • installations sportives extérieures Cette classe comprend également: - le lotissement de terrains, avec amélioration (par exemple, par l’ajout de routes, d’infrastructures de réseaux, etc.) Cette classe ne comprend pas: - l’installation de machines et de matériel d’usage industriel, voir 33.20 - le lotissement de terrains, sans amélioration, voir 68.10 - la gestion de projets d’ouvrages de génie civil, voir 71.12 @fr
scope note: Ovaj razred uključuje: - gradnju industrijskih građevina, osim zgrada, kao što su: • rafinerije • kemijska postrojenja - građevinske radove na izgradnji građevina (osim zgrada) za sportove koji se održavaju na otvorenom prostoru Ovaj razred također uključuje: - parcelizaciju zemljišta i opremanje zemljišta potrebnom infrastrukturom (npr. komunalna infrastruktura, gradnja prilaza cestama itd). Ovaj razred isključuje: - instaliranje industrijskih strojeva i opreme, vidi 33.20 - parcelizaciju zemljišta bez opremanja zemljišta potrebnom infrastrukturom, vidi 68.10 - usluge vođenja i nadzora izvedbe građevinskih projekata koje se odnose na radove u niskogradnji, vidi 71.12
scope note: Į šią klasę įeina: - pramoninių objektų, kitokių nei pastatai, statyba, pvz.: • naftos perdirbimo gamyklos • chemijos gamyklos - statinių, kitokių nei pastatai, statyba, pvz.: • atviri sporto įrenginiai Į šią klasę taip pat įeina: - žemės sklypų paruošimas su žemės tvarkymo darbais (pvz., tiesiant kelius, įvedant komunalinę infrastruktūrą ir kt.) Į šią klasę neįeina: - pramoninių mašinų ir įrangos įrengimas, žr. 33.20 - žemės sklypų paruošimas be žemės tvarkymo darbų, žr. 68.10 - inžinerinių statiniųprojektų vadyba, žr. 71.12 @lt
scope note: Данная группа включает монтажные работы по обеспечению функционирования здания, в том числе установку электрических систем, слесарные работы для систем водо-, газоснабжения, канализации, систем отопления и кондиционирования воздуха, элеваторов и т.д. @ru
scope note: Bu sınıf aşağıdakileri kapsamaktadır; - aşağıdakiler gibi sanayi tesislerinin inşaatı, binalar hariç: • rafineriler, • kimyasal tesisler, - aşağıdakiler gibi, binalar dışındaki inşaat işleri: • açık spor tesisleri. Ayrıca bu sınıf aşağıdakileri de kapsamaktadır; - arazi iyileştirilmesi ile birlikte arazinin parsellenmesi (örneğin yol, kamusal altyapı tesisleri vb. eklenmesi). Kapsam dışı olanlar; - endüstriyel makine ve gereçlerin kurulması, bkz. 33.20, - arazi iyileştirilmesi yapılmaksızın parselleme, bkz. 68.10, - bina dışı yapıların inşaat işleri ile ilgili proje yönetimi faaliyetleri, bkz. 71.12 @tr
preferred label: Строителство на други съоръжения, некласифицирани другаде @bg
preferred label: Výstavba ostatních staveb j. n. @cs
preferred label: Anden anlægsvirksomhed i.a.n. @da
preferred label: Sonstiger Tiefbau a. n. g. @de
preferred label: Κατασκευή άλλων έργων πολιτικού μηχανικού π.δ.κ.α. @el
preferred label: Construcción de otros proyectos de ingeniería civil n.c.o.p. @es
preferred label: Mujal liigitamata rajatiste ehitus @et
preferred label: Muualla luokittelematon maa- ja vesirakentaminen @fi
preferred label: Construction d'autres ouvrages de génie civil n.c.a. @fr
preferred label: Egyéb építmény építése m.n.s.
preferred label: Costruzione di altre opere di ingegneria civile n.c.a. @it
preferred label: Kitų, niekur kitur nepriskirtų, inžinerinių statinių statyba @lt
preferred label: Citur neklasificēta inženierbūvniecība @lv
preferred label: Kostruzzjoni ta' proġetti oħra ta' inġinerija ċivili n.e.c. @mt
preferred label: Bouw van andere civieltechnische werken, n.e.g. @nl
preferred label: Bygging av andre anlegg ikke nevnt annet sted @no
preferred label: Roboty związane z budową pozostałych obiektów inżynierii lądowej i wodnej, gdzie indziej niesklasyfikowane @pl
preferred label: Construção de outras obras de engenharia civil, n.e. @pt
preferred label: Lucrări de construcţii a altor proiecte inginereşti n.c.a. @ro
preferred label: Строительство прочих инженерных сооружений, не включенных в другие категории @ru
preferred label: Výstavba ostatných inžinierskych stavieb i. n. @sk
preferred label: Gradnja drugih objektov nizke gradnje @sl
preferred label: Övriga anläggningsarbeten @sv
preferred label: Başka yerde sınıflandırılmamış bina dışı diğer yapılara ait projelerin inşaatı @tr
broader: Construction of other civil engineering projects

Specialised construction activities
type: Concept
notation: 43
status: valid
status modified: 2013-10-18
accepted date: 2013-10-18
in scheme: Statistical Classification of Economic Activities in the European Community, Rev. 2 (2008)
scope note: Специализирано строителство на части от сгради и съоръжения или подготвителни работи за започване на строителството. То обикновено е специализирано в дейности, които са еднакви за различните строежи и изискват специализирани умения и оборудване. Включени са дейности като укрепване чрез пилоти, фундиране, сондиране, монтаж на арматура, изливане на бетон, изпълнение на тухлена и каменна зидария, монтаж на строително скеле, изпълнение на покривни покрития и други. Тук се включва и монтажът на елементи за метални конструкции, при условие че са произведени от друга единица (т.е. несобствено производство). Специализираното строителство обикновено се осъществява на договорна основа от подизпълнител, но специално при ремонта на сградите, то се извършва директно за собственика на имота. Включени са дейностите по изграждане в сгради и съоръжения на инсталации от всички видове, които ги правят функционални. Тези дейности обикновено се извършват на място, макар че част от работата може да се извърши в специални цехове. Включени са дейностите по строителство на водопроводни инсталации, отоплителни и климатични инсталации, антени, системи за предупредителна сигнализация и защита и други електрически инсталации, инсталации за гасене на пожари, монтаж на асансьори и ескалатори и други. Включени са още и дейностите по изграждане и монтаж на топлинни, звукови или вибрационни изолации, охладителни инсталации за търговски обекти, на осветителни и сигнализационни системи на пътища, релсови пътища, гари, летища, пристанища, монтаж на огради и други. Ремонтът на посочените инсталации се включва тук. Този раздел включва и довършителни строителни дейности. Довършителните строителни дейности обхващат: стъклопоставяне; полагане на мазилки; боядисване и декориране; полагане на различни подови и стенни облицовки от керамика, дялан камък, паркет, мокет, тапети и други; циклене на дюшеме; монтаж на дограма; външно почистване на сгради и други. Ремонтните дейности, на посочените довършителни строи… @bg
scope note: Tento oddíl zahrnuje specializované stavební činnosti (řemesla), to znamená provádění dílčích prací na budovách a inženýrských dílech nebo provádění příslušných přípravných prací. Specializované činnosti jsou obvykle zaměřené pouze na jednu oblast výstavby, která je společná pro různé druhy staveb a vyžaduje zvláštní odborné znalosti popř. zvláštní technické vybavení. Patří sem činnosti jako pilotování základů, základové práce, provádění hrubé stavby, betonování, zednické, dlaždičské, lešenářské, pokrývačské práce atd. Spadá sem rovněž montáž ocelových stavebních konstrukcí, pokud nejsou díly konstrukcí vyráběných jednou výrobní jednotkou. Specializované stavební činnosti jsou zpravidla prováděny subdodavateli (outsourcing), přímo pro vlastníka jsou většinou dělány například opravy. Tento oddíl rovněž zahrnuje kompletační a dokončovací práce na stavbách. Dokončovací práce zahrnují činnosti potřebné pro dokončení budovy. Jsou to sklenářské práce, práce s omítkami, malířské práce, pokládání podlahových krytin (dlaždic, parket, koberců atd.) nebo obkládání stěn (kachlíky, tapetování atd.), broušení podlah, tesařské a truhlářské práce, akustické práce, vnější čištění fasády atd. Oddíl rovněž zahrnuje příslušné opravy. Půjčování stavebních strojů a zařízení s obsluhou je klasifikováno podle stavební činnosti prováděné příslušným stavebním strojem nebo zařízením. Do tohoto oddílu se také zatřiďují jakékoli instalační práce, díky kterým lze zajistit funkčnost stavby. Tyto činnosti jsou většinou prováděny na staveništi (i když některé přípravné práce lze provádět v dílně). Patří sem instalace plynu, vodovodů, odpadů, systémů vytápění, větrání a klimatizace, antén, bezpečnostních zařízení a ostatních elektrických zařízení, požárních sprinklerů, výtahů, pojízdných schodišť atd. Dále sem patří provádění izolací proti vodě, tepelné a protihlukové izolace, plechařské práce, instalace chladicích zařízení, instalace osvětlení a signalizačních zařízení pro komunikace, železnice, le… @cs
scope note: Diese Abteilung umfasst den spezialisierten Hoch- und Tiefbau, also die Durchführung von Teilarbeiten an Hoch- und Tiefbauten oder die entsprechenden Vorarbeiten. Im Allgemeinen handelt es sich um spezialisierte Tätigkeiten, die besondere Fachkenntnisse bzw. Ausrüstungen erfordern. Dazu zählen Tätigkeiten wie Pfahlgründung, Fundamentarbeiten, Rohbau, Betonbau, Maurerarbeiten, Pflasterarbeiten, Gerüstbau, Dachdeckung usw. Die Errichtung von Stahlkonstruktionen zählt ebenfalls dazu, sofern die Einzelteile nicht von derselben Einheit hergestellt werden. Die Arbeiten des spezialisierten Hoch- und Tiefbaus werden in der Regel von Subunternehmern ausgeführt, besonders die entsprechenden Reparaturarbeiten werden jedoch unmittelbar für den Eigentümer ausgeführt. Baufertigstellung und Ausbauarbeiten sind ebenfalls eingeschlossen. Zu dieser Abteilung zählt ferner die Installation aller Arten von Anlagen der Versorgungstechnik, die für die Nutzung eines Gebäudes erforderlich sind. Diese Tätigkeiten werden meist auf dem Baugelände ausgeführt, manchmal findet jedoch auch eine werkseitige Vorfertigung statt. Hierunter fallen Tätigkeiten wie die Installation von Gas-, Wasser-, Heizungs-, Lüftungs- und Klimaanlagen, Antennen, Alarmanlagen und sonstigen elektrischen Anlagen, Sprinkleranlagen, Aufzügen, Rolltreppen usw. Ferner zählen dazu Abdichtarbeiten gegen Wasser, Wärme- und Schalldämmung, Blecharbeiten, Installation von Kühlanlagen für kommerzielle Nutzung, Installation von Beleuchtungs- und Signalanlagen für Straßen, Bahnverkehrsstrecken, Flughäfen, Häfen usw. Eingeschlossen sind auch die entsprechenden Reparaturarbeiten. Sonstiger Ausbau beinhaltet Tätigkeiten, die für den Ausbau und die Fertigstellung eines Gebäudes erforderlich sind. Dazu zählen Glaserarbeiten, Putzarbeiten, Maler- und Dekorationsarbeiten, Verlegen von Bodenbelägen wie Fliesen, Parkett, Teppichböden usw. oder Verkleiden von Wänden mit Materialien wie Fliesen, Tapeten usw., Abschleifen von Fußböden, Zimmerei,… @de
scope note: This division includes specialised construction activities (special trades), i.e. the construction of parts of buildings and civil engineering works or preparation therefore. These activities are usually specialised in one aspect common to different structures, requiring specialised skills or equipment, such as pile-driving, foundation work, carcass work, concrete work, brick laying, stone setting, scaffolding, roof covering, etc. The erection of steel structures is included, provided that the parts are not produced by the same unit. Specialised construction activities are mostly carried out under subcontract, but especially in repair construction it is done directly for the owner of the property. Also included are building finishing and building completion activities. Included is the installation of all kind of utilities that make the construction function as such. These activities are usually performed at the site of the construction, although parts of the job may be carried out in a special shop. Included are activities such as plumbing, installation of heating and air-conditioning systems, antennas, alarm systems and other electrical work, sprinkler systems, elevators and escalators, etc. Also included are insulation work (water, heat, sound), sheet metal work, commercial refrigerating work, the installation of illumination and signalling systems for roads, railways, airports, harbours, etc. Also repair of the same type as the above mentioned activities is included. Building completion activities encompass activities that contribute to the completion or finishing of a construction such as glazing, plastering, painting, floor and wall tiling or covering with other materials like parquet, carpets, wallpaper, etc., floor sanding, finish carpentry, acoustical work, cleaning of the exterior, etc. Also repair of the same type as the above mentioned activities is included. The renting of equipment with operator is classified with the associated construction activity. @en
scope note: Esta división comprende las actividades de construcción especializada, es decir, la preparación y la construcción de partes de edificios y obras de ingeniería civil. Estas actividades suelen estar especializadas en un aspecto común a diferentes estructuras y requieren la utilización de técnicas y equipos especiales. Se trata de actividades tales como la hinca de pilotes, la cimentación, la erección de estructuras de edificios, el hormigonado, la colocación de ladrillo y piedra, la instalación de andamios, la construcción de cubiertas, etc. Se incluye la construcción de estructuras de acero, siempre que sus partes no sean fabricadas por la misma unidad. Las actividades de construcción especializada se realizan en su mayoría mediante subcontratación, pero cuando se trata de trabajos de construcción destinados a la reparación se suele realizar directamente para el propietario. Se incluyen asimismo las actividades de acabado de edificios. Esta sección comprende además la instalación de todo tipo de equipos que permiten que la construcción funcione como tal. Normalmente estas actividades se realizan a pie de obra, aunque algunas partes del trabajo pueden llevarse a cabo en talleres especializados. Se incluyen actividades como la fontanería, la instalación de sistemas de calefacción y aire acondicionado, antenas, sistemas de alarma y otras instalaciones eléctricas, sistemas de aspersión automática contra incendios, ascensores y escaleras mecánicas, etc. También se incluyen los trabajos de aislamiento (térmico, sonoro y de humedad), chapistería, refrigeración industrial, la instalación de sistemas de iluminación y señalización de carreteras, ferrocarriles, aeropuertos, puertos, etc. También se incluye la reparación correspondiente a las actividades mencionadas. Las actividades de acabado de edificios y obras son las que contribuyen al acabado o terminación de la construcción, como el acristalamiento, revocamiento, pintura, embaldosado y alicatado o el revestimiento con otr… @es
scope note: Cette division comprend les activités de construction spécialisée (travaux spéciaux), c’est-à-dire la construction de parties de bâtiments et d’ouvrages d’art ou la préparation à cette fin. Il s’agit habituellement d’activités spécialisées concernant un aspect commun à différentes structures, requérant un savoir-faire ou un équipement particulier, tels que le battage de pieux, la réalisation de fondations, le gros œuvre, le bétonnage, la maçonnerie, le pavage, le montage d’échafaudage, la toiture, etc. Le montage de structures d’acier est inclus pour autant que les éléments ne soient pas produits par la même unité. Les travaux de construction spécialisée sont généralement sous-traités mais, en particulier dans le cas de travaux de réparation, ils sont réalisés directement pour le propriétaire de l’immeuble. Les travaux d’achèvement et de finition des bâtiments sont également couverts. Cette division comprend l’installation de toutes sortes de commodités qui rendent la construction fonctionnelle. Ces activités sont généralement accomplies sur le site de la construction, bien que des parties du travail puissent être réalisées dans un atelier spécialisé. Sont comprises des activités telles que la plomberie, l’installation de systèmes de chauffage et de conditionnement d’air, d’antennes, de systèmes d’alarme et autres travaux électriques, de systèmes d’extinction automatique d’incendie, d’ascenseurs et d’escaliers mécaniques, etc. Les travaux d’isolation (eau, chaleur, son), de tôlerie, de réfrigération commerciale, l’installation de systèmes d’éclairage et de signalisation pour les routes, voies de chemin de fer, aéroports, ports, etc., sont également compris. Les activités de réparation analogues aux activités décrites ci-dessus sont également comprises. Les activités d’achèvement de bâtiments englobent des activités qui contribuent à l’achèvement ou à la finition d’une construction telles que vitrerie, plafonnage, peinture, carrelage ou revêtement du sol et des murs … @fr
scope note: Ovaj odjeljak uključuje specijalizirane građevinske djelatnosti odnosno gradnju dijelova zgrada i građevina niskogradnje ili pripremne radove u tu svrhu. Radi se o specijaliziranim radovima koji se mogu obavljati na različitim vrstama građevina, a zahtijevaju specijalne stručne vještine ili opremu, kao što su zabijanje stupova (šipova), postavljanje temelja građevine, postavljanje kostura građevina, betonirački radovi, zidanje, popločavanje kamenom, postavljanje skela, pokrivanje krovova itd. Uključena je i montaža čeličnih konstrukcija pod uvjetom da ih nije proizveo isti poslovni subjekt koji ih i montira. Specijalizirane građevinske djelatnosti uglavnom obavljaju podizvođači, a kod popravka građevina se obično obavljaju izravno za vlasnika nekretnine. Ovaj odjeljak također uključuje instalacijske i završne radove na građevinama. Instalacijski radovi uključuju radove svih vrsta koji omogućuju nesmetanu uporabu građevina. Ovi se radovi pretežno izvode na gradilištu, a dio pripremnih poslova može se obavljati i u radionici. Uključeni su radovi kao što su uvođenje instalacija vodovoda, kanalizacije i plina, sustava za grijanje i klimatizaciju, postavljanje antena, alarmnih sustava, automatskih sustava za gašenje požara (tzv. sprinkler sustavi), dizala i pokretnih stepenica itd. Također su uključeni izolacijski radovi (voda, toplina, zvuk), limarski radovi, uvođenje opreme i vodova za hlađenje, postavljanje rasvjete i signalnih sustava na cestama, željeznici, zračnim lukama, pristaništima i lukama itd. Također su uključeni i popravci povezani s navedenim djelatnostima. Završni građevinski radovi uključuju djelatnosti koje doprinose potpunom dovršavanju građevina kao što su staklarski, fasadni, štukaturski i soboslikarski radovi, postavljanje podnih i zidnih pločica ili drugih obloga kao parketa, tepisona, tapeta itd., brušenje (pijeskarenje) podova, ugradnja stolarije, radovi na akustici prostorija, vanjsko čišćenje građevina itd. Također su uključeni i popravci povez…
scope note: Į šį skyrių įeina specializuota statybos veikla, t.y. pastatų dalių statyba ir inžineriniai statybos darbai ar paruošimas tokiems darbams. Šios veiklos rūšys dažniausiai yra specializuotos vienoje srityje, bendroje skirtingiems statiniams, reikalaujančios specialių įgūdžių ar įrangos, pvz., polių kalimas, pamatų klojimas, karkaso darbai, betono darbai, mūrijimo darbai, akmenų mūrijimas, pastolių statymas, stogų dengimas ir kt. Plieninių konstrukcijų montavimas priskiriamas tik tuo atveju, jeigu konstrukcijos dalys yra ne savos gamybos. Daugeliu atvejų specialieji statybos darbai atliekami pagal subrangos sutartis, tačiau itin dažnai statinių remonto darbai turto savininkams atliekami tiesiogiai. Be to, į šį skyrių įeina pastatų apdailos ir statybos baigiamieji darbai. Į skyrių įeina visų rūšių įrenginių, reikalingų statybos objektui funkcionuoti iš esmės, įrengimas. Šios veiklos rūšys dažniausiai vykdomos statybvietėse, nors dalis darbų gali būti atliekama specialiose dirbtuvėse. Tokioms veiklos rūšims priskiriami vandentiekio, šildymo ir oro kondicionavimo sistemų įrengimas, antenų, pavojaus signalizavimo sistemų įrengimas ir kiti elektros montavimo darbai, automatinių gesinimo sistemų, liftų ir eskalatorių įrengimas ir kt. Čia įeina ir vandens, šilumos ir garso izoliacijos įrengimas, metalo lakštų apdirbimas, komercinių šaldymo įrenginių įrengimas, kelių, geležinkelių, oro uostų, jūros uostų apšvietimo ir signalizavimo sistemų įrengimas ir kt. Taip pat įeina tokio tipo, kaip ir minėtos veiklos rūšys, remontas. Statybos baigiamieji darbai aprėpia veiklos rūšis, tokias kaip įstiklinimas, tinkavimas, dažymas, grindų ir sienų dengimas plytelėmis ar kitokiomis medžiagomis, tokiomis kaip parketas, kiliminė danga, sienų apmušalai ir kt., grindų šlifavimas, ir veiklos rūšis, susijusias su baigiamaisiais dailidės darbais, akustikos įrengimo darbais, išoriniais valymo darbas ir kt. darbais, reikalingais statybai užbaigti arba statinių apdailai atlikti. Taip pat įeina tokio … @lt
scope note: Этот класс включает установку электротехнических систем в любых зданиях и сооружениях гражданского строительства. Этот класс включает: - установку: • электропроводки и фурнитуры • телекоммуникационной проводки • компьютерных систем и телевизионных кабелей, включая оптоволоконные кабели • спутниковых тарелок • систем освещения • противопожарной сигнализации • охранной сигнализации • уличного освещения и электрического сигнального оборудования • освещения взлетно-посадочных полос • электрических коллекторов солнечной энергии Этот класс также включает: соединение электрического оборудования и бытовых приборов, включая плинтусные радиаторы Этот класс исключает: - строительство линий телекоммуникаций и электропередач, см. 42.22 - мониторинг и дистанционный контроль электронных систем безопасности, таких как охранная и пожарная сигнализация, включая их установку и техобслуживание, см. 80.20 @ru
scope note: Bu bölüm özel uzmanlık gerektiren inşaat faaliyetlerini kapsamaktadır (özel inşaatçılık), binaların ve bina dışı inşaat işlerinin bölümlerinin veya inşaatlarını bu amaç için yapılan hazırlıkları kapsar. Bu faaliyetler genellikle kazık çakılması, temel, çatı ve beton işleri ile duvarcılık, taş döşeme, yapı iskelesi kurma, çatı kaplama vb. gibi, özel yetenek ve donanım gerektiren, farklı yapıları ortak bir paydada sınıflandırmıştır. Çelik yapıların kurulumu, parçaların aynı birim tarafından üretilmemesi koşuluyla buraya dahildir. Özel uzmanlık gerektiren inşaat faaliyetleri genellikle taşeronluk sözleşmesine göre yapılmaktadır, ancak özellikle onarım inşaatlarında bu doğrudan mülk sahibinin yönlendirmesi ile yapılmaktadır. İnşaatın ince işleri ve diğer tamamlama faaliyetleri de buna dahildir.Bu sıfatla inşaatı işlevsel kılan her türlü tesisatın kurulumunu kapsar. Bu faaliyetler, İşin bölümleri her ne kadar özel bir atölyede yürütülse de, genellikle inşaat alanında gerçekleştirilmektedir. Boru tesisatı, ısıtma ve havalandırma sistemlerinin tesisatı, antenler, alarm sistemleri ve diğer elektrik işleri, otomatik yangın söndürme sistemleri, asansörler ve yürüyen merdivenlerin kurulumu vb. gibi faaliyetleri kapsar. Yalıtım işi (su, ısı, ses), metal plaka işi, ticari soğutma tesisatı işi ile yollar, demiryolu ve diğer raylı yollar, havaalanı, limanlar ve benzeri için aydınlatma ve buralardaki trafiği düzenleyen ışıklı sistem tesisatlarını da kapsar. Yukarıda ifade edilen faaliyetlerle ilgili onarım ,işlerini de kapsar. Bina tamamlama faaliyetleri cam takma, sıvama, boyama, zemin veya duvar döşemesi veya parke, halı, duvar kağıdı vb. diğer malzemelerle kaplama, zımparalama, doğramacılık, akustik işi, dış cephe temizlemesi gibi bir inşaatın tamamlanmasına yardımcı olan faaliyetleri kapsamaktadır. Yukarıda ifade edilen faaliyetlerle ilgili onarım işlerini de kapsar. Operatör ile birlikte araç ve gereçlerin kiralanması, ilgili inşaat faaliyeti içerisinde sınıflandırılmaktadır. @tr
preferred label: Специализирани строителни дейности @bg
preferred label: Specializované stavební činnosti @cs
preferred label: Bygge- og anlægsvirksomhed, som kræver specialisering @da
preferred label: Vorbereitende Baustellenarbeiten, Bauinstallation und sonstiges Ausbaugewerbe @de
preferred label: Εξειδικευμένες κατασκευαστικές δραστηριότητες @el
preferred label: Actividades de construcción especializada @es
preferred label: Eriehitustööd @et
preferred label: Erikoistunut rakennustoiminta @fi
preferred label: Travaux de construction spécialisés @fr
preferred label: Speciális szaképítés
preferred label: Lavori di costruzione specializzati @it
preferred label: Specializuota statybos veikla @lt
preferred label: Specializētie būvdarbi @lv
preferred label: Attivitajiet ta' kostruzzjoni speċjalizzati @mt
preferred label: Gespecialiseerde bouwwerkzaamheden @nl
preferred label: Spesialisert bygge- og anleggsvirksomhet @no
preferred label: Roboty budowlane specjalistyczne @pl
preferred label: Actividades especializadas de construção @pt
preferred label: Lucrări speciale de construcţii @ro
preferred label: Специализированные строительные работы @ru
preferred label: Špecializované stavebné práce @sk
preferred label: Specializirana gradbena dela @sl
preferred label: Specialiserad bygg- och anläggningsverksamhet @sv
preferred label: Özel inşaat faaliyetleri @tr
broader: CONSTRUCTION
narrower: Demolition and site preparation
narrower: Electrical, plumbing and other construction installation activities
narrower: Building completion and finishing
narrower: Other specialised construction activities

Demolition and site preparation
type: Concept
notation: 43.1
status: valid
status modified: 2013-10-18
accepted date: 2013-10-18
in scheme: Statistical Classification of Economic Activities in the European Community, Rev. 2 (2008)
scope note: Тази група включва дейности по подготовка на строителната площадка, вкл. демонтаж на по-рано съществуващи сгради и съоръжения. @bg
scope note: Tato skupina zahrnuje činnosti sloužící k přípravě staveniště pro následné provádění stavebních prací, včetně stržení a odklizení stávajících staveb. @cs
scope note: Diese Gruppe umfasst Tätigkeiten zur Vorbereitung von Baustellen für die anschließenden Bauarbeiten, einschließlich des Abbruchs vorhandener Bauwerke. @de
scope note: This group includes activities of preparing a site for subsequent construction activities, including the removal of previously existing structures. @en
scope note: Este grupo comprende las actividades de preparación de un terreno para la realización posterior de actividades de construcción, incluida la retirada de estructuras preexistentes. @es
scope note: Ce groupe comprend les activités de préparation d’un site pour des activités ultérieures de construction, y compris la destruction des structures existantes. @fr
scope note: Ova skupina obuhvaća djelatnosti pripreme gradilišta za kasniju gradnju građevina, uključujući uklanjanje postojećih građevina.
scope note: Į šią grupę įeina statybvietės paruošimas vėliau numatytoms statyboms, įskaitant aikštelėje esančių statinių šalinimą. @lt
scope note: Данный класс включает установку систем водопровода, отопления и кондиционирования воздуха, в том числе дополнение, переделку, техобслуживание и ремонт. Этот класс включает: - монтаж в зданиях или прочих строительных сооружениях: • отопительных систем (электрических, газовых и масляных) • печей, стояков водяного охлаждения • неэлектрических коллекторов солнечной энергии • водопроводного и сантехнического оборудования • оборудования для вентиляции и кондиционирования воздуха и воздуховодов • газопроводной арматуры • трубопроводов для подачи пара • систем автоматического пожаротушения • автоматических систем для полива газонов - работы по монтажу воздуховодов Этот класс исключает: - установку электрических плинтусных радиаторов, см. 43.21 @ru
scope note: Bu grup, daha önce mevcut olan yapıların kaldırılması dahil, sonraki inşaat faaliyetleri için şantiyenin hazırlanması faaliyetlerini kapsamaktadır. @tr
preferred label: Разчистване и подготовка на строителната площадка @bg
preferred label: Demolice a příprava staveniště @cs
preferred label: Nedrivning og forberedende byggepladsarbejder @da
preferred label: Abbrucharbeiten und vorbereitende Baustellenarbeiten @de
preferred label: Κατεδαφίσεις και προετοιμασία εργοταξίου @el
preferred label: Demolición y preparación de terrenos @es
preferred label: Lammutamine ja ehitusplatside ettevalmistus @et
preferred label: Rakennusten ja rakennelmien purku ja rakennuspaikan valmistelutyöt @fi
preferred label: Démolition et préparation des sites @fr
preferred label: Bontás, építési terület előkészítése
preferred label: Demolizione e preparazione del cantiere edile @it
preferred label: Statinių nugriovimas ir statybvietės paruošimas @lt
preferred label: Ēku nojaukšana un būvlaukuma sagatavošana @lv
preferred label: Twaqqigħ u tħejjija tas-sit @mt
preferred label: Slopen en bouwrijp maken van terreinen @nl
preferred label: Riving og grunnarbeid @no
preferred label: Rozbiórka i przygotowanie terenu pod budowę @pl
preferred label: Demolição e preparação dos locais de construção @pt
preferred label: Lucrări de demolare şi de pregătire a terenului @ro
preferred label: Снос существующих сооружений и подготовка площадки для строительства @ru
preferred label: Demolačné a zemné práce @sk
preferred label: Pripravljalna dela na gradbišču @sl
preferred label: Rivning av hus samt mark- och grundarbeten @sv
preferred label: Yıkım ve şantiyenin hazırlanması @tr
broader: Specialised construction activities
narrower: Demolition
narrower: Site preparation
narrower: Test drilling and boring

Demolition
type: Concept
notation: 43.11
status: valid
status modified: 2013-10-18
accepted date: 2013-10-18
in scheme: Statistical Classification of Economic Activities in the European Community, Rev. 2 (2008)
scope note: - събаряне на сгради и други съоръжения @bg
scope note: Z: - stržení (demolice) budov a jiných stavebních děl @cs
scope note: Diese Klasse umfasst: - Abbruch von Gebäuden und anderen Bauwerken @de
scope note: This class includes: - demolition or wrecking of buildings and other structures @en
scope note: Esta clase comprende: - la demolición y derribo de edificios y otras estructuras @es
scope note: Cette classe comprend: - la démolition d’immeubles et d’autres constructions @fr
scope note: Ovaj razred uključuje: - rušenje ili razbijanje zgrada i ostalih građevina
scope note: Į šią klasę įeina: - pastatų ir kitų statinių nugriovimas ar išardymas @lt
scope note: Данный класс включает установку любого оборудования, за исключением систем энергоснабжения, водопровода, отопления и кондиционирования воздуха или промышленного оборудования в зданиях и объектах гражданского строительства. Этот класс включает: - монтаж в зданиях или прочих строительных сооружениях: • лифтов, эскалаторов, включая их ремонт и техобслуживание • автоматических и вращающихся дверей • молниеотводов • пылесосных систем • термо-, звуко- или виброизоляции Этот класс исключает: - установку производственного оборудования, см. 33.20 @ru
scope note: Bu sınıf aşağıdakileri kapsamaktadır; - binaların ve diğer yapıların yıkılması ve sökülmesi. @tr
preferred label: Събаряне и разрушаване @bg
preferred label: Demolice @cs
preferred label: Nedrivning @da
preferred label: Abbrucharbeiten @de
preferred label: Κατεδαφίσεις @el
preferred label: Demolición @es
preferred label: Lammutamine @et
preferred label: Rakennusten ja rakennelmien purku @fi
preferred label: Travaux de démolition @fr
preferred label: Bontás
preferred label: Demolizione @it
preferred label: Statinių nugriovimas @lt
preferred label: Ēku nojaukšana @lv
preferred label: Twaqqigħ @mt
preferred label: Slopen @nl
preferred label: Riving av bygninger og andre konstruksjoner @no
preferred label: Rozbiórka i burzenie obiektów budowlanych @pl
preferred label: Demolição @pt
preferred label: Lucrări de demolare a construcţiilor @ro
preferred label: Разборка и снос зданий @ru
preferred label: Demolácia @sk
preferred label: Rušenje objektov @sl
preferred label: Rivning av hus och byggnader @sv
preferred label: Yıkım @tr
broader: Demolition and site preparation

Site preparation
type: Concept
notation: 43.12
status: valid
status modified: 2013-10-18
accepted date: 2013-10-18
in scheme: Statistical Classification of Economic Activities in the European Community, Rev. 2 (2008)
scope note: - разчистване на строителната площадка - земни работи по подготовка на строителната площадка: изкопни и насипни работи, подравняване, нивелиране, взривяване на скали - подготовка на строителния участък за добива: • разкривни работи и други дейности по разработване и подготовка на терени и участъци за добива, без тези за нефт и газ - дренажни дейности на строителната площадка - дренажни дейности на селскостопанска или горска земя - пробиване на нефтени и газови кладенци – 06.10, 06.20 - обеззаразяване на почвата – 39.00 - пробиване на кладенци за вода - 42.21 - пробиване на шахти - 43.99 @bg
scope note: Z: - vyklizení staveniště - přesuny zeminy: hloubení, zasypávání, vyrovnávání a odkopávka místa stavby, výkopy, odstraňování skal a odstřelování atd. - přípravu území pro těžbu: • odstranění skrývkové zeminy, vývojové a přípravné práce na pozemcích s výskytem minerálů (s výjimkou ložisek ropy a zemního plynu) ZT: - odvodnění staveniště - odvodnění zemědělských a lesních ploch N: - těžební vrty ropy a zemního plynu (06.10, 06.20, 09.10) - dekontaminaci půdy (39.00) - stavbu studní (42.21) - hloubení šachet (43.99) @cs
scope note: Diese Klasse umfasst: - Enttrümmerung von Baustellen - Erdbewegungen: Ausschachtung, Erdauffüllung, Einebnung und Planierung von Baugelände, Grabenaushub, Felsabbau, Sprengen usw. - Erschließung von Lagerstätten: • Abräumen des Deckgebirges sowie Entwicklungs- und Vorarbeiten an Bodenschätze führenden Grundstücken und Lagerstätten, mit Ausnahme von Erdöl- und Erdgaslagerstätten Diese Klasse umfasst ferner: - Baustellenentwässerung - Entwässerung von land- und forstwirtschaftlichen Flächen Diese Klasse umfasst nicht: - Erdöl- und Erdgasbohrungen zu Förderzwecken (s. 06.10 und 06.20) - Dekontaminierung von Böden (s. 39.00) - Brunnenbau (s. 42.21) - Schachtbau (s. 43.99) @de
scope note: This class includes: - clearing of building sites - earth moving: excavation, landfill, levelling and grading of construction sites, trench digging, rock removal, blasting, etc. - site preparation for mining: • overburden removal and other development and preparation of mineral properties and sites, except oil and gas sites This class also includes: - building site drainage - drainage of agricultural or forestry land This class excludes: - drilling of production oil or gas wells, see 06.10, 06.20 - decontamination of soil, see 39.00 - water well drilling, see 42.21 - shaft sinking, see 43.99 @en
scope note: Esta clase comprende: - la limpieza de escombros - el movimiento de tierras: excavación, rellenado y nivelación de emplazamientos de obras, excavación de zanjas, retirada de rocas, voladuras, etc. - la preparación de explotaciones mineras: • el destape de minas y otras actividades de preparación y desarrollo de los terrenos y las propiedades mineros, excepto yacimientos de petróleo y gas Esta clase comprende también: - el drenaje de emplazamientos de obras - el drenaje de terrenos agrícolas y forestales Esta clase no comprende: - la perforación de pozos de producción de petróleo y gas (véanse 06.10 y 06.20) - la descontaminación del suelo (véase 39.00) - la excavación de pozos hidráulicos (véase 42.21) - la perforación de pozos de minas (véase 43.99) @es
scope note: Cette classe comprend: - le déblayage des chantiers - les travaux de terrassement: creusement, comblement, nivellement de chantiers de construction, ouverture de tranchées, dérochement, destruction à l’explosif, etc. - la préparation de sites pour l’exploitation minière: • enlèvement des déblais et autres travaux d’aménagement et de préparation des terrains et des sites miniers, à l’exception des sites de pétrole ou de gaz Cette classe comprend également: - le drainage des chantiers de construction - le drainage des terrains agricoles et sylvicoles Cette classe ne comprend pas: - le forage de puits d’extraction de pétrole ou de gaz, voir 06.10 et 06.20 - la décontamination des sols, voir 39.00 - le forage de puits d’eau, voir 42.21 - le fonçage de puits, voir 43.99 @fr
scope note: Ovaj razred uključuje: - raščišćavanje gradilišta - zemljane radove: iskop, nasipanje, ravnanje i druge radove na oblikovanju gradilišta, kopanje kanala, uklanjanje stijena, miniranje, itd. - pripremanje terena za rudarstvo: • zemljane i druge radove na pripremi mineralnih nalazišta i gradilišta, osim naftnih ili plinskih nalazišta Ovaj razred također uključuje: - drenažne radove na gradilištu - drenažne radove na poljoprivrednom ili šumskom zemljištu Ovaj razred isključuje: - bušenje proizvodnih izvora nafte ili plina, vidi 06.10, 06.20 - dekontaminaciju tla, vidi 39.00 - bušenje izvora vode, vidi 42.21 - iskop okna, vidi 43.99
scope note: Į šią klasę įeina: - statybviečių valymas - žemės darbai: grunto kasimas, atliekų užkasimas, statybvietės planiravimas ir profiliavimas, tranšėjų ir griovių kasimas, uolienų šalinimas, sprogdinimo darbai ir kt. - statybinės aikštelės paruošimas kasybos darbams: • nuodangų pašalinimas ir kitoks rūdynų bei kasybos vietų atidengimas ir paruošimas, išskyrus naftos ir dujų gavybos vietas Į šią klasę taip įeina: - statybvietės drenažas - dirbamosios žemės ar miško žemės sausinimas Į šią klasę neįeina: - naftos ir dujų gręžinių gręžimas, žr. 06.10, 06.20 - dirvožemio taršos šalinimas, žr. 39.00 - vandens šulinių gręžimas, žr. 42.21 - šachtinių šulinių kasimas, žr. 43.99 @lt
scope note: Bu sınıf aşağıdakileri kapsamaktadır; - inşaat alanının temizlenmesi, - hafriyat işleri, inşaat alanının bölümlere ayrılması ve kazı, toprak doldurma, düzleme ve inşaat alanlarının düzenlenmesi, hendek kazma, kayaların uzaklaştırılması, patlatma işleri vb. gibi, - madencilik için şantiye alanının hazırlanması: • petrol ve gaz alanları hariç, ağır yükün taşınması ile diğer imar ve maden ve inşaat alanlarının hazırlanması. Ayrıca bu sınıf aşağıdakileri de kapsamaktadır; - inşaat alanının suyunun akıtılması (drenajı), - tarımsal ve ormanlık alanların drenajı, Kapsam dışı olanlar; - petrol ve gaz kuyularının açılması, bkz. 06.10, 06.20, - toprağın zehirden arındırılması, bkz. 39.00, - su kuyusu kazılması, bkz. 42.21, - düşey galeri ve kuyu açma (depolama, madencilik tüneli vb.), bkz. 43.99. @tr
preferred label: Земни работи @bg
preferred label: Příprava staveniště @cs
preferred label: Forberedende byggepladsarbejder @da
preferred label: Vorbereitende Baustellenarbeiten @de
preferred label: Προετοιμασία εργοταξίου @el
preferred label: Preparación de terrenos @es
preferred label: Ehitusplatside ettevalmistus @et
preferred label: Rakennuspaikan valmistelutyöt @fi
preferred label: Travaux de préparation des sites @fr
preferred label: Építési terület előkészítése
preferred label: Preparazione del cantiere edile @it
preferred label: Statybvietės paruošimas @lt
preferred label: Būvlaukuma sagatavošana @lv
preferred label: Tħejjija tas-sit @mt
preferred label: Bouwrijp maken van terreinen @nl
preferred label: Grunnarbeid @no
preferred label: Przygotowanie terenu pod budowę @pl
preferred label: Preparação dos locais de construção @pt
preferred label: Lucrări de pregătire a terenului @ro
preferred label: Подготовительные работы на стройплощадке @ru
preferred label: Zemné práce @sk
preferred label: Zemeljska pripravljalna dela @sl
preferred label: Mark- och grundarbeten @sv
preferred label: Şantiyenin hazırlanması @tr
broader: Demolition and site preparation

Test drilling and boring
type: Concept
notation: 43.13
status: valid
status modified: 2013-10-18
accepted date: 2013-10-18
in scheme: Statistical Classification of Economic Activities in the European Community, Rev. 2 (2008)
scope note: - сондиране за извличане на проби от различни дълбочини за строителни, геоложки и геофизични проучвания, вкл. каротаж - пробиване на нефтени и газови кладенци - 06.10, 06.20 - пробиване на сондажни отвори и вземане на проби - 09.90 - пробиване на кладенци за вода - 42.21 - пробиване на шахти - 43.99 - проучване на нефтени и газови находища, геоложки, геофизични и сеизмографски изследвания - 71.12 @bg
scope note: Z: - zkušební a průzkumné vrty pro stavební, geofyzikální, geologické nebo podobné účely N: - těžební vrty ropy a zemního plynu (06.10, 06.20, 09.10) - zkušební a průzkumné vrty na podporu těžby a dobývání (09.10, 09.90) - stavbu studní (42.21) - hloubení šachet (43.99) - průzkumy výskytu ropy a plynu, geofyzikální, geologické a seismické průzkumy (71.12 @cs
scope note: Diese Klasse umfasst: - Test-, Such- und Kernbohrung für bauliche, geophysikalische, geologische oder ähnliche Zwecke Diese Klasse umfasst nicht: - Erdöl- und Erdgasbohrungen zu Förderzwecken (s. 06.10 und 06.20) - Test- und Suchbohrungen zur Unterstützung des Bergbaus (s. 09.90) - Brunnenbau (s. 42.21) - Schachtbau (s. 43.99) - Prospektion auf Öl und Gas, geophysikalische, geologische und seismografische Untersuchungen (s. 71.12) @de
scope note: This class includes: - test drilling, test boring and core sampling for construction, geophysical, geological or similar purposes This class excludes: - drilling of production oil or gas wells, see 06.10, 06.20 - test drilling and boring support services during mining activities, see 09.90 - water well drilling, see 42.21 - shaft sinking, see 43.99 - oil and gas field exploration, geophysical, geological and seismic surveying, see 71.12 @en
scope note: Esta clase comprende: - las perforaciones, sondeos y muestreos para la construcción, geofísicos, geológicos u otros fines similares Esta clase no comprende: - la perforación de pozos de producción de petróleo y gas (véanse 06.10 y 06.20) - los servicios de perforaciones y sondeos de apoyo a las actividades mineras (véase 09.90) - la excavación de pozos hidráulicos (véase 42.21) - la perforación de pozos de minas (véase 43.99) - la prospección de yacimientos de petróleo y de gas; los estudios geofísicos, geológicos y sismográficos (véase 71.12) @es
scope note: Cette classe comprend: - les sondages d’essai, les forages d’essai et les carottages pour la construction ainsi que pour les études géophysiques, géologiques et similaires Cette classe ne comprend pas: - le forage de puits d’extraction de pétrole ou de gaz, voir 06.10 et 06.20 - les services de soutien aux sondages et forages d’essai liés aux activités minières voir 09.90 - le forage de puits d’eau, voir 42.21 - le fonçage de puits, voir 43.99 - la prospection de pétrole et de gaz, les études géophysiques, géologiques et sismiques, voir 71.12 @fr
scope note: Ovaj razred uključuje: - pokusno bušenje, sondiranje i uzimanje uzoraka terena za građevinske, geofizičke, geološke ili slične namjene Ovaj razred isključuje: - bušenje proizvodnih izvora nafte ili plina, vidi 06.10, 06.20 - pokusno bušenje i sondiranje terena u vezi s rudarstvom, vidi 09.90 - bušenje izvora vode, vidi 42.21 - iskop okna, vidi 43.99 - istraživanje nafte i plina, geofizičko, geološko i seizmičko istraživanje, vidi 71.12
scope note: Į šią klasę įeina: - žvalgomasis gręžimas, kernų ėmimas statybiniams, geofizikiniams, geologiniams ar panašiems tikslams Į šią klasę neįeina: - naftos ir dujų gręžinių gręžimas, žr. 06.10, 06.20 - bandomųjų gręžimų ir bandomųjų gręžinių gręžimo paslaugų veikla kasybos metu, žr. 09.90 - vandens šulinių gręžimas, žr. 42.21 - šachtinių šulinių kasimas, žr. 43.99 - naftos ir dujų telkinių žvalgymas, geofizinių, geologinių ir seisminių tyrimų veikla, žr. 71.12 @lt
scope note: Этот класс включает: - внешние и внутренние штукатурные работы в зданиях и других строительных объектах, включая установку штукатурных сеток @ru
scope note: Bu sınıf aşağıdakileri kapsamaktadır; - inşaat, jeofizik, jeolojik veya benzer amaçlar için test sondajı ve test delme ile örnekleme sondajı. Kapsam dışı olanlar; - petrol veya gaz kuyularının kazılması, bkz. 06.10, 06.20, - madencilik faaliyetleri boyunca test olarak delme ve sondaj çukuru açmayı destekleyici hizmetler, bkz. 09.90, - su kuyusu kazılması, bkz. 42.21, - düşey galeri ve kuyu açma (depolama, madencilik tüneli vb.), bkz. 43.99, - petrol ve gaz alanlarının tetkiki, jeofizik, yer bilimsel (jeolojik) ve deprem ile ilgili (sismik) araştırmalar yapılması, bkz. 71.12. @tr
preferred label: Сондиране и пробиване @bg
preferred label: Průzkumné vrtné práce @cs
preferred label: Funderingsundersøgelser @da
preferred label: Test- und Suchbohrung @de
preferred label: Δοκιμαστικές γεωτρήσεις @el
preferred label: Perforaciones y sondeos @es
preferred label: Kontrollpuurimine ja sondimine @et
preferred label: Koeporaus @fi
preferred label: Forages et sondages @fr
preferred label: Talajmintavétel, próbafúrás
preferred label: Trivellazioni e perforazioni @it
preferred label: Žvalgomasis gręžimas @lt
preferred label: Pētniecisko urbumu veikšana @lv
preferred label: Titqib u taħfir bi prova @mt
preferred label: Proefboren en boren @nl
preferred label: Prøveboring @no
preferred label: Wykonywanie wykopów i wierceń geologiczno-inżynierskich @pl
preferred label: Perfurações e sondagens @pt
preferred label: Lucrări de foraj şi sondaj pentru construcţii @ro
preferred label: Разведочное бурение @ru
preferred label: Prieskumné vrty a vrtné práce @sk
preferred label: Testno vrtanje in sondiranje @sl
preferred label: Markundersökning @sv
preferred label: Test sondajı ve delme @tr
broader: Demolition and site preparation

Electrical, plumbing and other construction installation activities
type: Concept
notation: 43.2
status: valid
status modified: 2013-10-18
accepted date: 2013-10-18
in scheme: Statistical Classification of Economic Activities in the European Community, Rev. 2 (2008)
scope note: Тази група включва дейности по изграждане в сгради и съоръжения на инсталации от всички видове, които ги правят функционални. Включени са дейностите по изграждане на електрически, водопроводни, канализационни, отоплителни и климатични инсталации, монтаж на асансьори и ескалатори и други. @bg
scope note: Tato skupina zahrnuje jakékoli instalační práce, díky kterým lze zajistit funkčnost stavby. Patří sem elektroinstalační práce, instalace vodovodů, odpadů, plynu, systémů vytápění, větrání a klimatizace, instalace výtahů atd. @cs
scope note: Diese Gruppe umfasst den Einbau technischer Anlagen, die für die Nutzung eines Gebäudes erforderlich sind. Hierzu zählt die Elektro-, Wasser-, Gas-, Heizungs-, Lüftungs- und Klimaanlageninstallation, der Einbau von Aufzügen usw. @de
scope note: This group includes installation activities that support the functioning of a building as such, including installation of electrical systems, plumbing (water, gas and sewage systems), heat and air-conditioning systems, elevators etc. @en
scope note: Este grupo comprende las actividades de instalación que permiten el funcionamiento de un edificio como tal, incluida la instalación de sistemas eléctricos, fontanería (agua, gas y sistemas de aguas residuales), sistemas de calefacción y aire acondicionado, ascensores, etc. @es
scope note: Ce groupe comprend l’installation de toutes sortes de commodités qui rendent la construction fonctionnelle, y compris l’installation de systèmes électriques, les travaux de plomberie (installations d’eau, de gaz et des eaux usées), de systèmes de chauffage et de conditionnement d’air, d’ascenseurs et d’escaliers mécaniques, etc. @fr
scope note: Ova skupina uključuje instalacijske radove koji omogućuju nesmetanu uporabu građevine, uključujući uvođenje električnih instalacija, instalacija vodovoda, kanalizacije i plina, sustava za grijanje i klimatizaciju, postavljanje dizala, pokretnih stepenica itd.
scope note: Į šią grupę įeina pastato funkcionavimui reikalingų sistemų, tokių kaip elektros, vidaus vamzdynų (vandens, dujų ir kanalizacijos sistemų), šildymo ir oro kondicionavimo sistemų, liftų ir kt., įrengimas. @lt
scope note: Этот класс включает: - установку дверей (за исключением автоматических и вращающихся), окон, дверных и оконных рам из дерева или других материалов - монтаж сборных кухонных гарнитуров, встроенных шкафов, лестниц, торгового оборудования и пр. - работы по внутренней отделке: установка потолков, раздвижных перегородок и т.п. Этот класс исключает: - установку автоматических и вращающихся дверей, см. 43.29 @ru
scope note: Bu grup, bir binanın işleyişini destekleyen elektrik, boruların tesisatı (su, gaz ve kanalizasyon), ısıtma ve iklimlendirme, asansör vb. sistemlerin kurulum faaliyetlerini kapsamaktadır. @tr
preferred label: Изграждане на инсталации @bg
preferred label: Elektroinstalační, instalatérské a ostatní stavebně instalační práce @cs
preferred label: El-installation, vvs- og blikkenslagerforretninger samt anden bygningsinstallationsvirksomhed @da
preferred label: Bauinstallation @de
preferred label: Δραστηριότητες ηλεκτρολογικών, υδραυλικών και άλλων κατασκευαστικών εγκαταστάσεων @el
preferred label: Instalaciones eléctricas, de fontanería y otras instalaciones en obras de construcción @es
preferred label: Elektriinstallatsioon ja torustiku paigaldus jm ehituspaigaldustööd @et
preferred label: Sähkö-, vesijohto- ja muu rakennusasennus @fi
preferred label: Travaux d'installation électrique, plomberie et autres travaux d'installation @fr
preferred label: Épületgépészeti szerelés
preferred label: Installazione di impianti elettrici, idraulici e altri lavori di costruzione e installazione @it
preferred label: Elektros, vandentiekio ir kitos įrangos įrengimas @lt
preferred label: Elektroinstalācijas ierīkošanas, cauruļvadu uzstādīšanas un citas līdzīgas darbības @lv
preferred label: Elettriku, plaming u attivitajiet oħra ta' installazzjoni tal-kostruzzjoni @mt
preferred label: Elektrische installatie, loodgieterswerk en overige bouwinstallatie @nl
preferred label: Elektrisk installasjonsarbeid, VVS-arbeid og annet installasjonsarbeid @no
preferred label: Wykonywanie instalacji elektrycznych, wodno-kanalizacyjnych i pozostałych instalacji budowlanych @pl
preferred label: Instalação eléctrica, de canalizações e outras instalações @pt
preferred label: Lucrări de instalaţii electrice şi tehnico-sanitare şi alte lucrări de instalaţii pentru construcţii @ro
preferred label: Электротехнические, слесарные и прочие строительно-монтажные работы @ru
preferred label: Elektrické, inštalačné a iné stavebno-montážne práce @sk
preferred label: Inštaliranje pri gradnjah @sl
preferred label: Elinstallationer, VVS-arbeten och andra bygginstallationer @sv
preferred label: Elektrik tesisatı, sıhhi tesisat ve diğer inşaat tesisatı faaliyetleri @tr
broader: Specialised construction activities
narrower: Electrical installation
narrower: Plumbing, heat and air-conditioning installation
narrower: Other construction installation

Electrical installation
type: Concept
notation: 43.21
status: valid
status modified: 2013-10-18
accepted date: 2013-10-18
in scheme: Statistical Classification of Economic Activities in the European Community, Rev. 2 (2008)
scope note: - изграждането в сгради и съоръжения на: • електрически инсталации и уредби • инсталации за далекосъобщения • компютърни мрежи и кабелни мрежи за телевизионни програми, вкл. оптичните влакна • сателитни чинии • осветителни системи • пожароизвестителни инсталации • сигнално-охранителни известителни системи • улично осветление и светлинни сигнали • наземни светлини на подхода за кацане и излитане - свързване на електрически уреди и домакински принадлежности, вкл. подово отопление - изграждане на електрически и далекосъобщителни мрежи – 42.22 - инсталиране и поддържане на пожароизвестителни инсталации и сигнално-охранителни известителни системи, ако е заедно с дейностите по контрол и дистанционно наблюдение - 80.20 @bg
scope note: Tato třída zahrnuje instalace elektrických systémů ve všech typech budov a inženýrských dílech. Z: - instalaci: • elektrického kabelového vedení • kabelového vedení pro telekomunikační systémy • kabelového vedení pro počítačové sítě a kabelové televize, včetně kabelů z optických vláken • parabolických antén • osvětlovacích zařízení • požárně bezpečnostních zařízení • bezpečnostních zařízení proti vloupání • elektrické signalizace a osvětlení komunikací • světelných návěstidel pro vzletové a přistávací dráhy ZT: - připojení elektrických domácích spotřebičů, včetně podlahového vytápění N: - výstavbu vedení pro přenos elektřiny a dat (42.22) - monitorování a dálkové monitorování elektronických bezpečnostních systémů, jako jsou poplašná zařízení proti vloupání a požáru, včetně jejich instalace a údržby (80.20) @cs
scope note: Diese Klasse umfasst folgende Elektroinstallationen in Gebäuden und Tiefbauwerken aller Arten: Diese Klasse umfasst: - Installation von: • elektrischen Leitungen und Armaturen • Leitungen für Telekommunikationssysteme • Leitungen für Computernetze und Kabelfernsehen, einschließlich Glasfaserkabeln • Parabolantennen • Beleuchtungsanlagen • Feuermeldeanlagen • Einbruchalarmanlagen • Straßenbeleuchtung und elektrische Signale • Befeuerungsanlagen für Rollbahnen • elektrischen Solarwärmekollektoren Diese Klasse umfasst ferner: - Anschluss von elektrischen Haushaltsgeräten, einschließlich Fußleistenheizung Diese Klasse umfasst nicht: - Bau von Strom- und Kommunikationsleitungen (s. 42.22) - Überwachung und Fernüberwachung von elektronischen Sicherheitssystemen wie Einbruchs- oder Diebstahlalarmgeräten und Feuermeldern, einschließlich deren Installation und Instandhaltung (s. 80.20) @de
scope note: This class includes the installation of electrical systems in all kinds of buildings and civil engineering structures of electrical systems. This class includes: - installation of: • electrical wiring and fittings • telecommunications wiring • computer network and cable television wiring, including fibre optic • satellite dishes • lighting systems • fire alarms • burglar alarm systems • street lighting and electrical signals • airport runway lighting • electric solar energy collectors This class also includes: - connecting of electric appliances and household equipment, including baseboard heating This class excludes: - construction of communications and power transmission lines, see 42.22 - monitoring and remote monitoring of electronic security systems, such as burglar alarms and fire alarms, including their installation and maintenance, see 80.20 @en
scope note: Esta clase comprende la instalación de sistemas eléctricos en todo tipo de edificios y estructuras de ingeniería civil. Esta clase comprende: - la instalación de: • cables eléctricos y sus accesorios • cables de telecomunicación • cables para redes informáticas y de televisión por cable, incluidos los de fibra óptica • antenas parabólicas • sistemas de iluminación • alarmas contra incendios • sistemas de alarma de protección contra robos • alumbrado y señales eléctricas en calles • alumbrado de pistas aeroportuarias Esta clase comprende también: - la conexión de aparatos eléctricos y equipos domésticos, incluida la calefacción radiante Esta clase no comprende: - la construcción de líneas eléctricas y de comunicaciones (véase 42.22) - la vigilancia a distancia o no de sistemas electrónicos de seguridad, como alarmas contra robos o incendios, incluida su instalación y su mantenimiento (véase 80.20) @es
scope note: Cette classe comprend l’installation de systèmes électriques dans des bâtiments et des ouvrages de génie civil de toute nature. Cette classe comprend: - l’installation de: • câbles et appareils électriques • câbles de télécommunications • câblage de réseau informatique et de télévision par câble, y compris les fibres optiques • paraboles • installations d’éclairage • systèmes d’alarme incendie • systèmes d’alarme contre les effractions • appareils d’éclairage de rue et signaux électriques • éclairage des pistes d’atterrissage • capteurs d’énergie solaire électriques Cette classe comprend également: - la connexion d’appareils électriques et d’électroménagers, y compris le chauffage par panneau rayonnant Cette classe ne comprend pas: - la construction de lignes de communication et de transport d’énergie électrique, voir 42.22 - la surveillance et la surveillance à distance de systèmes de sécurité électroniques tels que des dispositifs d’alarme antivol et d’alarme incendie, y compris leur installation et maintenance, voir 80.20 @fr
scope note: Ovaj razred uključuje uvođenje električnih instalacija u svim vrstama zgrada i građevinama niskogradnje. Ovaj razred uključuje: - postavljanje: • električnih vodova i opreme • telekomunikacijskih vodova • vodova za računalno umrežavanje i kabelsku televiziju, uključujući optičke kabele • satelitskih tanjura • sustava rasvjete • protupožarnih alarma • protuprovalnih alarma • ulične rasvjete i električne signalizacije • rasvjete na uzletištu u zračnim lukama Ovaj razred također uključuje: - priključivanje električnih kućanskih aparata i opreme, uključujući podno grijanje Ovaj razred isključuje: - gradnju komunikacijskih i elektroenergetskih distribucijskih vodova, vidi 42.22 - postavljanje, održavanje i nadzor, uključujući i daljinski nadzor, elektroničkih sigurnosnih sustava, kao što su protuprovalni i protupožarni alarmi, vidi 80.20
scope note: Į šią klasę įeina elektros sistemų įrengimas visų rūšių pastatuose ir inžineriniuose statiniuose. Į šią klasę įeina: - įrengimas: • elektros instaliacijos ir įtaisų • telekomunikacijų kabelių sistemų • kompiuterių tinklų ir kabelinės televizijos kabelių, įskaitant skaidulinės optikos kabelius • palydovinių antenų • apšvietimo sistemų • gaisro signalizacijos • apsaugos nuo įsilaužimų sistemų • gatvių apšvietimo ir elektrinių signalų • oro uostų kilimo ir tūpimo takų apšvietimo Į šią klasę taip pat įeina: - elektrinių prietaisų ir buitinės įrangos prijungimas, įskaitant grindjuostinį šildymą Į šią klasę neįeina: - ryšių ir energijos perdavimo linijų tiesyba, žr. 42.22 - elektroninių saugos sistemų, tokių kaip apsaugos nuo įsilaužimo ir gaisro signalizacijos, vietinė ir nuotolinė stebėsena, įskaitant jų įrengimą ir techninę priežiūrą, žr. 80.20 @lt
scope note: Этот класс включает: - укладывание, наклеивание плиток, подвешивание или сборку каких-либо частей в зданиях и прочих строительных сооружениях: • напольной или настенной плитки из керамики, бетона или тесаного камня, а также установку керамической печи • укладку паркета и прочих деревянных напольных покрытий, деревянных настенных покрытий • ковролана и линолеума, включая резиновые или пластиковые напольные покрытия • напольного или настенного покрытия из венецианской мозаики, мрамора или плит • оклеивание обоев @ru
scope note: Bu sınıf her çeşit binanın elektrik tesisatı ile bina dışı inşaatların elektrik tesisatlarının kurulumunu kapsamaktadır: Bu sınıf aşağıdakileri kapsamaktadır; - aşağıdakilerin kurulumu; • elektrik tesisatı ve bağlantı parçaları, • haberleşme kablolarının döşenmesi, • fiber optik dahil, kablolu televizyon ve bilgisayar ağı tesisatı, • uydu çanakları, • aydınlatma sistemleri, • yangın alarmları, • hırsız alarm sistemleri, • cadde aydınlatması ve elektrik işaretler, • havaalanı pisti aydınlatması. Ayrıca bu sınıf aşağıdakileri de kapsamaktadır; - duvar dibi ısıtma sistemleri de dahil, elektrikli aletler ve ev teçhizatının bağlanması. Kapsam dışı olanlar; - haberleşme ve yüksek gerilim hatlarının kurulumu, bkz. 42.22, - tesisatın kurulum ve bakımı dahil olmak üzere, hırsız ve yangın alarmları gibi, elektronik güvenlik sistemlerinin izlenmesi veya uzaktan kontrol edilmesi, bkz.80.20. @tr
preferred label: Изграждане на електрически инсталации @bg
preferred label: Elektrické instalace @cs
preferred label: El-installation @da
preferred label: Elektroinstallation @de
preferred label: Ηλεκτρικές εγκαταστάσεις @el
preferred label: Instalaciones eléctricas @es
preferred label: Elektriinstallatsioon @et
preferred label: Sähköasennus @fi
preferred label: Installation électrique @fr
preferred label: Villanyszerelés
preferred label: Installazione di impianti elettrici @it
preferred label: Elektros sistemų įrengimas @lt
preferred label: Elektroinstalācijas ierīkošana @lv
preferred label: Installazzjoni ta' elettriku @mt
preferred label: Elektrische installatie @nl
preferred label: Elektrisk installasjonsarbeid @no
preferred label: Wykonywanie instalacji elektrycznych @pl
preferred label: Instalações eléctricas @pt
preferred label: Lucrări de instalaţii electrice @ro
preferred label: Электротехнические и монтажные работы @ru
preferred label: Elektrická inštalácia @sk
preferred label: Inštaliranje električnih napeljav in naprav @sl
preferred label: Elinstallationer @sv
preferred label: Elektrik tesisatı @tr
broader: Electrical, plumbing and other construction installation activities

Plumbing, heat and air-conditioning installation
type: Concept
notation: 43.22
status: valid
status modified: 2013-10-18
accepted date: 2013-10-18
in scheme: Statistical Classification of Economic Activities in the European Community, Rev. 2 (2008)
scope note: Този клас включва изграждане на водопроводни, канализационни, вентилационни и климатични инсталации, вкл. техният ремонт и поддържане. - изграждане и монтаж в сгради и съоръжения на: • отоплителни системи (електрически, газови и нефтени) • пещи, охладителни кули • слънчеви колектори, които преобразуват директно слънчевата светлина в топлинна енергия • водоснабдителни и канализационни инсталации, вкл. инсталиране на санитарна керамика • вентилационни и климатични инсталации, вкл. тръбопроводните и съединителните им части • газови инсталации • тръбопроводи за пара • дъждовални (спринклер) системи за гасене на пожар • дъждовални (спринклер) системи за тревни площи - монтаж на тръбопроводи - монтаж на електрическо подово отопление – 43.21 @bg
scope note: Tato třída zahrnuje instalaci rozvodů vody, odpadu, plynu, topení a větracích a klimatizačních zařízení, včetně přístaveb, změn, údržby a oprav. Z: - instalaci těchto zařízení v budovách a jiných stavebních dílech: • zařízení (elektrického, plynového, olejového nebo naftového) vytápění • pecí, chladicích věží • neelektrických solárních kolektorů • zařízení rozvodů vody a sanitární techniky • větracích a klimatizačních zařízení • rozvodů plynu • parního potrubí • sprinkleorvých zařízení pro účely požární ochrany (požární sprinklery) • zahradních zavlažovacích systémů • vzduchotechnického potrubí N: - montáž elektrických podlahových topení (43.21) @cs
scope note: Diese Klasse umfasst die Installation von Gas-, Wasser-, Heizungs- und Lüftungs- sowie Klimaanlagen, einschließlich Erweiterung, Umbau, Instandhaltung und Reparatur. Diese Klasse umfasst: - Einbau von Folgendem in Gebäude und andere Bauwerke: • (Elektro-, Gas- oder Öl-) Heizungsanlagen • Öfen, Kühltürme • nicht-elektrische Solarwärmekollektoren • Wasser- und Sanitärinstallationen • Lüftungs- und Klimaanlagen • Gasinstallationen • Dampfleitungen • Sprinkleranlagen für Brandschutzzwecke • Rasensprengeranlagen - (Leer-) Rohrverlegung Diese Klasse umfasst nicht: - Einbau elektrischer Fußleistenheizungen (s. 43.21) @de
scope note: This class includes the installation of plumbing, heating and air-conditioning systems, including additions, alterations, maintenance and repair. This class includes: - installation in buildings or other construction projects of: • heating systems (electric, gas and oil) • furnaces, cooling towers • non-electric solar energy collectors • plumbing and sanitary equipment • ventilation and air-conditioning equipment and ducts • gas fittings • steam piping • fire sprinkler systems • lawn sprinkler systems - duct work installation This class excludes: - installation of electric baseboard heating, see 43.21 @en
scope note: Esta clase comprende la instalación de fontanería y sistemas de calefacción y aire acondicionado, incluidas las ampliaciones, las reformas, el mantenimiento y la reparación. Esta clase comprende: - la instalación en edificios y otras obras de construcción de: • sistemas de calefacción (eléctrica, de gas o de petróleo) • hornos, torres de refrigeración • colectores no eléctricos de energía solar • fontanería y sanitarios • equipos y conducciones de ventilación y aire acondicionado • instalaciones de gas • conducciones de vapor • sistemas de aspersión automática contra incendios • sistemas de aspersión automática para riego - instalación de canalizaciones Esta clase no comprende: - la instalación de calefacción radiante eléctrica (véase 43.21) @es
scope note: Cette classe comprend des activités telles que la plomberie, l’installation de systèmes de chauffage et de conditionnement d’air, ainsi que les extensions, les transformations, l’entretien et les réparations. Cette classe comprend: - l’installation dans des bâtiments ou d’autres projets de construction des éléments suivants: • systèmes de chauffage (à l’électricité, au gaz et au mazout) • chaudières, tours de refroidissement • les capteurs d’énergie solaire non électriques • plomberie et appareils sanitaires • matériel et conduites de ventilation et de climatisation • appareils à gaz • conduites de distribution de vapeur • installations d’extinction automatique d’incendie • systèmes d’arrosage automatique des pelouses - les travaux d’installation de conduits Cette classe ne comprend pas: - l’installation de chauffage électrique par panneau rayonnant, voir 43.21 @fr
scope note: Ovaj razred uključuje uvođenje instalacija vodovoda, kanalizacije i plina, sustava za grijanje i klimatizaciju, uključujući dogradnju, preinake, održavanje i popravak. Ovaj razred uključuje: - postavljanje u zgradama ili drugim građevinama: • sustava za grijanje (na struju, plin ili naftu) • peći za proizvodnju topline (npr. kotlovnice, visoke peći u industriji), uređaja za hlađenje vode (tzv. rashladni tornjevi u industriji) • neelektričnih kolektora sunčeve energije • instalacija vodovoda i kanalizacije te sanitarne opreme • opreme i vodova za ventilaciju i klimatizaciju • plinskih instalacija • cijevi za paru • automatskih sustava za gašenje požara (tzv. sprinkler sustavi) • sustava za raspršivanje vode na travnjacima - postavljanje cijevi za prolaz zraka, tekućina ili kablova Ovaj razred isključuje: - postavljanje električnog podnog grijanja, vidi 43.21
scope note: Į šią klasę įeina vandentiekio, šildymo ir oro kondicionavimo sistemų įrengimas, įskaitant išplėtimą ir rekonstravimą, techninę priežiūrą ir remontą. Į šią klasę įeina: - įrengimas pastatuose ar kituose statiniuose: • šildymo sistemų (elektros, dujų ir mazuto) • krosnių, aušinimo bokštų • neelektrinių saulės energijos kolektorių • vandentiekio ir sanitarinės įrangos • vėdinimo ir oro kondicionavimo įrangos ir kanalų • dujų įrangos • garo vamzdynų • purškiamųjų gaisro gesinimo sistemų • vejų purškiamojo laistymo sistemų - ortakynų įrengimas Į šią klasę neįeina: - elektrinių grindjuostinio šildymo sistemų įrengimas, žr. 43.21 @lt
scope note: Этот класс включает: - внешнюю и внутреннюю покраску зданий - покраску объектов гражданского строительства - установку стекол, зеркал и т.д. Этот класс исключает: - установку окон, см. 43.32 @ru
scope note: Bu sınıf ilaveler, değişiklikler, bakım ve onarım dahil, sıhhi tesisat ile ısıtma ve havalandırma sistemlerini kapsar. Bu sınıf aşağıdakileri kapsamaktadır; - binalar veya diğer inşaat projelerinde tesisat: • ısıtma sistemleri (elektrik, gaz ve petrol), • sıcak hava cihazları, soğutma kuleleri, • elektriksiz güneş enerjisi kolektörleri, • boru ve sıhhi tesisat ekipmanı, • havalandırma ve iklimlendirme teçhizat ve kanalları, • gaz tesisatı, • buhar boruları tesisatı, • yangın söndürme sistemleri, • çim sulama sistemleri, - boru tesisatı. Kapsam dışı olanlar; - duvar dibi elektrikli ısıtma sistemlerinin tesisatı, bkz. 43.21. @tr
preferred label: Изграждане на водопроводни, канализационни, отоплителни и климатични инсталации @bg
preferred label: Instalace rozvodů vody, topení a klimatizace @cs
preferred label: VVS- og blikkenslagerforretninger, installation af varme- og airconditioninganlæg @da
preferred label: Gas-, Wasser-, Heizungs- sowie Lüftungs- und Klimainstallation @de
preferred label: Υδραυλικές και κλιματιστικές εγκαταστάσεις θέρμανσης και ψύξης @el
preferred label: Fontanería, instalaciones de sistemas de calefacción y aire acondicionado @es
preferred label: Torustiku, kütte- ja kliimaseadmete paigaldus @et
preferred label: Lämpö-, vesijohto- ja ilmastointiasennus @fi
preferred label: Travaux de plomberie et installation de chauffage et de conditionnement d'air @fr
preferred label: Víz-, gáz-, fűtés-, légkondicionáló-szerelés
preferred label: Installazione di impianti idraulici, di riscaldamento e di condizionamento dell'aria @it
preferred label: Vandentiekio, šildymo ir oro kondicionavimo sistemų įrengimas @lt
preferred label: Cauruļvadu, apkures un gaisa kondicionēšanas iekārtu uzstādīšana @lv
preferred label: Installazzjoni ta' plaming, tisħin u installazzjoni ta' arja kkondizzjonata @mt
preferred label: Loodgieterswerk, installatie van verwarming en klimaatregeling @nl
preferred label: VVS-arbeid @no
preferred label: Wykonywanie instalacji wodno-kanalizacyjnych, cieplnych i klimatyzacyjnych @pl
preferred label: Instalação de canalizações e de climatização @pt
preferred label: Lucrări de instalaţii sanitare, de încălzire şi de aer condiţionat @ro
preferred label: Монтаж систем водоснабжения, отопления и кондиционирования воздуха @ru
preferred label: Inštalácia kanalizačných, výhrevných a klimatizačných zariadení @sk
preferred label: Inštaliranje vodovodnih, plinskih, ogrevalnih napeljav in naprav @sl
preferred label: VVS-arbeten @sv
preferred label: Sıhhi tesisat, ısıtma ve iklimlendirme tesisatı @tr
broader: Electrical, plumbing and other construction installation activities

Other construction installation
type: Concept
notation: 43.29
status: valid
status modified: 2013-10-18
accepted date: 2013-10-18
in scheme: Statistical Classification of Economic Activities in the European Community, Rev. 2 (2008)
scope note: Този клас включва изграждане в сгради и съоръжения на други инсталации, различни от електрически, водопроводни, канализационни, отоплителни и климатични инсталации. - изграждане и монтаж в сгради и съоръжения на: • асансьори и ескалатори • автоматични, летящи или въртящи се врати • гръмоотводи • системи за централно вакуумно почистване • топлинни, звукови или вибрационни изолации - инсталиране на промишлено оборудване – 33.20 @bg
scope note: Tato třída zahrnuje instalaci jiných zařízení než rozvodů elektřiny, vody, odpadu, plynu, topení, větracích a klimatizačních zařízení nebo průmyslových strojů a zařízení v budovách a stavebních dílech. Z: - instalaci těchto zařízení v budovách a stavebních dílech: • výtahů a pohyblivých schodišť, včetně údržby a oprav • automatických dveří, otáčivých dveří a turniketů • hromosvodů • systémů odsávání prachu • izolací proti chladu, teplu, hluku a otřesům N: - instalaci průmyslových strojů a zařízení (33.20) @cs
scope note: Diese Klasse umfasst die Installation von anderen Anlagen als Gas-, Wasser-, Heizungs-, Lüftungs- und Klimaanlagen oder Industriemaschinen in Gebäuden und anderen Bauwerken. Diese Klasse umfasst: - Einbau von Folgendem in Gebäude und andere Bauwerke: • Aufzüge und Rolltreppen, einschließlich Reparatur und Instandhaltung • automatische Türen und Drehtüren • Blitzableiter • Staubsaugersysteme • Dämmung gegen Kälte, Wärme, Schall und Erschütterung Diese Klasse umfasst nicht: - Installation von Industriemaschinen (s. 33.20) @de
scope note: This class includes the installation of equipment other than electrical, plumbing, heating and air-conditioning systems or industrial machinery in buildings and civil engineering structures. This class includes: - installation in buildings or other construction projects of: • elevators, escalators, including repair and maintenance • automated and revolving doors • lightning conductors • vacuum cleaning systems • thermal, sound or vibration insulation This class excludes: - installation of industrial machinery, see 33.20 @en
scope note: Esta clase comprende la instalación de equipos distintos de los sistemas eléctricos, de fontanería, de calefacción y de aire acondicionado, y de maquinaria industrial en edificios y estructuras de ingeniería civil. Esta clase comprende: - la instalación en edificios y otras obras de construcción de: • ascensores y escaleras mecánicas, incluyendo la reparación y el mantenimiento • puertas automáticas y giratorias • pararrayos • sistema de limpieza por aspirado • aislamientos térmicos, de sonido o de vibraciones Esta clase no comprende: - la instalación de maquinaria industrial (véase 33.20) @es
scope note: Cette classe comprend les autres travaux d’installation que l’électricité, la plomberie, les systèmes de chauffage et de conditionnement d’air ou de machines industrielles dans des bâtiments et des ouvrages de génie civil. Cette classe comprend: - l’installation dans des bâtiments ou d’autres projets de construction des éléments suivants: • monte-charge, escaliers mécaniques, y compris leur réparation et entretien • portes automatiques et tambours • paratonnerres • aspirateurs • isolation thermique, acoustique et antivibrations Cette classe ne comprend pas: - l’installation de machines industrielles, voir 33.20 @fr
scope note: Ovaj razred uključuje postavljanje ostale opreme u zgradama i građevinama niskogradnje, osim uvođenja električnih instalacija, instalacija vodovoda, kanalizacije i plina, sustava za grijanje i klimatizaciju ili instaliranja industrijskih strojeva i opreme. Ovaj razred uključuje: - postavljanje u zgradama ili drugim građevinama: • dizala i pokretnih stepenica, uključujući popravak i održavanje • automatskih vrata i vrata na senzor • gromobrana • sustava za centralno usisavanje • toplinske, zvučne i vibracijske izolacije Ovaj razred isključuje: - instaliranje industrijskih strojeva i opreme, vidi 33.20
scope note: Į šią klasę įeina kitokios nei elektros, vandentiekio, šildymo ir oro kondicionavimo sistemų ar pramoninių mašinų įrangos įrengimas pastatuose ir inžineriniuose statiniuose Į šią klasę įeina: - įrengimas pastatuose ar kituose statiniuose: • liftų ir eskalatorių, įskaitant remontą ir techninę priežiūrą • automatinių ir sukamųjų durų • žaibolaidžių • vakuuminių valymo sistemų • šilumos, garso ar vibracijų izoliacijos Į šią klasę neįeina: - pramoninių mašinų įrengimas, žr. 33.20 @lt
scope note: Этот класс включает: - приведение в порядок новых зданий после завершения строительства - прочие отделочные работы, не включенные в другие категории Этот класс исключает: - работу дизайнеров по внутренней отделке, см. 74.10 - общую внутреннюю очистку зданий и сооружений, см. 81.21 - специализированную внутреннюю и внешнюю очистку зданий, см. 81.22 @ru
scope note: Bu sınıf binalar ve bina dışı inşaat işlerinde kullanılan, elektrik, boru, ısıtma ve iklimlendirme sistemleri veya endüstri makinelerinin haricindeki cihazların kurulumunu kapsamaktadır. Bu sınıf aşağıdakileri kapsamaktadır; - binalar veya diğer inşaat projelerindeki tesisat işleri: • asansörler, yürüyen merdivenler (bakım ve onarım dahil), • otomatik ve döner kapılar, • paratoner tesisatı, • vakumlu temizleme sistemleri, • ısı, ses veya titreşim yalıtımı. Kapsam dışı olanlar; - sanayi makinelerinin tesisatı,bkz. 33.20. @tr
preferred label: Изграждане на други инсталации @bg
preferred label: Ostatní stavební instalace @cs
preferred label: Anden bygningsinstallationsvirksomhed @da
preferred label: Sonstige Bauinstallation @de
preferred label: Άλλες κατασκευαστικές εγκαταστάσεις @el
preferred label: Otras instalaciones en obras de construcción @es
preferred label: Muud ehituspaigaldustööd @et
preferred label: Muu rakennusasennus @fi
preferred label: Autres travaux d'installation @fr
preferred label: Egyéb épületgépészeti szerelés
preferred label: Altri lavori di costruzione e installazione @it
preferred label: Kitos įrangos įrengimas @lt
preferred label: Citu inženiersistēmu montāža @lv
preferred label: Installazzjoni oħra tal-kostruzzjoni @mt
preferred label: Overige bouwinstallatie @nl
preferred label: Annet installasjonsarbeid @no
preferred label: Wykonywanie pozostałych instalacji budowlanych @pl
preferred label: Outras instalações de construção @pt
preferred label: Alte lucrări de instalaţii pentru construcţii @ro
preferred label: Прочие строительно-монтажные работы @ru
preferred label: Ostatná stavebná inštalácia @sk
preferred label: Drugo inštaliranje pri gradnjah @sl
preferred label: Andra bygginstallationer @sv
preferred label: Diğer inşaat tesisatı @tr
broader: Electrical, plumbing and other construction installation activities

Building completion and finishing
type: Concept
notation: 43.3
status: valid
status modified: 2013-10-18
accepted date: 2013-10-18
in scheme: Statistical Classification of Economic Activities in the European Community, Rev. 2 (2008)
preferred label: Довършителни строителни дейности @bg
preferred label: Kompletační a dokončovací práce @cs
preferred label: Bygningsfærdiggørelse @da
preferred label: Sonstiger Ausbau @de
preferred label: Κατασκευαστικές εργασίες ολοκλήρωσης και τελειώματος @el
preferred label: Acabado de edificios @es
preferred label: Ehitiste viimistlus ja lõpetamine @et
preferred label: Rakennusten ja rakennelmien viimeistely @fi
preferred label: Travaux de finition @fr
preferred label: Befejező építés
preferred label: Completamento e finitura di edifici @it
preferred label: Statybos baigimas ir apdaila @lt
preferred label: Būvdarbu pabeigšana @lv
preferred label: Tlestija u rfinar tal-bini @mt
preferred label: Afwerking van gebouwen @nl
preferred label: Ferdiggjøring av bygninger @no
preferred label: Wykonywanie robót budowlanych wykończeniowych @pl
preferred label: Actividades de acabamento @pt
preferred label: Lucrări de finisare @ro
preferred label: Отделочные строительные работы @ru
preferred label: Kompletizačné a dokončovacie práce @sk
preferred label: Zaključna gradbena dela @sl
preferred label: Slutbehandling av byggnader @sv
preferred label: Binanın tamamlanması ve bitirilmesi @tr
broader: Specialised construction activities
narrower: Plastering
narrower: Joinery installation
narrower: Floor and wall covering
narrower: Painting and glazing
narrower: Other building completion and finishing

Plastering
type: Concept
notation: 43.31
status: valid
status modified: 2013-10-18
accepted date: 2013-10-18
in scheme: Statistical Classification of Economic Activities in the European Community, Rev. 2 (2008)
scope note: - нанасяне на вътрешна и външна мазилка, гипсова или варова шпакловка в сгради или съоръжения, вкл. нанасяне на мазилка върху рабицова мрежа @bg
scope note: Z: - vnější a vnitřní štukatérské, sádrovací a omítkářské práce včetně souvisejícího laťování na budovách a stavebních dílech a v nich @cs
scope note: Diese Klasse umfasst: - Stuck-, Gips- und Verputzarbeiten innen und außen einschließlich damit verbundener Lattenschalung in und an Gebäuden und anderen Bauwerken @de
scope note: This class includes: - application in buildings or other construction projects of interior and exterior plaster or stucco, including related lathing materials @en
scope note: Esta clase comprende: - la aplicación en edificios y otras obras de construcción de yeso y estuco interior y exterior, incluidos los materiales de listonado correspondientes @es
scope note: Cette classe comprend: - la mise en œuvre dans des bâtiments ou d’autres projets de construction de plâtre ou de stuc pour enduits intérieurs et extérieurs, y compris les matériaux de lattage associés @fr
scope note: Ovaj razred uključuje: - nanošenje unutrašnje i vanjske žbuke ili ukrasne radove (štukature) u zgradama ili drugim građevinama, uključujući postavljanje odgovarajuće podloge od drvenih letvica
scope note: Į šią klasę įeina: - pastatų ar kitų statinių vidaus ir išorės tinkavimas, įskaitant tinko pagrindo tvirtinimą @lt
scope note: Этот класс включает: - монтаж крыши - укладку кровли Этот класс исключает: - аренду строительного оборудования и техники без участия оператора, см. 77.32 @ru
scope note: Bu sınıf aşağıdakileri kapsamaktadır; -binalarda veya diğer inşaat projelerinde, ilgili kaplama malzemeleri de dahil, iç ve dış sıva veya alçı işleri @tr
preferred label: Полагане на мазилки @bg
preferred label: Omítkářské práce @cs
preferred label: Stukkatørvirksomhed @da
preferred label: Anbringen von Stuckaturen, Gipserei und Verputzerei @de
preferred label: Επιχρίσεις κονιαμάτων @el
preferred label: Revocamiento @es
preferred label: Krohvimine @et
preferred label: Rappaus @fi
preferred label: Travaux de plâtrerie @fr
preferred label: Vakolás
preferred label: Intonacatura @it
preferred label: Tinkavimas @lt
preferred label: Apmetēju darbi @lv
preferred label: Tikħil @mt
preferred label: Stukadoorswerk @nl
preferred label: Stukkatørarbeid og pussing @no
preferred label: Tynkowanie @pl
preferred label: Estucagem @pt
preferred label: Lucrări de ipsoserie @ro
preferred label: Штукатурные работы @ru
preferred label: Omietkárske práce @sk
preferred label: Fasaderska in štukaterska dela @sl
preferred label: Puts-, fasad- och stuckatörsarbeten @sv
preferred label: Sıva işleri @tr
broader: Building completion and finishing

Joinery installation
type: Concept
notation: 43.32
status: valid
status modified: 2013-10-18
accepted date: 2013-10-18
in scheme: Statistical Classification of Economic Activities in the European Community, Rev. 2 (2008)
scope note: - монтаж на дограма от всякакъв материал - монтаж на интериорни и други завършващи елементи - окачени тавани, подвижни преградни стени и други подобни - монтаж на автоматични, летящи или въртящи се врати – 43.29 @bg
scope note: Z: - instalaci dveří (kromě automatických a otáčivých), oken, dveřních a okenních rámů ze dřeva nebo jiného materiálu - instalaci kuchyňských linek, vestavěných skříní, schodišť, zařízení obchodů a podobně - instalaci stropů, pohyblivých příček a podobné vnitřní stavební práce N: - instalaci automatických dveří, otáčivých dveří a turniketů (43.29) @cs
scope note: Diese Klasse umfasst: - Einbau von Türen (außer automatischen Türen und Drehtüren), Fenstern, Tür- und Fensterrahmen aus Holz oder anderem Material - Einbau von Einbauküchen, Einbauschränken, Treppen, Ladeneinrichtungen und Ähnlichem - Einbau von Decken, beweglichen Trennwänden u. ä. Innenausbauarbeiten Diese Klasse umfasst nicht: - Einbau von automatischen Türen und Drehtüren (s. 43.29) @de
scope note: This class includes: - installation of doors (except automated and revolving), windows, door and window frames, of wood or other materials - installation of fitted kitchens, built-in cupboards, staircases, shop fittings and the like - interior completion such as ceilings, movable partitions, etc. This class excludes: - installation of automated and revolving doors, see 43.29 @en
scope note: Esta clase comprende: - la instalación de puertas (excepto automatizadas y giratorias), ventanas y sus marcos de madera u otros materiales - la instalación de cocinas, armarios empotrados, escaleras, mobiliario para tiendas y similares - acabados interiores, como techos, tabiques móviles, etc. Esta clase no comprende: - la instalación de puertas automatizadas y giratorias (véase 43.29) @es
scope note: Cette classe comprend: - l’installation de portes (à l’exception des portes automatiques et tambours), de fenêtres, de dormants de portes et de fenêtres, d’escaliers, en bois ou en d’autres matériaux - l’installation de meubles tels que cuisines équipées, d’escaliers, d’équipements pour magasins etc. - les aménagements intérieurs tels que plafonds, cloisons mobiles, etc. Cette classe ne comprend pas: - l’installation de portes automatiques et de tambours, voir 43.29 @fr
scope note: Ovaj razred uključuje: - ugradnju vrata (osim automatskih vrata i vrata na senzore), prozora, okvira za vrata i prozore, od drva ili drugog materijala - ugradnju kuhinjskih elemenata, stepenica, opreme za prodavaonice i sl. - unutrašnje završne radove kao što su radovi na postavljanju pomičnih pregrada, stropova itd.
scope note: Į šią klasę įeina: - medinių ar kitų medžiagų durų, išskyrus automatines ir sukamąsias duris, langų, durų ir langų staktų įstatymas, įrengimas - baldų, tokių kaip integruotos virtuvės įrangos, sieninių spintų, laiptų, parduotuvės įrangos ir pan., įrengimas - vidaus darbų, tokių kaip lubų dengimas, judamųjų pertvarų ir kt. įrengimas, užbaigimas Į šią klasę neįeina: - automatinių ir sukamųjų durų įrengimas, žr. 43.29 @lt
scope note: Этот класс включает: - строительные работы, сконцентрированные на одном аспекте, объединяющем различные типы сооружений, требующие специализированных навыков или оборудования: • строительство фундаментов, в том числе сваебойные работы • влаго- и водоизоляционные работы • осушение зданий • проходку шахтного ствола • установку стальных конструкций • сгибание стали • кладку кирпичей и камней • установку лесов, рабочих площадок и демонтаж, за исключением аренды лесов и рабочих площадок • установку дымоходов и промышленных печей • работа по специализированным требованиям доступа, что требует определенных навыков работы на высоте, а также использования соответствующего оборудования и оснащения, например, работа на высотных сооружениях - подземные работы - строительство открытых бассейнов - очистку паром, пескоструйную обработку и прочие подобные работы для внешних стен зданий - аренду кранов и прочего строительного оборудования, которое размещено на стройплощадке, с оператором Этот класс исключает: - аренду строительного оборудования и техники без участия оператора, см. 77.32 @ru
scope note: Bu sınıf aşağıdakileri kapsamaktadır; - ahşap veya diğer malzemeden yapılan kapılar (otomatik ve döner kapılar hariç), pencereler, kapı ve pencere çerçeveleri, vb. gibi tesisat işleri, - hazır mutfaklar, gömme dolaplar, merdivenler, dükkan tertibatı ve benzerlerinin kurulumu, - tavan, seyyar bölmeler gibi iç tamamlama işleri. Kapsam dışı olanlar; - otomatik ve döner kapıların kurulumu, bkz. 43.29. @tr
preferred label: Монтаж на дограма и дърводелски работи @bg
preferred label: Truhlářské práce @cs
preferred label: Tømrer- og bygningssnedkervirksomhed @da
preferred label: Bautischlerei und -schlosserei @de
preferred label: Ξυλουργικές εργασίες @el
preferred label: Instalación de carpintería @es
preferred label: Ehituspuusepatoodete paigaldus @et
preferred label: Rakennuspuusepän asennustyöt @fi
preferred label: Travaux de menuiserie @fr
preferred label: Épületasztalos-szerkezet szerelése
preferred label: Posa in opera di infissi @it
preferred label: Staliaus dirbinių įrengimas @lt
preferred label: Galdnieku darbi @lv
preferred label: Installazzjoni ta' xogħol ta' l-injam @mt
preferred label: Schrijnwerk @nl
preferred label: Snekkerarbeid @no
preferred label: Zakładanie stolarki budowlanej @pl
preferred label: Montagem de trabalhos de carpintaria e de caixilharia @pt
preferred label: Lucrări de tâmplărie şi dulgherie @ro
preferred label: Столярные и плотницкие работы @ru
preferred label: Stolárske práce @sk
preferred label: Vgrajevanje stavbnega pohištva @sl
preferred label: Byggnadssnickeriarbeten @sv
preferred label: Doğrama tesisatı @tr
broader: Building completion and finishing

Floor and wall covering
type: Concept
notation: 43.33
status: valid
status modified: 2013-10-18
accepted date: 2013-10-18
in scheme: Statistical Classification of Economic Activities in the European Community, Rev. 2 (2008)
scope note: - полагане и монтаж в сгради или съоръжения на: • плочки от керамика, бетон, дялан камък и други материали за външни и вътрешни подови настилки и стенни облицовки, монтиране на керамични пещи • паркет, дюшеме и други дървени подови настилки • мокет, линулеум, вкл. подови настилки от каучук или пластмаса • вътрешни декоративни подови настилки и стенни облицовки от мрамор, гранит или мозайка • текстилни стенни облицовки и тапети @bg
scope note: Z: - pokládání, lepení popř. jinou instalaci v budovách nebo stavebních dílech: • obkladů na stěny a podlahových dlaždic a kachlů z keramiky, betonu nebo kamene (včetně obkládání kachlových kamen) • parketových a jiných dřevěných podlah, dřevěného obložení stěn • koberců, linolea a podlahových krytin vyrobených i z pryže nebo plastů • podlah a obložení stěn z materiálů jako terrazzo, mramor, žula nebo břidlice • tapet @cs
scope note: Diese Klasse umfasst: - Verlegen, Anbringen oder Einbau von: • Wand- und Bodenfliesen oder -platten aus Keramik, Beton oder Stein; Fliesen von Kachelöfen • Parkett- und andere Holzböden, Wandvertäfelungen • Teppich- und Linoleumböden sowie Bodenbeläge aus Gummi oder Kunststoffen • Böden und Wandverkleidungen aus Terrazzo, Marmor, Granit oder Schiefer • Tapeten @de
scope note: This class includes: - laying, tiling, hanging or fitting in buildings or other construction projects of: • ceramic, concrete or cut stone wall or floor tiles, ceramic stove fitting • parquet and other wooden floor coverings, wooden wall coverings • carpets and linoleum floor coverings, including of rubber or plastic • terrazzo, marble, granite or slate floor or wall coverings • wallpaper @en
scope note: Esta clase comprende: - la colocación en edificios y otras obras de construcción de: • revestimientos de cerámica, hormigón o piedra tallada para paredes y suelos, la instalación de placas vitrocerámicas • parqué y otros revestimientos de madera para paredes y suelos • revestimientos de moqueta y linóleo para suelos, incluidos los de caucho y plástico • revestimientos de terrazo, mármol, granito o pizarra para paredes y suelos • papeles pintados @es
scope note: Cette classe comprend: - la pose dans des bâtiments ou d’autres projets de construction des éléments suivants: • revêtements muraux ou carrelages en céramique, en béton ou en pierre de taille; installation de poêles en céramique • parquets et autres revêtements de sols en bois, revêtements muraux en bois • moquettes et revêtements de sols en linoléum, y compris en caoutchouc ou en matières plastiques • revêtements de sols et de murs en granito, en marbre, en granit ou en ardoise • papiers peints @fr
scope note: Ovaj razred uključuje: - postavljanje u zgradama ili drugim građevinama: • zidnih ili podnih keramičkih, betonskih ili kamenih pločica, keramičkih peći • parketa i drugih drvenih podnih obloga, lamperije • tepisona i linoleuma, uključujući gumene ili plastične podne obloge • podnih i zidnih obloga od teraca, mramora, granita ili škriljevaca • zidnih tapeta
scope note: Į šią klasę įeina: - klojimas, klijavimas, kabinimas ar surinkimas pastatuose ir kituose statiniuose: • keraminių, betoninių ar akmeninių sieninių ar grindų plytelių, keraminių krosnių • parketo ir kitokių medinių grindų dangų, medinių sienų dangų • kilimų ir linoleumo grindų dangų klojimas, įskaitant gumines ar plastikines dangas • teracinių, marmurinių, granitinių ar skalūninių grindų ar sienų dangų • tapetų @lt
scope note: Данный раздел включает все виды деятельности (кроме производства и аренды), связанные с автомобилями и мотоциклами, включая грузовые автомобили и колесные тягачи, такие как оптовая и розничная продажа новых и бывших в употреблении транспортных средств, ремонт и техобслуживание транспортных средств, а также оптовая и розничная продажа запчастей и аксессуаров для автомобилей и мотоциклов. Также сюда относится деятельность комиссионных агентов, участвующих в оптовых или розничных продажах транспортных средств. В данный раздел также входят такие работы как мойка, полировка автомобилей и т.д. Данный раздел исключает розничную торговлю автомобильным топливом и смазочными или охлаждающими материалами или аренду автомобилей или мотоциклов. @ru
scope note: Bu sınıf aşağıdakileri kapsamaktadır; - aşağıdaki malzemelerin bina veya diğer inşaat projelerinde döşenmesi, kaplanması, asma tavan inşaası veya montajı: • seramik, beton veya yontma taş duvar veya zemin karoları, seramik fırını donanımı, • parke ve diğer ahşap zemin döşemeleri, ahşap duvar döşemeleri, • kauçuk veya plastik dahil, halı ve taban muşambası döşeme, • dökme mozaik, mermer, granit veya taş döşeme veya duvar kaplama, • duvar kağıdı. @tr
preferred label: Полагане на облицовки и настилки @bg
preferred label: Obkládání stěn a pokládání podlahových krytin @cs
preferred label: Udførelse af gulvbelægninger og vægbeklædning @da
preferred label: Fußboden-, Fliesen- und Plattenlegerei, Tapeziererei @de
preferred label: Επενδύσεις δαπέδων και τοίχων @el
preferred label: Revestimiento de suelos y paredes @es
preferred label: Põranda- ja seinakatete paigaldus @et
preferred label: Lattianpäällystys ja seinien verhoilu @fi
preferred label: Travaux de revêtement des sols et des murs @fr
preferred label: Padló-, falburkolás
preferred label: Rivestimento di pavimenti e di muri @it
preferred label: Grindų ir sienų dengimas @lt
preferred label: Grīdas un sienu apdare @lv
preferred label: Kisi ta' art u ta' ħitan @mt
preferred label: Vloerafwerking en behangen @nl
preferred label: Gulvlegging og tapetsering @no
preferred label: Posadzkarstwo; tapetowanie i oblicowywanie ścian @pl
preferred label: Revestimento de pavimentos e de paredes @pt
preferred label: Lucrări de pardosire şi placare a pereţilor @ro
preferred label: Работы по покрытию полов и облицовке стен @ru
preferred label: Obkladanie stien a kladenie dlážkových krytín @sk
preferred label: Oblaganje tal in sten @sl
preferred label: Golv- och väggbeläggningsarbeten @sv
preferred label: Yer ve duvar kaplama @tr
broader: Building completion and finishing

Painting and glazing
type: Concept
notation: 43.34
status: valid
status modified: 2013-10-18
accepted date: 2013-10-18
in scheme: Statistical Classification of Economic Activities in the European Community, Rev. 2 (2008)
scope note: - вътрешно и външно боядисване на сгради - боядисване на съоръжения - поставяне на стъкла, огледала и други - монтаж на прозорци – 43.32 @bg
scope note: Z: - vnitřní a vnější nátěry budov - nátěry inženýrských děl - instalaci skel, zrcadel atd. N: - instalaci oken (43.32) @cs
scope note: Diese Klasse umfasst: - Innen- und Außenanstrich von Gebäuden - Anstrich von Tiefbauten - Ausführung von Glaserarbeiten, einschließlich Einbau von Spiegeln usw. Diese Klasse umfasst nicht: - Fenstereinbau (s. 43.32) @de
scope note: This class includes: - interior and exterior painting of buildings - painting of civil engineering structures - installation of glass, mirrors, etc. This class excludes: - installation of windows, see 43.32 @en
scope note: Esta clase comprende: - la pintura interior y exterior de edificios - la pintura de obras de ingeniería civil - la instalación de cristales, espejos, etc. Esta clase no comprende: - la instalación de ventanas (véase 43.32) @es
scope note: Cette classe comprend: - la peinture intérieure et extérieure des bâtiments - les travaux de peinture sur des ouvrages de génie civil - la pose de vitres, de miroirs, etc. Cette classe ne comprend pas: - l’installation de fenêtres, voir 43.32 @fr
scope note: Ovaj razred uključuje: - unutrašnje i vanjsko bojenje zgrada - bojenje građevina niskogradnje - postavljanje stakala, ogledala itd. Ovaj razred isključuje: - ugradnju prozora, vidi 43.32
scope note: Į šią klasę įeina: - pastatų vidaus ir išorės dažymas - inžinerinių statinių dažymas - stiklų, veidrodžių ir kt. įrengimas Į šią klasę neįeina: - langų įrengimas, žr. 43.32 @lt
scope note: Bu sınıf aşağıdakileri kapsamaktadır; - binaların iç ve dış boyama işleri, - bina dışı yapıların boyama işleri, - cam, ayna vb.nin tesisat işleri. Kapsam dışı olanlar; - pencerelerin tesisatı, bkz. 43.32. @tr
preferred label: Боядисване и стъклопоставяне @bg
preferred label: Sklenářské, malířské a natěračské práce @cs
preferred label: Maler- og glarmestervirksomhed @da
preferred label: Malerei und Glaserei @de
preferred label: Χρωματισμοί και τοποθέτηση υαλοπινάκων @el
preferred label: Pintura y acristalamiento @es
preferred label: Värvimine ja klaasimine @et
preferred label: Maalaus ja lasitus @fi
preferred label: Travaux de peinture et vitrerie @fr
preferred label: Festés, üvegezés
preferred label: Tinteggiatura e posa in opera di vetri @it
preferred label: Dažymas ir stiklinimas @lt
preferred label: Krāsotāju un stiklinieku darbi @lv
preferred label: Żebgħa u tqegħid ta' ħġieġ @mt
preferred label: Schilderen en glaszetten @nl
preferred label: Maler- og glassarbeid @no
preferred label: Malowanie i szklenie @pl
preferred label: Pintura e colocação de vidros @pt
preferred label: Lucrări de vopsitorie, zugrăveli şi montări de geamuri @ro
preferred label: Малярные и стекольные работы @ru
preferred label: Maľovanie a zasklievanie @sk
preferred label: Steklarska in pleskarska dela @sl
preferred label: Måleri- och glasmästeriarbeten @sv
preferred label: Boya ve cam işleri @tr
broader: Building completion and finishing

Other building completion and finishing
type: Concept
notation: 43.39
status: valid
status modified: 2013-10-18
accepted date: 2013-10-18
in scheme: Statistical Classification of Economic Activities in the European Community, Rev. 2 (2008)
scope note: - почистване на нови сгради след завършване на строителството - други довършителни строителни дейности, некласифицирани другаде - дейности на дизайнери по вътрешно обзавеждане – 74.10 - неспециализирано вътрешно почистване на сгради и съоръжения – 81.21 - външно и специализирано почистване на сгради – 81.22 @bg
scope note: Z: - čištění a úklid nově postavených budov - ostatní kompletační a dokončovací práce j. n. N: - činnosti interiérových designérů (74.10) - všeobecný vnitřní úklid budov a jiných stavebních děl (81.21) - specializovaný vnitřní a vnější úklid budov (81.22) @cs
scope note: Diese Klasse umfasst: - Reinigung neu errichteter Gebäude (Baugrobreinigung) - sonstige Baufertigstellung und Ausbauarbeiten a. n. g. Diese Klasse umfasst nicht: - Tätigkeiten von Raumgestaltern (s. 74.10) - allgemeine Innenreinigung von Gebäuden und anderen Bauwerken (s. 81.21) - spezialisierte Innen- und Außenreinigung von Gebäuden (s. 81.22) @de
scope note: This class includes: - cleaning of new buildings after construction - other building completion and finishing work n.e.c. This class excludes: - activities of interior decoration designers, see 74.10 - general interior cleaning of buildings and other structures, see 81.21 - specialised interior and exterior cleaning of buildings, see 81.22 @en
scope note: Esta clase comprende: - la limpieza de nuevos edificios tras su construcción - otras obras de acabado de edificios n.c.o.p. Esta clase no comprende: - las actividades de los decoradores de interiores (véase 74.10) - la limpieza interior general de edificios (véase 81.21) - la limpieza interior y exterior especializada de edificios (véase 81.22) @es
scope note: Cette classe comprend: - le nettoyage de nouveaux bâtiments après leur construction - les autres travaux d’achèvement et de finition des bâtiments n.c.a. Cette classe ne comprend pas: - les activités des décorateurs d’intérieur, voir 74.10 - le nettoyage courant des parties intérieures de bâtiments et d’autres constructions, voir 81.21 - les activités de nettoyage intérieur et extérieur spécialisé de bâtiments, voir 81.22 @fr
scope note: Ovaj razred uključuje: - čišćenje novih zgrada nakon završetka gradnje - ostale završne građevinske radove, d. n. Ovaj razred isključuje: - djelatnosti dizajnera unutrašnjih dekoracija, vidi 74.10 - unutrašnje čišćenje zgrada i drugih građevina, vidi 81.21 - specijalizirano unutrašnje i vanjsko čišćenje zgrada, vidi 81.22
scope note: Į šią klasę įeina: - naujų pastatų valymas po statybų - kiti, niekur kitur nepriskirti, statybos baigiamieji ir apdailos darbai Į šią klasę neįeina: - vidaus apdailos projektuotojų veikla, žr. 74.10 - bendras pastatų ir kitų statinių vidaus valymas, žr. 81.21 - specializuotas pastatų vidaus ir išorės valymas, žr. 81.22 @lt
scope note: Этот класс включает: - оптовую и розничную продажу новых и бывших в употреблении транспортных средств: • пассажирских транспортных средств, включая специализированные пассажирские автомобили, такие как машины скорой помощи, микроавтобусы и т.д. (весом не более 3,5 тонн) Этот класс также включает: - оптовую и розничную продажу внедорожных моторных транспортных средств (весом не более 3,5 тонн) Этот класс исключает: - оптовую и розничную продажу комплектующих и аксессуаров для моторных транспортных средств, см. 45.3 - аренду транспортных средств с предоставлением водителя, см. 49.3 - аренду транспортных средств без водителя, см. 77.1 @ru
scope note: Bu sınıf aşağıdakileri kapsamaktadır; - yeni binaların, inşaat sonrası temizliği, - inşaatlardaki diğer bütünleyici ve tamamlayıcı işler, b.y.s. Kapsam dışı olanlar; - iç dekorasyon tasarımcılarının faaliyetleri, bkz. 74.10, - bina ve diğer yapıların genel iç temizliği, bkz. 81.21, - binaların iç ve dış özel temizliği, bkz. 81.22. @tr
preferred label: Други довършителни строителни дейности @bg
preferred label: Ostatní kompletační a dokončovací práce @cs
preferred label: Anden bygningsfærdiggørelse @da
preferred label: Sonstiger Ausbau a. n. g. @de
preferred label: Άλλες κατασκευαστικές εργασίες ολοκλήρωσης και τελειώματος @el
preferred label: Otro acabado de edificios @es
preferred label: Muu ehitiste viimistlus ja lõpetamine @et
preferred label: Muu rakennusten viimeistely @fi
preferred label: Autres travaux de finition @fr
preferred label: Egyéb befejező építés m.n.s.
preferred label: Altri lavori di completamento e di finitura degli edifici @it
preferred label: Kiti statybos baigiamieji ir apdailos darbai @lt
preferred label: Citas būvdarbu pabeigšanas operācijas @lv
preferred label: Tlestija u rfinar oħra tal-bini @mt
preferred label: Overige werkzaamheden in verband met de afwerking van gebouwen @nl
preferred label: Annen ferdiggjøring av bygninger @no
preferred label: Wykonywanie pozostałych robót budowlanych wykończeniowych @pl
preferred label: Outras actividades de acabamento de construção @pt
preferred label: Alte lucrări de finisare @ro
preferred label: Прочие отделочные работы @ru
preferred label: Ostatné stavebné kompletizačné a dokončovacie práce @sk
preferred label: Druga zaključna gradbena dela @sl
preferred label: Annan slutbehandling av byggnader @sv
preferred label: İnşaatlardaki diğer bütünleyici ve tamamlayıcı işler @tr
broader: Building completion and finishing

Other specialised construction activities
type: Concept
notation: 43.9
status: valid
status modified: 2013-10-18
accepted date: 2013-10-18
in scheme: Statistical Classification of Economic Activities in the European Community, Rev. 2 (2008)
scope note: Этот класс включает: - оптовую и розничную продажу новых и бывших в употреблении транспортных средств: • грузовых автомобилей, прицепов и полуприцепов • туристических автомобилей, таких как фургоны и дома на колесах Этот класс также включает: - оптовую и розничную продажу внедорожных моторных транспортных средств (весом более 3,5 тонн) Этот класс исключает: - оптовую и розничную продажу комплектующих и аксессуаров для моторных транспортных средств, см. 45.3 - аренду грузовых автомобилей с предоставлением водителя, см. 49.41 - аренду грузовых автомобилей без водителя, см. 77.12 @ru
preferred label: Други специализирани строителни дейности @bg
preferred label: Ostatní specializované stavební činnosti @cs
preferred label: Anden bygge- og anlægsvirksomhed, som kræver specialisering @da
preferred label: Sonstige spezialisierte Bautätigkeiten @de
preferred label: Άλλες εξειδικευμένες κατασκευαστικές δραστηριότητες @el
preferred label: Otras actividades de construcción especializada @es
preferred label: Muud eriehitustööd @et
preferred label: Muu erikoistunut rakennustoiminta @fi
preferred label: Autres travaux de construction spécialisés @fr
preferred label: Egyéb speciális szaképítés
preferred label: Altri lavori specializzati di costruzione @it
preferred label: Kita specializuota statybos veikla @lt
preferred label: Citi specializētie būvdarbi @lv
preferred label: Attivitajiet oħra speċjalizzati tal-kostruzzjoni @mt
preferred label: Overige gespecialiseerde bouwactiviteiten @nl
preferred label: Annen spesialisert bygge- og anleggsvirksomhet @no
preferred label: Roboty budowlane specjalistyczne pozostałe @pl
preferred label: Outras actividades especializadas de construção @pt
preferred label: Alte lucrări speciale de construcţii @ro
preferred label: Прочие специализированные строительные работы @ru
preferred label: Ostatné špecializované stavebné práce @sk
preferred label: Krovstvo in druga specializirana gradbena dela @sl
preferred label: Annan specialiserad bygg- och anläggningsverksamhet @sv
preferred label: Diğer özel inşaat faaliyetleri @tr
broader: Specialised construction activities
narrower: Roofing activities
narrower: Other specialised construction activities n.e.c.

Roofing activities
type: Concept
notation: 43.91
status: valid
status modified: 2013-10-18
accepted date: 2013-10-18
in scheme: Statistical Classification of Economic Activities in the European Community, Rev. 2 (2008)
scope note: - изграждане на покривни конструкции - изпълнение на покривни покрития, вкл. боядисване на покриви - даване под наем на машини и оборудване за строителството, без оператор - 77.32 @bg
scope note: Z: - stavbu střech - pokrývání střech N: - půjčování stavebních strojů a přístrojů bez obsluhy (77.32) @cs
scope note: Diese Klasse umfasst: - Errichtung von Dächern - Decken von Dächern Diese Klasse umfasst nicht: - Vermietung von Baumaschinen und -geräten ohne Bedienungspersonal (s. 77.32) @de
scope note: This class includes: - erection of roofs - roof covering This class excludes: - renting of construction machinery and equipment without operator, see 77.32 @en
scope note: Esta clase comprende: - la construcción de cubiertas - la construcción de tejados Esta clase no comprende: - el alquiler de equipo y maquinaria de construcción sin operario (véase 77.32) @es
scope note: Cette classe comprend: - le montage de charpentes - la pose de couvertures Cette classe ne comprend pas: - la location de machines et de matériels de construction sans opérateur, voir 77.32 @fr
scope note: Ovaj razred uključuje: - podizanje krovnih konstrukcija - pokrivanje krovova Ovaj razred isključuje: - iznajmljivanje građevinskih strojeva i opreme bez rukovatelja, vidi 77.32
scope note: Į šią klasę įeina: - stogų montavimas - stogo dengimas Į šią klasę neįeina: - statybos mašinų ir įrangos, be operatoriaus samdymo, nuoma, žr. 77.32 @lt
scope note: Bu sınıf aşağıdakileri kapsamaktadır; - çatı yapımı, - çatı kaplama. Kapsam dışı olanlar; - operatörsüz inşaat makine ve teçhizatının kiralanması, bkz. 77.32. @tr
preferred label: Покривни работи @bg
preferred label: Pokrývačské práce @cs
preferred label: Tagdækningsvirksomhed @da
preferred label: Dachdeckerei und Zimmerei @de
preferred label: Δραστηριότητες κατασκευής στεγών @el
preferred label: Construcción de cubiertas @es
preferred label: Katusetööd @et
preferred label: Kattorakenteiden asennus ja kattaminen @fi
preferred label: Travaux de couverture @fr
preferred label: Tetőfedés, tetőszerkezet-építés
preferred label: Realizzazione di coperture @it
preferred label: Stogų dengimas @lt
preferred label: Jumta seguma uzklāšana @lv
preferred label: Attivitajiet ta' tisqif @mt
preferred label: Dakwerkzaamheden @nl
preferred label: Takarbeid @no
preferred label: Wykonywanie konstrukcji i pokryć dachowych @pl
preferred label: Actividades de colocação de coberturas @pt
preferred label: Lucrări de învelitori, şarpante şi terase la construcţii @ro
preferred label: Кровельные работы @ru
preferred label: Postavljanje ostrešij in krovska dela @sl
preferred label: Takarbeten @sv
preferred label: Çatı işleri @tr
broader: Other specialised construction activities

Other specialised construction activities n.e.c.
type: Concept
notation: 43.99
status: valid
status modified: 2013-10-18
accepted date: 2013-10-18
in scheme: Statistical Classification of Economic Activities in the European Community, Rev. 2 (2008)
scope note: - специализирани строителни дейности, които са еднакви за различните строежи и изискват специални умения и оборудване: • фундиране, вкл. укрепване чрез пилоти • отводняване и хидроизолиране • саниране на сгради • пробиване на шахти • монтаж на елементи за метални конструкции • монтаж за арматура, вкл. заваряване • изпълнение на тухлена и каменна зидария • дейности по монтаж и демонтаж на строително скеле и работни платформи, без наетите • строителство на промишлени комини и пещи • специализирани строителни дейности във въздуха или на височина, които изискват специални умения и оборудване - подводно строителство - строителство на открити плувни басейни - външно почистване на сгради с пара или пясъчна струя - даване под наем на кранове и друго оборудване за строителството, което не може да бъде отнесено към специфичен вид строителна дейност, с оператор - даване под наем на машини и оборудване за строителството, без оператор - 77.32 @bg
scope note: Z: - specializované stavební činnosti, které vyžadují zvláštní znalosti popř. zvláštní vybavení: • budování základů včetně pilotování základů • pokládání izolací proti vlhku a vodě • vysoušení budov • hloubení šachet • montáž ocelových prvků • ohýbání železa • zednické a dlaždičské práce • montáž a demontáž lešení a pohyblivých pracovních plošin kromě jejich půjčování • výstavbu komínů a průmyslových pecí • výškové práce (práce, pro které jsou nutné speciální předpoklady a zkušenosti v lezení do výšek a příslušné vybavení) - podpovrchové práce - výstavbu otevřených (nezastřešených) plaveckých bazénů (veřejných i domácích) - čištění fasád - půjčování jeřábů a jiných stavebních strojů a zařízení, které nelze přiřadit určité stavební činnosti, s obsluhou N: - půjčování stavebních strojů a přístrojů bez obsluhy (77.32) @cs
scope note: Diese Klasse umfasst: - spezielle Tätigkeiten im Hoch- und Tiefbau, die besondere Fachkenntnisse bzw. Ausrüstungen erfordern: • Herstellen von Fundamenten einschließlich Pfahlgründung • Abdichtung gegen Wasser und Feuchtigkeit • Gebäudetrocknung • Schachtbau • Montage von Stahlelementen • Eisenbiegerei • Mauer- und Pflasterarbeiten • Auf- und Abbau von Gerüsten und beweglichen Arbeitsbühnen ohne deren Vermietung • Schornstein-, Feuerungs- und Industrieofenbau • Arbeiten, für die spezielle Voraussetzungen, wie Erfahrung im Klettern und die entsprechende Ausrüstung, erforderlich sind, d. h. Arbeiten an Bauwerken in großer Höhe - Unterwasserarbeiten - Bau von Außenschwimmbecken - Fassadenreinigung - Vermietung von Kränen und anderen Baugeräten, die nicht einer bestimmten Bautätigkeit zugeordnet werden können, mit Bedienungspersonal Diese Klasse umfasst nicht: - Vermietung von Baumaschinen und -geräten ohne Bedienungspersonal (s. 77.32) @de
scope note: This class includes: - construction activities specialising in one aspect common to different kind of structures, requiring specialised skill or equipment: • construction of foundations, including pile driving • damp proofing and water proofing works • de-humidification of buildings • shaft sinking • erection of steel elements • steel bending • bricklaying and stone setting • scaffolds and work platform erecting and dismantling, excluding renting of scaffolds and work platforms • erection of chimneys and industrial ovens • work with specialist access requirements necessitating climbing skills and the use of related equipment, e.g. working at height on tall structures - subsurface work - construction of outdoor swimming pools - steam cleaning, sand blasting and similar activities for building exteriors - renting of cranes and other building equipment, which cannot be allocated to a specific construction type, with operator This class excludes: - renting of construction machinery and equipment without operator, see 77.32 @en
scope note: Esta clase comprende: - las actividades de construcción que se especialicen en un aspecto común a diferentes tipos de estructura y que requieran aptitudes o materiales específicos: • obras de cimentación, incluida la hinca de pilotes • trabajos de impermeabilización • deshumidificación de edificios • perforación de pozos de minas • montaje de piezas de acero • curvado del acero • colocación de ladrillos y piedra • montaje y desmantelamiento de andamios y plataformas de trabajo, excluido su alquiler • construcción de chimeneas y hornos industriales • obras con necesidades de acceso especializadas que exijan destrezas de escalada y el empleo del correspondiente material (trabajo en altura sobre estructuras elevadas) - los trabajos subacuáticos - la construcción de piscinas al aire libre - la limpieza al vapor, con chorro de arena o similares, del exterior de los edificios - el alquiler de grúas y otros equipos de construcción que no pueden asignarse a un tipo de construcción específico, con operario Esta clase no comprende: - el alquiler de equipo y maquinaria de construcción sin operario (véase 77.32) @es
scope note: Cette classe comprend: - les activités de construction spécialisées qui concernent un aspect commun à différents ouvrages et requièrent des compétences ou du matériel spécialisés: • réalisation de fondations, y compris battage de pieux • travaux d’imperméabilisation et d’étanchéité • travaux de déshumidification des bâtiments • fonçage de puits • le montage d’éléments de structures métalliques • cintrage d’ossatures métalliques • maçonnerie, pavage • montage et démontage d’échafaudages et de plates-formes de travail, à l’exclusion de la location d’échafaudages et de plates-formes de travail • construction de cheminées et de fours industriels • travaux spécialisés qui, pour des raisons d’accès, nécessitent des aptitudes à l’escalade et l’utilisation d’un matériel particulier, c’est-à-dire travail en hauteur sur des structures élevées - les travaux sous-marins - la construction de piscines extérieures - le nettoyage à la vapeur, le sablage et les activités analogues appliquées aux parties extérieures des bâtiments - la location de grues et d’autres matériels de construction, ne correspondant pas à une activité de construction spécifique, avec opérateur Cette classe ne comprend pas: - la location de machines et de matériels de construction sans opérateur, voir 77.32 @fr
scope note: Ovaj razred uključuje: - specijalizirane građevinske djelatnosti koje se obavljaju na različitim vrstama građevina, a zahtijevaju specijalno izvođenje ili opremu: • fundiranje, uključujući i zabijanje stupova (šipova) • radove na zaštiti od vlage i vode (hidroizolacijski radovi) • uklanjanje vlage iz zgrada • iskop okna • montažu čeličnih elemenata, proizvedenih od drugih • armiračke radove • zidanje i popločavanje kamenom • montažu i demontažu skela i radnih platformi, isključujući iznajmljivanje skela i radnih platforma • gradnju dimnjaka i industrijskih peći • radove koji zahtijevaju specijalistički pristup i za koje su neophodne penjačke vještine i uporaba odgovarajuće opreme, npr. visinski radovi na visokim građevinama - podvodne radove - gradnju vanjskih bazena za plivanje - čišćenje parom, pješčanim mlazom i slične radove na vanjskim dijelovima zgrade - iznajmljivanje kranova i ostale opreme za gradnju, koja se ne može razvrstati pod pojedine vrste građevinskih radova, s rukovateljem Ovaj razred isključuje: - iznajmljivanje građevinskih strojeva i opreme bez rukovatelja, vidi 77.32
scope note: Į šią klasę įeina: - statybos veikla, kuri specializuojasi vienoje srityje, bendroje skirtingiems statiniams ir kuriai reikia specialių įgūdžių ar įrangos: • pamatų klojimas, įskaitant polių kalimą • apsaugos nuo drėgmės ir vandens darbai arba hidroizoliacijos darbai • pastatų sausinimas • šachtinių šulinių kasimas • plieninių elementų montavimas • armatūros lenkimas • plytų ir akmenų mūrijimas • pastolių ir darbo platformų statymas ir ardymas, įskaitant pastolių ir darbo platformų nuomą • dūmtraukių ir pramoninių krosnių įrengimas • darbai, kuriuos atlieka būtinus kopimo įgūdžius turintys ir specialią įrangą naudojantys specialistai, t.y. darbai aukštyje aukštybiniuose statiniuose ar konstrukcijose - požeminiai darbai - atvirųjų plaukymo baseinų statyba - pastatų išorės valymas garu, svidinimas smėliasraute ir panaši veikla - kranų ir kitokios statybos įrangos, kuri negali būti priskirta konkrečiai statybos sričiai, su operatoriaus samdymu, nuoma Į šią klasę neįeina: - statybos mašinų ir įrangos, be operatoriaus samdymo, nuoma, žr. 77.32 @lt
scope note: Этот класс включает: - техобслуживание и ремонт моторных транспортных средств: • механические ремонтные работы • электротехнические ремонтные работы • ремонт систем электронного впрыска топлива • регулярный осмотр и текущий ремонт • ремонт кузова • ремонт запчастей для транспортных средств • мойка, полировка и т.д. • распыление и покраска • ремонт лобовых стекол и окон • ремонт сидений транспортных средств - ремонт шин и камер, их установку или замену - антикоррозийную обработку - установку запчастей и принадлежностей, не являющуюся частью производственного процесса Этот класс исключает: - восстановление протектора и капитальный ремонт шин, см. 22.11 @ru
scope note: Bu sınıf aşağıdakileri kapsamaktadır; - özel ustalık ve teçhizat gerektiren, farklı yapı tiplerinde yaygın olan bir durum için özelleşmiş inşaat faaliyetleri: • kazık çakma dahil, temel inşaatı, • nem ve su yalıtımı işleri, • binalardaki nem gidermeye yönelik işlemler, • düşey galeri ve kuyu açma (depolama, madencilik tüneli vb.), • çelik elemanların kurulması, • çelik bükme, • duvar örme ve taş döşeme, • inşaat iskelesi ve platformun kiralanması hariç, inşaat iskelesinin ve çalışma platformunun kurma ve sökme işleri, • baca ve sanayi fırınlarının kurulması, • tırmanma yeteneği ve ilgili ekipmanı kullanmayı gerektiren koşullarda yetkili uzmanla çalışma, örneğin yüksek yapılarda zirvede çalışma gibi, - yer altı çalışmaları, - açık yüzme havuzlarının inşaatı, - yapı dış cepheleri için buharlı temizleme, kum püskürtme ve benzeri faaliyetler, - özel bir inşaat çeşidinde yer almayan, vinç ve benzeri diğer inşaat ekipmanlarının, operatörü ile birlikte kiralanması. Kapsam dışı olanlar; - inşaat makine ve ekipmanlarının operatörsüz olarak kiralanması, bkz. 77.32. @tr
preferred label: Други специализирани строителни дейности, некласифицирани другаде @bg
preferred label: Ostatní specializované stavební činnosti j. n. @cs
preferred label: Anden bygge- og anlægsvirksomhed, som kræver specialisering, i.a.n. @da
preferred label: Sonstige spezialisierte Bautätigkeiten a. n. g. @de
preferred label: Άλλες εξειδικευμένες κατασκευαστικές δραστηριότητες π.δ.κ.α. @el
preferred label: Otras actividades de construcción especializada n.c.o.p. @es
preferred label: Muud mujal liigitamata eriehitustööd @et
preferred label: Muualla luokittelematon erikoistunut rakennustoiminta @fi
preferred label: Autres travaux de construction spécialisés n.c.a. @fr
preferred label: Egyéb speciális szaképítés m.n.s.
preferred label: Altri lavori specializzati di costruzione n.c.a. @it
preferred label: Kita, niekur kitur nepriskirta, specializuota statybos veikla @lt
preferred label: Citur neklasificētie specializētie būvdarbi @lv
preferred label: Attivitajiet oħra speċjalizzati tal-kostruzzjoni n.e.c. @mt
preferred label: Overige gespecialiseerde bouwactiviteiten, n.e.g. @nl
preferred label: Annen spesialisert bygge- og anleggsvirksomhet @no
preferred label: Roboty budowlane specjalistyczne pozostałe, gdzie indziej niesklasyfikowane @pl
preferred label: Outras actividades especializadas de construção, n.e. @pt
preferred label: Alte lucrări speciale de construcţii n.c.a. @ro
preferred label: Прочие специализированные строительные работы, не включенные в другие категории @ru
preferred label: Ostatné špecializované stavebné práce i. n. @sk
preferred label: Druga specializirana gradbena dela @sl
preferred label: Diverse övrig specialiserad bygg- och anläggningsverksamhet @sv
preferred label: Başka yerde sınıflandırılmamış diğer özel inşaat faaliyetleri @tr
broader: Other specialised construction activities

Wholesale and retail trade and repair of motor vehicles and motorcycles
type: Concept
notation: 45
status: valid
status modified: 2013-10-18
accepted date: 2013-10-18
in scheme: Statistical Classification of Economic Activities in the European Community, Rev. 2 (2008)
scope note: Този раздел включва всички дейности (без производство и даване под наем), свързани с автомобили и мотоциклети, вкл. камиони и товарни автомобили: • търговия на едро и дребно с нови и употребявани автомобили • техническо обслужване и ремонт • търговия на едро и дребно с части и принадлежности за автомобили и мотоциклети • търговско посредничество с автомобили и мотоциклети, части и принадлежности за тях • почистване, измиване, лъскане - продажба на автомобили на търг, вкл. и по Интернет - търговия на дребно с горива, антифриз и смазочни материали – 47.3 - даване под наем на леки и лекотоварни автомобили , с водач - 49.3 - даване под наем на леки и лекотоварни автомобили, без водач - 77.11 - даване под наем на тежкотоварни автомобили, с водач - 49.41 - даване под наем на тежкотоварни автомобили, без водач - 77.12 @bg
scope note: Tento oddíl zahrnuje všechny typy obchodu (kromě výroby a pronájmu) související s motorovými vozidly a motocykly, včetně nákladních automobilů a přívěsů, stejně jako obchod s novými a ojetými vozidly, opravy a údržbu vozidel a velkoobchod a maloobchod s díly a příslušenstvím pro motorová vozidla a motocykly. Zahrnuje také činnosti obchodních zástupců pro velkoobchod s vozidly. Tento oddíl také zahrnuje mytí vozidel, leštění atd. Do tohoto oddílu nepatří maloobchod s pohonnými hmotami a mazivy, stejně jako s chladicími prostředky pro motorová vozidla a pronajímání motorových vozidel a motocyklů. @cs
scope note: Diese Abteilung umfasst alle Tätigkeiten, die sich auf Kraftfahrzeuge einschließlich Lastkraftwagen, Anhänger und Krafträder beziehen, außer deren Herstellung und Vermietung: Groß- und Einzelhandel mit Neu- und Gebrauchtfahrzeugen, Reparatur und Instandhaltung von Kraftfahrzeugen, Groß- und Einzelhandel mit Teilen und Zubehör von Kraftfahrzeugen. Ebenfalls eingeschlossen ist die Handelsvermittlung von Kraftfahrzeugen. Diese Abteilung umfasst ferner auch das Waschen, Polieren usw. von Kraftfahrzeugen. Nicht zu dieser Abteilung gehören der Einzelhandel mit Kraft- und Schmierstoffen sowie Kühlmitteln für Kraftfahrzeuge und die Vermietung von Kraftwagen und -rädern. @de
scope note: This division includes all activities (except manufacture and renting) related to motor vehicles and motorcycles, including lorries and trucks, such as the wholesale and retail sale of new and second-hand vehicles, the repair and maintenance of vehicles and the wholesale and retail sale of parts and accessories for motor vehicles and motorcycles. Also included are activities of commission agents involved in wholesale or retail sale of vehicles. This division also includes activities such as washing, polishing of vehicles etc. This division does not include the retail sale of automotive fuel and lubricating or cooling products or the renting of motor vehicles or motorcycles. @en
scope note: Esta división comprende todas las actividades (excepto las de fabricación y alquiler) relacionadas con vehículos de motor y motocicletas, incluidos camiones y vehículos pesados, como la venta al por mayor y al por menor de vehículos nuevos y de segunda mano, la reparación y el mantenimiento de vehículos y la venta al por mayor y al por menor de repuestos y accesorios para vehículos de motor y motocicletas. Se incluyen también las actividades de intermediarios del comercio al por mayor y al por menor de vehículos, las subastas al por mayor de automóviles y la venta al por mayor por Internet. Esta división comprende también actividades como el lavado, el encerado de vehículos, etc. Esta división no comprende la venta al por menor de carburantes y productos lubricantes o refrigerantes para la automoción ni el alquiler de vehículos de motor o motocicletas. @es
scope note: Cette division comprend toutes les activités (sauf la fabrication et la location) en rapport avec les véhicules automobiles et les motocycles, y compris les camions, telles que le commerce de gros et de détail de véhicules neufs et usagés, la réparation et l’entretien des véhicules et le commerce de gros et de détail de pièces et d’accessoires de véhicules automobiles et de motocycles. Les activités des intermédiaires du commerce de gros et de détail de véhicules. Cette division comprend également les activités de lavage et de lustrage de véhicules, etc. Cette division ne comprend pas le commerce de détail de carburants, de lubrifiants et de produits de refroidissement pour véhicules automobiles, ni les activités de location de véhicules automobiles et de motocycles. @fr
scope note: Ovaj odjeljak uključuje sve djelatnosti (osim proizvodnje i iznajmljivanja) povezane s motornim vozilima i motociklima, uključujući kamione i teretnjake kao što su trgovina na veliko i na malo novim i rabljenim vozilima, popravak i održavanje vozila te trgovina na veliko i na malo dijelovima i priborom za motorna vozila i motocikle. Također su uključene i djelatnosti posredovanja u trgovini na veliko i na malo vozilima, dražbe automobila u vezi s trgovinom na veliko te trgovina na veliko putem interneta. Ovaj odjeljak također uključuje djelatnosti kao što su pranje i poliranja vozila, itd. Ovaj odjeljak isključuje trgovinu na malo motornim gorivima, mazivima ili proizvodima za hlađenje te iznajmljivanje motornih vozila ili motocikla.
scope note: Į šį skyrių įeina visa su variklinėmis transporto priemonėmis ir motociklais, įskaitant krovininius automobilius ir sunkvežimius, susijusi veikla (išskyrus gamybą ir nuomą), pvz., naujų ir naudotų transporto priemonių didmeninė ir mažmeninė prekyba, transporto priemonių techninė priežiūra ir remontas, didmeninė ir mažmeninė variklinių transporto priemonių ir motociklų atsarginių dalių ir pagalbinių reikmenų prekyba. Į šį skyrių taip pat įeina didmeninės ar mažmeninės transporto priemonių atsarginių dalių prekybos tarpininkų veikla, automobilių didmeninė prekyba aukcionuose ir internetu. Į šį skyrių taip pat įeina transporto priemonių plovimas, poliravimas ir kt. Į šį skyrių neįeina mažmeninė prekyba automobiliniais degalais, tepalais ir aušalais bei variklinių transporto priemonių arba motociklų nuoma. @lt
scope note: Bu bölüm kamyon ve kamyonetler dahil olmak üzere motorlu taşıtlar ve motosikletlerle ilgili (üretim ve kiralama dışındaki) yeni ve ikinci el taşıtların toptan ve perakende satışı, taşıtların onarımı ve bakımı ve motorlu taşıtlar ve motosikletlerin parça ve aksesuarlarının toptan ve perakende satışı ile ilgili tüm faaliyetleri kapsamaktadır. Ayrıca, arabalar için düzenlenen açık artırma ve internet üzerinden yapılan toptan ticaret ile, taşıtların toptan ve perakende satışlarının da dahil olduğu komisyoncuların faaliyetleri de burada kapsanmaktadır. Bu bölüm aynı zamanda taşıtların yıkanması, cilalanması ve benzeri faaliyetleri de kapsamaktadır. Bu bölüm otomotiv yakıtı ve yağlama yağları veya soğutma ürünlerinin perakende satışını veya motorlu taşıtlar ve motosikletlerin kiralanmasını hariç tutmaktadır @tr
preferred label: Търговия на едро и дребно с автомобили и мотоциклети, техническо обслужване и ремонт @bg
preferred label: Velkoobchod a maloobchod; opravy a údržba motorových vozidel @cs
preferred label: Handel med biler og motorcykler og reparation heraf @da
preferred label: Handel mit Kraftfahrzeugen; Instandhaltung und Reparatur von Kraftfahrzeugen @de
preferred label: Χονδρικό και λιανικό εμπόριο· επισκευή μηχανοκίνητων οχημάτων και μοτοσυκλετών @el
preferred label: Venta y reparación de vehículos de motor y motocicletas @es
preferred label: Mootorsõidukite ja mootorrataste hulgi- ja jaemüük ning remont @et
preferred label: Moottoriajoneuvojen ja moottoripyörien tukku- ja vähittäiskauppa sekä korjaus @fi
preferred label: Commerce et réparation d'automobiles et de motocycles @fr
preferred label: Gépjármű-, motorkerékpár kereskedeleme, javítása
preferred label: Commercio all'ingrosso e al dettaglio e riparazione di autoveicoli e motocicli @it
preferred label: Variklinių transporto priemonių ir motociklų didmeninė ir mažmeninė prekyba bei remontas @lt
preferred label: Automobiļu un motociklu vairumtirdzniecība, mazumtirdzniecība un remonts @lv
preferred label: Negozju bl-ingrossa u bl-imnut u tiswija ta' vetturi bil-mutur u muturi @mt
preferred label: Groot- en detailhandel in en reparatie van auto's en motorfietsen @nl
preferred label: Handel med og reparasjon av motorvogner @no
preferred label: Handel hurtowy i detaliczny pojazdami samochodowymi i motocyklami; naprawa pojazdów samochodowych i motocykli @pl
preferred label: Comércio por grosso e a retalho e reparação de veículos automóveis e motociclos @pt
preferred label: Comerţ cu ridicata şi cu amănuntul, întreţinerea şi repararea autovehiculelor şi a motocicletelor @ro
preferred label: Оптовая и розничная торговля автомобилями и мотоциклами и их ремонт @ru
preferred label: Veľkoobchod a maloobchod a oprava motorových vozidiel a motocyklov @sk
preferred label: Trgovina z motornimi vozili in popravila motornih vozil @sl
preferred label: Handel samt reparation av motorfordon och motorcyklar @sv
preferred label: Toptan ve perakende ticaret ve motorlu kara taşıtlarının ve motosikletlerin onarımı @tr
broader: WHOLESALE AND RETAIL TRADE; REPAIR OF MOTOR VEHICLES AND MOTORCYCLES
narrower: Sale of motor vehicles
narrower: Maintenance and repair of motor vehicles
narrower: Sale of motor vehicle parts and accessories
narrower: Sale, maintenance and repair of motorcycles and related parts and accessories

Sale of motor vehicles
type: Concept
notation: 45.1
status: valid
status modified: 2013-10-18
accepted date: 2013-10-18
in scheme: Statistical Classification of Economic Activities in the European Community, Rev. 2 (2008)
scope note: Этот класс исключает: - розничную торговлю автомобильным топливом, см. 47.30 @ru
preferred label: Търговия с автомобили @bg
preferred label: Obchod s motorovými vozidly, kromě motocyklů @cs
preferred label: Salg af motorkøretøjer @da
preferred label: Handel mit Kraftwagen @de
preferred label: Πώληση μηχανοκίνητων οχημάτων @el
preferred label: Venta de vehículos de motor @es
preferred label: Mootorsõidukite müük @et
preferred label: Moottoriajoneuvojen kauppa @fi
preferred label: Commerce de véhicules automobiles @fr
preferred label: Gépjármű-kereskedelem
preferred label: Commercio di autoveicoli @it
preferred label: Variklinių transporto priemonių pardavimas @lt
preferred label: Automobiļu pārdošana @lv
preferred label: Bejgħ ta' vetturi bil-mutur @mt
preferred label: Handel in auto's @nl
preferred label: Handel med motorvogner, unntatt motorsykler @no
preferred label: Sprzedaż pojazdów samochodowych @pl
preferred label: Comércio de veículos automóveis @pt
preferred label: Comerţ cu autovehicule @ro
preferred label: Продажа моторных транспортных средств @ru
preferred label: Predaj motorových vozidiel @sk
preferred label: Trgovina z motornimi vozili @sl
preferred label: Handel med motorfordon utom motorcyklar @sv
preferred label: Motorlu kara taşıtlarının ticareti @tr
broader: Wholesale and retail trade and repair of motor vehicles and motorcycles
narrower: Sale of cars and light motor vehicles
narrower: Sale of other motor vehicles

Sale of cars and light motor vehicles
type: Concept
notation: 45.11
status: valid
status modified: 2013-10-18
accepted date: 2013-10-18
in scheme: Statistical Classification of Economic Activities in the European Community, Rev. 2 (2008)
scope note: - търговия на едро и дребно с нови и употребявани автомобили: • пътнически автомобили, вкл. специални пътнически автомобили, коли за спешна медицинска помощ, микробуси и други - търговско посредничество с нови и употребявани автомобили - търговия на едро и дребно с автомобили за всякакви терени - търговия на едро и дребно с части и принадлежности за автомобили - 45.3 - даване под наем на леки и лекотоварни автомобили, с водач - 49.3 - даване под наем на леки и лекотоварни автомобили, без водач - 77.11 @bg
scope note: Z: - velkoobchod a maloobchod s novými a ojetými motorovými vozidly: • osobními motorovými vozidly, včetně speciálních osobních motorových vozidel, např. sanitek, mikrobusů (s hmotností nepřesahující 3,5 t) ZT: - velkoobchod a maloobchod s terénními vozidly (s hmotností nepřesahující 3,5 t) N: - velkoobchod a maloobchod s díly a příslušenstvím pro motorová vozidla (45.3) - pronájem motorových vozidel s řidičem (49.3) - pronájem motorových vozidel bez řidiče (77.1) @cs
scope note: Diese Klasse umfasst: - Groß- und Einzelhandel mit neuen und gebrauchten Kraftwagen: • Personenkraftwagen einschließlich Sonderfahrzeuge wie Krankenwagen, Kleinbusse usw. (mit einem Gesamtgewicht von 3,5 t oder weniger) Diese Klasse umfasst ferner: - Groß- und Einzelhandel mit geländegängigen Kraftwagen (mit einem Gesamtgewicht von 3,5 t oder weniger) Diese Klasse umfasst nicht: - Groß- und Einzelhandel mit Kraftwagenteilen und Zubehör (s. 45.3) - Vermietung von Kraftwagen mit Fahrer (s. 49.3) - Vermietung von Kraftwagen ohne Fahrer (s. 77.1) @de
scope note: This class includes: - wholesale and retail sale of new and used vehicles: • passenger motor vehicles, including specialised passenger motor vehicles such as ambulances and minibuses, etc. (with a weight not exceeding 3,5 tons) This class also includes: - wholesale and retail sale of off-road motor vehicles (with a weight not exceeding 3,5 tons) This class excludes: - wholesale and retail sale of parts and accessories for motor vehicles, see 45.3 - renting of motor vehicles with driver, see 49.3 - renting of motor vehicles without driver, see 77.1 @en
scope note: Esta clase comprende: - el comercio al por mayor y al por menor de vehículos nuevos y de segunda mano: • vehículos de motor para pasajeros, incluidos los especializados (ambulancias, microbuses, etc.) (de un peso que no supere las 3,5 toneladas) Esta clase comprende también: - el comercio al por mayor y al por menor de vehículos de motor todoterreno (de un peso que no supere las 3,5 toneladas) Esta clase no comprende: - el comercio al por mayor y al por menor de repuestos y accesorios para vehículos de motor (véase 45.3) - el alquiler de vehículos de motor con conductor (véase 49.3) - el alquiler de vehículos de motor sin conductor (véase 77.1) @es
scope note: Cette classe comprend: - le commerce de gros et de détail de véhicules neufs ou usagés: • véhicules automobiles pour le transport des personnes, y compris les véhicules spéciaux tels qu’ambulances, minibus, etc. (dont le poids est inférieur ou égal à 3,5 tonnes) Cette classe comprend également: - le commerce de gros et de détail de véhicules automobiles tout terrain (dont le poids est inférieur ou égal à 3,5 tonnes) Cette classe ne comprend pas: - le commerce de gros et de détail de pièces et d’accessoires de véhicules automobiles, voir 45.3 - la location de véhicules avec chauffeur, voir 49.3 - la location de véhicules sans chauffeur, voir 77.11 @fr
scope note: Ovaj razred uključuje: - trgovinu na veliko i na malo novim i rabljenim vozilima : • putničkim motornim vozilima, uključujući specijalizirana putnička motorna vozila kao što su vozila hitne medicinske pomoći te miniautobusi, itd. (nosivosti manje od 3,5 tone) Ovaj razred također uključuje: - trgovinu na veliko i na malo terenskim motornim vozilima kao što su džipovi (nosivosti manje od 3,5 tone) Ovaj razred isključuje: - trgovinu na veliko i na malo dijelovima i priborom za motorna vozila, vidi 45.3 - iznajmljivanje motornih vozila s vozačem, vidi 49.3 - iznajmljivanje motornih vozila bez vozača, vidi 77.1
scope note: Į šią klasę įeina: - didmeninė ir mažmeninė prekyba naujomis ir naudotomis transporto priemonėmis: • keleivinėmis variklinėmis transporto priemonėmis, įskaitant specialiąsias, pvz., greitosios pagalbos mašinas, mikroautobusus ir kt. (kurių masė neviršija 3,5 tonų) Į šią klasę taip pat įeina: - didmeninė ar mažmeninė prekyba visureigėmis variklinėmis transporto priemonėmis, tokiomis kaip džipai (kurių masė neviršija 3,5 tonų) Į šią klasę neįeina: - didmeninė ir mažmeninė prekyba variklinių transporto priemonių atsarginėmis dalimis ir pagalbiniais reikmenimis, žr. 45.3 - variklinių transporto priemonių, su vairuotojo samdymu, nuoma, žr. 49 skyrių - variklinių transporto priemonių, be vairuotojo samdymo, nuoma, žr. 77.1 @lt
scope note: Bu sınıf aşağıdakileri kapsamaktadır; - yeni veya kullanılmış taşıtların toptan ve perakende satışı: • ambulans ve minibüs benzeri motorlu yolcu taşıtları dahil olmak üzere, motorlu yolcu taşıtları (3,5 tondan daha az). Ayrıca bu sınıf aşağıdakileri de kapsamaktadır; - cip ve benzeri motorlu arazi araçlarının toptan ve perakende satışı (3.5 tondan daha az). Kapsam dışı olanlar; - motorlu taşıt parçaları ve aksesuarlarının toptan ve perakende satışı, bkz. 45.3, - motorlu taşıtların sürücüsü ile birlikte kiralanması, bkz. bölüm 49, - motorlu taşıtların sürücüsüz olarak kiralanması, bkz. 77.1 @tr
preferred label: Търговия с леки и лекотоварни автомобили до 3.5 т @bg
preferred label: Obchod s automobily a jinými lehkými motorovými vozidly @cs
preferred label: Salg af biler og lette motorkøretøjer @da
preferred label: Handel mit Kraftwagen mit einem Gesamtgewicht von 3,5 t oder weniger @de
preferred label: Πώληση αυτοκινήτων και ελαφρών μηχανοκίνητων οχημάτων @el
preferred label: Venta de automóviles y vehículos de motor ligeros @es
preferred label: Sõiduautode ja väikebusside müük @et
preferred label: Henkilöautojen ja kevyiden moottoriajoneuvojen kauppa @fi
preferred label: Commerce de voitures et de véhicules automobiles légers @fr
preferred label: Személygépjármű-, könnyűgépjármű-kereskedelme
preferred label: Commercio di autovetture e di autoveicoli leggeri @it
preferred label: Automobilių ir lengvųjų variklinių transporto priemonių pardavimas @lt
preferred label: Automobiļu un citu vieglo transportlīdzekļu pārdošana @lv
preferred label: Bejgħ ta' karozzi u vetturi żgħar bil-mutur @mt
preferred label: Handel in personenauto's en andere lichte auto's @nl
preferred label: Handel med biler og lette motorvogner, unntatt motorsykler @no
preferred label: Sprzedaż samochodów osobowych i furgonetek @pl
preferred label: Comércio de veículos automóveis ligeiros @pt
preferred label: Comerţ cu autoturisme şi autovehicule uşoare (sub 3,5 tone) @ro
preferred label: Продажа автомобилей и легких моторных транспортных средств @ru
preferred label: Predaj automobilov a ľahkých motorových vozidiel @sk
preferred label: Trgovina z avtomobili in lahkimi motornimi vozili @sl
preferred label: Handel med personbilar och lätta motorfordon @sv
preferred label: Otomobillerin ve hafif motorlu kara taşıtlarının ticareti @tr
broader: Sale of motor vehicles

Sale of other motor vehicles
type: Concept
notation: 45.19
status: valid
status modified: 2013-10-18
accepted date: 2013-10-18
in scheme: Statistical Classification of Economic Activities in the European Community, Rev. 2 (2008)
scope note: - търговия на едро и дребно с нови и употребявани автомобили: • камиони, ремаркета и полуремаркета • каравани и туристически ремаркета - търговско посредничество с нови и употребявани автомобили - търговия на едро и дребно с автомобили за всякакви терени - търговия на едро и дребно с части и принадлежности за автомобили - 45.3 - даване под наем на тежкотоварни автомобили, с водач – 49.41 - даване под наем на тежкотоварни автомобили, без водач - 77.12 @bg
scope note: Z: - velkoobchod a maloobchod s novými a ojetými vozidly: • nákladními motorovými vozidly, přívěsy a návěsy • obytnými vozidly, např. obytnými automobily a obytnými vozy ZT: - velkoobchod a maloobchod s terénními motorovými vozidly (s hmotností přesahující 3,5 t) N: - velkoobchod a maloobchod s díly a příslušenstvím pro motorová vozidla (45.3) - pronájem nákladních automobilů s řidičem (49. 41) - pronájem nákladních automobilů bez řidiče (77.12) @cs
scope note: Diese Klasse umfasst: - Groß- und Einzelhandel mit neuen und gebrauchten Kraftwagen: • Lastkraftwagen, Anhänger und Sattelanhänger • Wohnwagen und Wohnmobile Diese Klasse umfasst ferner: - Groß- und Einzelhandel mit geländegängigen Kraftwagen (mit einem Gesamtgewicht von mehr als 3,5 t) Diese Klasse umfasst nicht: - Groß- und Einzelhandel mit Kraftwagenteilen und Zubehör (s. 45.3) - Lkw-Vermietung mit Fahrer (s. 49.41) - Lkw-Vermietung ohne Fahrer (s. 77.12) @de
scope note: This class includes: - wholesale and retail sale of new and used vehicles: • lorries, trailers and semi-trailers • camping vehicles such as caravans and motor homes This class also includes: - wholesale and retail sale of off-road motor vehicles (with a weight exceeding 3,5 tons) This class excludes: - wholesale and retail sale of parts and accessories for motor vehicles, see 45.3 - renting of trucks with driver, see 49.41 - renting of trucks without driver, see 77.12 @en
scope note: Esta clase comprende: - el comercio al por mayor y al por menor de vehículos nuevos y de segunda mano: • camiones, remolques y semirremolques • vehículos de acampada, como caravanas y autocaravanas Esta clase comprende también: - el comercio al por mayor y al por menor de vehículos de motor todoterreno (de un peso superior a 3,5 toneladas) Esta clase no comprende: - el comercio al por mayor y al por menor de repuestos y accesorios para vehículos de motor (véase 45.3) - el alquiler de camiones con conductor (véase 49.41) - el alquiler de camiones sin conductor (véase 77.12) @es
scope note: Cette classe comprend: - le commerce de gros et de détail de véhicules neufs ou usagés: • camions, remorques et semi-remorques • véhicules pour le camping tels que caravanes et autocaravanes (camping-cars) Cette classe comprend également: - le commerce de gros et de détail de véhicules automobiles tout terrain (dont le poids est supérieur à 3,5 tonnes) Cette classe ne comprend pas: - le commerce de gros et de détail de pièces et d’accessoires de véhicules automobiles, voir 45.3 - la location de camions avec chauffeur, voir 49.41 - la location de camions sans chauffeur, voir 77.12 @fr
scope note: Ovaj razred uključuje: - trgovinu na veliko i na malo novim i rabljenim vozilima: • kamionima, prikolicama i poluprikolicama • kamp-vozilima kao što su stambene autoprikolice i autodomovi (kamperi) Ovaj razred također uključuje: - trgovinu na veliko i na malo terenskim motornim vozilima kao što su džipovi (nosivosti veće od 3,5 tone) Ovaj razred isključuje: - trgovinu na veliko i na malo dijelovima i priborom za motorna vozila, vidi 45.3 - iznajmljivanje kamiona s vozačem, vidi 49.41 - iznajmljivanje kamiona bez vozača, vidi 77.12
scope note: Į šią klasę įeina: - didmeninė ir mažmeninė prekyba naujomis ir naudotomis transporto priemonėmis: • krovininiais automobiliais, priekabomis ir puspriekabėmis, • poilsinėmis transporto priemonėmis, tokiomis kaip priekabiniai nameliai, varikliniai autonameliai Į šią klasę taip pat įeina: - didmeninė ar mažmeninė prekyba visureigėmis variklinėmis transporto priemonėmis (sunkesnėmis nei 3,5 tonos) Į šią klasę neįeina: - didmeninė ir mažmeninė prekyba variklinių transporto priemonių atsarginėmis dalimis ir pagalbiniais reikmenimis, žr. 45.3 - krovininių automobilių, su vairuotojo samdymu, nuoma, žr. 49.41 - krovininių automobilių, be vairuotojo samdymo, nuoma, žr. 77.12 @lt
scope note: Этот класс включает: - оптовую и розничную продажу мотоциклов, в том числе мопедов - оптовую и розничную продажу запчастей и принадлежностей (включая продажу через комиссионных агентов и фирмы посылочной торговли) - ремонт, технический уход и обслуживание мотоциклов Этот класс исключает: - оптовую продажу велосипедов и соответствующих деталей и принадлежностей к ним, см. 46.49 - розничную продажу велосипедов и соответствующих деталей и принадлежностей к ним, см. 47.64 - аренду мотоциклов, см. 77.39 - ремонт, технический уход и обслуживание велосипедов, см. 95.29 @ru
scope note: Bu sınıf aşağıdakileri kapsamaktadır; - yeni veya kullanılmış taşıtların toptan ve perakende satışı: • kamyonlar, otobüsler, römorklar ve yarı römorklar, • karavanlar ve motorlu karavanlar. Ayrıca bu sınıf aşağıdakileri de kapsamaktadır; - motorlu arazi araçlarının toptan ve perakende satışı (3,5 tondan ağır olanlar). Kapsam dışı olanlar; - motorlu taşıt parçaları ve aksesuarlarının toptan ve perakende satışı, bkz. 45.3, - kamyonların sürücüsü ile birlikte kiralanması, bkz. 49.41, - kamyonların sürücü olmaksızın kiralanması, bkz. 77.12. @tr
preferred label: Търговия с други автомобили над 3.5 т @bg
preferred label: Obchod s ostatními motorovými vozidly, kromě motocyklů @cs
preferred label: Salg af andre motorkøretøjer @da
preferred label: Handel mit Kraftwagen mit einem Gesamtgewicht von mehr als 3,5 t @de
preferred label: Πώληση άλλων μηχανοκίνητων οχημάτων @el
preferred label: Venta de otros vehículos de motor @es
preferred label: Muude mootorsõidukite müük @et
preferred label: Muiden moottoriajoneuvojen myynti @fi
preferred label: Commerce d'autres véhicules automobiles @fr
preferred label: Egyéb gépjármű-kereskedelme
preferred label: Commercio di altri autoveicoli @it
preferred label: Kitų variklinių transporto priemonių pardavimas @lt
preferred label: Citu automobiļu pārdošana @lv
preferred label: Bejgħ ta' vetturi oħra bil-mutur @mt
preferred label: Handel in andere auto's @nl
preferred label: Handel med andre motorvogner, unntatt motorsykler @no
preferred label: Sprzedaż pozostałych pojazdów samochodowych @pl
preferred label: Comércio de outros veículos automóveis @pt
preferred label: Comerţ cu alte autovehicule @ro
preferred label: Продажа прочих моторных транспортных средств @ru
preferred label: Predaj ostatných motorových vozidiel @sk
preferred label: Trgovina z drugimi motornimi vozili @sl
preferred label: Handel med andra motorfordon utom motorcyklar @sv
preferred label: Diğer motorlu kara taşıtlarının ticareti @tr
broader: Sale of motor vehicles

Maintenance and repair of motor vehicles
type: Concept
notation: 45.2
status: valid
status modified: 2013-10-18
accepted date: 2013-10-18
in scheme: Statistical Classification of Economic Activities in the European Community, Rev. 2 (2008)
scope note: Данный раздел включает оптовую торговлю за собственный счет или на основе договора (комиссионная торговля) в отношении оптовой торговли бытовыми товарами, а также международную оптовую торговлю (импорт/экспорт). Данный раздел исключает: - оптовую торговлю автомобилями, фургонами и мотоциклами, см. 45.1, 45.4 - оптовую продажу аксессуаров для автомобилей, см. 45.31, 45.40 - аренду и прокат товаров, см. раздел 77 - упаковку твердых товаров и разлив в бутылки жидких или газообразных товаров, включая смешивание и очистку (фильтрацию) для других лиц, см. 82.92 @ru
preferred label: Техническо обслужване и ремонт на автомобили @bg
preferred label: Opravy a údržba motorových vozidel, kromě motocyklů @cs
preferred label: Vedligeholdelse og reparation af motorkøretøjer @da
preferred label: Instandhaltung und Reparatur von Kraftwagen @de
preferred label: Συντήρηση και επισκευή μηχανοκίνητων οχημάτων @el
preferred label: Mantenimiento y reparación de vehículos de motor @es
preferred label: Mootorsõidukite hooldus ja remont @et
preferred label: Moottoriajoneuvojen huolto ja korjaus (pl. moottoripyörät) @fi
preferred label: Entretien et réparation de véhicules automobiles @fr
preferred label: Gépjárműjavítás, karbantartás
preferred label: Manutenzione e riparazione di autoveicoli @it
preferred label: Variklinių transporto priemonių techninė priežiūra ir remontas @lt
preferred label: Automobiļu apkope un remonts @lv
preferred label: Manutenzjoni u tiswija ta' vetturi bil-mutur @mt
preferred label: Onderhoud en reparatie van auto's @nl
preferred label: Vedlikehold og reparasjon av motorvogner, unntatt motorsykler @no
preferred label: Konserwacja i naprawa pojazdów samochodowych @pl
preferred label: Manutenção e reparação de veículos automóveis @pt
preferred label: Întreţinerea şi repararea autovehiculelor @ro
preferred label: Техобслуживание и ремонт моторных транспортных средств @ru
preferred label: Oprava a údržba motorových vozidiel @sk
preferred label: Vzdrževanje in popravila motornih vozil @sl
preferred label: Underhåll och reparation av motorfordon utom motorcyklar @sv
preferred label: Motorlu kara taşıtlarının bakım ve onarımı @tr
broader: Wholesale and retail trade and repair of motor vehicles and motorcycles
narrower: Maintenance and repair of motor vehicles

Maintenance and repair of motor vehicles
type: Concept
notation: 45.20
status: valid
status modified: 2013-10-18
accepted date: 2013-10-18
in scheme: Statistical Classification of Economic Activities in the European Community, Rev. 2 (2008)
scope note: - дейности по техническо обслужване и ремонт на автомобили: • ремонт на механиката на автомобила • ремонт на електрическата инсталация • ремонт на електронните впръскващи системи (инжекцион) • текущо техническо обслужване • ремонт на каросерията и купето на автомобила • ремонт на части за автомобили • почистване, измиване, лъскане и други подобни дейности • боядисване, вкл. с пистолет • ремонт на врати, прозорци, ключалки и други • ремонт на седалки - ремонт, регулиране и балансиране, замяна и монтаж на вътрешни и външни гуми на автомобила - антикорозионна обработка - монтаж на части и принадлежности за автомобили, когато не е част от производствения процес - регенериране на пневматични гуми - 22.11 @bg
scope note: Z: - údržbu a opravy motorových vozidel: • mechanických částí • elektrického zařízení • elektronických vstřikovacích systémů • běžnou provozní údržbu • opravy karoserií • opravy dílů motorových vozidel • mytí, leštění atd. • stříkání a lakování • opravy čelních skel a oken • opravy automobilových sedadel - úpravy, přestavby motorových vozidel (kromě přestavby na alternativní pohon) - opravy pneumatik a duší, jejich montáže a výměny - ochranné ošetřování proti korozi - montáž dílů a příslušenství, které nejsou součástí výrobního procesu (kromě montáže zakoupených měřicích přístrojů, např. rychloměrů, otáčkoměrů, do palubní desky) N: - protektorování pneumatik (22.11) - přestavbu motorových vozidel na alternativní pohon (29.10) - montáž zakoupených měřicích přístrojů, např. rychloměrů, otáčkoměrů, do palubní desky (29.31) @cs
scope note: Zu dieser Klasse gehören: - Instandhaltung und Reparatur von Kraftwagen: • mechanische Reparaturen • elektrische Reparaturen • Reparatur von elektronischen Einspritzsystemen • gewöhnlicher Wartungsdienst • Karosseriereparaturen • Reparatur von Kraftwagenteilen • Waschen, Polieren usw. • Spritzen und Lackieren • Reparatur von Windschutzscheiben und Fenstern • Reparatur von Autositzen - Reifendienst außer Runderneuerung - Rostschutzbehandlung - Einbau von Teilen und Zubehör, nicht als Teil des Herstellungsprozesses Diese Klasse umfasst nicht: - Runderneuerung von Reifen (s. 22.11) @de
scope note: This class includes: - maintenance and repair of motor vehicles: • mechanical repairs • electrical repairs • electronic injection systems repair • ordinary servicing • bodywork repair • repair of motor vehicle parts • washing, polishing, etc. • spraying and painting • repair of screens and windows • repair of motor vehicle seats - tyre and tube repair, fitting or replacement - anti-rust treatment - installation of parts and accessories not as part of the manufacturing process This class excludes: - retreading and rebuilding of tyres, see 22.11 @en
scope note: Esta clase comprende: - el mantenimiento y la reparación de vehículos de motor: • las reparaciones mecánicas • las reparaciones eléctricas • la reparación de sistemas de inyección electrónica • el mantenimiento corriente • la reparación de carrocerías • la reparación de accesorios de vehículos de motor • el lavado, encerado, etc. • la pintura • la reparación de parabrisas y ventanillas • la reparación de asientos de vehículos de motor - la reparación, instalación y sustitución de neumáticos y cámaras - el tratamiento antioxidante - la instalación de repuestos y accesorios fuera del proceso de fabricación Esta clase no comprende: - el recauchutado de neumáticos (véase 22.11) @es
scope note: Cette classe comprend: - l’entretien et la réparation de véhicules automobiles: • réparation mécanique • réparation électrique • réparation des systèmes d’injection électroniques • entretien courant • réparation de carrosserie • réparation de pièces de véhicules automobiles • lavage, lustrage, etc. • peinture, y compris au pistolet • réparation de pare-brise et de vitres • réparation des sièges de voiture - la réparation, la pose ou le remplacement de pneumatiques et de chambres à air - le traitement antirouille - le montage de pièces et accessoires ne faisant pas partie du processus de fabrication Cette classe ne comprend pas: - le rechapage et le resculptage de pneumatiques, voir 22.11 @fr
scope note: Ovaj razred uključuje: - održavanje i popravak motornih vozila: • mehaničke popravke • električarske popravke • popravke elektroničkih sustava ubrizgavanja • redovito servisiranje • popravak karoserije • popravak dijelova motornih vozila • pranje, poliranje itd. • prskanje i bojenje • popravak vjetrobrana i prozora • popravak sjedala motornih vozila - popravak vanjskih i unutarnjih guma te podešavanje i zamjenu guma - zaštitu od korozije - ugradnju dijelova i pribora koja nije dio proizvodnog procesa Ovaj razred isključuje: - protektiranje guma, vidi 22.11 - vuču vozila i pomoć na cesti, vidi 52.21 - redoviti tehnički pregled motornih vozila, vidi 71.20
scope note: Į šią klasę įeina: - variklinių transporto priemonių techninė priežiūra ir remontas: • mechaninis remontas • elektrinės įrangos remontas • elektroninių įpurškimo sistemų remontas • einamoji techninė priežiūra • kėbulo remontas • variklinių transporto priemonių dalių remontas • plovimas, poliravimas ir kt. • purškimas ir dažymas • priekinių stiklų ir langų remontas • variklinių transporto priemonių sėdynių remontas - padangų ir kamerų remontas, uždėjimas ar pakeitimas - antikorozinis apdorojimas - dalių ir pagalbinių reikmenų įrengimas ne gamybos proceso metu Į šią klasę neįeina: - padangų atnaujinimas ir restauravimas, žr. 22.11 @lt
scope note: Данная группа включает: - деятельность комиссионных агентов, товарных брокеров и прочих оптовиков, осуществляющих сделки от имени или за счет других лиц или фирм - деятельность, связанную со сведением продавцов с покупателями или с осуществлением коммерческих сделок от имени комитента, в том числе через Интернет Данная группа также включает: - деятельность оптовых аукционных домов, включая оптовые аукционы через сеть Интернет @ru
scope note: Bu sınıf aşağıdakileri kapsamaktadır; - motorlu kara taşıtlarının bakım ve onarımı: • mekanik onarımlar, • elektrik onarımları, • elektronik enjeksiyon sistemi onarımı, • olağan servis bakımı, • karoser onarımı, • motorlu kara taşıtlarına ait parçaların onarımı, • yıkama, cilalama ve benzeri, • püskürtme ve boyama, • cam ve pencere onarımı, • motorlu kara taşıtlarına ait koltukların onarımı, - lastik onarımı, takma veya değiştirme, - paslanmaya karşı bakım, - imalat sürecinin bir parçası olmamak kaydıyla parçaların ve aksesuarların kurulumu. Kapsam dışı olanlar; - otomobil lastiklerinin yeniden kaplanması ve yeniden yerleştirilmesi, bkz. 22.11. @tr
preferred label: Техническо обслужване и ремонт на автомобили @bg
preferred label: Opravy a údržba motorových vozidel, kromě motocyklů @cs
preferred label: Vedligeholdelse og reparation af motorkøretøjer @da
preferred label: Instandhaltung und Reparatur von Kraftwagen @de
preferred label: Συντήρηση και επισκευή μηχανοκίνητων οχημάτων @el
preferred label: Mantenimiento y reparación de vehículos de motor @es
preferred label: Mootorsõidukite hooldus ja remont @et
preferred label: Moottoriajoneuvojen huolto ja korjaus (pl. moottoripyörät) @fi
preferred label: Entretien et réparation de véhicules automobiles @fr
preferred label: Gépjárműjavítás, karbantartás
preferred label: Manutenzione e riparazione di autoveicoli @it
preferred label: Variklinių transporto priemonių techninė priežiūra ir remontas @lt
preferred label: Automobiļu apkope un remonts @lv
preferred label: Manutenzjoni u tiswija ta' vetturi bil-mutur @mt
preferred label: Onderhoud en reparatie van auto's @nl
preferred label: Vedlikehold og reparasjon av motorvogner, unntatt motorsykler @no
preferred label: Konserwacja i naprawa pojazdów samochodowych @pl
preferred label: Manutenção e reparação de veículos automóveis @pt
preferred label: Întreţinerea şi repararea autovehiculelor @ro
preferred label: Техобслуживание и ремонт моторных транспортных средств @ru
preferred label: Oprava a údržba motorových vozidiel @sk
preferred label: Vzdrževanje in popravila motornih vozil @sl
preferred label: Underhåll och reparation av motorfordon utom motorcyklar @sv
preferred label: Motorlu kara taşıtlarının bakım ve onarımı @tr
broader: Maintenance and repair of motor vehicles

Sale of motor vehicle parts and accessories
type: Concept
notation: 45.3
status: valid
status modified: 2013-10-18
accepted date: 2013-10-18
in scheme: Statistical Classification of Economic Activities in the European Community, Rev. 2 (2008)
scope note: - търговия на едро и дребно с нови и употребявани части и принадлежности, апарати и устройства за автомобили, такива като: • външни и вътрешни гуми • свещи за запалване, акумулатори, фарове, лампи и части за електрически съоръжения за автомобили - търговско посредничество с нови и употребявани части и принадлежности за автомобили @bg
scope note: Tato skupina zahrnuje velkoobchod a maloobchod s díly, součástkami, materiály, nástroji a příslušenstvím všeho druhu pro motorová vozidla, např. • s pryžovými pneumatikami a dušemi • se zapalovacími svíčkami, bateriemi, osvětlovacím vybavením a elektrickými díly @cs
scope note: Diese Gruppe umfasst Groß- und Einzelhandel mit Teilen, Bauelementen, Material, Werkzeugen und Zubehör aller Art für Kraftfahrzeuge, z. B.: • Gummireifen und Luftschläuchen • Zündkerzen, Batterien, Beleuchtungsgeräten und elektrischen Teilen @de
scope note: This group includes wholesale and retail trade of all kinds of parts, components, supplies, tools and accessories for motor vehicles, such as: • rubber tyres and inner tubes for tyres • spark plugs, batteries, lighting equipment and electrical parts @en
scope note: Es grupo comprende el comercio al por mayor y al por menor de todo tipo de repuestos, componentes, suministros, herramientas y accesorios para vehículos de motor, como: • neumáticos y cámaras de aire para cubiertas • bujías de encendido, baterías, equipos de iluminación y piezas eléctricas @es
scope note: Ce groupe comprend le commerce de gros et de détail de tout type de pièces, composants, fournitures, outils et accessoires de véhicules automobiles, tels que: • pneumatiques et chambres à air pour pneumatiques • bougies d’allumage, appareils d’éclairage et parties électriques @fr
scope note: Ova skupina uključuje trgovinu na veliko i na malo svim vrstama dijelova, pribora, alata i opreme za motorna vozila, kao što su: • vanjske i unutarnje gume • svjećice, baterije, rasvjetna oprema i električni dijelovi
scope note: Į šią grupę įeina didmeninė ir mažmeninė prekyba įvairiomis variklinių transporto priemonių dalimis, komponentais, atsargomis, įrankiais ir pagalbiniais reikmenimis, pvz.: • guminėmis padangomis ir padangų kameromis • uždegimo žvakėmis, akumuliatoriais, apšvietimo įranga ir elektrinėmis dalimis @lt
scope note: Этот класс исключает: - оптовую торговлю от собственного имени, см. 46.2, 46.9 - розничную торговлю, осуществляемую комиссионными агентами не через магазины, см. 47.99 @ru
scope note: Bu grup aşağıdakiler gibi, her çeşit motorlu taşıt parça, bölüm, teçhizat, alet ve aksesuarlarının toptan ve perakende satışını kapsar: • lastik tekerlekler için kauçuk otomobil lastikleri ve otomobilin iç lastikleri, • ateşleme bujileri, bataryalar, aydınlatma teçhizatı ve elektrik bölmeleri. @tr
preferred label: Търговия с части и принадлежности за автомобили @bg
preferred label: Obchod s díly a příslušenstvím pro motorová vozidla, kromě motocyklů @cs
preferred label: Salg af reservedele og tilbehør til motorkøretøjer @da
preferred label: Handel mit Kraftwagenteilen und -zubehör @de
preferred label: Πώληση μερών και εξαρτημάτων μηχανοκίνητων οχημάτων @el
preferred label: Comercio de repuestos y accesorios de vehículos de motor @es
preferred label: Mootorsõidukite osade ja lisaseadmete müük @et
preferred label: Moottoriajoneuvojen osien ja varusteiden kauppa @fi
preferred label: Commerce d'équipements automobiles @fr
preferred label: Gépjárműalkatrész-kereskedelem
preferred label: Commercio di parti e accessori di autoveicoli @it
preferred label: Variklinių transporto priemonių atsarginių dalių ir pagalbinių reikmenų pardavimas @lt
preferred label: Automobiļu detaļu un piederumu pārdošana @lv
preferred label: Bejgħ ta' parts u aċċessorji ta' vetturi bil-mutur @mt
preferred label: Handel in delen en toebehoren van auto's @nl
preferred label: Handel med deler og utstyr til motorvogner, unntatt motorsykler @no
preferred label: Sprzedaż części i akcesoriów do pojazdów samochodowych @pl
preferred label: Comércio de peças e acessórios para veículos automóveis @pt
preferred label: Comerţ cu piese şi accesorii pentru autovehicule @ro
preferred label: Торговля автомобильными деталями, узлами и принадлежностями @ru
preferred label: Predaj dielov a príslušenstva motorových vozidiel @sk
preferred label: Trgovina z rezervnimi deli in opremo za motorna vozila @sl
preferred label: Handel med reservdelar och tillbehör till motorfordon utom motorcyklar @sv
preferred label: Motorlu kara taşıtlarının parça ve aksesuarlarının ticareti @tr
broader: Wholesale and retail trade and repair of motor vehicles and motorcycles
narrower: Wholesale trade of motor vehicle parts and accessories
narrower: Retail trade of motor vehicle parts and accessories

Wholesale trade of motor vehicle parts and accessories
type: Concept
notation: 45.31
status: valid
status modified: 2013-10-18
accepted date: 2013-10-18
in scheme: Statistical Classification of Economic Activities in the European Community, Rev. 2 (2008)
scope note: - търговия на едро с части и принадлежности за автомобили - търговско посредничество с части и принадлежности за автомобили @bg
scope note: Данный класс включает агентов, занимающихся продажей: • топливом, рудами, металлами и химическими веществами, включая удобрения Этот класс исключает: - оптовую торговлю от собственного имени, см. 46.2, 46.9 - розничную торговлю, осуществляемую комиссионными агентами не через магазины, см. 47.99 @ru
preferred label: Търговия на едро с части и принадлежности за автомобили @bg
preferred label: Velkoobchod s díly a příslušenstvím pro motorová vozidla, kromě motocyklů @cs
preferred label: Engroshandel med reservedele og tilbehør til motorkøretøjer @da
preferred label: Großhandel mit Kraftwagenteilen und -zubehör @de
preferred label: Χονδρικό εμπόριο μερών και εξαρτημάτων μηχανοκίνητων οχημάτων @el
preferred label: Comercio al por mayor de repuestos y accesorios de vehículos de motor @es
preferred label: Mootorsõidukite osade ja lisaseadmete hulgimüük @et
preferred label: Moottoriajoneuvojen osien ja varusteiden tukkukauppa @fi
preferred label: Commerce de gros d'équipements automobiles @fr
preferred label: Gépjárműalkatrész-nagykereskedelem
preferred label: Commercio all'ingrosso di parti e accessori di autoveicoli @it
preferred label: Variklinių transporto priemonių atsarginių dalių ir pagalbinių reikmenų didmeninė prekyba @lt
preferred label: Automobiļu rezerves daļu un piederumu vairumtirdzniecība @lv
preferred label: Negozju bl-ingrossa ta' parts u aċċessorji ta' vetturi bil-mutur @mt
preferred label: Groothandel in delen en toebehoren van auto's @nl
preferred label: Agentur- og engroshandel med deler og utstyr til motorvogner, unntatt motorsykler @no
preferred label: Sprzedaż hurtowa części i akcesoriów do pojazdów samochodowych @pl
preferred label: Comércio por grosso de peças e acessórios para veículos automóveis @pt
preferred label: Comerţ cu ridicata de piese şi accesorii pentru autovehicule @ro
preferred label: Оптовая торговля запасными частями и принадлежностями для автомобилей @ru
preferred label: Veľkoobchod s dielmi a príslušenstvom motorových vozidiel @sk
preferred label: Trgovina na debelo z rezervnimi deli in opremo za motorna vozila @sl
preferred label: Parti- och provisionshandel med reservdelar och tillbehör till motorfordon utom motorcyklar @sv
preferred label: Motorlu kara taşıtlarının parça ve aksesuarlarının toptan ticareti @tr
broader: Sale of motor vehicle parts and accessories

Retail trade of motor vehicle parts and accessories
type: Concept
notation: 45.32
status: valid
status modified: 2013-10-18
accepted date: 2013-10-18
in scheme: Statistical Classification of Economic Activities in the European Community, Rev. 2 (2008)
scope note: - търговия на дребно с автомобилни горива и смазочни материали - 47.30 @bg
scope note: N: - maloobchod s pohonnými hmotami pro motorová vozidla (47.30) @cs
scope note: Diese Klasse umfasst nicht: - Einzelhandel mit Motorenkraftstoffen (Tankstellen) (s. 47.30) @de
scope note: This class excludes: - retail sale of automotive fuel, see 47.30 @en
scope note: Esta clase no comprende: - el comercio al por menor de carburantes para la automoción (véase 47.30) @es
scope note: Cette classe ne comprend pas: - le commerce de détail de carburants, voir 47.30 @fr
scope note: Ovaj razred isključuje: - trgovinu na malo motornim gorivima, vidi 47.30
scope note: Į šią klasę neįeina: - mažmeninė prekyba automobiliniais degalais, žr. 47.30 @lt
scope note: Этот класс исключает: - оптовую торговлю от собственного имени, см. 46.2, 46.9 - розничную торговлю, осуществляемую комиссионными агентами не через магазины, см. 47.99 @ru
scope note: Kapsam dışı olanlar; - perakende yakıt satışı, bkz. 47.30. @tr
preferred label: Търговия на дребно с части и принадлежности за автомобили @bg
preferred label: Maloobchod s díly a příslušenstvím pro motorová vozidla, kromě motocyklů @cs
preferred label: Detailhandel med reservedele og tilbehør til motorkøretøjer @da
preferred label: Einzelhandel mit Kraftwagenteilen und -zubehör @de
preferred label: Λιανικό εμπόριο μερών και εξαρτημάτων μηχανοκίνητων οχημάτων @el
preferred label: Comercio al por menor de repuestos y accesorios de vehículos de motor @es
preferred label: Mootorsõidukite osade ja lisaseadmete jaemüük @et
preferred label: Moottoriajoneuvojen osien ja varusteiden vähittäiskauppa @fi
preferred label: Commerce de détail d'équipements automobiles @fr
preferred label: Gépjárműalkatrész-kiskereskedelem
preferred label: Commercio al dettaglio di parti e accessori di autoveicoli @it
preferred label: Variklinių transporto priemonių atsarginių dalių ir pagalbinių reikmenų mažmeninė prekyba @lt
preferred label: Automobiļu rezerves daļu un piederumu mazumtirdzniecība @lv
preferred label: Negozju bl-imnut ta' parts u aċċessorji ta' vetturi bil-mutur @mt
preferred label: Detailhandel in delen en toebehoren van auto's @nl
preferred label: Detaljhandel med deler og utstyr til motorvogner, unntatt motorsykler @no
preferred label: Sprzedaż detaliczna części i akcesoriów do pojazdów samochodowych @pl
preferred label: Comércio a retalho de peças e acessórios para veículos automóveis @pt
preferred label: Comerţ cu amănuntul de piese şi accesorii pentru autovehicule @ro
preferred label: Розничная торговля запасными частями и принадлежностями для автомобилей @ru
preferred label: Maloobchod s dielmi a príslušenstvom motorových vozidiel @sk
preferred label: Trgovina na drobno z rezervnimi deli in opremo za motorna vozila @sl
preferred label: Detaljhandel med reservdelar och tillbehör till motorfordon utom motorcyklar @sv
preferred label: Motorlu kara taşıtlarının parça ve aksesuarlarının perakende ticareti @tr
broader: Sale of motor vehicle parts and accessories

Sale, maintenance and repair of motorcycles and related parts and accessories
type: Concept
notation: 45.4
status: valid
status modified: 2013-10-18
accepted date: 2013-10-18
in scheme: Statistical Classification of Economic Activities in the European Community, Rev. 2 (2008)
scope note: Данный класс включает агентов, занимающихся торговлей: • машинами, включая офисную технику и компьютеры,, промышленным оборудованием, морскими и воздушными судами Этот класс исключает: - деятельность комиссионных агентов, занимающихся продажей моторных транспортных средств, см. 45.1 - аукционы моторных транспортных средств, см. 45.1 - оптовую торговлю от собственного имени, см. 46.2, 46.9 - розничную торговлю, осуществляемую комиссионными агентами не через магазины, см. 47.99 @ru
preferred label: Търговия с мотоциклети и с части за тях, техническо обслужване и ремонт на мотоциклети @bg
preferred label: Obchod s motocykly, jejich díly a příslušenstvím a jejich opravy a údržba @cs
preferred label: Salg, vedligeholdelse og reparation af motorcykler og reservedele og tilbehør hertil @da
preferred label: Handel mit Krafträdern, Kraftradteilen und -zubehör; Instandhaltung und Reparatur von Krafträdern @de
preferred label: Πώληση, συντήρηση και επισκευή μοτοσυκλετών και των μερών και εξαρτημάτων τους @el
preferred label: Venta, mantenimiento y reparación de motocicletas y de sus repuestos y accesorios @es
preferred label: Mootorrataste, nende osade ja lisaseadmete müük, hooldus ja remont @et
preferred label: Moottoripyörien sekä niiden osien ja varusteiden myynti, huolto ja korjaus @fi
preferred label: Commerce et réparation de motocycles @fr
preferred label: Motorkerékpár, -alkatrész kereskedelme, javítása
preferred label: Commercio, manutenzione e riparazione di motocicli e relativi parti ed accessori @it
preferred label: Motociklų ir jų atsarginių dalių bei pagalbinių reikmenų pardavimas, techninė priežiūra ir remontas @lt
preferred label: Motociklu, to detaļu un piederumu pārdošana, apkope un remonts @lv
preferred label: Bejgħ, manutenzjoni u tiswija ta' parts u aċċessorji tal-muturi u oħrajn relatati @mt
preferred label: Handel in en onderhoud en reparatie van motorfietsen en delen en toebehoren van motorfietsen @nl
preferred label: Handel med motorsykler, deler og utstyr. Vedlikehold og reparasjon av motorsykler @no
preferred label: Sprzedaż, konserwacja i naprawa motocykli oraz sprzedaż części i akcesoriów do nich @pl
preferred label: Comércio, manutenção e reparação de motociclos, de suas peças e acessórios @pt
preferred label: Comerţ cu motociclete, piese şi accesorii aferente; întreţinerea şi repararea motocicletelor @ro
preferred label: Торговля мотоциклами, их деталями, узлами и принадлежностями; техническое обслуживание и ремонт мотоциклов @ru
preferred label: Predaj, údržba a oprava motocyklov a ich dielov a príslušenstva @sk
preferred label: Trgovina, vzdrževanje in popravila motornih koles; trgovina z njihovimi deli in opremo @sl
preferred label: Handel med och service av motorcyklar inklusive reservdelar och tillbehör @sv
preferred label: Motosiklet ve ilgili parça ve aksesuarların ticareti, bakımı ve onarımı @tr
broader: Wholesale and retail trade and repair of motor vehicles and motorcycles
narrower: Sale, maintenance and repair of motorcycles and related parts and accessories

Sale, maintenance and repair of motorcycles and related parts and accessories
type: Concept
notation: 45.40
status: valid
status modified: 2013-10-18
accepted date: 2013-10-18
in scheme: Statistical Classification of Economic Activities in the European Community, Rev. 2 (2008)
scope note: - търговия на едро и дребно с мотоциклети, вкл. мотопеди - търговия на едро и дребно с части и принадлежности за мотоциклети, вкл. по пощата - търговско посредничество с мотоциклети и с части за тях - техническо обслужване и ремонт на мотоциклети - търговия на едро с велосипеди, части и принадлежности за тях - 46.49 - търговия на дребно с велосипеди, части и принадлежности за тях - 47.64 - даване под наем на велосипеди - 77.39 - ремонт на велосипеди - 95.29 @bg
scope note: Z: - velkoobchod a maloobchod s motocykly, včetně mopedů - velkoobchod a maloobchod s díly a příslušenstvím pro motocykly, včetně zprostředkování obchodu a zásilkového obchodu - údržbu a opravy motocyklů N: - velkoobchod s jízdními koly, jejich díly a příslušenstvím (46.49) - maloobchod s jízdními koly, jejich díly a příslušenstvím (47.64) - pronájem motocyklů (77.39) - opravy a údržbu jízdních kol (95.29) @cs
scope note: Diese Klasse umfasst: - Groß- und Einzelhandel mit Krafträdern einschließlich Kleinkrafträdern - Groß- und Einzelhandel mit Teilen und Zubehör für Krafträder (einschließlich Handelsvermittlung und Versandhandel) - Instandhaltung und Reparatur von Krafträdern Diese Klasse umfasst nicht: - Großhandel mit Fahrrädern, Fahrradteilen und -zubehör (s. 46.49) - Einzelhandel mit Fahrrädern, Fahrradteilen und -zubehör (s. 47.64) - Vermietung von Krafträdern (s. 77.39) - Reparatur und Instandhaltung von Fahrrädern (s. 95.29) @de
scope note: This class includes: - wholesale and retail sale of motorcycles, including mopeds - wholesale and retail sale of parts and accessories for motorcycles (including by commission agents and mail order houses) - maintenance and repair of motorcycles This class excludes: - wholesale of bicycles and related parts and accessories, see 46.49 - retail sale of bicycles and related parts and accessories, see 47.64 - renting of motorcycles, see 77.39 - repair and maintenance of bicycles, see 95.29 @en
scope note: Esta clase comprende: - el comercio al por mayor y al por menor de motocicletas, incluidos los ciclomotores - el comercio al por mayor y al por menor de repuestos y accesorios de motocicletas (incluido el comercio por intermediarios y por correo) - el mantenimiento y reparación de motocicletas Esta clase no comprende: - el comercio al por mayor de bicicletas y sus repuestos y accesorios (véase 46.49) - el comercio al por menor de bicicletas y sus repuestos y accesorios (véase 47.64) - el alquiler de motocicletas (véase 77.39) - la reparación y mantenimiento de bicicletas (véase 95.29) @es
scope note: Cette classe comprend: - le commerce de gros et de détail de motocycles, y compris les cyclomoteurs - le commerce de gros et de détail de pièces et d’accessoires de motocycles (y compris par des intermédiaires et par correspondance) - l’entretien et la réparation de motocycles Cette classe ne comprend pas: - le commerce de gros de bicyclettes et de leurs pièces et accessoires, voir 46.49 - le commerce de détail de bicyclettes et de leurs pièces et accessoires, voir 47.64 - la location de motocycles, voir 77.39 - la réparation et l’entretien de bicyclettes, voir 95.29 @fr
scope note: Ovaj razred uključuje: - trgovinu na veliko i na malo motociklima, uključujući mopede - trgovinu na veliko i na malo dijelovima i priborom za motocikle (uključujući putem posrednika ili poštom) - održavanje i popravak motocikla Ovaj razred isključuje: - trgovinu na veliko biciklima i njihovim dijelovima i priborom, vidi 46.49 - trgovinu na malo biciklima i njihovim dijelovima i priborom, vidi 47.64 - iznajmljivanje motocikla, vidi 77.39 - popravak i održavanje bicikla, vidi 95.29
scope note: Į šią klasę įeina: - didmeninė ir mažmeninė prekyba motociklais, įskaitant mopedus - didmeninė ir mažmeninė prekyba motociklų atsarginėmis dalimis ir pagalbiniais reikmenimis (įskaitant prekybos tarpininkus ir prekybos firmas, išsiunčiančias prekes paštu pagal užsakymą) - motociklų techninė priežiūra ir remontas Į šią klasę neįeina: - didmeninė prekyba dviračiais ir jų atsarginėmis dalimis bei pagalbiniais reikmenimis, žr. 46.49 - mažmeninė prekyba dviračiais ir jų atsarginėmis dalimis bei pagalbiniais reikmenimis, žr. 47.64 - motociklų nuoma, žr. 77.39 - dviračių techninė priežiūra ir remontas, žr. 95.29 @lt
scope note: Этот класс исключает: - оптовую торговлю от собственного имени, см. 46.2, 46.9 - розничную торговлю, осуществляемую комиссионными агентами не через магазины, см. 47.99 @ru
scope note: Bu sınıf aşağıdakileri kapsamaktadır; - küçük motorlu bisikletler dahil, motosikletlerin toptan ve perakende satışı, - motosikletlerin parçaları ve aksesuarlarının toptan ve perakende satışı (komisyoncular ve posta ile satış yapan mağazalar dahil), - motosikletlerin bakım ve onarımı. Kapsam dışı olanlar; - bisikletlerin ve ilgili parçalarının ve aksesuarlarının toptan ticareti, bkz. 46.49, - bisikletlerin ve ilgili parçalarının ve aksesuarlarının perakende satışı, bkz. 47.64, - motosikletlerin kiralanması, bkz. 77.39, - bisikletlerin bakım ve onarımı, bkz. 95.29. @tr
preferred label: Търговия с мотоциклети и с части за тях, техническо обслужване и ремонт на мотоциклети @bg
preferred label: Obchod s motocykly, jejich díly a příslušenstvím a jejich opravy a údržba @cs
preferred label: Salg, vedligeholdelse og reparation af motorcykler og reservedele og tilbehør hertil @da
preferred label: Handel mit Krafträdern, Kraftradteilen und -zubehör; Instandhaltung und Reparatur von Krafträdern @de
preferred label: Πώληση, συντήρηση και επισκευή μοτοσυκλετών και των μερών και εξαρτημάτων τους @el
preferred label: Venta, mantenimiento y reparación de motocicletas y de sus repuestos y accesorios @es
preferred label: Mootorrataste, nende osade ja lisaseadmete müük, hooldus ja remont @et
preferred label: Moottoripyörien sekä niiden osien ja varusteiden myynti, huolto ja korjaus @fi
preferred label: Commerce et réparation de motocycles @fr
preferred label: Motorkerékpár, -alkatrész kereskedelme, javítása
preferred label: Commercio, manutenzione e riparazione di motocicli e relativi parti ed accessori @it
preferred label: Motociklų ir jų atsarginių dalių bei pagalbinių reikmenų pardavimas, techninė priežiūra ir remontas @lt
preferred label: Motociklu, to detaļu un piederumu pārdošana, apkope un remonts @lv
preferred label: Bejgħ, manutenzjoni u tiswija ta' muturi u ta' parts relatati u aċċessorji @mt
preferred label: Handel in en onderhoud en reparatie van motorfietsen en delen en toebehoren van motorfietsen @nl
preferred label: Handel med motorsykler, deler og utstyr. Vedlikehold og reparasjon av motorsykler @no
preferred label: Sprzedaż, konserwacja i naprawa motocykli oraz sprzedaż części i akcesoriów do nich @pl
preferred label: Comércio, manutenção e reparação de motociclos, de suas peças e acessórios @pt
preferred label: Comerţ cu motociclete, piese şi accesorii aferente; întreţinerea şi repararea motocicletelor @ro
preferred label: Торговля мотоциклами, их деталями, узлами и принадлежностями; техническое обслуживание и ремонт мотоциклов @ru
preferred label: Predaj, údržba a oprava motocyklov a ich dielov a príslušenstva @sk
preferred label: Trgovina, vzdrževanje in popravila motornih koles; trgovina z njihovimi deli in opremo @sl
preferred label: Handel med och service av motorcyklar inklusive reservdelar och tillbehör @sv
preferred label: Motosiklet ve ilgili parça ve aksesuarların ticareti, bakımı ve onarımı @tr
broader: Sale, maintenance and repair of motorcycles and related parts and accessories

Wholesale trade, except of motor vehicles and motorcycles
type: Concept
notation: 46
status: valid
status modified: 2013-10-18
accepted date: 2013-10-18
in scheme: Statistical Classification of Economic Activities in the European Community, Rev. 2 (2008)
scope note: Този раздел включва търговия на едро за собствена сметка или срещу заплащане (по договор или еднократно), свързана с продажби на едро на вътрешния и външния пазар (внос и износ). - търговия на едро с автомобили, каравани и мотоциклети - 45.1, 45.4 - търговия на едро с части и принадлежности за автомобили и мотоциклети - 45.31, 45.40 - даване под наем и оперативен лизинг на лични и домакински вещи – раздел 77 - пакетиране на твърди продукти и бутилиране на течни или газообразни продукти, вкл. смесване и филтриране, предлагано като бизнесуслуга за трети лица - 82.92 @bg
scope note: Tento oddíl zahrnuje nákup a další prodej nového nebo použitého zboží (bez transformace) na vlastní účet; zprostředkování velkoobchodu a velkoobchodu v zastoupení (komisionářský obchod); jak v domácím, tak v mezinárodním velkoobchodě (dovoz/vývoz). N: - velkoobchod s motorovými vozidly a obytnými vozy a motocykly (45.1, 45.4) - velkoobchod s příslušenstvím motorových vozidel (45.31, 45.40) - pronájem a leasing zboží (oddíl 77) - balení zboží v pevném stavu a plnění zboží v kapalném nebo plynném stavu, včetně míchání a filtrování pro třetí stranu (82.92) @cs
scope note: Diese Abteilung umfasst Großhandel auf eigene Rechnung oder Handelsvermittlung, und zwar sowohl Binnengroßhandel als auch internationalen Großhandel (Import/Export). Diese Abteilung umfasst nicht: - Großhandel mit Kraftwagen und Wohnwagen sowie mit Krafträdern (s. 45.1, 45.4) - Großhandel mit Kraftwagen- und Kraftradzubehör (s. 45.31, 45.40) - Vermietung und Operate-Leasing (s. Abteilung 77) - Verpackung von festen Waren und Abfüllung von flüssigen oder gasförmigen Waren, einschließlich Mischen und Filtern für Dritte (s. 82.92) @de
scope note: This division includes wholesale trade on own account or on a fee or contract basis (commission trade) related to domestic wholesale trade as well as international wholesale trade (import/export). This division excludes: - wholesale of motor vehicles, caravans and motorcycles, see 45.1, 45.4 - wholesale of motor vehicle accessories, see 45.31, 45.40 - renting and leasing of goods, see division 77 - packing of solid goods and bottling of liquid or gaseous goods, including blending and filtering for third parties, see 82.92 @en
scope note: Esta división comprende el comercio al por mayor por cuenta propia o por cuenta de terceros (intermediarios de comercio) relacionado con el comercio al por mayor nacional, así como el comercio al por mayor internacional (importación/exportación). Esta división no comprende: - el comercio al por mayor de vehículos, caravanas y motocicletas (véanse 45.1 y 45.4) - el comercio al por mayor de accesorios de vehículos de motor (véanse 45.31 y 45.40) - el alquiler de bienes (véase la división 77) - el empaquetado de mercancías sólidas y el embotellado de mercancías líquidas o gaseosas, incluida la mezcla y filtrado para terceros (véase 82.92) @es
scope note: Cette division comprend le commerce de gros pour compte propre ou pour le compte de tiers (intermédiaires du commerce) et concerne les activités de commerce intérieur ou le commerce de gros international (importation/exportation). Cette division ne comprend pas: - le commerce de gros de véhicules automobiles, de caravanes et de motocycles, voir 45.1 et 45.4 - le commerce de gros d’accessoires de véhicules automobiles, voir 45.31 et 45.40 - les activités de location et location-bail, voir division 77 - l’emballage de marchandises solides et l’embouteillage de marchandises liquides ou gazeuses, y compris le mélange et le filtrage, pour le compte de tiers, voir 82.92 @fr
scope note: Ovaj odjeljak uključuje trgovinu na veliko za vlastiti račun ili uz naplatu ili na osnovi ugovora (posredovanje), a odnosi se na trgovinu na veliko na domaćem tržištu, kao i na međunarodnu trgovinu na veliko (uvoz/izvoz). Ovaj odjeljak isključuje: - trgovinu na veliko motornim vozilima, stambenim autoprikolicama i motociklima, vidi 45.1, 45.4 - trgovinu na veliko priborom za motorna vozila i motocikle, vidi 45.31, 45.40 - iznajmljivanje i davanje robe u zakup (leasing), vidi odjeljak 77 - pakiranje čvrste robe i punjenje tekuće ili plinovite robe u boce, uključujući miješanje i filtriranje za treće osobe, vidi 82.92
scope note: Į šį skyrių įeina didmeninė prekyba savo lėšomis arba už atlygį ar pagal sutartį (komisinė prekyba), susijusi tiek su didmenine vidaus, tiek su didmenine tarptautine prekyba (importas / eksportas). Į šį skyrių neįeina: - variklinių transporto priemonių, priekabinių namelių ir motociklų didmeninė prekyba, žr. 45.1, 45.4 - variklinių transporto priemonių pagalbinių reikmenų didmeninė prekyba, žr. 45.31, 45.40 - prekių nuoma ir išperkamoji nuoma, žr. skyrių 77 - trečiosioms šalims atliekamas kietųjų prekių pakavimas, skystųjų arba dujinių produktų išpilstymas į butelius, įskaitant sumaišymą ir filtravimą, žr. 82.92 @lt
scope note: Этот класс исключает: - оптовую торговлю от собственного имени, см. 46.2, 46.9 - розничную торговлю, осуществляемую комиссионными агентами не через магазины, см. 47.99 @ru
scope note: Bu bölüm, uluslararası toptan ticaret (ithalat/ihracat) de dahil ülke içi toptan ticaret ile ilgili kendi hesabına veya bir ücret veya sözleşmeye dayalı olarak (komisyon ticareti) yapılan toptan ticareti kapsamaktadır. Kapsam dışı olanlar; - motorlu taşıtların, karavanların ve motosikletlerin toptan ticareti, bkz. 45.1, 45.4, - motorlu taşıt aksesuarlarının toptan ticareti, bkz. 45.31, 45.40, - malların kiralanması veya leasingi, bkz. Bölüm 77, - katı malların paketlenmesi ve sıvı veya gazlı malların şişelenmesi (üçüncü kişiler için harmanlanması ve süzülmesi dahil), bkz. 82.92. @tr
preferred label: Търговия на едро, без търговията с автомобили и мотоциклети @bg
preferred label: Velkoobchod, kromě s motorovými vozidly @cs
preferred label: Engroshandel undtagen med motorkøretøjer og motorcykler @da
preferred label: Großhandel (ohne Handel mit Kraftfahrzeugen und Krafträdern) @de
preferred label: Χονδρικό εμπόριο, εκτός από το εμπόριο μηχανοκίνητων οχημάτων και μοτοσυκλετών @el
preferred label: Comercio al por mayor e intermediarios del comercio, excepto de vehículos de motor y motocicletas @es
preferred label: Hulgikaubandus, v.a mootorsõidukid ja mootorrattad @et
preferred label: Tukkukauppa (pl. moottoriajoneuvojen ja moottoripyörien kauppa) @fi
preferred label: Commerce de gros, à l’exception des automobiles et des motocycles @fr
preferred label: Nagykereskedelem (kivéve: jármű, motorkerékpár)
preferred label: Commercio all'ingrosso, escluso quello di autoveicoli e di motocicli @it
preferred label: Didmeninė prekyba, išskyrus prekybą variklinėmis transporto priemonėmis ir motociklais @lt
preferred label: Vairumtirdzniecība, izņemot automobiļus un motociklus @lv
preferred label: Negozju bl-ingrossa, għajr ta' vetturi bil-mutur u muturi @mt
preferred label: Groothandel, met uitzondering van de handel in auto's en motorfietsen @nl
preferred label: Agentur- og engroshandel, unntatt med motorvogner @no
preferred label: Handel hurtowy, z wyłączeniem handlu pojazdami samochodowymi i motocyklami @pl
preferred label: Comércio por grosso (excepto de veículos automóveis e motociclos) @pt
preferred label: Comerţ cu ridicata cu excepţa comerţului cu autovehicule şi motociclete @ro
preferred label: Оптовая торговля, за исключением автомобилей и мотоциклов @ru
preferred label: Veľkoobchod, okrem motorových vozidiel a motocyklov @sk
preferred label: Posredništvo in trgovina na debelo, razen z motornimi vozili @sl
preferred label: Parti- och provisionshandel utom med motorfordon @sv
preferred label: Toptan ticaret, motorlu kara taşıtları ve motosikletler hariç @tr
broader: WHOLESALE AND RETAIL TRADE; REPAIR OF MOTOR VEHICLES AND MOTORCYCLES
narrower: Wholesale on a fee or contract basis
narrower: Wholesale of agricultural raw materials and live animals
narrower: Wholesale of food, beverages and tobacco
narrower: Wholesale of household goods
narrower: Wholesale of information and communication equipment
narrower: Wholesale of other machinery, equipment and supplies
narrower: Other specialised wholesale
narrower: Non-specialised wholesale trade

Wholesale on a fee or contract basis
type: Concept
notation: 46.1
status: valid
status modified: 2013-10-18
accepted date: 2013-10-18
in scheme: Statistical Classification of Economic Activities in the European Community, Rev. 2 (2008)
scope note: - дейности на посредници, стокови брокери и всички посредници на едро, които търгуват в полза на или за сметка на трети лица - дейности на лица, свързващи купувачите с продавачите или осъществяващи търговските сделки в полза на трети лица, вкл. и по Интернет - дейности по продажби на едро чрез търг с явно наддаване, вкл. и по Интернет (аукционни къщи) - търговия на едро за собствена сметка - 46.2 - 46.9 - търговия на дребно извън търговски обекти чрез търговски агенти - 47.99 @bg
scope note: Z: - činnosti obchodních zástupců, obchodních makléřů a všech ostatních velkoobchodníků, kteří obchodují v zastoupení a na účet jiných - činnosti propojení prodávajících zboží s kupujícími zboží, nebo obstarávání obchodních záležitostí jménem zadavatele, včetně prostřednictvím internetu ZT: - velkoobchodní činnosti aukčních domů, včetně velkoobchodních aukcí prostřednictvím internetu @cs
scope note: Diese Gruppe umfasst: - Tätigkeiten von Handelsvertretern, Handelsmaklern und allen anderen Großhändlern, die im Namen und auf Rechnung anderer Handel treiben - Zusammenbringen von Käufern und Verkäufern von Waren oder Besorgung von Handelsgeschäften im Namen eines Auftraggebers, auch über das Internet Diese Gruppe umfasst ferner: - Großhandelstätigkeiten von Auktionshäusern, auch im Internet @de
scope note: This group includes: - activities of commission agents, commodity brokers and all other wholesalers who trade on behalf and on the account of others - activities of those involved in bringing sellers and buyers together or undertaking commercial transactions on behalf of a principal, including on the Internet. This group also includes: - activities of wholesale auctioneering houses, including Internet wholesale auctions @en
scope note: Este grupo comprende: - las actividades de intermediarios, corredores de mercancías y los restantes mayoristas que comercian por cuenta ajena - las actividades de los que estén dedicados a poner en contacto a compradores y vendedores o emprendan operaciones comerciales en nombre de un mandante, incluso por Internet Este grupo comprende también: - las actividades de las empresas de subastas al por mayor, incluso las subastas al por mayor por Internet @es
scope note: Ce groupe comprend: - les activités des commissionnaires, des courtiers en marchandises et de tous les autres intermédiaires du commerce de gros qui agissent au nom et pour le compte de tiers - les activités des personnes qui mettent en contact des acheteurs et des vendeurs ou qui exécutent des opérations commerciales pour le compte d’un tiers, y compris sur Internet Cette division comprend également: - les activités des maisons de vente aux enchères en gros, y compris par Internet @fr
scope note: Ova skupina uključuje: - djelatnosti trgovačkih posrednika i svih drugih trgovaca na veliko koji trguju u ime ili za račun drugih - djelatnosti onih koji su uključeni u povezivanje prodavača s kupcima ili poduzimaju trgovačke transakcije u ime vlasnika robe, uključujući internetom Ovaj razred također uključuje: - djelatnosti dražbovaonica (aukcijskih kuća) u vezi s trgovinom na veliko, uključujući i dražbe internetom
scope note: Į šią grupę įeina: - prekybos tarpininkų, prekių prekybos brokerių ir visų kitų didmeninės prekybos prekiautojų, prekiaujančių kitų asmenų vardu ir jų lėšomis veikla - tų, kurie supažindina pardavėjus su pirkėjais arba sudaro komercinius sandorius pagrindinių asmenų vardu, įskaitant paslaugas internetu, veikla Į šią grupę taip pat įeina: - didmeninės prekybos aukcionų namų, įskaitant didmeninės prekybos aukcionus internetu, veikla @lt
scope note: Этот класс исключает: - оптовую торговлю от собственного имени, см. 46.2, 46.9 - розничную торговлю, осуществляемую комиссионными агентами не через магазины, см. 47.99 @ru
scope note: Bu grup aşağıdakileri kapsamaktadır: - kendi hesabına ve diğerlerinin adına ticaret yapan komisyoncuların, mal simsarlarının ve diğer tüm toptancıların faaliyetleri, - internet üzerinden olanlar da dahil olmak üzere, satıcıları ve alıcıları bir araya getirenlerin veya işverenlerin adına ticari işleri yürütenlerin faaliyetleri. Ayrıca bu grup aşağıdakileri de kapsamaktadır; - toptancı müzayede evlerinin ticari faaliyetleri (internetteki toptan satışlı müzayedeler dahil). @tr
preferred label: Търговия на едро чрез посредничество @bg
preferred label: Zprostředkování velkoobchodu @cs
preferred label: Agenturhandel (engroshandel på honorar- eller kontraktbasis) @da
preferred label: Handelsvermittlung @de
preferred label: Χονδρικό εμπόριο έναντι αμοιβής ή βάσει σύμβασης @el
preferred label: Intermediarios del comercio @es
preferred label: Hulgimüük vahendustasu või lepingute alusel @et
preferred label: Agentuuritoiminta @fi
preferred label: Intermédiaires du commerce de gros @fr
preferred label: Ügynöki nagykereskedelem
preferred label: Intermediari del commercio @it
preferred label: Didmeninė prekyba už atlygį ar pagal sutartį @lt
preferred label: Vairumtirdzniecība uz līguma pamata vai par atlīdzību @lv
preferred label: Bejgħ bl-ingrossa fuq bażi ta' ħlas jew kuntratt @mt
preferred label: Handelsbemiddeling @nl
preferred label: Agenturhandel @no
preferred label: Sprzedaż hurtowa realizowana na zlecenie @pl
preferred label: Agentes do comércio por grosso @pt
preferred label: Activităţi de intermediere în comerţul cu ridicata @ro
preferred label: Оптовая торговля за вознаграждение или на договорной основе @ru
preferred label: Sprostredkovanie veľkoobchodu @sk
preferred label: Posredništvo @sl
preferred label: Provisionshandel utom med motorfordon @sv
preferred label: Bir ücret veya sözleşmeye dayalı olarak yapılan toptan ticaret @tr
broader: Wholesale trade, except of motor vehicles and motorcycles
narrower: Agents involved in the sale of agricultural raw materials, live animals, textile raw materials and semi-finished goods
narrower: Agents involved in the sale of fuels, ores, metals and industrial chemicals
narrower: Agents involved in the sale of timber and building materials
narrower: Agents involved in the sale of machinery, industrial equipment, ships and aircraft
narrower: Agents involved in the sale of furniture, household goods, hardware and ironmongery
narrower: Agents involved in the sale of textiles, clothing, fur, footwear and leather goods
narrower: Agents involved in the sale of food, beverages and tobacco
narrower: Agents specialised in the sale of other particular products
narrower: Agents involved in the sale of a variety of goods

Agents involved in the sale of agricultural raw materials, live animals, textile raw materials and semi-finished goods
type: Concept
notation: 46.11
status: valid
status modified: 2013-10-18
accepted date: 2013-10-18
in scheme: Statistical Classification of Economic Activities in the European Community, Rev. 2 (2008)
scope note: N: - velkoobchod na vlastní účet (46.2 až 46.9) - maloobchod prostřednictvím obchodních zástupců mimo prodejny, stánky, trhy (47.99) @cs
scope note: Diese Klasse umfasst nicht: - Großhandel auf eigene Rechnung (s. 46.2 bis 46.9) - Einzelhandel durch Handelsvertreter nicht in Verkaufsräumen (s. 47.99) @de
scope note: This class excludes: - wholesale trade in own name, see 46.2 to 46.9 - retail sale by non-store commission agents, see 47.99 @en
scope note: Esta clase no comprende: - el comercio al por mayor por cuenta propia (véanse 46.2 a 46.9) - el comercio al por menor por intermediarios no realizada en establecimientos (véase 47.99) @es
scope note: Cette classe ne comprend pas: - le commerce de gros pour compte propre, voir 46.2 à 46.9 - le commerce de détail par des intermédiaires du commerce hors magasin, voir 47.99 @fr
scope note: Ovaj razred isključuje: - trgovinu na veliko za vlastiti račun, vidi 46.2 do 46.9 - trgovinu na malo preko posrednika, vidi 47.99
scope note: Į šią klasę neįeina: - didmeninė prekyba savo vardu, žr. nuo 46.2 iki 46.9 - mažmeninė prekyba ne parduotuvėse per komiso agentus, žr. 47.99 @lt
scope note: Этот класс исключает: - оптовую торговлю от собственного имени, см. 46.2, 46.9 - розничную торговлю, осуществляемую комиссионными агентами не через магазины, см. 47.99 - деятельность страховых агентов, см. 66.22 - деятельность агентов по торговле недвижимостью, см. 68.31 @ru
scope note: Kapsam dışı olanlar; - kendi adına toptan ticaret, bkz. 46.2'den 46.9'a kadar, - mağaza dışında komisyoncular tarafından yapılan perakende satış, bkz. 47.99. @tr
preferred label: Търговско посредничество със селскостопански суровини, живи животни, текстилни суровини и полуфабрикати @bg
preferred label: Zprostředkování velkoobchodu se základními zemědělskými produkty, živými zvířaty, textilními surovinami a polotovary @cs
preferred label: Agenturhandel med landbrugsråvarer, levende dyr, tekstilmaterialer og halvfabrikata @da
preferred label: Handelsvermittlung von landwirtschaftlichen Grundstoffen, lebenden Tieren, textilen Rohstoffen und Halbwaren @de
preferred label: Εμπορικοί αντιπρόσωποι που μεσολαβούν στην πώληση γεωργικών πρώτων υλών, ζώντων ζώων, κλωστοϋφαντουργικών πρώτων υλών και ημιτελών προϊόντων @el
preferred label: Intermediarios del comercio de materias primas agrarias, animales vivos, materias primas textiles y productos semielaborados @es
preferred label: Põllumajandustoorme, elusloomade, tekstiilitoorme ja pooltoodete vahendamine @et
preferred label: Maatalousraaka-aineiden, elävien eläinten, tekstiiliraaka-aineiden sekä puolivalmisteiden agentuuritoiminta @fi
preferred label: Intermédiaires du commerce en matières premières agricoles, animaux vivants, matières premières textiles et produits semi-finis @fr
preferred label: Mezőgazdasági termék ügynöki nagykereskedelme
preferred label: Intermediari del commercio di materie prime agricole, di animali vivi, di materie prime tessili e di semilavorati @it
preferred label: Žemės ūkio žaliavų, gyvų gyvulių, tekstilės žaliavų ir pusgaminių pardavimo agentų veikla @lt
preferred label: Lauksaimniecības izejvielu, dzīvu lopu, tekstilizejvielu un pusfabrikātu vairumtirdzniecības starpnieku darbība @lv
preferred label: Aġenti involuti fil-bejgħ ta' materja prima agrikola, annimali ħajja, materja prima tat-tessuti u oġġetti imħejjija għall-aħħar stadju tal-manifattura @mt
preferred label: Handelsbemiddeling in landbouwproducten, levende dieren en textielgrondstoffen en halffabrikaten @nl
preferred label: Agenturhandel med jordbruksråvarer, levende dyr, tekstilråvarer og innsatsvarer @no
preferred label: Działalność agentów zajmujących się sprzedażą płodów rolnych, żywych zwierząt, surowców dla przemysłu tekstylnego i półproduktów @pl
preferred label: Agentes de comércio por grosso de matérias-primas agrícolas e têxteis, animais vivos e produtos semiacabados @pt
preferred label: Intermedieri în comerţul cu materii prime agricole, animale vii, materii prime textile şi cu semifabricate @ro
preferred label: Деятельность агентов по торговле сельскохозяйственным сырьем, живыми животными, текстильным сырьем и полуфабрикатами @ru
preferred label: Sprostredkovanie obchodu s poľnohospodárskymi surovinami, živými zvieratami, textilnými surovinami a polotovarmi @sk
preferred label: Posredništvo pri prodaji kmetijskih surovin, živih živali, tekstilnih surovin, polizdelkov @sl
preferred label: Provisionshandel med jordbruksråvaror, levande djur, textilråvaror och textilhalvfabrikat @sv
preferred label: Tarımsal hammaddelerin, canlı hayvanların, tekstil hammaddelerinin ve yarı mamul malların satışı ile ilgili aracılar @tr
broader: Wholesale on a fee or contract basis

Agents involved in the sale of fuels, ores, metals and industrial chemicals
type: Concept
notation: 46.12
status: valid
status modified: 2013-10-18
accepted date: 2013-10-18
in scheme: Statistical Classification of Economic Activities in the European Community, Rev. 2 (2008)
scope note: - търговско посредничество с горива, руди, метали и химични продукти, вкл. торове @bg
scope note: Z: - činnost velkoobchodních zástupců zprostředkujících obchod: • s palivy, rudami, kovy a průmyslovými chemikáliemi, včetně hnojiv N: - velkoobchod na vlastní účet (46.2 až 46.9) - maloobchod prostřednictvím obchodních zástupců mimo prodejny, stánky a trhy (47.99) @cs
scope note: Diese Klasse umfasst die Handelsvermittlung von: • Brennstoffen, Erzen, Metallen und technischen Chemikalien, einschließlich Düngemitteln Diese Klasse umfasst nicht: - Großhandel auf eigene Rechnung (s. 46.2 bis. 46.9) - Einzelhandel durch Handelsvertreter nicht in Verkaufsräumen (s. 47.99) @de
scope note: This class includes agents involved in the sale of: • fuels, ores, metals and industrial chemicals, including fertilisers This class excludes: - wholesale trade in own name, see 46.2 to 46.9 - retail sale by non-store commission agents, see 47.99 @en
scope note: Esta clase comprende intermediarios del comercio de: • combustibles, minerales, metales y productos químicos industriales, incluidos los fertilizantes Esta clase no comprende: - el comercio al por mayor por cuenta propia (véanse 46.2 a 46.9) - el comercio al por menor por intermediarios no realizada en establecimientos (véase 47.99) @es
scope note: Cette classe comprend les intermédiaires du commerce de: • combustibles, minéraux, métaux et produits chimiques, y compris les engrais Cette classe ne comprend pas: - le commerce de gros pour compte propre, voir 46.2 à 46.9 - le commerce de détail par des intermédiaires du commerce hors magasin, voir 47.99 @fr
scope note: Ovaj razred uključuje posredovanje u trgovini: • gorivima, rudama, metalima i industrijskih kemijskim proizvodima, uključujući umjetna gnojiva Ovaj razred isključuje: - trgovinu na veliko za vlastiti račun, vidi 46.2 do 46.9 - trgovinu na malo preko posrednika, vidi 47.99
scope note: Į šią klasę įeina agentai, susiję su prekyba: • degalais, rūda, metalais ir pramoniniais chemikalais, įskaitant trąšas Į šią klasę neįeina: - didmeninė prekyba savo vardu, žr. nuo 46.2 iki 46.9 - mažmeninė prekyba ne parduotuvėse per komiso agentus, žr. 47.99 @lt
scope note: Этот класс исключает: - оптовую торговлю от собственного имени, см. 46.2, 46.9 - розничную торговлю, осуществляемую комиссионными агентами не через магазины, см. 47.99 @ru
scope note: Bu sınıf şunların satışında yer alan acenteleri kapsamaktadır: • yakıtlar, maden cevherleri, metaller ve endüstriyel kimyasallar (gübreler dahil). Kapsam dışı olanlar; - kendi adına toptan ticaret, bkz. 46.2`den 46.9`a kadar, - mağaza dışında komisyoncular tarafından yapılan perakende satış, bkz. 47.99. @tr
preferred label: Търговско посредничество с горива, руди, метали и химични продукти @bg
preferred label: Zprostředkování velkoobchodu s palivy, rudami, kovy a technickými chemikáliemi @cs
preferred label: Agenturhandel med brændstoffer, malme, metaller og kemiske produkter til industrien @da
preferred label: Handelsvermittlung von Brennstoffen, Erzen, Metallen und technischen Chemikalien @de
preferred label: Εμπορικοί αντιπρόσωποι που μεσολαβούν στην πώληση καυσίμων, μεταλλευμάτων, μετάλλων και βιομηχανικών χημικών προϊόντων @el
preferred label: Intermediarios del comercio de combustibles, minerales, metales y productos químicos industriales @es
preferred label: Kütuste, maakide, metallide ja tööstuskemikaalide vahendamine @et
preferred label: Polttoaineiden, malmien, metallien ja teollisuuskemikaalien agentuuritoiminta @fi
preferred label: Intermédiaires du commerce en combustibles, métaux, minéraux et produits chimiques @fr
preferred label: Alapanyag, üzemanyag ügynöki nagykereskedelme
preferred label: Intermediari del commercio di combustibili, minerali, metalli e prodotti chimici @it
preferred label: Degalų, rūdų, metalų ir pramoninių cheminių preparatų pardavimo agentų veikla @lt
preferred label: Degvielas, rūdas, metāla un rūpniecisko ķīmikāliju vielu vairumtirdzniecības starpnieku darbība @lv
preferred label: Aġenti involuti fil-bejgħ ta' fjuwil, minerali, metalli u kimiċi industrijali @mt
preferred label: Handelsbemiddeling in brandstoffen, ertsen, metalen en chemische producten @nl
preferred label: Agenturhandel med brensel, drivstoff, malm, metaller og industrikjemikalier @no
preferred label: Działalność agentów zajmujących się sprzedażą paliw, rud, metali i chemikaliów przemysłowych @pl
preferred label: Agentes do comércio por grosso de combustíveis, minérios, metais e de produtos químicos para a indústria @pt
preferred label: Intermedieri în comerţul cu combustibili, minereuri, metale şi produse chimice pentru industrie @ro
preferred label: Деятельность агентов по торговле топливом, рудами, металлами и химическими веществами @ru
preferred label: Sprostredkovanie obchodu s palivami, rudami, kovmi a priemyselnými chemikáliami @sk
preferred label: Posredništvo pri prodaji goriv, rud, kovin, tehničnih kemikalij @sl
preferred label: Provisionshandel med bränsle, malm, metaller och industrikemikalier @sv
preferred label: Yakıtların, maden cevherlerinin, metallerin ve endüstriyel kimyasalların satışı ile ilgili aracılar @tr
broader: Wholesale on a fee or contract basis

Agents involved in the sale of timber and building materials
type: Concept
notation: 46.13
status: valid
status modified: 2013-10-18
accepted date: 2013-10-18
in scheme: Statistical Classification of Economic Activities in the European Community, Rev. 2 (2008)
scope note: N: - velkoobchod na vlastní účet (46.2 až 46.9) - maloobchod prostřednictvím obchodních zástupců mimo prodejny, stánky, trhy (47.99) @cs
scope note: Diese Klasse umfasst nicht: - Großhandel auf eigene Rechnung (s. 46.2 bis. 46.9) - Einzelhandel durch Handelsvertreter nicht in Verkaufsräumen (s. 47.99) @de
scope note: This class excludes: - wholesale trade in own name, see 46.2 to 46.9 - retail sale by non-store commission agents, see 47.99 @en
scope note: Esta clase no comprende: - el comercio al por mayor por cuenta propia (véanse 46.2 a 46.9) - el comercio al por menor por intermediarios no realizada en establecimientos (véase 47.99) @es
scope note: Cette classe ne comprend pas: - le commerce de gros pour compte propre, voir 46.2 à 46.9 - le commerce de détail par des intermédiaires du commerce hors magasin, voir 47.99 @fr
scope note: Ovaj razred isključuje: - trgovinu na veliko za vlastiti račun, vidi 46.2 do 46.9 - trgovinu na malo preko posrednika, vidi 47.99
scope note: Į šią klasę neįeina: - didmeninė prekyba savo vardu, žr. nuo 46.2 iki 46.9 - mažmeninė prekyba ne parduotuvėse per komiso agentus, žr. 47.99 @lt
scope note: Kapsam dışı olanlar; - kendi adına toptan ticaret, bkz. 46.2'den 46.9'a kadar, - mağaza dışında komisyoncular tarafından yapılan perakende satış, bkz. 47.99. @tr
preferred label: Търговско посредничество с дървен материал и материали за строителството @bg
preferred label: Zprostředkování velkoobchodu se dřevem a stavebními materiály @cs
preferred label: Agenturhandel med tømmer og andre byggematerialer @da
preferred label: Handelsvermittlung von Holz, Baustoffen und Anstrichmitteln @de
preferred label: Εμπορικοί αντιπρόσωποι που μεσολαβούν στην πώληση ξυλείας και οικοδομικών υλικών @el
preferred label: Intermediarios del comercio de la madera y materiales de construcción @es
preferred label: Puidu ja ehitusmaterjalide vahendamine @et
preferred label: Puutavaran ja rakennusmateriaalien agentuuritoiminta @fi
preferred label: Intermédiaires du commerce en bois et matériaux de construction @fr
preferred label: Fa-, építési anyag ügynöki nagykereskedelme
preferred label: Intermediari del commercio di legname e materiali da costruzione @it
preferred label: Statybinio miško ir statybinių medžiagų pardavimo agentų veikla @lt
preferred label: Kokmateriālu un būvmateriālu vairumtirdzniecības starpnieku darbība @lv
preferred label: Aġenti involuti fil-bejgħ ta' injam u materjal għall-bini @mt
preferred label: Handelsbemiddeling in hout en bouwmaterialen @nl
preferred label: Agenturhandel med tømmer, trelast og byggevarer @no
preferred label: Działalność agentów zajmujących się sprzedażą drewna i materiałów budowlanych @pl
preferred label: Agentes do comércio por grosso de madeira e materiais de construção @pt
preferred label: Intermedieri în comerţul cu material lemnos şi materiale de construcţii @ro
preferred label: Деятельность агентов по торговле древесиной и строительными материалами @ru
preferred label: Sprostredkovanie obchodu s drevom a stavebným materiálom @sk
preferred label: Posredništvo pri prodaji lesa in gradbenega materiala @sl
preferred label: Provisionshandel med virke och byggmaterial @sv
preferred label: Kereste ve inşaat malzemelerinin satışı ile ilgili aracılar @tr
broader: Wholesale on a fee or contract basis

Agents involved in the sale of machinery, industrial equipment, ships and aircraft
type: Concept
notation: 46.14
status: valid
status modified: 2013-10-18
accepted date: 2013-10-18
in scheme: Statistical Classification of Economic Activities in the European Community, Rev. 2 (2008)
scope note: - търговско посредничество с: • машини (вкл. офис техника, компютри и програмни продукти), промишлено оборудване, кораби и самолети - търговско посредничество с автомобили - 45.1 - продажби на автомобили на търг - 45.1 @bg
scope note: Z: - činnost velkoobchodních zástupců zprostředkujících obchod: • se stroji, včetně kancelářských strojů a počítačů, průmyslovým zařízením, loděmi a letadly N: - zprostředkování velkoobchodu s motorovými vozidly (45.1) - aukce motorových vozidel (45.1) - velkoobchod na vlastní účet (46.2 až 46.9) - maloobchod prostřednictvím obchodních zástupců mimo prodejny, stánky, trhy (47.99) @cs
scope note: Diese Klasse umfasst die Handelsvermittlung von: • Maschinen, einschließlich Büromaschinen und Datenverarbeitungsgeräten, technischem Bedarf, Wasser- und Luftfahrzeugen Diese Klasse umfasst nicht: - Handelsvermittlung von Kraftfahrzeugen (s. 45.1) - Auktionen mit Kraftfahrzeugen (s. 45.1) - Großhandel auf eigene Rechnung (s. 46.2 bis 46.9) - Einzelhandel durch Handelsvertreter nicht in Verkaufsräumen (s. 47.99) @de
scope note: This class includes agents involved in the sale of: • machinery, including office machinery and computers, industrial equipment, ships and aircraft This class excludes: - activities of commission agents for motor vehicles, see 45.1 - auctions of motor vehicles, see 45.1 - wholesale trade in own name, see 46.2 to 46.9 - retail sale by non-store commission agents, see 47.99 @en
scope note: Esta clase comprende intermediarios del comercio de: • maquinaria, incluidos los equipos de oficina y ordenadores, equipos industriales, embarcaciones y aeronaves Esta clase no comprende: - las actividades de intermediarios para vehículos de motor (véase 45.1) - las subastas de vehículos de motor (véase 45.1) - el comercio al por mayor por cuenta propia (véanse 46.2 a 46.9) - el comercio al por menor por intermediarios no realizada en establecimientos (véase 47.99) @es
scope note: Cette classe comprend les intermédiaires du commerce de: • machines, y compris machines de bureau et ordinateurs, équipements industriels, navires et avions Cette classe ne comprend pas: - les activités des intermédiaires du commerce de véhicules automobiles, voir 45.1 - les maisons de vente aux enchères en gros de véhicules automobiles, voir 45.1 - le commerce de gros pour compte propre, voir 46.2 à 46.9 - le commerce de détail par des intermédiaires du commerce hors magasin, voir 47.99 @fr
scope note: Ovaj razred uključuje posredovanje u trgovini: • strojevima, uključujući uredske strojeve i računala, industrijskom opremom, brodovima i zrakoplovima Ovaj razred isključuje: - djelatnosti posredovanja u trgovini motornim vozilima, vidi 45.1 - dražbe motornih vozila, vidi 45.1 - trgovinu na veliko za vlastiti račun, vidi 46.2 do 46.9 - trgovinu na malo preko posrednika, vidi 47.99
scope note: Į šią klasę įeina pardavimo agentų veikla, susijusi su pardavimu: • mašinų, įskaitant įstaigos mašinas ir kompiuterius, pramonės įrangą, laivus ir orlaivius bei žemės ūkio mašinas Į šią klasę neįeina: - variklinių transporto priemonių pardavimo agentų veikla, žr. 45.1 - variklinių transporto priemonių aukcionai, žr. 45.1 - didmeninė prekyba savo vardu, žr.46.2 - 46.9 - mažmeninė prekyba ne parduotuvėse per komiso agentus, žr. 47.99 @lt
scope note: Этот класс включает: - оптовую торговлю зерном - оптовую торговлю масличными фруктами - оптовую торговлю сырьевым табаком - оптовую торговлю кормами для животных и сельскохозяйственным сырьем, не включенных в другие категории Этот класс исключает: - оптовую торговлю текстильным волокном, см. 46.76 @ru
scope note: Bu sınıf aşağıdakilerin satışı ile ilgili aracıları kapsamaktadır: • ofis makineleri ve bilgisayarlar da dahil olmak üzere, makine, sanayi araç ve gereçleri ile deniz ve hava taşıtları Kapsam dışı olanlar; - motorlu taşıtlar için komisyoncularının faaliyetleri, bkz. 45.1, - motorlu taşıtlar müzayedesi, bkz. 45.1, - kendi adına toptan ticaret, bkz. 46.2`den 46.9`a kadar, - mağaza dışında komisyoncular tarafından yapılan perakende satış, bkz. 47.99. @tr
preferred label: Търговско посредничество с машини, промишлено оборудване, кораби и самолети @bg
preferred label: Zprostředkování velkoobchodu se stroji, průmyslovým zařízením, loděmi a letadly @cs
preferred label: Agenturhandel med maskiner, teknisk udstyr, skibe og flyvemaskiner @da
preferred label: Handelsvermittlung von Maschinen, technischem Bedarf, Wasser- und Luftfahrzeugen @de
preferred label: Εμπορικοί αντιπρόσωποι που μεσολαβούν στην πώληση μηχανημάτων, βιομηχανικού εξοπλισμού, πλοίων και αεροσκαφών @el
preferred label: Intermediarios del comercio de maquinaria, equipo industrial, embarcaciones y aeronaves @es
preferred label: Masinate, tööstusseadmete, laevade ja õhusõidukite vahendamine @et
preferred label: Koneiden ja laitteiden agentuuritoiminta @fi
preferred label: Intermédiaires du commerce en machines, équipements industriels, navires et avions @fr
preferred label: Gép, hajó, repülőgép ügynöki nagykereskedelme
preferred label: Intermediari del commercio di macchinari, impianti industriali, navi e aeromobili @it
preferred label: Mašinų, pramonės įrangos, laivų ir lėktuvų pardavimo agentų veikla @lt
preferred label: Mašīnu, rūpniecības iekārtu, kuģu un lidaparātu vairumtirdzniecības starpnieku darbība @lv
preferred label: Aġenti involuti fil-bejgħ ta' makkinarju, tagħmir industrijali, vapuri u inġenji ta' l-ajru @mt
preferred label: Handelsbemiddeling in machines, apparaten en werktuigen voor de industrie en in schepen en luchtvaartuigen @nl
preferred label: Agenturhandel med maskiner, produksjonsutstyr, båter og luftfartøyer @no
preferred label: Działalność agentów zajmujących się sprzedażą maszyn, urządzeń przemysłowych, statków i samolotów @pl
preferred label: Agentes do comércio por grosso de máquinas, equipamento industrial, embarcações e aeronaves @pt
preferred label: Intermedieri în comerţul cu maşini, echipamente industriale, nave şi avioane @ro
preferred label: Деятельность агентов по торговле машинами, оборудованием, промышленным оборудованием, морскими и воздушными судами @ru
preferred label: Sprostredkovanie obchodu so strojmi, priemyselnými zariadeniami, loďami a lietadlami @sk
preferred label: Posredništvo pri prodaji strojev, industrijske opreme, ladij, letal @sl
preferred label: Provisionshandel med maskiner, industriell utrustning, fartyg och luftfartyg @sv
preferred label: Makine, sanayi araç ve gereçleri ile deniz ve hava taşıtlarının satışı ile ilgili aracılar @tr
broader: Wholesale on a fee or contract basis

Agents involved in the sale of furniture, household goods, hardware and ironmongery
type: Concept
notation: 46.15
status: valid
status modified: 2013-10-18
accepted date: 2013-10-18
in scheme: Statistical Classification of Economic Activities in the European Community, Rev. 2 (2008)
scope note: N: - velkoobchod na vlastní účet (46.2 až 46.9) - maloobchod prostřednictvím obchodních zástupců mimo prodejny, stánky, trhy (47.99) @cs
scope note: Diese Klasse umfasst nicht: - Großhandel auf eigene Rechnung (s. 46.2 bis 46.9) - Einzelhandel durch Handelsvertreter nicht in Verkaufsräumen (s. 47.99) @de
scope note: This class excludes: - wholesale trade in own name, see 46.2 to 46.9 - retail sale by non-store commission agents, see 47.99 @en
scope note: Esta clase no comprende: - el comercio al por mayor por cuenta propia (véanse 46.2 a 46.9) - el comercio al por menor por intermediarios no realizada en establecimientos (véase 47.99) @es
scope note: Cette classe ne comprend pas: - le commerce de gros pour compte propre, voir 46.2 à 46.9 - le commerce de détail par des intermédiaires du commerce hors magasin, voir 47.99 @fr
scope note: Ovaj razred isključuje: - trgovinu na veliko za vlastiti račun, vidi 46.2 do 46.9 - trgovinu na malo preko posrednika, vidi 47.99
scope note: Į šią klasę neįeina: - didmeninė prekyba savo vardu, žr. 46.2 - 46.9 - mažmeninė prekyba ne parduotuvėse per komiso agentus, žr. 47.99 @lt
scope note: Этот класс включает: - оптовую торговлю цветами, растениями и луковицами @ru
scope note: Kapsam dışı olanlar; - kendi adına toptan ticaret, bkz. 46.2'den 46.9'a kadar, - mağaza dışında komisyoncular tarafından yapılan perakende satış, bkz. 47.99. @tr
preferred label: Търговско посредничество с мебели, стоки за бита, железария и метални изделия @bg
preferred label: Zprostředkování velkoobchodu s nábytkem, železářským zbožím a potřebami převážně pro domácnost @cs
preferred label: Agenturhandel med møbler, husholdningsartikler og isenkram @da
preferred label: Handelsvermittlung von Möbeln, Einrichtungs- und Haushaltsgegenständen, Eisen- und Metallwaren @de
preferred label: Εμπορικοί αντιπρόσωποι που μεσολαβούν στην πώληση επίπλων, ειδών οικιακής χρήσης, σιδηρικών και ειδών κιγκαλερίας @el
preferred label: Intermediarios del comercio de muebles, artículos para el hogar y ferretería @es
preferred label: Mööbli, kodutarvete ja rauakaupade vahendamine @et
preferred label: Huonekalujen, taloustavaroiden ja rautakauppatavaroiden agentuuritoiminta @fi
preferred label: Intermédiaires du commerce en meubles, articles de ménage et quincaillerie @fr
preferred label: Bútor, háztartási áru, fémáru ügynöki nagykereskedelme
preferred label: Intermediari del commercio di mobili, articoli per la casa e ferramenta @it
preferred label: Baldų, namų ūkio reikmenų, metalo ir geležies dirbinių pardavimo agentų veikla @lt
preferred label: Mēbeļu, mājsaimniecības preču un metālizstrādājumu vairumtirdzniecības starpnieku darbība @lv
preferred label: Aġenti involuti fil-bejgħ ta' għamara, oġġetti għad-dar u ferramenta @mt
preferred label: Handelsbemiddeling in meubelen, huishoudelijke artikelen en ijzerwaren @nl
preferred label: Agenturhandel med møbler, husholdningsvarer og jernvarer @no
preferred label: Działalność agentów zajmujących się sprzedażą mebli, artykułów gospodarstwa domowego i drobnych wyrobów metalowych @pl
preferred label: Agentes do comércio por grosso de mobiliário, artigos para uso doméstico e ferragens @pt
preferred label: Intermedieri în comerţul cu mobilă, articole de menaj şi de fierărie @ro
preferred label: Деятельность агентов по торговле мебелью, бытовыми товарами, скобяными и прочими металлическими изделиями @ru
preferred label: Sprostredkovanie obchodu s nábytkom, tovarom pre domácnosť a železiarskym tovarom @sk
preferred label: Posredništvo pri prodaji pohištva, predmetov in naprav za gospodinjstvo in železnine @sl
preferred label: Provisionshandel med möbler, hushålls- och järnhandelsvaror @sv
preferred label: Mobilya, ev eşyaları, madeni eşyalar ve hırdavatların satışı ile ilgili aracılar @tr
broader: Wholesale on a fee or contract basis

Agents involved in the sale of textiles, clothing, fur, footwear and leather goods
type: Concept
notation: 46.16
status: valid
status modified: 2013-10-18
accepted date: 2013-10-18
in scheme: Statistical Classification of Economic Activities in the European Community, Rev. 2 (2008)
scope note: - търговско посредничество при продажбата на кожухарски кожи @bg
scope note: N: - velkoobchod na vlastní účet (46.2 až 46.9) - maloobchod prostřednictvím obchodních zástupců mimo prodejny, stánky, trhy (47.99) @cs
scope note: Diese Klasse umfasst nicht: - Großhandel auf eigene Rechnung (s. 46.2 bis 46.9) - Einzelhandel durch Handelsvertreter nicht in Verkaufsräumen (s. 47.99) @de
scope note: This class excludes: - wholesale trade in own name, see 46.2 to 46.9 - retail sale by non-store commission agents, see 47.99 @en
scope note: Esta clase no comprende: - el comercio al por mayor por cuenta propia (véanse 46.2 a 46.9) - el comercio al por menor por intermediarios no realizada en establecimientos (véase 47.99) @es
scope note: Cette classe ne comprend pas: - le commerce de gros pour compte propre, voir 46.2 à 46.9 - le commerce de détail par des intermédiaires du commerce hors magasin, voir 47.99 @fr
scope note: Ovaj razred isključuje: - trgovinu na veliko za vlastiti račun, vidi 46.2 do 46.9 - trgovinu na malo preko posrednika, vidi 47.99
scope note: Į šią klasę neįeina: - didmeninė prekyba savo vardu, žr. 46.2 - 46.9 - mažmeninė prekyba ne parduotuvėse per komiso agentus, žr. 47.99 @lt
scope note: Kapsam dışı olanlar; - kendi adına toptan ticaret, bkz. 46.2`den 46.9`a kadar. - mağaza dışında komisyoncular tarafından yapılan perakende satış, bkz. 47.99. @tr
preferred label: Търговско посредничество с текстил, облекло, обувки и кожени изделия @bg
preferred label: Zprostředkování velkoobchodu s textilem, oděvy, kožešinovými výrobky, obuví a koženými výrobky @cs
preferred label: Agenturhandel med tekstiler, beklædning, pelsværk, fodtøj og lædervarer @da
preferred label: Handelsvermittlung von Textilien, Bekleidung, Schuhen und Lederwaren @de
preferred label: Εμπορικοί αντιπρόσωποι που μεσολαβούν στην πώληση κλωστοϋφαντουργικών προϊόντων, ενδυμάτων, γουναρικών, υποδημάτων και δερμάτινων προϊόντων @el
preferred label: Intermediarios del comercio de textiles, prendas de vestir, peletería, calzado y artículos de cuero @es
preferred label: Tekstiili, rõivaste, jalatsite ja nahktoodete vahendamine @et
preferred label: Tekstiilien, vaatteiden, jalkineiden ja nahkavalmisteiden agentuuritoiminta @fi
preferred label: Intermédiaires du commerce en textiles, habillement, fourrures, chaussures et articles en cuir @fr
preferred label: Textil, ruházat, lábbeli, bőráru ügynöki nagykereskedelme
preferred label: Intermediari del commercio di prodotti tessili, abbigliamento, calzature e articoli in pelle @it
preferred label: Tekstilės, drabužių, kailių, avalynės ir odos dirbinių pardavimo agentų veikla @lt
preferred label: Tekstilizstrādājumu, apģērbu, apavu un ādas izstrādājumu vairumtirdzniecības starpnieku darbība @lv
preferred label: Aġenti involuti fil-bejgħ ta' tessuti, ħwejjeġ, xedd tas-saqajn u oġġetti tal-ġilda @mt
preferred label: Handelsbemiddeling in textiel, kleding, bont, schoeisel en lederwaren @nl
preferred label: Agenturhandel med tekstiler, klær, pelsskinn, skotøy og lærvarer @no
preferred label: Działalność agentów zajmujących się sprzedażą wyrobów tekstylnych, odzieży, wyrobów futrzarskich, obuwia i artykułów skórzanych @pl
preferred label: Agentes do comércio por grosso de têxteis, vestuário, calçado e artigos de couro @pt
preferred label: Intermedieri în comerţul cu textile, confecţii din blană, încălţăminte şi articole din piele @ro
preferred label: Деятельность агентов по торговле текстильными изделиями, одеждой, обувью, изделиями из кожи и меха @ru
preferred label: Sprostredkovanie obchodu s textilom, odevmi, kožušinami, obuvou a koženým tovarom @sk
preferred label: Posredništvo pri prodaji tekstila, oblačil, krzna, obutve, usnjenih izdelkov @sl
preferred label: Provisionshandel med textilier, kläder, skodon och lädervaror @sv
preferred label: Tekstil, giysi, kürk, ayakkabı ve deri eşyaların satışı ile ilgili aracılar @tr
broader: Wholesale on a fee or contract basis

Agents involved in the sale of food, beverages and tobacco
type: Concept
notation: 46.17
status: valid
status modified: 2013-10-18
accepted date: 2013-10-18
in scheme: Statistical Classification of Economic Activities in the European Community, Rev. 2 (2008)
scope note: N: - velkoobchod na vlastní účet (46.2 až 46.9) - maloobchod prostřednictvím obchodních zástupců mimo prodejny, stánky, trhy (47.99) @cs
scope note: Diese Klasse umfasst nicht: - Großhandel auf eigene Rechnung (s. 46.2 bis 46.9) - Einzelhandel durch Handelsvertreter nicht in Verkaufsräumen (s. 47.99) @de
scope note: This class excludes: - wholesale trade in own name, see 46.2 to 46.9 - retail sale by non-store commission agents, see 47.99 @en
scope note: Esta clase no comprende: - el comercio al por mayor por cuenta propia (véanse 46.2 a 46.9) - el comercio al por menor por intermediarios no realizada en establecimientos (véase 47.99) @es
scope note: Cette classe ne comprend pas: - le commerce de gros pour compte propre, voir 46.2 à 46.9 - le commerce de détail par des intermédiaires du commerce hors magasin, voir 47.99 @fr
scope note: Ovaj razred isključuje: - trgovinu na veliko za vlastiti račun, vidi 46.2 do 46.9 - trgovinu na malo preko posrednika, vidi 47.99
scope note: Į šią klasę neįeina: - didmeninė prekyba savo vardu, žr. 46.2 - 46.9 - mažmeninė prekyba ne parduotuvėse per komiso agentus, žr. 47.99 @lt
scope note: Kapsam dışı olanlar; - kendi adına toptan ticaret, bkz. 46.2'den 46.9'a kadar, - mağaza dışında komisyoncular tarafından yapılan perakende satış, bkz. 47.99. @tr
preferred label: Търговско посредничество с хранителни стоки, напитки и тютюневи изделия @bg
preferred label: Zprostředkování velkoobchodu s potravinami, nápoji, tabákem a tabákovými výrobky @cs
preferred label: Agenturhandel med føde-, drikke- og tobaksvarer @da
preferred label: Handelsvermittlung von Nahrungsmitteln, Getränken und Tabakwaren @de
preferred label: Εμπορικοί αντιπρόσωποι που μεσολαβούν στην πώληση τροφίμων, ποτών και καπνού @el
preferred label: Intermediarios del comercio de productos alimenticios, bebidas y tabaco @es
preferred label: Toidukaupade, jookide ja tubakatoodete vahendamine @et
preferred label: Elintarvikkeiden, juomien ja tupakan agentuuritoiminta @fi
preferred label: Intermédiaires du commerce en denrées, boissons et tabac @fr
preferred label: Élelmiszer, ital, dohányáru ügynöki nagykereskedelme
preferred label: Intermediari del commercio di prodotti alimentari, bevande e tabacco @it
preferred label: Maisto produktų, gėrimų ir tabako pardavimo agentų veikla @lt
preferred label: Pārtikas, dzērienu un tabakas vairumtirdzniecības starpnieku darbība @lv
preferred label: Aġenti involuti fil-bejgħ ta' ikel, xorb u tabakk @mt
preferred label: Handelsbemiddeling in voedings- en genotmiddelen @nl
preferred label: Agenturhandel med nærings- og nytelsesmidler @no
preferred label: Działalność agentów zajmujących się sprzedażą żywności, napojów i wyrobów tytoniowych @pl
preferred label: Agentes do comércio por grosso de produtos alimentares, bebidas e tabaco @pt
preferred label: Intermedieri în comerţul cu produse alimentare, băuturi şi tutun @ro
preferred label: Деятельность агентов по торговле пищевыми продуктами, включая напитки, и табачными изделиями @ru
preferred label: Sprostredkovanie obchodu s potravinami, nápojmi a tabakom @sk
preferred label: Posredništvo pri prodaji živil, pijač, tobačnih izdelkov @sl
preferred label: Provisionshandel med livsmedel, drycker och tobak @sv
preferred label: Gıda, içecek ve tütün satışı ile ilgili aracılar @tr
broader: Wholesale on a fee or contract basis

Agents specialised in the sale of other particular products
type: Concept
notation: 46.18
status: valid
status modified: 2013-10-18
accepted date: 2013-10-18
in scheme: Statistical Classification of Economic Activities in the European Community, Rev. 2 (2008)
scope note: - търговско посредничество с велосипеди, части и принадлежности за тях - търговско посредничество с часовници и бижутерия - търговско посредничество с коригиращи и защитни очила, контактни лещи, рамки за очила - търговско посредничество с фотографски п - дейности на застрахователни агенти - 66.22 - посредническа дейност при покупка и продажба на недвижими имоти - 68.31 @bg
scope note: N: - velkoobchod na vlastní účet (46.2 až 46.9) - maloobchod prostřednictvím obchodních zástupců mimo prodejny, stánky, trhy (47.99) - činnosti pojišťovacích agentů (66.22) - činnosti realitních makléřů (68.31) @cs
scope note: Diese Klasse umfasst nicht: - Großhandel auf eigene Rechnung (s. 46.2 bis 46.9) - Einzelhandel durch Handelsvertreter nicht in Verkaufsräumen (s. 47.99) - Tätigkeiten von Versicherungsagenten (s. 66.22) - Tätigkeiten von Immobilienmaklern (s. 68.31) @de
scope note: This class excludes: - wholesale trade in own name, see 46.2 to 46.9 - retail sale by non-store commission agents, see 47.99 - activities of insurance agents, see 66.22 - activities of real estate agents, see 68.31 @en
scope note: Esta clase no comprende: - el comercio al por mayor por cuenta propia (véanse 46.2 a 46.9) - el comercio al por menor por intermediarios no realizada en establecimientos (véase 47.99) - las actividades de agentes de seguros (véase 66.22) - las actividades de los agentes de la propiedad inmobiliaria (véase 68.31) @es
scope note: Cette classe ne comprend pas: - le commerce de gros pour compte propre, voir 46.2 à 46.9 - le commerce de détail par des intermédiaires du commerce hors magasin, voir 47.99 - les activités des agents d’assurances, voir 66.22 - les activités des agents immobiliers, voir 68.31 @fr
scope note: Ovaj razred isključuje: - trgovinu na veliko za vlastiti račun, vidi 46.2 do 46.9 - trgovinu na malo preko posrednika, vidi 47.99 - djelatnosti agenata osiguranja, vidi 66.22 - djelatnosti agenata za nekretnine, vidi 68.31
scope note: Į šią klasę neįeina: - didmeninė prekyba savo vardu, žr. 46.2 - 46.9 - mažmeninė prekyba ne parduotuvėse per komiso agentus, žr. 47.99 - draudimo agentų veikla, žr. 66.22 - nekilnojamojo turto agentų veikla, žr. 68.31 @lt
scope note: Kapsam dışı olanlar; - kendi adına toptan ticaret, bkz. 46.2`den 46.9`a kadar, - mağaza dışında komisyoncular tarafından yapılan perakende satış, bkz. 47.99, - sigorta acentelerinin faaliyetleri, bkz. 66.22, - emlakçıların faaliyetleri, bkz. 68.31. @tr
preferred label: Специализирано търговско посредничество с други групи стоки @bg
preferred label: Zprostředkování specializované na velkoobchod s ostatním zbožím @cs
preferred label: Agenturhandel med specialiseret varesortiment i.a.n. @da
preferred label: Handelsvermittlung von sonstigen Waren @de
preferred label: Εμπορικοί αντιπρόσωποι ειδικευμένοι στην πώληση άλλων συγκεκριμένων προϊόντων @el
preferred label: Intermediarios del comercio especializados en la venta de otros productos específicos @es
preferred label: Muude kindlate kaupade vahendamine @et
preferred label: Muu erikoistunut agentuuritoiminta @fi
preferred label: Intermédiaires spécialisés dans le commerce d'autres produits spécifiques @fr
preferred label: Egyéb termék ügynöki nagykereskedelme
preferred label: Intermediari specializzati nel commercio di altri prodotti particolari @it
preferred label: Kitų specifinių produktų pardavimo agentų specializuota veikla @lt
preferred label: Cita veida īpašu preču vairumtirdzniecības starpnieku darbība @lv
preferred label: Aġenti li jispeċjalizzaw fil-bejgħ bl-ingrossa ta' prodotti oħra @mt
preferred label: Handelsbemiddeling gespecialiseerd in andere goederen @nl
preferred label: Agenturhandel med spesialisert vareutvalg ellers @no
preferred label: Działalność agentów specjalizujących się w sprzedaży pozostałych określonych towarów @pl
preferred label: Agentes especializados do comércio por grosso de outros produtos @pt
preferred label: Intermedieri în comerţul specializat în vânzarea produselor cu caracter specific, n.c.a. @ro
preferred label: Деятельность агентов, специализирующихся на торговле отдельными видами товаров @ru
preferred label: Špecializované sprostredkovanie obchodu s iným špecifickým tovarom @sk
preferred label: Specializirano posredništvo pri prodaji drugih določenih izdelkov @sl
preferred label: Provisionshandel med annat specialsortiment @sv
preferred label: Belirli diğer ürünlerin satışı ile ilgili uzmanlaşmış aracılar @tr
broader: Wholesale on a fee or contract basis

Agents involved in the sale of a variety of goods
type: Concept
notation: 46.19
status: valid
status modified: 2013-10-18
accepted date: 2013-10-18
in scheme: Statistical Classification of Economic Activities in the European Community, Rev. 2 (2008)
scope note: N: - velkoobchod na vlastní účet (46.2 až 46.9) - maloobchod prostřednictvím obchodních zástupců mimo prodejny, stánky, trhy (47.99) @cs
scope note: Diese Klasse umfasst nicht: - Großhandel auf eigene Rechnung (s. 46.2 bis 46.9) - Einzelhandel durch Handelsvertreter nicht in Verkaufsräumen (s. 47.99) @de
scope note: This class excludes: - wholesale trade in own name, see 46.2 to 46.9 - retail sale by non-store commission agents, see 47.99 @en
scope note: Esta clase no comprende: - el comercio al por mayor por cuenta propia (véanse 46.2 a 46.9) - el comercio al por menor por intermediarios no realizada en establecimientos (véase 47.99) @es
scope note: Cette classe ne comprend pas: - le commerce de gros pour compte propre, voir 46.2 à 46.9 - le commerce de détail par des intermédiaires du commerce hors magasin, voir 47.99 @fr
scope note: Ovaj razred isključuje: - trgovinu na veliko za vlastiti račun, vidi 46.2 do 46.9 - trgovinu na malo preko posrednika, vidi 47.99
scope note: Į šią klasę neįeina: - didmeninė prekyba savo vardu, žr. 46.2 - 46.9 - mažmeninė prekyba ne parduotuvėse per komiso agentus, žr. 47.99 @lt
scope note: Этот класс включает: - оптовую торговлю свежими фруктами и овощами - оптовую торговлю консервированными фруктами и овощами @ru
scope note: Kapsam dışı olanlar; - kendi adına toptan ticaret, bkz. 46.2'den 46.9'a kadar, - mağaza dışında komisyoncular tarafından yapılan perakende satış, bkz. 47.99. @tr
preferred label: Неспециализирано търговско посредничество с разнообразни стоки @bg
preferred label: Zprostředkování nespecializovaného velkoobchodu @cs
preferred label: Agenturhandel med blandet sortiment @da
preferred label: Handelsvermittlung von Waren ohne ausgeprägten Schwerpunkt @de
preferred label: Εμπορικοί αντιπρόσωποι που μεσολαβούν στην πώληση διαφόρων ειδών @el
preferred label: Intermediarios del comercio de productos diversos @es
preferred label: Mitmesuguste erinevate kaupade vahendamine @et
preferred label: Yleisagentuuritoiminta @fi
preferred label: Intermédiaires du commerce en produits divers @fr
preferred label: Vegyes termékkörű ügynöki nagykereskedelem
preferred label: Intermediari del commercio di vari prodotti senza prevalenza di alcuno @it
preferred label: Įvairių prekių pardavimo agentų veikla @lt
preferred label: Plaša sortimenta preču vairumtirdzniecības starpnieku darbība @lv
preferred label: Aġenti involuti fil-bejgħ ta' varjetà ta' oġġetti @mt
preferred label: Handelsbemiddeling in goederen, algemeen assortiment @nl
preferred label: Agenturhandel med bredt vareutvalg @no
preferred label: Działalność agentów zajmujących się sprzedażą towarów różnego rodzaju @pl
preferred label: Agentes do comércio por grosso misto sem predominância @pt
preferred label: Intermedieri în comerţul cu produse diverse @ro
preferred label: Деятельность агентов по торговле товарами широкого ассортимента @ru
preferred label: Sprostredkovanie obchodu s rozličným tovarom @sk
preferred label: Nespecializirano posredništvo pri prodaji raznovrstnih izdelkov @sl
preferred label: Provisionshandel med blandat sortiment @sv
preferred label: Çeşitli malların satışı ile ilgili aracılar @tr
broader: Wholesale on a fee or contract basis

Wholesale of agricultural raw materials and live animals
type: Concept
notation: 46.2
status: valid
status modified: 2013-10-18
accepted date: 2013-10-18
in scheme: Statistical Classification of Economic Activities in the European Community, Rev. 2 (2008)
preferred label: Tърговия на едро със селскостопански суровини и живи животни @bg
preferred label: Velkoobchod se základními zemědělskými produkty a živými zvířaty @cs
preferred label: Engroshandel med landbrugsråvarer og levende dyr @da
preferred label: Großhandel mit landwirtschaftlichen Grundstoffen und lebenden Tieren @de
preferred label: Χονδρικό εμπόριο ακατέργαστων γεωργικών πρώτων υλών και ζώντων ζώων @el
preferred label: Comercio al por mayor de materias primas agrarias y de animales vivos @es
preferred label: Põllumajandustoorme ja elusloomade hulgimüük @et
preferred label: Maatalousperäisten raaka-aineiden ja elävien eläinten tukkukauppa @fi
preferred label: Commerce de gros de produits agricoles bruts et d'animaux vivants @fr
preferred label: Mezőgazdasági nyersanyag, élőállat nagykereskedelme
preferred label: Commercio all'ingrosso di materie prime agricole e animali vivi @it
preferred label: Žemės ūkio žaliavų ir gyvų gyvulių didmeninė prekyba @lt
preferred label: Lauksaimniecības izejvielu un dzīvu lopu vairumtirdzniecība @lv
preferred label: Bejgħ bl-ingrossa ta' materja prima agrikola u annimali ħajja @mt
preferred label: Groothandel in landbouwproducten en levende dieren @nl
preferred label: Engroshandel med jordbruksråvarer og levende dyr @no
preferred label: Sprzedaż hurtowa płodów rolnych i żywych zwierząt @pl
preferred label: Comércio por grosso de produtos agrícolas brutos e animais vivos @pt
preferred label: Comerţ cu ridicata al produselor agricole brute şi al animalelor vii @ro
preferred label: Оптовая торговля сельскохозяйственным сырьем и живыми животными @ru
preferred label: Veľkoobchod s poľnohospodárskymi surovinami a živými zvieratami @sk
preferred label: Trgovina na debelo s kmetijskimi surovinami in živimi živalmi @sl
preferred label: Partihandel med jordbruksråvaror och levande djur @sv
preferred label: Tarımsal hammadde ve canlı hayvanların toptan ticareti @tr
broader: Wholesale trade, except of motor vehicles and motorcycles
narrower: Wholesale of grain, unmanufactured tobacco, seeds and animal feeds
narrower: Wholesale of flowers and plants
narrower: Wholesale of live animals
narrower: Wholesale of hides, skins and leather

Wholesale of grain, unmanufactured tobacco, seeds and animal feeds
type: Concept
notation: 46.21
status: valid
status modified: 2013-10-18
accepted date: 2013-10-18
in scheme: Statistical Classification of Economic Activities in the European Community, Rev. 2 (2008)
scope note: - търговия на едро със зърно и семена - търговия на едро с маслодайни семена и плодове - търговия на едро със суров и първично обработен тютюн - търговия на едро с храни за животни и селскостопански суровини - търговия на едро с растителни текстилни влакна - 46.76 @bg
scope note: Z: - velkoobchod s obilím a osivy - velkoobchod s olejninami - velkoobchod se surovým tabákem - velkoobchod s krmivy a základními zemědělskými surovinami j. n. N: - velkoobchod s textilními vlákny (46.76) @cs
scope note: Diese Klasse umfasst: - Großhandel mit Getreide und Saatgut - Großhandel mit Ölfrüchten - Großhandel mit Rohtabak - Großhandel mit Futtermitteln und landwirtschaftlichen Grundstoffen a. n. g. Diese Klasse umfasst nicht: - Großhandel mit Textilfasern (s. 46.76) @de
scope note: This class includes: - wholesale of grains and seeds - wholesale of oleaginous fruits - wholesale of unmanufactured tobacco - wholesale of animal feeds and agricultural raw material n.e.c. This class excludes: - wholesale of textile fibres, see 46.76 @en
scope note: Esta clase comprende: - comercio al por mayor de cereales y semillas - el comercio al por mayor de frutos oleaginosos - el comercio al por mayor de tabaco sin elaborar - el comercio al por mayor de alimentos para animales y de materias primas agrarias n.c.o.p. Esta clase no comprende: - el comercio al por mayor de fibras textiles (véase 46.76) @es
scope note: Cette classe comprend: - le commerce de gros de céréales et de semences - le commerce de gros de fruits oléagineux - le commerce de gros de tabac non manufacturé - le commerce de gros d’aliments pour animaux et d’autres matières premières agricoles Cette classe ne comprend pas: - le commerce de gros de fibres textiles, voir 46.76 @fr
scope note: Ovaj razred uključuje: - trgovinu na veliko žitaricama i sjemenjem - trgovinu na veliko uljanim plodovima - trgovinu na veliko sirovim duhanom - trgovinu na veliko stočnom hranom i poljoprivrednim sirovinama, d. n. Ovaj razred isključuje: - trgovinu na veliko tekstilnim vlaknima, vidi 46.76
scope note: Į šią klasę įeina: - grūdų ir sėklų didmeninė prekyba - aliejingųjų vaisių ir uogų didmeninė prekyba - neapdirbto tabako didmeninė prekyba - pašarų gyvuliams ir žemės ūkio žaliavų didmeninė prekyba Į šią klasę neįeina: - tekstilės pluoštų didmeninė prekyba, žr. 46.76 @lt
scope note: Этот класс включает: - оптовую торговлю молочной продукцией - оптовую торговлю яйцами и яичной продукцией - оптовую торговлю животными и растительными пищевыми маслами и жирами @ru
scope note: Bu sınıf aşağıdakileri kapsamaktadır; - tahılların ve tohumların toptan ticareti, - yağlı tohumların toptan ticareti, - işlenmemiş tütünün toptan ticareti, - hayvan yemlerinin ve başka yerde sınıflandırılmamış tarımsal ham maddelerin toptan ticareti. Kapsam dışı olanlar; - tekstil elyafı toptan ticareti, bkz. 46.76. @tr
preferred label: Търговия на едро със зърно, семена, фуражи и необработен тютюн @bg
preferred label: Velkoobchod s obilím, surovým tabákem, osivy a krmivy @cs
preferred label: Engroshandel med korn, uforarbejdet tobak, såsæd og foderstoffer @da
preferred label: Großhandel mit Getreide, Rohtabak, Saatgut und Futtermitteln @de
preferred label: Χονδρικό εμπόριο σιτηρών, ακατέργαστου καπνού, σπόρων και ζωοτροφών @el
preferred label: Comercio al por mayor de cereales, tabaco en rama, simientes y alimentos para animales @es
preferred label: Teravilja, töötlemata tubaka, seemnete ja loomasööda hulgimüük @et
preferred label: Viljan, raakatupakan, siementen ja eläinrehujen tukkukauppa @fi
preferred label: Commerce de gros de céréales, de tabac non manufacturé, de semences et d'aliments pour le bétail @fr
preferred label: Gabona-, dohány-, vetőmag-, takarmány-nagykereskedelme
preferred label: Commercio all'ingrosso di cereali, tabacco grezzo, sementi e alimenti per il bestiame @it
preferred label: Grūdų, neperdirbto tabako, sėklų ir pašarų gyvuliams didmeninė prekyba @lt
preferred label: Graudu, sēklu, neapstrādātas tabakas un lopbarības vairumtirdzniecība @lv
preferred label: Bejgħ bl-ingrossa ta' qmugħ, tabakk mhux maħdum, żrieragħ u għalf ta' l-annimali @mt
preferred label: Groothandel in granen, ruwe tabak, zaden en diervoeders @nl
preferred label: Engroshandel med korn, råtobakk, såvarer og fôrvarer @no
preferred label: Sprzedaż hurtowa zboża, nieprzetworzonego tytoniu, nasion i pasz dla zwierząt @pl
preferred label: Comércio por grosso de cereais, tabaco em bruto, sementes e alimentos para animais @pt
preferred label: Comerţ cu ridicata al cerealelor, seminţelor, furajelor şi tutunului neprelucrat @ro
preferred label: Оптовая торговля зерном, необработанным табаком, семенами и кормами для животных @ru
preferred label: Veľkoobchod s obilím, nespracovaným tabakom, semenami a krmivom @sk
preferred label: Trgovina na debelo z žiti, tobakom, semeni in krmo @sl
preferred label: Partihandel med spannmål, råtobak, utsäde och djurfoder @sv
preferred label: Tahıl, işlenmemiş tütün, tohum ve hayvan yemi toptan ticareti @tr
broader: Wholesale of agricultural raw materials and live animals

Wholesale of flowers and plants
type: Concept
notation: 46.22
status: valid
status modified: 2013-10-18
accepted date: 2013-10-18
in scheme: Statistical Classification of Economic Activities in the European Community, Rev. 2 (2008)
scope note: - търговия на едро с луковици, грудки, грудести корени и друг посадъчен материал за цветя @bg
scope note: Z: - velkoobchod s květinami a jinými rostlinami, jejich cibulkami a hlízami @cs
scope note: Diese Klasse umfasst: - Großhandel mit Blumen, Pflanzen und Blumenzwiebeln @de
scope note: This class includes: - wholesale of flowers, plants and bulbs @en
scope note: Esta clase comprende: - el comercio al por mayor de flores, plantas y bulbos @es
scope note: Cette classe comprend: - le commerce de gros de fleurs, plantes et bulbes @fr
scope note: Ovaj razred uključuje: - trgovinu na veliko cvijećem, sadnicama i lukovicama
scope note: Į šią klasę įeina: - gėlių, sodinukų ir svogūnėlių didmeninė prekyba @lt
scope note: Этот класс включает: - оптовую торговлю алкогольными напитками - оптовую торговлю безалкогольными напитками Этот класс также включает: - покупку вина крупными партиями и расфасовку в бутылки без преобразований Этот класс исключает: - смешивание вина или дистиллированного спирта, см. 11.01, 11.02 @ru
scope note: Bu sınıf aşağıdakileri kapsamaktadır; - çiçeklerin, bitkilerin ve çiçek soğanlarının toptan ticareti. @tr
preferred label: Търговия на едро с цветя и растения @bg
preferred label: Velkoobchod s květinami a jinými rostlinami @cs
preferred label: Engroshandel med blomster og planter @da
preferred label: Großhandel mit Blumen und Pflanzen @de
preferred label: Χονδρικό εμπόριο λουλουδιών και φυτών @el
preferred label: Comercio al por mayor de flores y plantas @es
preferred label: Lillede ja taimede hulgimüük @et
preferred label: Kukkien ja taimien tukkukauppa @fi
preferred label: Commerce de gros de fleurs et plantes @fr
preferred label: Dísznövény nagykereskedelme
preferred label: Commercio all'ingrosso di fiori e piante @it
preferred label: Gėlių ir sodinukų didmeninė prekyba @lt
preferred label: Ziedu un augu vairumtirdzniecība @lv
preferred label: Bejgħ bl-ingrossa ta' fjuri u pjanti @mt
preferred label: Groothandel in bloemen en planten @nl
preferred label: Sprzedaż hurtowa kwiatów i roślin @pl
preferred label: Comércio por grosso de flores e plantas @pt
preferred label: Comerţ cu ridicata al florilor şi al plantelor @ro
preferred label: Оптовая торговля цветами и другими растениями @ru
preferred label: Veľkoobchod s kvetmi a rastlinami @sk
preferred label: Trgovina na debelo s cvetjem in rastlinami @sl
preferred label: Partihandel med blommor och växter @sv
preferred label: Çiçeklerin ve bitkilerin toptan ticareti @tr
broader: Wholesale of agricultural raw materials and live animals

Wholesale of live animals
type: Concept
notation: 46.23
status: valid
status modified: 2013-10-18
accepted date: 2013-10-18
in scheme: Statistical Classification of Economic Activities in the European Community, Rev. 2 (2008)
preferred label: Търговия на едро с живи животни @bg
preferred label: Velkoobchod se živými zvířaty @cs
preferred label: Engroshandel med levende dyr @da
preferred label: Großhandel mit lebenden Tieren @de
preferred label: Χονδρικό εμπόριο ζώντων ζώων @el
preferred label: Comercio al por mayor de animales vivos @es
preferred label: Elusloomade hulgimüük @et
preferred label: Elävien eläinten tukkukauppa @fi
preferred label: Commerce de gros d'animaux vivants @fr
preferred label: Élőállat nagykereskedelme
preferred label: Commercio all'ingrosso di animali vivi @it
preferred label: Gyvų gyvulių didmeninė prekyba @lt
preferred label: Dzīvu lopu vairumtirdzniecība @lv
preferred label: Bejgħ bl-ingrossa ta' annimali ħajja @mt
preferred label: Groothandel in levende dieren @nl
preferred label: Sprzedaż hurtowa żywych zwierząt @pl
preferred label: Comércio por grosso de animais vivos @pt
preferred label: Comerţ cu ridicata al animalelor vii @ro
preferred label: Оптовая торговля живыми животными @ru
preferred label: Veľkoobchod so živými zvieratami @sk
preferred label: Trgovina na debelo z živimi živalmi @sl
preferred label: Partihandel med levande djur @sv
preferred label: Canlı hayvanların toptan ticareti @tr
broader: Wholesale of agricultural raw materials and live animals

Wholesale of hides, skins and leather
type: Concept
notation: 46.24
status: valid
status modified: 2013-10-18
accepted date: 2013-10-18
in scheme: Statistical Classification of Economic Activities in the European Community, Rev. 2 (2008)
scope note: Этот класс включает: - оптовую торговлю сахаром, шоколадом и кондитерскими изделиями - оптовую торговлю хлебобулочной продукцией @ru
preferred label: Търговия на едро със сурови и обработени кожи @bg
preferred label: Velkoobchod se surovými kůžemi, kožešinami a usněmi @cs
preferred label: Engroshandel med huder, skind og læder @da
preferred label: Großhandel mit Häuten, Fellen und Leder @de
preferred label: Χονδρικό εμπόριο δερμάτων, προβιών και κατεργασμένου δέρματος @el
preferred label: Comercio al por mayor de cueros y pieles @es
preferred label: Toor- ja parknaha hulgimüük @et
preferred label: Turkisten ja nahkojen tukkukauppa @fi
preferred label: Commerce de gros de cuirs et peaux @fr
preferred label: Bőr nagykereskedelme
preferred label: Commercio all'ingrosso di pelli e cuoio @it
preferred label: Kailių ir odų didmeninė prekyba @lt
preferred label: Jēlādu un izstrādātu ādu vairumtirdzniecība @lv
preferred label: Bejgħ bl-ingrossa ta' ġlud @mt
preferred label: Groothandel in huiden, vellen en leer @nl
preferred label: Engroshandel med huder, skinn og lær @no
preferred label: Sprzedaż hurtowa skór @pl
preferred label: Comércio por grosso de peles e couro @pt
preferred label: Comerţ cu ridicata al blănurilor, pieilor brute şi al pieilor prelucrate @ro
preferred label: Оптовая торговля шкурами и кожей @ru
preferred label: Veľkoobchod s kožou, kožušinou a opracovanou kožou @sk
preferred label: Trgovina na debelo s kožami, usnjem @sl
preferred label: Partihandel med hudar, skinn och läder @sv
preferred label: Ham deri, post ve deri toptan ticareti @tr
broader: Wholesale of agricultural raw materials and live animals

Wholesale of food, beverages and tobacco
type: Concept
notation: 46.3
status: valid
status modified: 2013-10-18
accepted date: 2013-10-18
in scheme: Statistical Classification of Economic Activities in the European Community, Rev. 2 (2008)
preferred label: Търговия на едро с хранителни стоки, напитки и тютюневи изделия @bg
preferred label: Velkoobchod s potravinami, nápoji a tabákovými výrobky @cs
preferred label: Engroshandel med føde-, drikke- og tobaksvarer @da
preferred label: Großhandel mit Nahrungs- und Genussmitteln, Getränken und Tabakwaren @de
preferred label: Χονδρικό εμπόριο τροφίμων, ποτών και καπνού @el
preferred label: Comercio al por mayor de productos alimenticios, bebidas y tabaco @es
preferred label: Toidukaupade, jookide ja tubakatoodete hulgimüük @et
preferred label: Elintarvikkeiden, juomien ja tupakan tukkukauppa @fi
preferred label: Commerce de gros de produits alimentaires, de boissons et de tabac @fr
preferred label: Élelmiszer, ital, dohányáru nagykereskedelme
preferred label: Commercio all'ingrosso di prodotti alimentari, bevande e tabacco @it
preferred label: Maisto produktų, gėrimų, tabako ir jo gaminių didmeninė prekyba @lt
preferred label: Pārtikas, dzērienu un tabakas izstrādājumu vairumtirdzniecība @lv
preferred label: Bejgħ bl-ingrossa ta' ikel, xorb u tabakk @mt
preferred label: Groothandel in voedings- en genotmiddelen @nl
preferred label: Engroshandel med nærings- og nytelsesmidler @no
preferred label: Sprzedaż hurtowa żywności, napojów i wyrobów tytoniowych @pl
preferred label: Comércio por grosso de produtos alimentares, bebidas e tabaco @pt
preferred label: Comerţ cu ridicata al produselor alimentare, al băuturilor şi al tutunului @ro
preferred label: Оптовая торговля продуктами питания, напитками и табачными изделиями @ru
preferred label: Veľkoobchod s potravinami, nápojmi a tabakom @sk
preferred label: Trgovina na debelo z živili, pijačami, tobačnimi izdelki @sl
preferred label: Partihandel med livsmedel, drycker och tobak @sv
preferred label: Gıda, içecek ve tütün toptan ticareti @tr
broader: Wholesale trade, except of motor vehicles and motorcycles
narrower: Wholesale of fruit and vegetables
narrower: Wholesale of meat and meat products
narrower: Wholesale of dairy products, eggs and edible oils and fats
narrower: Wholesale of beverages
narrower: Wholesale of tobacco products
narrower: Wholesale of sugar and chocolate and sugar confectionery
narrower: Wholesale of coffee, tea, cocoa and spices
narrower: Wholesale of other food, including fish, crustaceans and molluscs
narrower: Non-specialised wholesale of food, beverages and tobacco

Wholesale of fruit and vegetables
type: Concept
notation: 46.31
status: valid
status modified: 2013-10-18
accepted date: 2013-10-18
in scheme: Statistical Classification of Economic Activities in the European Community, Rev. 2 (2008)
scope note: - търговия на едро c пресни плодове и зеленчуци, вкл. картофи - търговия на едро c консервирани плодове и зеленчуци - търговия на едро c култивирани гъби и билки @bg
scope note: Z: - velkoobchod s čerstvým ovocem a zeleninou - velkoobchod s konzervovaným ovocem a zeleninou @cs
scope note: Diese Klasse umfasst: - Großhandel mit frischem Obst und Gemüse und frischen Kartoffeln - Großhandel mit haltbar gemachtem Obst und Gemüse und haltbar gemachten Kartoffeln @de
scope note: This class includes: - wholesale of fresh fruits and vegetables - wholesale of preserved fruits and vegetables @en
scope note: Esta clase comprende: - el comercio al por mayor de frutas y hortalizas frescas - el comercio al por mayor de frutas y hortalizas en conserva @es
scope note: Cette classe comprend: - le commerce de gros de fruits et légumes frais - le commerce de gros de fruits et légumes en conserve @fr
scope note: Ovaj razred uključuje: - trgovinu na veliko svježim voćem i povrćem - trgovinu na veliko konzerviranim voćem i povrćem
scope note: Į šią klasę įeina: - šviežių vaisių, uogų ir daržovių didmeninė prekyba - paruoštų ir konservuotų vaisių, uogų ir daržovių didmeninė prekyba @lt
scope note: Этот класс также включает: - оптовую торговлю кормами для домашних животных @ru
scope note: Bu sınıf aşağıdakileri kapsamaktadır; - meyve ve sebzelerin toptan ticareti, - konserve meyve ve sebzelerin toptan ticareti. @tr
preferred label: Търговия на едро с плодове и зеленчуци @bg
preferred label: Velkoobchod s ovocem a zeleninou @cs
preferred label: Engroshandel med frugt og grøntsager @da
preferred label: Großhandel mit Obst, Gemüse und Kartoffeln @de
preferred label: Χονδρικό εμπόριο φρούτων και λαχανικών @el
preferred label: Comercio al por mayor de frutas y hortalizas @es
preferred label: Puu- ja köögivilja hulgimüük @et
preferred label: Juures-, vihannes- marja- ja hedelmätukkukauppa @fi
preferred label: Commerce de gros de fruits et légumes @fr
preferred label: Zöldség-, gyümölcs-nagykereskedelem
preferred label: Commercio all'ingrosso di frutta e ortaggi @it
preferred label: Vaisių, uogų ir daržovių didmeninė prekyba @lt
preferred label: Augļu un dārzeņu vairumtirdzniecība @lv
preferred label: Bejgħ bl-ingrossa ta' frott u ħxejjex @mt
preferred label: Groothandel in groenten en fruit @nl
preferred label: Engroshandel med frukt og grønnsaker @no
preferred label: Sprzedaż hurtowa owoców i warzyw @pl
preferred label: Comércio por grosso de fruta e de produtos hortícolas @pt
preferred label: Comerţ cu ridicata al fructelor şi legumelor @ro
preferred label: Оптовая торговля фруктами и овощами @ru
preferred label: Veľkoobchod s ovocím a zeleninou @sk
preferred label: Trgovina na debelo s sadjem in zelenjavo @sl
preferred label: Partihandel med frukt och grönsaker @sv
preferred label: Meyve ve sebzelerin toptan ticareti @tr
broader: Wholesale of food, beverages and tobacco

Wholesale of meat and meat products
type: Concept
notation: 46.32
status: valid
status modified: 2013-10-18
accepted date: 2013-10-18
in scheme: Statistical Classification of Economic Activities in the European Community, Rev. 2 (2008)
scope note: - търговия на едро с месо, вкл. дивечово и птиче, месни продукти и консерви @bg
preferred label: Търговия на едро с месо и месни продукти @bg
preferred label: Velkoobchod s masem a masnými výrobky @cs
preferred label: Engroshandel med kød og kødprodukter @da
preferred label: Großhandel mit Fleisch und Fleischwaren @de
preferred label: Χονδρικό εμπόριο κρέατος και προϊόντων κρέατος @el
preferred label: Comercio al por mayor de carne y productos cárnicos @es
preferred label: Liha ja lihatoodete hulgimüük @et
preferred label: Lihan ja lihatuotteiden tukkukauppa @fi
preferred label: Commerce de gros de viandes et de produits à base de viande @fr
preferred label: Hús-, húskészítmény nagykereskedelme
preferred label: Commercio all'ingrosso di carni e di prodotti a base di carne @it
preferred label: Mėsos ir mėsos produktų didmeninė prekyba @lt
preferred label: Gaļas un gaļas produktu vairumtirdzniecība @lv
preferred label: Bejgħ bl-ingrossa ta' laħam u prodotti tal-laħam @mt
preferred label: Groothandel in vlees en vleesproducten @nl
preferred label: Engroshandel med kjøtt og kjøttvarer @no
preferred label: Sprzedaż hurtowa mięsa i wyrobów z mięsa @pl
preferred label: Comércio por grosso de carne e produtos à base de carne @pt
preferred label: Comerţ cu ridicata al cărnii şi produselor din carne @ro
preferred label: Оптовая торговля мясом и мясными продуктами @ru
preferred label: Veľkoobchod s mäsom a mäsovými výrobkami @sk
preferred label: Trgovina na debelo z mesom in mesnimi izdelki @sl
preferred label: Partihandel med kött och köttvaror @sv
preferred label: Et ve et ürünlerinin toptan ticareti @tr
broader: Wholesale of food, beverages and tobacco

Wholesale of dairy products, eggs and edible oils and fats
type: Concept
notation: 46.33
status: valid
status modified: 2013-10-18
accepted date: 2013-10-18
in scheme: Statistical Classification of Economic Activities in the European Community, Rev. 2 (2008)
scope note: - търговия на едро с мляко и млечни продукти - търговия на едро с яйца - търговия на едро с хранителни масла и мазнини от растителен и животински произход @bg
scope note: Z: - velkoobchod s mlékem a mléčnými výrobky - velkoobchod s vejci a výrobky z vajec - velkoobchod s jedlými oleji a tuky rostlinného nebo živočišného původu @cs
scope note: Diese Klasse umfasst: - Großhandel mit Milch und Milcherzeugnissen - Großhandel mit Eiern und Eiprodukten - Großhandel mit tierischen oder pflanzlichen Speiseölen und Nahrungsfetten @de
scope note: This class includes: - wholesale of dairy products - wholesale of eggs and egg products - wholesale of edible oils and fats of animal or vegetable origin @en
scope note: Esta clase comprende: - el comercio al por mayor de productos lácteos - el comercio al por mayor de huevos y productos a base de huevos - el comercio al por mayor de grasas y aceites comestibles de origen animal y vegetal @es
scope note: Cette classe comprend: - le commerce de gros de produits laitiers - le commerce de gros d’œufs et d’ovoproduits - le commerce de gros d’huiles et de graisses comestibles d’origine animale et végétale @fr
scope note: Ovaj razred uključuje: - trgovinu na veliko mliječnim proizvodima - trgovinu na veliko jajima i proizvodima od jaja - trgovinu na veliko jestivim uljima i masnoćama životinjskog ili biljnog podrijetla
scope note: Į šią klasę įeina: - pieno produktų didmeninė prekyba - kiaušinių ir kiaušinių produktų didmeninė prekyba - gyvūninio ar augalinio valgomojo aliejaus ir riebalų didmeninė prekyba @lt
scope note: Данная группа включает оптовую торговлю непродовольственными товарами потребительского назначения, включая текстильные изделия. @ru
scope note: Bu sınıf aşağıdakileri kapsamaktadır; - süt ürünlerinin toptan ticareti, - yumurtalar ve yumurta ürünlerinin toptan ticareti, - hayvan veya bitkisel kaynaklı yenilebilir sıvı ve katı yağların toptan ticareti. @tr
preferred label: Търговия на едро с мляко и млечни продукти, яйца, хранителни масла и мазнини @bg
preferred label: Velkoobchod s mléčnými výrobky, vejci, jedlými oleji a tuky @cs
preferred label: Engroshandel med mejeriprodukter, æg samt spiselige olier og fedtstoffer @da
preferred label: Großhandel mit Milch, Milcherzeugnissen, Eiern, Speiseölen und Nahrungsfetten @de
preferred label: Χονδρικό εμπόριο γαλακτοκομικών προϊόντων, αβγών και βρώσιμων ελαίων και λιπών @el
preferred label: Comercio al por mayor de productos lácteos, huevos, aceites y grasas comestibles @es
preferred label: Piimatoodete, munade, toiduõli ja -rasva hulgimüük @et
preferred label: Maitotaloustuotteiden, munien sekä ravintoöljyjen ja @fi
preferred label: Commerce de gros de produits laitiers, œufs, huiles et matières grasses comestibles @fr
preferred label: Tejtermék, tojás, zsiradék nagykereskedelme
preferred label: Commercio all'ingrosso di prodotti lattiero-caseari, uova, oli e grassi commestibili @it
preferred label: Pieno produktų, kiaušinių bei valgomųjų aliejaus ir riebalų didmeninė prekyba @lt
preferred label: Piena, piena produktu, olu un pārtikas tauku un eļļu vairumtirdzniecība @lv
preferred label: Bejgħ bl-ingrossa ta' prodotti tal-ħalib, bajd u żjut u xaħmijiet ta' l-ikel @mt
preferred label: Groothandel in zuivelproducten, eieren en spijsoliën en -vetten @nl
preferred label: Engroshandel med meierivarer, egg, matolje og -fett @no
preferred label: Sprzedaż hurtowa mleka, wyrobów mleczarskich, jaj, olejów i tłuszczów jadalnych @pl
preferred label: Comércio por grosso de leite e derivados, ovos, azeite, óleos e gorduras alimentares @pt
preferred label: Comerţ cu ridicata al produselor lactate, ouălor, uleiurilor şi grăsimilor comestibile @ro
preferred label: Оптовая торговля молочными продуктами, яйцами и пищевыми маслами и жирами @ru
preferred label: Veľkoobchod s mliečnymi produktmi, vajciami a jedlým olejom a tukom @sk
preferred label: Trgovina na debelo z mlekom, mlečnimi izdelki, jajci, jedilnimi olji in maščobami @sl
preferred label: Partihandel med mejeriprodukter, ägg, matolja och matfett @sv
preferred label: Süt ürünleri, yumurta ve yenilebilir sıvı ve katı yağların toptan ticareti @tr
broader: Wholesale of food, beverages and tobacco

Wholesale of beverages
type: Concept
notation: 46.34
status: valid
status modified: 2013-10-18
accepted date: 2013-10-18
in scheme: Statistical Classification of Economic Activities in the European Community, Rev. 2 (2008)
scope note: - търговия на едро с алкохолни и безалкохолни напитки - търговия на едро с наливно вино и неговото бутилиране, без преработване - смесване на вино или дестилиране на спиртни напитки - 11.01, 11.02 @bg
scope note: Z: - velkoobchod s alkoholickými nápoji - velkoobchod s nealkoholickými nápoji ZT: - nákup vína ve velkém a plnění do lahví bez dalšího zpracování N: - míchání vín nebo destilovaných lihovin (11.01, 11.02) @cs
scope note: Diese Klasse umfasst: - Großhandel mit alkoholhaltigen Getränken - Großhandel mit alkoholfreien Getränken Diese Klasse umfasst ferner: - Einkauf und Flaschenabfüllung von Wein ohne weitere Verarbeitung Diese Klasse umfasst nicht: - Verschneiden von Wein oder Spirituosen (s. 11.01, 11.02) @de
scope note: This class includes: - wholesale of alcoholic beverages - wholesale of non-alcoholic beverages This class also includes: - buying of wine in bulk and bottling without transformation This class excludes: - blending of wine or distilled spirits, see 11.01, 11.02 @en
scope note: Esta clase comprende: - el comercio al por mayor de bebidas alcohólicas - el comercio al por mayor de bebidas no alcohólicas Esta clase comprende también: - la compra y embotellado sin transformación de vino a granel Esta clase no comprende: - la mezcla de vino o bebidas alcohólicas destiladas (véanse 11.01 y 11.02) @es
scope note: Cette classe comprend: - le commerce de gros de boissons alcoolisées - le commerce de gros de boissons non alcoolisées Cette classe comprend également: - l’achat de vin en vrac et sa mise en bouteilles sans transformation Cette classe ne comprend pas: - le mélange de vins ou de spiritueux distillés, voir 11.01 et 11.02 @fr
scope note: Ovaj razred uključuje: - trgovinu na veliko alkoholnim pićima - trgovinu na veliko bezalkoholnim pićima Ovaj razred također uključuje: - kupnju vina bez ambalaže (u rinfuzi) i punjenje u boce bez prethodne dorade Ovaj razred isključuje: - miješanje vina ili destiliranih alkoholnih pića, vidi 11.01 i 11.02
scope note: Į šią klasę įeina: - alkoholinių gėrimų didmeninė prekyba - nealkoholinių gėrimų didmeninė prekyba Į šią klasę taip pat įeina: - vyno pirkimas didelėse talpyklose ir jo nepakeitus pilstymas į butelius Į šią klasę neįeina: - vyno ar rektifikuoto spirito maišymas, žr. 11.01, 11.02 @lt
scope note: Этот класс включает: - оптовую торговлю пряжей - оптовую торговлю тканями - оптовую торговлю постельным, столовым бельем и т.д. - оптовую торговлю галантерейными товарами: иголками, нитками и т.д. Этот класс исключает: - оптовую торговлю текстильным волокном, см. 46.76 @ru
scope note: Bu sınıf aşağıdakileri kapsamaktadır; - alkollü içeceklerin toptan ticareti, - alkollü olmayan içeceklerin toptan ticareti. Ayrıca bu sınıf aşağıdakileri de kapsamaktadır; - dökme olarak (paketlenmemiş) şarabın satın alınması ve üzerinde hiçbir değişiklik yapılmaksızın şişelenmesi. Kapsam dışı olanlar; - şarap veya damıtılmış alkollü içeceklerin harmanlanması, bkz. 11.01, 11.02. @tr
preferred label: Търговия на едро с напитки @bg
preferred label: Velkoobchod s nápoji @cs
preferred label: Engroshandel med drikkevarer @da
preferred label: Großhandel mit Getränken @de
preferred label: Χονδρικό εμπόριο ποτών @el
preferred label: Comercio al por mayor de bebidas @es
preferred label: Jookide hulgimüük @et
preferred label: Alkoholi- ja muiden juomien tukkukauppa @fi
preferred label: Commerce de gros de boissons @fr
preferred label: Ital nagykereskedelme
preferred label: Commercio all'ingrosso di bevande @it
preferred label: Gėrimų didmeninė prekyba @lt
preferred label: Dzērienu vairumtirdzniecība @lv
preferred label: Bejgħ bl-ingrossa ta' xorb @mt
preferred label: Groothandel in dranken @nl
preferred label: Sprzedaż hurtowa napojów @pl
preferred label: Comércio por grosso de bebidas @pt
preferred label: Comerţ cu ridicata al băuturilor @ro
preferred label: Оптовая торговля напитками @ru
preferred label: Veľkoobchod nápojmi @sk
preferred label: Trgovina na debelo s pijačami @sl
preferred label: Partihandel med drycker @sv
preferred label: İçecek toptan ticareti @tr
broader: Wholesale of food, beverages and tobacco

Wholesale of tobacco products
type: Concept
notation: 46.35
status: valid
status modified: 2013-10-18
accepted date: 2013-10-18
in scheme: Statistical Classification of Economic Activities in the European Community, Rev. 2 (2008)
scope note: - търговия на едро с нарязана по формат цигарена хартия @bg
scope note: Этот класс включает: - оптовую торговлю одеждой, в том числе спортивной - оптовую торговлю такими аксессуарами, как перчатки, галстуки и подтяжки - оптовую торговлю обувью - оптовую торговлю меховыми изделиями - оптовую торговлю зонтами Этот класс исключает: - оптовую торговлю ювелирными изделиями, см. 46.48 - оптовую торговлю кожаными изделиями, см. 46.49 - оптовую торговлю специализированным спортивным оборудованием и инвентарем, а также обувью, например, лыжными ботинками, см. 46.49 @ru
preferred label: Търговия на едро с тютюневи изделия @bg
preferred label: Velkoobchod s tabákovými výrobky @cs
preferred label: Engroshandel med tobaksvarer @da
preferred label: Großhandel mit Tabakwaren @de
preferred label: Χονδρικό εμπόριο προϊόντων καπνού @el
preferred label: Comercio al por mayor de productos del tabaco @es
preferred label: Tubakatoodete hulgimüük @et
preferred label: Tupakkatuotteiden tukkukauppa @fi
preferred label: Commerce de gros de produits à base de de tabac @fr
preferred label: Dohányáru nagykereskedelme
preferred label: Commercio all'ingrosso di prodotti del tabacco @it
preferred label: Tabako gaminių didmeninė prekyba @lt
preferred label: Tabakas izstrādājumu vairumtirdzniecība @lv
preferred label: Bejgħ bl-ingrossa ta' prodotti tat-tabakk @mt
preferred label: Groothandel in tabaksproducten @nl
preferred label: Engroshandel med tobakksvarer @no
preferred label: Sprzedaż hurtowa wyrobów tytoniowych @pl
preferred label: Comércio por grosso de tabaco @pt
preferred label: Comerţ cu ridicata al produselor din tutun @ro
preferred label: Оптовая торговля табачными изделиями @ru
preferred label: Veľkoobchod s tabakovými výrobkami @sk
preferred label: Trgovina na debelo s tobačnimi izdelki @sl
preferred label: Partihandel med tobak @sv
preferred label: Tütün ürünlerinin toptan ticaretı @tr
broader: Wholesale of food, beverages and tobacco

Wholesale of sugar and chocolate and sugar confectionery
type: Concept
notation: 46.36
status: valid
status modified: 2013-10-18
accepted date: 2013-10-18
in scheme: Statistical Classification of Economic Activities in the European Community, Rev. 2 (2008)
scope note: - търговия на едро със захар, захарни изделия и шоколад - търговия на едро със сухи сладкарски изделия @bg
scope note: Z: - velkoobchod s cukrem, čokoládou a cukrovinkami - velkoobchod s pekařskými výrobky @cs
scope note: Diese Klasse umfasst: - Großhandel mit Zucker und Süßwaren - Großhandel mit Backwaren @de
scope note: This class includes: - wholesale of sugar, chocolate and sugar confectionery - wholesale of bakery products @en
scope note: Esta clase comprende: - el comercio al por mayor de azúcar, chocolate y confitería - el comercio al por mayor de productos de panadería @es
scope note: Cette classe comprend: - le commerce de gros de sucre, chocolat et confiserie - le commerce de gros de produits de boulangerie @fr
scope note: Ovaj razred uključuje: - trgovinu na veliko šećerom, čokoladom i bombonima - trgovinu na veliko pekarskim proizvodima
scope note: Į šią klasę įeina: - cukraus, šokolado ir cukraus saldumynų didmeninė prekyba - kepyklos produktų didmeninė prekyba @lt
scope note: Этот класс включает: - оптовую торговлю электрическими бытовыми приборами - оптовую торговлю радио- и телевизионным оборудованием - оптовую торговлю фотографическими и оптическими товарами - оптовую торговлю электрическими обогревателями - оптовую торговлю аудио и видеопленками, дисками CD и DVD с записями Этот класс исключает: - оптовую торговлю чистыми аудио и видеопленками, дисками CD и DVD, см. 46.52 - оптовую торговлю швейными машинами, см. 46.64 @ru
scope note: Bu sınıf aşağıdakileri kapsamaktadır; - şeker ve çikolata ile şekerlemelerin toptan ticareti, - fırıncılık mamullerinin toptan ticareti. @tr
preferred label: Търговия на едро със захар, захарни и шоколадови изделия @bg
preferred label: Velkoobchod s cukrem, čokoládou a cukrovinkami @cs
preferred label: Engroshandel med sukker, chokolade og sukkervarer @da
preferred label: Großhandel mit Zucker, Süßwaren und Backwaren @de
preferred label: Χονδρικό εμπόριο ζάχαρης, σοκολάτας και ειδών ζαχαροπλαστικής @el
preferred label: Comercio al por mayor de azúcar, chocolate y confitería @es
preferred label: Suhkru, šokolaadi ja suhkrukondiitritoodete hulgimüük @et
preferred label: Sokerin, suklaan, makeisten ja leipomotuotteiden tukkukauppa @fi
preferred label: Commerce de gros de sucre, chocolat et confiserie @fr
preferred label: Cukor, édesség, nagykereskedelme
preferred label: Commercio all'ingrosso di zucchero, cioccolato e dolciumi @it
preferred label: Cukraus, šokolado ir cukraus saldumynų didmeninė prekyba @lt
preferred label: Cukura, šokolādes un cukuroto konditorijas izstrādājumu vairumtirdzniecība @lv
preferred label: Bejgħ bl-ingrossa ta' zokkor u ċikkulata u dolċerija @mt
preferred label: Groothandel in suiker, chocolade en suikerwerk @nl
preferred label: Engroshandel med sukker, sjokolade og sukkervarer @no
preferred label: Sprzedaż hurtowa cukru, czekolady i wyrobów cukierniczych @pl
preferred label: Comércio por grosso de açúcar, chocolate e produtos de confeitaria @pt
preferred label: Comerţ cu ridicata al zahărului, ciocolatei şi produselor zaharoase @ro
preferred label: Оптовая торговля сахаром, шоколадом и сахаристыми кондитерскими изделиями @ru
preferred label: Veľkoobchod s cukrom a čokoládou a cukrovinkami @sk
preferred label: Trgovina na debelo s sladkorjem, čokolado, sladkornimi izdelki @sl
preferred label: Partihandel med socker, choklad och sockerkonfektyrer @sv
preferred label: Şeker, çikolata ve şekerleme toptan ticareti @tr
broader: Wholesale of food, beverages and tobacco

Wholesale of coffee, tea, cocoa and spices
type: Concept
notation: 46.37
status: valid
status modified: 2013-10-18
accepted date: 2013-10-18
in scheme: Statistical Classification of Economic Activities in the European Community, Rev. 2 (2008)
scope note: Этот класс включает: - оптовую торговлю изделиями из фарфора и стекла - оптовую торговлю чистящими средствами @ru
preferred label: Търговия на едро с кафе, чай, какао и подправки @bg
preferred label: Velkoobchod s kávou, čajem, kakaem a kořením @cs
preferred label: Engroshandel med kaffe, te, kakao og krydderier @da
preferred label: Großhandel mit Kaffee, Tee, Kakao und Gewürzen @de
preferred label: Χονδρικό εμπόριο καφέ, τσαγιού, κακάου και μπαχαρικών @el
preferred label: Comercio al por mayor de café, té, cacao y especias @es
preferred label: Kohvi, tee, kakao ja maitseainete hulgimüük @et
preferred label: Kahvin, teen, kaakaon ja mausteiden tukkukauppa @fi
preferred label: Commerce de gros de café, thé, cacao et épices @fr
preferred label: Kávé-, tea-, kakaó-, fűszer-nagykereskedelem
preferred label: Commercio all'ingrosso di caffè, tè, cacao e spezie @it
preferred label: Kavos, arbatos, kakavos ir prieskonių didmeninė prekyba @lt
preferred label: Kafijas, tējas, kakao un garšvielu vairumtirdzniecība @lv
preferred label: Bejgħ bl-ingrossa ta' kafè, te, kawkaw u ħwawar @mt
preferred label: Groothandel in koffie, thee, cacao en specerijen @nl
preferred label: Engroshandel med kaffe, te, kakao og krydder @no
preferred label: Sprzedaż hurtowa herbaty, kawy, kakao i przypraw @pl
preferred label: Comércio por grosso de café, chá, cacau e especiarias @pt
preferred label: Comerţ cu ridicata cu cafea, ceai, cacao şi condimente @ro
preferred label: Оптовая торговля кофе, чаем, какао и пряностями @ru
preferred label: Veľkoobchod s kávou, čajom, kakaom a korením @sk
preferred label: Trgovina na debelo s kavo, čajem, kakavom, začimbami @sl
preferred label: Partihandel med kaffe, te, kakao och kryddor @sv
preferred label: Kahve, çay, kakao ve baharat toptan ticareti @tr
broader: Wholesale of food, beverages and tobacco

Wholesale of other food, including fish, crustaceans and molluscs
type: Concept
notation: 46.38
status: valid
status modified: 2013-10-18
accepted date: 2013-10-18
in scheme: Statistical Classification of Economic Activities in the European Community, Rev. 2 (2008)
scope note: - търговия на едро с риба, рибни продукти, ракообразни и мекотели - търговия на едро с картофени изделия - търговия на едро с храни за домашни любимци @bg
scope note: ZT: - velkoobchod s krmivy pro zvířata v zájmovém chovu (domácí mazlíčky) @cs
scope note: Diese Klasse umfasst auch: - Großhandel mit Futtermitteln für Heimtiere @de
scope note: This class also includes: - wholesale of feed for pet animals @en
scope note: Esta clase comprende también: - el comercio al por mayor de productos alimenticios para animales domésticos @es
scope note: Cette classe comprend également: - le commerce de gros d’aliments pour animaux de compagnie @fr
scope note: Ovaj razred također uključuje: - trgovinu na veliko hranom za kućne ljubimce
scope note: Į šią klasę taip pat įeina: - naminių gyvūnėlių ėdalo didmeninė prekyba @lt
scope note: Этот класс включает: - оптовую торговлю парфюмерией, косметикой и мылом @ru
scope note: Ayrıca bu sınıf aşağıdakileri de kapsamaktadır; - evcil hayvanlar için olan yemlerin veya yiyeceklerin toptan ticareti. @tr
preferred label: Специализирана търговия на едро с други хранителни стоки @bg
preferred label: Specializovaný velkoobchod s jinými potravinami, včetně ryb, korýšů a měkkýšů @cs
preferred label: Engroshandel med andre fødevarer herunder fisk, krebsdyr og bløddyr @da
preferred label: Großhandel mit sonstigen Nahrungs- und Genussmitteln @de
preferred label: Χονδρικό εμπόριο άλλων τροφίμων, συμπεριλαμβανομένων ψαριών, καρκινοειδών και μαλακίων @el
preferred label: Comercio al por mayor de pescados, mariscos y otros productos alimenticios @es
preferred label: Muude toidukaupade hulgimüük, k.a kalad, vähilaadsed ja limused @et
preferred label: Kalan, luontaistuotteiden ja muiden elintarvikkeiden tukkukauppa @fi
preferred label: Commerce de gros d'autres produits alimentaires, y compris poissons, crustacés et mollusques @fr
preferred label: Egyéb élelmiszer nagykereskedelme
preferred label: Commercio all'ingrosso di altri prodotti alimentari, inclusi pesci, crostacei e molluschi @it
preferred label: Kitų maisto produktų, įskaitant žuvis, vėžiagyvius ir moliuskus, didmeninė prekyba @lt
preferred label: Citu pārtikas produktu vairumtirdzniecība, ieskaitot zivis, vēžveidīgos un mīkstmiešus @lv
preferred label: Bejgħ bl-ingrossa ta' ikel ieħor, inkluż ħut, krustaċji u molluski @mt
preferred label: Groothandel in andere voedingsmiddelen, met inbegrip van vis en schaal- en weekdieren @nl
preferred label: Engroshandel med andre næringsmidler, herunder fisk, skalldyr og bløtdyr @no
preferred label: Sprzedaż hurtowa pozostałej żywności, włączając ryby, skorupiaki i mięczaki @pl
preferred label: Comércio por grosso de outros produtos alimentares (incluindo peixe, crustáceos e moluscos) @pt
preferred label: Comerţ cu ridicata specializat al altor alimente, inclusiv peşte, crustacee şi moluşte @ro
preferred label: Оптовая торговля прочими продуктами питания, включая рыбу, ракообразных и моллюсков @ru
preferred label: Veľkoobchod s inými potravinami, vrátane rýb, kôrovcov a mäkkýšov @sk
preferred label: Trgovina na debelo z drugimi živili, tudi z ribami, raki, mehkužci @sl
preferred label: Partihandel med andra livsmedel, bl.a. fisk samt skal- och blötdjur @sv
preferred label: Balık, kabuklular ve yumuşakçalar da dahil diğer gıda maddelerinin toptan ticareti @tr
broader: Wholesale of food, beverages and tobacco

Non-specialised wholesale of food, beverages and tobacco
type: Concept
notation: 46.39
status: valid
status modified: 2013-10-18
accepted date: 2013-10-18
in scheme: Statistical Classification of Economic Activities in the European Community, Rev. 2 (2008)
scope note: Этот класс включает: - оптовую торговлю фармацевтическими и медицинскими товарами @ru
preferred label: Неспециализирана търговия на едро с хранителни стоки, напитки и тютюневи изделия @bg
preferred label: Nespecializovaný velkoobchod s potravinami, nápoji a tabákovými výrobky @cs
preferred label: Ikke-specialiseret engroshandel med føde-, drikke- og tobaksvarer @da
preferred label: Großhandel mit Nahrungs- und Genussmitteln, Getränken und Tabakwaren, ohne ausgeprägten Schwerpunkt @de
preferred label: Μη ειδικευμένο χονδρικό εμπόριο τροφίμων, ποτών και καπνού @el
preferred label: Comercio al por mayor, no especializado, de productos alimenticios, bebidas y tabaco @es
preferred label: Toidukaupade, jookide ja tubakatoodete spetsialiseerimata hulgimüük @et
preferred label: Elintarvikkeiden, juomien ja tupakan yleistukkukauppa @fi
preferred label: Commerce de gros non spécialisé de denrées, boissons et tabac @fr
preferred label: Élelmiszer, ital, dohányáru vegyes nagykereskedelme
preferred label: Commercio all'ingrosso non specializzato di prodotti alimentari, bevande e tabacco @it
preferred label: Maisto produktų, gėrimų ir tabako nespecializuota didmeninė prekyba @lt
preferred label: Pārtikas produktu, dzērienu un tabakas nespecializēta vairumtirdzniecība @lv
preferred label: Bejgħ bl-ingrossa mhux speċjalizzat ta' ikel, xorb u tabakk @mt
preferred label: Niet-gespecialiseerde groothandel in voedings- en genotmiddelen @nl
preferred label: Engroshandel med bredt utvalg av nærings- og nytelsesmidler @no
preferred label: Sprzedaż hurtowa niewyspecjalizowana żywności, napojów i wyrobów tytoniowych @pl
preferred label: Comércio por grosso não especializado de produtos alimentares, bebidas e tabaco @pt
preferred label: Comerţ cu ridicata nespecializat de produse alimentare, băuturi şi tutun @ro
preferred label: Неспециализированная оптовая торговля продуктами питания, напитками и табачными изделиями @ru
preferred label: Nešpecializovaný veľkoobchod s potravinami, nápojmi a tabakom @sk
preferred label: Nespecializirana trgovina na debelo z živili, pijačami, tobačnimi izdelki @sl
preferred label: Icke specialiserad partihandel med livsmedel, drycker och tobak @sv
preferred label: Belirli bir mala tahsis edilmemiş mağazalardaki gıda, içecek ve tütün toptan ticareti @tr
broader: Wholesale of food, beverages and tobacco

Wholesale of household goods
type: Concept
notation: 46.4
status: valid
status modified: 2013-10-18
accepted date: 2013-10-18
in scheme: Statistical Classification of Economic Activities in the European Community, Rev. 2 (2008)
scope note: Тази група включва търговия на едро със стоки за домакинството, вкл. търговия на едро с текстил. @bg
scope note: Tato skupina zahrnuje velkoobchod se zbožím převážně pro domácnost, včetně textilu. @cs
scope note: Diese Gruppe umfasst den Großhandel mit Gebrauchs- und Verbrauchsgütern, einschließlich Textilien. @de
scope note: This group includes the wholesale of household goods, including textiles. @en
scope note: Este grupo comprende el comercio al por mayor de artículos de uso doméstico, incluidos los textiles @es
scope note: Ce groupe comprend le commerce de gros de biens domestiques, y compris les articles textiles. @fr
scope note: Ova skupina uključuje trgovinu na veliko proizvodima za kućanstvo, uključujući tekstil.
scope note: Į šią grupę įeina namų ūkio reikmenų, įskaitant tekstilės gaminius, didmeninė prekyba. @lt
scope note: Этот класс включает: - оптовую торговлю бытовой мебелью - оптовую торговлю коврами - оптовую торговлю осветительным оборудованием Этот класс исключает: - оптовую торговлю офисной мебелью, см. 46.65 @ru
scope note: Bu grup, tekstil ürünleri de dahil, ev eşyalarının toptan ticaretini kapsamaktadır. @tr
preferred label: Търговия на едро с нехранителни потребителски стоки @bg
preferred label: Velkoobchod s výrobky převážně pro domácnost @cs
preferred label: Engroshandel med husholdningsartikler @da
preferred label: Großhandel mit Gebrauchs- und Verbrauchsgütern @de
preferred label: Χονδρικό εμπόριο ειδών οικιακής χρήσης @el
preferred label: Comercio al por mayor de artículos de uso doméstico @es
preferred label: Kodutarvete hulgimüük @et
preferred label: Taloustavaroiden tukkukauppa @fi
preferred label: Commerce de gros de biens domestiques @fr
preferred label: Háztartási cikk nagykereskedelme
preferred label: Commercio all'ingrosso di beni di consumo @it
preferred label: Namų ūkio reikmenų didmeninė prekyba @lt
preferred label: Mājsaimniecības preču vairumtirdzniecība @lv
preferred label: Bejgħ bl-ingrossa ta' oġġetti għad-dar @mt
preferred label: Groothandel in consumentenartikelen @nl
preferred label: Engroshandel med husholdningsvarer og varer til personlig bruk @no
preferred label: Sprzedaż hurtowa artykułów użytku domowego @pl
preferred label: Comércio por grosso de bens de consumo, excepto alimentares, bebidas e tabaco @pt
preferred label: Comerţ cu ridicata al bunurilor de consum @ro
preferred label: Оптовая торговля непродовольственными товарами потребительского назначения @ru
preferred label: Veľkoobchod s tovarom pre domácnosť @sk
preferred label: Trgovina na debelo z izdelki za široko rabo @sl
preferred label: Partihandel med hushållsvaror @sv
preferred label: Ev eşyalarının toptan ticareti @tr
broader: Wholesale trade, except of motor vehicles and motorcycles
narrower: Wholesale of textiles
narrower: Wholesale of clothing and footwear
narrower: Wholesale of electrical household appliances
narrower: Wholesale of china and glassware and cleaning materials
narrower: Wholesale of perfume and cosmetics
narrower: Wholesale of pharmaceutical goods
narrower: Wholesale of furniture, carpets and lighting equipment
narrower: Wholesale of watches and jewellery
narrower: Wholesale of other household goods

Wholesale of textiles
type: Concept
notation: 46.41
status: valid
status modified: 2013-10-18
accepted date: 2013-10-18
in scheme: Statistical Classification of Economic Activities in the European Community, Rev. 2 (2008)
scope note: - търговия на едро с прежди - търговия на едро с тъкани и плетени платове - търговия на едро с конфекционирани текстилни изделия за домакинството - одеяла, юргани, спално бельо, покривки за маса и други - търговия на едро с галантерийни и пасмантерийни изделия - шевни игли и игли за плетене, конци, копчета и други - търговия на едро с текстилни влакна - 46.76 @bg
scope note: Z: - velkoobchod s přízemi - velkoobchod s látkami - velkoobchod s prádlem pro domácnost atd. - velkoobchod s textilní galanterií: jehlami, šicími nitěmi atd. - velkoobchod s lany, provazy, síťovými výrobky N: - velkoobchod s textilními vlákny (46.76) @cs
scope note: Diese Klasse umfasst: - Großhandel mit Garnen - Großhandel mit Stoffen - Großhandel mit Haushaltswäsche usw. - Großhandel mit Kurzwaren: Nadeln, Nähgarn usw. Diese Klasse umfasst nicht: - Großhandel mit Textilfasern (s. 46.76) @de
scope note: This class includes: - wholesale of yarn - wholesale of fabrics - wholesale of household linen etc. - wholesale of haberdashery: needles, sewing thread etc. This class excludes: - wholesale of textile fibres, see 46.76 @en
scope note: Esta clase comprende: - el comercio al por mayor de hilo - el comercio al por mayor de tejidos - el comercio al por mayor de ropa blanca, etc. - el comercio al por mayor de artículos de mercería: agujas, hilo de coser, etc. Esta clase no comprende: - el comercio al por mayor de fibras textiles (véase 46.76) @es
scope note: Cette classe comprend: - le commerce de gros de fils - le commerce de gros de tissus - le commerce de gros de linge de maison, etc. - le commerce de gros d’articles de mercerie: aiguilles, fils, etc. Cette classe ne comprend pas: - le commerce de gros de fibres textiles, voir 46.76 @fr
scope note: Ovaj razred uključuje: - trgovinu na veliko pređom - trgovinu na veliko tkaninama - trgovinu na veliko rubljem za kućanstvo itd. - trgovinu na veliko pozamanterijom i priborom: iglama, koncima za šivanje itd. Ovaj razred isključuje: - trgovinu na veliko tekstilnim vlaknima, vidi 46.76
scope note: Į šią klasę įeina: - verpalų didmeninė prekyba - audinių didmeninė prekyba - skalbinių ir kt. didmeninė prekyba - galanterijos: adatų, siuvimo siūlų ir kt. didmeninė prekyba Į šią klasę neįeina: - tekstilės pluoštų didmeninė prekyba, žr. 46.76 @lt
scope note: Bu sınıf aşağıdakileri kapsamaktadır; - iplik toptan ticareti, - kumaş toptan ticareti, - ev tekstili gibi ürünlerin toptan ticareti, - manifatura ürünleri toptan ticareti: iğneler, dikiş ipliği vb.. Kapsam dışı olanlar; - tekstil elyafı toptan ticareti, bkz. 46.76. @tr
preferred label: Търговия на едро с текстил и галантерийни стоки @bg
preferred label: Velkoobchod s textilem @cs
preferred label: Engroshandel med tekstiler @da
preferred label: Großhandel mit Textilien @de
preferred label: Χονδρικό εμπόριο κλωστοϋφαντουργικών προϊόντων @el
preferred label: Comercio al por mayor de textiles @es
preferred label: Tekstiiltoodete hulgimüük @et
preferred label: Tekstiilien tukkukauppa @fi
preferred label: Commerce de gros de textiles @fr
preferred label: Textil-nagykereskedelem
preferred label: Commercio all'ingrosso di prodotti tessili @it
preferred label: Tekstilės gaminių didmeninė prekyba @lt
preferred label: Tekstilizstrādājumu vairumtirdzniecība @lv
preferred label: Bejgħ bl-ingrossa ta' tessuti @mt
preferred label: Groothandel in textiel @nl
preferred label: Engroshandel med tekstiler og utstyrsvarer @no
preferred label: Sprzedaż hurtowa wyrobów tekstylnych @pl
preferred label: Comércio por grosso de têxteis @pt
preferred label: Comerţ cu ridicata al produselor textile @ro
preferred label: Оптовая торговля текстильными товарами @ru
preferred label: Veľkoobchod s textilom @sk
preferred label: Trgovina na debelo s tekstilom @sl
preferred label: Partihandel med textilier @sv
preferred label: Tekstil ürünlerinin toptan ticareti @tr
broader: Wholesale of household goods

Wholesale of clothing and footwear
type: Concept
notation: 46.42
status: valid
status modified: 2013-10-18
accepted date: 2013-10-18
in scheme: Statistical Classification of Economic Activities in the European Community, Rev. 2 (2008)
scope note: - търговия на едро с облекло, вкл. спортно - търговия на едро с аксесоари за облекло - шалове, ръкавици, вратовръзки, тиранти и други - търговия на едро с обувки - търговия на едро с кожухарски изделия - търговия на едро с чадъри - търговия на едро с бижутерия - 46.48 - търговия на едро с кожени изделия - куфари, чанти и други - 46.49 - търговия на едро с обувки за ски и ски бягане – 46.49 @bg
scope note: Z: - velkoobchod s oděvy, včetně sportovního oblečení - velkoobchod s oděvními doplňky, např. rukavicemi, kravatami, deštníky a sponami - velkoobchod s obuví - velkoobchod s kožešinovými výrobky N: - velkoobchod s klenoty (46.48) - velkoobchod s koženým zbožím (46.49) - velkoobchod se speciální sportovní obuví, např. s lyžařskými botami (46.49) @cs
scope note: Diese Klasse umfasst: - Großhandel mit Bekleidung einschließlich Sportbekleidung - Großhandel mit Bekleidungszubehör wie Handschuhen, Krawatten und Hosenträgern - Großhandel mit Schuhen - Großhandel mit Pelzwaren - Großhandel mit Schirmen Diese Klasse umfasst nicht: - Großhandel mit Schmuck (s. 46.48) - Großhandel mit Lederwaren (s. 46.49) - Großhandel mit speziellen Sportschuhen, z. B. Skischuhen (s. 46.49) @de
scope note: This class includes: - wholesale of clothing, including sports clothes - wholesale of clothing accessories such as gloves, ties and braces - wholesale of footwear - wholesale of fur articles - wholesale of umbrellas This class excludes: - wholesale of jewellery, see 46.48 - wholesale of leather goods, see 46.49 - wholesale of special sports equipment footwear such as ski boots, see 46.49 @en
scope note: Esta clase comprende: - el comercio al por mayor de prendas de vestir, incluido la ropa deportiva deportivo - el comercio al por mayor de accesorios de vestir tales como guantes, corbatas y tirantes - el comercio al por mayor de calzado - el comercio al por mayor de artículos de peletería - el comercio al por mayor de paraguas Esta clase no comprende: - el comercio al por mayor de joyería (véase 46.48) - el comercio al por mayor de artículos de cuero (véase 46.49) - el comercio al por mayor de calzado deportivo especial, como botas de esquí (véase 46.49) @es
scope note: Cette classe comprend: - le commerce de gros d’articles d’habillement, y compris les vêtements de sport - le commerce de gros d’accessoires du vêtement tels que gants, cravates et bretelles - le commerce de gros de chaussures - le commerce de gros d’articles en fourrure - le commerce de gros de parapluies Cette classe ne comprend pas: - le commerce de gros d’articles de bijouterie, voir 46.48 - le commerce de gros d’articles en cuir, voir 46.49 - le commerce de gros de chaussures spéciales de sport, telles que des chaussures de ski, voir 46.49 @fr
scope note: Ovaj razred uključuje: - trgovinu na veliko odjećom, uključujući sportsku odjeću - trgovinu na veliko priborom za odjeću kao što su rukavice, kravate i naramenice za hlače - trgovinu na veliko obućom - trgovinu na veliko proizvodima od krzna - trgovinu na veliko kišobranima Ovaj razred isključuje: - trgovinu na veliko nakitom, vidi 46.48 - trgovinu na veliko proizvodima od kože, vidi 46.49 - trgovinu na veliko specijalnom sportskom obućom kao što su skijaške cipele (pancerice), vidi 46.49
scope note: Į šią klasę įeina: - drabužių, įskaitant sportinius drabužius, didmeninė prekyba - drabužių priedų, tokių kaip pirštinės, kaklaraiščiai, petnešos didmeninė prekyba - avalynės didmeninė prekyba - kailinių dirbinių didmeninė prekyba - skėčių didmeninė prekyba Į šią klasę neįeina: - juvelyrinių dirbinių didmeninė prekyba, žr. 46.48 - odinių dirbinių didmeninė prekyba, žr. 46.49 - specialios sportinės avalynės, tokios kaip slidžių batai, didmeninė prekyba, žr. 46.49 @lt
scope note: Этот класс включает: - оптовую торговлю изделиями из дерева, плетеными изделиями и кухонной посудой - оптовую торговлю велосипедами и запчастями и аксессуарами к ним - оптовую торговлю школьно-письменными принадлежностями, книгами, журналами и газетами - оптовую торговлю кожаными изделиями и дорожными принадлежностями - оптовую торговлю музыкальными инструментами - оптовую торговлю детскими играми и игрушками - оптовую торговлю спортивными товарами, включая специальную спортивную обувь, такую как лыжные ботинки @ru
scope note: Bu sınıf aşağıdakileri kapsamaktadır; - giysi toptan ticareti (spor giysileri dahil), - eldivenler, kravatlar ve pantolon askıları gibi giysi aksesuarlarının toptan ticareti, - ayakkabı toptan ticareti, - kürklü eşyaların toptan ticareti - şemsiyelerin toptan ticareti, Kapsam dışı olanlar; - mücevher toptan ticareti, bkz. 46.48, - deri eşyaların toptan ticareti, bkz. 46.49, - kayak botları gibi özel spor ekipman ayakkabılarının toptan ticareti, bkz. 46.49. @tr
preferred label: Търговия на едро с облекло и обувки @bg
preferred label: Velkoobchod s oděvy a obuví @cs
preferred label: Engroshandel med beklædning og fodtøj @da
preferred label: Großhandel mit Bekleidung und Schuhen @de
preferred label: Χονδρικό εμπόριο ενδυμάτων και υποδημάτων @el
preferred label: Comercio al por mayor de prendas de vestir y calzado @es
preferred label: Rõivaste ja jalatsite hulgimüük @et
preferred label: Vaatteiden ja jalkineiden tukkukauppa @fi
preferred label: Commerce de gros d'habillement et de chaussures @fr
preferred label: Ruházat, lábbeli nagykereskedelme
preferred label: Commercio all'ingrosso di abbigliamento e di calzature @it
preferred label: Drabužių ir avalynės didmeninė prekyba @lt
preferred label: Apģērbu un apavu vairumtirdzniecība @lv
preferred label: Bejgħ bl-ingrossa ta' ħwejjeġ u xedd tas-saqajn @mt
preferred label: Groothandel in kleding en schoeisel @nl
preferred label: Engroshandel med klær og skotøy @no
preferred label: Sprzedaż hurtowa odzieży i obuwia @pl
preferred label: Comércio por grosso de vestuário e calçado @pt
preferred label: Comerţ cu ridicata al îmbrăcămintei şi încălţămintei @ro
preferred label: Оптовая торговля одеждой и обувью @ru
preferred label: Veľkoobchod s odevmi a obuvou @sk
preferred label: Trgovina na debelo z oblačili in obutvijo @sl
preferred label: Partihandel med kläder och skodon @sv
preferred label: Giysi ve ayakkabı toptan ticareti @tr
broader: Wholesale of household goods

Wholesale of electrical household appliances
type: Concept
notation: 46.43
status: valid
status modified: 2013-10-18
accepted date: 2013-10-18
in scheme: Statistical Classification of Economic Activities in the European Community, Rev. 2 (2008)
scope note: - търговия на едро с електрически домакински уреди - търговия на едро с електрически отоплителни уреди - търговия на едро с битова електроника - търговия на едро с фотографски и оптични стоки - търговия на едро с грамофонни плочи, записани аудио- и видеокасети, компактдискове и цифрови дискове - търговия на едро с незаписани аудио- и видеокасети, компактдискове и цифрови дискове - 46.52 - търговия на едро с шевни машини - 46.64 @bg
scope note: Z: - velkoobchod s elektrickými domácími spotřebiči - velkoobchod s rozhlasovými a televizními přijímači - velkoobchod s fotografickým a optickým zbožím - velkoobchod se spotřebiči pro elektrické vytápění - velkoobchod s nahranými magnetofonovými pásky a videokazetami, CD a DVD N: - velkoobchod s nenahranými magnetofonovými pásky a videokazetami, CD a DVD (46.52) - velkoobchod s šicími stroji (46.64) @cs
scope note: Diese Klasse umfasst: - Großhandel mit elektrischen Haushaltsgeräten - Großhandel mit Rundfunk- und Fernsehgeräten - Großhandel mit Fotoartikeln und optischen Erzeugnissen - Großhandel mit elektrischen Heizgeräten - Großhandel mit bespielten Ton- und Videobändern, CDs und DVDs Diese Klasse umfasst nicht: - Großhandel mit unbespielten Ton- und Videobändern, CDs und DVDs (s.46.52) - Großhandel mit Nähmaschinen (s. 46.64) @de
scope note: This class includes: - wholesale of electrical household appliances - wholesale of radio and television equipment - wholesale of photographic and optical goods - wholesale of electrical heating appliances - wholesale of recorded audio and video tapes, CDs, DVDs This class excludes: - wholesale of blank audio and video tapes, CDs, DVDs, see 46.52 - wholesale of sewing machines, see 46.64 @en
scope note: Esta clase comprende: - el comercio al por mayor de aparatos electrodomésticos - el comercio al por mayor de aparatos de radio y televisión - el comercio al por mayor de productos fotográficos y ópticos - el comercio al por mayor de aparatos de calefacción eléctrica - el comercio al por mayor de cintas de audio y vídeo, CD y DVD grabados Esta clase no comprende: - el comercio al por mayor de cintas de audio y vídeo, CD y DVD vírgenes (véase 46.52) - el comercio al por mayor de máquinas de coser (véase 46.64) @es
scope note: Cette classe comprend: - le commerce de gros d’appareils électroménagers - le commerce de gros d’appareils de radio et de télévision - le commerce de gros de produits photographiques et optiques - le commerce de gros d’appareils de chauffage électriques - le commerce de gros de cassettes contenant des enregistrements sonores et vidéo, de CD, de DVD Cette classe ne comprend pas: - le commerce de gros de cassettes audio et vidéo, de CD, de DVD vierges, voir 46.52 - le commerce de gros de machines à coudre, voir 46.64 @fr
scope note: Ovaj razred uključuje: - trgovinu na veliko električnim aparatima za kućanstvo - trgovina na veliko radio i televizijskom opremom - trgovinu na veliko fotografskim i optičkim proizvodima - trgovinu na veliko električnim uređajima za grijanje - trgovinu na veliko snimljenim audio i videovrpcama, CD-ima, DVD-ima Ovaj razred isključuje: - trgovinu na veliko praznim audio i videovrpcama, CD-ima, DVD-ima, vidi 46.52 - trgovinu na veliko strojevima za šivanje, vidi 46.64
scope note: Į šią klasę įeina: - buitinių elektrinių prietaisų didmeninė prekyba - radijo ir televizijos aparatūros didmeninė prekyba - fotografijos ir optinių prekių didmeninė prekyba - elektrinių šildymo prietaisų didmeninė prekyba - įrašytų garsajuosčių ir vaizdajuosčių, kompaktinių diskų (CD), skaitmeninių vaizdo diskų (DVD) didmeninė prekyba Į šią klasę neįeina: - neįrašytų garsajuosčių ir vaizdajuosčių, kompaktinių diskų (CD), skaitmeninių vaizdo diskų (DVD) didmeninė prekyba, žr. 46.52 - siuvimo mašinų didmeninė prekyba, žr. 46.64 @lt
scope note: Данная группа включает оптовую торговлю информационными и коммуникационными технологиями и оборудованием, т.е. телекоммуникационным оборудованием и запчастями к нему. @ru
scope note: Bu sınıf aşağıdakileri kapsamaktadır; - elektrikli ev aletlerinin toptan ticareti, - radyo ve televizyon toptan ticareti, - fotoğraf malzemeleri ile optik malzemelerin toptan ticareti, - elektrikli ısıtma cihazlarının toptan ticareti, - kayıtlı ses ve video kasetler, CD`ler ve DVD`lerin toptan ticareti. Kapsam dışı olanlar; - boş ses ve video kasetler, CD`ler ve DVD`lerin toptan ticareti, bkz. 46.52, - dikiş makinelerinin toptan ticareti, bkz. 46.64. @tr
preferred label: Търговия на едро с битова електроника и електроуреди @bg
preferred label: Velkoobchod s elektrospotřebiči a elektronikou převážně pro domácnost @cs
preferred label: Engroshandel med elektriske husholdningsartikler @da
preferred label: Großhandel mit Foto- und optischen Erzeugnissen, elektrischen Haushaltsgeräten und Geräten der Unterhaltungselektronik @de
preferred label: Χονδρικό εμπόριο ηλεκτρικών οικιακών συσκευών @el
preferred label: Comercio al por mayor de aparatos electrodomésticos @es
preferred label: Elektriliste kodumasinate hulgimüük @et
preferred label: Kodinkoneiden tukkukauppa @fi
preferred label: Commerce de gros d'appareils électroménagers @fr
preferred label: Elektronikus háztartási cikk nagykereskedelme
preferred label: Commercio all'ingrosso di elettrodomestici @it
preferred label: Elektrinių buitinių aparatų arba prietaisų didmeninė prekyba @lt
preferred label: Elektrisko mājsaimniecības ierīču vairumtirdzniecība @lv
preferred label: Bejgħ bl-ingrossa ta' apparat domestiku ta' l-elettriku @mt
preferred label: Groothandel in elektrische huishoudelijke apparaten @nl
preferred label: Engroshandel med elektriske husholdningsapparater @no
preferred label: Sprzedaż hurtowa elektrycznych artykułów użytku domowego @pl
preferred label: Comércio por grosso de electrodomésticos @pt
preferred label: Comerţ cu ridicata al aparatelor electrice de uz gospodăresc, al aparatelor de radio şi televizoarelor @ro
preferred label: Оптовая торговля бытовыми электротоварами @ru
preferred label: Veľkoobchod s elektrickými zariadeniami pre domácnosť @sk
preferred label: Trgovina na debelo z električnimi gospodinjskimi napravami @sl
preferred label: Partihandel med hushållsapparater, samt elartiklar @sv
preferred label: Elektrikli ev aletleri toptan ticareti @tr
broader: Wholesale of household goods

Wholesale of china and glassware and cleaning materials
type: Concept
notation: 46.44
status: valid
status modified: 2013-10-18
accepted date: 2013-10-18
in scheme: Statistical Classification of Economic Activities in the European Community, Rev. 2 (2008)
scope note: - търговия на едро с порцеланови и стъкларски изделия - търговия на едро с почистващи препарати @bg
scope note: Z: - velkoobchod s porcelánovými a skleněnými výrobky - velkoobchod s čisticími prostředky @cs
scope note: Diese Klasse umfasst: - Großhandel mit keramischen Erzeugnissen und Glaswaren - Großhandel mit Wasch-, Putz- und Reinigungsmitteln @de
scope note: This class includes: - wholesale of china and glassware - wholesale of cleaning materials @en
scope note: Esta clase comprende: - el comercio al por mayor de porcelana y cristalería - el comercio al por mayor de artículos de limpieza @es
scope note: Cette classe comprend: - le commerce de gros de porcelaine et de verrerie - le commerce de gros de produits d’entretien @fr
scope note: Ovaj razred uključuje: - trgovinu na veliko porculanom i staklom - trgovinu na veliko sredstvima za čišćenje
scope note: Į šią klasę įeina: - porceliano ir stiklo dirbinių didmeninė prekyba - valymo priemonių didmeninė prekyba @lt
scope note: Этот класс включает: - оптовую торговлю компьютерами и периферийным компьютерным оборудованием - оптовую торговлю программным обеспечением Этот класс исключает: - оптовую торговлю электронными компонентами, см. 46.52 - оптовую торговлю офисной техникой и оборудованием (за исключением компьютеров и периферийного оборудования), см. 46.66 @ru
scope note: Bu bölüm aşağıdakileri kapsamaktadır; - porselen ve cam eşya toptan ticareti, - temizleme maddelerinin toptan ticareti. @tr
preferred label: Търговия на едро с порцеланови и стъкларски изделия и почистващи препарати @bg
preferred label: Velkoobchod s porcelánovými, keramickými a skleněnými výrobky a čisticími prostředky @cs
preferred label: Engroshandel med porcelæns- og glasvarer og rengøringsmidler @da
preferred label: Großhandel mit keramischen Erzeugnissen, Glaswaren und Reinigungsmitteln @de
preferred label: Χονδρικό εμπόριο ειδών πορσελάνης και γυαλικών και υλικών καθαρισμού @el
preferred label: Comercio al por mayor de porcelana, cristalería y artículos de limpieza @es
preferred label: Portselani ja klaastoodete ning puhastusvahendite hulgimüük @et
preferred label: Posliini-, lasi- ja muiden taloustavaroiden sekä puhdistusaineiden tukkukauppa @fi
preferred label: Commerce de gros de vaisselle, verrerie et produits d'entretien @fr
preferred label: Porcelán-, üvegáru-, tisztítószer-nagykereskedelem
preferred label: Commercio all'ingrosso di articoli di porcellana e di vetro e di prodotti per la pulizia @it
preferred label: Porceliano ir stiklo dirbinių bei valymo priemonių didmeninė prekyba @lt
preferred label: Porcelāna, stikla izstrādājumu un tīrīšanas līdzekļu vairumtirdzniecība @lv
preferred label: Bejgħ bl-ingrossa ta' kina u oġġetti tal-ħġieġ u materjal għat-tindif @mt
preferred label: Groothandel in porselein, glaswerk en reinigingsmiddelen @nl
preferred label: Engroshandel med kjøkkenutstyr, glass, steintøy og rengjøringsmidler @no
preferred label: Sprzedaż hurtowa wyrobów porcelanowych, ceramicznych i szklanych oraz środków czyszczących @pl
preferred label: Comércio por grosso de louças em cerâmica e em vidro e produtos de limpeza @pt
preferred label: Comerţ cu ridicata al produselor din ceramică, sticlărie, şi produse de întreţinere @ro
preferred label: Оптовая торговля фарфором, стеклянной посудой и чистящими средствами @ru
preferred label: Veľkoobchod s porcelánom a sklom a čistiacimi prostriedkami @sk
preferred label: Trgovina na debelo s porcelanom, steklenino, čistili @sl
preferred label: Partihandel med glas och porslin, rengöringsmedel @sv
preferred label: Porselen ve cam eşya ile temizlik maddelerinin toptan ticareti @tr
broader: Wholesale of household goods

Wholesale of perfume and cosmetics
type: Concept
notation: 46.45
status: valid
status modified: 2013-10-18
accepted date: 2013-10-18
in scheme: Statistical Classification of Economic Activities in the European Community, Rev. 2 (2008)
scope note: - търговия на едро с парфюмерийни и козметични стоки и сапуни @bg
scope note: Z: - velkoobchod s parfémy, kosmetikou a mýdly @cs
scope note: Diese Klasse umfasst: - Großhandel mit Parfümeriewaren, Körperpflegemitteln und Seifen @de
scope note: This class includes: - wholesale of perfumeries, cosmetics and soaps @en
scope note: Esta clase comprende: - el comercio al por mayor de perfumería, productos de belleza y jabones @es
scope note: Cette classe comprend: - le commerce de gros de parfumerie, de produits de beauté et de savons @fr
scope note: Ovaj razred uključuje: - trgovinu na veliko parfemima, kozmetikom i sapunima
scope note: Į šią klasę įeina: - kvepalų, kosmetikos priemonių ir muilo didmeninė prekyba @lt
scope note: Этот класс включает: - оптовую торговлю электронными клапанами и трубками - оптовую торговлю полупроводниковыми приборами - оптовую торговлю микрочипами и интегральными микросхемами - оптовую торговлю печатными электронными схемами - оптовую торговлю чистыми аудио и видеопленками и дискетами, магнитными и оптическими дисками (CD, DVD) - оптовую торговлю телефонным и коммуникационным оборудованием Этот класс исключает: - оптовую торговлю аудио и видеопленками с записью, дисками CD, DVD, см. 46.43 - оптовую торговлю компьютерами и периферийным компьютерным оборудованием, см. 46.51 @ru
scope note: Bu sınıf aşağıdakileri kapsamaktadır; - parfümlerin, kozmetik ürünlerin ve sabunların toptan ticareti. @tr
preferred label: Търговия на едро с парфюмерийни и козметични стоки @bg
preferred label: Velkoobchod s kosmetickými výrobky @cs
preferred label: Engroshandel med parfumerivarer og kosmetik @da
preferred label: Großhandel mit kosmetischen Erzeugnissen und Körperpflegemitteln @de
preferred label: Χονδρικό εμπόριο αρωμάτων και καλλυντικών @el
preferred label: Comercio al por mayor de productos de perfumería y cosmética @es
preferred label: Parfüümide ja kosmeetika hulgimüük @et
preferred label: Hajuvesien ja kosmetiikan tukkukauppa @fi
preferred label: Commerce de gros de parfumerie et de produits de beauté @fr
preferred label: Illatszer nagykereskedelme
preferred label: Commercio all'ingrosso di profumi e cosmetici @it
preferred label: Kvepalų ir kosmetikos priemonių didmeninė prekyba @lt
preferred label: Smaržu un kosmētikas līdzekļu vairumtirdzniecība @lv
preferred label: Bejgħ bl-ingrossa ta' fwieħa u kożmetiċi @mt
preferred label: Groothandel in parfumerieën en cosmetica @nl
preferred label: Engroshandel med parfyme og kosmetikk @no
preferred label: Sprzedaż hurtowa perfum i kosmetyków @pl
preferred label: Comércio por grosso de perfumes e de produtos de higiene @pt
preferred label: Comerţ cu ridicata al produselor cosmetice şi de parfumerie @ro
preferred label: Оптовая торговля парфюмерией и косметикой @ru
preferred label: Veľkoobchod s parfumérskym a kozmetickým tovarom @sk
preferred label: Trgovina na debelo s parfumi in kozmetiko @sl
preferred label: Partihandel med parfym och kosmetika @sv
preferred label: Parfüm ve kozmetik ürünlerinin toptan ticareti @tr
broader: Wholesale of household goods

Wholesale of pharmaceutical goods
type: Concept
notation: 46.46
status: valid
status modified: 2013-10-18
accepted date: 2013-10-18
in scheme: Statistical Classification of Economic Activities in the European Community, Rev. 2 (2008)
scope note: - търговия на едро с медицински инструменти и апарати за лекарски кабинети и болници - търговия на едро с биостимулиращи средства, диагностични реактиви, ваксини - търговия на едро с марли, бинтове и други изделия @bg
scope note: Z: - velkoobchod s farmaceutickými a zdravotnickými výrobky @cs
scope note: Diese Klasse umfasst: - Großhandel mit pharmazeutischen Erzeugnissen und medizinischen Hilfsmitteln @de
scope note: This class includes: - wholesale of pharmaceutical and medical goods @en
scope note: Esta clase comprende: - el comercio al por mayor de productos farmacéuticos y artículos médicos @es
scope note: Cette classe comprend: - le commerce de détail de produits pharmaceutiques et médicaux @fr
scope note: Ovaj razred uključuje: - trgovinu na veliko farmaceutskim i medicinskim proizvodima
scope note: Į šią klasę įeina: - farmacijos ir medicinos prekių didmeninė prekyba @lt
scope note: Данная группа включает оптовую торговлю специализированной техникой, оборудованием и запасными частями для различных отраслей промышленности и оборудованием общего назначения. @ru
scope note: Bu sınıf aşağıdakileri kapsamaktadır; - ecza ve tıbbi ürünlerin toptan ticareti. @tr
preferred label: Търговия на едро с фармацевтични стоки, медицинска техника и апаратура @bg
preferred label: Velkoobchod s farmaceutickými výrobky @cs
preferred label: Engroshandel med medicinalvarer @da
preferred label: Großhandel mit pharmazeutischen, medizinischen und orthopädischen Erzeugnissen @de
preferred label: Χονδρικό εμπόριο φαρμακευτικών προϊόντων @el
preferred label: Comercio al por mayor de productos farmacéuticos @es
preferred label: Farmaatsiatoodete hulgimüük @et
preferred label: Farmaseuttisten tuotteiden tukkukauppa @fi
preferred label: Commerce de gros de produits pharmaceutiques @fr
preferred label: Gyógyszer, gyógyászati termék nagykereskedelme
preferred label: Commercio all'ingrosso di prodotti farmaceutici @it
preferred label: Farmacijos prekių didmeninė prekyba @lt
preferred label: Farmaceitisko izstrādājumu vairumtirdzniecība @lv
preferred label: Bejgħ bl-ingrossa ta' oġġetti farmaċewtiċi @mt
preferred label: Groothandel in farmaceutische producten @nl
preferred label: Engroshandel med sykepleie- og apotekvarer @no
preferred label: Sprzedaż hurtowa wyrobów farmaceutycznych i medycznych @pl
preferred label: Comércio por grosso de produtos farmacêuticos @pt
preferred label: Comerţ cu ridicata al produselor farmaceutice @ro
preferred label: Оптовая торговля фармацевтическими товарами @ru
preferred label: Veľkoobchod s farmaceutickým tovarom @sk
preferred label: Trgovina na debelo s farmacevtskimi izdelki ter medicinskimi potrebščinami in materiali @sl
preferred label: Partihandel med medicinsk utrustning och apoteksvaror @sv
preferred label: Eczacılık ürünlerinin toptan ticareti @tr
broader: Wholesale of household goods

Wholesale of furniture, carpets and lighting equipment
type: Concept
notation: 46.47
status: valid
status modified: 2013-10-18
accepted date: 2013-10-18
in scheme: Statistical Classification of Economic Activities in the European Community, Rev. 2 (2008)
scope note: - търговия на едро с мебели - търговия на едро с килими - търговия на едро с осветители и части за тях - търговия на едро с офис мебели - 46.65 @bg
scope note: Z: - velkoobchod s nábytkem - velkoobchod s koberci - velkoobchod se svítidly N: - velkoobchod s kancelářským nábytkem (46.65) @cs
scope note: Diese Klasse umfasst: - Großhandel mit Wohnmöbeln - Großhandel mit Teppichen - Großhandel mit Lampen und Leuchten Diese Klasse umfasst nicht: - Großhandel mit Büromöbeln (s. 46.65) @de
scope note: This class includes: - wholesale of household furniture - wholesale of carpets - wholesale of lighting equipment This class excludes: - wholesale of office furniture, see 46.65 @en
scope note: Esta clase comprende: - el comercio al por mayor de muebles - el comercio al por mayor de alfombras - el comercio al por mayor de equipos de iluminación Esta clase no comprende: - el comercio al por mayor de mobiliario de oficina (véase 46.65) @es
scope note: Cette classe comprend: - le commerce de gros de mobilier domestique - le commerce de gros de tapis - le commerce de gros d’appareils d’éclairage Cette classe ne comprend pas: - le commerce de gros de mobilier de bureau, voir 46.65 @fr
scope note: Ovaj razred uključuje: - trgovinu na veliko namještajem za kućanstvo - trgovinu na veliko sagovima - trgovinu na veliko opremom za rasvjetu Ovaj razred isključuje: - trgovinu na veliko uredskim namještajem, vidi 46.65
scope note: Į šią klasę įeina: - buitinių baldų didmeninė prekyba - kilimų didmeninė prekyba - apšvietimo įrangos didmeninė prekyba Į šią klasę neįeina: - įstaigos baldų didmeninė prekyba, žr. 46.65 @lt
scope note: Этот класс включает: - оптовую торговлю сельскохозяйственной техникой и оборудованием: • плугами, распределителями навоза, сеялками • уборочными машинами • молотилками • доильными аппаратами • птицеводческой, пчеловодческой техникой • тракторами, используемыми в сельском и лесном хозяйствах Этот класс также включает: - оптовую торговлю газонокосилками @ru
scope note: Bu bölüm aşağıdakileri kapsamaktadır; - ev mobilyalarının toptan ticareti, - halı toptan ticareti, - aydınlatma ekipmanlarının toptan ticareti. Kapsam dışı olanlar; - ofis mobilyalarının toptan ticareti, bkz. 46.65. @tr
preferred label: Търговия на едро с мебели, килими и осветители @bg
preferred label: Velkoobchod s nábytkem, koberci a svítidly @cs
preferred label: Engroshandel med møbler, tæpper og belysningsartikler @da
preferred label: Großhandel mit Möbeln, Teppichen, Lampen und Leuchten @de
preferred label: Χονδρικό εμπόριο επίπλων, χαλιών και φωτιστικών @el
preferred label: Comercio al por mayor de muebles, alfombras y aparatos de iluminación @es
preferred label: Mööbli, vaipade ja valgustite hulgimüük @et
preferred label: Huonekalujen, mattojen ja valaisimien tukkukauppa @fi
preferred label: Commerce de gros de meubles, de tapis et d'appareils d'éclairage @fr
preferred label: Bútor, szőnyeg, világító berendezés nagykereskedelme
preferred label: Commercio all'ingrosso di mobili, tappeti e articoli per l'illuminazione @it
preferred label: Baldų, kilimų ir apšvietimo įrangos didmeninė prekyba @lt
preferred label: Mēbeļu, paklāju un apgaismes ierīču vairumtirdzniecība @lv
preferred label: Bejgħ bl-ingrossa ta' għamara, twapet u tagħmir għad-dawl @mt
preferred label: Groothandel in meubelen, vloerbedekking en verlichtingsbenodigdheden @nl
preferred label: Engroshandel med møbler, gulvbelegg, gulvtepper og belysningsutstyr @no
preferred label: Sprzedaż hurtowa mebli, dywanów i sprzętu oświetleniowego @pl
preferred label: Comércio por grosso de móveis para uso doméstico, carpetes, tapetes e artigos de iluminação @pt
preferred label: Comerţ cu ridicata al mobilei, covoarelor şi a articolelor de iluminat @ro
preferred label: Оптовая торговля мебелью, коврами и осветительным оборудованием @ru
preferred label: Veľkoobchod s nábytkom, kobercami a svietidlami @sk
preferred label: Trgovina na debelo s pohištvom, preprogami in svetili @sl
preferred label: Partihandel med möbler, mattor och belysningsartiklar @sv
preferred label: Mobilya, halı ve aydınlatma ekipmanlarının toptan ticareti @tr
broader: Wholesale of household goods

Wholesale of watches and jewellery
type: Concept
notation: 46.48
status: valid
status modified: 2013-10-18
accepted date: 2013-10-18
in scheme: Statistical Classification of Economic Activities in the European Community, Rev. 2 (2008)
scope note: Этот класс включает: - оптовую торговлю механическими станками любого типа и для любого материала Этот класс также включает: - оптовую торговлю механическими станками с компьютерным управлением @ru
preferred label: Търговия на едро с часовници и бижутерия @bg
preferred label: Velkoobchod s hodinami, hodinkami a klenoty @cs
preferred label: Engroshandel med ure, smykker og guld- og sølvvarer @da
preferred label: Großhandel mit Uhren und Schmuck @de
preferred label: Χονδρικό εμπόριο ρολογιών και κοσμημάτων @el
preferred label: Comercio al por mayor de artículos de relojería y joyería @es
preferred label: Kellade ja ehete hulgimüük @et
preferred label: Kellojen ja korujen tukkukauppa @fi
preferred label: Commerce de gros d'articles d'horlogerie et de bijouterie @fr
preferred label: Óra-, ékszer-nagykereskedelem
preferred label: Commercio all'ingrosso di orologi e di gioielleria @it
preferred label: Laikrodžių, papuošalų ir juvelyrinių dirbinių didmeninė prekyba @lt
preferred label: Pulksteņu un juvelierizstrādājumu vairumtirdzniecība @lv
preferred label: Bejgħ bl-ingrossa ta' arloġġi ta' l-idejn u ġojjelli @mt
preferred label: Groothandel in uurwerken en sieraden @nl
preferred label: Engroshandel med klokker, ur, gull- og sølvvarer @no
preferred label: Sprzedaż hurtowa zegarków, zegarów i biżuterii @pl
preferred label: Comércio por grosso de relógios e de artigos de ourivesaria e joalharia @pt
preferred label: Comerţ cu ridicata al ceasurilor şi bijuteriilor @ro
preferred label: Оптовая торговля часами и ювелирными украшениями @ru
preferred label: Veľkoobchod s hodinami a šperkami @sk
preferred label: Trgovina na debelo z urami in nakitom @sl
preferred label: Partihandel med ur och guldsmedsvaror @sv
preferred label: Saat ve mücevher toptan ticareti @tr
broader: Wholesale of household goods

Wholesale of other household goods
type: Concept
notation: 46.49
status: valid
status modified: 2013-10-18
accepted date: 2013-10-18
in scheme: Statistical Classification of Economic Activities in the European Community, Rev. 2 (2008)
scope note: - търговия на едро с кошничарски изделия и изделия от дърво и корк - търговия на едро с велосипеди, части и принадлежности за тях - търговия на едро с книги, вестници, списания и канцеларски стоки - търговия на едро с кожени изделия и пътни принадлежности - търговия на едро с музикални инструменти и партитури - търговия на едро с игри и играчки - търговия на едро със спортни стоки, вкл. обувки за ски и ски бягане - търговия на едро със спортно облекло - 46.42 @bg
scope note: Z: - velkoobchod s výrobky ze dřeva, proutí, korku atd. - velkoobchod s jízdními koly a jejich díly a příslušenstvím - velkoobchod s papírnickým zbožím, knihami, časopisy a novinami - velkoobchod s koženým zbožím a cestovními doplňky - velkoobchod s hudebními nástroji - velkoobchod s hrami a hračkami - velkoobchod se sportovními potřebami, včetně speciální sportovní obuví, např. lyžařskými botami @cs
scope note: Diese Klasse umfasst: - Großhandel mit Holz-, Korb-, Flecht- und Korkwaren - Großhandel mit Fahrrädern und Fahrradzubehör - Großhandel mit Papier- und Schreibwaren, Büchern, Zeitschriften und Zeitungen - Großhandel mit Lederwaren und Reiseaccessoires - Großhandel mit Musikinstrumenten - Großhandel mit Spielwaren - Großhandel mit Sportartikeln, einschließlich spezieller Sportschuhe wie z. B. Skischuhe @de
scope note: This class includes: - wholesale of woodenware, wickerwork and corkware etc. - wholesale of bicycles and their parts and accessories - wholesale of stationery, books, magazines and newspapers - wholesale of leather goods and travel accessories - wholesale of musical instruments - wholesale of games and toys - wholesale of sports goods, including special sports footwear such as ski boots @en
scope note: Esta clase comprende: - el comercio al por mayor de artículos de madera, mimbres, corchos, etc. - el comercio al por mayor de bicicletas y sus repuestos y accesorios - el comercio al por mayor de material de escritorio, libros, revistas y periódicos - el comercio al por mayor de artículos de cuero y accesorios de viaje - el comercio al por mayor de instrumentos musicales - el comercio al por mayor de juegos y juguetes - el comercio al por mayor de artículos de deporte, incluido el calzado deportivo especial, como las botas de esquí @es
scope note: Cette classe comprend: - le commerce de gros d’ouvrages en bois, vannerie et liège, etc. - le commerce de gros de cycles et de leurs pièces et accessoires - le commerce de gros de papeterie, de livres, de journaux et de périodiques - le commerce de gros d’articles de maroquinerie et d’accessoires de voyage - le commerce de gros d’instruments de musique - le commerce de gros de jeux et jouets - le commerce de gros d’articles de sport, y compris de chaussures spéciales de sport, telles que des chaussures de ski @fr
scope note: Ovaj razred uključuje: - trgovinu na veliko drvenim, pletarskim i plutenim proizvodima itd. - trgovinu na veliko biciklima te njihovim dijelovima i priborom - trgovinu na veliko papirnatom robom, knjigama, časopisima i novinama - trgovinu na veliko proizvodima od kože i priborom za putovanja - trgovinu na veliko glazbenim instrumentima - trgovinu na veliko igrama i igračkama - trgovinu na veliko sportskom opremom, uključujući specijalnu sportsku obuću kao što su skijaške cipele (pancerice)
scope note: Į šią klasę įeina: - medienos dirbinių, pintinių dirbinių, kamštienos ir kt. dirbinių didmeninė prekyba - dviračių ir jų atsarginių dalių bei pagalbinių reikmenų didmeninė prekyba - raštinės reikmenų, knygų, žurnalų ir laikraščių didmeninė prekyba - odinių prekių ir kelionės reikmenų didmeninė prekyba - muzikos instrumentų didmeninė prekyba - žaidimų ir žaislų didmeninė prekyba - sporto prekių, įskaitant specialiąją sportinę avalynę, tokią kaip slidžių batai, didmeninė prekyba - neelektrinių namų ūkio prietaisų didmeninė prekyba @lt
scope note: Bu bölüm aşağıdakileri kapsamaktadır; - tahta işi, hasır işi, mantar işi ve benzeri eşyaların toptan ticareti, - bisikletler ve bisiklet parçaları ile aksesuarlarının toptan ticareti, - kırtasiye malzemeleri, kitaplar, dergiler ve gazetelerin toptan ticareti, - deri eşyalarının ve seyahat eşyalarının toptan ticareti, - müzik enstrümanlarının toptan ticareti, - oyunlar ve oyuncakların toptan ticareti, - kayak botları gibi özel spor ayakkabıları da dahil, spor eşyalarının toptan ticareti. @tr
preferred label: Търговия на едро с други нехранителни потребителски стоки @bg
preferred label: Velkoobchod s ostatními výrobky převážně pro domácnost @cs
preferred label: Engroshandel med andre husholdningsartikler @da
preferred label: Großhandel mit sonstigen Gebrauchs- und Verbrauchsgütern @de
preferred label: Χονδρικό εμπόριο άλλων ειδών οικιακής χρήσης @el
preferred label: Comercio al por mayor de otros artículos de uso doméstico @es
preferred label: Muude kodutarvete hulgimüük @et
preferred label: Muiden taloustavaroiden tukkukauppa @fi
preferred label: Commerce de gros d'autres biens domestiques @fr
preferred label: Egyéb háztartási cikk nagykereskedelme m.n.s.
preferred label: Commercio all'ingrosso di altri beni di consumo @it
preferred label: Kitų namų ūkio reikmenų didmeninė prekyba @lt
preferred label: Citu mājsaimniecības preču vairumtirdzniecība @lv
preferred label: Bejgħ bl-ingrossa ta' oġġetti oħra għad-dar @mt
preferred label: Groothandel in andere consumentenartikelen @nl
preferred label: Engroshandel med husholdningsvarer og varer til personlig bruk ellers @no
preferred label: Sprzedaż hurtowa pozostałych artykułów użytku domowego @pl
preferred label: Outro comércio por grosso de bens de consumo @pt
preferred label: Comerţ cu ridicata al altor bunuri de uz gospodăresc @ro
preferred label: Оптовая торговля прочими бытовыми товарами @ru
preferred label: Veľkoobchod s ostatným tovarom pre domácnosť @sk
preferred label: Trgovina na debelo z drugimi izdelki široke porabe @sl
preferred label: Partihandel med andra hushållsvaror @sv
preferred label: Diğer ev eşyalarının toptan ticareti @tr
broader: Wholesale of household goods

Wholesale of information and communication equipment
type: Concept
notation: 46.5
status: valid
status modified: 2013-10-18
accepted date: 2013-10-18
in scheme: Statistical Classification of Economic Activities in the European Community, Rev. 2 (2008)
scope note: Тази група включва търговия на едро с компютри, комуникационна техника и електронни елементи. @bg
scope note: Tato skupina zahrnuje velkoobchod se zařízením informačně komunikačních technologií (ICT), tj. s počítači, telekomunikačním zařízením a jejich díly. @cs
scope note: Diese Gruppe umfasst den Großhandel mit Geräten der Informations- und Kommunikationstechnik (IKT), d. h. mit Datenverarbeitungsgeräten, Telekommunikationsgeräten und elektronischen Bauteilen. @de
scope note: This group includes the wholesale of information and communications technology (ICT) equipment, i.e. computers, telecommunications equipment and parts. @en
scope note: Este grupo comprende el comercio al por mayor de equipos relacionados con las tecnologías de la información y la comunicación (TIC), es decir, ordenadores, equipos y componentes para telecomunicaciones. @es
scope note: Ce groupe comprend le commerce de gros d’équipements des technologies de l’information et de la communication (TIC), c’est-à-dire des ordinateurs, des équipements de télécommunication et des pièces. @fr
scope note: Ova skupina uključuje trgovinu na veliko opremom informacijske i komunikacijske tehnologije tj. računalima, telekomunikacijskom opremom i dijelovima.
scope note: Į šią grupę įeina informacijos ir ryšių technologijų įrangos (IRT), t.y. kompiuterių, telekomunikacijos įrangos ir jų dalių, didmeninė prekyba. @lt
scope note: Этот класс также включает: - оптовую торговлю техникой для текстильной промышленности и прядильно-вязальными машинами с компьютерным управлением @ru
scope note: Bu grup, bilgisayarlar, telekomünikasyon teçhizatı ve parçaları gibi bilgi ve iletişim teknolojisi teçhizatının toptan ticaretini kapsamaktadır. @tr
preferred label: Търговия на едро с компютърна и комуникационна техника @bg
preferred label: Velkoobchod s počítačovým a komunikačním zařízením @cs
preferred label: Engroshandel med informations- og kommunikationsudstyr @da
preferred label: Großhandel mit Geräten der Informations- und Kommunikationstechnik @de
preferred label: Χονδρικό εμπόριο εξοπλισμού πληροφοριακών και επικοινωνιακών συστημάτων @el
preferred label: Comercio al por mayor de equipos para las tecnologías de la información y las comunicaciones @es
preferred label: Info- ja sidetehnika hulgimüük @et
preferred label: Tieto- ja viestintäteknisten laitteiden tukkukauppa @fi
preferred label: Commerce de gros d'équipements de l'information et de la communication @fr
preferred label: Információtechnológiai, híradástechnikai termék nagykereskedelme
preferred label: Commercio all'ingrosso di apparecchiature ICT @it
preferred label: Informacijos ir ryšių technologijų (IRT) įrangos didmeninė prekyba @lt
preferred label: Informācijas un komunikāciju tehnoloģiju iekārtu vairumtirdzniecība @lv
preferred label: Bejgħ bl-ingrossa ta' tagħmir ta' l-informatika u tal-komunikazzjoni @mt
preferred label: Groothandel in informatie- en communicatieapparatuur @nl
preferred label: Engroshandel med IKT-utstyr @no
preferred label: Sprzedaż hurtowa narzędzi informacyjnych i komunikacyjnych @pl
preferred label: Comércio por grosso de equipamento das tecnologias da informação e comunicação @pt
preferred label: Comerţ cu ridicata al echipamentului informatic şi de telecomunicaţii @ro
preferred label: Оптовая торговля информационным и коммуникационным оборудованием @ru
preferred label: Veľkoobchod so zariadeniami pre informatiku a komunikácie – IKT @sk
preferred label: Trgovina na debelo z napravami za informacijsko- komunikacijsko tehnologijo @sl
preferred label: Partihandel med informations- och kommunikationsutrustning @sv
preferred label: Bilgi ve iletişim teknolojisi ekipmanlarının toptan ticareti @tr
broader: Wholesale trade, except of motor vehicles and motorcycles
narrower: Wholesale of computers, computer peripheral equipment and software
narrower: Wholesale of electronic and telecommunications equipment and parts

Wholesale of computers, computer peripheral equipment and software
type: Concept
notation: 46.51
status: valid
status modified: 2013-10-18
accepted date: 2013-10-18
in scheme: Statistical Classification of Economic Activities in the European Community, Rev. 2 (2008)
scope note: - търговия на едро с компютри и периферни устройства за тях - търговия на едро със софтуер - търговия на едро с електронни елементи и оборудване - 46.52 - търговия на едро с офис техника (с изключение на компютри и периферни устройства за тях) - 46.66 @bg
scope note: Z: - velkoobchod s počítači a počítačovým periferním zařízením - velkoobchod se softwarem N: - velkoobchod s elektronickými díly (46.52) - velkoobchod s kancelářskými stroji a zařízením do kanceláří, kromě počítačů a počítačových periferních zařízení (46.66) @cs
scope note: Diese Klasse umfasst: - Großhandel mit Datenverarbeitungsgeräten und peripheren Geräten - Großhandel mit Software Diese Klasse umfasst nicht: - Großhandel mit elektronischen Bauteilen (s. 46.52) - Großhandel mit Büromaschinen (ohne Datenverarbeitungsgeräte und periphere Geräte) (s. 46.66) @de
scope note: This class includes: - wholesale of computers and computer peripheral equipment - wholesale of software This class excludes: - wholesale of electronic parts, see 46.52 - wholesale of office machinery and equipment, (except computers and peripheral equipment), see 46.66 @en
scope note: Esta clase comprende: - el comercio al por mayor de ordenadores y periféricos - el comercio al por mayor de programas informáticos Esta clase no comprende: - el comercio al por mayor de componentes electrónicos (véase 46.52) - el comercio al por mayor de máquinas y equipos de oficina (excepto ordenadores y periféricos) (véase 46.66) @es
scope note: Cette classe comprend: - le commerce de gros d’ordinateurs et d’équipements périphériques - le commerce de gros de logiciels Cette classe ne comprend pas: - le commerce de gros de composants électroniques, voir 46.52 - le commerce de gros de machines et d’équipements de bureau (à l’exception des ordinateurs et des équipements périphériques), voir 46.66 @fr
scope note: Ovaj razred uključuje: - trgovinu na veliko računalima i računalnom perifernom opremom - trgovinu na veliko softverom Ovaj razred isključuje: - trgovinu na veliko elektroničkim dijelovima, vidi 46.52 - trgovinu na veliko uredskim strojevima i opremom (osim računala i periferne opreme), vidi 46.66
scope note: Į šią klasę įeina: - kompiuterių ir jų išorinės įrangos didmeninė prekyba - programinės įrangos didmeninė prekyba Į šią klasę neįeina: - elektroninių dalių didmeninė prekyba, žr. 46.52 - įstaigos mašinų ir įrangos (išskyrus kompiuterius ir išorinę įrangą) didmeninė prekyba, žr. 46.66 @lt
scope note: Этот класс включает: - оптовые торговые услуги, имеющие отношение к: • товарам, классифицированным в классе 31.01 (Производство офисной и торговой мебели) @ru
scope note: Bu sınıf aşağıdakileri kapsamaktadır; - bilgisayarların ve bilgisayar çevre donanımlarının toptan ticareti, - bilgisayar yazılımının toptan ticareti. Kapsam dışı olanlar; - elektronik parçaların toptan ticareti, bkz. 46.52, - büro makine ve teçhizatlarının toptan ticareti, (bilgisayarlar ve çevre donanımları hariç), bkz. 46.66. @tr
preferred label: Търговия на едро с компютри, периферни устройства за тях и програмни продукти @bg
preferred label: Velkoobchod s počítači, počítačovým periferním zařízením a softwarem @cs
preferred label: Engroshandel med computere, ydre enheder og software @da
preferred label: Großhandel mit Datenverarbeitungsgeräten, peripheren Geräten und Software @de
preferred label: Χονδρικό εμπόριο ηλεκτρονικών υπολογιστών, περιφερειακού εξοπλισμού υπολογιστών και λογισμικού @el
preferred label: Comercio al por mayor de ordenadores, equipos periféricos y programas informáticos @es
preferred label: Arvutite, arvuti välisseadmete ja tarkvara hulgimüük @et
preferred label: Tietokoneiden, oheislaitteiden ja ohjelmistojen tukkukauppa @fi
preferred label: Commerce de gros d'ordinateurs, d'équipements informatiques périphériques et de logiciels @fr
preferred label: Számítógép, periféria, szoftver nagykereskedelme
preferred label: Commercio all'ingrosso di computer, apparecchiature informatiche periferiche e di software @it
preferred label: Kompiuterių, jų išorinės ir programinės įrangos didmeninė prekyba @lt
preferred label: Datoru, to perifēro iekārtu un programmatūras vairumtirdzniecība @lv
preferred label: Bejgħ bl-ingrossa ta' kompjuters, tagħmir periferali tal-kompjuter u softwer @mt
preferred label: Groothandel in computers, randapparatuur en software @nl
preferred label: Engroshandel med datamaskiner, tilleggsutstyr til datamaskiner samt programvare @no
preferred label: Sprzedaż hurtowa komputerów, urządzeń peryferyjnych i oprogramowania @pl
preferred label: Comércio por grosso de computadores, equipamentos periféricos e programas informáticos @pt
preferred label: Comerţ cu ridicata al calculatoarelor, echipamentelor periferice şi software-lui @ro
preferred label: Оптовая торговля компьютерами, периферийным компьютерным оборудованием и программным обеспечением @ru
preferred label: Veľkoobchod s počítačmi, počítačovými periférnymi zariadeniami a softvérom @sk
preferred label: Trgovina na debelo z računalniškimi napravami @sl
preferred label: Partihandel med datorer och kringutrustning samt programvara @sv
preferred label: Bilgisayar, bilgisayar çevre birimleri ve yazılım toptan ticareti @tr
broader: Wholesale of information and communication equipment

Wholesale of electronic and telecommunications equipment and parts
type: Concept
notation: 46.52
status: valid
status modified: 2013-10-18
accepted date: 2013-10-18
in scheme: Statistical Classification of Economic Activities in the European Community, Rev. 2 (2008)
scope note: - търговия на едро с електронни лампи и тръби - търговия на едро с полупроводникови елементи - търговия на едро с интегрални схеми и електронни микрочипове - търговия на едро с печатни платки - търговия на едро с незаписани аудио- и видеокасети, дискети, компактдискове и цифрови дискове - търговия на едро с телефонни апарати, факсове и друга комуникационна техника - търговия на едро със записани аудио- и видеокасети, компактдискове и цифрови дискове - 46.43 - търговия на едро с компютри и периферни устройства за тях - 46.51 @bg
scope note: Z: - velkoobchod s elektronickými součástkami - velkoobchod s polovodičovými zařízeními - velkoobchod s mikročipy a integrovanými obvody - velkoobchod s tištěnými spoji - velkoobchod s nenahranými audio- a videopásky a disketami, magnetickými a optickými disky (CD a DVD) - velkoobchod s telefonními a komunikačními zařízeními N: - velkoobchod s nahranými audio- a videopásky, CD a DVD (46.43) - velkoobchod s počítači a počítačovým periferním zařízením (46.51) @cs
scope note: Diese Klasse umfasst: - Großhandel mit Elektronenröhren - Großhandel mit Halbleiterbauelementen - Großhandel mit Mikrochips und integrierten Schaltungen - Großhandel mit gedruckten Schaltungen - Großhandel mit unbespielten Ton- und Videobändern und Disketten, magnetischen und optischen CDs und DVDs - Großhandel mit Telefon- und Telekommunikationsgeräten Diese Klasse umfasst nicht: - Großhandel mit bespielten Ton- und Videobändern, CDs und DVDs (s.46.43) - Großhandel mit Datenverarbeitungsgeräten und peripheren Geräten (s. 46.51) @de
scope note: This class includes: - wholesale of electronic valves and tubes - wholesale of semi-conductor devices - wholesale of microchips and integrated circuits - wholesale of printed circuits - wholesale of blank audio and video tapes and diskettes, magnetic and optical disks (CDs, DVDs) - wholesale of telephone and communications equipment This class excludes: - wholesale of recorded audio and video tapes, CDs, DVDs, see 46.43 - wholesale of computers and computer peripheral equipment, see 46.51 @en
scope note: Esta clase comprende: - el comercio al por mayor de válvulas y tubos electrónicos - el comercio al por mayor de semiconductores - el comercio al por mayor de microchips y circuitos integrados - el comercio al por mayor de circuitos impresos - el comercio al por mayor de cintas de audio y vídeo, discos magnéticos y ópticos (CD, DVD) vírgenes - el comercio al por mayor de equipos telefónicos y de comunicación Esta clase no comprende: - el comercio al por mayor de cintas de audio y vídeo, CD y DVD grabados (véase 46.43) - el comercio al por mayor de ordenadores y periféricos (véase 46.51) @es
scope note: Cette classe comprend: - le commerce de gros de tubes et de valves électroniques - le commerce de gros de dispositifs à semi-conducteurs - le commerce de gros de puces électroniques et de circuits intégrés - le commerce de gros de circuits imprimés - le commerce de gros de bandes et disquettes vierges pour le son et l’image, de disques magnétiques et optiques vierges (CD, DVD) - le commerce de gros d’équipements téléphoniques et de communications Cette classe ne comprend pas: - le commerce de gros de cassettes audio et vidéo, de CD, de DVD contenant des enregistrements, voir 46.43 - le commerce de gros d’ordinateurs et d’équipements périphériques, voir 46.51 @fr
scope note: Ovaj razred uključuje: - trgovinu na veliko elektroničkim cijevima - trgovinu na veliko poluvodičkim elementima - trgovinu na veliko mikročipovima i integriranim krugovima - trgovinu na veliko tiskanim krugovima - trgovinu na veliko praznim audio i videovrpcama i disketama, magnetskim i optičkim diskovima (CD-i, DVD-i) - trgovinu na veliko telefonima i komunikacijskom opremom Ovaj razred isključuje: - trgovinu na veliko snimljenim audio i videovrpcama, CD-ima, DVD-ima, vidi 46.43 - trgovinu na veliko računalima i računalnom perifernom opremom, vidi 46.51
scope note: Į šią klasę įeina: - elektroninių lempų ir vamzdžių didmeninė prekyba - puslaidininkinių įtaisų didmeninė prekyba - mikroprocesoriaus lustų ir integrinių grandynų didmeninė prekyba - spausdintinių grandinių didmeninė prekyba - neįrašytų garsajuosčių ir vaizdajuosčių ir diskelių, magnetinių ir optinių diskų (kompaktinių diskų (CD), skaitmeninių vaizdo diskų (DVD)) didmeninė prekyba - telefono ir ryšių įrangos didmeninė prekyba Į šią klasę neįeina: - įrašytų garsajuosčių ir vaizdajuosčių, kompaktinių diskų (CD), skaitmeninių vaizdo diskų (DVD) didmeninė prekyba, žr. 46.43 - kompiuterių ir jų išorinės įrangos didmeninė prekyba, žr. 46.51 @lt
scope note: Этот класс включает: - оптовую торговлю офисной техникой и оборудованием, за исключением компьютеров и компьютерного периферийного оборудования Этот класс исключает: - оптовую торговлю компьютерами и периферийным компьютерным оборудованием, см. 46.51 - оптовую торговлю электронными запчастями, телефонным и коммуникационным оборудованием, см. 46.52 @ru
scope note: Bu sınıf aşağıdakileri kapsamaktadır; - elektronik valflerin ve boruların toptan ticareti, - yarı iletken cihazların toptan ticareti, - mikroçiplerin ve entegre devrelerin toptan ticareti, - baskılı devrelerin toptan ticareti, - boş ses ve video kasetler ile disketlerin, manyetik ve optik disklerin (CD`ler, DVD`ler) toptan ticareti, - telefon ve iletişim ekipmanlarının toptan ticareti. Kapsam dışı olanlar; - kayıtlı ses ve video kasetlerin, CD`lerin, DVD`lerin toptan ticareti, bkz. 46.43, - bilgisayarların ve bilgisayar çevre donanımlarının toptan ticareti, bkz. 46.51. @tr
preferred label: Търговия на едро с електронни елементи и комуникационна техника @bg
preferred label: Velkoobchod s elektronickým a telekomunikačním zařízením a jeho díly @cs
preferred label: Engroshandel med elektronisk udstyr og telekommunikationsudstyr og dele hertil @da
preferred label: Großhandel mit elektronischen Bauteilen und Telekommunikationsgeräten @de
preferred label: Χονδρικό εμπόριο ηλεκτρονικού και τηλεπικοινωνιακού εξοπλισμού και εξαρτημάτων @el
preferred label: Comercio al por mayor de equipos electrónicos y de telecomunicaciones y sus componentes @es
preferred label: Elektroonika- ja telekommunikatsiooniseadmete ning nende osade hulgimüük @et
preferred label: Elektroniikka- ja viestintälaitteiden ja osien tukkukauppa @fi
preferred label: Commerce de gros de composants et d'équipements électroniques et de télécommunication @fr
preferred label: Elektronikus, híradástechnikai berendezés, és alkatrészei nagykereskedelme
preferred label: Commercio all'ingrosso di apparecchiature elettroniche e per telecomunicazioni e di loro componenti @it
preferred label: Elektroninės ir telekomunikacinės įrangos ir jos dalių didmeninė prekyba @lt
preferred label: Elektronisko ierīču, telekomunikāciju iekārtu un to daļu vairumtirdzniecība @lv
preferred label: Bejgħ bl-ingrossa ta' tagħmir u parts ta' l-elettronika u t-telekomunikazzjoni @mt
preferred label: Groothandel in elektronische en telecommunicatieapparatuur en delen daarvan @nl
preferred label: Engroshandel med elektronikkutstyr og telekommunikasjonsutstyr samt deler @no
preferred label: Sprzedaż hurtowa sprzętu elektronicznego i telekomunikacyjnego oraz części do niego @pl
preferred label: Comércio por grosso de equipamentos electrónicos e de telecomunicações e suas partes @pt
preferred label: Comerţ cu ridicata de componente şi echipamente electronice şi de telecomunicaţii @ro
preferred label: Оптовая торговля электронным и телекоммуникационным оборудованием и запчастями к нему @ru
preferred label: Veľkoobchod s elektronickými a telekomunikačnými zariadeniami a ich dielmi @sk
preferred label: Trgovina na debelo z elektronskimi in telekomunikacijskimi napravami in deli @sl
preferred label: Partihandel med elektronik- och telekommunikationsutrustning @sv
preferred label: Elektronik ve telekomünikasyon ekipmanlarının ve parçalarının toptan ticareti @tr
broader: Wholesale of information and communication equipment

Wholesale of other machinery, equipment and supplies
type: Concept
notation: 46.6
status: valid
status modified: 2013-10-18
accepted date: 2013-10-18
in scheme: Statistical Classification of Economic Activities in the European Community, Rev. 2 (2008)
scope note: Tato skupina zahrnuje velkoobchod se speciálními stroji, strojním zařízením a příslušenstvím pro všechna průmyslová odvětví a stroji pro všeobecné použití. @cs
scope note: Diese Gruppe umfasst den Großhandel mit speziellen Maschinen, Ausrüstungen und Zubehör für alle Wirtschaftszweige sowie mit nichtwirtschaftszweigspezifischen Maschinen. @de
scope note: This group includes the wholesale of specialised machinery, equipment and supplies for all kinds of industries and general purpose machinery. @en
scope note: Este grupo comprende la venta al por mayor de maquinaria y equipos especializados para todo tipo de industrias y maquinaria de uso general. @es
scope note: Ce groupe comprend le commerce de gros de machines spéciales, d’équipements et de fournitures pour tout type d’industrie et des machines d’usage général. @fr
scope note: Ova skupina uključuje trgovinu na veliko specijaliziranim strojevima, opremom i priborom za sve vrste industrija te strojevima opće namjene.
scope note: Į šią grupę įeina specialiosios paskirties mašinų, įrangos ir reikmenų, skirtų įvairiomis pramonės rūšimis ir bendrosios paskirties mašinoms, didmeninė prekyba. @lt
scope note: Этот класс включает: - оптовую торговлю транспортным оборудованием, за исключением автомобилей, мотоциклов и велосипедов - оптовую торговлю промышленными роботами - оптовую торговлю электрическим проводом и выключателями, а также прочим установочным оборудованием промышленного использования - оптовую торговлю прочими электротехническими изделиями, такими как электродвигатели, трансформаторы - оптовую торговлю прочим оборудованием (не классифицированным выше), используемым в промышленности (за исключением горнодобывающей, строительной и текстильной отраслей), в торговле, навигации и в других видах деятельности Этот класс также включает: - оптовую торговлю измерительными приборами и оборудованием Этот класс исключает: - оптовую торговлю автомобилями,прицепами и фургонами, см. 45.1 - оптовую продажу автомобильных запчастей, см. 45.31 - оптовую продажу мотоциклов, см. 45.40 - оптовую продажу велосипедов, см. 46.49 @ru
scope note: Bu grup, her çeşit endüstri ve genel amaçlı makineler için özel makine, ekipman, aksam ve parçalarının toptan ticaretini kapsamaktadır. @tr
preferred label: Търговия на едро с други машини и оборудване със стопанско предназначение и части за тях @bg
preferred label: Velkoobchod s ostatními stroji, strojním zařízením a příslušenstvím @cs
preferred label: Engroshandel med andre maskiner, andet udstyr og tilbehør @da
preferred label: Großhandel mit sonstigen Maschinen, Ausrüstungen und Zubehör @de
preferred label: Χονδρικό εμπόριο άλλων μηχανημάτων, εξοπλισμού και προμηθειών @el
preferred label: Comercio al por mayor de otra maquinaria, equipos y suministros @es
preferred label: Muude masinate, seadmete ja lisaseadmete hulgimüük @et
preferred label: Muiden koneiden, laitteiden ja tarvikkeiden tukkukauppa @fi
preferred label: Commerce de gros d'autres équipements industriels @fr
preferred label: Egyéb gép, berendezés, tartozék nagykereskedelme
preferred label: Commercio all'ingrosso di altri macchinari, attrezzature e forniture @it
preferred label: Kitų mašinų, įrangos ir reikmenų didmeninė prekyba @lt
preferred label: Citu mašīnu, iekārtu un to piederumu vairumtirdzniecība @lv
preferred label: Bejgħ bl-ingrossa ta' makkinarju, tagħmir u provvisti oħra @mt
preferred label: Groothandel in andere machines en werktuigen en toebehoren @nl
preferred label: Engroshandel med andre maskiner og annet utstyr @no
preferred label: Sprzedaż hurtowa maszyn, urządzeń i dodatkowego wyposażenia @pl
preferred label: Comércio por grosso de outras máquinas e equipamentos e suas partes @pt
preferred label: Comerţ cu ridicata al altor maşini, echipamente şi furnituri @ro
preferred label: Оптовая торговля прочей техникой, оборудованием и запасными частями @ru
preferred label: Veľkoobchod s ostatnými strojmi, zariadeniami a príslušenstvom @sk
preferred label: Trgovina na debelo z drugimi stroji, napravami, opremo @sl
preferred label: Partihandel med övriga maskiner och övrig utrustning @sv
preferred label: Diğer makine, ekipman, aksam ve parçaları ile büro mobilyalarının toptan ticareti @tr
broader: Wholesale trade, except of motor vehicles and motorcycles
narrower: Wholesale of agricultural machinery, equipment and supplies
narrower: Wholesale of machine tools
narrower: Wholesale of mining, construction and civil engineering machinery
narrower: Wholesale of machinery for the textile industry and of sewing and knitting machines
narrower: Wholesale of office furniture
narrower: Wholesale of other office machinery and equipment
narrower: Wholesale of other machinery and equipment

Wholesale of agricultural machinery, equipment and supplies
type: Concept
notation: 46.61
status: valid
status modified: 2013-10-18
accepted date: 2013-10-18
in scheme: Statistical Classification of Economic Activities in the European Community, Rev. 2 (2008)
scope note: - търговия на едро с машини и оборудване за селското стопанство: • плугове, сеялки, разпръсквачки на торове, брани • машини за събиране на реколтата • вършачки • машини за доене • машини и апарати за птицевъдството и пчеларството • трактори за селското и горското стопанство - търговия на едро с всякакви видове косачки за трева @bg
scope note: Z: - velkoobchod se zemědělskými stroji a zařízením: • pluhy, rozmetadly chlévské mrvy, secími stroji • sklízecími stroji (kombajny) • mlátičkami • stroji na dojení • stroji pro chov drůbeže, včel • traktory pro zemědělství a lesnictví ZT: - velkoobchod se sekačkami na trávu jakkoliv ovládanými @cs
scope note: Diese Klasse umfasst: - Großhandel mit landwirtschaftlichen Maschinen und Geräten: • Pflüge, Stalldungstreuer, Sämaschinen • Erntemaschinen • Dreschmaschinen • Melkmaschinen • Maschinen für Geflügelhaltung und Imkerei • land- und forstwirtschaftliche Zugmaschinen Diese Klasse umfasst ferner: - Rasenmäher @de
scope note: This class includes: - wholesale of agricultural machinery and equipment: • ploughs, manure spreaders, seeders • harvesters • threshers • milking machines • poultry-keeping machines, bee-keeping machines • tractors used in agriculture and forestry This class also includes: - lawn mowers however operated @en
scope note: Esta clase comprende: - el comercio al por mayor de maquinaria y equipo agrario • arados, esparcidoras de estiércol, sembradoras • cosechadoras • trilladoras • máquinas de ordeño • máquinas y aparatos para la avicultura y la apicultura • tractores empleados en la agricultura y en la silvicultura Esta clase comprende también: - el comercio al por mayor de máquinas cortacésped de todos los tipos @es
scope note: Cette classe comprend: - le commerce de gros de machines et de matériel agricoles: • charrues, épandeurs de fumier, semoirs • moissonneuses • batteuses • machines à traire • machines et appareils pour l’aviculture, l’apiculture • tracteurs agricoles et forestiers Cette classe comprend également: - les tondeuses à gazon, quel que soit leur mode de fonctionnement @fr
scope note: Ovaj razred uključuje: - trgovinu na veliko poljoprivrednim strojevima i opremom: • plugovima, rasipačima gnoja, sijačicama • žetelicama • vršalicama • strojevima za mužnju • opremom za uzgoj peradi • opremom za uzgoj pčela • traktorima za poljoprivredu i šumarstvo Ovaj razred također uključuje: - trgovinu na veliko kosilicama za travu
scope note: Į šią klasę įeina: - žemės ūkio mašinų ir įrangos didmeninė prekyba: • plūgų, mėšlo kratytuvų, sėjamųjų • derliaus nuėmimo • kuliamųjų • melžimo įrenginių • paukštininkystės, bitininkystės įrenginių • žemės ir miškų ūkio traktorių Į šią klasę taip pat įeina: - vejapjovių su įvairiais varytuvais didmeninė prekyba @lt
scope note: Данная группа включает прочие специализированные услуги оптовой торговли, которые не были классифицированы по другим группам данного раздела. Сюда относится оптовая торговля промежуточными продуктами, за исключением сельскохозяйственных, которые обычно не предназначены для бытового использования. @ru
scope note: Bu sınıf aşağıdakileri kapsamaktadır; - tarımsal makine ve teçhizatın toptan ticareti: • pulluklar, gübre dağıtıcı makineler, tohum ekme aletleri, • biçerdöverler, • harman dövme makineleri, • sağma makineleri, • kümes hayvanları makineleri, arıcılık makineleri, • tarım ve ormancılıkta kullanılan traktörler. Ayrıca bu sınıf aşağıdakileri de kapsamaktadır; - nasıl çalışırsa çalışsın çim biçme makineleri. @tr
preferred label: Търговия на едро с машини и обрудване за селското и горското стопанство и части за тях @bg
preferred label: Velkoobchod se zemědělskými stroji, strojním zařízením a příslušenstvím @cs
preferred label: Engroshandel med landbrugsmaskiner, -udstyr og tilbehør hertil @da
preferred label: Großhandel mit landwirtschaftlichen Maschinen, und Geräten @de
preferred label: Χονδρικό εμπόριο γεωργικών μηχανημάτων, εξοπλισμού και προμηθειών @el
preferred label: Comercio al por mayor de maquinaria, equipos y suministros agrícolas @es
preferred label: Põllumajandusmasinate, -seadmete ja lisaseadmete hulgimüük @et
preferred label: Maa- ja metsätalouskoneiden ja -tarvikkeiden tukkukauppa mukaan lukien traktorit @fi
preferred label: Commerce de gros de matériel agricole @fr
preferred label: Mezőgazdasági gép, berendezés nagykereskedelme
preferred label: Commercio all'ingrosso di macchinari, attrezzature e forniture agricole @it
preferred label: Žemės ūkio mašinų, įrangos ir reikmenų didmeninė prekyba @lt
preferred label: Lauksaimniecības mašīnu, iekārtu un to piederumu vairumtirdzniecība @lv
preferred label: Bejgħ bl-ingrossa ta' makkinarju, tagħmir u provvisti agrikoli @mt
preferred label: Groothandel in machines, werktuigen en toebehoren voor de landbouw @nl
preferred label: Engroshandel med maskiner og utstyr til jordbruk og skogbruk @no
preferred label: Sprzedaż hurtowa maszyn i urządzeń rolniczych oraz dodatkowego wyposażenia @pl
preferred label: Comércio por grosso de máquinas e equipamentos agrícolas @pt
preferred label: Comerţ cu ridicata al maşinilor agricole, echipamentelor şi furniturilor @ro
preferred label: Оптовая торговля сельскохозяйственной техникой, оборудованием и запасными частями @ru
preferred label: Veľkoobchod s poľnohospodárskymi strojmi, zariadeniami a príslušenstvom @sk
preferred label: Trgovina na debelo s kmetijskimi stroji, priključki, opremo @sl
preferred label: Partihandel med jordbruksmaskiner och -utrustning @sv
preferred label: Tarımsal amaçlı makine ve ekipmanlar ile aksam ve parçalarının toptan ticareti @tr
broader: Wholesale of other machinery, equipment and supplies

Wholesale of machine tools
type: Concept
notation: 46.62
status: valid
status modified: 2013-10-18
accepted date: 2013-10-18
in scheme: Statistical Classification of Economic Activities in the European Community, Rev. 2 (2008)
scope note: - търговия на едро с обработващи машини с компютърно управление @bg
scope note: Z: - velkoobchod s obráběcími stroji všeho druhu a pro jakékoliv materiály ZT: - velkoobchod s počítačově řízenými obráběcími stroji @cs
scope note: Diese Klasse umfasst: - Großhandel mit Werkzeugmaschinen jeder Art und für jedes Material Diese Klasse umfasst ferner: - Großhandel mit computergesteuerten Werkzeugmaschinen @de
scope note: This class includes: - wholesale of machine tools of any type and for any material This class also includes: - wholesale of computer-controlled machine tools @en
scope note: Esta clase comprende: - el comercio al por mayor de máquinas herramienta de cualquier tipo y para cualquier material Esta clase comprende también: - el comercio al por mayor de máquinas herramienta controladas por ordenador @es
scope note: Cette classe comprend: - le commerce de gros de machines-outils de tout type et pour tout type de matériau Cette classe comprend également: - le commerce de gros de machines-outils commandées par ordinateur @fr
scope note: Ovaj razred uključuje: - trgovinu na veliko raznovrsnim alatnim strojevima za obradu svih vrsta materijala Ovaj razred također uključuje: - trgovinu na veliko računalno upravljanim alatnim strojevima
scope note: Į šią klasę įeina: - staklių didmeninė prekyba Į šią klasę taip pat įeina: - kompiuterio valdomų staklių didmeninė prekyba @lt
scope note: Этот класс включает: - оптовую торговлю топливом, смазочными веществами и материалами, маслами, такими как: • древесный, каменный уголь, кокс, топливная древесина, нафталин • сырая нефть, дизельное топливо, бензин, горючее, печное топливо, керосин • сжиженный нефтяной газ, бутан и газ пропан • смазочные масла, очищенные нефтепродукты @ru
scope note: Bu sınıf aşağıdakileri kapsamaktadır; - her tür materyal için takım tezgahlarının toptan ticareti. Ayrıca bu sınıf aşağıdakileri de kapsamaktadır; - bilgisayar kontrollü takım tezgahlarının toptan ticareti. @tr
preferred label: Търговия на едро с обработващи машини и части за тях @bg
preferred label: Velkoobchod s obráběcími stroji @cs
preferred label: Engroshandel med værktøjsmaskiner @da
preferred label: Großhandel mit Werkzeugmaschinen @de
preferred label: Χονδρικό εμπόριο εργαλειομηχανών @el
preferred label: Comercio al por mayor de máquinas herramienta @es
preferred label: Tööpinkide hulgimüük @et
preferred label: Työstökoneiden tukkukauppa @fi
preferred label: Commerce de gros de machines-outils @fr
preferred label: Szerszámgép-nagykereskedelem
preferred label: Commercio all'ingrosso di macchine utensili @it
preferred label: Staklių didmeninė prekyba @lt
preferred label: Darbgaldu vairumtirdzniecība @lv
preferred label: Bejgħ bl-ingrossa ta' għodod mekkanizzati @mt
preferred label: Groothandel in gereedschapswerktuigen @nl
preferred label: Engroshandel med maskinverktøy @no
preferred label: Sprzedaż hurtowa obrabiarek @pl
preferred label: Comércio por grosso de máquinas-ferramentas @pt
preferred label: Comerţ cu ridicata al maşinilor-unelte @ro
preferred label: Оптовая торговля механическими станками @ru
preferred label: Veľkoobchod s obrábacími strojmi @sk
preferred label: Trgovina na debelo z obdelovalnimi stroji @sl
preferred label: Partihandel med verktygsmaskiner @sv
preferred label: Takım tezgahlarının toptan ticareti @tr
broader: Wholesale of other machinery, equipment and supplies

Wholesale of mining, construction and civil engineering machinery
type: Concept
notation: 46.63
status: valid
status modified: 2013-10-18
accepted date: 2013-10-18
in scheme: Statistical Classification of Economic Activities in the European Community, Rev. 2 (2008)
scope note: Этот класс включает: - оптовую торговлю рудами черных и цветных металлов - оптовую торговлю черными и цветными металлами в первичном виде - оптовую торговлю полуобработанной продукцией из цветных и черных металлов, не классифицированных выше - оптовую торговлю золотом и другими драгоценными металлами Этот класс исключает: - оптовую торговлю металлоломом, см. 46.77 @ru
preferred label: Търговия на едро с машини и оборудване за добива и строителството и части за тях @bg
preferred label: Velkoobchod s těžebními a stavebními stroji a zařízením @cs
preferred label: Engroshandel med maskiner til minedrift og bygge- og anlægsvirksomhed @da
preferred label: Großhandel mit Bergwerks-, Bau- und Baustoffmaschinen @de
preferred label: Χονδρικό εμπόριο εξορυκτικών μηχανημάτων, καθώς και μηχανημάτων για κατασκευαστικά έργα και έργα πολιτικού μηχανικού @el
preferred label: Comercio al por mayor de maquinaria para la minería, la construcción y la ingeniería civil @es
preferred label: Kaevandus- ja ehitusmasinate hulgimüük @et
preferred label: Kaivos- ja rakennuskoneiden tukkukauppa @fi
preferred label: Commerce de gros de machines pour l'extraction, la construction et le génie civil @fr
preferred label: Bányászati-, építőipari gép nagykereskedelme
preferred label: Commercio all'ingrosso di macchinari per l'estrazione, l'edilizia e l'ingegneria civile @it
preferred label: Kasybos, statybos ir statybos inžinerijos mašinų didmeninė prekyba @lt
preferred label: Ieguves rūpniecības, būvniecības un inženierbūvniecības iekārtu vairumtirdzniecība @lv
preferred label: Bejgħ bl-ingrossa ta' makkinarju tal-minjieri, tal-kostruzzjoni u ta' l-inġineriji ċivili @mt
preferred label: Groothandel in machines voor de mijnbouw, de bouwnijverheid en de weg- en waterbouw @nl
preferred label: Engroshandel med maskiner og utstyr til bergverksdrift, olje- og gassutvinning og bygge- og anleggsvirksomhet @no
preferred label: Sprzedaż hurtowa maszyn wykorzystywanych w górnictwie, budownictwie oraz inżynierii lądowej i wodnej @pl
preferred label: Comércio por grosso de máquinas para a indústria extractiva, construção e engenharia civil @pt
preferred label: Comerţ cu ridicata al maşinilor pentru industria minieră şi construcţii @ro
preferred label: Оптовая торговля техникой для горнодобычи и гражданского строительства @ru
preferred label: Veľkoobchod so strojmi pre baníctvo, stavebníctvo a stavebné inžinierstvo @sk
preferred label: Trgovina na debelo z rudarskimi in gradbenimi stroji @sl
preferred label: Partihandel med gruv-, bygg- och anläggningsmaskiner @sv
preferred label: Madencilik, bina ve bina dışı inşaat makinelerinin toptan ticareti @tr
broader: Wholesale of other machinery, equipment and supplies

Wholesale of machinery for the textile industry and of sewing and knitting machines
type: Concept
notation: 46.64
status: valid
status modified: 2013-10-18
accepted date: 2013-10-18
in scheme: Statistical Classification of Economic Activities in the European Community, Rev. 2 (2008)
scope note: - търговия на едро с машини с компютърно управление за текстил, облекло, кожи и кожени изделия; шевни и плетачни машини @bg
scope note: ZT: - velkoobchod s počítačově řízenými šicími a pletacími stroji pro textilní průmysl @cs
scope note: Diese Klasse umfasst auch: - Großhandel mit computergesteuerten Textil-, Näh- und Strickmaschinen @de
scope note: This class also includes: - wholesale of computer-controlled machinery for the textile industry and of computer-controlled sewing and knitting machines @en
scope note: Esta clase comprende también: - el comercio al por mayor de maquinaria controlada por ordenador para la industria textil y de máquinas de coser y de hacer punto controladas por ordenador @es
scope note: Cette classe comprend également: - le commerce de gros de machines pour l’industrie textile et de machines à coudre et à tricoter, commandées par ordinateur @fr
scope note: Ovaj razred uključuje: - trgovinu na veliko računalno upravljanim strojevima za tekstilnu industriju i računalno upravljanim strojevima za šivanje i pletenje
scope note: Į šią klasę taip pat įeina: - kompiuterio valdomų tekstilės pramonės mašinų ir kompiuterio valdomų siuvamųjų ir mezgimo mašinų didmeninė prekyba @lt
scope note: Этот класс включает: - оптовую торговлю необработанной древесиной - оптовую торговлю древесиной первичной обработки - оптовую торговлю лаками и красками - оптовую торговлю строительными материалами: • песком, гравием - оптовую торговлю обоями и напольным покрытием - оптовую торговлю листовым стеклом - оптовую торговлю сантехническим оборудованием: • ваннами, раковинами, унитазами и другой сантехникой - оптовую торговлю сборными конструкциями @ru
scope note: Ayrıca bu sınıf aşağıdakileri de kapsamaktadır; - tekstil endüstrisi için bilgisayar kontrollü makineler ile bilgisayar kontrollü dikiş ve örgü makinelerinin toptan ticareti. @tr
preferred label: Търговия на едро с машини за производство на текстил, облекло и кожени изделия и части за тях @bg
preferred label: Velkoobchod se strojním zařízením pro textilní průmysl, šicími a pletacími stroji @cs
preferred label: Engroshandel med maskiner, udstyr og tilbehør til tekstilindustrien @da
preferred label: Großhandel mit Textil-, Näh- und Strickmaschinen @de
preferred label: Χονδρικό εμπόριο μηχανημάτων για την κλωστοϋφαντουργική βιομηχανία, και χονδρικό εμπόριο ραπτομηχανών και πλεκτομηχανών @el
preferred label: Comercio al por mayor de maquinaria para la industria textil y de máquinas de coser y tricotar @es
preferred label: Tekstiilitööstus-, õmblus- ja kudumismasinate hulgimüük @et
preferred label: Tekstiiliteollisuuden koneiden sekä ompelu- ja kutomakoneiden tukkukauppa @fi
preferred label: Commerce de gros de machines pour l'industrie textile et l'habillement @fr
preferred label: Textilipari gép, varró-, kötőgép nagykereskedelme
preferred label: Commercio all'ingrosso di macchinari per l'industria tessile, di macchine per cucire e per maglieria @it
preferred label: Tekstilės pramonės mašinų bei siuvamųjų ir mezgimo mašinų didmeninė prekyba @lt
preferred label: Tekstilrūpniecības iekārtu, šujmašīnu un adāmmašīnu vairumtirdzniecība @lv
preferred label: Bejgħ bl-ingrossa ta' makkinarju għall-industrija tat-tessuti u ta' magni tal-ħjata u li jaħdmu s-suf @mt
preferred label: Groothandel in machines voor de textielindustrie en in naai- en breimachines @nl
preferred label: Engroshandel med maskiner og utstyr til tekstilproduksjon @no
preferred label: Sprzedaż hurtowa maszyn dla przemysłu tekstylnego oraz maszyn do szycia i maszyn dziewiarskich @pl
preferred label: Comércio por grosso de máquinas para a indústria têxtil, máquinas de costura e de tricotar @pt
preferred label: Comerţ cu ridicata al maşinilor pentru industria textilă şi al maşinilor de cusut şi de tricotat @ro
preferred label: Оптовая торговля техникой для текстильного, швейного и трикотажного производств @ru
preferred label: Veľkoobchod so strojmi pre textilný priemysel a so šijacími a pletacími strojmi @sk
preferred label: Trgovina na debelo s stroji za tekstilno industrijo @sl
preferred label: Partihandel med textil-, sy- och stickmaskiner @sv
preferred label: Tekstil endüstrisi makineleri ile dikiş ve örgü makinelerinin toptan ticareti @tr
broader: Wholesale of other machinery, equipment and supplies

Wholesale of office furniture
type: Concept
notation: 46.65
status: valid
status modified: 2013-10-18
accepted date: 2013-10-18
in scheme: Statistical Classification of Economic Activities in the European Community, Rev. 2 (2008)
scope note: - търговия на едро с мебели за офиси и магазини @bg
scope note: Z: - velkoobchodní řemeslné služby související: • s instalací zboží, jehož výroba je zatříděna ve třídě 31.01 (Výroba kancelářského nábytku a zařízení obchodů) @cs
scope note: Diese Klasse umfasst: Großhandel verbunden mit: • Erzeugnissen der Klasse 31.01 (Herstellung von Büro- und Ladenmöbeln) @de
scope note: This class includes: - wholesale trade services related to: • goods classified in 31.01 (Manufacture of office and shop furniture) @en
scope note: Esta clase comprende: - los servicios de comercio al por mayor relacionados con: • bienes cuya fabricación se clasifica en la clase 31.01 (Fabricación de muebles de oficina y de establecimientos comerciales) @es
scope note: Cette classe comprend: - les services de commerce de gros concernant les: • produits classés sous 31.01 (Fabrication de meubles de bureau et de magasin) @fr
scope note: Ovaj razred uključuje: - usluge trgovine na veliko proizvodima razvrstanim u razred 31.01 (Proizvodnja namještaja za poslovne i prodajne prostore)
scope note: Į šią klasę įeina: - didmeninės prekybos paslaugos susijusios su: • gaminiais, kurių gamyba klasifikuojama 31.01 klasėje (Įstaigų ir parduotuvių baldų gamyba) @lt
scope note: Этот класс включает: - оптовую торговлю металлическими изделиями и замками - оптовую торговлю крепежными приспособлениями - оптовую торговлю водонагревателями - оптовую торговлю приспособлениями для установки сантехнического оборудования: • трубами, креплениями, водопроводными кранами, тройниками, соединителями, резиновыми трубами и т.д. - оптовую торговлю инструментами, такими как молотки, пилы, отвертки и прочие ручные инструменты @ru
scope note: Bu sınıf aşağıdakileri kapsamaktadır; - toptan ticaret ile ilgili aşağıdaki hizmetler; • 31.01`de sınıflandırılan mallar (Büro ve mağaza mobilyalarının imalatı). @tr
preferred label: Търговия на едро с офис мебели @bg
preferred label: Velkoobchod s kancelářským nábytkem @cs
preferred label: Engroshandel med kontormøbler @da
preferred label: Großhandel mit Büromöbeln @de
preferred label: Χονδρικό εμπόριο επίπλων γραφείου @el
preferred label: Comercio al por mayor de muebles de oficina @es
preferred label: Kontorimööbli hulgimüük @et
preferred label: Toimitilakalusteiden tukkukauppa @fi
preferred label: Commerce de gros de mobilier de bureau @fr
preferred label: Irodabútor-nagykereskedelem
preferred label: Commercio all'ingrosso di mobili per ufficio @it
preferred label: Įstaigos baldų didmeninė prekyba @lt
preferred label: Biroja mēbeļu vairumtirdzniecība @lv
preferred label: Bejgħ bl-ingrossa ta' għamara għall-uffiċċji @mt
preferred label: Groothandel in kantoormeubelen @nl
preferred label: Sprzedaż hurtowa mebli biurowych @pl
preferred label: Comércio por grosso de mobiliário de escritório @pt
preferred label: Comerţ cu ridicata al mobilei de birou @ro
preferred label: Оптовая торговля офисной мебелью @ru
preferred label: Veľkoobchod s kancelárskym nábytkom @sk
preferred label: Trgovina na debelo s pisarniškim pohištvom @sl
preferred label: Partihandel med kontorsmöbler @sv
preferred label: Büro mobilyalarının toptan ticareti @tr
broader: Wholesale of other machinery, equipment and supplies

Wholesale of other office machinery and equipment
type: Concept
notation: 46.66
status: valid
status modified: 2013-10-18
accepted date: 2013-10-18
in scheme: Statistical Classification of Economic Activities in the European Community, Rev. 2 (2008)
scope note: - търговия на едро с офис техника – пишещи машини, текстообработващи машини, фотокопирни апарати, счетоводни и други подобни машини (с изключение на компютри и периферни устройства за тях) - търговия на едро с компютри и периферни устройства за тях - 46.51 - търговия на едро с телефонни апарати, факсове, електронни елементи и друга комуникационна техника - 46.52 @bg
scope note: Z: - velkoobchod s kancelářskými stroji a zařízením, kromě počítačů a počítačových periferních zařízení N: - velkoobchod s počítači a periferními zařízeními (46.51) - velkoobchod s elektronickými díly a telefonním a komunikačním zařízením (46.52) @cs
scope note: Diese Klasse umfasst: - Großhandel mit Büromaschinen (ohne Datenverarbeitungsgeräte und periphere Geräte) Diese Klasse umfasst nicht: - Großhandel mit Datenverarbeitungsgeräten und peripheren Geräten (s. 46.51) - Großhandel mit elektronischen Bauteilen und Telefon- und Telekommunikationsgeräten (s. 46.52) @de
scope note: This class includes: - wholesale of office machinery and equipment, except computers and computer peripheral equipment This class excludes: - wholesale of computers and peripheral equipment, see 46.51 - wholesale of electronic parts and telephone and communications equipment, see 46.52 @en
scope note: Esta clase comprende: - el comercio al por mayor de máquinas y equipos de oficina (excepto ordenadores y periféricos) Esta clase no comprende: - el comercio al por mayor de ordenadores y periféricos (véase 46.51) - el comercio al por mayor de componentes electrónicos, teléfonos y otros equipos de comunicación (véase 46.52) @es
scope note: Cette classe comprend: - le commerce de gros de machines et d’équipements de bureau, à l’exception des ordinateurs et des équipements périphériques Cette classe ne comprend pas: - le commerce de gros d’ordinateurs et d’équipements périphériques, voir 46.51 - le commerce de gros de composants électroniques et d’équipements téléphoniques et de communications, voir 46.52 @fr
scope note: Ovaj razred uključuje: - trgovinu na veliko uredskim strojevima i opremom, osim računala i računalne periferne opreme Ovaj razred isključuje: - trgovinu na veliko računalima i perifernom opremom, vidi 46.51 - trgovinu na veliko elektroničkim dijelovima te telefonima i komunikacijskom opremom, vidi 46.52
scope note: Į šią klasę įeina: - įstaigos mašinų ir įrangos, išskyrus kompiuterius ir jų išorinę įrangą, didmeninė prekyba Į šią klasę neįeina: - kompiuterių ir jų išorinės įrangos didmeninė prekyba, žr. 46.51 - elektroninių dalių, telefono ir ryšių įrangos didmeninė prekyba, žr. 46.52 @lt
scope note: Этот класс включает: - оптовую торговлю промышленными химикатами: • анилинами, печатной краской, эфирными маслами, промышленными газами, химическим клеем, красящими веществами, синтетической смолой, метанолом, парафином, ароматическими добавками, содой, промышленной солью, кислотой и серой, крахмалом и т.д. - оптовую торговлю удобрениями и агрохимическими продуктами @ru
scope note: Bu sınıf aşağıdakileri kapsamaktadır; - büro makine ve ekipmanının toptan ticareti (bilgisayarlar ve bilgisayar çevre donanımları hariç). Kapsam dışı olanlar; - bilgisayar ve bilgisayar çevre donanımları toptan ticareti, bkz. 46.51, - elektronik parçalar ile telefonun ve iletişim ekipmanının toptan ticareti, bkz. 46.52. @tr
preferred label: Търговия на едро с друга офис техника, без компютри @bg
preferred label: Velkoobchod s ostatními kancelářskými stroji a zařízením @cs
preferred label: Engroshandel med andre kontormaskiner og andet kontorudstyr @da
preferred label: Großhandel mit sonstigen Büromaschinen und –einrichtungen @de
preferred label: Χονδρικό εμπόριο άλλων μηχανών και εξοπλισμού γραφείου @el
preferred label: Comercio al por mayor de otra maquinaria y equipo de oficina @es
preferred label: Muude kontorimasinate ja -seadmete hulgimüük @et
preferred label: Muiden konttorikoneiden ja -laitteiden tukkukauppa @fi
preferred label: Commerce de gros d'autres machines et équipements de bureau @fr
preferred label: Egyéb irodagép, -berendezés nagykereskedelme
preferred label: Commercio all'ingrosso di altri macchinari e attrezzature per ufficio @it
preferred label: Kitų įstaigos mašinų ir įrangos didmeninė prekyba @lt
preferred label: Citu biroja ierīču un iekārtu vairumtirdzniecība @lv
preferred label: Bejgħ bl-ingrossa ta' makkinarju u tagħmir ieħor għall-uffiċċji @mt
preferred label: Groothandel in andere kantoormachines en kantoorbenodigdheden @nl
preferred label: Engroshandel med maskiner og utstyr til kontor ellers @no
preferred label: Sprzedaż hurtowa pozostałych maszyn i urządzeń biurowych @pl
preferred label: Comércio por grosso de outras máquinas e material de escritório @pt
preferred label: Comerţ cu ridicata al altor maşini şi echipamente de birou @ro
preferred label: Оптовая торговля прочей офисной техникой и оборудованием @ru
preferred label: Veľkoobchod s ostatnými kancelárskymi strojmi a zariadeniami @sk
preferred label: Trgovina na debelo s pisarniškimi stroji in opremo @sl
preferred label: Partihandel med andra kontorsmaskiner och kontorsutrustning @sv
preferred label: Diğer büro makine ve ekipmanlarının toptan ticareti @tr
broader: Wholesale of other machinery, equipment and supplies

Wholesale of other machinery and equipment
type: Concept
notation: 46.69
status: valid
status modified: 2013-10-18
accepted date: 2013-10-18
in scheme: Statistical Classification of Economic Activities in the European Community, Rev. 2 (2008)
scope note: - търговия на едро с превозни средства, без търговия с автомобили, мотоциклети и велосипеди - търговия на едро с подемно-транспортно оборудване и асансьори, роботизирани производствени линии - търговия на едро с електрически машини и оборудване, използвани в производството - търговия на едро с електрически мотори, трансформатори и други - търговия на едро с други машини (некласифицирани другаде), използвани в производството, търговията и навигацията (без машини за добива, строителството и машини за производство на текстил) - търговия на едро с измервателни апарати и оборудване - търговия на едро с апарати за климатизиране на въздуха - търговия на едро с автомобили, каравани и ремаркета - 45.1 - търговия на едро с части и принадлежности за автомобили - 45.31 - търговия на едро с мотоциклети, части и принадлежности за тях - 45.40 - търговия на едро с велосипеди - 46.49 @bg
scope note: Z: - velkoobchod s dopravním zařízením, kromě motorových vozidel, motocyklů a jízdních kol - velkoobchod s roboty u výrobních linek - velkoobchod s dráty a vypínači a jiným instalačním materiálem pro průmyslové použití - velkoobchod s ostatním elektrickým zařízením, např. elektromotory a transformátory - velkoobchod s ostatními stroji j. n. pro využití v průmyslu (kromě těžby, stavebnictví a textilního průmyslu), řemeslných činnostech, pro navigaci a jiné činnosti ZT: - velkoobchod s měřicími přístroji a zařízeními N: - velkoobchod s motorovými vozidly, přívěsy a karavany (45.1) - velkoobchod s díly a příslušenstvím pro motorová vozidla (45.31) - velkoobchod s motocykly (45.40) - velkoobchod s jízdními koly (46.49) @cs
scope note: Diese Klasse umfasst: - Großhandel mit Beförderungsmitteln außer Kraftfahrzeugen und Fahrrädern - Großhandel mit Industrierobotern - Großhandel mit Kabeln und Leitungen, Schaltern und anderem technischem Installationsmaterial - Großhandel mit sonstigem Elektromaterial wie Elektromotoren und Transformatoren - Großhandel mit sonstigen Maschinen a. n. g. für Industrie (ausgenommen Bergbau, Hoch- und Tiefbau und Textilindustrie), Handel, Navigation und andere Dienstleistungen Diese Klasse umfasst ferner: - Großhandel mit Messgeräten Diese Klasse umfasst nicht: - Großhandel mit Kraftwagen, Anhängern und Wohnwagen (s. 45.1) - Großhandel mit Kraftwagenteilen (s. 45.31) - Großhandel mit Krafträdern (s. 45.40) - Großhandel mit Fahrrädern (s. 46.49) @de
scope note: This class includes: - wholesale of transport equipment except motor vehicles, motorcycles and bicycles - wholesale of production-line robots - wholesale of wires and switches and other installation equipment for industrial use - wholesale of other electrical material such as electrical motors, transformers - wholesale of other machinery n.e.c. for use in industry (except mining, construction, civil engineering and textile industry), trade and navigation and other services This class also includes: - wholesale of measuring instruments and equipment This class excludes: - wholesale of motor vehicles, trailers and caravans, see 45.1 - wholesale of motor vehicle parts, see 45.31 - wholesale of motorcycles, see 45.40 - wholesale of bicycles, see 46.49 @en
scope note: Esta clase comprende: - el comercio al por mayor de equipos de transporte con exclusión de los vehículos de motor, motocicletas y bicicletas - el comercio al por mayor de robots de fabricación en cadena - el comercio al por mayor de cables, interruptores y otros equipos de instalación para uso industrial - el comercio al por mayor de otro material eléctrico como motores eléctricos y transformadores - el comercio al por mayor de otra maquinaria n.c.o.p. para la industria (excepto industrias minera, de construcción, de ingeniería civil y textil), el comercio y la navegación y otros servicios Esta clase comprende también: - el comercio al por mayor de instrumentos y equipo de medida Esta clase no comprende: - el comercio al por mayor de vehículos, remolques y caravanas (véase 45.1) - el comercio al por mayor de piezas de vehículos de motor (véase 45.31) - el comercio al por mayor de motocicletas (véase 45.40) - el comercio al por mayor de bicicletas (véase 46.49) @es
scope note: Cette classe comprend: - le commerce de gros de matériels de transport autres que les véhicules automobiles, les cycles et les motocycles - le commerce de gros de robots pour chaînes de montage - le commerce de gros de fils, d’interrupteurs et d’autres matériels d’installation à usage industriel - le commerce de gros d’autres matériels électriques tels les moteurs et les transformateurs - le commerce de gros d’autres machines utilisées dans l’industrie (à l’exception des machines pour l’extraction, la construction, le génie civil et l’industrie textile), le commerce et la navigation et d’autres services Cette classe comprend également: - le commerce de gros d’instruments et d’appareils de mesure Cette classe ne comprend pas: - le commerce de gros de véhicules automobiles, de remorques et de caravanes, voir 45.1 - le commerce de gros de pièces de véhicules automobiles, voir 45.31 - le commerce de gros de motocycles, voir 45.40 - le commerce de gros de cycles, voir 46.49 @fr
scope note: Ovaj razred uključuje: - trgovinu na veliko prijevoznom opremom, osim motornim vozilima, motociklima i biciklima - trgovinu na veliko automatiziranim proizvodnim linijama - trgovinu na veliko žicom, prekidačima i drugim instalacijskim materijalom za industrijsku uporabu - trgovinu na veliko ostalim elektromaterijalom kao što su elektromotori, transformatori - trgovinu na veliko ostalim strojevima, d. n., za uporabu u industriji (osim za rudnike, građevinarstvo i tekstilnu industriju), trgovini, navigaciji i drugim uslužnim djelatnostima Ovaj razred također uključuje: - trgovinu na veliko mjernim instrumentima i opremom Ovaj razred isključuje: - trgovinu na veliko motornim vozilima, prikolicama i stambenim autoprikolicama, vidi 45.1 - trgovinu na veliko dijelovima za motorna vozila, vidi 45.31 - trgovinu na veliko motociklima, vidi 45.40 - trgovinu na veliko biciklima, vidi 46.49
scope note: Į šią klasę įeina: - transporto įrangos, išskyrus variklines transporto priemones, motociklus ir dviračius, didmeninė prekyba - konvejerinės gamybos robotų didmeninė prekyba - laidų, jungiklių ir kitokios pramonėje naudojamos instaliacinės įrangos didmeninė prekyba - kitos elektros įrangos, tokios kaip elektros varikliai ir transformatoriai, didmeninė prekyba - kitų, niekur kitur nepriskirtų, mašinų, naudojamų pramonėje, (išskyrus kasybos, statybos, inžinierinių statinių statybos ir tekstilės pramonę), prekyboje, navigacijoje ir kitoms paslaugoms teikti, didmeninė prekyba Į šią klasę taip pat įeina: - matavimo prietaisų ir įrangos didmeninė prekyba Į šią klasę neįeina: - variklinių transporto priemonių, priekabų ir priekabinių namelių didmeninė prekyba, žr. 45.1 - variklinių transporto priemonių atsarginių dalių didmeninė prekyba, žr. 45.31 - motociklų didmeninė prekyba, žr. 45.40 - dviračių didmeninė prekyba, žr. 46.49 @lt
scope note: Этот класс включает: - оптовую торговлю пластмассой в первичном виде - оптовую торговлю резиной - оптовую торговлю текстильными волокнами и т.д. - оптовую торговлю бумагой крупными партиями - оптовую торговлю драгоценными камнями @ru
scope note: Bu sınıf aşağıdakileri kapsamaktadır; - ulaştırma ekipmanlarının toptan ticareti, (motorlu taşıtlar, motosikletler ve bisikletler hariç) - üretim hattı robotlarının toptan ticareti, - endüstriyel kullanım için kablolar ve elektrik anahtarları ile diğer kurulum ekipmanlarının toptan ticareti, - elektrik motorları, trafolar gibi diğer elektrikli materyallerin toptan ticareti, - endüstride, ticarette, denizcilikte ve diğer hizmetlerde (madencilik, inşaat, inşaat mühendisliği ve tekstil endüstrisi hariç) kullanılan diğer makinelerin toptan ticareti. Ayrıca bu sınıf aşağıdakileri de kapsamaktadır; - ölçüm aletlerinin ve ekipmanlarının toptan ticareti. Kapsam dışı olanlar; - motorlu taşıtların, römorkların ve karavanların toptan ticareti, bkz. 45.1, - motorlu taşıt parçalarının toptan ticareti, bkz. 45.31, - motosikletlerin toptan ticareti, bkz. 45.40, - bisikletlerin toptan ticareti, bkz. 46.49. @tr
preferred label: Търговия на едро с други машини и оборудване със стопанско предназначение, некласифицирана другаде и части за тях @bg
preferred label: Velkoobchod s ostatními stroji a zařízením @cs
preferred label: Engroshandel med andre maskiner og andet udstyr @da
preferred label: Großhandel mit sonstigen Maschinen und Ausrüstungen @de
preferred label: Χονδρικό εμπόριο άλλων μηχανημάτων και εξοπλισμού @el
preferred label: Comercio al por mayor de otra maquinaria y equipo @es
preferred label: Muude masinate ja seadmete hulgimüük @et
preferred label: Muiden koneiden, laitteiden ja tarvikkeiden tukkukauppa @fi
preferred label: Commerce de gros d'autres machines et équipements @fr
preferred label: Egyéb m.n.s. gép, berendezés nagykereskedelme
preferred label: Commercio all'ingrosso di altri macchinari e attrezzature @it
preferred label: Kitų mašinų ir įrangos didmeninė prekyba @lt
preferred label: Citu mašīnu un iekārtu vairumtirdzniecība @lv
preferred label: Bejgħ bl-ingrossa ta' makkinarju u tagħmir ieħor @mt
preferred label: Groothandel in andere machines en werktuigen @nl
preferred label: Engroshandel med maskiner og utstyr ellers @no
preferred label: Sprzedaż hurtowa pozostałych maszyn i urządzeń @pl
preferred label: Comércio por grosso de outras máquinas e equipamentos @pt
preferred label: Comerţ cu ridicata al altor maşini şi echipamente @ro
preferred label: Оптовая торговля прочей техникой и оборудованием @ru
preferred label: Veľkoobchod s ostatnými strojmi a zariadeniami @sk
preferred label: Trgovina na debelo z drugimi napravami in opremo @sl
preferred label: Partihandel med andra maskiner och annan utrustning @sv
preferred label: Diğer makine ve ekipmanların toptan ticareti @tr
broader: Wholesale of other machinery, equipment and supplies

Other specialised wholesale
type: Concept
notation: 46.7
status: valid
status modified: 2013-10-18
accepted date: 2013-10-18
in scheme: Statistical Classification of Economic Activities in the European Community, Rev. 2 (2008)
scope note: Тази група включва специализирана търговия на едро, некласифицирана в друга група от този раздел. Включва още и търговия на едро с неселскостопански междинни продукти, които не са за домакинско потребление @bg
scope note: Tato skupina zahrnuje ostatní činnosti specializovaného velkoobchodu, které nejsou zařazeny v jiných skupinách tohoto oddílu. Patří sem také velkoobchod s polotovary (kromě zemědělských), které nejsou typické pro použití v domácnosti. @cs
scope note: Diese Gruppe umfasst sonstige, in anderen Gruppen dieser Abteilung nicht aufgeführte Tätigkeiten des Fachgroßhandels. Hierzu zählt auch der Großhandel mit Halbwaren, ausgenommen landwirtschaftlichen Halbwaren, die typischerweise nicht für den Haushaltsgebrauch gedacht sind. @de
scope note: This group includes other specialised wholesale activities not classified in other groups of this division. This includes the wholesale of intermediate products, except agricultural, typically not for household use. @en
scope note: Este grupo comprende otras actividades de comercio al por mayor especializado no incluidas en otros grupos de esta división. Comprende el comercio al por mayor de productos intermedios, excepto los agrarios, que no suelen ser para uso doméstico @es
scope note: Ce groupe comprend les divers commerces de gros spécialisés ne relevant pas d’une des catégories de cette division. Il comprend le commerce de gros de produits intermédiaires non agricoles et non destinés, en général, à une utilisation domestique. @fr
scope note: Ova skupina uključuje djelatnosti ostale specijalizirane trgovine na veliko koja nije razvrstana u ostalim skupinama ovog odjeljka. To uključuje trgovinu na veliko poluproizvodima, osim poljoprivrednima, koji se u pravilu ne koriste u kućanstvima.
scope note: Į šią grupę įeina kita, niekur kitur šiame skyriuje neklasifikuojama, specializuota didmeninė prekyba. Čia įeina tarpinių produktų, išskyrus žemės ūkio, paprastai ne namų ūkio reikmėms, didmeninė prekyba. @lt
scope note: Этот класс включает: - оптовую торговлю металлическими и неметаллическими отходами, металлоломом и материалами для повторного использования, включая сбор, сортировку, отделение, демонтаж использованных товаров, таких как автомобили, с целью получения запчастей, упаковку и вторичную упаковку, хранение и доставку, но без существенных преобразований. Кроме того, покупаемые и продаваемые отходы имеют остаточную стоимость. Этот класс также включает: - демонтаж автомобилей, компьютеров, телевизоров и прочего оборудования на пригодные к употреблению запчасти с целью их продажи Этот класс исключает: - сбор бытовых и промышленных отходов, см. 38.1 - переработку отходов, не для дальнейшего использования в промышленном или производственном процессе, но с целью захоронения, см. 38.2 - переработку отходов, мусора и других предметов во вторичное сырье, когда требуется настоящая трансформация (получаемое вторичное сырье пригодно для непосредственного использования в промышленно-производственном процессе, но не является конечным продуктом), см. 38.3 - демонтаж автомобилей, компьютеров, телевизоров и прочего оборудования на пригодные к употреблению запчасти с целью их продажи, см. 38.1 - разбор кораблей на части, см. 38.31 - измельчение автомобилей посредством механического процесса, см. 38.32 - розничную торговлю подержанными товарами, см. 47.79 @ru
scope note: Bu grup, bu bölümün diğer gruplarında sınıflandırılmayan belirli bir mala tahsis edilmiş mağazalardaki diğer toptan ticaret faaliyetlerini kapsamaktadır. Burada, tarımsal ürünler hariç, tipik olarak evde kullanım için olmayan ara ürünlerin toptan ticareti kapsanmaktadır. @tr
preferred label: Търговия на едро с неселскостопански междинни продукти, отпадъци и скрап @bg
preferred label: Ostatní specializovaný velkoobchod @cs
preferred label: Anden specialiseret engroshandel @da
preferred label: Sonstiger Großhandel @de
preferred label: Άλλο ειδικευμένο χονδρικό εμπόριο @el
preferred label: Otro comercio al por mayor especializado @es
preferred label: Muu spetsialiseeritud hulgimüük @et
preferred label: Muu erikoistunut tukkukauppa @fi
preferred label: Autres commerces de gros spécialisés @fr
preferred label: Egyéb szakosodott nagykereskedelem
preferred label: Commercio all'ingrosso specializzato di altri prodotti @it
preferred label: Kita specializuota didmeninė prekyba @lt
preferred label: Cita veida specializētā vairumtirdzniecība @lv
preferred label: Bejgħ ieħor speċjalizzat bl-ingrossa @mt
preferred label: Overige gespecialiseerde groothandel @nl
preferred label: Engroshandel med spesialisert vareutvalg ellers @no
preferred label: Sprzedaż hurtowa wyspecjalizowana pozostała @pl
preferred label: Outro comércio por grosso especializado @pt
preferred label: Comerţ cu ridicata specializat al altor produse @ro
preferred label: Другая специализированная оптовая торговля @ru
preferred label: Ostatný špecializovaný veľkoobchod @sk
preferred label: Druga specializirana trgovina na debelo @sl
preferred label: Annan specialiserad partihandel @sv
preferred label: Belirli bir mala tahsis edilmiş mağazalardaki diğer toptan ticaret @tr
broader: Wholesale trade, except of motor vehicles and motorcycles
narrower: Wholesale of solid, liquid and gaseous fuels and related products
narrower: Wholesale of metals and metal ores
narrower: Wholesale of wood, construction materials and sanitary equipment
narrower: Wholesale of hardware, plumbing and heating equipment and supplies
narrower: Wholesale of chemical products
narrower: Wholesale of other intermediate products
narrower: Wholesale of waste and scrap

Wholesale of solid, liquid and gaseous fuels and related products
type: Concept
notation: 46.71
status: valid
status modified: 2013-10-18
accepted date: 2013-10-18
in scheme: Statistical Classification of Economic Activities in the European Community, Rev. 2 (2008)
scope note: - търговия на едро с твърди, течни и газообразни горива и подобни продукти, такива като: • твърди горива - въглища, дървени въглища, кокс, дърва за горене • течни горива - нефт, нафта, бензин, дизелово гориво • втечнени газообразни горива – пропан-бутан • смазочни масла и други масла на нефтена основа, други рафинирани нефтопродукти - търговия на едро с нафта за отопление и газ в бутилки @bg
scope note: Z: - velkoobchod s palivy, mazivy, oleji, např.: • dřevěným uhlím, uhlím, koksem, palivovým dřívím, naftou • surovým petrolejem, surovou ropou, motorovou naftou, benzínem, topným olejem, petrolejem • zkapalněnými ropnými plyny, propanovými a butanovými plyny • mazacími oleji a tuky, výrobky z rafinované ropy @cs
scope note: Diese Klasse umfasst: - Großhandel mit Kraft- und Schmierstoffen, z. B.: • Holzkohle, Kohle, Koks, Brennholz, Naphtha • Erdöl, Rohöl, Dieselkraftstoff, Benzin, Heizöl, Kerosin • Flüssiggas, Butan und Propan • Schmieröle und –fette, Mineralölerzeugnisse @de
scope note: This class includes: - wholesale of fuels, greases, lubricants, oils such as: • charcoal, coal, coke, fuel wood, naphtha • crude petroleum, crude oil, diesel fuel, gasoline, fuel oil, heating oil, kerosene • liquefied petroleum gases, butane and propane gas • lubricating oils and greases, refined petroleum products @en
scope note: Esta clase comprende: - el comercio al por mayor de combustibles, grasas, lubricantes y aceites como: • carbón, hulla, coque, leña para calefacción, nafta • crudos de petróleo, gasóleo, fueloil, gasolina, gasóleo para calefacción, queroseno • gases licuados de petróleo, gas butano y propano • aceites y grasas lubricantes, productos de refino del petróleo @es
scope note: Cette classe comprend: - le commerce de gros de carburants, de graisses, de lubrifiants, d’huiles, tels que: • charbon de bois, charbon, coke, bois de chauffage, naphte • pétrole brut, gasoil, essence, mazout, kérosène • gaz de pétrole liquéfié, butane et propane • huiles de graissage et graisses lubrifiantes, produits pétroliers raffinés @fr
scope note: Ovaj razred uključuje: - trgovinu na veliko gorivima, mazivima, uljima kao što su: • drveni ugljen, kameni ugljen, koks, drvo za ogrjev • sirova nafta, dizelsko gorivo, gazolin, pogonsko gorivo, loživo ulje, kerozin • tekući plinovi, butan i propan • ulje za podmazivanje, derivati nafte
scope note: Į šią klasę įeina: - degalų, tepalų, plastiškųjų tepalų, alyvų, tokių kaip: • medžio anglys, akmens anglys, koksas, medienos kuras, ligroinas • žalia nafta, nevalyta nafta, dyzelinas, benzinas, kūrenamasis mazutas, krosnių kuras, žibalas • suskystintos naftos dujos, butano ir propano dujos • tepamoji alyva ir tepalai, rafinuoti naftos produktai, didmeninė prekyba @lt
scope note: Bu sınıf aşağıdakileri kapsamaktadır; - akaryakıt, gres yağı, motor yağları, madeni yağlar vb. toptan ticareti, örneğin: • odun kömürü, kömür, kok kömürü, yakacak odun, nafta, • ham petrol, ham yağ, mazot, benzin, fuel oil, kalorifer yağı, gazyağı, • sıvı petrol gazları, bütan ve propan gazı, • madeni yağlar ve gres yağları, rafine edilmiş petrol ürünleri. @tr
preferred label: Търговия на едро с твърди, течни и газообразни горива и подобни продукти @bg
preferred label: Velkoobchod s pevnými, kapalnými a plynnými palivy a příbuznými výrobky @cs
preferred label: Engroshandel med fast, flydende og luftformigt brændstof og lignende varer @da
preferred label: Großhandel mit festen Brennstoffen und Mineralölerzeugnissen @de
preferred label: Χονδρικό εμπόριο στερεών, υγρών και αερίων καυσίμων και συναφών προϊόντων @el
preferred label: Comercio al por mayor de combustibles sólidos, líquidos y gaseosos, y productos similares @es
preferred label: Tahke-, vedel- ja gaaskütuse jms toodete hulgimüük @et
preferred label: Kiinteiden, nestemäisten ja kaasumaisten polttoaineiden yms. tukkukauppa @fi
preferred label: Commerce de gros de combustibles et de produits annexes @fr
preferred label: Üzem-, tüzelőanyag nagykereskedelme
preferred label: Commercio all'ingrosso di combustibili solidi, liquidi, gassosi e di prodotti derivati @it
preferred label: Kietojo, skystojo ir dujinio kuro bei priedų didmeninė prekyba @lt
preferred label: Degvielas, cietā, šķidrā un gāzveida kurināmā un līdzīgu produktu vairumtirdzniecība @lv
preferred label: Bejgħ bl-ingrossa ta' fjuwil soldu, likwidu u fi stat ta' gass u prodotti relatati @mt
preferred label: Groothandel in vaste, vloeibare en gasvormige brandstoffen en aanverwante producten @nl
preferred label: Engroshandel med drivstoff og brensel @no
preferred label: Sprzedaż hurtowa paliw stałych, ciekłych, gazowych oraz produktów pochodnych @pl
preferred label: Comércio por grosso de combustíveis sólidos, líquidos e gasosos e produtos derivados @pt
preferred label: Comerţ cu ridicata al combustibililor solizi, lichizi şi gazoşi şi al produselor derivate @ro
preferred label: Оптовая торговля твердым, жидким и газообразным топливом и подобными продуктами @ru
preferred label: Veľkoobchod s pevnými, kvapalnými a plynnými palivami a súvisiacimi produktmi @sk
preferred label: Trgovina na debelo s trdimi, tekočimi in plinastimi gorivi @sl
preferred label: Partihandel med bränslen @sv
preferred label: Katı, sıvı ve gazlı yakıtlar ile bunlarla ilgili ürünlerin toptan ticareti @tr
broader: Other specialised wholesale

Wholesale of metals and metal ores
type: Concept
notation: 46.72
status: valid
status modified: 2013-10-18
accepted date: 2013-10-18
in scheme: Statistical Classification of Economic Activities in the European Community, Rev. 2 (2008)
scope note: - търговия на едро с метални руди и техните концентрати - търговия на едро с черни и цветни метали в първични форми - търговия на едро с полуфабрикати от черни и цветни метали - търговия на едро със злато и други благородни метали - търговия на едро с метални отпадъци - 46.77 @bg
scope note: Z: - velkoobchod s železnými a neželeznými kovovými rudami - velkoobchod s železnými a neželeznými kovy v primárních formách - velkoobchod s železnými a neželeznými kovovými polotovary j. n. - velkoobchod se zlatem a jinými drahými kovy N: - velkoobchod s kovovým šrotem (46.77) @cs
scope note: Diese Klasse umfasst: - Großhandel mit Eisen- und anderen Metallerzen - Großhandel mit Hüttenmetallen - Großhandel mit Halbzeug aus Eisen- und anderen Metallerzen a. n. g. - Großhandel mit Gold und anderen Edelmetallen Diese Klasse umfasst nicht: - Großhandel mit Metallschrott (s. 46.77) @de
scope note: This class includes: - wholesale of ferrous and non-ferrous metal ores - wholesale of ferrous and non-ferrous metals in primary forms - wholesale of ferrous and non-ferrous semi-finished metal products n.e.c. - wholesale of gold and other precious metals This class excludes: - wholesale of metal scrap, see 46.77 @en
scope note: Esta clase comprende: - el comercio al por mayor de minerales metálicos férreos y no férreos - el comercio al por mayor de metales férreos y no férreos en forma primaria - el comercio al por mayor de productos metálicos férreos y no férreos semielaborados n.c.o.p. - el comercio al por mayor de oro y otros metales preciosos Esta clase no comprende: - el comercio al por mayor de chatarra metálica (véase 46.77) @es
scope note: Cette classe comprend: - le commerce de gros de minerais métalliques ferreux et non ferreux - le commerce de gros de métaux ferreux et non ferreux sous formes primaires - le commerce de gros de demi-produits en métaux ferreux et non ferreux n.c.a. - le commerce de gros d’or et d’autres métaux précieux Cette classe ne comprend pas: - le commerce de gros de déchets métalliques, voir 46.77 @fr
scope note: Ovaj razred uključuje: - trgovinu na veliko rudama željeza i obojenih metala - trgovinu na veliko primarnim prerađevinama od željeza i obojenih metala - trgovinu na veliko poluproizvodima od željeza i obojenih metala, d. n. - trgovinu na veliko zlatom i ostalim plemenitim metalima Ovaj razred isključuje: - trgovinu na veliko metalnim otpacima, vidi 46.77
scope note: Į šią klasę įeina: - juodųjų ir spalvotųjų metalų rūdų didmeninė prekyba - juodųjų ir spalvotųjų metalų pirminių formų didmeninė prekyba - kitų, niekur kitur nepriskirtų, juodųjų ir spalvotųjų metalų pusgaminių didmeninė prekyba - aukso ir kitų tauriųjų metalų didmeninė prekyba Į šią klasę neįeina: - metalo laužo didmeninė prekyba, žr. 46.77 @lt
scope note: Этот класс включает: оптовую торговлю различным ассортиментом товаров без какой-либо конкретной специализации @ru
scope note: Bu sınıf aşağıdakileri kapsamaktadır; - demir içeren ve demir içermeyen maden cevherlerinin toptan ticareti, - birincil formdaki demir içeren ve demir içermeyen metallerin toptan ticareti, - başka yerde sınıflandırılmamış demir içeren ve demir içermeyen yarı işlenmiş metal ürünlerin toptan ticareti, - altın ve diğer değerli metallerin toptan ticareti. Kapsam dışı olanlar; - metal atıkların toptan ticareti, bkz. 46.77. @tr
preferred label: Търговия на едро с метали и руди @bg
preferred label: Velkoobchod s rudami, kovy a hutními výrobky @cs
preferred label: Engroshandel med metaller og metalmalme @da
preferred label: Großhandel mit Erzen, Metallen und Metallhalbzeug @de
preferred label: Χονδρικό εμπόριο μετάλλων και μεταλλευμάτων @el
preferred label: Comercio al por mayor de metales y minerales metálicos @es
preferred label: Metallide ja metallimaakide hulgimüük @et
preferred label: Raakametallien ja metallimalmien tukkukauppa @fi
preferred label: Commerce de gros de minerais et métaux @fr
preferred label: Fém-, érc-nagykereskedelem
preferred label: Commercio all'ingrosso di metalli e di minerali metalliferi @it
preferred label: Metalų rūdų ir metalų didmeninė prekyba @lt
preferred label: Metālu un metāla rūdu vairumtirdzniecība @lv
preferred label: Bejgħ bl-ingrossa ta' metalli u minerali tal-metall @mt
preferred label: Groothandel in metalen en metaalertsen @nl
preferred label: Engroshandel med metaller og metallholdig malm @no
preferred label: Sprzedaż hurtowa metali i rud metali @pl
preferred label: Comércio por grosso de minérios e de metais @pt
preferred label: Comerţ cu ridicata al metalelor şi minereurilor metalice @ro
preferred label: Оптовая торговля металлами и металлическими рудами @ru
preferred label: Veľkoobchod s kovmi a kovovými rudami @sk
preferred label: Trgovina na debelo s kovinami in rudami @sl
preferred label: Partihandel med metaller och metallmalmer @sv
preferred label: Madenler ve maden cevherlerinin toptan ticareti @tr
broader: Other specialised wholesale

Wholesale of wood, construction materials and sanitary equipment
type: Concept
notation: 46.73
status: valid
status modified: 2013-10-18
accepted date: 2013-10-18
in scheme: Statistical Classification of Economic Activities in the European Community, Rev. 2 (2008)
scope note: - търговия на едро с необработен дървен материал - търговия на едро с първично обработен дървен материал - търговия на едро с бои, лакове и емайли - търговия на едро с материали за строителството: • тухли, керемиди, цимент, чакъл, пясък и други - търговия на едро с тапети и подови покрития, без килими - търговия на едро с плоско стъкло - търговия на едро със санитарно оборудване: • вани, мивки, тоалетни и друг санитарен порцелан - търговия на едро със сглобяеми къщи от дървен материал @bg
scope note: Z: - velkoobchod se surovým dřevem - velkoobchod s produkty primárního zpracování dřeva - velkoobchod s barvami a laky - velkoobchod se stavebními materiály: • pískem, štěrkem - velkoobchod s tapetami a podlahovými krytinami - velkoobchod s plochým sklem - velkoobchod se sanitárním zařízením: • vanami na koupání, umyvadly, toaletními mísami a jinými výrobky ze sanitární keramiky - velkoobchod se stavebními díly @cs
scope note: Diese Klasse umfasst: - Großhandel mit Rohholz - Großhandel mit Holzhalbwaren - Großhandel mit Anstrichmitteln - Großhandel mit Baustoffen: • Sand und Kies - Großhandel mit Tapeten und Fußbodenbelägen - Großhandel mit Flachglas - Großhandel mit Sanitärkeramik: • Badewannen, Waschbecken, Toiletten und andere sanitärkeramische Erzeugnisse - Großhandel mit vorgefertigten Gebäuden @de
scope note: This class includes: - wholesale of wood in the rough - wholesale of products of primary processing of wood - wholesale of paint and varnish - wholesale of construction materials: • sand, gravel - wholesale of wallpaper and floor coverings - wholesale of flat glass - wholesale of sanitary equipment: • baths, washbasins, toilets and other sanitary porcelain - wholesale of prefabricated buildings @en
scope note: Esta clase comprende: - el comercio al por mayor de madera en bruto - el comercio al por mayor de productos de primera transformación de la madera - el comercio al por mayor de pinturas y barnices - el comercio al por mayor de materiales de construcción: • arena, grava - el comercio al por mayor de papeles pintados y revestimientos de suelos - el comercio al por mayor de vidrio plano - el comercio al por mayor de sanitarios: • bañeras, lavabos, inodoros y otros sanitarios - el comercio al por mayor de edificios prefabricados @es
scope note: Cette classe comprend: - le commerce de gros de bois brut - le commerce de gros de produits de la transformation primaire du bois - le commerce de gros de peintures et de vernis - le commerce de gros de matériaux de construction: • sable, gravier - le commerce de gros de papiers peints et de revêtements de sols - le commerce de gros de verre plat - le commerce de gros d’appareils sanitaires: • baignoires, lavabos, cuvettes d’aisance et autres porcelaines sanitaires - le commerce de gros de bâtiments préfabriqués @fr
scope note: Ovaj razred uključuje: - trgovinu na veliko neobrađenim drvom - trgovinu na veliko proizvodima primarne obrade drva - trgovinu na veliko bojama i lakovima - trgovinu na veliko građevinskim materijalom: • pijeskom, šljunkom - trgovinu na veliko zidnim tapetama i podnim oblogama - trgovinu na veliko ravnim staklom - trgovinu na veliko sanitarnom opremom: • kadama, umivaonicima, WC školjkama i ostalom sanitarnom keramikom - trgovinu na veliko montažnim kućama
scope note: Į šią klasę įeina: - žaliavinės medienos didmeninė prekyba - pirminio medienos apdirbimo gaminių didmeninė prekyba - dažų ir lakų didmeninė prekyba - statybinių medžiagų didmeninė prekyba: • smėlio, žvyro - sienų apmušalų ir grindų dangų didmeninė prekyba - plokščiojo stiklo didmeninė prekyba - sanitarinės įrangos didmeninė prekyba: • vonių, praustuvų, klozetų ir kitokio sanitarinio porceliano - surenkamųjų pastatų didmeninė prekyba @lt
scope note: Данный раздел включает перепродажу (продажу без изменения) новых и бывших в употреблении товаров широкой общественности для личного или домашнего использования магазинами, универмагами, киосками, палатками, фирмами, выполняющими заказы по почте, уличными торговцами или торговцами вразнос, потребительскими кооперативами и т.п. Розничная торговля классифицируется прежде всего по типу места торговли (розничная торговля в магазинах: группы 47.1 по 47.7; розничная торговля не через магазины: группы 47.8 по 47.9). Розничная торговля через магазины включает розничную торговлю подержанными товарами (класс 47.79). Для розничной торговли через магазины существует дальнейшее подразделение на специализированную (группы 47.2 по 47.7) и неспециализированную розничную торговлю (группа 47.1). Специализированная розничная торговля новыми товарами далее классифицируется в зависимости от вида реализуемого товара. Торговля не через магазины подразделяется в соответствии с видами торговли, такими как розничная торговля посредством рынков и магазинов (группа 47.8) и прочие типы розничной торговли, осуществляемые не через магазины, например, по почтовым заказам, доставкой 99.99от порога до порога99.99, посредством торговых автоматов и т.д. (группа 47.9). Товары, перечисленные в данном разделе, ограничиваются товарами, обычно именуемыми как потребительские товары или товары розничной торговли. Следовательно, товары, которые обычно не классифицируются как товары розничной торговли, такие как зерно и злаковые культуры, руда, промышленное оборудование и т.д., из данного раздела исключаются. Данный раздел также может включать торговлю такими товарами как компьютеры, канцелярские товары, краска или древесина, несмотря на то, что эти продукты могут и не быть предназначены для личного или бытового использования. Обычные операции в торговле, которые не влияют на видоизменение товара, могут включать в себя, сортировку, разделение, смешивание и упаковку. Данный раздел также включает розничную торгов… @ru
scope note: Bu sınıf aşağıdakileri kapsamaktadır; - ham halde ağaç toptan ticareti, - ağacın ilk işlenmesinden elde edilen ürünlerin toptan ticareti, - boya ve vernik toptan ticareti, - inşaat malzemelerinin toptan ticareti: • kum, çakıl, - duvar kağıdı ve yer döşemelerinin toptan ticareti, - düz cam toptan ticareti, - sıhhi teçhizatın toptan ticareti: • banyolar, lavabolar, tuvaletler ve diğer sıhhi porselenler, - prefabrik yapıların toptan ticareti. @tr
preferred label: Търговия на едро с дървен материал, материали за строителството и санитарно оборудване @bg
preferred label: Velkoobchod se dřevem, stavebními materiály a sanitárním vybavením @cs
preferred label: Engroshandel med træ og byggematerialer samt sanitetsartikler @da
preferred label: Großhandel mit Holz, Baustoffen, Anstrichmitteln und Sanitärkeramik @de
preferred label: Χονδρικό εμπόριο ξυλείας, οικοδομικών υλικών και ειδών υγιεινής @el
preferred label: Comercio al por mayor de madera, materiales de construcción y aparatos sanitarios @es
preferred label: Puidu ja ehitusmaterjalide ja sanitaarseadmete hulgimüük @et
preferred label: Puun, rakennusmateriaalien ja saniteettilaitteiden tukkukauppa @fi
preferred label: Commerce de gros de bois, de matériaux de construction et d'appareils sanitaires @fr
preferred label: Fa-, építőanyag-, szaniteráru-nagykereskedelem
preferred label: Commercio all'ingrosso di legname, materiali da costruzione e apparecchi igienico-sanitari @it
preferred label: Medienos, statybinių medžiagų ir sanitarinių įrenginių didmeninė prekyba @lt
preferred label: Kokmateriālu, būvmateriālu un sanitārtehnikas ierīču vairumtirdzniecība @lv
preferred label: Bejgħ bl-ingrossa ta' injam, materjal għall-kostruzzjoni u tagħmir sanitarju @mt
preferred label: Groothandel in hout, bouwmaterialen en sanitair @nl
preferred label: Engroshandel med tømmer, trelast, byggevarer og sanitærutstyr @no
preferred label: Sprzedaż hurtowa drewna, materiałów budowlanych i wyposażenia sanitarnego @pl
preferred label: Comércio por grosso de madeira, de materiais de construção e de equipamento sanitário @pt
preferred label: Comerţ cu ridicata al materialului lemnos şi a materialelor de construcţie şi echipamentelor sanitare @ro
preferred label: Оптовая торговля лесоматериалами, строительными материалами и сантехническим оборудованием @ru
preferred label: Veľkoobchod s drevom, stavebným materiálom a sanitárnymi zariadeniami @sk
preferred label: Trgovina na debelo z lesom, gradbenim materialom in sanitarno opremo @sl
preferred label: Partihandel med virke, andra byggmaterial och sanitetsgods @sv
preferred label: Ağaç, inşaat malzemesi ve sıhhi teçhizat toptan ticareti @tr
broader: Other specialised wholesale

Wholesale of hardware, plumbing and heating equipment and supplies
type: Concept
notation: 46.74
status: valid
status modified: 2013-10-18
accepted date: 2013-10-18
in scheme: Statistical Classification of Economic Activities in the European Community, Rev. 2 (2008)
scope note: - търговия на едро с железария – гвоздеи, шайби, винтове, болтове, скрепителни елементи, катинари, брави за мебели и други - търговия на едро с канализационно, водопроводно и отоплително оборудване и арматура за него: • тръби и съединителни части за тях, колена, муфи, кранове, Т-образни и гъвкави свръзки и други - търговия на едро с инструменти (земеделски, градинарски или за дърводобив) например кирки, чукове, триони, отвертки и други инструменти за ръчна употреба @bg
scope note: Z: - velkoobchod se železářským zbožím a zámky - velkoobchod s instalačními předměty pro budovy a stavby - velkoobchod s ohřívači vody - velkoobchod s materiálem pro vnitřní instalace: • rourami, trubkami, kováním, kohoutky, T - součástmi, spojkami, pryžovými hadicemi atd. - velkoobchod s nářadím, např. kladivy, pilami, šroubováky a jiným ručním nářadím @cs
scope note: Diese Klasse umfasst: - Großhandel mit Metallwaren und Schlössern - Großhandel mit Installationsbedarf - Großhandel mit Warmwasserbereitern - Großhandel mit Sanitärinstallationsmaterial: • Rohrleitungen, Armaturen, T-Stücke, Anschlüsse, Gummischläuche usw. - Großhandel mit Handwerkszeugen wie Hämmer, Sägen, Schraubendreher usw. @de
scope note: This class includes: - wholesale of hardware and locks - wholesale of fittings and fixtures - wholesale of hot water heaters - wholesale of sanitary installation equipment: • tubes, pipes, fittings, taps, T-pieces, connections, rubber pipes etc. - wholesale of tools such as hammers, saws, screwdrivers and other hand tools @en
scope note: Esta clase comprende: - el comercio al por mayor de ferretería y cerraduras - el comercio al por mayor de elementos de instalación fija en edificios y sus accesorios - el comercio al por mayor de calentadores de agua - el comercio al por mayor de equipo para la instalación de sanitarios: • tuberías, cañerías, accesorios, grifos, juntas, conexiones, cañerías de caucho, etc. - el comercio al por mayor de herramientas como martillos, sierras, destornilladores y otras herramientas manuales @es
scope note: Cette classe comprend: - le commerce de gros d’articles de serrurerie - le commerce de gros de fixations - le commerce de gros de chaudières - le commerce de gros de fournitures pour installations sanitaires: • tubes, tuyaux, raccords de tuyauterie, robinets, raccordements en T, tuyaux en caoutchouc, etc. - le commerce de gros d’outils tels que marteaux, scies, tournevis et outils similaires à main @fr
scope note: Ovaj razred uključuje: - trgovinu na veliko željeznom robom i bravama - trgovinu na veliko instalacijskim materijalom - trgovinu na veliko grijačima za toplu vodu - trgovinu na veliko sanitarnom instalacijskom opremom: • cijevima, fitinzima, slavinama, T-dijelovima, spojevima, gumenim cijevima itd. - trgovinu na veliko alatima kao što su čekići, pile, odvijači i ostali ručni alati
scope note: Į šią klasę įeina: - metalinių dirbinių ir spynų didmeninė prekyba - jungiamųjų detalių ir įtaisų didmeninė prekyba - vandens šildytuvų didmeninė prekyba - sanitarinės instaliacinės įrangos didmeninė prekyba: • vamzdžių, vamzdelių, jungiamųjų detalių, čiaupų, trišakių, jungių, guminių vamzdžių ir kt. - įrankių, tokių kaip plaktukai, pjūklai, atsuktuvai ir kitokie rankiniai įrankiai, didmeninė prekyba @lt
scope note: Данная группа включает розничную торговлю различным ассортиментом товаров в одних и тех же торговых точках (неспециализированных магазинах), таких как супермаркеты или универмаги. @ru
scope note: Bu sınıf aşağıdakileri kapsamaktadır; - hırdavat ve kilitlerin toptan ticareti, - armatürler (bağlantı parçaları) ve aparatların toptan ticareti, - sıcak su ısıtıcılarının toptan ticareti, - sıhhi tesisat malzemelerinin toptan ticareti: • tüpler, borular, armatürler (bağlantı parçaları), musluklar, T-parçaları, bağlantılar, kauçuk borular ve benzeri, - çekiçler, testereler, tornavidalar ve diğer el aletlerinin toptan ticareti. @tr
preferred label: Търговия на едро с железария и арматурни изделия @bg
preferred label: Velkoobchod se železářským zbožím a instalatérskými a topenářskými potřebami @cs
preferred label: Engroshandel med isenkram, varmeanlæg og tilbehør @da
preferred label: Großhandel mit Metall- und Kunststoffwaren für Bauzwecke sowie Installationsbedarf für Gas, Wasser und Heizung @de
preferred label: Χονδρικό εμπόριο σιδηρικών, υδραυλικών ειδών και εξοπλισμού και προμηθειών για εγκαταστάσεις θέρμανσης @el
preferred label: Comercio al por mayor de ferretería, fontanería y calefacción @es
preferred label: Rauakaupade, veevarustus- ja kütteseadmete ning nende koosteosade hulgimüük @et
preferred label: Rautakauppatavaroiden, LVI-laitteiden ja -tarvikkeiden tukkukauppa @fi
preferred label: Commerce de gros de quincaillerie et fournitures pour plomberie et chauffage @fr
preferred label: Fémáru-, szerelvény, fűtési berendezés nagykereskedelme
preferred label: Commercio all'ingrosso di ferramenta, di apparecchi e accessori per impianti idraulici e di riscaldamento @it
preferred label: Metalinių dirbinių, vandentiekio ir šildymo įrangos bei reikmenų didmeninė prekyba @lt
preferred label: Metālizstrādājumu cauruļu, apkures iekārtu un to piederumu vairumtirdzniecība @lv
preferred label: Bejgħ bl-ingrossa ta' ferramenta u tagħmir u provvisti għall-plaming u t-tisħin @mt
preferred label: Groothandel in ijzerwaren en in installatiemateriaal voor loodgieterswerk en verwarming @nl
preferred label: Engroshandel med jernvarer, rørleggerartikler og oppvarmingsutstyr @no
preferred label: Sprzedaż hurtowa wyrobów metalowych oraz sprzętu i dodatkowego wyposażenia hydraulicznego i grzejnego @pl
preferred label: Comércio por grosso de ferragens, ferramentas manuais e artigos para canalizações e aquecimento @pt
preferred label: Comerţ cu ridicata al echipamentelor şi furniturilor de fierărie pentru instalaţii sanitare şi de încălzire @ro
preferred label: Оптовая торговля металлическими изделиями, водопроводным и отопительным оборудованием и инвентарем @ru
preferred label: Veľkoobchod so železiarskym a inštalatérskym tovarom a vykurovacími zariadeniami a potrebami @sk
preferred label: Trgovina na debelo s kovinskimi proizvodi, inštalacijskim materialom, napravami za ogrevanje @sl
preferred label: Partihandel med järnhandelsvaror och VVS-armatur @sv
preferred label: Hırdavat, sıhhi tesisat ve ısıtma tesisatı malzemelerinin toptan ticareti @tr
broader: Other specialised wholesale

Wholesale of chemical products
type: Concept
notation: 46.75
status: valid
status modified: 2013-10-18
accepted date: 2013-10-18
in scheme: Statistical Classification of Economic Activities in the European Community, Rev. 2 (2008)
scope note: - търговия на едро с основни промишлени химични продукти: • анилинова боя, печатарско мастило, етерични масла, промишлени газове, химични лепила, багрилни вещества, синтетични смоли, метанол, парафин, парфюми и есенции, сода, промишлени соли, киселини и сяра, нишесте и нишестени продукти - търговия на едро с торове и агрохимикали - минерални, животински или растителни торове, пестициди, инсектициди, хербициди, дезинфекционни средства и други @bg
scope note: Z: - velkoobchod s průmyslovými chemikáliemi: • anilinem, tiskařskými barvami, éterickými oleji, průmyslovými plyny, chemickými lepidly, barvivy, syntetickými pryskyřicemi, metanolem, parafínem, vůněmi a esencemi, sodou, průmyslovými solemi, kyselinami, sírou, deriváty škrobu atd. - velkoobchod s hnojivy a agrochemickými výrobky @cs
scope note: Diese Klasse umfasst: - Großhandel mit technischen Chemikalien: • Anilin, Druckfarbe, etherische Öle, Industriegase, chemische Klebstoffe, Farbstoffe, Kunstharz, Methanol, Paraffin, Duft- und Geschmacksstoffe, Soda, Industriesalz, Säuren, Schwefel, Stärkederivate usw. - Großhandel mit Düngemitteln und agrochemischen Erzeugnissen @de
scope note: This class includes: - wholesale of industrial chemicals: • aniline, printing ink, essential oils, industrial gases, chemical glues, colouring matter, synthetic resin, methanol, paraffin, scents and flavourings, soda, industrial salt, acids and sulphurs, starch derivates etc. - wholesale of fertilisers and agrochemical products @en
scope note: Esta clase comprende: - el comercio al por mayor de productos químicos industriales: • anilina, tinta de impresión, aceites esenciales, gases industriales, colas sintéticas, colorantes, resina sintética, metanol, parafina, aromatizantes y potenciadores del sabor, soda, sal industrial, ácidos y sulfuros, derivados de almidón, etc. - el comercio al por mayor de fertilizantes y productos agroquímicos @es
scope note: Cette classe comprend: - le commerce de gros de produits chimiques industriels: • aniline, encres d’imprimerie, huiles essentielles, gaz industriels, colles chimiques, matières colorantes, résine synthétique, méthanol, paraffine, parfums et essences, soude, sel industriel, acides et soufre, produits amylacés, etc. - le commerce de gros d’engrais et de produits phytosanitaires @fr
scope note: Ovaj razred uključuje: - trgovinu na veliko industrijskim kemikalijama: • anilinom, tiskarskim bojama, eteričnim uljima, industrijskim plinovima, kemijskim ljepilima, bojama, sintetičkom smolom, metanolom, parafinom, mirisima i aromama, sodom, industrijskom soli, kiselinama i sumpornim spojevima, derivatima škroba itd. - trgovinu na veliko gnojivima i agrokemijskim proizvodima
scope note: Į šią klasę įeina: - pramoninių chemikalų didmeninė prekyba: • anilino, spaustuvinių dažų, eterinių aliejų, pramoninių dujų, cheminių klijų, dažančiųjų medžiagų, dirbtinės dervos, metanolio, parafino, skoninių ir aromatingųjų medžiagų, sodos, pramoninės druskos, rūgščių ir sieros, krakmolo pakaitalų ir kt. - trąšų ir agrocheminių produktų didmeninė prekyba @lt
scope note: Этот класс включает: - розничную торговлю широким ассортиментом товаров, из которых, продукты питания, напитки или табачные изделия должны преобладать: • деятельность универсальных магазинов, имеющих, помимо основной торговли продуктами питания, напитками или табачными изделиями, ряд других товаров, таких как одежда, мебель, бытовые приборы, скобяные изделия, косметика и т.д. @ru
scope note: Bu sınıf aşağıdakileri kapsamaktadır; - endüstriyel kimyasal ürünlerinin toptan ticareti: • anilin, matbaa mürekkebi, bitkisel yağlar, endüstriyel gazlar, kimyasal yapıştırıcılar, boyama maddeleri, sentetik reçine, metil alkol, parafin, esanslar ve tatlandırıcılar, soda, sanayi tuzu, asitler ve sülfürler, kola türevleri vb. - gübreler ve tarım ilaçlarının toptan ticareti. @tr
preferred label: Търговия на едро с химични вещества и продукти @bg
preferred label: Velkoobchod s chemickými výrobky @cs
preferred label: Engroshandel med kemiske produkter @da
preferred label: Großhandel mit chemischen Erzeugnissen @de
preferred label: Χονδρικό εμπόριο χημικών προϊόντων @el
preferred label: Comercio al por mayor de productos químicos @es
preferred label: Keemiatoodete hulgimüük @et
preferred label: Peruskemikaalien, lannoitteiden yms. tukkukauppa @fi
preferred label: Commerce de gros de produits chimiques @fr
preferred label: Vegyi áru nagykereskedelme
preferred label: Commercio all'ingrosso di prodotti chimici @it
preferred label: Chemijos produktų didmeninė prekyba @lt
preferred label: Ķīmisko vielu vairumtirdzniecība @lv
preferred label: Bejgħ bl-ingrossa ta' prodotti kimiċi @mt
preferred label: Groothandel in chemische producten @nl
preferred label: Engroshandel med kjemiske produkter @no
preferred label: Sprzedaż hurtowa wyrobów chemicznych @pl
preferred label: Comércio por grosso de produtos químicos @pt
preferred label: Comerţ cu ridicata al produselor chimice @ro
preferred label: Оптовая торговля химической продукцией @ru
preferred label: Veľkoobchod s chemickými výrobkami @sk
preferred label: Trgovina na debelo s kemičnimi izdelki @sl
preferred label: Partihandel med kemiska produkter @sv
preferred label: Kimyasal ürünlerin toptan ticareti @tr
broader: Other specialised wholesale

Wholesale of other intermediate products
type: Concept
notation: 46.76
status: valid
status modified: 2013-10-18
accepted date: 2013-10-18
in scheme: Statistical Classification of Economic Activities in the European Community, Rev. 2 (2008)
scope note: - търговия на едро с пластмаси в първични форми - търговия на едро с каучук - търговия на едро с текстилни влакна - естествени, синтетични или изкуствени влакна, подготвени за предене - търговия на едро с хартии и картони във форми, пригодени за продажба на едро - търговия на едро със скъпоценни камъни @bg
scope note: Z: - velkoobchod s plastovými materiály v primárních formách - velkoobchod s gumou - velkoobchod s textilními vlákny atd. - velkoobchod s papírem ve velkém - velkoobchod s drahými kameny @cs
scope note: Diese Klasse umfasst: - Großhandel mit Rohkunststoffen - Großhandel mit Kautschuk - Großhandel mit Textilfasern usw. - Großhandel mit Papier (Meterware) - Großhandel mit Edelsteinen @de
scope note: This class includes: - wholesale of plastic materials in primary forms - wholesale of rubber - wholesale of textile fibres etc. - wholesale of paper in bulk - wholesale of precious stones @en
scope note: Esta clase comprende: - el comercio al por mayor de materias plásticas en forma primaria - el comercio al por mayor de caucho - el comercio al por mayor de fibras textiles, etc. - el comercio al por mayor de papel en bruto - el comercio al por mayor de piedras preciosas @es
scope note: Cette classe comprend: - le commerce de gros de matières plastiques sous formes primaires - le commerce de gros de caoutchouc - le commerce de gros de fibres textiles, etc. - le commerce de gros de papier en vrac - le commerce de gros de pierres précieuses @fr
scope note: Ovaj razred uključuje: - trgovinu na veliko primarnim prerađevinama od plastičnih materijala - trgovinu na veliko gumom - trgovinu na veliko tekstilnim vlaknima itd. - trgovinu na veliko papirom (nekonfencioniranim) - trgovina na veliko dragim kamenjem
scope note: Į šią klasę įeina: - plastikinių medžiagų pirminių formų didmeninė prekyba - gumos (kaučiuko) didmeninė prekyba - tekstilės pluoštų ir kt. didmeninė prekyba - popieriaus šūsnių didmeninė prekyba - brangakmenių didmeninė prekyba @lt
scope note: Этот класс включает: - розничную торговлю широким ассортиментом товаров, из которых, продукты питания, напитки или табачные изделия не преобладают - деятельность универсальных магазинов, торгующих товарами общего ассортимента, включая одежду, мебель, бытовые приборы, скобяные изделия, косметику, ювелирные изделия, игрушки, спортивные товары и т.д. @ru
scope note: Bu sınıf aşağıdakileri kapsamaktadır; - birincil formda plastik maddelerin toptan ticareti, - kauçuk toptan ticareti, - tekstil elyafı vb. toptan ticareti, - dökme halde kağıt satışı, - değerli taşların toptan ticareti. @tr
preferred label: Специализирана търговия на едро с други междинни продукти @bg
preferred label: Velkoobchod s ostatními meziprodukty @cs
preferred label: Engroshandel med andre råvarer og halvfabrikata @da
preferred label: Großhandel mit sonstigen Halbwaren @de
preferred label: Χονδρικό εμπόριο άλλων ενδιάμεσων προϊόντων @el
preferred label: Comercio al por mayor de otros productos semielaborados @es
preferred label: Muude vahetoodete hulgimüük @et
preferred label: Muiden välituotteiden tukkukauppa @fi
preferred label: Commerce de gros d'autres produits intermédiaires @fr
preferred label: Egyéb termelési célú termék nagykereskedelme
preferred label: Commercio all'ingrosso di altri prodotti intermedi @it
preferred label: Kitų tarpinių produktų didmeninė prekyba @lt
preferred label: Starpproduktu vairumtirdzniecība @lv
preferred label: Bejgħ bl-ingrossa ta' prodotti oħra intermedji @mt
preferred label: Groothandel in andere intermediaire producten @nl
preferred label: Engroshandel med innsatsvarer ellers @no
preferred label: Sprzedaż hurtowa pozostałych półproduktów @pl
preferred label: Comércio por grosso de outros bens intermédios @pt
preferred label: Comerţ cu ridicata al altor produse intermediare @ro
preferred label: Оптовая торговля прочими промежуточными продуктами @ru
preferred label: Veľkoobchod s ostatnými medziproduktmi @sk
preferred label: Trgovina na debelo z drugimi polizdelki @sl
preferred label: Partihandel med andra insatsvaror @sv
preferred label: Diğer ara ürünlerin toptan ticareti @tr
broader: Other specialised wholesale

Wholesale of waste and scrap
type: Concept
notation: 46.77
status: valid
status modified: 2013-10-18
accepted date: 2013-10-18
in scheme: Statistical Classification of Economic Activities in the European Community, Rev. 2 (2008)
scope note: - търговия на едро с метални и неметални отпадъци и скрап и с материали за вторична преработка, вкл. събиране, сортиране, разделяне, разглобяване на употребявани стоки (като например автомобили за части втора употреба), опаковане и преопаковане, складиране и доставяне, но без преработване. Купените и продадените отпадъци имат остатъчна стойност. - разкомплектоване на излезли от употреба автомобили, компютри и друго оборудване, когато целта е извличане на части за продажба и повторна употреба - събиране на битови и производствени отпадъци - 38.1 - обработване и обезвреждане на отпадъци с цел тяхното отстраняване - 38.2 - преработка на отпадъци и скрап до състояние на вторично получена суровина, при която се изисква процес на действителна преработка (получените суровини от рециклирани отпадъци се считат като междинни стоки, годни за директно използване в различни промишлени производства, но не са краен продукт) - 38.3 - разкомплектоване на отпадъци от всякакъв тип (автомобили, кораби, компютри, телевизори и друго оборудване) за последващо рециклиране - 38.31 - разкъсване на парчета или раздробяване (шредиране) на стари автомобили и други метални отпадъци - 38.32 - търговия на дребно с употребявани стоки - 47.79 @bg
scope note: Z: - velkoobchod s kovovým a nekovovým odpadem a šrotem a materiály pro recyklaci, zahrnující sběr, třídění, oddělování, řezání použitého zboží (např. auta), aby se získaly znovu použitelné díly pro další prodej; zahrnuje také balení, přebalování, skladování a dodávání odpadu a šrotu, ale bez reálného transformačního procesu. Přesto má nakupovaný a prodávaný odpad zbytkovou hodnotu. ZT: - demontáž automobilů, počítačů, televizorů a jiných zařízení za účelem získání a následného prodeje použitelných dílů N: - shromažďování a sběr komunálního a průmyslového odpadu (38.1) - úprava odpadu, s cílem jeho odstranění (38.2) - zpracování odpadu a šrotu na druhotnou surovinu, kde je vyžadován skutečný transformační proces (výsledná surovina je vhodná pro přímé použití v průmyslovém výrobním procesu, ale není finálním produktem) (38.3) - demontáž automobilů, počítačů, televizorů a jiných vraků za účelem zpětného získávání materiálů, za účelem dalšího zpracování (38.31) - demontáž lodí ( 38.31) - úprava vraků motorových vozidel mechanickými postupy k dalšímu využití (38.32) - maloobchod s použitým zbožím (47.79) @cs
scope note: Diese Klasse umfasst: - Großhandel mit Schrott und sonstigen Altmaterialien und Reststoffen für die Rückgewinnung, einschließlich Sammeln, Sortieren, Trennen, Zerlegen von Gebrauchtwaren, wie z. B. Autos, zur Gewinnung wieder verwertbarer Teile, Verpacken und Neuverpacken, Lagern und Ausliefern, jedoch ohne eigentliches Weiterverarbeitungsverfahren. Darüber hinaus haben die angekauften und verkauften Altmaterialien einen Restwert. Diese Klasse umfasst ferner: - Zerlegen von Kraftwagen, Datenverarbeitungsgeräten, Fernseh- und anderen Geräten zur Gewinnung und zum Wiederverkauf von verwendbaren Einzelteilen Diese Klasse umfasst nicht: - Sammlung von Abfällen aus Haushalt, Industrie, Handwerk und Gewerbe (s. 38.1) - Behandlung von Abfällen, nicht zur Weiterverwendung in einem industriellen Herstellungsverfahren, sondern mit dem Ziel der Entsorgung (s. 38.2) - Verarbeitung von Altmaterialien, Reststoffen usw. zu Sekundärrohstoffen, wenn ein industrieller Verarbeitungsprozess erforderlich ist (die hergestellten Sekundärrohstoffe eignen sich für die direkte Verwendung in einem industriellen Herstellungsverfahren, sind jedoch kein Endprodukt) (s. 38.3) - Zerlegen von Kraftwagen, Datenverarbeitungsgeräten, Fernseh- und anderen Geräten zur Materialrückgewinnung (s. 38.31) - Schiffsverschrottung (s. 38.31) - Schreddern von Autos mit Hilfe mechanischer Verfahren (s. 38.32) - Einzelhandel mit Gebrauchtwaren (s. 47.79) @de
scope note: This class includes: - wholesale of metal and non-metal waste and scrap and materials for recycling, including collecting, sorting, separating, stripping of used goods such as cars in order to obtain reusable parts, packing and repacking, storage and delivery, but without a real transformation process. Additionally, the purchased and sold waste has a remaining value. This class also includes: - dismantling of automobiles, computers, televisions and other equipment to obtain and re-sell usable parts This class excludes: - collection of household and industrial waste, see 38.1 - treatment of waste, not for a further use in an industrial manufacturing process, but with the aim of disposal, see 38.2 - processing of waste and scrap and other articles into secondary raw material when a real transformation process is required (the resulting secondary raw material is fit for direct use in an industrial manufacturing process, but is not a final product), see 38.3 - dismantling of automobiles, computers, televisions and other equipment for materials recovery, see 38.31 - ship-breaking, see 38.31 - shredding of cars by means of a mechanical process, see 38.32 - retail sale of second-hand goods, see 47.79 @en
scope note: Esta clase comprende: - el comercio al por mayor de desechos metálicos y no metálicos y de chatarra, así como de materiales para reciclar, incluida la recogida, clasificación, separación, desguace de bienes usados, como automóviles, con el fin de obtener partes reutilizables, (re-)embalaje, almacenamiento y distribución, pero sin un verdadero proceso de transformación. Además, los desechos comprados y vendidos siguen manteniendo un valor. Esta clase comprende también: - el desguace de automóviles, ordenadores, televisores y otros equipos para obtener y revender piezas que pueden volver a usarse Esta clase no comprende: - la recogida de residuos domésticos e industriales (véase 38.1) - el tratamiento de los desechos para su eliminación, y no para su utilización ulterior en un proceso de fabricación industrial (véase 38.2) - el procesamiento de desechos, chatarra y otros artículos para la obtención de una materia prima secundaria cuando es necesario un verdadero proceso de transformación (la materia prima secundaria resultante es apta para su utilización directa en un proceso de fabricación industrial, pero no constituye un producto final) (véase 38.3) - el desguace de automóviles, ordenadores, televisores y otros equipos para la recuperación de materiales (véase 38.31) - desguace naval (véase 38.31) - la trituración de automóviles mediante proceso mecánico (véase 38.32) - el comercio al por menor de bienes de segunda mano (véase 47.79) @es
scope note: Cette classe comprend: - le commerce de gros de déchets et débris métalliques et non métalliques et de matériaux de récupération, y compris la collecte, le tri, la séparation, le démontage de biens usés tels que les automobiles afin de récupérer des pièces réutilisables, le reconditionnement, le stockage et la livraison mais sans réelle transformation. De plus, les déchets achetés et vendus ont une valeur résiduelle. Cette classe comprend également: - le démantèlement d’automobiles, d’ordinateurs, de télévisions et d’autres matériels à des fins de récupération de pièces pour les revendre Cette classe ne comprend pas: - l’enlèvement des déchets ménagers et industriels, voir 38.1 - le traitement des déchets non à des fins de réutilisation dans un processus de fabrication industrielle mais d’élimination, voir 38.2 - le recyclage de déchets, de débris et d’autres articles sous la forme de matières premières secondaires si une réelle transformation est requise (les matières premières secondaires résultantes sont propres à une utilisation directe dans un processus de fabrication industrielle et ne sont pas un produit fini), voir 38.3 - le démantèlement d’automobiles, d’ordinateurs, de télévisions et d’autres matériels à des fins de récupération de matériaux, voir 38.31 - la démolition navale, voir 38.31 - le déchiquetage de véhicules par un procédé mécanique, voir 38.32 - le commerce de détail de biens d’occasion, 47.79 @fr
scope note: Ovaj razred uključuje: - trgovinu na veliko metalnim i nemetalnim ostacima i otpacima i materijalom za reciklažu, uključujući skupljanje, sortiranje, odvajanje, rastavljanje rabljenih predmeta, na primjer automobila, radi izdvajanja dijelova koji se mogu ponovno upotrijebiti, pakiranje i prepakiranje, skladištenje i isporuku, ali bez stvarnoga transformacijskog procesa. Osim toga kupljeni i prodani otpaci zadržavaju preostalu vrijednost. Ovaj razred također uključuje: - rastavljanje automobila, računala, televizora i ostale opreme radi izdvajanja i preprodaje upotrebljivih dijelova Ovaj razred isključuje: - skupljanje kućnog i industrijskog otpada, vidi 38.1 - obradu otpada, ne za daljnju uporabu u prerađivačkoj industriji, već s ciljem njegova uklanjanja, vidi 38.2 - preradu ostataka i otpadaka te drugih predmeta u sekundarnu sirovinu koja zahtijeva stvarni transformacijski proces (sekundarna sirovina pogodna je za izravnu uporabu u industrijskom procesu, ali nije riječ o gotovom proizvodu) vidi 38.3 - rastavljanje automobila, računala, televizora i ostale opreme radi obnavljanja materijala, vidi 38.31 - rezanje brodova, vidi 38.31 - rezanje automobila mehaničkim procesom, vidi 38.32 - trgovinu na malo rabljenom robom, vidi 47.79
scope note: Į šią klasę įeina: - metalo ir nemetalo atliekų, laužo ir medžiagų tinkamų grąžinamajam perdirbimui didmeninė prekyba, įskaitant naudotų daiktų, tokių kaip automobiliai, kaupimą, rūšiavimą, išardymą, išrinkimą, norint atskirti tinkamas naudoti dalis, pakavimą, perpakavimą, saugojimą ir pristatymą, bet realus perdirbimo procesas čia neįeina. Be to, superkamos ir parduodamos atliekos turi tam tikrą likutinę vertę. Į šią klasę taip pat įeina: - automobilių, kompiuterių, televizorių ir kitos įrangos išardymas ir išrinkimas dalių tinkamų pardavimui Į šią klasę neįeina: - buitinių ir pramoninių atliekų rinkimas, žr. 38.1 - atliekų tvarkymas, nesusijęs su jų panaudojimu tolesniame pramoninės gamybos procese, turint tikslą jas pašalinti, žr. 38.2 - atliekų, laužo ir kitokių daiktų perdirbimas į antrines žaliavas, kai realus perdirbimo procesas būtinas (antrinės žaliavos, kaip perdirbimo rezultatas, tiesiogiai tinka pramoniniam gamybos procesui, bet tai nėra naujas produktas), žr. 38.3 - automobilių, kompiuterių, televizorių ir kitos įrangos išardymas, atskiriant atgavimui tinkamas medžiagas, žr. 38.31 - laivų išardymas, žr. 38.31 - automobilių supjaustymas mechaniniu būdu, žr. 38.32 - naudotų daiktų mažmeninė prekyba, žr. 47.79 @lt
scope note: Bu sınıf aşağıdakileri kapsamaktadır; - toplama, sıralama, ayırma, tekrar kullanılabilecek kısımları elde etmek amacıyla kullanılmış malları sökme, paketleme ve tekrar paketleme, depolama ve dağıtma (burada,gerçek bir dönüştürme işlemi yoktur) dahil, metal ve metal olmayan atık ve hurdalar ile yeniden dönüştürülebilir malzemelerin toptan ticareti. Ayrıca, satın alınan ve satılan atıklar kalıcı bir değere sahiptir. Ayrıca bu sınıf aşağıdakileri de kapsamaktadır; - kullanılabilir parçalar elde etmek veya yeniden satmak için otomobillerin, bilgisayarların, televizyonların ve diğer ekipmanın sökülmesi (demontajı). Kapsam dışı olanlar; - ev ve endüstri atıklarının toplanması, bkz. 38.1, - bir endüstriyel imalat işleminde daha ileri bir kullanım amacıyla yapılmayan, fakat bertaraf amacıyla yapılan atıkların işlenmesi, , bkz. 38.2, - gerçek bir dönüşüm işleminin gerekmesi durumunda atık ve hurdalar ile diğer malzemelerin ikincil hammaddeye dönüştürülmesi (İkincil hammadde olarak ortaya çıkarılan bu ürünler, bir sanayi imalat işleminde direk kullanım için uygundur, fakat, nihai yeni bir ürün değildir), bkz. 38.3, - eşyaların yenilenmesi için, otomobillerin, bilgisayarların, televizyonların ve diğer ekipmanın sökülmesi, bkz. 38.31, - gemi sökümü, bkz. 38.31, - bir mekanik işlem yardımıyla araçların parçalanması, bkz. 38.32, - ikinci el eşyaların perakende satışı, bkz. 47.79. @tr
preferred label: Търговия на едро с отпадъци и скрап @bg
preferred label: Velkoobchod s odpadem a šrotem @cs
preferred label: Engroshandel med affaldsprodukter @da
preferred label: Großhandel mit Altmaterialien und Reststoffen @de
preferred label: Χονδρικό εμπόριο απορριμμάτων και υπολειμμάτων @el
preferred label: Comercio al por mayor de chatarra y productos de desecho @es
preferred label: Jäätmete ja jääkide hulgikaubandus @et
preferred label: Jätteen ja romun tukkukauppa @fi
preferred label: Commerce de gros de déchets et débris @fr
preferred label: Hulladék-nagykereskedelem
preferred label: Commercio all'ingrosso di rottami e cascami @it
preferred label: Atliekų ir laužo didmeninė prekyba @lt
preferred label: Atkritumu un lūžņu vairumtirdzniecība @lv
preferred label: Bejgħ bl-ingrossa ta' skart u ruttam @mt
preferred label: Groothandel in afval en schroot @nl
preferred label: Engroshandel med avfall og skrap @no
preferred label: Sprzedaż hurtowa odpadów i złomu @pl
preferred label: Comércio por grosso de desperdícios e sucata @pt
preferred label: Comerţ cu ridicata al deşeurilor şi resturilor @ro
preferred label: Оптовая торговля отходами и ломом @ru
preferred label: Veľkoobchod s odpadom a šrotom @sk
preferred label: Trgovina na debelo z ostanki in odpadki @sl
preferred label: Partihandel med avfallsprodukter och skrot @sv
preferred label: Atık ve hurda toptan ticareti @tr
broader: Other specialised wholesale

Non-specialised wholesale trade
type: Concept
notation: 46.9
status: valid
status modified: 2013-10-18
accepted date: 2013-10-18
in scheme: Statistical Classification of Economic Activities in the European Community, Rev. 2 (2008)
scope note: Этот класс включает: - розничную торговлю свежими фруктами и овощами - розничную торговлю приготовленными и консервированными фруктами и овощами @ru
preferred label: Неспециализирана търговия на едро @bg
preferred label: Nespecializovaný velkoobchod @cs
preferred label: Ikke-specialiceret engroshandel @da
preferred label: Großhandel ohne ausgeprägten Schwerpunkt @de
preferred label: Μη ειδικευμένο χονδρικό εμπόριο @el
preferred label: Comercio al por mayor no especializado @es
preferred label: Spetsialiseerimata hulgikaubandus @et
preferred label: Muu tukkukauppa @fi
preferred label: Commerce de gros non spécialisé @fr
preferred label: Vegyestermékkörű nagykereskedelem
preferred label: Commercio all'ingrosso non specializzato @it
preferred label: Nespecializuota didmeninė prekyba @lt
preferred label: Nespecializētā vairumtirdzniecība @lv
preferred label: Negozju bl-ingrossa mhux speċjalizzat @mt
preferred label: Niet-gespecialiseerde groothandel @nl
preferred label: Uspesifisert engroshandel @no
preferred label: Sprzedaż hurtowa niewyspecjalizowana @pl
preferred label: Comércio por grosso não especializado @pt
preferred label: Comerţ cu ridicata nespecializat @ro
preferred label: Неспециализированная оптовая торговля @ru
preferred label: Nešpecializovaný veľkoobchod @sk
preferred label: Nespecializirana trgovina na debelo @sl
preferred label: Övrig partihandel @sv
preferred label: Belirli bir mala tahsis edilmemiş mağazalardaki toptan ticaret @tr
broader: Wholesale trade, except of motor vehicles and motorcycles
narrower: Non-specialised wholesale trade

Non-specialised wholesale trade
type: Concept
notation: 46.90
status: valid
status modified: 2013-10-18
accepted date: 2013-10-18
in scheme: Statistical Classification of Economic Activities in the European Community, Rev. 2 (2008)
scope note: - търговия на едро с разнообразни стоки без особена специализация @bg
scope note: Z: - velkoobchod se zbožím různého druhu bez vyhraněné specializace @cs
scope note: Zu dieser Klasse gehört: - Großhandel mit Waren verschiedener Art ohne ausgeprägten Schwerpunkt @de
scope note: This class includes: - wholesale of a variety of goods without any particular specialisation @en
scope note: Esta clase comprende: - el comercio al por mayor de bienes diversos sin una especialización particular @es
scope note: Cette classe comprend: - le commerce de gros de divers produits et articles sans spécialisation particulière @fr
scope note: Ovaj razred uključuje: - trgovinu na veliko različitim proizvodima bez posebne specijalizacije
scope note: Į šią klasę įeina: - įvairių nespecializuotų prekių didmeninė prekyba @lt
scope note: Этот класс включает: - розничную торговлю мясом и мясными продуктами (включая птицу) @ru
scope note: Bu sınıf aşağıdakileri kapsamaktadır; - belirli bir uzmanlaşma olmaksızın çeşitli malların toptan ticareti. @tr
preferred label: Неспециализирана търговия на едро @bg
preferred label: Nespecializovaný velkoobchod @cs
preferred label: Ikke-specialiceret engroshandel @da
preferred label: Großhandel ohne ausgeprägten Schwerpunkt @de
preferred label: Μη ειδικευμένο χονδρικό εμπόριο @el
preferred label: Comercio al por mayor no especializado @es
preferred label: Spetsialiseerimata hulgikaubandus @et
preferred label: Muu tukkukauppa @fi
preferred label: Commerce de gros non spécialisé @fr
preferred label: Vegyestermékkörű nagykereskedelem
preferred label: Commercio all'ingrosso non specializzato @it
preferred label: Nespecializuota didmeninė prekyba @lt
preferred label: Nespecializētā vairumtirdzniecība @lv
preferred label: Negozju bl-ingrossa mhux speċjalizzat @mt
preferred label: Niet-gespecialiseerde groothandel @nl
preferred label: Uspesifisert engroshandel @no
preferred label: Sprzedaż hurtowa niewyspecjalizowana @pl
preferred label: Comércio por grosso não especializado @pt
preferred label: Comerţ cu ridicata nespecializat @ro
preferred label: Неспециализированная оптовая торговля @ru
preferred label: Nešpecializovaný veľkoobchod @sk
preferred label: Nespecializirana trgovina na debelo @sl
preferred label: Övrig partihandel @sv
preferred label: Belirli bir mala tahsis edilmemiş mağazalardaki toptan ticaret @tr
broader: Non-specialised wholesale trade

Retail trade, except of motor vehicles and motorcycles
type: Concept
notation: 47
status: valid
status modified: 2013-10-18
accepted date: 2013-10-18
in scheme: Statistical Classification of Economic Activities in the European Community, Rev. 2 (2008)
scope note: Този раздел включва препродажба (продажба без преработване) на нови и употребявани стоки за широк кръг потребители за лично или домакинско потребление и употреба; осъществява се от специализирани или универсални магазини, открити щандове и сергии; чрез фирми, изпълняващи поръчки по пощата; амбулантни търговци; потребителски кооперации; фирми, организиращи търгове и други. Търговията на дребно е класифицирана първо според мястото, където се извършва (търговия на дребно в магазини: 47.1-47.7; търговия на дребно извън магазини: 47.8 и 47.9). Търговията на дребно в магазини включва и търговия на дребно с употребявани стоки (клас 47.79). В този раздел има разграничение между специализирана (47.2-47.7) и неспециализирана (47.1) търговия на дребно в магазини. Тези групи допълнително се подразделят според асортимента на продаваните стоки. Продажбите на дребно извън магазини се класифицират според начина на предлагане на стоките - например на открити щандове и пазари (47.8), чрез поръчки по пощата, по домовете, чрез автомати за продажба и други (47.9). “Обичайните операции” (или манипулации), свързани с търговията на дребно, като сортиране, разделяне, смесване, пакетиране, транспортиране и складиране не променят основните характеристики на продаваните стоки. В този раздел продаваните стоки са потребителски и следователно продажбите на стоки със стопанско предназначение (например руди, суров нефт, производствени машини и други) не са включени тук. - продажба на стоки за широк кръг потребители, които не са за лично или домакинско потребление например персонални компютри, канцеларски стоки, бои или дървен материал - търговия на дребно чрез търговски агенти и продажби на дребно чрез търг с явно надда - продажба на продукти на селското стопанство от селскостопанските производители - раздел 01 - когато една единица осъществява едновременно производствена и търговска дейност, в повечето случаи нейната основна дейност се класифицира в раздели от 10 до 32 - търговия с автомобили, мот… @bg
scope note: Tento oddíl zahrnuje nákup a další prodej (bez transformace) nového a použitého zboží především široké veřejnosti pro osobní potřebu nebo pro spotřebu a využití v domácnostech prostřednictvím prodejen, stánků, zásilkových domů, podomních a pouličních prodavačů, spotřebních družstev atd. Maloobchod je nejdříve klasifikován podle místa, kde je uskutečňován (maloobchod v prodejnách: skupiny 47.1 až 47.7; maloobchod mimo prodejny: skupiny 47.8 a 47.9). Maloobchod v prodejnách zahrnuje i prodej použitého zboží (třída 47.79). U maloobchodu v prodejnách existuje další rozlišení mezi specializovaným maloobchodem (skupiny 47.2 až 47.7) a nespecializovaným maloobchodem (skupina 47.1). Výše uvedené skupiny se dále dělí podle sortimentu prodávaného zboží. Maloobchod mimo prodejny se dále dělí podle formy prodeje na maloobchod ve stáncích a na trzích (skupina 47.8) a na ostatní maloobchod mimo prodejny, např. zásilkovou službou, podomními prodejci, v automatech (skupina 47.9). Maloobchod v tomto oddílu je omezen na výrobky, které jsou obvykle označovány jako spotřební nebo maloobchodní zboží. Je tedy vyloučeno zboží, které se normálně v maloobchodě neprodává, jako např. obilí, rudy, průmyslové stroje. Do tohoto oddílu patří ale také jednotky zabývající se hlavně maloobchodem předváděného zboží široké veřejnosti, např. osobních počítačů, papírnického zboží, barev nebo dřeva, i když tyto výrobky nejsou určeny k osobní spotřebě nebo pro domácnost. Zacházení se zbožím obvyklé v obchodě nemá vliv na základní vlastnosti zboží a může zahrnovat např. třídění, oddělování, míšení a balení, prováděné ve vlastní režii. Tento oddíl zahrnuje také maloobchod prostřednictvím obchodních zástupců a maloobchodní činnost aukčních domů. Tento oddíl nezahrnuje: - prodej zemědělských produktů prostřednictvím zemědělců (oddíl 01) - výrobu a prodej zboží, které je obecně zatříděno jako výroba (oddíl 10 až 32) - obchod s motorovými vozidly, motocykly a jejich díly (oddíl 45) - obchod s obilím, rudami, ro… @cs
scope note: Diese Abteilung umfasst den Wiederverkauf (Verkauf ohne Weiterverarbeitung) von Neu- und Gebrauchtwaren vor allem an private Haushalte für den privaten Ge- oder Verbrauch, in Verkaufsräumen, Warenhäusern, an Ständen, durch Versandhäuser, Straßenhändler und Haustürverkauf, Verbrauchergenossenschaften usw. Der Einzelhandel wird zunächst nach der Art der Verkaufsstelle klassifiziert (Einzelhandel in Verkaufsräumen: Gruppen 47.1 bis 47.7; Einzelhandel nicht in Verkaufsräumen: Gruppen 47.8 und 47.9). Der Einzelhandel in Verkaufsräumen umfasst auch den Einzelhandel mit Gebrauchtwaren (Klasse 47.79). Zudem wird beim Einzelhandel in Verkaufsräumen unterschieden zwischen Facheinzelhandel (Gruppen 47.2 bis 47.7) und Einzelhandel mit Waren verschiedener Art (Gruppe 47.1). Der Facheinzelhandel in Verkaufsräumen wird weiter nach dem Warensortiment unterteilt. Der Einzelhandel nicht in Verkaufsräumen wird nach Arten des Einzelhandels unterteilt, wie Einzelhandel an Verkaufsständen und auf Märkten (Gruppe 47.8) und sonstiger Einzelhandel nicht in Verkaufsräumen, z. B. Versandhandel, Haustürverkauf, Automatenverkauf usw. (Gruppe 47.9). Die in dieser Abteilung verkauften Waren sind auf Erzeugnisse beschränkt, die allgemein als Konsumgüter oder Einzelhandelswaren bezeichnet werden. Daher sind Waren, die normalerweise nicht im Einzelhandel verkauft werden, wie etwa Getreide, Erze, Industriemaschinen usw., ausgeschlossen. Ebenfalls zu dieser Abteilung gehören Einheiten, deren Tätigkeit überwiegend im Verkauf ausgestellter Waren an private Haushalte besteht, etwa von Personalcomputern, Papier- und Schreibwaren, Farben oder Holz, auch wenn diese Produkte nicht für den persönlichen Gebrauch oder für den Haushalt bestimmt sind. Die handelsübliche Behandlung, die z. B. Sortieren, Trennen, Zusammenstellen und Verpacken umfassen kann, tangiert nicht die Wesenseigenschaften einer Ware. Diese Abteilung umfasst auch den Einzelhandel durch Handelsvertreter und Einzelhandelstätigkeiten von Auktion… @de
scope note: This division includes the resale (sale without transformation) of new and used goods mainly to the general public for personal or household consumption or utilisation, by shops, department stores, stalls, mail-order houses, door-to-door sales persons, hawkers, consumer cooperatives etc. Retail trade is classified first by type of sale outlet (retail trade in stores: groups 47.1 to 47.7; retail trade not in stores: groups 47.8 and 47.9). Retail trade in stores includes the retail sale of used goods (class 47.79). For retail sale in stores, there exists a further distinction between specialised retail sale (groups 47.2 to 47.7) and non-specialised retail sale (group 47.1). The above groups are further subdivided by the range of products sold. Sale not via stores is subdivided according to the forms of trade, such as retail sale via stalls and markets (group 47.8) and other non-store retail sale, e.g. mail order, door-to-door, by vending machines etc. (group 47.9). The goods sold in this division are limited to goods usually referred to as consumer goods or retail goods. Therefore goods not normally entering the retail trade, such as cereal grains, ores, industrial machinery etc. are excluded. This division also includes units engaged primarily in selling to the general public, from displayed merchandise, products such as personal computers, stationery, paint or timber, although these products may not be for personal or household use. Handling that is customary in trade does not affect the basic character of the merchandise and may include, for example, sorting, separating, mixing and packaging. This division also includes the retail sale by commission agents and activities of retail auctioning houses. This division excludes: - sale of farmers' products by farmers, see division 01 - manufacture and sale of goods, which is generally classified as manufacturing in divisions 10-32 - sale of motor vehicles, motorcycles and their parts, see division 45 - trade in cereal gr… @en
scope note: Esta división comprende la reventa (venta sin transformación) de bienes nuevos y usados principalmente al público en general para su consumo o utilización personal o doméstica, en tiendas, grandes almacenes, puestos, empresas de venta por correo, vendedores a domicilio, vendedores ambulantes, economatos, etc. El comercio al por menor se clasifica en primer lugar según el punto de venta (comercio al por menor en establecimientos: grupos 47.1 a 47.7; comercio al por menor no realizado en establecimientos: grupos 47.8 y 47.9). El comercio al por menor en establecimientos comprende la venta al por menor de bienes de segunda mano (clase 47.79). Dentro del comercio al por menor en establecimientos se hace otra distinción entre el realizado en establecimientos especializados (grupos 47.2 a 47.7) y el realizado en establecimientos no especializados (grupo 47.1). Los grupos mencionados a su vez se subdividen según la gama de productos vendidos. El comercio que no se realiza en establecimientos se subdivide de acuerdo con el tipo de comercio, como el realizado en puestos de venta y en mercadillos (grupo 47.8) y otro comercio al por menor no realizado en establecimientos, por ejemplo, por correo, a domicilio, en máquinas expendedoras, etc. (grupo 47.9). Los bienes vendidos en esta división se limitan a los denominados en general bienes de consumo o mercancías al por menor. En consecuencia, se excluyen los bienes que no suelen incluirse en el comercio al por menor, como los cereales, los minerales, la maquinaria y equipos industriales, etc. Esta división comprende también las unidades que se dedican fundamentalmente a la venta al público en general, a partir de la exposición de la mercancía, de productos como los ordenadores personales, material de escritorio, pintura o madera, aunque tales ventas pueden no ser para uso personal o doméstico. La manipulación que suele realizarse vinculado a la actividad comercial no afecta al carácter básico de los productos y puede incluir, por… @es
scope note: Cette division comprend la revente (vente sans transformation) au public de biens neufs ou d’occasion essentiellement destinés à la consommation des particuliers ou des ménages, par des magasins, des grands magasins, des comptoirs et des kiosques, des maisons de vente par correspondance, des colporteurs et des marchands ambulants, des coopératives de consommateurs, etc. Le commerce de détail s’organise d’abord selon la nature des points de vente (en magasin: groupes 47.1 à 47.7; hors magasin: groupes 47.8 et 47.9). Le commerce de détail en magasin comprend la vente au détail de biens usagés (classe 47.79). Pour la vente au détail en magasin, il existe une autre distinction entre le commerce de détail en magasin spécialisé (groupes 47.2 à 47.7) et le commerce de détail en magasin non spécialisé (groupe 47.1). Les groupes ci-dessus sont à leur tour subdivisés en fonction de la gamme des produits vendus. La vente hors magasin est subdivisée en fonction des formes de commerce, comme la vente au détail sur éventaires et marchés (groupe 47.8) et les autres commerces de détail hors magasin, par correspondance, porte-à-porte, au moyen de distributeurs automatiques, etc. (groupe 47.9). Les articles vendus dans cette division se limitent aux articles désignés habituellement par les termes de "biens de consommation". C’est pourquoi elle exclut les articles n’entrant normalement pas dans le circuit du commerce de détail, tels que céréales, machines industrielles, etc. Cette division comprend également l’activité des unités consistant principalement à vendre au grand public, à partir d’une exposition des marchandises, des produits tels que ordinateurs personnels, articles de papeterie, peinture ou bois, même si ces produits ne sont pas destinés à une utilisation personnelle ou domestique. La manutention est une activité habituelle du commerce et n’a pas d’effet sur la nature des marchandises: elle peut inclure les activités de tri, séparation, mélange et conditionnement. Cette d… @fr
scope note: Ovaj odjeljak uključuje trgovinu na malo (prodaju bez prerade) novim i rabljenim predmetima pretežno stanovništvu za osobnu potrošnju ili uporabu u kućanstvu koja se obavlja u prodavaonicama, robnim kućama, na štandovima, putem pošte i interneta, uličnih prodavača, prodajom od vrata do vrata, putem potrošačkih zadruga itd. Trgovina na malo prvo se razvrstava prema vrsti prodajnog mjesta (trgovina na malo u prodavaonicama: skupine 47.1 do 47.7; trgovina na malo izvan prodavaonica: skupine 47.8 i 47.9). Trgovina na malo u prodavaonicama uključuje i trgovinu na malo rabljenim predmetima (razred 47.79). Kod trgovine na malo u prodavaonicama postoji daljnja razlika između specijalizirane trgovine na malo (skupine 47.2 do 47.7) i nespecijalizirane trgovine na malo (skupina 47.1). Navedene skupine dalje su podijeljene prema rasponu prodanih proizvoda. Prodaja izvan prodavaonica razlikuje se prema načinu na koji se obavlja, primjerice trgovina na malo na štandovima i tržnicama (skupina 47.8) i ostala trgovina na malo izvan prodavaonica, npr. narudžbe poštom, dostava kupcu na kućnu adresu, prodaja pomoću samoposlužnih aparata itd. (skupina 47.9). Roba koja se prodaje u ovom odjeljku se u pravilu odnosi na robu široke potrošnje ili trgovine na malo. Iz tog je razloga roba koja se inače ne prodaje u trgovini na malo isključena iz ovog odjeljka (npr. žitarice, rude, industrijski strojevi i oprema, itd.). Ovaj odjeljak također uključuje jedinice koje se bave pretežno prodajom stanovništvu proizvoda kao što su osobna računala, papirnata roba i pisaći pribor, boje ili drva, iako se ovi proizvodi ne moraju koristiti za osobnu potrošnju ili uporabu u kućanstvu. Rukovanje robom, koje je uobičajeno u trgovini, ne utječe na osnovne karakteristike robe i može uključivati npr. sortiranje, odvajanje, miješanje i pakiranje. Ovaj odjeljak također uključuje trgovinu na malo preko posrednika i djelatnosti dražbovaonica (aukcijskih kuća) u vezi s trgovinom na malo. Ovaj odjeljak isključuje: - …
scope note: Į šį skyrių įeina naujų ir panaudotų prekių, skirtų plačiajai visuomenei asmeniškai vartoti ar naudoti namų ūkyje, perpardavimas (pardavimas jų neperdirbant) parduotuvėse, universalinėse parduotuvėse, kioskuose, per prekybos firmas, parduodančias prekes pagal užsakymą paštu, per prekių išnešiotojus, per gatvės prekiautojus, vartotojų kooperatyvus ir kt. Mažmeninė prekyba klasifikuojama pirmiausiai atsižvelgiant į prekybos punkto tipą (mažmeninė prekyba parduotuvėse klasifikuojama 47.1 – 47.7 grupėse, mažmeninė prekyba ne parduotuvėse klasifikuojama 47.8 ir 47.9 grupėse). Į mažmeninę prekybą parduotuvėse įeina mažmeninė prekyba naudotomis prekėmis (47.79 klasė). Mažmeninė prekyba parduotuvėse skirstoma į specializuotą mažmeninę prekybą (47.2 – 47.7 grupės) ir nespecializuotą mažmeninę prekybą (47.1 grupė). Minėtos grupės toliau skirstomos pagal parduodamų prekių asortimentą. Pardavimas ne parduotuvėse skirstomas pagal pardavimo formą, pvz., mažmeninė prekyba kioskuose ir turgavietėse (47.8 grupė) ir kita mažmeninė prekyba ne parduotuvėse, pvz., prekių pagal užsakymus pardavimas paštu, išnešiojamoji prekyba, prekyba iš automatų ir kt. (47.9 grupė). Į šį skyrių įeinančios parduodamos prekės yra tik tokios prekės, kurios paprastai vadinamos vartojimo arba mažmeninėmis prekėmis. Todėl į šį skyrių neįeina prekės, paprastai nepriskiriamos mažmeninei prekybai, tokios kaip grūdai, rūda, pramoninės mašinos ir įranga, ir kt. Į šį skyrių taip pat įeina gamybos vienetai, pirmiausiai susiję su prekių, tokių kaip asmeniniai kompiuteriai, raštinės reikmenys, dažai arba mediena, pardavimu plačiajai visuomenei, nors šie pardavimai nebūtų skirti asmeniniam arba namų ūkio vartojimui, tačiau atliekami demonstruojamų pardavimų metu. Įprastas prekyboje apdorojimas nekeičia pagrindinių prekės charakteristikų ir gali aprėpti, pvz., rūšiavimą, perskirstymą, maišymą ir pakavimą. Į šį skyrių taip pat įeina mažmeninė prekyba, vykdoma prekybos tarpininkų ir aukcionų namų. Į šį skyrių neįeina: - … @lt
scope note: Этот класс включает: - розничную торговлю рыбой, морскими продуктами и производными продуктами @ru
scope note: Bu bölüm, dükkanlar, büyük mağazalar, tezgahlar, posta ile satış yapan dükkanlar, kapıdan kapıya satış yapan kişiler, gezgin satıcılar, sokak satıcıları, tüketici kooperatifleri ve benzerleri tarafından kişisel olarak veya evde tüketimi veya faydası için genel kamuya yeni ve kullanılmış malların perakende satışını (üzerinde değişiklik yapılmadan satış) kapsamaktadır. Perakende ticaret, ilk olarak satış yerinin türüne göre sınıflandırılmaktadır (mağazalardaki perakende ticaret: 47.1`den 47.7`ye kadar olan gruplar; mağaza dışında yapılan perakende ticaret: Gruplar 47.8 ve 47.9). Mağazalardaki perakende ticaret, kullanılmış malların perakende satışını kapsamaktadır (sınıf 47.79). Mağazalardaki perakende satış için, belirli bir mala tahsis edilmiş yerlerdeki perakende satış (47.2`den 47.7`ye kadar olan gruplar) ve belirli bir mala tahsis edilmemiş yerlerdeki perakende satış (grup 47.1) arasında daha ileri bir ayırım söz konusudur. Yukarıdaki gruplar, satılan ürünlerin çeşitliliğine göre daha fazla alt bölüme ayrılmaktadır. Mağazalar vasıtasıyla yapılmayan satış, ticaret tiplerine göre, örneğin dükkan ve marketler yoluyla (47.8) ve posta siparişi, kapıdan kapıya, satış makineleri ile (grup 47.9) yapılan diğer mağaza dışı perakende satış vasıtasıyla yapılan perakende satış gibi, alt bölümlere ayrılmaktadır. Bu bölümde satılan mallar, genellikle tüketici malları veya perakende ticaret malları olarak belirtilen mallarla sınırlıdır. Bu nedenle normal olarak perakende ticarete girmeyen, tahıllar, cevherler, endüstri makineleri vb. gibi mallar hariç tutulmaktadır. Bu bölüm ayrıca, vitrin mallarının, kişisel bilgisayarlar, kırtasiye malzemesi, boya veya kereste gibi ürünlerin temel olarak genel halka satışıyla uğraşan birimleri (bu ürünler kişisel olarak veya evde kullanıma yönelik olmamasına rağmen) kapsamaktadır. Ticarette alışılagelmiş olan bazı malların işlenmesi, ticareti yapılan malın temel niteliğini etkilemez, bu yüzden, örneğin, sıralama, ayırma, karıştırma ve paketlem… @tr
preferred label: Търговия на дребно, без търговията с автомобили и мотоциклети @bg
preferred label: Maloobchod, kromě s motorovými vozidly @cs
preferred label: Detailhandel undtagen med motorkøretøjer og motorcykler @da
preferred label: Einzelhandel (ohne Handel mit Kraftfahrzeugen) @de
preferred label: Λιανικό εμπόριο, εκτός από το εμπόριο μηχανοκίνητων οχημάτων και μοτοσυκλετών @el
preferred label: Comercio al por menor, excepto de vehículos de motor y motocicletas @es
preferred label: Jaekaubandus, v.a mootorsõidukid ja mootorrattad @et
preferred label: Vähittäiskauppa (pl. moottoriajoneuvojen ja moottoripyörien kauppa) @fi
preferred label: Commerce de détail, à l’exception des automobiles et des motocycles @fr
preferred label: Kiskereskedelem (kivéve: gépjármű, motorkerékpár)
preferred label: Commercio al dettaglio, escluso quello di autoveicoli e di motocicli @it
preferred label: Mažmeninė prekyba, išskyrus variklinių transporto priemonių ir motociklų prekybą @lt
preferred label: Mazumtirdzniecība, izņemot automobiļus un motociklus @lv
preferred label: Negozju bl-imnut, għajr ta' vetturi bil-mutur u muturi @mt
preferred label: Detailhandel, met uitzondering van de handel in auto's en motorfietsen @nl
preferred label: Detaljhandel, unntatt med motorvogner @no
preferred label: Handel detaliczny, z wyłączeniem handlu pojazdami samochodowymi i motocyklami @pl
preferred label: Comércio a retalho, excepto de veículos automóveis e motociclos @pt
preferred label: Comerţ cu amănuntul, cu excepţia autovehiculelor şi motocicletelor @ro
preferred label: Розничная торговля, за исключением автомобилей и мотоциклов @ru
preferred label: Maloobchod, okrem motorových vozidiel a motocyklov @sk
preferred label: Trgovina na drobno, razen z motornimi vozili @sl
preferred label: Detaljhandel utom med motorfordon och motorcyklar @sv
preferred label: Perakende ticaret (Motorlu kara taşıtları ve motosikletler hariç) @tr
broader: WHOLESALE AND RETAIL TRADE; REPAIR OF MOTOR VEHICLES AND MOTORCYCLES
narrower: Retail sale in non-specialised stores
narrower: Retail sale of food, beverages and tobacco in specialised stores
narrower: Retail sale of automotive fuel in specialised stores
narrower: Retail sale of information and communication equipment in specialised stores
narrower: Retail sale of other household equipment in specialised stores
narrower: Retail sale of cultural and recreation goods in specialised stores
narrower: Retail sale of other goods in specialised stores
narrower: Retail sale via stalls and markets
narrower: Retail trade not in stores, stalls or markets

Retail sale in non-specialised stores
type: Concept
notation: 47.1
status: valid
status modified: 2013-10-18
accepted date: 2013-10-18
in scheme: Statistical Classification of Economic Activities in the European Community, Rev. 2 (2008)
scope note: Тази група включва търговия на дребно с разнообразни стоки в неспециализирани магазини като супермаркети или универсални магазини. @bg
scope note: Tato skupina zahrnuje maloobchod s širokým sortimentem zboží v jednom celku (nespecializované prodejny), jako v supermarketech nebo obchodních domech. @cs
scope note: Diese Gruppe umfasst den Einzelhandel (in Verkaufsräumen) mit einem breit gefächerten Warensortiment in derselben Einheit, etwa in Supermärkten oder Kaufhäusern. @de
scope note: This group includes the retail sale of a variety of product lines in the same unit (non-specialised stores), such as supermarkets or department stores. @en
scope note: Este grupo comprende el comercio al por menor de diversas líneas de productos en la misma unidad (establecimientos no especializados), como supermercados y grandes almacenes. @es
scope note: Ce groupe comprend le commerce de détail d’une large gamme de produits dans la même unité (en magasin non spécialisé), comme les supermarchés ou les grands magasins. @fr
scope note: Ova skupina uključuje trgovinu na malo raznovrsnom robom u istoj jedinici (nespecijalizirane prodavaonice) kao što su supermarketi ili robne kuće.
scope note: Į šią grupę įeina mažmeninė prekyba įvairaus asortimento prekėmis tame pačiame gamybos vienete (nespecializuotoje parduotuvėje), tokiame kaip prekybos centras ar universalinė parduotuvė. @lt
scope note: Bu grup, süper marketler veya büyük mağazalar gibi, aynı birim içerisinde (belirli bir mala tahsis edilmemiş mağazalar) çeşitli ürün reyonlarının olduğu yerlerdeki perakende ticareti kapsamaktadır. @tr
preferred label: Търговия на дребно в неспециализирани магазини @bg
preferred label: Maloobchod v nespecializovaných prodejnách @cs
preferred label: Detailhandel fra ikke-specialiserede forretninger @da
preferred label: Einzelhandel mit Waren verschiedener Art (in Verkaufsräumen) @de
preferred label: Λιανικό εμπόριο σε μη ειδικευμένα καταστήματα @el
preferred label: Comercio al por menor en establecimientos no especializados @es
preferred label: Jaemüük spetsialiseerimata kauplustes @et
preferred label: Vähittäiskauppa erikoistumattomissa myymälöissä @fi
preferred label: Commerce de détail en magasin non spécialisé @fr
preferred label: Nem szakosodott bolti vegyes kiskereskedelem
preferred label: Commercio al dettaglio in esercizi non specializzati @it
preferred label: Mažmeninė prekyba nespecializuotose parduotuvėse @lt
preferred label: Mazumtirdzniecība nespecializētajos veikalos @lv
preferred label: Bejgħ bl-imnut minn ħwienet mhux speċjalizzati @mt
preferred label: Detailhandel in niet-gespecialiseerde winkels @nl
preferred label: Butikkhandel med bredt vareutvalg @no
preferred label: Sprzedaż detaliczna prowadzona w niewyspecjalizowanych sklepach @pl
preferred label: Comércio a retalho em estabelecimentos não especializados @pt
preferred label: Comerţ cu amănuntul în magazine nespecializate @ro
preferred label: Розничная торговля в неспециализированных магазинах @ru
preferred label: Maloobchod v nešpecializovaných predajniach @sk
preferred label: Trgovina na drobno v nespecializiranih prodajalnah @sl
preferred label: Detaljhandel med brett sortiment @sv
preferred label: Belirli bir mala tahsis edilmemiş mağazalardaki perakende ticaret @tr
broader: Retail trade, except of motor vehicles and motorcycles
narrower: Retail sale in non-specialised stores with food, beverages or tobacco predominating
narrower: Other retail sale in non-specialised stores

Retail sale in non-specialised stores with food, beverages or tobacco predominating
type: Concept
notation: 47.11
status: valid
status modified: 2013-10-18
accepted date: 2013-10-18
in scheme: Statistical Classification of Economic Activities in the European Community, Rev. 2 (2008)
scope note: - търговия на дребно с разнообразни стоки, между които преобладават хранителни продукти, напитки и тютюневи изделия: • дейности на магазини (обикновено супермаркети или други магазини от този тип), които заедно с основната продажба на хранителни продукти, напитки и тютюневи изделия предлагат и други групи стоки като облекло, мебели, домакински уреди, козметика, железария, и други @bg
scope note: Z: - maloobchod s nejrůznějším zbožím, avšak s převahou potravinářských výrobků, nápojů a tabákových výrobků: • činnosti obchodních domů, které, vedle převažujícího sortimentu potravin, nápojů a tabákových výrobků, mají další sortiment zboží, jako oděvy, nábytek, elektrické spotřebiče, železářské zboží, kosmetiku atd. @cs
scope note: Diese Klasse umfasst folgende Einzelhandelstätigkeiten in Verkaufsräumen: - Einzelhandel mit breit gefächertem Warensortiment, jedoch mit der Hauptrichtung Nahrungsmittel, Getränke und Tabakwaren: • Tätigkeiten von Supermärkten und Verbrauchermärkten, die neben dem Schwerpunkt Nahrungsmittel, Getränke und Tabakwaren weitere Sortimente wie Bekleidung, Möbel, Geräte, Metallwaren, kosmetische Artikel usw. führen @de
scope note: This class includes: - retail sale of a large variety of goods of which, however, food products, beverages or tobacco should be predominant: • activities of general stores that have, apart from their main sales of food products, beverages or tobacco, several other lines of merchandise such as wearing apparel, furniture, appliances, hardware, cosmetics etc. @en
scope note: Esta clase comprende: - el comercio al por menor de una gran variedad de artículos con predominio, sin embargo, de los productos alimenticios, bebidas o tabaco: • las actividades de las grandes superficies que, aparte de vender principalmente alimentos, bebidas y tabaco, ofrecen otras mercancías tales como prendas de vestir, muebles, electrodomésticos, artículos de ferretería, cosméticos, etc. @es
scope note: Cette classe comprend: - le commerce de détail d’une large gamme de produits, avec toutefois une prédominance des produits alimentaires, des boissons et du tabac: • les activités des grandes surfaces qui — en sus des produits alimentaires, des boissons et du tabac qui représentent le plus gros des ventes — proposent également diverses autres lignes de produits tels que articles d’habillement, meubles, petits appareils, articles de quincaillerie, produits cosmétiques, etc. @fr
scope note: Ovaj razred uključuje: - trgovinu na malo raznovrsnom robom, među kojom prevladavaju hrana, pića i duhanski proizvodi: • djelatnosti prodavaonica mješovitom robom, u kojima se, osim hrane, pića i duhanskih proizvoda, prodaje i razna druga roba, kao što su odjeća, namještaj, aparati, željezna roba, kozmetika itd.
scope note: Į šią klasę įeina: - plataus asortimento, kuriame vyrauja maisto produktai, gėrimai ir tabakas, prekių mažmeninė prekyba: • universalinių parduotuvių, kuriose be pagrindinių maisto, gėrimų ar tabako pardavimų, prekiaujama kitomis prekėmis, tokiomis kaip drabužiai, baldai, prietaisai, metalo gaminiai, kosmetika ir kt., veikla @lt
scope note: Этот класс включает: - розничную торговлю напитками (не для употребления в помещениях): • алкогольными напитками • безалкогольными напитками @ru
scope note: Bu sınıf aşağıdakileri kapsamaktadır; - gıda ürünleri, içecek veya tütün ağırlıklı çeşitli malların perakende ticareti: • gıda ürünleri, içecek veya tütün ana satışları olmak üzere giyim eşyası, mobilya, cihazlar, hırdavat, kozmetikler vb. diğer çeşitli ticari eşyaların reyonlarına sahip olan genel mağazaların faaliyetleri. @tr
preferred label: Търговия на дребно в неспециализирани магазини предимно с хранителни стоки, напитки и тютюневи изделия @bg
preferred label: Maloobchod s převahou potravin, nápojů a tabákových výrobků v nespecializovaných prodejnách @cs
preferred label: Detailhandel fra ikke-specialiserede forretninger med hovedvægten på føde-, drikke- og tobaksvarer @da
preferred label: Einzelhandel mit Waren verschiedener Art, Hauptrichtung Nahrungs- und Genussmittel, Getränke und Tabakwaren @de
preferred label: Λιανικό εμπόριο σε μη ειδικευμένα καταστήματα που πωλούν κυρίως τρόφιμα, ποτά ή καπνό @el
preferred label: Comercio al por menor en establecimientos no especializados, con predominio en productos alimenticios, bebidas y tabaco @es
preferred label: Jaemüük spetsialiseerimata kauplustes, kus on ülekaalus toidukaubad, joogid ja tubakatooted @et
preferred label: Elintarvikkeiden, juomien ja tupakan erikoistumaton vähittäiskauppa @fi
preferred label: Commerce de détail en magasin non spécialisé à prédominance alimentaire @fr
preferred label: Élelmiszer jellegű bolti vegyes kiskereskedelem
preferred label: Commercio al dettaglio in esercizi non specializzati con prevalenza di prodotti alimentari, bevande o tabacco @it
preferred label: Mažmeninė prekyba nespecializuotose parduotuvėse, kuriose vyrauja maistas, gėrimai ir tabakas @lt
preferred label: Mazumtirdzniecība nespecializētajos veikalos, kuros galvenokārt pārdod pārtikas preces, dzērienus vai tabaku @lv
preferred label: Bejgħ bl-imnut minn ħwienet mhux speċjalizzati fejn jiddomina ikel, xorb jew tabakk @mt
preferred label: Detailhandel in niet-gespecialiseerde winkels waarbij voedings- en genotmiddelen overheersen @nl
preferred label: Butikkhandel med bredt vareutvalg med hovedvekt på nærings- og nytelsesmidler @no
preferred label: Sprzedaż detaliczna prowadzona w niewyspecjalizowanych sklepach z przewagą żywności, napojów i wyrobów tytoniowych @pl
preferred label: Comércio a retalho em estabelecimentos não especializados, com predominância de produtos alimentares, bebidas ou tabaco @pt
preferred label: Comerţ cu amănuntul în magazine nespecializate, cu vânzare predominantă de produse alimentare, băuturi şi tutun @ro
preferred label: Розничная торговля в неспециализированных магазинах преимущественно продуктами питания, включая напитки, и табачными изделиями @ru
preferred label: Maloobchod v nešpecializovaných predajniach najmä s potravinami, nápojmi alebo tabakom @sk
preferred label: Trgovina na drobno v nespecializiranih prodajalnah, pretežno z živili @sl
preferred label: Detaljhandel med brett sortiment, mest livsmedel, drycker och tobak @sv
preferred label: Belirli bir mala tahsis edilmemiş mağazalarda gıda, içecek veya tütün ağırlıklı perakende ticaret @tr
broader: Retail sale in non-specialised stores

Other retail sale in non-specialised stores
type: Concept
notation: 47.19
status: valid
status modified: 2013-10-18
accepted date: 2013-10-18
in scheme: Statistical Classification of Economic Activities in the European Community, Rev. 2 (2008)
scope note: - търговия на дребно с разнообразни стоки, между които не преобладават хранителни продукти, напитки и тютюневи изделия - дейности на универсални магазини, които предлагат пълен набор от стоки, вкл. облекло, мебели, домакински уреди, железария, бижута, козметика, спортни стоки, играчки и други @bg
scope note: Z: - maloobchod s nejrůznějším zbožím, kde však potraviny, nápoje a tabákové výrobky nejsou převažující - činnosti obchodních domů nabízejících všeobecný sortiment zboží včetně oděvů, nábytku, elektrických spotřebičů, železářského zboží, kosmetiky, klenotů, hraček, sportovních potřeb atd. @cs
scope note: Diese Klasse umfasst: - Einzelhandel mit breit gefächertem Warensortiment, wobei Nahrungsmittel, Getränke und Tabakwaren nicht die Hauptrichtung bilden: - Tätigkeiten von Kaufhäusern und Warenhäusern, die ein breites Warensortiment einschließlich Bekleidung, Möbeln, Geräten, Metallwaren, kosmetischen Artikeln, Schmuck, Spielzeug, Sportartikeln usw. führen @de
scope note: This class includes: - retail sale of a large variety of goods of which food products, beverages or tobacco are not predominant - activities of department stores carrying a general line of merchandise, including wearing apparel, furniture, appliances, hardware, cosmetics, jewellery, toys, sports goods etc. @en
scope note: Esta clase comprende: - el comercio al por menor de una gran variedad de productos entre los que no predominan los productos alimenticios, las bebidas o el tabaco - las actividades de los grandes almacenes que ofrecen mercancías en general entre las que se incluyen prendas de vestir, muebles, electrodomésticos, artículos de ferretería, cosméticos, joyería, juguetes, artículos de deportes, etc. @es
scope note: Cette classe comprend: - le commerce de détail d’une large gamme de produits sans prédominance des produits alimentaires, des boissons et du tabac - les activités des grands magasins qui proposent un éventail complet de produits, y compris les articles d’habillement, les meubles, les petits appareils, les articles de quincaillerie, les produits cosmétiques, les articles de joaillerie, les jouets, les articles de sport, etc. @fr
scope note: Ovaj razred uključuje: - trgovinu na malo razvnovrsnom robom, u kojoj ne prevladavaju hrana, pića i duhanski proizvodi - djelatnosti robnih kuća koje se bave prodajom raznovrsne robe, uključujući odjeću, namještaj, aparate, željeznu robu, kozmetiku, nakit, igračke, sportsku opremu itd.
scope note: Į šią klasę įeina: - plataus asortimento, kuriame maisto produktai, gėrimai ar tabakas nėra vyraujantys, prekių mažmeninė prekyba - universalinių parduotuvių, kuriose prekiaujama bendrosios paskirties prekėmis, įskaitant drabužius, baldus, prietaisus, metalo gaminius, kosmetikos priemones, juvelyrinius dirbinius, žaislus, sporto prekes ir kt., veikla @lt
scope note: Этот класс включает: - розничную торговлю табаком - розничную торговлю табачными изделиями @ru
scope note: Bu sınıf aşağıdakileri kapsamaktadır; - gıda ürünleri, içecek veya tütün ürünlerinin ağırlıklı olmadığı çok çeşitli malların perakende ticareti, - giyim eşyası, mobilya, cihaz, hırdavat, kozmetik, mücevher, oyuncak, spor eşyaları vb. dahil olmak üzere, ticari eşya reyonları olan bölümlü mağazaların faaliyetleri. @tr
preferred label: Търговия на дребно в неспециализирани магазини с разнообразни стоки @bg
preferred label: Ostatní maloobchod v nespecializovaných prodejnách @cs
preferred label: Anden detailhandel fra ikke-specialiserede forretninger @da
preferred label: Sonstiger Einzelhandel mit Waren verschiedener Art @de
preferred label: Άλλο λιανικό εμπόριο σε μη ειδικευμένα καταστήματα @el
preferred label: Otro comercio al por menor en establecimientos no especializados @es
preferred label: Muu jaemüük spetsialiseerimata kauplustes @et
preferred label: Muu vähittäiskauppa erikoistumattomissa myymälöissä @fi
preferred label: Autre commerce de détail en magasin non spécialisé @fr
preferred label: Iparcikk jellegű bolti vegyes kiskereskedelem
preferred label: Commercio al dettaglio in altri esercizi non specializzati @it
preferred label: Kita mažmeninė prekyba nespecializuotose parduotuvėse @lt
preferred label: Pārējā mazumtirdzniecība nespecializētajos veikalos @lv
preferred label: Bejgħ ieħor bl-imnut minn ħwienet mhux speċjalizzati @mt
preferred label: Overige detailhandel in niet-gespecialiseerde winkels @nl
preferred label: Butikkhandel med bredt vareutvalg ellers @no
preferred label: Sprzedaż detaliczna pozostała prowadzona w niewyspecjalizowanych sklepach @pl
preferred label: Comércio a retalho de outros produtos em estabelecimentos não especializados @pt
preferred label: Comerţ cu amănuntul în magazine nespecializate, cu vânzare predominantă de produse nealimentare @ro
preferred label: Прочая розничная торговля в неспециализированных магазинах @ru
preferred label: Ostatný maloobchod v nešpecializovaných predajniach @sk
preferred label: Druga trgovina na drobno v nespecializiranih prodajalnah @sl
preferred label: Annan detaljhandel med brett sortiment @sv
preferred label: Belirli bir mala tahsis edilmemiş mağazalarda yapılan diğer perakende ticaret @tr
broader: Retail sale in non-specialised stores

Retail sale of food, beverages and tobacco in specialised stores
type: Concept
notation: 47.2
status: valid
status modified: 2013-10-18
accepted date: 2013-10-18
in scheme: Statistical Classification of Economic Activities in the European Community, Rev. 2 (2008)
scope note: Этот класс включает: - розничную торговлю молочными продуктами и яйцами - розничную торговлю прочими продуктами питания, не перечисленные выше @ru
preferred label: Търговия на дребно в специализирани магазини с хранителни стоки, напитки и тютюневи изделия @bg
preferred label: Maloobchod s potravinami, nápoji a tabákovými výrobky ve specializovaných prodejnách @cs
preferred label: Detailhandel med føde-, drikke- og tobaksvarer i specialforretninger @da
preferred label: Einzelhandel mit Nahrungs- und Genussmitteln, Getränken und Tabakwaren (in Verkaufsräumen) @de
preferred label: Λιανικό εμπόριο τροφίμων, ποτών και καπνού σε ειδικευμένα καταστήματα @el
preferred label: Comercio al por menor de productos alimenticios, bebidas y tabaco en establecimientos especializados @es
preferred label: Toidukaupade, jookide ja tubakatoodete jaemüük spetsialiseeritud kauplustes @et
preferred label: Elintarvikkeiden, juomien ja tupakan vähittäiskauppa erikoismyymälöissä @fi
preferred label: Commerce de détail alimentaire en magasin spécialisé @fr
preferred label: Élelmiszer-, ital-, dohányáru-kiskereskedelme
preferred label: Commercio al dettaglio di prodotti alimentari, bevande e tabacco in esercizi specializzati @it
preferred label: Maisto, gėrimų ir tabako mažmeninė prekyba specializuotose parduotuvėse @lt
preferred label: Pārtikas, dzērienu un tabakas mazumtirdzniecība specializētajos veikalos @lv
preferred label: Bejgħ bl-imnut ta' ikel, xorb u tabakk minn ħwienet speċjalizzati @mt
preferred label: Detailhandel in voedings- en genotmiddelen in gespecialiseerde winkels @nl
preferred label: Butikkhandel med nærings- og nytelsesmidler i spesialforretninger @no
preferred label: Sprzedaż detaliczna żywności, napojów i wyrobów tytoniowych prowadzona w wyspecjalizowanych sklepach @pl
preferred label: Comércio a retalho de produtos alimentares, bebidas e tabaco, em estabelecimentos especializados @pt
preferred label: Comerţ cu amănuntul al produselor alimentare, băuturilor şi al produselor din tutun, în magazine specializate @ro
preferred label: Розничная торговля продуктами питания, включая напитки, и табачными изделиями в специализированных магазинах @ru
preferred label: Maloobchod s potravinami, nápojmi a tabakom v špecializovaných predajniach @sk
preferred label: Trgovina na drobno v specializiranih prodajalnah z živili, pijačami in tobačnimi izdelki @sl
preferred label: Specialiserad butikshandel med livsmedel, drycker och tobak @sv
preferred label: Belirli bir mala tahsis edilmiş mağazalarda gıda, içecek ve tütün perakende ticareti @tr
broader: Retail trade, except of motor vehicles and motorcycles
narrower: Retail sale of fruit and vegetables in specialised stores
narrower: Retail sale of meat and meat products in specialised stores
narrower: Retail sale of fish, crustaceans and molluscs in specialised stores
narrower: Retail sale of bread, cakes, flour confectionery and sugar confectionery in specialised stores
narrower: Retail sale of beverages in specialised stores
narrower: Retail sale of tobacco products in specialised stores
narrower: Other retail sale of food in specialised stores

Retail sale of fruit and vegetables in specialised stores
type: Concept
notation: 47.21
status: valid
status modified: 2013-10-18
accepted date: 2013-10-18
in scheme: Statistical Classification of Economic Activities in the European Community, Rev. 2 (2008)
scope note: - търговия на дребно с пресни плодове и зеленчуци - търговия на дребно с консервирани плодове и зеленчуци @bg
scope note: Z: - maloobchod s čerstvým ovocem a zeleninou - maloobchod s upraveným a konzervovaným ovocem a zeleninou @cs
scope note: Diese Klasse umfasst: - Einzelhandel mit frischem Obst und Gemüse und frischen Kartoffeln - Einzelhandel mit zubereitetem und konserviertem Obst und Gemüse und zubereiteten und konservierten Kartoffeln @de
scope note: This class includes: - retail sale of fresh fruit and vegetables - retail sale of prepared and preserved fruits and vegetables @en
scope note: Esta clase comprende: - el comercio al por menor de frutas y hortalizas frescas - el comercio al por menor de frutas y hortalizas preparadas y conservadas @es
scope note: Cette classe comprend: - le commerce de détail de fruits et légumes frais - le commerce de détail de fruits et légumes en conserve @fr
scope note: Ovaj razred uključuje: - trgovinu na malo svježim voćem i povrćem - trgovinu na malo pripremljenim i konzerviranim voćem i povrćem
scope note: Į šią klasę įeina: - šviežių vaisių, uogų ir daržovių mažmeninė prekyba - paruoštų ir konservuotų vaisių, uogų ir daržovių mažmeninė prekyba @lt
scope note: Bu sınıf aşağıdakileri kapsamaktadır; - taze meyve ve sebzelerin perakende satışı, - hazır ve konserve meyve ve sebzelerin perakende satışı. @tr
preferred label: Търговия на дребно с плодове и зеленчуци @bg
preferred label: Maloobchod s ovocem a zeleninou ve specializovaných prodejnách @cs
preferred label: Frugt og grøntforretninger @da
preferred label: Einzelhandel mit Obst, Gemüse und Kartoffeln @de
preferred label: Λιανικό εμπόριο φρούτων και λαχανικών σε ειδικευμένα καταστήματα @el
preferred label: Comercio al por menor de frutas y hortalizas en establecimientos especializados @es
preferred label: Puu- ja köögivilja jaemüük spetsialiseeritud kauplustes @et
preferred label: Hedelmien, marjojen ja vihannesten vähittäiskauppa @fi
preferred label: Commerce de détail de fruits et légumes en magasin spécialisé @fr
preferred label: Zöldség-, gyümölcs kiskereskedelme
preferred label: Commercio al dettaglio di frutta e verdura in esercizi specializzati @it
preferred label: Vaisių, uogų ir daržovių mažmeninė prekyba specializuotose parduotuvėse @lt
preferred label: Augļu un dārzeņu mazumtirdzniecība specializētajos veikalos @lv
preferred label: Bejgħ bl-imnut ta' frott u ħxejjex @mt
preferred label: Detailhandel in groenten en fruit in gespecialiseerde winkels @nl
preferred label: Butikkhandel med frukt og grønnsaker @no
preferred label: Sprzedaż detaliczna owoców i warzyw prowadzona w wyspecjalizowanych sklepach @pl
preferred label: Comércio a retalho de frutas e produtos hortícolas, em estabelecimentos especializados @pt
preferred label: Comerţ cu amănuntul al fructelor şi legumelor proaspete, în magazine specializate @ro
preferred label: Розничная торговля фруктами и овощами в специализированных магазинах @ru
preferred label: Maloobchod s ovocím a zeleninou v špecializovaných predajniach @sk
preferred label: Trgovina na drobno v specializiranih prodajalnah s sadjem in zelenjavo @sl
preferred label: Specialiserad butikshandel med frukt och grönsaker @sv
preferred label: Belirli bir mala tahsis edilmiş mağazalardaki meyve ve sebze perakende ticareti @tr
broader: Retail sale of food, beverages and tobacco in specialised stores

Retail sale of meat and meat products in specialised stores
type: Concept
notation: 47.22
status: valid
status modified: 2013-10-18
accepted date: 2013-10-18
in scheme: Statistical Classification of Economic Activities in the European Community, Rev. 2 (2008)
scope note: - търговия на дребно с дивечово и птиче месо @bg
scope note: Z: - maloobchod s masem a masnými výrobky (včetně drůbeže) @cs
scope note: Diese Klasse umfasst: - Einzelhandel mit Fleisch und Fleischwaren (einschließlich Geflügelfleisch und Fleischwaren daraus) @de
scope note: This class includes: - retail sale of meat and meat products (including poultry) @en
scope note: Esta clase comprende: - el comercio al por menor de carne y productos cárnicos (incluidas aves) @es
scope note: Cette classe comprend: - le commerce de détail de viandes et produits à base de viande (y compris la volaille) @fr
scope note: Ovaj razred uključuje: - trgovinu na malo mesom i mesnim proizvodima (uključujući meso peradi)
scope note: Į šią klasę įeina: - mėsos ir mėsos produktų (įskaitant paukštieną) mažmeninė prekyba @lt
scope note: Этот класс включает: - розничную торговлю автомобильным и мотоциклетным топливом Этот класс также включает: - розничную торговлю смазочными материалами и охлаждающими средствами для моторных транспортных средств Этот класс исключает: - оптовую торговлю топливом, см. 46.71 - розничную торговлю сжиженным газом для приготовления пищи или отопления, см. 47.78 @ru
scope note: Bu sınıf aşağıdakileri kapsamaktadır; - et ve et ürünlerinin perakende satışı (kümes hayvanları dahil). @tr
preferred label: Търговия на дребно с месо и месни продукти @bg
preferred label: Maloobchod s masem a masnými výrobky ve specializovaných prodejnách @cs
preferred label: Slagter og viktualieforretninger @da
preferred label: Einzelhandel mit Fleisch und Fleischwaren @de
preferred label: Λιανικό εμπόριο κρέατος και προϊόντων κρέατος σε ειδικευμένα καταστήματα @el
preferred label: Comercio al por menor de carne y productos cárnicos en establecimientos especializados @es
preferred label: Liha ja lihatoodete jaemüük spetsialiseeritud kauplustes @et
preferred label: Lihan ja lihatuotteiden vähittäiskauppa @fi
preferred label: Commerce de détail de viandes et de produits à base de viande en magasin spécialisé @fr
preferred label: Hús-, húsáru kiskereskedelme
preferred label: Commercio al dettaglio di carni e di prodotti a base di carne in esercizi specializzati @it
preferred label: Mėsos ir mėsos produktų mažmeninė prekyba specializuotose parduotuvėse @lt
preferred label: Gaļas un gaļas produktu mazumtirdzniecība specializētajos veikalos @lv
preferred label: Bejgħ bl-imnut ta' laħam u prodotti tal-laħam @mt
preferred label: Detailhandel in vlees en vleesproducten in gespecialiseerde winkels @nl
preferred label: Butikkhandel med kjøtt og kjøttvarer @no
preferred label: Sprzedaż detaliczna mięsa i wyrobów z mięsa prowadzona w wyspecjalizowanych sklepach @pl
preferred label: Comércio a retalho de carne e produtos à base de carne, em estabelecimentos especializados @pt
preferred label: Comerţ cu amănuntul al cărnii şi al produselor din carne, în magazine specializate @ro
preferred label: Розничная торговля мясом и мясными продуктами в специализированных магазинах @ru
preferred label: Maloobchod s mäsom a mäsovými výrobkami v špecializovaných predajniach @sk
preferred label: Trgovina na drobno v specializiranih prodajalnah z mesom in mesnimi izdelki @sl
preferred label: Specialiserad butikshandel med kött och charkuterier @sv
preferred label: Belirli bir mala tahsis edilmiş mağazalardaki et ve et ürünlerinin perakende ticareti @tr
broader: Retail sale of food, beverages and tobacco in specialised stores

Retail sale of fish, crustaceans and molluscs in specialised stores
type: Concept
notation: 47.23
status: valid
status modified: 2013-10-18
accepted date: 2013-10-18
in scheme: Statistical Classification of Economic Activities in the European Community, Rev. 2 (2008)
scope note: - търговия на дребно с риба, рибни продукти, ракообразни и мекотели @bg
scope note: Z: - maloobchod s rybami, mořskými produkty a výrobky z nich @cs
scope note: Diese Klasse umfasst: - Einzelhandel mit Fisch, Meeresfrüchten und Fischerzeugnissen @de
scope note: This class includes: - retail sale of fish, other seafood and products thereof @en
scope note: Esta clase comprende: - el comercio al por menor de pescado, otros mariscos y derivados @es
scope note: Cette classe comprend: - le commerce de détail des poissons, d’autres produits de la mer et des préparations à partir de ces produits @fr
scope note: Ovaj razred uključuje: - trgovinu na malo ribom, morskim plodovima i njihovim proizvodima
scope note: Į šią klasę įeina: - žuvų, kitų jūros gėrybių ir gaminių iš jų mažmeninė prekyba @lt
scope note: Данная группа включает розничную торговлю информационными и коммуникационными технологиями и оборудованием, такими как компьютеры, периферийное оборудование, телекоммуникационное оборудование и бытовая электроника через специализированные магазины. @ru
scope note: Bu sınıf aşağıdakileri kapsamaktadır; - balık, diğer yenilebilen deniz ürünleri ve bunlardan yapılan ürünlerin perakende satışı. @tr
preferred label: Търговия на дребно с риба и други морски храни @bg
preferred label: Maloobchod s rybami, korýši a měkkýši ve specializovaných prodejnách @cs
preferred label: Fiskeforretninger @da
preferred label: Einzelhandel mit Fisch, Meeresfrüchten und Fischerzeugnissen @de
preferred label: Λιανικό εμπόριο ψαριών, καρκινοειδών και μαλακίων σε ειδικευμένα καταστήματα @el
preferred label: Comercio al por menor de pescados y mariscos en establecimientos especializados @es
preferred label: Kala, vähilaadsete ja limuste jaemüük spetsialiseeritud kauplustes @et
preferred label: Kalan, äyriäisten ja nilviäisten vähittäiskauppa @fi
preferred label: Commerce de détail de poissons, crustacés et mollusques en magasin spécialisé @fr
preferred label: Hal kiskereskedelme
preferred label: Commercio al dettaglio di pesci, crostacei e molluschi in esercizi specializzati @it
preferred label: Žuvų, vėžiagyvių ir moliuskų mažmeninė prekyba specializuotose parduotuvėse @lt
preferred label: Zivju, vēžveidīgo un mīkstmiešu mazumtirdzniecība specializētajos veikalos @lv
preferred label: Bejgħ bl-imnut ta' ħut, krustaċi u molluski @mt
preferred label: Detailhandel in vis en schaal- en weekdieren in gespecialiseerde winkels @nl
preferred label: Butikkhandel med fisk, skalldyr og bløtdyr @no
preferred label: Sprzedaż detaliczna ryb, skorupiaków i mięczaków prowadzona w wyspecjalizowanych sklepach @pl
preferred label: Comércio a retalho de peixe, crustáceos e moluscos, em estabelecimentos especializados @pt
preferred label: Comerţ cu amănuntul al peştelui, crustaceelor şi moluştelor, în magazine specializate @ro
preferred label: Розничная торговля рыбой, ракообразными и моллюсками в специализированных магазинах @ru
preferred label: Maloobchod s rybami, kôrovcami a mäkkýšmi v špecializovaných predajniach @sk
preferred label: Trgovina na drobno v specializiranih prodajalnah z ribami, raki, mehkužci @sl
preferred label: Specialiserad butikshandel med fisk, skal- och blötdjur @sv
preferred label: Belirli bir mala tahsis edilmiş mağazalardaki balık, kabuklu hayvanlar ve yumuşakçaların perakende ticareti @tr
broader: Retail sale of food, beverages and tobacco in specialised stores

Retail sale of bread, cakes, flour confectionery and sugar confectionery in specialised stores
type: Concept
notation: 47.24
status: valid
status modified: 2013-10-18
accepted date: 2013-10-18
in scheme: Statistical Classification of Economic Activities in the European Community, Rev. 2 (2008)
scope note: Этот класс включает: - розничную торговлю компьютерами - розничную торговлю периферийным компьютерным оборудованием - розничную торговлю пультами для видеоигр - розничную торговлю программным обеспечением, изготовленным не на заказ, включая видеоигры Этот класс исключает: - розничную торговлю чистой пленкой и дисками, см. 47.63 @ru
preferred label: Търговия на дребно с хляб, хлебни, захарни и сладкарски изделия @bg
preferred label: Maloobchod s chlebem, pečivem, cukrářskými výrobky a cukrovinkami ve specializovaných prodejnách @cs
preferred label: Detailhandel med brød, konditori- og sukkervarer i specialforretninger @da
preferred label: Einzelhandel mit Back- und Süßwaren @de
preferred label: Λιανικό εμπόριο ψωμιού, αρτοσκευασμάτων και λοιπών ειδών αρτοποιίας και ζαχαροπλαστικής σε ειδικευμένα καταστήματα @el
preferred label: Comercio al por menor de pan y productos de panadería, confitería y pastelería en establecimientos especializados @es
preferred label: Leivatoodete, kookide, jahu- ja suhkrukondiitritoodete jaemüük spetsialiseeritud kauplustes @et
preferred label: Leipomotuotteiden ja makeisten vähittäiskauppa @fi
preferred label: Commerce de détail de pain, pâtisserie et confiserie en magasin spécialisé @fr
preferred label: Kenyér-, pékáru-, édesség-kiskereskedelem
preferred label: Commercio al dettaglio di pane, pasticceria e dolciumi in esercizi specializzati @it
preferred label: Duonos, bandelių, konditerijos gaminių ir cukraus saldumynų mažmeninė prekyba specializuotose parduotuvėse @lt
preferred label: Maizes, kūku, miltu konditorejas un cukuroto konditorejas izstrādājumu mazumtirdzniecība specializētajos veikalos @lv
preferred label: Bejgħ bl-imnut ta' ħobż, pasti, ħlewwiet tad-dqiq u dolċerija @mt
preferred label: Detailhandel in brood, banketbakkerswerk en suikerwerk in gespecialiseerde winkels @nl
preferred label: Butikkhandel med bakervarer, konditorvarer og sukkervarer @no
preferred label: Sprzedaż detaliczna pieczywa, ciast, wyrobów ciastkarskich i cukierniczych prowadzona w wyspecjalizowanych sklepach @pl
preferred label: Comércio a retalho de pão, de produtos de pastelaria e de confeitaria, em estabelecimentos especializados @pt
preferred label: Comerţ cu amănuntul al pâinii, produselor de patiserie şi produselor zaharoase, în magazine specializate @ro
preferred label: Розничная торговля хлебобулочными, мучными и сахаристыми кондитерскими изделиями в специализированных магазинах @ru
preferred label: Maloobchod s chlebom, pečivom, cukrárskymi výrobkami v špecializovaných predajniach @sk
preferred label: Trgovina na drobno v specializiranih prodajalnah s kruhom, pecivom, testeninami, sladkornimi izdelki @sl
preferred label: Specialiserad butikshandel med bröd, konditorivaror och konfektyrer @sv
preferred label: Belirli bir mala tahsis edilmiş mağazalardaki ekmek, pastalar, unlu mamuller ve şekerli ürünlerin perakende ticareti @tr
broader: Retail sale of food, beverages and tobacco in specialised stores

Retail sale of beverages in specialised stores
type: Concept
notation: 47.25
status: valid
status modified: 2013-10-18
accepted date: 2013-10-18
in scheme: Statistical Classification of Economic Activities in the European Community, Rev. 2 (2008)
scope note: - алкохолни и безалкохолни напитки, които не са за непосредствена консумация @bg
scope note: Z: - maloobchod s nápoji (ne jako občerstvení k okamžité konzumaci na místě): • alkoholickými • nealkoholickými @cs
scope note: Diese Klasse umfasst: - Einzelhandel mit Getränken (nicht zum Verzehr an Ort und Stelle): • alkoholhaltige Getränke • alkoholfreie Getränke @de
scope note: This class includes: - retail sale of beverages (not for consumption on the premises): • alcoholic beverages • non-alcoholic beverages @en
scope note: Esta clase comprende: - el comercio al por menor de bebidas (para su consumo fuera del local): • bebidas alcohólicas • bebidas no alcohólicas @es
scope note: Cette classe comprend: - le commerce de détail de boissons (non destinées à la consommation sur place): • boissons alcoolisées • boissons non alcoolisées @fr
scope note: Ovaj razred uključuje: - trgovinu na malo pićima (ne za konzumiranje na „licu mjesta"): • alkoholnim pićima • bezalkoholnim pićima
scope note: Į šią klasę įeina: - gėrimų (neskirtų vartoti pardavimo vietoje) mažmeninė prekyba: • alkoholinių gėrimų mažmeninė prekyba • nealkoholinių gėrimų mažmeninė prekyba @lt
scope note: Bu sınıf aşağıdakileri kapsamaktadır; - içeceklerin perakende satışı: • alkollü içecekler, • alkolsüz içecekler. @tr
preferred label: Търговия на дребно с напитки @bg
preferred label: Maloobchod s nápoji ve specializovaných prodejnách @cs
preferred label: Detailhandel med drikkevarer @da
preferred label: Einzelhandel mit Getränken @de
preferred label: Λιανικό εμπόριο ποτών σε ειδικευμένα καταστήματα @el
preferred label: Comercio al por menor de bebidas en establecimientos especializados @es
preferred label: Jookide jaemüük spetsialiseeritud kauplustes @et
preferred label: Alkoholi- ja muiden juomien vähittäiskauppa @fi
preferred label: Commerce de détail de boissons en magasin spécialisé @fr
preferred label: Ital-kiskereskedelem
preferred label: Commercio al dettaglio di bevande in esercizi specializzati @it
preferred label: Gėrimų mažmeninė prekyba specializuotose parduotuvėse @lt
preferred label: Alkoholisko un citu dzērienu mazumtirdzniecība specializētajos veikalos @lv
preferred label: Bejgħ bl-imnut ta' xorb @mt
preferred label: Detailhandel in dranken in gespecialiseerde winkels @nl
preferred label: Butikkhandel med drikkevarer @no
preferred label: Sprzedaż detaliczna napojów alkoholowych i bezalkoholowych prowadzona w wyspecjalizowanych sklepach @pl
preferred label: Comércio a retalho de bebidas, em estabelecimentos especializados @pt
preferred label: Comerţ cu amănuntul al băuturilor, în magazine specializate @ro
preferred label: Розничная торговля напитками в специализированных магазинах @ru
preferred label: Maloobchod s nápojmi v špecializovaných predajniach @sk
preferred label: Trgovina na drobno v specializiranih prodajalnah s pijačami @sl
preferred label: Specialiserad butikshandel med alkoholhaltiga och andra drycker @sv
preferred label: Belirli bir mala tahsis edilmiş mağazalardaki içeceklerin perakende ticareti @tr
broader: Retail sale of food, beverages and tobacco in specialised stores

Retail sale of tobacco products in specialised stores
type: Concept
notation: 47.26
status: valid
status modified: 2013-10-18
accepted date: 2013-10-18
in scheme: Statistical Classification of Economic Activities in the European Community, Rev. 2 (2008)
scope note: Z: - maloobchod s tabákem - maloobchod s tabákovými výrobky @cs
scope note: Diese Klasse umfasst: - Einzelhandel mit Tabak - Einzelhandel mit Tabakwaren @de
scope note: This class includes: - retail sale of tobacco - retail sale of tobacco products @en
scope note: Esta clase comprende: - el comercio al por menor de tabaco - el comercio al por menor de productos del tabaco @es
scope note: Cette classe comprend: - le commerce de détail de tabac - le commerce de détail de produits à base de tabac @fr
scope note: Ovaj razred uključuje: - trgovinu na malo duhanom - trgovinu na malo duhanskim proizvodima
scope note: Į šią klasę įeina: - tabako mažmeninė prekyba - tabako gaminių mažmeninė prekyba @lt
scope note: Этот класс включает: - розничную торговлю радио и телевизионным оборудованием - розничную торговлю аудио и видео оборудованием - розничную торговлю плеерами и магнитофонами CD, DVD и т.д. @ru
scope note: Bu sınıf aşağıdakilerin perakende satışını kapsamaktadır; - tütün perakende satışı, - tütün ürünlerinin perakende satışı. @tr
preferred label: Търговия на дребно с тютюневи изделия @bg
preferred label: Maloobchod s tabákovými výrobky ve specializovaných prodejnách @cs
preferred label: Tobaksforretninger @da
preferred label: Einzelhandel mit Tabakwaren @de
preferred label: Λιανικό εμπόριο προϊόντων καπνού σε ειδικευμένα καταστήματα @el
preferred label: Comercio al por menor de productos de tabaco en establecimientos especializados @es
preferred label: Tubakatoodete jaemüük spetsialiseeritud kauplustes @et
preferred label: Tupakkatuotteiden vähittäiskauppa @fi
preferred label: Commerce de détail de produits à base de tabac en magasin spécialisé @fr
preferred label: Dohányáru-kiskereskedelem
preferred label: Commercio al dettaglio di prodotti del tabacco in esercizi specializzati @it
preferred label: Tabako gaminių mažmeninė prekyba specializuotose parduotuvėse @lt
preferred label: Tabakas izstrādājumu mazumtirdzniecība specializētajos veikalos @lv
preferred label: Bejgħ bl-imnut ta' prodotti tat-tabakk @mt
preferred label: Detailhandel in tabaksproducten in gespecialiseerde winkels @nl
preferred label: Butikkhandel med tobakksvarer @no
preferred label: Sprzedaż detaliczna wyrobów tytoniowych prowadzona w wyspecjalizowanych sklepach @pl
preferred label: Comércio a retalho de tabaco, em estabelecimentos especializados @pt
preferred label: Comerţ cu amănuntul al produselor din tutun, în magazine specializate @ro
preferred label: Розничная торговля табачными изделиями в специализированных магазинах @ru
preferred label: Maloobchod s tabakovými výrobkami v špecializovaných predajniach @sk
preferred label: Trgovina na drobno v specializiranih prodajalnah s tobačnimi izdelki @sl
preferred label: Specialiserad butikshandel med tobaksvaror @sv
preferred label: Belirli bir mala tahsis edilmiş mağazalardaki tütün ürünlerinin perakende ticareti @tr
broader: Retail sale of food, beverages and tobacco in specialised stores

Other retail sale of food in specialised stores
type: Concept
notation: 47.29
status: valid
status modified: 2013-10-18
accepted date: 2013-10-18
in scheme: Statistical Classification of Economic Activities in the European Community, Rev. 2 (2008)
scope note: - търговия на дребно с мляко и млечни продукти, яйца, хранителни масла и мазнини - търговия на дребно с други хранителни стоки, некласифицирани другаде @bg
scope note: Z: - maloobchod s mléčnými výrobky a vejci - maloobchod s ostatními potravinářskými výrobky j. n. @cs
scope note: Diese Klasse umfasst: - Einzelhandel mit Milch, Milcherzeugnissen und Eiern - Einzelhandel mit sonstigen Nahrungsmitteln a. n. g. @de
scope note: This class includes: - retail sale of dairy products and eggs - retail sale of other food products n.e.c. @en
scope note: Esta clase comprende: - el comercio al por menor de productos lácteos y huevos - el comercio al por menor de otros productos alimenticios n.c.o.p. @es
scope note: Cette classe comprend: - le commerce de détail de produits laitiers et d’œufs - les autres commerces de détail alimentaires n.c.a. @fr
scope note: Ovaj razred uključuje: - trgovinu na malo mliječnim proizvodima i jajima - trgovinu na malo ostalim prehrambenim proizvodima, d. n.
scope note: Į šią klasę įeina: - pieno produktų ir kiaušinių mažmeninė prekyba - kitų, niekur kitur nepriskirtų, maisto produktų mažmeninė prekyba @lt
scope note: Данная группа включает розничную торговлю бытовым оборудованием, текстильными изделиями, металлическими изделиями, коврами, электрическими приборами или мебелью в специализированных магазинах. @ru
scope note: Bu sınıf aşağıdakileri kapsamaktadır; - süt ürünleri ve yumurtaların perakende satışı, - başka yerde sınıflandırılmamış diğer gıda ürünlerinin perakende satışı. @tr
preferred label: Търговия на дребно с други хранителни стоки @bg
preferred label: Ostatní maloobchod s potravinami ve specializovaných prodejnách @cs
preferred label: Anden detailhandel med fødevarer i specialforretninger @da
preferred label: Sonstiger Einzelhandel mit Nahrungs- und Genussmitteln @de
preferred label: Λιανικό εμπόριο άλλων τροφίμων σε ειδικευμένα καταστήματα @el
preferred label: Otro comercio al por menor de productos alimenticios en establecimientos especializados @es
preferred label: Muu toidukaupade jaemüük spetsialiseeritud kauplustes @et
preferred label: Muu vähittäiskauppa erikoismyymälöissä @fi
preferred label: Autres commerces de détail alimentaires en magasin spécialisé @fr
preferred label: Egyéb élelmiszer-kiskereskedelem
preferred label: Commercio al dettaglio di altri prodotti alimentari in esercizi specializzati @it
preferred label: Kita maisto produktų mažmeninė prekyba specializuotose parduotuvėse @lt
preferred label: Citur neklasificēta pārtikas mazumtirdzniecība specializētajos veikalos @lv
preferred label: Bejgħ ieħor bl-imnut ta' ikel minn ħwienet speċjalizzati @mt
preferred label: Overige detailhandel in voedingsmiddelen in gespecialiseerde winkels @nl
preferred label: Butikkhandel med nærings- og nytelsesmidler ellers @no
preferred label: Sprzedaż detaliczna żywności prowadzona w wyspecjalizowanych sklepach, pozostała @pl
preferred label: Comércio a retalho de outros produtos alimentares, em estabelecimentos especializados @pt
preferred label: Comerţ cu amănuntul al altor produse alimentare, în magazine specializate @ro
preferred label: Прочие виды розничной торговли продуктами питания в специализированных магазинах @ru
preferred label: Ostatný maloobchod s potravinami v špecializovaných predajniach @sk
preferred label: Druga trgovina na drobno v specializiranih prodajalnah z živili @sl
preferred label: Annan specialiserad butikshandel med livsmedel @sv
preferred label: Belirli bir mala tahsis edilmiş mağazalardaki diğer gıda ürünlerinin perakende ticareti @tr
broader: Retail sale of food, beverages and tobacco in specialised stores

Retail sale of automotive fuel in specialised stores
type: Concept
notation: 47.3
status: valid
status modified: 2013-10-18
accepted date: 2013-10-18
in scheme: Statistical Classification of Economic Activities in the European Community, Rev. 2 (2008)
scope note: Этот класс включает: - розничную торговлю тканями - розничную торговлю трикотажной пряжей - розничную торговлю базовым материалом для изготовления ковров, гобеленов или вышивки - розничную торговлю текстильными изделиями - розничную торговлю галантерейными товарами: иголками, нитками и т.д. Этот класс исключает: - розничную торговлю одеждой, см. 47.71 @ru
preferred label: Търговия на дребно с автомобилни горива и смазочни материали @bg
preferred label: Maloobchod s pohonnými hmotami ve specializovaných prodejnách @cs
preferred label: Servicestationer @da
preferred label: Einzelhandel mit Motorenkraftstoffen (Tankstellen) @de
preferred label: Λιανικό εμπόριο καυσίμων κίνησης σε ειδικευμένα καταστήματα @el
preferred label: Comercio al por menor de combustible para la automoción en establecimientos especializados @es
preferred label: Mootorkütuse jaemüük spetsialiseeritud kauplustes @et
preferred label: Ajoneuvojen polttoaineen vähittäiskauppa @fi
preferred label: Commerce de détail de carburants en magasin spécialisé @fr
preferred label: Gépjármű-üzemanyag kiskereskedelem
preferred label: Commercio al dettaglio di carburante per autotrazione in esercizi specializzati @it
preferred label: Automobilių degalų mažmeninė prekyba specializuotose parduotuvėse @lt
preferred label: Degvielas mazumtirdzniecība degvielas uzpildes stacijās @lv
preferred label: Bejgħ bl-imnut ta' fjuwil awtomotiv minn ħwienet speċjalizzati @mt
preferred label: Detailhandel in motorbrandstoffen in gespecialiseerde winkels @nl
preferred label: Detaljhandel med drivstoff til motorvogner @no
preferred label: Sprzedaż detaliczna paliw do pojazdów silnikowych na stacjach paliw @pl
preferred label: Comércio a retalho de combustível para veículos a motor, em estabelecimentos especializados @pt
preferred label: Comerţ cu amănuntul al carburanţilor pentru autovehicule în magazine specializate @ro
preferred label: Розничная торговля топливом в специализированных магазинах @ru
preferred label: Maloobchod s pohonnými látkami v špecializovaných predajniach @sk
preferred label: Trgovina na drobno v specializiranih prodajalnah z motornimi gorivi @sl
preferred label: Specialiserad detaljhandel med drivmedel @sv
preferred label: Belirli bir mala tahsis edilmiş mağazalarda otomotiv yakıtının perakende ticareti @tr
broader: Retail trade, except of motor vehicles and motorcycles
narrower: Retail sale of automotive fuel in specialised stores

Retail sale of automotive fuel in specialised stores
type: Concept
notation: 47.30
status: valid
status modified: 2013-10-18
accepted date: 2013-10-18
in scheme: Statistical Classification of Economic Activities in the European Community, Rev. 2 (2008)
scope note: - търговия на дребно с течни и газообразни горива за автомобили и мотоциклети - търговия на дребно със смазочни материали и антифриз - търговия на дребно с почистващи и полиращи средства и подобни продукти за автомобили - търговия на едро с автомобилни горива - 46.71 - търговия на дребно с втечнен газ в бутилки за битови нужди - 47.78 @bg
scope note: Z: - maloobchod s pohonnými hmotami pro motorová vozidla a motocykly ZT: - maloobchod s prostředky pro mazání a chlazení motorových vozidel N: - velkoobchod s palivy (46.71) - maloobchod se zkapalněným plynem pro domácnosti (47.78) @cs
scope note: Diese Klasse umfasst: - Einzelhandel mit Fahrzeugkraftstoffen Diese Klasse umfasst ferner: - Einzelhandel mit Schmierstoffen und Kühlmitteln für Kraftfahrzeuge Diese Klasse umfasst nicht: - Großhandel mit Kraftstoffen (s. 46.71) - Einzelhandel mit Flüssiggas für den Haushalt (s. 47.78) @de
scope note: This class includes: - retail sale of fuel for motor vehicles and motorcycles This class also includes: - retail sale of lubricating products and cooling products for motor vehicles This class excludes: - wholesale of fuels, see 46.71 - retail sale of liquefied petroleum gas for cooking or heating, see 47.78 @en
scope note: Esta clase comprende: - el comercio al por menor de carburante para vehículos de motor y motocicletas Esta clase comprende también: - el comercio al por menor de lubricantes y refrigerantes para vehículos de motor Esta clase no comprende: - el comercio al por mayor de carburante (véase 46.71) - el comercio al por menor de gases licuados de petróleo para cocina o calefacción (véase 47.78) @es
scope note: Cette classe comprend: - le commerce de détail de carburants pour véhicules automobiles et motocycles Cette classe comprend également: - le commerce de détail de lubrifiants et de produits de refroidissement pour véhicules automobiles Cette classe ne comprend pas: - le commerce de gros de carburants, voir 46.71 - le commerce de détail de gaz de pétrole liquéfié pour la cuisine ou le chauffage, voir 47.78 @fr
scope note: Ovaj razred uključuje: - trgovinu na malo gorivima za motorna vozila i motocikle Ovaj razred također uključuje: - trgovinu na malo mazivima i proizvodima za hlađenje za motorna vozila Ovaj razred isključuje: - trgovinu na veliko gorivima, vidi 46.71 - trgovinu na malo plinom u bocama za kućanstvo, vidi 47.7
scope note: Į šią klasę įeina: - variklinių transporto priemonių ir motociklų degalų mažmeninė prekyba Į šią klasę taip pat įeina: - variklinių transporto priemonių tepalų ir aušinimo produktų mažmeninė prekyba Į šią klasę neįeina: - degalų didmeninė prekyba, žr. 46.71 - mažmeninė prekyba suskystintomis naftos dujomis maistui gaminti arba šildymo reikmėms, žr. 47.78 @lt
scope note: Этот класс включает: - розничную торговлю скобяными изделиями - розничную торговлю лакокрасочной продукцией - розничную торговлю листовым стеклом - розничную торговлю прочими строительными материалами, такими как кирпичи, древесина, сантехническое оборудование - розничную торговлю самодельными товарами и оборудованием Этот класс также включает: - розничную торговлю газонокосилками любого управления - розничную торговлю саунами @ru
scope note: Bu sınıf aşağıdakileri kapsamaktadır; - motorlu taşıt ve motosiklet yakıtının perakende ticareti. Ayrıca bu sınıf aşağıdakileri de kapsamaktadır; - motorlu taşıtlar için yağ ürünlerinin ve soğutma ürünlerinin perakende ticareti. Kapsam dışı olanlar; - yakıtların toptan ticareti, bkz. 46.71, - yemek pişirme ve ısınma amaçlı sıvılaştırılmış petrol gazının perakende ticareti, bkz. 47.78. @tr
preferred label: Търговия на дребно с автомобилни горива и смазочни материали @bg
preferred label: Maloobchod s pohonnými hmotami ve specializovaných prodejnách @cs
preferred label: Servicestationer @da
preferred label: Einzelhandel mit Motorenkraftstoffen (Tankstellen) @de
preferred label: Λιανικό εμπόριο καυσίμων κίνησης σε ειδικευμένα καταστήματα @el
preferred label: Comercio al por menor de combustible para la automoción en establecimientos especializados @es
preferred label: Mootorkütuse jaemüük spetsialiseeritud kauplustes @et
preferred label: Ajoneuvojen polttoaineen vähittäiskauppa @fi
preferred label: Commerce de détail de carburants en magasin spécialisé @fr
preferred label: Gépjármű-üzemanyag kiskereskedelem
preferred label: Commercio al dettaglio di carburante per autotrazione in esercizi specializzati @it
preferred label: Automobilių degalų mažmeninė prekyba specializuotose parduotuvėse @lt
preferred label: Degvielas mazumtirdzniecība degvielas uzpildes stacijās @lv
preferred label: Bejgħ bl-imnut ta' fjuwil awtomotiv minn ħwienet speċjalizzati @mt
preferred label: Detailhandel in motorbrandstoffen in gespecialiseerde winkels @nl
preferred label: Detaljhandel med drivstoff til motorvogner @no
preferred label: Sprzedaż detaliczna paliw do pojazdów silnikowych na stacjach paliw @pl
preferred label: Comércio a retalho de combustível para veículos a motor, em estabelecimentos especializados @pt
preferred label: Comerţ cu amănuntul al carburanţilor pentru autovehicule în magazine specializate @ro
preferred label: Розничная торговля топливом в специализированных магазинах @ru
preferred label: Maloobchod s pohonnými látkami v špecializovaných predajniach @sk
preferred label: Trgovina na drobno v specializiranih prodajalnah z motornimi gorivi @sl
preferred label: Specialiserad detaljhandel med drivmedel @sv
preferred label: Belirli bir mala tahsis edilmiş mağazalarda otomotiv yakıtının perakende ticareti @tr
broader: Retail sale of automotive fuel in specialised stores

Retail sale of information and communication equipment in specialised stores
type: Concept
notation: 47.4
status: valid
status modified: 2013-10-18
accepted date: 2013-10-18
in scheme: Statistical Classification of Economic Activities in the European Community, Rev. 2 (2008)
scope note: Тази група включва търговия на дребно в специализирани магазини с компютри, периферни устройства за тях, устройства за далекосъобщения и битова електроника. @bg
scope note: Tato skupina zahrnuje specializovaný maloobchod se zařízením pro informační a komunikační technologii (ICT), jako jsou počítače a periferní zařízení, zařízení telekomunikační a spotřební elektroniky. @cs
scope note: Diese Gruppe umfasst den Facheinzelhandel mit Geräten der Informations- und Kommunikationstechnik (IKT), wie Datenverarbeitungsgeräte und periphere Geräte, Telekommunikationsgeräte und Geräten der Unterhaltungselektronik. @de
scope note: This group includes the retail sale of information and communications technology (ICT) equipment, such as computers and peripheral equipment, telecommunications equipment and consumer electronics, by specialised stores. @en
scope note: Este grupo comprende el comercio al por menor de equipos relacionados con las tecnologías de la información y las comunicaciones (TIC), como ordenadores, periféricos, equipos de telecomunicaciones y productos electrónicos de consumo, en establecimientos especializados. @es
scope note: Ce groupe comprend le commerce de détail d’équipements des technologies de l’information et de la communication (TIC), c’est-à-dire des ordinateurs et des équipements périphériques, des équipements de télécommunication et des produits électroniques grand public, en magasin spécialisé. @fr
scope note: Ova skupina uključuje trgovinu na malo opremom informacijsko-komunikacijske tehnologije (ICT) kao što su računala i periferna oprema, telekomunikacijska oprema te elektronički uređaji za široku potrošnju u specijaliziranim prodavaonicama.
scope note: Į šią grupę įeina informacijos ir ryšių technologijų įrangos (IRT), tokios kaip kompiuteriai, jų išorinė įranga, telekomunikacijų įranga ir buitinė elektroninė aparatūra, mažmeninė prekyba specializuotose parduotuvėse. @lt
scope note: Этот класс включает: - розничную торговлю коврами и ковровыми изделиями - розничную торговлю шторами и оконными сетками - розничную торговлю обоями и напольными покрытиями Этот класс исключает: - розничную торговлю пробковым покрытием для полов, см. 47.52 @ru
scope note: Bu grup, belirli bir mala tahsis edilmiş mağazalar tarafından bilgisayarlar ve çevre donanımları, iletişim donanımları ve tüketim malları gibi bilgi ve iletişim teknolojisi (ICT) teçhizatının perakende ticaretini kapsamaktadır. @tr
preferred label: Търговия на дребно в специализирани магазини с компютърна и комуникационна техника и битова електроника @bg
preferred label: Maloobchod s počítačovým a komunikačním zařízením ve specializovaných prodejnách @cs
preferred label: Detailhandel med informations- og kommunikationsudstyr i specialforretninger @da
preferred label: Einzelhandel mit Geräten der Informations- und Kommunikationstechnik (in Verkaufsräumen) @de
preferred label: Λιανικό εμπόριο εξοπλισμού πληροφοριακών και επικοινωνιακών συστημάτων σε ειδικευμένα καταστήματα @el
preferred label: Comercio al por menor de equipos para las tecnologías de la información y las comunicaciones en establecimientos especializados @es
preferred label: Info- ja sidetehnika jaemüük spetsialiseeritud kauplustes @et
preferred label: Tieto- ja viestintäteknisten laitteiden vähittäiskauppa erikoismyymälöissä @fi
preferred label: Commerce de détail d'équipements de l'information et de la communication en magasin spécialisé @fr
preferred label: Információs, híradástechnikai termék kiskereskedelme
preferred label: Commercio al dettaglio di apparecchiature di informazione e comunicazione in esercizi specializzati @it
preferred label: Informacijos ir ryšių technologijų (IRT) įrangos mažmeninė prekyba specializuotose parduotuvėse @lt
preferred label: Informācijas un komunikāciju tehnoloģiju iekārtu mazumtirdzniecība specializētajos veikalos @lv
preferred label: Bejgħ bl-imnut ta' tagħmir ta' l-informatika u l-komunikazzjoni minn ħwienet speċjalizzati @mt
preferred label: Detailhandel in ICT-apparatuur in gespecialiseerde winkels @nl
preferred label: Butikkhandel med IKT-utstyr i spesialforretninger @no
preferred label: Sprzedaż detaliczna narzędzi informacyjnych i komunikacyjnych prowadzona w wyspecjalizowanych sklepach @pl
preferred label: Comércio a retalho de equipamento das tecnologias de informação e comunicação, em estabelecimentos especializados @pt
preferred label: Comerţ cu amănuntul al echipamentului informatic şi de telecomunicaţii în magazine specializate @ro
preferred label: Розничная торговля информационным и коммуникационным оборудованием в специализированных магазинах @ru
preferred label: Maloobchod so zariadeniami pre informatiku a komunikácie – IKT v špecializovaných predajniach @sk
preferred label: Trgovina na drobno v specializiranih prodajalnah z računalniškimi, komunikacijskimi, avdio in video napravami @sl
preferred label: Specialiserad butikshandel med informations- och kommunikationsutrustning @sv
preferred label: Belirli bir mala tahsis edilmiş mağazalarda bilgi ve iletişim teknolojisi (ICT) teçhizatının perakende ticareti @tr
broader: Retail trade, except of motor vehicles and motorcycles
narrower: Retail sale of computers, peripheral units and software in specialised stores
narrower: Retail sale of telecommunications equipment in specialised stores
narrower: Retail sale of audio and video equipment in specialised stores

Retail sale of computers, peripheral units and software in specialised stores
type: Concept
notation: 47.41
status: valid
status modified: 2013-10-18
accepted date: 2013-10-18
in scheme: Statistical Classification of Economic Activities in the European Community, Rev. 2 (2008)
scope note: - търговия на дребно с компютри - търговия на дребно с периферни устройства - търговия на дребно с видео конзолни игри - търговия на дребно със стандартен софтуер, вкл. видеоигри - търговия на дребно с незаписани аудио- и видеокасети, дискети, компактдискове и цифрови дискове - 47.63 @bg
scope note: Z: - maloobchod s počítači - maloobchod s počítačovými periferními zařízeními - maloobchod s konzolemi pro videohry - maloobchod se standardním softwarem, včetně videoher N: - maloobchod s nenahranými zvukovými a obrazovými nosiči (47.63) @cs
scope note: Diese Klasse umfasst: - Einzelhandel mit Datenverarbeitungsgeräten - Einzelhandel mit peripheren Geräten - Einzelhandel mit Videospielkonsolen - Einzelhandel mit Standardsoftware, einschließlich Videospielen Diese Klasse umfasst nicht: - Einzelhandel mit unbespielten Ton- und Bildträgern (s. 47.63) @de
scope note: This class includes: - retail sale of computers - retail sale of computer peripheral equipment - retail sale of video game consoles - retail sale of non-customised software, including video games This class excludes: - retail sale of blank tapes and disks, see 47.63 @en
scope note: Esta clase comprende: - el comercio al por menor de ordenadores - el comercio al por menor de periféricos - el comercio al por menor de consolas de videojuegos - el comercio al por menor de programas informáticos no fabricados según especificaciones, incluidos los videojuegos Esta clase no comprende: - el comercio al por menor de cintas y discos vírgenes (véase 47.63) @es
scope note: Cette classe comprend: - le commerce de détail d’ordinateurs - le commerce de détail d’équipements périphériques - le commerce de détail de consoles de jeux vidéo - le commerce de détail de logiciels non personnalisés, y compris les jeux vidéo Cette classe ne comprend pas: - le commerce de détail de bandes et disques vierges, voir 47.63 @fr
scope note: Ovaj razred uključuje: - trgovinu na malo računalima - trgovinu na malo računalnom perifernom opremom - trgovinu na malo konzolama za videoigre - trgovinu na malo standardnim softverom, uključujući videoigre Ovaj razred isključuje: - trgovinu na malo praznim vrpcama i diskovima, vidi 47.63
scope note: Į šią klasę įeina: - kompiuterių mažmeninė prekyba - kompiuterių išorinės įrangos mažmeninė prekyba - vaizdo žaidimų pultų mažmeninė prekyba - bendrosios paskirties programinės įrangos, įskaitant vaizdo žaidimus, mažmeninė prekyba Į šią klasę neįeina: - neįrašytų kasečių ir diskų mažmeninė prekyba, žr. 47.63 @lt
scope note: Этот класс исключает: - розничную торговлю аудио и видео оборудованием, см. 47.43 @ru
scope note: Bu sınıf aşağıdakileri kapsamaktadır; - bilgisayarların perakende ticareti, - bilgisayar çevre donanımlarının perakende ticareti, - video oyun konsollarının perakende ticareti, - kişiye özel olmayan yazılım programlarının (video oyunları dahil) perakende ticareti. Kapsam dışı olanlar; - boş kasetlerin ve disklerin perakende ticareti, bkz. 47.63, @tr
preferred label: Търговия на дребно с компютри, периферни устройства за тях и програмни продукти @bg
preferred label: Maloobchod s počítači, počítačovým periferním zařízením a softwarem ve specializovaných prodejnách @cs
preferred label: Detailhandel med computere, ydre enheder og software @da
preferred label: Einzelhandel mit Datenverarbeitungsgeräten, peripheren Geräten und Software @de
preferred label: Λιανικό εμπόριο ηλεκτρονικών υπολογιστών, περιφερειακών μονάδων υπολογιστών και λογισμικού σε ειδικευμένα καταστήματα @el
preferred label: Comercio al por menor de ordenadores, equipos periféricos y programas informáticos en establecimientos especializados @es
preferred label: Arvutite, arvuti välisseadmete ja tarkvara jaemüük spetsialiseeritud kauplustes @et
preferred label: Tietokoneiden, niiden oheislaitteiden ja ohjelmistojen vähittäiskauppa @fi
preferred label: Commerce de détail d'ordinateurs, d'unités périphériques et de logiciels en magasin spécialisé @fr
preferred label: Számítógép, periféria, szoftver kiskereskedelme
preferred label: Commercio al dettaglio di computer, unità periferiche e software in esercizi specializzati @it
preferred label: Kompiuterių, jų išorinės ir programinės įrangos mažmeninė prekyba specializuotose parduotuvėse @lt
preferred label: Datoru, to perifēro iekārtu un programmatūras mazumtirdzniecība specializētajos veikalos @lv
preferred label: Bejgħ bl-imnut ta' kompjuters, unitajiet periferali u softwer minn ħwienet speċjalizzati @mt
preferred label: Detailhandel in computers, randapparatuur en software in gespecialiseerde winkels @nl
preferred label: Butikkhandel med datamaskiner og utstyr til datamaskiner @no
preferred label: Sprzedaż detaliczna komputerów, urządzeń peryferyjnych i oprogramowania prowadzona w wyspecjalizowanych sklepach @pl
preferred label: Comércio a retalho de computadores, unidades periféricas e programas informáticos, em estabelecimentos especializados @pt
preferred label: Comerţ cu amănuntul al calculatoarelor, unităţilor periferice şi software-lui în magazine specializate @ro
preferred label: Розничная торговля компьютерами, периферийным оборудованием и программным обеспечением в специализированных магазинах @ru
preferred label: Maloobchod s počítačmi, periférnymi jednotkami a softvérom v špecializovaných predajniach @sk
preferred label: Trgovina na drobno v specializiranih prodajalnah z računalniškimi napravami in programi @sl
preferred label: Specialiserad butikshandel med datorer, programvara, data- och tv-spel @sv
preferred label: Belirli bir mala tahsis edilmiş mağazalarda bilgisayarların, çevre donanımlarının ve yazılım programlarının perakende ticareti @tr
broader: Retail sale of information and communication equipment in specialised stores

Retail sale of telecommunications equipment in specialised stores
type: Concept
notation: 47.42
status: valid
status modified: 2013-10-18
accepted date: 2013-10-18
in scheme: Statistical Classification of Economic Activities in the European Community, Rev. 2 (2008)
scope note: Этот класс включает: - розничную торговлю бытовой мебелью - розничную торговлю осветительными приборами - розничную торговлю бытовой утварью, столовыми принадлежностями, посудой, стеклянными, фарфоровыми и керамическими изделиями - розничную торговлю деревянными, пробковыми и плетеными изделиями - розничную торговлю неэлектрическими бытовыми приборами - розничную торговлю музыкальными инструментами и партитурами - розничную торговлю электрическими системами безопасности и сигнализации, такими как замки и предохранители, сейфы и тайники без предоставления услуг по установке и техобслуживанию - розничную торговлю бытовыми приборами и оборудованием, не перечисленными выше Этот класс исключает: - розничную торговлю антикварными товарами, см. 47.79 @ru
preferred label: Търговия на дребно с телефонни апарати и други устройства за далекосъобщения @bg
preferred label: Maloobchod s telekomunikačním zařízením ve specializovaných prodejnách @cs
preferred label: Detailhandel med telekommunikationsudstyr @da
preferred label: Einzelhandel mit Telekommunikationsgeräten @de
preferred label: Λιανικό εμπόριο τηλεπικοινωνιακού εξοπλισμού σε ειδικευμένα καταστήματα @el
preferred label: Comercio al por menor de equipos de telecomunicaciones en establecimientos especializados @es
preferred label: Telekommunikatsiooniseadmete jaemüük spetsialiseeritud kauplustes @et
preferred label: Televiestintälaitteiden vähittäiskauppa @fi
preferred label: Commerce de détail de matériels de télécommunication en magasin spécialisé @fr
preferred label: Telekommunikációs termék kiskereskedelme
preferred label: Commercio al dettaglio di apparecchiature per le telecomunicazioni in esercizi specializzati @it
preferred label: Telekomunikacijų įrangos mažmeninė prekyba specializuotose parduotuvėse @lt
preferred label: Telekomunikāciju iekārtu mazumtirdzniecība specializētajos veikalos @lv
preferred label: Bejgħ bl-imnut ta' tagħmir tat-telekomunikazzjoni minn ħwienet speċjalizzati @mt
preferred label: Detailhandel in telecommunicatieapparatuur in gespecialiseerde winkels @nl
preferred label: Butikkhandel med telekommunikasjonsutstyr @no
preferred label: Sprzedaż detaliczna sprzętu telekomunikacyjnego prowadzona w wyspecjalizowanych sklepach @pl
preferred label: Comércio a retalho de equipamento de telecomunicações, em estabelecimentos especializados @pt
preferred label: Comerţ cu amănuntul al echipamentului pentru telecomunicaţii în magazine specializate @ro
preferred label: Розничная торговля телекоммуникационным оборудованием в специализированных магазинах @ru
preferred label: Maloobchod s telekomunikačnými prístrojmi v špecializovaných predajniach @sk
preferred label: Trgovina na drobno v specializiranih prodajalnah s telekomunikacijskimi napravami @sl
preferred label: Specialiserad butikshandel med telekommunikationsutrustning @sv
preferred label: Belirli bir mala tahsis edilmiş mağazalarda telekomünikasyon teçhizatının perakende ticareti @tr
broader: Retail sale of information and communication equipment in specialised stores

Retail sale of audio and video equipment in specialised stores
type: Concept
notation: 47.43
status: valid
status modified: 2013-10-18
accepted date: 2013-10-18
in scheme: Statistical Classification of Economic Activities in the European Community, Rev. 2 (2008)
scope note: - търговия на дребно с радио- и телевизионна техника - търговия на дребно с аудио- и видеотехника - търговия на дребно с компактдискови устройства за възпроизвеждане на звук (CD) и записващи и възпроизвеждащи апарати за цифрови дискове (DVD) @bg
scope note: Z: - maloobchod s rádiovým a televizním zařízením - maloobchod s audio- a videozařízením - maloobchod se záznamovým a reprodukčním zařízením pro CD, DVD atd. @cs
scope note: Diese Klasse umfasst: - Einzelhandel mit Rundfunk- und Fernsehgeräten - Einzelhandel mit Audio- und Videogeräten - Einzelhandel mit Aufzeichnungs- und Wiedergabegeräten für CDs, DVDs usw. @de
scope note: This class includes: - retail sale of radio and television equipment - retail sale of audio and video equipment - retail sale of CD, DVD etc. players and recorders @en
scope note: Esta clase comprende: - el comercio al por menor de aparatos de radio y televisión - el comercio al por menor de equipos de audio y vídeo - el comercio al por menor de reproductores y grabadores de CD, DVD, etc. @es
scope note: Cette classe comprend: - le commerce de détail d’appareils de radio et de télévision - le commerce de détail d’appareils audio et vidéo - le commerce de détail de lecteurs et enregistreurs de CD et de DVD @fr
scope note: Ovaj razred uključuje: - trgovinu na malo radio i televizijskom opremom - trgovinu na malo audio i videoopremom - trgovinu na malo CD i DVD-uređajima
scope note: Į šią klasę įeina: - radijo ir televizijos įrangos mažmeninė prekyba - garso ir vaizdo įrangos mažmeninė prekyba - kompaktinių diskų (CD), skaitmeninių vaizdo diskų (DVD) ir kt. leistuvų ir įrašymo aparatų mažmeninė prekyba @lt
scope note: Данная группа включает розничную торговлю в специализированных магазинах товарами культурно-развлекательного характера, такими как книги, газеты, музыкальная продукция, спортивная экипировка, игры и игрушки. @ru
scope note: Bu sınıf aşağıdakileri kapsamaktadır; - radyo ve televizyon perakende ticareti, - ses ve video teçhizatın perakende ticareti, - CD, DVD, MP3 vb. çalarlar ve kaydedicilerin perakende ticareti. @tr
preferred label: Търговия на дребно с битова електроника @bg
preferred label: Maloobchod s audio- a videozařízením ve specializovaných prodejnách @cs
preferred label: Radio- og tvforretninger @da
preferred label: Einzelhandel mit Geräten der Unterhaltungselektronik @de
preferred label: Λιανικό εμπόριο εξοπλισμού ήχου και εικόνας σε ειδικευμένα καταστήματα @el
preferred label: Comercio al por menor de equipos de audio y vídeo en establecimientos especializados @es
preferred label: Heli- ja videoseadmete jaemüük spetsialiseeritud kauplustes @et
preferred label: Viihde-elektroniikan vähittäiskauppa @fi
preferred label: Commerce de détail de matériels audio/vidéo en magasin spécialisé @fr
preferred label: Audio-, videoberendezés kiskereskedelme
preferred label: Commercio al dettaglio di apparecchiature audio e video in esercizi specializzati @it
preferred label: Garso ir vaizdo įrangos mažmeninė prekyba specializuotose parduotuvėse @lt
preferred label: Audio un video ierīču mazumtirdzniecība specializētajos veikalos @lv
preferred label: Bejgħ bl-imnut ta' tagħmir awdjo u vidjo minn ħwienet speċjalizzati @mt
preferred label: Detailhandel in audio- en videoapparatuur in gespecialiseerde winkels @nl
preferred label: Butikkhandel med audio- og videoutstyr @no
preferred label: Sprzedaż detaliczna sprzętu audiowizualnego prowadzona w wyspecjalizowanych sklepach @pl
preferred label: Comércio a retalho de equipamento de audiovisual, em estabelecimentos especializados @pt
preferred label: Comerţ cu amănuntul al echipamentelor audio/video în magazine specializate @ro
preferred label: Розничная торговля аудио и видео техникой в специализированных магазинах @ru
preferred label: Maloobchod s audio a video prístrojmi v špecializovaných predajniach @sk
preferred label: Trgovina na drobno v specializiranih prodajalnah z avdio in video napravami @sl
preferred label: Specialiserad butikshandel med ljud- och bildanläggningar samt videoutrustning @sv
preferred label: Belirli bir mala tahsis edilmiş mağazalarda ses ve görüntü cihazlarının perakende ticareti @tr
broader: Retail sale of information and communication equipment in specialised stores

Retail sale of other household equipment in specialised stores
type: Concept
notation: 47.5
status: valid
status modified: 2013-10-18
accepted date: 2013-10-18
in scheme: Statistical Classification of Economic Activities in the European Community, Rev. 2 (2008)
scope note: Tato skupina zahrnuje specializovaný maloobchod s potřebami pro domácnost, např. textilem, železářským zbožím, koberci, elektrickými spotřebiči a nábytkem. @cs
scope note: Diese Gruppe umfasst den Einzelhandel mit Haushaltsartikeln wie Textilien, Metallwaren, Teppichen, Elektrogeräten oder Möbeln. @de
scope note: This group includes the retail sale of household equipment, such as textiles, hardware, carpets, electrical appliances or furniture, in specialised stores. @en
scope note: Este grupo comprende el comercio al por menor de artículos domésticos como textiles, ferretería, alfombras, aparato eléctrico o muebles en establecimientos especializados. @es
scope note: Ce groupe comprend le commerce de détail d’équipements ménagers, tels que textiles, quincaillerie, tapis, appareils électriques ou meubles, en magasins spécialisés. @fr
scope note: Ova skupina uključuje trgovinu na malo opremom za kućanstvo kao što su tekstil, željezna roba, sagovi, električni aparati za kućanstvo ili namještaj, u specijaliziranim prodavaonicama.
scope note: Į šią grupę įeina buitinės įrangos, tokios kaip tekstilės gaminiai ar dirbiniai, metalo dirbiniai, kilimai, elektriniai prietaisai ar baldai, mažmeninė prekyba specializuotose parduotuvėse. @lt
scope note: Этот класс включает: - розничную торговлю книгами всех жанров и направлений Этот класс исключает: - розничную торговлю подержанными или старинными книгами, см. 47.79 @ru
scope note: Bu grup, belirli bir mala tahsis edilmiş mağazalarda tekstil, hırdavat, halı, elektrikli cihazlar veya mobilyaların perakende ticaretini kapsamaktadır. @tr
preferred label: Търговия на дребно в специализирани магазини с текстил, железария, стоки за обзавеждане и битови електроуреди @bg
preferred label: Maloobchod s ostatními výrobky převážně pro domácnost ve specializovaných prodejnách @cs
preferred label: Detailhandel med husholdningsudstyr i specialforretninger @da
preferred label: Einzelhandel mit sonstigen Haushaltsgeräten, Textilien, Heimwerker- und Einrichtungsbedarf (in Verkaufsräumen) @de
preferred label: Λιανικό εμπόριο άλλου οικιακού εξοπλισμού σε ειδικευμένα καταστήματα @el
preferred label: Comercio al por menor de otros artículos de uso doméstico en establecimientos especializados @es
preferred label: Muude kodutarvete jaemüük spetsialiseeritud kauplustes @et
preferred label: Muiden kotitaloustavaroiden vähittäiskauppa erikoismyymälöissä @fi
preferred label: Commerce de détail d'autres équipements du foyer en magasin spécialisé @fr
preferred label: Egyéb háztartási cikk kiskereskedelme
preferred label: Commercio al dettaglio di altri oggetti di uso domestico in esercizi specializzati @it
preferred label: Kitos namų ūkio įrangos mažmeninė prekyba specializuotose parduotuvėse @lt
preferred label: Mājsaimniecības piederumu mazumtirdzniecība specializētajos veikalos @lv
preferred label: Bejgħ bl-imnut ta' tagħmir ieħor għad-dar minn ħwienet speċjalizzati @mt
preferred label: Detailhandel in andere consumentenartikelen in gespecialiseerde winkels @nl
preferred label: Butikkhandel med andre husholdningsvarer i spesialforretninger @no
preferred label: Sprzedaż detaliczna artykułów użytku domowego prowadzona w wyspecjalizowanych sklepach @pl
preferred label: Comércio a retalho de outro equipamento para uso doméstico, em estabelecimentos especializados @pt
preferred label: Comerţ cu amănuntul al altor produse casnice, în magazine specializate @ro
preferred label: Розничная торговля прочим бытовым оборудованием в специализированных магазинах @ru
preferred label: Maloobchod s ostatným tovarom pre domácnosť v špecializovaných predajniach @sk
preferred label: Trgovina na drobno v specializiranih prodajalnah z drugo gospodinjsko opremo @sl
preferred label: Specialiserad butikshandel med heminredningsartiklar och husgeråd @sv
preferred label: Belirli bir mala tahsis edilmiş mağazalarda diğer ev eşyalarının perakende ticareti @tr
broader: Retail trade, except of motor vehicles and motorcycles
narrower: Retail sale of textiles in specialised stores
narrower: Retail sale of hardware, paints and glass in specialised stores
narrower: Retail sale of carpets, rugs, wall and floor coverings in specialised stores
narrower: Retail sale of electrical household appliances in specialised stores
narrower: Retail sale of furniture, lighting equipment and other household articles in specialised stores

Retail sale of textiles in specialised stores
type: Concept
notation: 47.51
status: valid
status modified: 2013-10-18
accepted date: 2013-10-18
in scheme: Statistical Classification of Economic Activities in the European Community, Rev. 2 (2008)
scope note: - търговия на дребно с тъкани и плетени платове - търговия на дребно с прежди - търговия на дребно с материали за килими, гоблени или бродерии - търговия на дребно с текстилни изделия за домакинството - одеяла, юргани, спално бельо, покривки за маса и други - търговия на дребно с галантерийни и пасмантерийни изделия - шевни игли, игли за плетене, конци, копчета и други - търговия на дребно с облекло - 47.71 @bg
scope note: Z: - maloobchod s látkami - maloobchod s pletacími přízemi - maloobchod se základními potřebami pro zhotovování koberců, tapiserií a výšivek - maloobchod s textiliemi - maloobchod s textilní galanterií: jehlami, šicími nitěmi atd. N: - maloobchod s oděvy (47.71) @cs
scope note: Diese Klasse umfasst: - Einzelhandel mit Stoffen - Einzelhandel mit Strickgarn - Einzelhandel mit Ausgangsmaterial für Handarbeiten zur Herstellung von Teppichen und Stickereien - Einzelhandel mit Textilien - Einzelhandel mit Kurzwaren: Nadeln, Nähgarn usw. Diese Klasse umfasst nicht: - Einzelhandel mit Bekleidung (s. 47.71) @de
scope note: This class includes: - retail sale of fabrics - retail sale of knitting yarn - retail sale of basic materials for rug, tapestry or embroidery making - retail sale of textiles - retail sale of haberdashery: needles, sewing thread etc. This class excludes: - retail sale of clothing, see 47.71 @en
scope note: Esta clase comprende: - el comercio al por menor de telas - el comercio al por menor de hilos de punto - el comercio al por menor del material básico de fabricación de alfombras, tapices o bordados - el comercio al por menor de textiles - el comercio al por menor de artículos de mercería: agujas, hilo de coser, etc. Esta clase no comprende: - el comercio al por menor de prendas de vestir (véase 47.71) @es
scope note: Cette classe comprend: - le commerce de détail de tissus - le commerce de détail de fils à tricoter - le commerce de détail de matériaux de base pour la fabrication de tapis, de tapisseries ou de broderies - le commerce de détail de textiles - le commerce de détail d’articles de mercerie: aiguilles, fils, etc. Cette classe ne comprend pas: - le commerce de détail d’articles d’habillement, voir 47.71 @fr
scope note: Ovaj razred uključuje: - trgovinu na malo tkaninama - trgovinu na malo koncem za pletenje - trgovinu na malo osnovnim materijalom (podlogom) za izradu sagova, goblena ili za vezenje - trgovinu na malo tekstilom - trgovinu na malo pozamanterijom i priborom: iglama, koncima za šivanje itd. Ovaj razred isključuje: - trgovinu na malo odjećom, vidi 47.71
scope note: Į šią klasę įeina: - audinių mažmeninė prekyba - mezgininių verpalų mažmeninė prekyba - pagrindinių medžiagų kilimėlių, gobelenų ar siuvinių gamybai mažmeninė prekyba - tekstilės gaminių ar dirbinių mažmeninė prekyba - galanterijos reikmenų: adatų, siuvimo siūlų ir kt. mažmeninė prekyba Į šią klasę neįeina: - drabužių mažmeninė prekyba, žr. 47.71 @lt
scope note: Этот класс также включает: - розничную торговлю офисными принадлежностями, такими как ручки, карандаши, бумага и т.д. @ru
scope note: Bu sınıf aşağıdakileri kapsamaktadır; - kumaş perakende ticareti, - örgü ipliği perakende ticareti, - halı, goblen veya nakış yapımı için temel materyallerin perakende ticareti, - tekstil perakende ticareti, - tuhafiye ürünlerinin perakende ticareti: iğneler, dikiş ipliği vb. Kapsam dışı olanlar; - giysilerin perakende ticareti, bkz. 47.71. @tr
preferred label: Търговия на дребно с текстил и галантерийни стоки @bg
preferred label: Maloobchod s textilem ve specializovaných prodejnách @cs
preferred label: Detailhandel med kjolestoffer, garn, broderier mv. @da
preferred label: Einzelhandel mit Textilien @de
preferred label: Λιανικό εμπόριο κλωστοϋφαντουργικών προϊόντων σε ειδικευμένα καταστήματα @el
preferred label: Comercio al por menor de textiles en establecimientos especializados @es
preferred label: Tekstiiltoodete jaemüük spetsialiseeritud kauplustes @et
preferred label: Tekstiilien vähittäiskauppa @fi
preferred label: Commerce de détail de textiles en magasin spécialisé @fr
preferred label: Textil-kiskereskedelem
preferred label: Commercio al dettaglio di prodotti tessili in esercizi specializzati @it
preferred label: Tekstilės gaminių mažmeninė prekyba specializuotose parduotuvėse @lt
preferred label: Tekstilizstrādājumu mazumtirdzniecība specializētajos veikalos @lv
preferred label: Bejgħ bl-imnut ta' tessuti minn ħwienet speċjalizzati @mt
preferred label: Detailhandel in textiel in gespecialiseerde winkels @nl
preferred label: Butikkhandel med tekstiler og utstyrsvarer @no
preferred label: Sprzedaż detaliczna wyrobów tekstylnych prowadzona w wyspecjalizowanych sklepach @pl
preferred label: Comércio a retalho de têxteis em estabelecimentos especializados @pt
preferred label: Comerţ cu amănuntul al textilelor, în magazine specializate @ro
preferred label: Розничная торговля текстильными изделиями в специализированных магазинах @ru
preferred label: Maloobchod s textilom v špecializovaných predajniach @sk
preferred label: Trgovina na drobno v specializiranih prodajalnah s tekstilom @sl
preferred label: Specialiserad butikshandel med textilier @sv
preferred label: Belirli bir mala tahsis edilmiş mağazalarda tekstil ürünleri perakende ticareti @tr
broader: Retail sale of other household equipment in specialised stores

Retail sale of hardware, paints and glass in specialised stores
type: Concept
notation: 47.52
status: valid
status modified: 2013-10-18
accepted date: 2013-10-18
in scheme: Statistical Classification of Economic Activities in the European Community, Rev. 2 (2008)
scope note: - търговия на дребно с железария и железарски стоки - търговия на дребно с бои и лакове - търговия на дребно с плоско стъкло - търговия на дребно с други материали за строителството - тухли, дървен материал, санитарно оборудване - търговия на дребно с материали и оборудване за поправки и ремонти “Направи си сам” - търговия на дребно с косачки за трева - търговия на дребно със сауни - търговия на дребно с коркови подови плочки @bg
scope note: Z: - maloobchod s železářským zbožím - maloobchod s nátěrovými hmotami - maloobchod s plochým sklem - maloobchod s ostatním stavebním materiálem, např. cihly, dřevem, sanitárním zařízením - maloobchod s potřebami (materiálem i zařízením) pro kutily ZT: - maloobchod se sekačkami na trávu jakýmkoli způsobem ovládanými - maloobchod se saunami @cs
scope note: Diese Klasse umfasst: - Einzelhandel mit Metallwaren - Einzelhandel mit Anstrichmitteln - Einzelhandel mit Flachglas - Einzelhandel mit sonstigem Baumaterial wie Mauersteinen, Holz und Sanitärbedarf - Einzelhandel mit Heimwerkerbedarf Diese Klasse umfasst ferner: - Einzelhandel mit Rasenmähern - Einzelhandel mit Saunas @de
scope note: This class includes: - retail sale of hardware - retail sale of paints, varnishes and lacquers - retail sale of flat glass - retail sale of other building material such as bricks, wood, sanitary equipment - retail sale of do-it-yourself material and equipment This class also includes: - retail sale of lawnmowers, however operated - retail sale of saunas @en
scope note: Esta clase comprende: - el comercio al por menor de ferretería - el comercio al por menor de pinturas, barnices y esmaltes - el comercio al por menor de vidrio plano - el comercio al por menor de otros materiales de construcción como ladrillos, madera y sanitarios - el comercio al por menor de material y equipo de bricolaje Esta clase comprende también: - el comercio al por menor de máquinas cortacésped de cualquier tipo - el comercio al por menor de saunas @es
scope note: Cette classe comprend: - le commerce de détail d’articles de quincaillerie - le commerce de détail de peintures, de vernis et d’émaux - le commerce de détail de verre plat - le commerce de détail d’autres matériaux de construction tels que briques, bois, appareils sanitaires - le commerce de détail de matériaux et de matériels de bricolage Cette classe comprend également: - le commerce de détail de tondeuses à gazon, quel que soit le mode de propulsion - le commerce de détail de saunas @fr
scope note: Ovaj razred uključuje: - trgovinu na malo željeznom robom - trgovinu na malo bojama, premazima i lakovima - trgovinu na malo ravnim staklom - trgovinu na malo ostalim građevinskim materijalom kao što su cigle, drvo, sanitarna oprema - trgovinu na malo materijalom i opremom „uradi sam" Ovaj razred također uključuje: - trgovinu na malo kosilicama za travu - trgovinu na malo saunama
scope note: Į šią klasę įeina: - metalo gaminių mažmeninė prekyba - dažų, lakų ir politūrų mažmeninė prekyba - plokščiojo stiklo mažmeninė prekyba - kitų statybinių medžiagų, tokių kaip plytos, mediena, sanitarinė įranga, mažmeninė prekyba - „pasidaryk pats“ reikalingų medžiagų ir įrangos mažmeninė prekyba Į šią klasę taip pat įeina: - vejapjovių su įvairiais varytuvais mažmeninė prekyba - saunų mažmeninė prekyba @lt
scope note: Этот класс включает: - розничную торговлю музыкальной продукцией, аудиокассетами, компакт-дисками и кассетами - розничную торговлю видеопленками и дисками DVD Этот класс также включает: - розничную торговлю чистой пленкой и дисками @ru
scope note: Bu sınıf aşağıdakileri kapsamaktadır; - hırdavat perakende ticareti, - boyaların, cilaların ve verniklerin perakende ticareti, - düz cam perakende ticareti, - tuğla, tahta, sıhhi ürünler (küvet, lavabo, vs) gibi diğer yapı materyallerinin perakende ticareti, - kendin yap türünden malzeme ve teçhizatın perakende ticareti. Ayrıca bu sınıf aşağıdakileri de kapsamaktadır; - nasıl çalıştırılırsa çalıştırılsın çim biçme makinelerinin perakende ticareti, - sauna perakende ticareti. @tr
preferred label: Търговия на дребно с железария, бои и плоско стъкло @bg
preferred label: Maloobchod se železářským zbožím, barvami, sklem a potřebami pro kutily ve specializovaných prodejnách @cs
preferred label: Detailhandel med isenkram, maling og glas @da
preferred label: Einzelhandel mit Metallwaren, Anstrichmitteln, Bau- und Heimwerkerbedarf @de
preferred label: Λιανικό εμπόριο σιδηρικών, χρωμάτων και τζαμιών σε ειδικευμένα καταστήματα @el
preferred label: Comercio al por menor de ferretería, pintura y vidrio en establecimientos especializados @es
preferred label: Rauakaupade, värvide ja klaasi jaemüük spetsialiseeritud kauplustes @et
preferred label: Rautakauppatavaran, maalien ja lasin vähittäiskauppa @fi
preferred label: Commerce de détail de quincaillerie, peintures et verres en magasin spécialisé @fr
preferred label: Vasáru-, festék-, üveg-kiskereskedelme
preferred label: Commercio al dettaglio di ferramenta, vernici e vetro in esercizi specializzati @it
preferred label: Metalo dirbinių, dažų ir stiklo mažmeninė prekyba specializuotose parduotuvėse @lt
preferred label: Metālizstrādājumu, krāsu un stikla mazumtirdzniecība specializētajos veikalos @lv
preferred label: Bejgħ bl-imnut ta' ferramenta, żebgħa u ħġieġ minn ħwienet speċjalizzati @mt
preferred label: Detailhandel in ijzerwaren, verf en glas in gespecialiseerde winkels @nl
preferred label: Butikkhandel med jernvarer, fargevarer og glass @no
preferred label: Sprzedaż detaliczna drobnych wyrobów metalowych, farb i szkła prowadzona w wyspecjalizowanych sklepach @pl
preferred label: Comércio a retalho de ferragens, tintas e vidros, em estabelecimentos especializados @pt
preferred label: Comerţ cu amănuntul al articolelor de fierărie, al articolelor din sticlă şi a celor pentru vopsit, în magazine specializate @ro
preferred label: Розничная торговля скобяными изделиями, лакокрасочными материалами и стеклом в специализированных магазинах @ru
preferred label: Maloobchod so železiarskym tovarom, farbami a sklom v špecializovaných predajniach @sk
preferred label: Trgovina na drobno v specializiranih prodajalnah z gradbenim materialom, kovinskimi izdelki, barvami in steklom @sl
preferred label: Specialiserad butikshandel med bygg-, järn- och VVS-varor samt färger och glas @sv
preferred label: Belirli bir mala tahsis edilmiş mağazalarda hırdavat, boya ve cam perakende ticareti @tr
broader: Retail sale of other household equipment in specialised stores

Retail sale of carpets, rugs, wall and floor coverings in specialised stores
type: Concept
notation: 47.53
status: valid
status modified: 2013-10-18
accepted date: 2013-10-18
in scheme: Statistical Classification of Economic Activities in the European Community, Rev. 2 (2008)
scope note: - търговия на дребно с килими - търговия на дребно с пердета, завеси, щори и драперии - търговия на дребно с тапети и подови покрития - търговия на дребно с коркови подови плочки - 47.52 @bg
scope note: Z: - maloobchod s koberci a předložkami - maloobchod se závěsy a záclonami - maloobchod s tapetami a podlahovými krytinami N: - maloobchod s podlahovými korkovými deskami (47.52) @cs
scope note: Diese Klasse umfasst: - Einzelhandel mit Teppichen, Brücken und Läufern - Einzelhandel mit Vorhängen und Gardinen - Einzelhandel mit Tapeten und Fußbodenbelägen Diese Klasse umfasst nicht: - Einzelhandel mit Bodenplatten aus Kork (s. 47.52) @de
scope note: This class includes: - retail sale of carpets and rugs - retail sale of curtains and net curtains - retail sale of wallpaper and floor coverings This class excludes: - retail sale of cork floor tiles, see 47.52 @en
scope note: Esta clase comprende: - el comercio al por menor de alfombras y moquetas - el comercio al por menor de cortinas y visillos - el comercio al por menor de papeles pintados y revestimientos de suelos Esta clase no comprende: - el comercio al por menor de suelos de corcho (véase 47.52) @es
scope note: Cette classe comprend: - le commerce de détail de tapis et moquettes - le commerce de détail de rideaux et de voilages - le commerce de détail de papiers peints et de revêtements de sols Cette classe ne comprend pas: - le commerce de détail de carreaux de sol en liège, voir 47.52 @fr
scope note: Ovaj razred uključuje: - trgovinu na malo sagovima i prostiračima - trgovinu na malo zastorima i zavjesama - trgovinu na malo zidnim tapetama i podnim oblogama Ovaj razred isključuje: - trgovinu na malo plutenim pločama za oblaganje podova, vidi 47.52
scope note: Į šią klasę įeina: - kilimų ir kilimėlių mažmeninė prekyba - užuolaidų ir tiulinių užuolaidų mažmeninė prekyba - tapetų ir grindų dangų mažmeninė prekyba Į šią klasę neįeina: - kamštienos grindų plytelių mažmeninė prekyba, žr. 47.52 @lt
scope note: Этот класс включает: - розничную торговлю спортивными товарами, оснащением для рыбалки, туристским снаряжением, лодками и велосипедами @ru
scope note: Bu sınıf aşağıdakileri kapsamaktadır; - halı ve kilimlerin perakende ticareti, - perdeler ve tül perdelerin perakende ticareti, - duvar kağıdı ve yer döşemelerinin perakende ticareti. Kapsam dışı olanlar; - mantar yer karolarının perakende ticareti, bkz. 47.52. @tr
preferred label: Търговия на дребно с тапети, килими и други стенни и подови покрития @bg
preferred label: Maloobchod s koberci, podlahovými krytinami a nástěnnými obklady ve specializovaných prodejnách @cs
preferred label: Detailhandel med tæpper, vægbeklædning og gulvbelægning @da
preferred label: Einzelhandel mit Vorhängen, Teppichen, Fußbodenbelägen und Tapeten @de
preferred label: Λιανικό εμπόριο χαλιών, κιλιμιών και επενδύσεων δαπέδου και τοίχου σε ειδικευμένα καταστήματα @el
preferred label: Comercio al por menor de alfombras, moquetas y revestimientos de paredes y suelos en establecimientos especializados @es
preferred label: Vaipade, mattide, seina- ja põrandakatete jaemüük spetsialiseeritud kauplustes @et
preferred label: Mattojen, tapettien ja lattianpäällysteiden vähittäiskauppa @fi
preferred label: Commerce de détail de tapis, moquettes et revêtements de murs et de sols en magasin spécialisé @fr
preferred label: Takaró, szőnyeg, fal-, padlóburkoló kiskereskedelme
preferred label: Commercio al dettaglio di tappeti, scendiletto e rivestimenti per pavimenti e pareti in esercizi specializzati @it
preferred label: Kilimų, kilimėlių, sienų ir grindų dangų mažmeninė prekyba specializuotose parduotuvėse @lt
preferred label: Paklāju, grīdsegu, tapešu un grīdas segumu mazumtirdzniecība specializētajos veikalos @lv
preferred label: Bejgħ bl-imnut ta' twapet, twapet żgħar, kisi tal-ħajt u ta' l-art minn ħwienet speċjalizzati @mt
preferred label: Detailhandel in tapijten en andere vloerbedekking en wandbekleding in gespecialiseerde winkels @nl
preferred label: Butikkhandel med tapeter, gulvtepper og gardiner @no
preferred label: Sprzedaż detaliczna dywanów, chodników, pokryć ściennych i podłogowych prowadzona w wyspecjalizowanych sklepach @pl
preferred label: Comércio a retalho de tapetes, carpetes, cortinados e outros revestimentos para paredes e pavimentos, em estabelecimentos especializados @pt
preferred label: Comerţ cu amănuntul al covoarelor, carpetelor, tapetelor şi a altor acoperitoare de podea, în magazine specializate @ro
preferred label: Розничная торговля коврами, ковровыми изделиями, а также настенными и напольными покрытиями в специализированных магазинах @ru
preferred label: Maloobchod s kobercami, rohožami, podlahovými alebo nástennými krytinami v špecializovaných predajniach @sk
preferred label: Trgovina na drobno v specializiranih prodajalnah s preprogami, talnimi in stenskimi oblogami @sl
preferred label: Specialiserad butikshandel med mattor och inredningstextilier @sv
preferred label: Belirli bir mala tahsis edilmiş mağazalarda halı, kilim, duvar ve yer kaplamalarının perakende ticareti @tr
broader: Retail sale of other household equipment in specialised stores

Retail sale of electrical household appliances in specialised stores
type: Concept
notation: 47.54
status: valid
status modified: 2013-10-18
accepted date: 2013-10-18
in scheme: Statistical Classification of Economic Activities in the European Community, Rev. 2 (2008)
scope note: - търговия на дребно с аудио- и видеотехника - 47.43 @bg
scope note: N: - maloobchod se zařízením spotřební elektroniky (47.43) @cs
scope note: Diese Klasse umfasst nicht: - Einzelhandel mit Geräten der Unterhaltungselektronik (s. 47.43) @de
scope note: This class excludes: - retail sale of audio and video equipment, see 47.43 @en
scope note: Esta clase no comprende: - el comercio al por menor de equipos de audio y vídeo (véase 47.43) @es
scope note: Cette classe ne comprend pas: - le commerce de détail d’appareils audio et vidéo, voir 47.43 @fr
scope note: Ovaj razred isključuje: - trgovinu na malo audio i videoopremom, vidi 47.43
scope note: Į šią klasę neįeina: - garso ir vaizdo įrangos mažmeninė prekyba, žr. 47.43 @lt
scope note: Этот класс включает: - розничную торговлю играми и игрушками, изготовленными из различных материалов Этот класс исключает: - розничную торговлю пультами для видеоигр, см. 47.41 - розничную торговлю программным обеспечением, изготовленным не на заказ, включая видеоигры, см. 47.41 @ru
scope note: Kapsam dışı olanlar; - ses ve video ekipmanının perakende ticareti, bkz. 47.43. @tr
preferred label: Търговия на дребно с битови електроуреди @bg
preferred label: Maloobchod s elektrospotřebiči a elektronikou převážně pro domácnost ve specializovaných prodejnách @cs
preferred label: Detailhandel med elektriske husholdningsapparater @da
preferred label: Einzelhandel mit elektrischen Haushaltsgeräten @de
preferred label: Λιανικό εμπόριο ηλεκτρικών οικιακών συσκευών σε ειδικευμένα καταστήματα @el
preferred label: Comercio al por menor de aparatos electrodomésticos en establecimientos especializados @es
preferred label: Elektriliste kodumasinate jaemüük spetsialiseeritud kauplustes @et
preferred label: Sähköisten kodinkoneiden vähittäiskauppa @fi
preferred label: Commerce de détail d'appareils électroménagers en magasin spécialisé @fr
preferred label: Villamos háztartási készülék kiskereskedelme
preferred label: Commercio al dettaglio di elettrodomestici in esercizi specializzati @it
preferred label: Elektrinių buitinių aparatų ir prietaisų mažmeninė prekyba specializuotose parduotuvėse @lt
preferred label: Mājsaimniecības elektroierīču mazumtirdzniecība specializētajos veikalos @lv
preferred label: Bejgħ bl-imnut ta' apparat ta' l-elettriku għad-dar minn ħwienet speċjalizzati @mt
preferred label: Detailhandel in elektrische huishoudapparaten in gespecialiseerde winkels @nl
preferred label: Butikkhandel med elektriske husholdningsapparater @no
preferred label: Sprzedaż detaliczna elektrycznego sprzętu gospodarstwa domowego prowadzona w wyspecjalizowanych sklepach @pl
preferred label: Comércio a retalho de electrodomésticos em estabelecimentos especializados @pt
preferred label: Comerţ cu amănuntul al articolelor şi aparatelor electrocasnice, în magazine specializate @ro
preferred label: Розничная торговля электрическими бытовыми приборами в специализированных магазинах @ru
preferred label: Maloobchod s elektrickými zariadeniami pre domácnosť v špecializovaných predajniach @sk
preferred label: Trgovina na drobno v specializiranih prodajalnah z električnimi gospodinjskimi napravami @sl
preferred label: Specialiserad butikshandel med elektriska hushållsmaskiner och hushållsapparater @sv
preferred label: Belirli bir mala tahsis edilmiş mağazalarda elektrikli ev aletlerinin perakende ticareti @tr
broader: Retail sale of other household equipment in specialised stores

Retail sale of furniture, lighting equipment and other household articles in specialised stores
type: Concept
notation: 47.59
status: valid
status modified: 2013-10-18
accepted date: 2013-10-18
in scheme: Statistical Classification of Economic Activities in the European Community, Rev. 2 (2008)
scope note: - търговия на дребно с мебели, вкл. офис мебели - търговия на дребно с осветители - търговия на дребно с домакински съдове, прибори за хранене, стъклени, порцеланови и керамични изделия - търговия на дребно с кошничарски изделия и изделия от дърво и корк - търговия на дребно с неелектрически домакински уреди - търговия на дребно с музикални инструменти и партитури - търговия на дребно със системи за сигурност (заключващи устройства, сейфове/желязни каси и трезори), без тяхното инстралиране и ремонт - търговия на дребно със стоки за бита, некласифицирани другаде - търговия на дребно със старинни предмети (антиквариат) - 47.79 @bg
scope note: Z: - maloobchod s nábytkem pro domácnost - maloobchod s výrobky pro osvětlení - maloobchod s potřebami pro domácnost, noži, nádobím a výrobky ze skla, porcelánu a kameniny - maloobchod s výrobky ze dřeva, korku a proutí - maloobchod s neelektrickými přístroji pro domácnost - maloobchod s hudebními nástroji a notami - maloobchod se zabezpečovacími systémy, jako zamykatelnými zařízeními, sejfy a trezory, ale bez instalace a údržby - maloobchod s výrobky a zařízením pro domácnost j. n. N: - maloobchod se starožitnostmi (47.79) @cs
scope note: Diese Klasse umfasst: - Einzelhandel mit Wohnmöbeln - Einzelhandel mit Beleuchtungsartikeln - Einzelhandel mit Haushaltsartikeln, Schneidwaren, Geschirr, Glas-, Porzellan- und Tonwaren - Einzelhandel mit Holz-, Kork-, Korb- und Flechtwaren - Einzelhandel mit nichtelektrischen Haushaltsgeräten - Einzelhandel mit Musikinstrumenten und Noten - Einzelhandel mit Sicherheitssystemen wie Verriegelungseinrichtungen und Tresoren, ohne Installation oder Wartung - Einzelhandel mit Haushaltsartikeln und Einrichtungsgegenständen a. n. g. Diese Klasse umfasst nicht: - Einzelhandel mit Antiquitäten (s. 47.79) @de
scope note: This class includes: - retail sale of household furniture - retail sale of articles for lighting - retail sale of household utensils and cutlery, crockery, glassware, china and pottery - retail sale of wooden, cork and wickerwork goods - retail sale of non-electrical household appliances - retail sale of musical instruments and scores - retail sale of electrical security alarm systems, such as locking devices, safes, and vaults, without installation or maintenance services - retail sale of household articles and equipment n.e.c. This class excludes: - retail sale of antiques, see 47.79 @en
scope note: Esta clase comprende: - el comercio al por menor de muebles de uso doméstico - el comercio al por menor de artículos para la iluminación - el comercio al por menor de diversos utensilios domésticos y cubertería, vajilla, cristalería, porcelana y loza - el comercio al por menor de artículos de madera, corcho y cestería - el comercio al por menor de aparatos domésticos no eléctricos - el comercio al por menor de instrumentos de música y partituras musicales - el comercio al por menor de sistemas de alarma de seguridad eléctricos, como dispositivos de cierre, cajas fuertes, cámaras acorazadas, sin instalación ni mantenimiento - el comercio al por menor de artículos y equipos de uso doméstico n.c.o.p. Esta clase no comprende: - el comercio al por menor de antigüedades (véase 47.79) @es
scope note: Cette classe comprend: - le commerce de détail de mobilier domestique - le commerce de détail d’appareils d’éclairage - le commerce de détail d’ustensiles ménagers, de coutellerie, de vaisselle, de verrerie, de porcelaine et de poterie - le commerce de détail d’ouvrages en bois, liège et vannerie - le commerce de détail d’appareils ménagers non électriques - le commerce de détail d’instruments de musique et de partitions - le commerce de détail de systèmes de sécurité à alarmes électriques, de dispositifs de verrouillage et de coffres-forts, sans services d’installation ou de maintenance - le commerce de détail d’appareils et d’articles de ménage ou d’économie domestique n.c.a. Cette classe ne comprend pas: - le commerce de détail d’antiquités, voir 47.79 @fr
scope note: Ovaj razred uključuje: - trgovinu na malo namještajem za kućanstvo - trgovinu na malo proizvodima za rasvjetu - trgovinu na malo kuhinjskim posuđem, priborom za jelo, predmetima od gline, stakla, porculana i keramike - trgovinu na malo proizvodima od drva, pluta i pruća - trgovinu na malo neelektričnim aparatima za kućanstvo - trgovinu na malo glazbenim instrumentima i muzikalijama - trgovinu na malo sigurnosnim sustavima kao što su ključanice, sefovi i sigurnosni pretinci (trezori), bez usluga ugradnje ili održavanja - trgovinu na malo predmetima i opremom za kućanstvo, d. n. Ovaj razred isključuje: - trgovinu na malo antikvitetima, vidi 47.79
scope note: Į šią klasę įeina: - namų ūkio baldų mažmeninė prekyba - apšvietimo prietaisų mažmeninė prekyba - namų ūkio reikmenų ir stalo įrankių, indų, stiklo, porceliano ir keramikos mažmeninė prekyba - medinių, kamštienos ir pintinių dirbinių mažmeninė prekyba - neelektrinių namų ūkio prietaisų mažmeninė prekyba - muzikos instrumentų ir muzikos partitūrų mažmeninė prekyba - garsinių apsaugos sistemų, tokių kaip elektroniniai užraktai, seifai ir saugyklos, be įrengimo ir aptarnavimo paslaugų mažmeninė prekyba - niekur kitur nepriskirtų namų ūkio daiktų ir įrangos mažmeninė prekyba Į šią klasę neįeina: - antikvarinių daiktų mažmeninė prekyba, žr. 47.79 @lt
scope note: Данная группа включает торговлю в специализированных магазинах, торгующих определенной линией товаров, не включенных в другие разделы, такими товарами как одежда, обувь, кожаные изделия, фармацевтические и медицинские товары, часы, сувениры, чистящие материалы, оружие, цветы, домашние животные и прочее. Также сюда относится розничная торговля подержанными товарами в специализированных магазинах. @ru
scope note: Bu sınıf aşağıdakileri kapsamaktadır; - ev mobilyalarının perakende ticareti, - aydınlatma gereçlerinin perakende ticareti, - ev aletleri ve çatal-bıçak takımı, tabak-çanak, cam eşyalar, porselen ve çömlek ürünlerinin perakende ticareti, - ahşap, mantar ve hasır ürünlerinin perakende ticareti, - elektrikli olmayan ev aletlerinin perakende ticareti, - müzik enstrümanlarının ve eserlerinin perakende ticareti, - kilitleme cihazları, kasalar ve kasa daireleri gibi elektrikli güvenlik alarm sistemlerinin perakende ticareti (kurulum ve bakım hizmeti hariç), - ev aletleri ve teçhizatının perakende ticareti. Kapsam dışı olanlar; - antikaların perakende ticareti, bkz. 47.79. @tr
preferred label: Търговия на дребно с мебели, осветители и с други стоки за бита, некласифицирани другаде @bg
preferred label: Maloobchod s nábytkem, svítidly a ostatními výrobky převážně pro domácnost ve specializovaných prodejnách @cs
preferred label: Detailhandel med møbler og belysningsartikler samt andre husholdningsartikler @da
preferred label: Einzelhandel mit Möbeln, Einrichtungsgegenständen und sonstigem Hausrat @de
preferred label: Λιανικό εμπόριο επίπλων, φωτιστικών και άλλων ειδών οικιακής χρήσης σε ειδικευμένα καταστήματα @el
preferred label: Comercio al por menor de muebles, aparatos de iluminación y otros artículos de uso doméstico en establecimientos especializados @es
preferred label: Mööbli, valgustite ja muude kodutarvete jaemüük spetsialiseeritud kauplustes @et
preferred label: Huonekalujen, valaisimien ja muualla luokittelemattomien taloustarvikkeiden vähittäiskauppa erikoismyymälöissä @fi
preferred label: Commerce de détail de meubles, appareils d'éclairage et autres articles de ménage en magasin spécialisé @fr
preferred label: Bútor, világítási eszköz, egyéb háztartási cikk kiskereskedelem
preferred label: Commercio al dettaglio di mobili, di articoli per l'illuminazione e altri articoli per la casa in esercizi specializzati @it
preferred label: Baldų, apšvietimo įrangos ir kitų namų ūkio prekių mažmeninė prekyba specializuotose parduotuvėse @lt
preferred label: Mēbeļu, apgaismes ierīču un cita veida mājsaimniecības piederumu mazumtirdzniecība specializētajos veikalos @lv
preferred label: Bejgħ bl-imnut ta' għamara, tagħmir għad-dawl u oġġetti għad-dar oħra minn ħwienet speċjalizzati @mt
preferred label: Detailhandel in meubelen, verlichtingsbenodigdheden en andere huishoudelijke artikelen in gespecialiseerde winkels @nl
preferred label: Butikkhandel med møbler, belysningsutstyr og andre innredningsartikler @no
preferred label: Sprzedaż detaliczna mebli, sprzętu oświetleniowego i pozostałych artykułów użytku domowego prowadzona w wyspecjalizowanych sklepach @pl
preferred label: Comércio a retalho de móveis, de artigos de iluminação e de outros artigos para o lar em estabelecimentos especializados @pt
preferred label: Comerţ cu amănuntul al mobilei, al articolelor de iluminat şi al articole de uz casnic n.c.a., în magazine specializate @ro
preferred label: Розничная торговля мебелью, осветительным оборудованием и прочими бытовыми принадлежностями в специализированных магазинах @ru
preferred label: Maloobchod s nábytkom, svietidlami a inými domácimi potrebami v špecializovaných predajniach @sk
preferred label: Trgovina na drobno v specializiranih prodajalnah s pohištvom, svetili in drugje nerazvrščenimi predmeti za gospodinjstvo @sl
preferred label: Specialiserad butikshandel med möbler, belysnings- och heminredningsartiklar @sv
preferred label: Belirli bir mala tahsis edilmiş mağazalarda mobilya, aydınlatma teçhizatı ve diğer ev eşyalarının perakende ticareti @tr
broader: Retail sale of other household equipment in specialised stores

Retail sale of cultural and recreation goods in specialised stores
type: Concept
notation: 47.6
status: valid
status modified: 2013-10-18
accepted date: 2013-10-18
in scheme: Statistical Classification of Economic Activities in the European Community, Rev. 2 (2008)
scope note: Тази група включва търговия на дребно в специализирани магазини със стоки, предназначени за свободното време и развлечение, като книги, вестници, музикални и видеозаписи, спортни стоки, игри и играчки. @bg
scope note: Tato skupina zahrnuje specializovaný maloobchod s výrobky pro kulturní rozhled a rekreaci, např. knihami, novinami a časopisy, hudebními nahrávkami a videozáznamy, sportovním vybavením, hrami a hračkami @cs
scope note: Diese Gruppe umfasst den Einzelhandel mit Waren für kulturelle und Freizeitaktivitäten, wie Bücher, Zeitungen und Zeitschriften, Musik- und Videoaufnahmen, Sportausrüstung und Spielwaren. @de
scope note: This group includes the retail sale in specialised stores of cultural and recreation goods, such as books, newspapers, music and video recordings, sporting equipment, games and toys. @en
scope note: Este grupo comprende el comercio al por menor en establecimientos especializados de artículos culturales y recreativos como libros, periódicos, grabaciones musicales y de vídeo, material deportivo, juegos y juguetes. @es
scope note: Ce groupe comprend le commerce de détail de biens culturels et de loisirs en magasin spécialisé, tels que livres, journaux et périodiques, enregistrements musicaux et vidéo, articles de sport, jeux et jouets. @fr
scope note: Ova skupina uključuje trgovinu na malo proizvodima za kulturu i rekreaciju kao što su knjige, novine, glazbeni i videozapisi, sportska oprema, igre i igračke, u specijaliziranim prodavaonicama.
scope note: Į šią grupę įeina kultūros ir poilsio prekių, tokių kaip knygos, laikraščiai, muzikos ir vaizdo įrašai, sporto įranga, žaidimai ir žaislai, mažmeninė prekyba specializuotose parduotuvėse. @lt
scope note: Этот класс включает: - розничную торговлю предметами одежды - розничную торговлю меховыми изделиями - розничную торговлю различными аксессуарами, такими как перчатки, галстуки, подтяжки и т.д. Этот класс исключает: - розничную торговлю текстильными изделиями, см. 47.51 @ru
scope note: Bu grup, belirli mala tahsis edilmiş mağazalarda kitaplar, gazeteler, müzik ve video kayıtları, spor aletleri, oyunlar ve oyuncaklar gibi kültürel ve eğlence mallarının perakende ticaretini kapsamaktadır. @tr
preferred label: Търговия на дребно в специализирани магазини със стоки, предназначени за свободното време @bg
preferred label: Maloobchod s výrobky pro kulturní rozhled a rekreaci ve specializovaných prodejnách @cs
preferred label: Detailhandel med varer til kulturelle formål og til fritid i specialforretninger @da
preferred label: Einzelhandel mit Verlagsprodukten, Sportausrüstungen und Spielwaren (in Verkaufsräumen) @de
preferred label: Λιανικό εμπόριο επιμορφωτικών ειδών και ειδών ψυχαγωγίας σε ειδικευμένα καταστήματα @el
preferred label: Comercio al por menor de artículos culturales y recreativos en establecimientos especializados @es
preferred label: Kultuuri- ja vaba aja kaupade jaemüük spetsialiseeritud kauplustes @et
preferred label: Kulttuuri- ja vapaa-ajan tuotteiden vähittäiskauppa erikoismyymälöissä @fi
preferred label: Commerce de détail de biens culturels et de loisirs en magasin spécialisé @fr
preferred label: Kulturális, szabadidős cikk bolti kiskereskedelme
preferred label: Commercio al dettaglio di articoli culturali e ricreativi in esercizi specializzati @it
preferred label: Kultūros ir poilsio prekių mažmeninė prekyba specializuotose parduotuvėse @lt
preferred label: Kultūras preču un atpūtai paredzētu preču mazumtirdzniecība specializētajos veikalos @lv
preferred label: Bejgħ bl-imnut ta' oġġetti kulturali u ta' rikrekreazzjoni minn ħwienet speċjalizzati @mt
preferred label: Detailhandel in cultuur- en recreatieartikelen in gespecialiseerde winkels @nl
preferred label: Butikkhandel med bøker, musikkartikler og andre fritidsartikler i spesialforretninger @no
preferred label: Sprzedaż detaliczna wyrobów związanych z kulturą i rekreacją prowadzona w wyspecjalizowanych sklepach @pl
preferred label: Comércio a retalho de bens culturais e recreativos em estabelecimentos especializados @pt
preferred label: Comerţ cu amănuntul de bunuri culturale şi recreative, în magazine specializate @ro
preferred label: Розничная торговля товарами культурно-развлекательного характера в специализированных магазинах @ru
preferred label: Maloobchod s tovarom pre kultúru a rekreáciu v špecializovaných predajniach @sk
preferred label: Trgovina na drobno v specializiranih prodajalnah z izdelki za kulturo, šport in zabavo @sl
preferred label: Specialiserad butikshandel med kultur- och fritidsartiklar @sv
preferred label: Belirli bir mala tahsis edilmiş mağazalarda kültür ve eğlence mallarının perakende ticareti @tr
broader: Retail trade, except of motor vehicles and motorcycles
narrower: Retail sale of books in specialised stores
narrower: Retail sale of newspapers and stationery in specialised stores
narrower: Retail sale of music and video recordings in specialised stores
narrower: Retail sale of sporting equipment in specialised stores
narrower: Retail sale of games and toys in specialised stores

Retail sale of books in specialised stores
type: Concept
notation: 47.61
status: valid
status modified: 2013-10-18
accepted date: 2013-10-18
in scheme: Statistical Classification of Economic Activities in the European Community, Rev. 2 (2008)
scope note: - търговия на дребно с нови книги - търговия на дребно с книги втора употреба - 47.79 @bg
scope note: Z: - maloobchod s knihami všeho druhu N: - maloobchod s použitými i antikvárními knihami (47.79) @cs
scope note: Diese Klasse umfasst: - Einzelhandel mit Büchern aller Art Diese Klasse umfasst nicht: - Einzelhandel mit gebrauchten oder antiquarischen Büchern (s. 47.79) @de
scope note: This class includes: - retail sale of books of all kinds This class excludes: - retail sale of second-hand or antique books, see 47.79 @en
scope note: Esta clase comprende: - el comercio al por menor de libros de todo tipo Esta clase no comprende: - el comercio al por menor de libros antiguos o de segunda mano (véase 47.79) @es
scope note: Cette classe comprend: - le commerce de détail de livres de toute nature Cette classe ne comprend pas: - le commerce de détail de livres d’occasion ou de livres anciens, voir 47.79 @fr
scope note: Ovaj razred uključuje: - trgovinu na malo knjigama svih vrsta Ovaj razred isključuje: - trgovinu na malo rabljenim i antiknim knjigama, vidi 47.79
scope note: Į šią klasę įeina: - įvairių knygų mažmeninė prekyba Į šią klasę neįeina: - naudotų ir antikvarinių knygų mažmeninė prekyba, žr. 47.79 @lt
scope note: Этот класс включает: - розничную торговлю обувью - розничную торговлю кожаными изделиями - розничную торговлю туристическими аксессуарами из кожи и кожзаменителей Этот класс исключает: - розничную торговлю специализированным спортивным оборудованием и инвентарем, а также обувью, например, лыжными ботинками, см. 47.64 @ru
scope note: Bu sınıf aşağıdakileri kapsamaktadır; - her çeşit kitabın perakende ticareti. Kapsam dışı olanlar; - ikinci el veya antika kitapların perakende ticareti, bkz. 47.79. @tr
preferred label: Търговия на дребно с книги @bg
preferred label: Maloobchod s knihami ve specializovaných prodejnách @cs
preferred label: Detailhandel med bøger @da
preferred label: Einzelhandel mit Büchern @de
preferred label: Λιανικό εμπόριο βιβλίων σε ειδικευμένα καταστήματα @el
preferred label: Comercio al por menor de libros en establecimientos especializados @es
preferred label: Raamatute jaemüük spetsialiseeritud kauplustes @et
preferred label: Kirjojen vähittäiskauppa @fi
preferred label: Commerce de détail de livres en magasin spécialisé @fr
preferred label: Könyv-kiskereskedelem
preferred label: Commercio al dettaglio di libri in esercizi specializzati @it
preferred label: Knygų mažmeninė prekyba specializuotose parduotuvėse @lt
preferred label: Grāmatu mazumtirdzniecība specializētajos veikalos @lv
preferred label: Bejgħ bl-imnut ta' kotba minn ħwienet speċjalizzati @mt
preferred label: Detailhandel in boeken in gespecialiseerde winkels @nl
preferred label: Butikkhandel med bøker @no
preferred label: Sprzedaż detaliczna książek prowadzona w wyspecjalizowanych sklepach @pl
preferred label: Comércio a retalho de livros em estabelecimentos especializados @pt
preferred label: Comerţ cu amănuntul al cărţilor, în magazine specializate @ro
preferred label: Розничная торговля книгами в специализированных магазинах @ru
preferred label: Maloobchod s knihami v špecializovaných predajniach @sk
preferred label: Trgovina na drobno v specializiranih prodajalnah s knjigami @sl
preferred label: Specialiserad butikshandel med böcker @sv
preferred label: Belirli bir mala tahsis edilmiş mağazalarda kitapların perakende ticareti @tr
broader: Retail sale of cultural and recreation goods in specialised stores

Retail sale of newspapers and stationery in specialised stores
type: Concept
notation: 47.62
status: valid
status modified: 2013-10-18
accepted date: 2013-10-18
in scheme: Statistical Classification of Economic Activities in the European Community, Rev. 2 (2008)
scope note: - търговия на дребно с канцеларски стоки - писалки, моливи, хартия и други @bg
scope note: ZT: - maloobchod s kancelářskými potřebami, pery, tužkami, papírem atd. @cs
scope note: Diese Klasse umfasst ferner: - Einzelhandel mit Kugelschreibern, Bleistiften, Papier und anderem Schreib- und Büromaterial @de
scope note: This class also includes: - retail sale of office supplies such as pens, pencils, paper etc. @en
scope note: Esta clase comprende también: - el comercio al por menor de material de oficina, como plumas, lápices, papel, etc. @es
scope note: Cette classe comprend également: - le commerce de détail de fournitures de bureau telles que stylos, crayons, papier, etc. @fr
scope note: Ovaj razred također uključuje: - trgovinu na malo uredskim priborom kao što su olovke, kemijske olovke, papir itd.
scope note: Į šią klasę taip pat įeina: - rašymo reikmenų, tokių kaip plunksnakočiai, pieštukai, popierius ir kt., mažmeninė prekyba @lt
scope note: Этот класс включает: - розничную торговлю фармацевтическими товарами @ru
scope note: Ayrıca bu sınıf aşağıdakileri de kapsamaktadır; - kalem, kurşun kalem, kağıt vb. büro malzemelerinin perakende ticareti. @tr
preferred label: Търговия на дребно с вестници и канцеларски стоки @bg
preferred label: Maloobchod s novinami, časopisy a papírnickým zbožím ve specializovaných prodejnách @cs
preferred label: Detailhandel med aviser og papirvarer @da
preferred label: Einzelhandel mit Zeitschriften, Zeitungen, Schreibwaren und Bürobedarf @de
preferred label: Λιανικό εμπόριο εφημερίδων και γραφικής ύλης σε ειδικευμένα καταστήματα @el
preferred label: Comercio al por menor de periódicos y artículos de papelería en establecimientos especializados @es
preferred label: Ajalehtede ja kirjatarvete jaemüük spetsialiseeritud kauplustes @et
preferred label: Sanomalehtien ja paperitavaran vähittäiskauppa @fi
preferred label: Commerce de détail de journaux et papeterie en magasin spécialisé @fr
preferred label: Újság-, papíráru-kiskereskedelem
preferred label: Commercio al dettaglio di giornali e articoli di cartoleria in esercizi specializzati @it
preferred label: Laikraščių ir raštinės reikmenų mažmeninė prekyba specializuotose parduotuvėse @lt
preferred label: Avīžu un kancelejas piederumu mazumtirdzniecība specializētajos veikalos @lv
preferred label: Bejgħ bl-imnut ta' gazzetti u kartolerija minn ħwienet speċjalizzati @mt
preferred label: Detailhandel in kranten en kantoorbehoeften in gespecialiseerde winkels @nl
preferred label: Butikkhandel med aviser og papirvarer @no
preferred label: Sprzedaż detaliczna gazet i artykułów piśmiennych prowadzona w wyspecjalizowanych sklepach @pl
preferred label: Comércio a retalho de jornais, revistas e artigos de papelaria em estabelecimentos especializados @pt
preferred label: Comerţ cu amănuntul al ziarelor şi articolelor de papetărie, în magazine specializate @ro
preferred label: Розничная торговля газетами и канцелярскими товарами в специализированных магазинах @ru
preferred label: Maloobchod s novinami a kancelárskymi potrebami v špecializovaných predajniach @sk
preferred label: Trgovina na drobno v specializiranih prodajalnah s časopisi, revijami, papirjem, pisalnimi potrebščinami @sl
preferred label: Specialiserad butikshandel med tidningar och kontorsförbrukningsvaror @sv
preferred label: Belirli bir mala tahsis edilmiş mağazalarda gazeteler ve kırtasiye ürünlerinin perakende ticareti @tr
broader: Retail sale of cultural and recreation goods in specialised stores

Retail sale of music and video recordings in specialised stores
type: Concept
notation: 47.63
status: valid
status modified: 2013-10-18
accepted date: 2013-10-18
in scheme: Statistical Classification of Economic Activities in the European Community, Rev. 2 (2008)
scope note: - търговия на дребно с грамофонни плочи, аудио касети и компактдискове - търговия на дребно с видеокасети и цифрови дискове - търговия на дребно с незаписани аудио- и видеокасети, дискети, компактдискове и цифрови дискове @bg
scope note: Z: - maloobchod s hudebními nahrávkami, audiopásky, kompaktními disky a kazetami - maloobchod s videokazetami a DVD ZT: - maloobchod s nenahranými nosiči zvuku a obrazu @cs
scope note: Diese Klasse umfasst: - Einzelhandel mit Musikaufnahmen, Tonbändern, Compact Discs und Kassetten - Einzelhandel mit Videobändern und DVD Diese Klasse umfasst ferner: - Einzelhandel mit unbespielten Ton- und Bildträgern @de
scope note: This class includes: - retail sale of musical records, audio tapes, compact discs and cassettes - retail sale of video tapes and DVDs This class also includes: - retail sale of blank tapes and discs @en
scope note: Esta clase comprende: - el comercio al por menor de discos, cintas, discos compactos y casetes de música - el comercio al por menor de cintas de vídeo y DVD Esta clase comprende también: - el comercio al por menor de cintas y discos vírgenes @es
scope note: Cette classe comprend: - le commerce de détail d’enregistrements musicaux, de cassettes audio, de CD et de cassettes - le commerce de détail de vidéocassettes et de DVD Cette classe comprend également: - le commerce de détail de bandes et disques vierges @fr
scope note: Ovaj razred uključuje: - trgovinu na malo glazbenim zapisima, audiovrpcama, CD-ima i kasetama - trgovinu na malo videovrpcama i DVD-ima Ovaj razred također uključuje: - trgovinu na malo praznim vrpcama i diskovima
scope note: Į šią klasę įeina: - muzikos įrašų, garsajuosčių, kompaktinių diskų ir kasečių mažmeninė prekyba - vaizdajuosčių ir skaitmeninių vaizdo diskų (DVD) mažmeninė prekyba Į šią klasę taip pat įeina: - neįrašytų juostų ir diskų mažmeninė prekyba @lt
scope note: Bu sınıf aşağıdakileri kapsamaktadır; - müzik kayıtlarının, ses bantlarının, kompakt disklerin ve kasetlerin perakende ticareti, - video kasetlerin ve DVD`lerin perakende ticareti. Ayrıca bu sınıf aşağıdakileri de kapsamaktadır; - boş bant ve disklerin perakende ticareti. @tr
preferred label: Търговия на дребно с аудио и видео записи @bg
preferred label: Maloobchod s audio- a videozáznamy ve specializovaných prodejnách @cs
preferred label: Detailhandel med musik- og videooptagelser @da
preferred label: Einzelhandel mit bespielten Ton- und Bildträgern @de
preferred label: Λιανικό εμπόριο εγγραφών μουσικής και εικόνας σε ειδικευμένα καταστήματα @el
preferred label: Comercio al por menor de grabaciones de música y vídeo en establecimientos especializados @es
preferred label: Muusika- ja videosalvestiste jaemüük spetsialiseeritud kauplustes @et
preferred label: Musiikki- ja videotallenteiden vähittäiskauppa @fi
preferred label: Commerce de détail d'enregistrements musicaux et vidéo en magasin spécialisé @fr
preferred label: Zene-, videofelvétel kiskereskedelme
preferred label: Commercio al dettaglio di registrazioni musicali e video in esercizi specializzati @it
preferred label: Muzikos ir vaizdo įrašų mažmeninė prekyba specializuotose parduotuvėse @lt
preferred label: Audio un video ierakstu mazumtirdzniecība specializētajos veikalos @lv
preferred label: Bejgħ bl-imnut ta' reġistrazzjonijiet ta' mużika u vidjo minn ħwienet speċjalizzati @mt
preferred label: Detailhandel in audio- en video-opnamen in gespecialiseerde winkels @nl
preferred label: Butikkhandel med innspillinger av musikk og video @no
preferred label: Sprzedaż detaliczna nagrań dźwiękowych i audio-wizualnych prowadzona w wyspecjalizowanych sklepach @pl
preferred label: Comércio a retalho de discos, CD, DVD e cassetes e similares gravados, em estabelecimentos especializados @pt
preferred label: Comerţ cu amănuntul al discurilor şi benzilor magnetice cu sau fără înregistrări audio/video, în magazine specializate @ro
preferred label: Розничная торговля аудио и видеозаписями в специализированных магазинах @ru
preferred label: Maloobchod s audio a video nahrávkami v špecializovaných predajniach @sk
preferred label: Trgovina na drobno v specializiranih prodajalnah z glasbenimi in video zapisi @sl
preferred label: Specialiserad butikshandel med inspelade och oinspelade band och skivor för musik och bild @sv
preferred label: Belirli bir mala tahsis edilmiş mağazalarda müzik ve video kayıtlarının perakende ticareti @tr
broader: Retail sale of cultural and recreation goods in specialised stores

Retail sale of sporting equipment in specialised stores
type: Concept
notation: 47.64
status: valid
status modified: 2013-10-18
accepted date: 2013-10-18
in scheme: Statistical Classification of Economic Activities in the European Community, Rev. 2 (2008)
scope note: - търговия на дребно със спортни стоки, риболовни принадлежности, къмпинг принадлежности, лодки, велосипеди • търговия на дребно със спортно облекло • търговия на дребно с обувки за ски и ски бягане @bg
scope note: Z: - specializovaný maloobchod se sportovními, kempinkovými a rybářskými potřebami, čluny a jízdními koly @cs
scope note: Diese Klasse umfasst: - Facheinzelhandel mit Sport- und Campingartikeln, Anglerbedarf, Booten und Fahrrädern @de
scope note: This class includes: - retail sale of sports goods, fishing gear, camping goods, boats and bicycles @en
scope note: Esta clase comprende: - el comercio al por menor de artículos de deporte, artículos de pesca, de acampada, embarcaciones y bicicletas @es
scope note: Cette classe comprend: - le commerce de détail d’articles de sport, d’articles pour la pêche, de matériel de camping, de bateaux et de bicyclettes @fr
scope note: Ovaj razred uključuje: - trgovinu na malo sportskom opremom, priborom za ribolov, opremom za kampiranje, čamcima i biciklima
scope note: Į šią klasę įeina: - sporto prekių, žvejybos reikmenų, stovyklavimo prekių, valčių ir dviračių mažmeninė prekyba @lt
scope note: Этот класс включает: - розничную торговлю парфюмерией, косметикой и предметами гигиены @ru
scope note: Bu sınıf aşağıdakileri kapsamaktadır; - spor eşyaları, balık avlama teçhizatı, kamp eşyaları, botlar ve bisikletlerin perakende ticareti. @tr
preferred label: Търговия на дребно със спортни стоки @bg
preferred label: Maloobchod se sportovním vybavením ve specializovaných prodejnách @cs
preferred label: Detailhandel med sportsudstyr @da
preferred label: Einzelhandel mit Fahrrädern, Sport- und Campingartikeln @de
preferred label: Λιανικό εμπόριο αθλητικού εξοπλισμού σε ειδικευμένα καταστήματα @el
preferred label: Comercio al por menor de artículos deportivos en establecimientos especializados @es
preferred label: Sporditarvete jaemüük spetsialiseeritud kauplustes @et
preferred label: Urheiluvälineiden vähittäiskauppa @fi
preferred label: Commerce de détail d'articles de sport en magasin spécialisé @fr
preferred label: Sportszer-kiskereskedelem
preferred label: Commercio al dettaglio di articoli sportivi in esercizi specializzati @it
preferred label: Sporto įrangos mažmeninė prekyba specializuotose parduotuvėse @lt
preferred label: Sporta preču mazumtirdzniecība specializētajos veikalos @lv
preferred label: Bejgħ bl-imnut ta' tagħmir għall-isport minn ħwienet speċjalizzati @mt
preferred label: Detailhandel in sportartikelen in gespecialiseerde winkels @nl
preferred label: Butikkhandel med sportsutstyr @no
preferred label: Sprzedaż detaliczna sprzętu sportowego prowadzona w wyspecjalizowanych sklepach @pl
preferred label: Comércio a retalho de artigos de desporto, em estabelecimentos especializados @pt
preferred label: Comerţ cu amănuntul al echipamentelor sportive, în magazine specializate @ro
preferred label: Розничная торговля спортивным оборудованием в специализированных магазинах @ru
preferred label: Maloobchod so športovými potrebami v špecializovaných predajniach @sk
preferred label: Trgovina na drobno v specializiranih prodajalnah s športno opremo @sl
preferred label: Specialiserad butikshandel med sport- och fritidsartiklar @sv
preferred label: Belirli bir mala tahsis edilmiş mağazalarda spor malzemelerinin perakende ticareti @tr
broader: Retail sale of cultural and recreation goods in specialised stores

Retail sale of games and toys in specialised stores
type: Concept
notation: 47.65
status: valid
status modified: 2013-10-18
accepted date: 2013-10-18
in scheme: Statistical Classification of Economic Activities in the European Community, Rev. 2 (2008)
scope note: - търговия на дребно с игри и играчки независимо от материала - търговия на дребно с видео конзолни игри - 47.41 - търговия на дребно със стандартен софтуер, вкл. видео игри - 47.41 @bg
scope note: Z: - maloobchod s hračkami z jakéhokoliv materiálu N: - maloobchod s konzolemi pro videohry (47.41) - maloobchod se standardním softwarem, včetně videoher (47.41) @cs
scope note: Diese Klasse umfasst: - Einzelhandel mit Spielwaren aus jeglichem Material Diese Klasse umfasst nicht: - Einzelhandel mit Videospielkonsolen (s. 47.41) - Einzelhandel mit Standardsoftware, einschließlich Videospielen (s. 47.41) @de
scope note: This class includes: - retail sale of games and toys, made of all materials This class excludes: - retail sale of video game consoles, see 47.41 - retail sale of non-customised software, including video games, see 47.41 @en
scope note: Esta clase comprende: - el comercio al por menor de juegos y juguetes, de cualquier material Esta clase no comprende: - el comercio al por menor de consolas de videojuegos (véase 47.41) - el comercio al por menor de programas informáticos no fabricados según especificaciones, incluidos los videojuegos (véase 47.41) @es
scope note: Cette classe comprend: - le commerce de détail de jeux et de jouets, en toutes matières Cette classe ne comprend pas: - le commerce de détail de consoles de jeux vidéo, voir 47.41 - le commerce de détail de logiciels non personnalisés, y compris les jeux vidéo, voir 47.41 @fr
scope note: Ovaj razred uključuje: - trgovinu na malo igrama i igračkama koje su izrađene od svih vrsta materijala Ovaj razred isključuje: - trgovinu na malo konzolama za videoigre, vidi 47.41 - trgovinu na malo standardnim softverom, uključujući videoigre, vidi 47.41
scope note: Į šią klasę įeina: - žaidimų ir žaislų, pagamintų iš įvairių medžiagų mažmeninė prekyba Į šią klasę neįeina: - vaizdo žaidimų pultų mažmeninė prekyba, žr. 47.41 - bendrosios paskirties programinės įrangos, įskaitant vaizdo žaidimus, mažmeninė prekyba, žr. 47.41 @lt
scope note: Bu sınıf aşağıdakileri kapsamaktadır; - her türlü materyalden yapılan, oyunlar ve oyuncakların perakende ticareti. Kapsam dışı olanlar; - video oyunları konsollarının perakende ticareti, bkz. 47.41, - kişiye özel olmayan yazılım programlarının (video oyunları dahil) perakende ticareti, bkz. 47.41. @tr
preferred label: Търговия на дребно с игри и играчки @bg
preferred label: Maloobchod s hrami a hračkami ve specializovaných prodejnách @cs
preferred label: Detailhandel med spil og legetøj @da
preferred label: Einzelhandel mit Spielwaren @de
preferred label: Λιανικό εμπόριο παιχνιδιών κάθε είδους σε ειδικευμένα καταστήματα @el
preferred label: Comercio al por menor de juegos y juguetes en establecimientos especializados @es
preferred label: Mängude ja mänguasjade jaemüük spetsialiseeritud kauplustes @et
preferred label: Pelien ja leikkikalujen vähittäiskauppa @fi
preferred label: Commerce de détail de jeux et jouets en magasin spécialisé @fr
preferred label: Játék-kiskereskedelem
preferred label: Commercio al dettaglio di giochi e giocattoli in esercizi specializzati @it
preferred label: Žaidimų ir žaislų mažmeninė prekyba specializuotose parduotuvėse @lt
preferred label: Spēļu un rotaļlietu mazumtirdzniecība specializētajos veikalos @lv
preferred label: Bejgħ bl-imnut ta' logħob u ġugarelli minn ħwienet speċjalizzati @mt
preferred label: Detailhandel in spellen en speelgoed in gespecialiseerde winkels @nl
preferred label: Butikkhandel med spill og leker @no
preferred label: Sprzedaż detaliczna gier i zabawek prowadzona w wyspecjalizowanych sklepach @pl
preferred label: Comércio a retalho de jogos e de brinquedos, em estabelecimentos especializados @pt
preferred label: Comerţ cu amănuntul al jocurilor şi jucăriilor, în magazine specializate @ro
preferred label: Розничная торговля играми и игрушками в специализированных магазинах @ru
preferred label: Maloobchod s hračkami a hrami v špecializovaných predajniach @sk
preferred label: Trgovina na drobno v specializiranih prodajalnah z igračami in rekviziti za igre in zabavo @sl
preferred label: Specialiserad butikshandel med spel och leksaker @sv
preferred label: Belirli bir mala tahsis edilmiş mağazalarda oyunlar ve oyuncakların perakende ticareti @tr
broader: Retail sale of cultural and recreation goods in specialised stores

Retail sale of other goods in specialised stores
type: Concept
notation: 47.7
status: valid
status modified: 2013-10-18
accepted date: 2013-10-18
in scheme: Statistical Classification of Economic Activities in the European Community, Rev. 2 (2008)
scope note: Тази група включва продажби на дребно в специализирани магазини на отделни групи продукти, некласифицирани в други групи, такива като облекло, обувки и кожени изделия, фармацевтични и медицински стоки, часовници, сувенири, почистващи препарати, оръжия, цветя, домашни любимци и други. - търговия на дребно в магазини с употребявани стоки @bg
scope note: Tato skupina zahrnuje specializovaný maloobchod představující zvláštní sortiment výrobků nezahrnutých v jiných částech klasifikace, např. oděvy, botami a koženou galanterií, farmaceutickými výrobky a lékařským zbožím, hodinkami, suvenýry, čisticími prostředky, zbraněmi, květinami, zvířaty pro zájmový chov aj. Rovněž je zde zahrnut maloobchod s použitým zbožím ve specializovaných prodejnách. @cs
scope note: Diese Gruppe umfasst den Einzelhandel mit bestimmten Produktsortimenten, die in anderen Teilen der Klassifikation nicht genannt sind, wie etwa Bekleidung, Schuhe und Lederwaren, pharmazeutische Erzeugnisse und medizinische Hilfsmittel, Uhren, Andenken, Reinigungsmittel, Waffen, Blumen, Haustiere und dergleichen. Ebenfalls eingeschlossen ist der Einzelhandel mit Gebrauchtwaren. @de
scope note: This group includes the sale in specialised stores carrying a particular line of products not included in other parts of the classification, such as clothing, footwear and leather articles, pharmaceutical and medical goods, watches, souvenirs, cleaning materials, weapons, flowers and pets and others. Also included is the retail sale of used goods in specialised stores. @en
scope note: Este grupo comprende el comercio al por menor en establecimientos especializados en un determinado grupo de productos no incluidos en otras partes de la clasificación, como prendas de vestir, calzado y artículos de cuero, productos farmacéuticos y artículos médicos, relojes, souvenirs, artículos de limpieza, armas, flores, animales de compañía y otros. Comprende también el comercio al por menor de bienes de segunda mano en establecimientos especializados @es
scope note: Ce groupe comprend les activités de commerce de détail en magasin spécialisé proposant à la vente une gamme particulière de produits non couverts ailleurs dans la nomenclature, tels que articles d’habillement, chaussures et maroquinerie, produits pharmaceutiques et médicaux, montres, souvenirs, produits d’entretien, armes, fleurs, animaux de compagnies et autres articles. La vente au détail de biens usagés en magasin spécialisé est également comprise dans ce groupe. @fr
scope note: Ova skupina uključuje djelatnosti specijaliziranih prodavaonica koje se bave prodajom određenih grupa proizvoda koje nisu uključene u drugim dijelovima klasifikacije kao što su odjeća, obuća i proizvodi od kože, farmaceutski proizvodi i medicinski pripravci, satovi, suveniri, sredstva za čišćenje, oružje, cvijeće i kućni ljubimci te ostalo. Također je uključena trgovina na malo rabljenom robom u specijaliziranim prodavaonicama.
scope note: Į šią grupę įeina prekyba specializuotose parduotuvėse tam tikromis, neįtrauktomis į kitas klasifikatoriaus grupes, prekėmis, tokiomis kaip drabužiai, avalynė ir odos gaminiai, medikamentai ir medicinos prekės, laikrodžiai, suvenyrai, valymo medžiagos, ginklai, gėlės ir naminiai gyvūnai, ir kt. Taip pat įeina naudotų prekių mažmeninė prekyba specializuotose parduotuvėse. @lt
scope note: Bu grup, giyim eşyası, ayakkabı ve deri eşyalar ile eczacılık ürünleri ve tıbbi ürünler, saatler, hatıra eşyalar, temizleme maddeleri, silahlar, çiçekler ve ev hayvanları ve diğer ürünler gibi bu sınıflamanın diğer bölümlerine dahil edilmemiş ürünlerin belirli bir mala tahsis edilmiş mağazalardaki satışını kapsamaktadır. Ayrıca, belirli bir mala tahsis edilmiş mağazalardaki kullanılmış malların perakende satışı da burada kapsanmaktadır. @tr
preferred label: Търговия на дребно в специализирани магазини с други нехранителни стоки @bg
preferred label: Maloobchod s ostatním zbožím ve specializovaných prodejnách @cs
preferred label: Detailhandel med andre varer i specialforretninger @da
preferred label: Einzelhandel mit sonstigen Gütern (in Verkaufsräumen) @de
preferred label: Λιανικό εμπόριο άλλων ειδών σε ειδικευμένα καταστήματα @el
preferred label: Comercio al por menor de otros artículos en establecimientos especializados @es
preferred label: Muude kaupade jaemüük spetsialiseeritud kauplustes @et
preferred label: Muiden tavaroiden vähittäiskauppa erikoismyymälöissä @fi
preferred label: Autres commerces de détail en magasin spécialisé @fr
preferred label: Egyéb m.n.s. áru kiskereskedelme
preferred label: Commercio al dettaglio di altri prodotti in esercizi specializzati @it
preferred label: Kitų prekių mažmeninė prekyba specializuotose parduotuvėse @lt
preferred label: Citu preču mazumtirdzniecība specializētajos veikalos @lv
preferred label: Bejgħ bl-imnut ta' oġġetti oħra minn ħwienet speċjalizzati @mt
preferred label: Detailhandel in andere artikelen in gespecialiseerde winkels @nl
preferred label: Annen butikkhandel i spesialforretninger @no
preferred label: Sprzedaż detaliczna pozostałych wyrobów prowadzona w wyspecjalizowanych sklepach @pl
preferred label: Comércio a retalho de outros produtos, em estabelecimentos especializados @pt
preferred label: Comerţ cu amănuntul al altor bunuri, în magazine specializate @ro
preferred label: Розничная торговля прочими товарами в специализированных магазинах @ru
preferred label: Maloobchod ostatného tovaru v špecializovaných predajniach @sk
preferred label: Trgovina na drobno v specializiranih prodajalnah z drugimi izdelki @sl
preferred label: Övrig specialiserad butikshandel med hushållsvaror @sv
preferred label: Belirli bir mala tahsis edilmiş mağazalarda diğer malların perakende ticareti @tr
broader: Retail trade, except of motor vehicles and motorcycles
narrower: Retail sale of clothing in specialised stores
narrower: Retail sale of footwear and leather goods in specialised stores
narrower: Dispensing chemist in specialised stores
narrower: Retail sale of medical and orthopaedic goods in specialised stores
narrower: Retail sale of cosmetic and toilet articles in specialised stores
narrower: Retail sale of flowers, plants, seeds, fertilisers, pet animals and pet food in specialised stores
narrower: Retail sale of watches and jewellery in specialised stores
narrower: Other retail sale of new goods in specialised stores
narrower: Retail sale of second-hand goods in stores

Retail sale of clothing in specialised stores
type: Concept
notation: 47.71
status: valid
status modified: 2013-10-18
accepted date: 2013-10-18
in scheme: Statistical Classification of Economic Activities in the European Community, Rev. 2 (2008)
scope note: - търговия на дребно с облекло - търговия на дребно с кожухарски изделия - търговия на дребно с аксесоари за облекло - шалове, ръкавици, вратовръзки, тиранти и други - търговия на дребно с текстил - 47.51 - търговия на дребно със спортно облекло - 47.64 @bg
scope note: Z: - maloobchod s oděvy - maloobchod s kožešinovým zbožím - maloobchod s oděvními doplňky, jako rukavicemi, kravatami, deštníky, sponami atd. N: - maloobchod s textilem (47.51) @cs
scope note: Diese Klasse umfasst: - Einzelhandel mit Bekleidung - Einzelhandel mit Pelzwaren - Einzelhandel mit Bekleidungszubehör wie Handschuhen, Krawatten, Hosenträgern usw. Diese Klasse umfasst nicht: - Einzelhandel mit Textilien (s. 47.51) @de
scope note: This class includes: - retail sale of articles of clothing - retail sale of articles of fur - retail sale of clothing accessories such as gloves, ties, braces etc. This class excludes: - retail sale of textiles, see 47.51 @en
scope note: Esta clase comprende: - el comercio al por menor de prendas de vestir - el comercio al por menor de artículos de peletería - el comercio al por menor de accesorios de vestir tales como guantes, corbatas, tirantes, etc. Esta clase no comprende: - el comercio al por menor de textiles (véase 47.51) @es
scope note: Cette classe comprend: - le commerce de détail d’articles d’habillement - le commerce de détail d’articles en fourrure - le commerce de détail d’accessoires du vêtement tels que gants, cravates, bretelles, etc. Cette classe ne comprend pas: - le commerce de détail de textiles, voir 47.51 @fr
scope note: Ovaj razred uključuje: - trgovinu na malo odjećom - trgovinu na malo proizvodima od krzna - trgovinu na malo priborom za odjeću kao što su rukavice, kravate itd. Ovaj razred isključuje: - trgovinu na malo tekstilom, vidi 47.51
scope note: Į šią klasę įeina: - drabužių mažmeninė prekyba - kailio gaminių mažmeninė prekyba - aprangos priedų, tokių kaip pirštinės, kaklaraiščiai, petnešos ir kt. mažmeninė prekyba Į šią klasę neįeina: - tekstilės gaminių ir dirbinių mažmeninė prekyba, žr. 47.51 @lt
scope note: Этот класс включает: - розничную торговлю фотографическими, оптическими и точными приборами - деятельность оптиков - розничную торговлю сувенирами, поделками и религиозными товарами - деятельность коммерческих картинных галерей - розничную торговлю топливом коммунально-бытового назначения, газом в баллонах, углем и древесным топливом для дома - розничную торговлю оружием и боеприпасами - розничную торговлю монетами и марками - розничную торговлю услугами коммерческих картинных галерей - розничную торговлю непродовольственными товарами, не перечисленными выше @ru
scope note: Bu sınıf aşağıdakileri kapsamaktadır; - giyim eşyalarının perakende ticareti, - kürklü eşyaların perakende ticareti, - eldivenler, kravatlar, pantolon askıları vb. gibi giysi aksesuarlarının perakende ticareti. Kapsam dışı olanlar; - tekstil perakende ticareti, bkz. 47.51. @tr
preferred label: Търговия на дребно с облекло @bg
preferred label: Maloobchod s oděvy ve specializovaných prodejnách @cs
preferred label: Detailhandel med beklædningsartikler @da
preferred label: Einzelhandel mit Bekleidung @de
preferred label: Λιανικό εμπόριο ενδυμάτων σε ειδικευμένα καταστήματα @el
preferred label: Comercio al por menor de prendas de vestir en establecimientos especializados @es
preferred label: Rõivaste jaemüük spetsialiseeritud kauplustes @et
preferred label: Vaatteiden vähittäiskauppa @fi
preferred label: Commerce de détail d'habillement en magasin spécialisé @fr
preferred label: Ruházat kiskereskedelem
preferred label: Commercio al dettaglio di articoli di abbigliamento in esercizi specializzati @it
preferred label: Drabužių mažmeninė prekyba specializuotose parduotuvėse @lt
preferred label: Apģērbu mazumtirdzniecība specializētajos veikalos @lv
preferred label: Bejgħ bl-imnut ta' ħwejjeġ minn ħwienet speċjalizzati @mt
preferred label: Detailhandel in kleding in gespecialiseerde winkels @nl
preferred label: Butikkhandel med klær @no
preferred label: Sprzedaż detaliczna odzieży prowadzona w wyspecjalizowanych sklepach @pl
preferred label: Comércio a retalho de vestuário, em estabelecimentos especializados @pt
preferred label: Comerţ cu amănuntul al îmbrăcămintei, în magazine specializate @ro
preferred label: Розничная торговля одеждой в специализированных магазинах @ru
preferred label: Maloobchod s odevmi v špecializovaných predajniach @sk
preferred label: Trgovina na drobno v specializiranih prodajalnah z oblačili @sl
preferred label: Specialiserad butikshandel med kläder @sv
preferred label: Belirli bir mala tahsis edilmiş mağazalarda giyim eşyalarının perakende ticareti @tr
broader: Retail sale of other goods in specialised stores

Retail sale of footwear and leather goods in specialised stores
type: Concept
notation: 47.72
status: valid
status modified: 2013-10-18
accepted date: 2013-10-18
in scheme: Statistical Classification of Economic Activities in the European Community, Rev. 2 (2008)
scope note: - търговия на дребно с обувки - търговия на дребно с кожени изделия - търговия на дребно с пътнически принадлежности от кожа или изкуствена кожа - търговия на дребно с обувки за ски и ски бягане - 47.64 @bg
scope note: Z: - maloobchod s obuví - maloobchod s koženými výrobky - maloobchod s brašnářským zbožím a cestovními doplňky z kůže nebo náhražek kůže N: - maloobchod se speciální sportovní obuví, např. lyžařskými botami (47.64) @cs
scope note: Diese Klasse umfasst: - Einzelhandel mit Schuhen - Einzelhandel mit Lederwaren - Einzelhandel mit Täschnerwaren und Reiseaccessoires aus Leder oder Ersatzstoffen Diese Klasse umfasst nicht: - Einzelhandel mit speziellen Sportschuhen, z. B. Skischuhen (s. 47.64) @de
scope note: This class includes: - retail sale of footwear - retail sale of leather goods - retail sale of travel accessories of leather and leather substitutes This class excludes: - retail sale of special sports equipment footwear such as ski boots, see 47.64 @en
scope note: Esta clase comprende: - el comercio al por menor de calzado - el comercio al por menor de artículos de cuero - el comercio al por menor de artículos de viaje, de cuero o de cuero de imitación Esta clase no comprende: - el comercio al por menor de calzado deportivo especial, como botas de esquí (véase 47.64) @es
scope note: Cette classe comprend: - le commerce de détail de chaussures - le commerce de détail d’articles en cuir - le commerce de détail d’accessoires de voyage en cuir ou en cuirs synthétiques Cette classe ne comprend pas: - le commerce de détail de chaussures spéciales de sport, telles que des chaussures de ski, voir 47.64 @fr
scope note: Ovaj razred uključuje: - trgovinu na malo obućom - trgovinu na malo proizvodima od kože - trgovinu na malo priborom za putovanje od kože i umjetne kože Ovaj razred isključuje: - trgovinu na malo specijalnom sportskom obućom kao što su skijaške cipele (pancerice), vidi 47.64
scope note: Į šią klasę įeina: - avalynės mažmeninė prekyba - odos gaminių mažmeninė prekyba - kelionės reikmenų iš odos arba odos pakaitalų mažmeninė prekyba Į šią klasę neįeina: - specialiosios sportinės avalynės, tokios kaip slidžių batai, mažmeninė prekyba, žr. 47.64 @lt
scope note: Этот класс включает: - розничную торговлю подержанными книгами - розничную торговлю прочими подержанными товарами - розничную торговлю антикварными товарами - деятельность аукционных домов (розничная торговля) Этот класс исключает: - розничную продажу подержанных автомобилей, см. 45.1 - деятельность Интернет-аукционов и других внемагазинных аукционов (в розницу), см. 47.91, 47.99 - деятельность ломбардов, см. 64.92 @ru
scope note: Bu sınıf aşağıdakileri kapsamaktadır; - ayakkabı perakende ticareti, - deri eşyaların perakende ticareti, - deri ve deri ikameli seyahat aksesuarlarının perakende ticareti. Kapsam dışı olanlar; - kayak botları gibi özel spor ekipman ayakkabılarının perakende ticareti, bkz. 47.64. @tr
preferred label: Търговия на дребно с обувки и кожени изделия @bg
preferred label: Maloobchod s obuví a koženými výrobky ve specializovaných prodejnách @cs
preferred label: Detailhandel med skotøj og lædervarer @da
preferred label: Einzelhandel mit Schuhen und Lederwaren @de
preferred label: Λιανικό εμπόριο υποδημάτων και δερμάτινων ειδών σε ειδικευμένα καταστήματα @el
preferred label: Comercio al por menor de calzado y artículos de cuero en establecimientos especializados @es
preferred label: Jalatsite ja nahktoodete jaemüük spetsialiseeritud kauplustes @et
preferred label: Jalkineiden ja nahkatavaroiden vähittäiskauppa @fi
preferred label: Commerce de détail de chaussures et d'articles en cuir en magasin spécialisé @fr
preferred label: Lábbeli-, bőráru-kiskereskedelem
preferred label: Commercio al dettaglio di calzature e articoli in pelle in esercizi specializzati @it
preferred label: Avalynės ir odos gaminių mažmeninė prekyba specializuotose parduotuvėse @lt
preferred label: Apavu un ādas izstrādājumu mazumtirdzniecība specializētajos veikalos @lv
preferred label: Bejgħ bl-imnut ta' xedd tas-saqajn u oġġetti tal-ġilda minn ħwienet speċjalizzati @mt
preferred label: Detailhandel in schoeisel en lederwaren in gespecialiseerde winkels @nl
preferred label: Butikkhandel med skotøy og lærvarer @no
preferred label: Sprzedaż detaliczna obuwia i wyrobów skórzanych prowadzona w wyspecjalizowanych sklepach @pl
preferred label: Comércio a retalho de calçado e artigos de couro, em estabelecimentos especializados @pt
preferred label: Comerţ cu amănuntul al încălţămintei şi articolelor din piele, în magazine specializate @ro
preferred label: Розничная торговля обувью и кожаными изделиями в специализированных магазинах @ru
preferred label: Maloobchod s obuvou a koženými výrobkami v špecializovaných predajniach @sk
preferred label: Trgovina na drobno v specializiranih prodajalnah z obutvijo in usnjenimi izdelki @sl
preferred label: Specialiserad butikshandel med skodon och lädervaror @sv
preferred label: Belirli bir mala tahsis edilmiş mağazalarda ayakkabı ve deri eşyaların perakende ticareti @tr
broader: Retail sale of other goods in specialised stores

Dispensing chemist in specialised stores
type: Concept
notation: 47.73
status: valid
status modified: 2013-10-18
accepted date: 2013-10-18
in scheme: Statistical Classification of Economic Activities in the European Community, Rev. 2 (2008)
scope note: Z: - maloobchod s léčivy @cs
scope note: Diese Klasse umfasst: - Einzelhandel mit Arzneimitteln @de
scope note: This class includes: - retail sale of pharmaceuticals @en
scope note: Esta clase comprende: - el comercio al por menor de productos farmacéuticos @es
scope note: Cette classe comprend: - le commerce de détail de produits pharmaceutiques @fr
scope note: Ovaj razred uključuje: - trgovinu na malo farmaceutskim proizvodima
scope note: Į šią klasę įeina: - vaistų mažmeninė prekyba @lt
scope note: Данная группа включает розничную торговлю любыми видами новых или подержанных товаров в обычных магазинах, расположенных либо у дороги, либо в специально отведенных для торговли местах. @ru
scope note: Bu sınıf aşağıdakileri kapsamaktadır; - eczacılık ürünlerinin perakende satışı. @tr
preferred label: Търговия на дребно с лекарства и други фармацевтични стоки @bg
preferred label: Maloobchod s farmaceutickými přípravky ve specializovaných prodejnách @cs
preferred label: Apoteker @da
preferred label: Apotheken @de
preferred label: Φαρμακευτικά είδη σε ειδικευμένα καταστήματα @el
preferred label: Comercio al por menor de productos farmacéuticos en establecimientos especializados @es
preferred label: Apteekide tegevus @et
preferred label: Apteekit @fi
preferred label: Commerce de détail de produits pharmaceutiques en magasin spécialisé @fr
preferred label: Gyógyszer-kiskereskedelem
preferred label: Commercio al dettaglio di medicinali in esercizi specializzati @it
preferred label: Vaistinių, ruošiančių ir parduodančių vaistus, veikla @lt
preferred label: Farmaceitisko izstrādājumu mazumtirdzniecība specializētajos veikalos @lv
preferred label: Spiżjar fi ħwienet speċjalizzati @mt
preferred label: Apothekers in gespecialiseerde winkels @nl
preferred label: Butikkhandel med apotekvarer @no
preferred label: Sprzedaż detaliczna wyrobów farmaceutycznych prowadzona w wyspecjalizowanych sklepach @pl
preferred label: Comércio a retalho de produtos farmacêuticos, em estabelecimentos especializados @pt
preferred label: Comerţ cu amănuntul al produselor farmaceutice, în magazine specializate @ro
preferred label: Розничная торговля фармацевтическими товарами в специализированных магазинах @ru
preferred label: Lekárne @sk
preferred label: Trgovina na drobno v specializiranih prodajalnah s farmacevtskimi izdelki @sl
preferred label: Apotekshandel @sv
preferred label: Belirli bir mala tahsis edilmiş mağazalarda eczacılık ürünlerinin perakende ticareti @tr
broader: Retail sale of other goods in specialised stores

Retail sale of medical and orthopaedic goods in specialised stores
type: Concept
notation: 47.74
status: valid
status modified: 2013-10-18
accepted date: 2013-10-18
in scheme: Statistical Classification of Economic Activities in the European Community, Rev. 2 (2008)
scope note: Этот класс исключает: - розничную торговлю приготовленными продуктами питания для немедленного потребления (передвижные торговцы пищевыми продуктами), см. 56.10 @ru
preferred label: Търговия на дребно с медицински и ортопедични стоки @bg
preferred label: Maloobchod se zdravotnickými a ortopedickými výrobky ve specializovaných prodejnách @cs
preferred label: Detailhandel med medicinske og ortopædiske artikler @da
preferred label: Einzelhandel mit medizinischen und orthopädischen Artikeln @de
preferred label: Λιανικό εμπόριο ιατρικών και ορθοπεδικών ειδών σε ειδικευμένα καταστήματα @el
preferred label: Comercio al por menor de artículos médicos y ortopédicos en establecimientos especializados @es
preferred label: Meditsiini- ja ortopeediakaupade jaemüük spetsialiseeritud kauplustes @et
preferred label: Terveydenhoitotarvikkeiden vähittäiskauppa @fi
preferred label: Commerce de détail d'articles médicaux et orthopédiques en magasin spécialisé @fr
preferred label: Gyógyászati termék kiskereskedelme
preferred label: Commercio al dettaglio di articoli medicali e ortopedici in esercizi specializzati @it
preferred label: Medicinos ir ortopedinių prekių mažmeninė prekyba specializuotose parduotuvėse @lt
preferred label: Medicīnas un ortopēdisko preču mazumtirdzniecība specializētajos veikalos @lv
preferred label: Bejgħ bl-imnut ta' oġġetti mediċi u ortopediċi minn ħwienet speċjalizzati @mt
preferred label: Detailhandel in medische en orthopedische artikelen in gespecialiseerde winkels @nl
preferred label: Butikkhandel med medisinske og ortopediske artikler @no
preferred label: Sprzedaż detaliczna wyrobów medycznych i ortopedycznych w wyspecjalizowanych sklepach @pl
preferred label: Comércio a retalho de produtos médicos e ortopédicos, em estabelecimentos especializados @pt
preferred label: Comerţ cu amănuntul al articolelor medicale şi ortopedice, în magazine specializate @ro
preferred label: Розничная торговля медицинскими и ортопедическими товарами в специализированных магазинах @ru
preferred label: Maloobchod so zdravotníckymi a ortopedickými pomôckami v špecializovaných predajniach @sk
preferred label: Trgovina na drobno v specializiranih prodajalnah z medicinskimi in ortopedskimi pripomočki @sl
preferred label: Specialiserad butikshandel med sjukvårdsartiklar @sv
preferred label: Belirli bir mala tahsis edilmiş mağazalarda tıbbi ve ortopedik ürünlerin perakende ticareti @tr
broader: Retail sale of other goods in specialised stores

Retail sale of cosmetic and toilet articles in specialised stores
type: Concept
notation: 47.75
status: valid
status modified: 2013-10-18
accepted date: 2013-10-18
in scheme: Statistical Classification of Economic Activities in the European Community, Rev. 2 (2008)
scope note: Z: - maloobchod s voňavkářským zbožím a toaletními výrobky @cs
scope note: Diese Klasse umfasst: - Einzelhandel mit Parfümeriewaren, kosmetischen Erzeugnissen und Körperpflegemitteln @de
scope note: This class includes: - retail sale of perfumery, cosmetic and toilet articles @en
scope note: Esta clase comprende: - el comercio al por menor de productos de perfumería, cosméticos e higiénicos @es
scope note: Cette classe comprend: - le commerce de détail de parfums et de produits de beauté @fr
scope note: Ovaj razred uključuje: - trgovinu na malo parfemima, kozmetičkim i toaletnim proizvodima
scope note: Į šią klasę įeina: - kvepalų, kosmetikos ir tualeto reikmenų mažmeninė prekyba @lt
scope note: Bu sınıf aşağıdakileri kapsamaktadır; - parfüm, kozmetik ve kişisel bakım malzemelerinin perakende ticareti. @tr
preferred label: Търговия на дребно с парфюмерийни и козметични стоки и тоалетни принадлежности @bg
preferred label: Maloobchod s kosmetickými a toaletními výrobky ve specializovaných prodejnách @cs
preferred label: Detailhandel med kosmetikvarer og produkter til personlig pleje @da
preferred label: Einzelhandel mit kosmetischen Erzeugnissen und Körperpflegemitteln @de
preferred label: Λιανικό εμπόριο καλλυντικών και ειδών καλλωπισμού σε ειδικευμένα καταστήματα @el
preferred label: Comercio al por menor de productos cosméticos e higiénicos en establecimientos especializados @es
preferred label: Kosmeetika ja tualetitarvete jaemüük spetsialiseeritud kauplustes @et
preferred label: Kosmetiikka- ja hygieniatuotteiden vähittäiskauppa @fi
preferred label: Commerce de détail de parfumerie et de produits de beauté en magasin spécialisé @fr
preferred label: Illatszer-kiskereskedelem
preferred label: Commercio al dettaglio di cosmetici e di articoli di profumeria in esercizi specializzati @it
preferred label: Kosmetikos ir tualeto reikmenų mažmeninė prekyba specializuotose parduotuvėse @lt
preferred label: Kosmētikas un tualetes piederumu mazumtirdzniecība specializētajos veikalos @lv
preferred label: Bejgħ bl-imnut ta' oġġetti kożmetiċi u tat-twaletta minn ħwienet speċjalizzati @mt
preferred label: Detailhandel in cosmetica en toiletartikelen in gespecialiseerde winkels @nl
preferred label: Butikkhandel med kosmetikk og toalettartikler @no
preferred label: Sprzedaż detaliczna kosmetyków i artykułów toaletowych prowadzona w wyspecjalizowanych sklepach @pl
preferred label: Comércio a retalho de produtos cosméticos e de higiene, em estabelecimentos especializados @pt
preferred label: Comerţ cu amănuntul al produselor cosmetice şi de parfumerie, în magazine specializate @ro
preferred label: Розничная торговля косметическими товарами и предметами гигиены в специализированных магазинах @ru
preferred label: Maloobchod s kozmetickými a toaletnými výrobkami v špecializovaných predajniach @sk
preferred label: Trgovina na drobno v specializiranih prodajalnah s kozmetičnimi in toaletnimi izdelki @sl
preferred label: Specialiserad butikshandel med kosmetika och hygienartiklar @sv
preferred label: Belirli bir mala tahsis edilmiş mağazalarda kozmetik ve kişisel bakım malzemelerinin perakende ticareti @tr
broader: Retail sale of other goods in specialised stores

Retail sale of flowers, plants, seeds, fertilisers, pet animals and pet food in specialised stores
type: Concept
notation: 47.76
status: valid
status modified: 2013-10-18
accepted date: 2013-10-18
in scheme: Statistical Classification of Economic Activities in the European Community, Rev. 2 (2008)
scope note: Этот класс включает: - розничную торговлю прочими товарами через палатки и рынки, таких как: • ковры и ковровые изделия • книги • игры и игрушки • бытовые товары и электроника • аудио и видеозаписи @ru
preferred label: Търговия на дребно с цветя, растения, семена, торове, домашни любимци и храни за тях @bg
preferred label: Maloobchod s květinami, rostlinami, osivy, hnojivy, zvířaty pro zájmový chov a krmivy pro ně ve specializovaných prodejnách @cs
preferred label: Detailhandel med blomster, planter, frø, gødningsstoffer, kæledyr samt foder til kæledyr @da
preferred label: Einzelhandel mit Blumen, Pflanzen, Sämereien, Düngemitteln, zoologischem Bedarf und lebenden Tieren @de
preferred label: Λιανικό εμπόριο λουλουδιών, φυτών, σπόρων, λιπασμάτων, ζώων συντροφιάς και σχετικών ζωοτροφών σε ειδικευμένα καταστήματα @el
preferred label: Comercio al por menor de flores, plantas, semillas, fertilizantes, animales de compañía y alimentos para los mismos en establecimientos especializados @es
preferred label: Lillede, taimede, seemnete, väetiste, lemmikloomade ja lemmikloomatoidu jaemüük spetsialiseeritud kauplustes @et
preferred label: Kukkien, kasvien, siementen, lannoitteiden, lemmikkieläinten ja niiden ruokien vähittäiskauppa @fi
preferred label: Commerce de détail de fleurs, plantes, graines, engrais, animaux de compagnie et aliments pour ces animaux en magasin spécialisé @fr
preferred label: Dísznövény, vetőmag, műtrágya, hobbiállat-eledel kiskereskedelem
preferred label: Commercio al dettaglio di fiori, piante, semi, fertilizzanti, animali domestici e alimenti per animali domestici in esercizi specializzati @it
preferred label: Gėlių, sodinukų, sėklų, trąšų, naminių gyvūnėlių ir jų ėdalo mažmeninė prekyba specializuotose parduotuvėse @lt
preferred label: Ziedu, augu, sēklu, mēslošanas līdzekļu, istabas dzīvnieku un to barības mazumtirdzniecība specializētajos veikalos @lv
preferred label: Bejgħ bl-imnut ta' fjuri, pjanti, żrieragħ, fertilizzanti, annimali domestiċi u ikel għall-annimali domestiċi minn ħwienet speċjalizzati @mt
preferred label: Detailhandel in bloemen, planten, zaden, kunstmeststoffen, huisdieren en voer voor huisdieren in gespecialiseerde winkels @nl
preferred label: Butikkhandel med blomster og planter, kjæledyr og fôrvarer til kjæledyr @no
preferred label: Sprzedaż detaliczna kwiatów, roślin, nasion, nawozów, żywych zwierząt domowych, karmy dla zwierząt domowych prowadzona w wyspecjalizowanych sklepach @pl
preferred label: Comércio a retalho de flores, plantas, sementes, fertilizantes, animais de estimação e respectivos alimentos, em estabelecimentos especializados @pt
preferred label: Comerţ cu amănuntul al florilor, plantelor şi seminţelor; comerţ cu amănuntul al animalelor de companie şi a hranei pentru acestea, în magazine specializate @ro
preferred label: Розничная торговля цветами, комнатными растениями, семенами, удобрениями, домашними животными и кормами для домашних животных в специализированных магазинах @ru
preferred label: Maloobchod s kvetmi, rastlinami, semenami hnojivami, domácimi zvieratami a krmivom pre zvieratá v špecializovaných predajniach @sk
preferred label: Trgovina na drobno v specializiranih prodajalnah s cvetjem, rastlinami, gnojili, hišnimi živalmi in hrano za živali @sl
preferred label: Specialiserad butikshandel med blommor och andra växter, frön och gödselmedel samt små sällskapsdjur @sv
preferred label: Belirli bir mala tahsis edilmiş mağazalarda çiçek, bitki, tohum, gübre, ev hayvanları ve ev hayvanları yemleri perakende ticareti @tr
broader: Retail sale of other goods in specialised stores

Retail sale of watches and jewellery in specialised stores
type: Concept
notation: 47.77
status: valid
status modified: 2013-10-18
accepted date: 2013-10-18
in scheme: Statistical Classification of Economic Activities in the European Community, Rev. 2 (2008)
scope note: Данная группа включает розничную торговлю через фирмы посылочной торговли, через Интернет, торговые автоматы, торговлю разносчиками и т.д. @ru
preferred label: Търговия на дребно с часовници и бижутерия @bg
preferred label: Maloobchod s hodinami, hodinkami a klenoty ve specializovaných prodejnách @cs
preferred label: Detailhandel med ure, smykker og guld- og sølvvarer @da
preferred label: Einzelhandel mit Uhren und Schmuck @de
preferred label: Λιανικό εμπόριο ρολογιών και κοσμημάτων σε ειδικευμένα καταστήματα @el
preferred label: Comercio al por menor de artículos de relojería y joyería en establecimientos especializados @es
preferred label: Kellade ja ehete jaemüük spetsialiseeritud kauplustes @et
preferred label: Kultasepänteosten ja kellojen vähittäiskauppa @fi
preferred label: Commerce de détail d'articles d'horlogerie et de bijouterie en magasin spécialisé @fr
preferred label: Óra-, ékszer-kiskereskedelem
preferred label: Commercio al dettaglio di orologi e articoli di gioielleria in esercizi specializzati @it
preferred label: Laikrodžių, papuošalų ir juvelyrinių dirbinių mažmeninė prekyba specializuotose parduotuvėse @lt
preferred label: Pulksteņu un juvelierizstrādājumu mazumtirdzniecība specializētajos veikalos @lv
preferred label: Bejgħ bl-imnut ta' arloġġi ta' l-idejn u ġojjellerija minn ħwienet speċjalizzati @mt
preferred label: Detailhandel in uurwerken en sieraden in gespecialiseerde winkels @nl
preferred label: Butikkhandel med ur, gull- og sølvvarer @no
preferred label: Sprzedaż detaliczna zegarków, zegarów i biżuterii prowadzona w wyspecjalizowanych sklepach @pl
preferred label: Comércio a retalho de relógios e de artigos de orivesaria e joalharia, em estabelecimentos especializados @pt
preferred label: Comerţ cu amănuntul al ceasurilor şi bijuteriilor, în magazine specializate @ro
preferred label: Розничная торговля часами и ювелирными украшениями в специализированных магазинах @ru
preferred label: Maloobchod s hodinami a šperkami v špecializovaných predajniach @sk
preferred label: Trgovina na drobno v specializiranih prodajalnah z urami in nakitom @sl
preferred label: Specialiserad butikshandel med ur, guldsmedsvaror och smycken @sv
preferred label: Belirli bir mala tahsis edilmiş mağazalarda saat ve mücevher perakende ticareti @tr
broader: Retail sale of other goods in specialised stores

Other retail sale of new goods in specialised stores
type: Concept
notation: 47.78
status: valid
status modified: 2013-10-18
accepted date: 2013-10-18
in scheme: Statistical Classification of Economic Activities in the European Community, Rev. 2 (2008)
scope note: - търговия на дребно с офис техника - търговия на дребно с фотографски принадлежности, оптични и прецизни уреди - дейност на оптиките - търговия на дребно със сувенири, произведения на изкуството и занаятите, църковни утвари и вещи - дейност на художествени галерии с търговска цел - търговия на дребно с отоплителни материали за домакинска употреба - нафта, газ в бутилки, въглища, дърва и други - търговия на дребно със стрелково оръжие за ловни и спортни цели, пневматични пушки, газови пушки и пистолети, както и муниции за тях - търговия на дребно с пощенски марки и монети - търговия на дребно с почистващи препарати - търговия на дребно с други нехранителни стоки, некласифицирана другаде @bg
scope note: Z: - maloobchod s fotografickými potřebami, optickými výrobky a výrobky jemné mechaniky - činnost optiků - maloobchod se suvenýry, rukodělnými výrobky a náboženskými předměty - činnosti komerčních uměleckých galerií - maloobchod s topným olejem, plynem v lahvích, uhlím a palivovým dřevem - maloobchod se zbraněmi a municí - maloobchod s poštovními známkami a mincemi - maloobchod se službami komerčních uměleckých galerií - rámování obrazů - maloobchod s nepotravinářským zbožím j. n. @cs
scope note: Diese Klasse umfasst: - Einzelhandel mit Fotoartikeln, optischen und feinmechanischen Artikeln - Tätigkeiten von Augenoptikern - Einzelhandel mit Andenken, kunstgewerblichen Erzeugnissen und Devotionalien - Tätigkeiten von kommerziellen Kunstgalerien - Einzelhandel mit Heizöl, Flaschengas, Kohle und Holz - Einzelhandel mit Waffen und Munition - Einzelhandel mit Briefmarken und Münzen - Einzelhandelsleistungen kommerzieller Kunstgalerien - Einzelhandel mit Non-Food-Waren a. n. g. @de
scope note: This class includes: - retail sale of photographic, optical and precision equipment - activities of opticians - retail sale of souvenirs, craftwork and religious articles - activities of commercial art galleries - retail sale of household fuel oil, bottled gas, coal and fuel wood - retail sale of weapons and ammunition - retail sale of stamps and coins - retail trade services of commercial art galleries - retail sale of non-food products n.e.c. @en
scope note: Esta clase comprende: - el comercio al por menor de material fotográfico, óptico y de precisión - las actividades de las ópticas - el comercio al por menor de souvenirs, artesanía y artículos religiosos - las actividades de las galerías de arte comerciales - el comercio al por menor de combustibles líquidos, botellas de gases licuados, carbón y leña para uso doméstico - el comercio al por menor de armas y municiones - el comercio al por menor de sellos y monedas - servicios de venta al por menor de las galerías de arte - el comercio al por menor de productos no alimenticios n.c.o.p. @es
scope note: Cette classe comprend: - le commerce de détail de matériel photographique, optique et de matériel de précision - les activités des opticiens - le commerce de détail de souvenirs, d’objets artisanaux et d’articles religieux - les activités des galeries d’art commerciales - le commerce de détail de mazout, de gaz en bonbonnes, de charbon et de bois pour usages domestiques - le commerce de détail d’armes et de munitions - le commerce de détail de timbres-poste et de pièces de monnaie - la vente au détail d’objets d’art - le commerce de détail de produits non alimentaires n.c.a. @fr
scope note: Ovaj razred uključuje: - trgovinu na malo fotografskom, optičkom i preciznom opremom - djelatnosti optičara - trgovinu na malo suvenirima, rukotvorinama i religijskim proizvodima - djelatnosti prodajnih galerija - trgovinu na malo umjetninama - trgovinu na malo loživim uljem za kućanstvo, plinom u bocama, ugljenom i ogrjevnim drvom - trgovinu na malo oružjem i streljivom - trgovinu na malo filatelističkim markama i novcem - trgovinu na malo neprehrambenim proizvodima, d. n.
scope note: Į šią klasę įeina: - fotografijos, optinės ir tiksliosios įrangos mažmeninė prekyba - optikų veikla - suvenyrų, meno dirbinių ir religinių reikmenų mažmeninė prekyba - komercinių meno galerijų veikla - buitinio skystojo kuro, dujų balionų, akmens anglių ir malkų mažmeninė prekyba - ginklų ir šaudmenų mažmeninė prekyba - ženklų ir monetų mažmeninė prekyba - komercinių meno galerijų atliekama mažmeninė prekyba - niekur kitur nepriskirtų ne maisto produktų mažmeninė prekyba @lt
scope note: Данный класс включает розничную торговлю через фирмы посылочной торговли, через Интернет, т.е. торговую деятельность, где покупатель осуществляет свой выбор на основе рекламных объявлений, каталогов, информации, предоставленной на веб-сайтах, макетах или любой другой рекламной продукции и размешает свой заказ по почте, телефону или Интернету (обычно посредством специальных средств, размещенных на веб-сайте). Покупаемый продукт может быть либо напрямую скачан с Интернет-сайта, либо доставлен покупателю. Этот класс включает: - розничную торговлю любой продукцией через фирмы посылочной торговли - розничную торговлю любой продукцией через Интернет Этот класс также включает: - прямые продажи посредством телевидения, радио и телефона - Интернет-аукционы розничной торговли Этот класс исключает: - розничную продажу автомобилей, а также запчастей и аксессуаров к ним через Интернет, см. группы 45.1, 45.3 - розничную продажу мотоциклов, а также запчастей и аксессуаров к ним через Интернет, см. 45.40 @ru
scope note: Bu sınıf aşağıdakileri kapsamaktadır; - fotografik, optik ve hassas aletlerin perakende ticareti, - gözlükçülerin faaliyetleri, - hediyelik eşyalar, elişi ürünler ve dini eşyaların perakende ticareti, - ticari sanat galerileri faaliyetleri, - evde kullanılan fuel oil, tüp gaz, kömür ve yakacak odun perakende ticareti, - silahlar ve mühimmat perakende ticareti, - pullar ve madeni paraların perakende ticareti, - ticari sanat galerileri perakende ticaret hizmetleri , - başka yerde sınıflandırılmamış gıda dışı ürünlerin perakende ticareti. @tr
preferred label: Търговия на дребно с други нехранителни стоки, некласифицирана другаде @bg
preferred label: Ostatní maloobchod s novým zbožím ve specializovaných prodejnách @cs
preferred label: Anden detailhandel fra specialforretninger @da
preferred label: Sonstiger Einzelhandel in Verkaufsräumen (ohne Antiquitäten und Gebrauchtwaren) @de
preferred label: Άλλο λιανικό εμπόριο καινούργιων ειδών σε ειδικευμένα καταστήματα @el
preferred label: Otro comercio al por menor de artículos nuevos en establecimientos especializados @es
preferred label: Muude uute kaupade jaemüük spetsialiseeritud kauplustes @et
preferred label: Muu uusien tavaroiden vähittäiskauppa @fi
preferred label: Autre commerce de détail de biens neufs en magasin spécialisé @fr
preferred label: Egyéb m.n.s. új áru kiskereskedelme
preferred label: Commercio al dettaglio di altri prodotti (esclusi quelli di seconda mano) in esercizi specializzati @it
preferred label: Kita naujų prekių mažmeninė prekyba specializuotose parduotuvėse @lt
preferred label: Citur neklasificēta jaunu preču mazumtirdzniecība specializētajos veikalos @lv
preferred label: Bejgħ ieħor bl-imnut ta' oġġetti ġodda minn ħwienet speċjalizzati @mt
preferred label: Overige detailhandel in nieuwe artikelen in gespecialiseerde winkels @nl
preferred label: Annen butikkhandel med nye varer i spesialforretninger @no
preferred label: Sprzedaż detaliczna pozostałych nowych wyrobów prowadzona w wyspecjalizowanych sklepach @pl
preferred label: Comércio a retalho de outros produtos novos, em estabelecimentos especializados @pt
preferred label: Comerţ cu amănuntul al altor bunuri noi, în magazine specializate @ro
preferred label: Другие виды розничной торговли новыми товарами в специализированных магазинах @ru
preferred label: Ostatný maloobchod s novým tovarom v špecializovaných predajniach @sk
preferred label: Druga trgovina na drobno v specializiranih prodajalnah z novim blagom @sl
preferred label: Annan specialiserad butikshandel med nya varor @sv
preferred label: Belirli bir mala tahsis edilmiş mağazalarda diğer yeni malların perakende ticareti @tr
broader: Retail sale of other goods in specialised stores

Retail sale of second-hand goods in stores
type: Concept
notation: 47.79
status: valid
status modified: 2013-10-18
accepted date: 2013-10-18
in scheme: Statistical Classification of Economic Activities in the European Community, Rev. 2 (2008)
scope note: - търговия на дребно с книги втора употреба - търговия на дребно с други употребявани стоки - търговия на дребно със старинни предмети (антиквариат) - дейности по продажби на дребно чрез търг с явно наддаване (аукционни къщи) - търговия на дребно с употребявани автомобили - 45.1 - дейности по продажби на дребно чрез търг по Интернет и други продажби на дребно чрез търг извън търговски обекти - 47.91, 47.99 - дейности на заложни къщи - 64.92 @bg
scope note: Z: - maloobchod s použitými knihami - maloobchod s ostatním použitým zbožím - maloobchod se starožitnostmi - činnosti aukčních domů (maloobchod) N: - maloobchod s ojetými motorovými vozidly (45.1) - internetové maloobchodní aukce (47.91) a ostatní maloobchodní aukce mimo prodejny (47.99) - činnost zastaváren (64.92) @cs
scope note: Diese Klasse umfasst: - Einzelhandel mit gebrauchten Büchern - Einzelhandel mit sonstigen Gebrauchtwaren - Einzelhandel mit Antiquitäten - Tätigkeiten von Auktionshäusern (Einzelhandel) Diese Klasse umfasst nicht: - Einzelhandel mit gebrauchten Kraftwagen (s. 45.1) - Internet-Auktionen und sonstige Auktionen nicht in Verkaufsräumen (Einzelhandel) (s. 47.91, 47.99) - Tätigkeiten von Pfandleihhäusern (s. 64.92) @de
scope note: This class includes: - retail sale of second-hand books - retail sale of other second-hand goods - retail sale of antiques - activities of auctioning houses (retail) This class excludes: - retail sale of second-hand motor vehicles, see 45.1 - activities of Internet auctions and other non-store auctions (retail), see 47.91, 47.99 - activities of pawn shops, see 64.92 @en
scope note: Esta clase comprende: - el comercio al por menor de libros de segunda mano - el comercio al por menor de otros artículos de segunda mano - el comercio al por menor de antigüedades - las actividades de las empresas de subastas (al por menor) Esta clase no comprende: - el comercio al por menor de vehículos de motor de segunda mano (véase 45.1) - las actividades de las subastas por Internet y otras subastas no realizadas en establecimientos (al por menor) (véanse 47.91 y 47.99) - las actividades de las casas de empeño (véase 64.92) @es
scope note: Cette classe comprend: - le commerce de détail de livres d’occasion - le commerce de détail d’autres biens d’occasion - le commerce de détail d’antiquités - les activités des centres de vente aux enchères (commerce de détail) Cette classe ne comprend pas: - le commerce de détail de véhicules automobiles d’occasion, voir 45.1 - la vente aux enchères par Internet et les autres activités de vente aux enchères (commerce de détail), voir 47.91 et 47.99 - les activités de prêteurs sur gage, voir 64.92 @fr
scope note: Ovaj razred uključuje: - trgovinu na malo rabljenim knjigama - trgovinu na malo ostalom rabljenom robom - trgovinu na malo antikvitetima - djelatnosti dražbovaonica (aukcijskih kuća) u vezi s trgovinom na malo Ovaj razred isključuje: - trgovinu na malo rabljenim motornim vozilima, vidi 45.1 - dražbe internetom i ostale dražbe izvan prodajnih prostora (u vezi s trgovinom na malo) vidi 47.91, 47.99 - djelatnosti zalagaonica, vidi 64.92
scope note: Į šią klasę įeina: - naudotų knygų mažmeninė prekyba - kitų naudotų daiktų mažmeninė prekyba - antikvarinių daiktų mažmeninė prekyba - aukcionų namų (mažmeninė) veikla Į šią klasę neįeina: - naudotų variklinių transporto priemonių mažmeninė prekyba, žr. 45.1 - interneto ir kitų, ne parduotuvėse organizuojamų (mažmeninių) aukcionų, veikla, žr. 47.91, 47.99 - lombardų veikla, žr. 64.92 @lt
scope note: Этот класс включает: - розничную торговлю любым типом товаров любым способом, не включенным в предыдущие классы: • через прямые продажи посредством торговых представителей • через торговые автоматы и т.д. - прямую продажу топлива (печного топлива, дров и т.д.), доставляемого непосредственно потребителям - деятельность внемагазинных аукционов (розничную торговлю, за исключением продаж через Интернет) - розничную торговлю посредством (внемагазинных) комиссионных агентов @ru
scope note: Bu sınıf aşağıdakileri kapsamaktadır; - ikinci el kitapların perakende ticareti, - diğer ikinci el malların perakende ticareti, - antika eşyaların perakende ticareti, - müzayede salonlarının faaliyetleri (perakende). Kapsam dışı olanlar; - ikinci el motorlu taşıtların perakende ticareti, bkz. 45.1, - internet müzayedeleri ve diğer mağaza dışı müzayedelerin faaliyetleri (perakende), bkz. 47.91, 47.99, - tefeci bürolarının faaliyetleri, bkz. 64.92. @tr
preferred label: Търговия на дребно в магазини с употребявани стоки @bg
preferred label: Maloobchod s použitým zbožím v prodejnách @cs
preferred label: Detailhandel med brugte varer i forretninger @da
preferred label: Einzelhandel mit Antiquitäten und Gebrauchtwaren @de
preferred label: Λιανικό εμπόριο μεταχειρισμένων ειδών σε καταστήματα @el
preferred label: Comercio al por menor de artículos de segunda mano en establecimientos especializados @es
preferred label: Kasutatud kaupade jaemüük kauplustes @et
preferred label: Käytettyjen tavaroiden vähittäiskauppa myymälöissä @fi
preferred label: Commerce de détail de biens d'occasion en magasin @fr
preferred label: Használtcikk bolti kiskereskedelem
preferred label: Commercio al dettaglio di articoli di seconda mano @it
preferred label: Naudotų daiktų mažmeninė prekyba parduotuvėse @lt
preferred label: Lietotu preču mazumtirdzniecība veikalos @lv
preferred label: Bejgħ bl-imnut ta' oġġetti wżati minn ħwienet @mt
preferred label: Detailhandel in tweedehandsgoederen in winkels @nl
preferred label: Butikkhandel med brukte varer @no
preferred label: Sprzedaż detaliczna artykułów używanych prowadzona w wyspecjalizowanych sklepach @pl
preferred label: Comércio a retalho de artigos em segunda mão, em estabelecimentos @pt
preferred label: Comerţ cu amănuntul al bunurilor de ocazie vândute prin magazine @ro
preferred label: Розничная торговля подержанными товарами в магазинах @ru
preferred label: Maloobchod s použitým tovarom v predajniach @sk
preferred label: Trgovina na drobno v prodajalnah z rabljenim blagom @sl
preferred label: Specialiserad butikshandel med antikviteter och andra begagnade varor @sv
preferred label: Kullanılmış malların satıldığı mağazalardaki perakende ticaret @tr
broader: Retail sale of other goods in specialised stores

Retail sale via stalls and markets
type: Concept
notation: 47.8
status: valid
status modified: 2013-10-18
accepted date: 2013-10-18
in scheme: Statistical Classification of Economic Activities in the European Community, Rev. 2 (2008)
scope note: Тази група включва търговия на дребно с всякакъв вид нови и употребявани стоки на щандове, подвижни сергии, разположени на пазари или на други определени места за търговия, като тротоари, улици и други подобни. @bg
scope note: Tato skupina zahrnuje maloobchod s novým nebo použitým zbožím všeho druhu většinou v mobilních stáncích na ulicích nebo stabilně v tržnicích @cs
scope note: Diese Gruppe umfasst den Einzelhandel mit Neu- oder Gebrauchtwaren aller Art an meist beweglichen Ständen entweder auf öffentlichen Straßen oder auf festen Marktplätzen. @de
scope note: This group includes the retail sale of any kind of new or second-hand product in a usually movable stall either along a public road or at a fixed marketplace. @en
scope note: Este grupo comprende el comercio al por menor de cualquier tipo de producto nuevo o de segunda mano realizado en puestos ambulantes situados tanto en la vía pública como en mercados destinados al efecto @es
scope note: Ce groupe comprend le commerce de détail de tous types de produits neufs ou d’occasion présentés sur des éventaires, généralement mobiles, installés sur la voie publique ou sur un emplacement de marché déterminé. @fr
scope note: Ova skupina uključuje trgovinu na malo bilo kojom vrstom novih ili rabljenih proizvoda na većinom pokretnim štandovima duž javnih prometnica ili na stalnome mjestu na tržnicama.
scope note: Į šią grupę įeina bet kokios rūšies naujų ar naudotų prekių mažmeninė prekyba, paprastai atliekama kilnojamuosiuose kioskuose, pastatytuose šalia kelių ar prekiauti skirtose vietose. @lt
scope note: Данный раздел включает транспортировку грузов и пассажирские перевозки на автомобилях, по железной дороге, а также транспортировку грузов по трубопроводам. @ru
scope note: Bu grup, bir yol boyunca ya da sabit bir pazarda genellikle taşınabilen bir tezgahta her çeşit yeni veya ikinci el ürünlerin perakende ticaretini kapsamaktadır. @tr
preferred label: Търговия на дребно на открити щандове и пазари @bg
preferred label: Maloobchod ve stáncích a na trzích @cs
preferred label: Detailhandel fra stadepladser og markeder @da
preferred label: Einzelhandel an Verkaufsständen und auf Märkten @de
preferred label: Λιανικό εμπόριο σε υπαίθριους πάγκους και αγορές @el
preferred label: Comercio al por menor en puestos de venta y mercadillos @es
preferred label: Jaemüük kioskites ja turgudel @et
preferred label: Tori- ja markkinakauppa @fi
preferred label: Commerce de détail sur éventaires et marchés @fr
preferred label: Piaci kiskereskedelem
preferred label: Commercio al dettaglio ambulante in bancarelle e mercati @it
preferred label: Mažmeninė prekyba kioskuose ir prekyvietėse @lt
preferred label: Mazumtirdzniecība stendos un tirgos @lv
preferred label: Bejgħ bl-imnut permezz ta' tilari u swieq @mt
preferred label: Markt- en straathandel @nl
preferred label: Torghandel @no
preferred label: Sprzedaż detaliczna prowadzona na straganach i targowiskach @pl
preferred label: Comércio a retalho, em bancas, feiras e unidades móveis de venda @pt
preferred label: Comerţ cu amănuntul efectuat prin standuri, chioşcuri şi pieţe @ro
preferred label: Розничная торговля через палатки и рынки @ru
preferred label: Maloobchod v stánkoch a na trhoch @sk
preferred label: Trgovina na drobno na stojnicah in tržnicah @sl
preferred label: Torg- och marknadshandel @sv
preferred label: Tezgahlar ve pazar yerleri vasıtasıyla yapılan perakende ticaret @tr
broader: Retail trade, except of motor vehicles and motorcycles
narrower: Retail sale via stalls and markets of food, beverages and tobacco products
narrower: Retail sale via stalls and markets of textiles, clothing and footwear
narrower: Retail sale via stalls and markets of other goods

Retail sale via stalls and markets of food, beverages and tobacco products
type: Concept
notation: 47.81
status: valid
status modified: 2013-10-18
accepted date: 2013-10-18
in scheme: Statistical Classification of Economic Activities in the European Community, Rev. 2 (2008)
scope note: - продажба на храни за непосредствена консумация на подвижни сергии - 56.10 @bg
scope note: N: - maloobchod s připravenými potravinami k okamžité spotřebě (občerstvení i v mobilních zařízeních) (56.10) @cs
scope note: Diese Klasse umfasst nicht: - Einzelhandel mit zubereiteten Nahrungsmitteln für den sofortigen Verzehr (mobile Imbissstände) (s. 56.10) @de
scope note: This class excludes: - retail sale of prepared food for immediate consumption (mobile food vendors), see 56.10 @en
scope note: Esta clase no comprende: - el comercio al por menor de comidas aptas para su consumo inmediato (vendedores ambulantes de alimentos) (véase 56.10) @es
scope note: Cette classe ne comprend pas: - le commerce de détail d’aliments préparés destinés à être consommés sur place (services de restauration mobile), voir 56.10 @fr
scope note: Ovaj razred isključuje: - trgovinu na malo pripremljenom hranom za konzumiranje na „licu mjesta", vidi 56.10
scope note: Į šią klasę neįeina: - paruošto maisto, skirto vartoti nedelsiant, mažmeninė prekyba (mobilieji prekiautojai maistu), žr. 56.10 @lt
scope note: Kapsam dışı olanlar; - hemen tüketilmeye yönelik hazır gıdaların perakende ticareti (seyyar yiyecek satıcıları), bkz. 56.10. @tr
preferred label: Търговия на дребно на открити щандове и пазари с хранителни стоки, напитки и тютюневи изделия @bg
preferred label: Maloobchod s potravinami, nápoji a tabákovými výrobky ve stáncích a na trzích @cs
preferred label: Detailhandel med føde-, drikke- og tobaksvarer fra stadepladser og markeder @da
preferred label: Einzelhandel mit Nahrungs- und Genussmitteln, Getränken und Tabakwaren an Verkaufsständen und auf Märkten @de
preferred label: Λιανικό εμπόριο τροφίμων, ποτών και καπνού σε υπαίθριους πάγκους και αγορές @el
preferred label: Comercio al por menor de productos alimenticios, bebidas y tabaco en puestos de venta y mercadillos @es
preferred label: Toidukaupade, jookide ja tubakatoodete jaemüük kioskites ja turgudel @et
preferred label: Elintarvikkeiden, juomien ja tupakkatuotteiden vähittäiskauppa kojuista ja toreilla @fi
preferred label: Commerce de détail alimentaire sur éventaires et marchés @fr
preferred label: Élelmiszer, ital, dohányáru piaci kiskereskedelme
preferred label: Commercio al dettaglio ambulante in bancarelle e mercati di prodotti alimentari, bevande e tabacco @it
preferred label: Maisto, gėrimų ir tabako gaminių mažmeninė prekyba kioskuose ir prekyvietėse @lt
preferred label: Pārtikas, dzērienu un tabakas izstrādājumu mazumtirdzniecība stendos un tirgos @lv
preferred label: Bejgħ bl-imnut permezz ta' tilari u swieq, ta' ikel, xorb u prodotti tat-tabakk @mt
preferred label: Markt- en straathandel in voedings- en genotmiddelen @nl
preferred label: Torghandel med næringsmidler, drikkevarer og tobakksvarer @no
preferred label: Sprzedaż detaliczna żywności, napojów i wyrobów tytoniowych prowadzona na straganach i targowiskach @pl
preferred label: Comércio a retalho, em bancas, feiras e unidades móveis de venda, de produtos alimentares, bebidas e tabaco @pt
preferred label: Comerţ cu amănuntul al produselor alimentare, băuturilor şi produselor din tutun efectuat prin standuri, chioşcuri şi pieţe @ro
preferred label: Розничная торговля продуктами питания, напитками и табачными изделиями в торговых палатках и на рынке @ru
preferred label: Maloobchod v stánkoch a na trhoch s potravinami, nápojmi a tabakom @sk
preferred label: Trgovina na drobno na stojnicah in tržnicah z živili, pijačami in tobačnimi izdelki @sl
preferred label: Torg- och marknadshandel med livsmedel, drycker och tobak @sv
preferred label: Tezgahlar ve pazar yerleri vasıtasıyla gıda, içecek ve tütün ürünleri perakende ticareti @tr
broader: Retail sale via stalls and markets

Retail sale via stalls and markets of textiles, clothing and footwear
type: Concept
notation: 47.82
status: valid
status modified: 2013-10-18
accepted date: 2013-10-18
in scheme: Statistical Classification of Economic Activities in the European Community, Rev. 2 (2008)
scope note: Этот класс включает: - железнодорожные пассажирские перевозки с использованием передвижного состава по основным путям сообщения, расположенным на обширной географической территории - пассажирские перевозки по железным дорогам междугороднего сообщения - услуги спальных вагонов или вагонов-ресторанов как неотъемлемую часть деятельности железнодорожных компаний Этот класс исключает: - пассажирские перевозки посредством городских и сельских транспортных систем, см. 49.31 - деятельность пассажирских железнодорожных станций, см. 52.21 - управление железнодорожной инфраструктурой, соответствующие операции, связанные с маневрированием и составлением поездов, см. 52.21 - услуги спальных вагонов и вагонов-ресторанов, если они предоставляются отдельными фирмами, см. 55.90, 56.10 @ru
preferred label: Търговия на дребно на открити щандове и пазари с текстил, облекло и обувки @bg
preferred label: Maloobchod s textilem, oděvy a obuví ve stáncích a na trzích @cs
preferred label: Detailhandel med tekstiler, beklædningsartikler og fodtøj fra stadepladser og markeder @da
preferred label: Einzelhandel mit Textilien, Bekleidung und Schuhen an Verkaufsständen und auf Märkten @de
preferred label: Λιανικό εμπόριο κλωστοϋφαντουργικών προϊόντων, ενδυμάτων και υποδημάτων σε υπαίθριους πάγκους και αγορές @el
preferred label: Comercio al por menor de productos textiles, prendas de vestir y calzado en puestos de venta y mercadillos @es
preferred label: Tekstiili, rõivaste ja jalatsite jaemüük kioskites ja turgudel @et
preferred label: Tekstiilien, vaatteiden ja jalkineiden vähittäiskauppa kojuista ja toreilla @fi
preferred label: Commerce de détail de textiles, d'habillement et de chaussures sur éventaires et marchés @fr
preferred label: Textil, ruházat, lábbeli piaci kiskereskedelme
preferred label: Commercio al dettaglio ambulante in bancarelle e mercati di prodotti tessili, abbigliamento e calzature @it
preferred label: Tekstilės, drabužių ir avalynės mažmeninė prekyba kioskuose ir prekyvietėse @lt
preferred label: Tekstilizstrādājumu, apģērbu un apavu mazumtirdzniecība stendos un tirgos @lv
preferred label: Bejgħ bl-imnut permezz ta' swieq, ta' tessuti, ħwejjeġ u xedd tas-saqajn @mt
preferred label: Markt- en straathandel in textiel, kleding en schoeisel @nl
preferred label: Torghandel med tekstiler, klær, skotøy og utstyrsvarer @no
preferred label: Sprzedaż detaliczna wyrobów tekstylnych, odzieży i obuwia prowadzona na straganach i targowiskach @pl
preferred label: Comércio a retalho, em bancas, feiras e unidades móveis de venda, de têxteis, vestuário e calçado @pt
preferred label: Comerţ cu amănuntul al textilelor, îmbrăcămintei şi încălţămintei efectuat prin standuri, chioşcuri şi pieţe @ro
preferred label: Розничная торговля одеждой, обувью и тканями в торговых палатках и на рынке @ru
preferred label: Maloobchod v stánkoch a trhoch s textilom, odevmi a obuvou @sk
preferred label: Trgovina na drobno na stojnicah in tržnicah s tekstilijami in obutvijo @sl
preferred label: Torg- och marknadshandel med textilier, kläder och skodon @sv
preferred label: Tezgahlar ve pazar yerleri vasıtasıyla tekstil, giyim eşyası ve ayakkabı perakende ticareti @tr
broader: Retail sale via stalls and markets

Retail sale via stalls and markets of other goods
type: Concept
notation: 47.89
status: valid
status modified: 2013-10-18
accepted date: 2013-10-18
in scheme: Statistical Classification of Economic Activities in the European Community, Rev. 2 (2008)
scope note: - търговия на дребно на открити щандове и пазари с други стоки: • килими и пътеки • книги • игри и играчки • домакински уреди и битова електроника • аудио и видео записи @bg
scope note: Z: - maloobchod s ostatním zbožím na stáncích a na trzích, jako: • koberci, koberečky a běhouny • knihami • hrami a hračkami • domácími spotřebiči a spotřební elektronikou • hudebními nahrávkami a videozáznamy @cs
scope note: Diese Klasse umfasst: - Einzelhandel mit sonstigen Gütern an Verkaufsständen und auf Märkten, z. B.: • Teppiche, Brücken und Läufer • Bücher • Spiele und Spielwaren • Haushaltsgeräte und Unterhaltungselektronikgeräte • Musik- und Videoaufnahmen @de
scope note: This class includes: - retail sale of other goods via stalls or markets, such as: • carpets and rugs • books • games and toys • household appliances and consumer electronics • music and video recordings @en
scope note: Esta clase comprende: - el comercio al por menor de otros tipos de bienes en puestos de venta y en mercadillos, por ejemplo: • alfombras y moquetas • libros • juegos y juguetes • aparatos domésticos y electrónica de consumo • grabaciones musicales y de vídeo @es
scope note: Cette classe comprend: - les autres commerces de détail sur éventaires et marchés: • tapis et moquettes • livres • jeux et jouets • appareils ménagers et produits électroniques grand public • enregistrements musicaux et vidéo @fr
scope note: Ovaj razred uključuje: - trgovinu na malo ostalom robom na štandovima i tržnicama kao što su: • sagovi i prostirači • knjige • igre i igračke • aparati za kućanstvo i elektronički uređaji za široku potrošnju • glazbeni i videozapisi
scope note: Į šią klasę įeina: - mažmeninė prekyba kioskuose arba turgavietėse kitomis prekėmis, tokiomis kaip: • kilimai ir kilimėliai • knygos • žaidimas ir žaislas • buitiniai prietaisai ir buitinė elektroninė aparatūra • muzikos ir vaizdo įrašai @lt
scope note: Bu sınıf aşağıdakileri kapsamaktadır; - tezgahlar ve pazar yerleri vasıtasıyla aşağıdakiler gibi diğer malların perakende ticareti: • halı ve kilimler, • kitaplar, • oyunlar ve oyuncaklar, • ev aletleri ve elektronik aletler, • müzik ve video bantları. @tr
preferred label: Търговия на дребно на открити щандове и пазари с други стоки @bg
preferred label: Maloobchod s ostatním zbožím ve stáncích a na trzích @cs
preferred label: Detailhandel med andre varer fra stadepladser og markeder @da
preferred label: Einzelhandel mit sonstigen Gütern an Verkaufsständen und auf Märkten @de
preferred label: Λιανικό εμπόριο άλλων ειδών σε υπαίθριους πάγκους και αγορές @el
preferred label: Comercio al por menor de otros productos en puestos de venta y mercadillos @es
preferred label: Muude kaupade jaemüük kioskites ja turgudel @et
preferred label: Muiden tavaroiden vähittäiskauppa kojuista ja toreilla @fi
preferred label: Autres commerces de détail sur éventaires et marchés @fr
preferred label: Egyéb áruk piaci kiskereskedelme
preferred label: Commercio al dettaglio ambulante in bancarelle e mercati di altri prodotti @it
preferred label: Kitų prekių mažmeninė prekyba kioskuose ir prekyvietėse @lt
preferred label: Citu preču mazumtirdzniecība stendos un tirgos @lv
preferred label: Bejgħ bl-imnut permezz ta' tilari u swieq, ta' oġġetti oħra @mt
preferred label: Markt- en straathandel in andere artikelen @nl
preferred label: Torghandel med andre varer @no
preferred label: Sprzedaż detaliczna pozostałych wyrobów prowadzona na straganach i targowiskach @pl
preferred label: Comércio a retalho, em bancas, feiras e unidades móveis de venda, de outros produtos @pt
preferred label: Comerţ cu amănuntul prin standuri, chioşcuri şi pieţe al altor produse @ro
preferred label: Розничная торговля прочими товарами через палатки и рынки @ru
preferred label: Maloobchod v stánkoch a na trhoch s ostatným tovarom @sk
preferred label: Trgovina na drobno na stojnicah in tržnicah z drugim blagom @sl
preferred label: Torg- och marknadshandel med övriga varor @sv
preferred label: Tezgahlar ve pazar yerleri vasıtasıyla diğer malların perakende ticareti @tr
broader: Retail sale via stalls and markets

Retail trade not in stores, stalls or markets
type: Concept
notation: 47.9
status: valid
status modified: 2013-10-18
accepted date: 2013-10-18
in scheme: Statistical Classification of Economic Activities in the European Community, Rev. 2 (2008)
scope note: Тази група включва търговия на дребно чрез поръчки по пощата, Интернет, доставка по домовете, чрез автомати и други. @bg
scope note: Tato skupina zahrnuje maloobchodní činnost zásilkových domů, maloobchod prostřednictvím internetu, podomní prodej, prodej v automatech atd. @cs
scope note: Diese Gruppe umfasst Einzelhandelstätigkeiten von Versandhäusern, über das Internet, im Haustürverkauf, Automatenverkauf usw. @de
scope note: This group includes retail sale activities by mail order houses, over the Internet, through door-to-door sales, vending machines etc. @en
scope note: Este grupo comprende las actividades de comercio al por menor realizas por correspondencia, por Internet, a domicilio, en máquinas expendedoras, etc. @es
scope note: Ce groupe comprend le commerce de détail par correspondance, par Internet, par démarcheurs, par distributeurs automatiques, etc. @fr
scope note: Ova skupina uključuje djelatnosti trgovine na malo preko pošte, interneta, prodajom od vrata do vrata, pomoću samoposlužnih aparata itd.
scope note: Į šią grupę įeina mažmeninė prekyba, atliekama užsakant prekes paštu, internetu, išnešiojamoji prekyba, prekyba iš automatų smulkioms prekėms pardavinėti ir kt. @lt
scope note: Этот класс включает: - грузовые перевозки по магистральным железнодорожным сетям, а также по грузовым путям, предназначенным для переправки небольших партий груза Этот класс исключает: - складирование и хранение груза, см. 52.10 - деятельность грузовых железнодорожных станций, см. 52.21 - управление железнодорожной инфраструктурой, соответствующие операции, связанные с маневрированием и составлением поездов, см. 52.21 - погрузочно-разгрузочные работы, см. 52.24 @ru
scope note: Bu grup posta yoluyla, internet üzerinden, kapı kapı dolaşılarak, otomatik satış makineleri vasıtasıyla yapılan perakende ticaret faaliyetlerini kapsamaktadır. @tr
preferred label: Търговия на дребно извън търговски обекти @bg
preferred label: Maloobchod mimo prodejny, stánky a trhy @cs
preferred label: Detailhandel undtagen fra forretninger, stadepladser og markeder @da
preferred label: Einzelhandel, nicht in Verkaufsräumen, an Verkaufsständen oder auf Märkten @de
preferred label: Λιανικό εμπόριο εκτός καταστημάτων, υπαίθριων πάγκων ή αγορών @el
preferred label: Comercio al por menor no realizado ni en establecimientos, ni en puestos de venta ni en mercadillos @es
preferred label: Jaemüük väljaspool kauplusi, kioskeid ja turge @et
preferred label: Vähittäiskauppa muualla kuin myymälöissä (pl. tori- ja markkinakauppa) @fi
preferred label: Commerce de détail hors magasin, éventaires ou marchés @fr
preferred label: Nem bolti, piaci kiskereskedelem
preferred label: Commercio al dettaglio al di fuori dei negozi, delle bancarelle e dei mercati @it
preferred label: Mažmeninė prekyba ne parduotuvėse, kioskuose ar prekyvietėse @lt
preferred label: Mazumtirdzniecība ārpus veikaliem, stendiem un tirgiem @lv
preferred label: Bejgħ bl-imnut mhux minn tilari jew swieq @mt
preferred label: Detailhandel, niet in winkels en exclusief markt- en straathandel @nl
preferred label: Detaljhandel utenom utsalgssted @no
preferred label: Sprzedaż detaliczna prowadzona poza siecią sklepową, straganami i targowiskami @pl
preferred label: Comércio a retalho não efectuado em estabelecimentos, bancas, feiras ou unidades móveis de venda @pt
preferred label: Comerţ cu amănuntul care nu se efectuează prin magazine, standuri, chioşcuri şi pieţe @ro
preferred label: Розничная торговля не через магазины и рынки @ru
preferred label: Maloobchod mimo predajní, stánkov a trhov @sk
preferred label: Trgovina na drobno zunaj prodajaln, stojnic in tržnic @sl
preferred label: Detaljhandel, ej i butik, på torg eller marknad @sv
preferred label: Mağazalar, tezgahlar ve pazar yerleri dışında yapılan perakende ticaret @tr
broader: Retail trade, except of motor vehicles and motorcycles
narrower: Retail sale via mail order houses or via Internet
narrower: Other retail sale not in stores, stalls or markets

Retail sale via mail order houses or via Internet
type: Concept
notation: 47.91
status: valid
status modified: 2013-10-18
accepted date: 2013-10-18
in scheme: Statistical Classification of Economic Activities in the European Community, Rev. 2 (2008)
scope note: При търговията на дребно в този клас купувачът прави своя избор на базата на рекламни брошури, каталози, информация в интернет страници, мостри или всякакви други рекламни средства. Покупките се осъществяват чрез поръчки по пощата, телефона или Интернет (обикновено чрез специални технически средства, с които са снабдени уебстраниците). Закупената стока може да бъде директно изтеглена от Интернет или физически доставена до мястото на купувача. - търговия на дребно с разнообразни стоки чрез поръчки по пощата - търговия на дребно с разнообразни стоки по Интернет - директни продажби чрез телефон, радио и телевизия - дейности по продажби на дребно чрез търг по Интернет - търговия на дребно по Интернет с автомобили и части и принадлежности за тях - 45.1, 45.3 - търговия на дребно по Интернет с мотоциклети и части и принадлежности за тях - 45.40 @bg
scope note: Tato třída zahrnuje maloobchodní činnosti zásilkových domů nebo prostřednictvím internetu. Kupující si vybírá na základě reklamy, katalogů, informací na webových stránkách, vzorků nebo jiných reklamních prostředků. Objednávka se provádí poštou, telefonicky nebo přes internet (zpravidla pomocí zvláštního zařízení na některé webové stránce). Zakoupené produkty mohou být přímo staženy z internetu nebo fyzicky dodány zákazníkovi. Z: - maloobchod jakéhokoliv druhu zboží zásilkovou službou - maloobchod se zbožím všeho druhu prostřednictvím internetu ZT: - přímý prodej prostřednictvím televize, rádia a telefonu - internetové maloobchodní aukce N: - maloobchod s motorovými vozidly a s díly a příslušenstvím motorových vozidel prostřednictvím internetu (45.1, 45.3) - maloobchod s motocykly a s díly a příslušenstvím motocyklů prostřednictvím internetu (45.40) @cs
scope note: Diese Klasse umfasst Einzelhandelstätigkeiten des Versandhandels, auch unter Einsatz des Internets. Dabei trifft der Käufer seine Wahl anhand von Anzeigen, Katalogen, Informationen auf Webseiten, Mustern oder anderen Werbemitteln. Die Bestellung erfolgt per Post, telefonisch oder über das Internet (in der Regel mit Hilfe besonderer Einrichtungen auf einer Webseite). Die erworbenen Produkte können entweder direkt aus dem Internet heruntergeladen oder physisch an den Kunden ausgeliefert werden. Diese Klasse umfasst: - Versand-Einzelhandel mit Waren aller Art - Internet-Einzelhandel mit Waren aller Art Diese Klasse umfasst ferner: - Direktverkauf über Fernsehen, Hörfunk und Telefon - Internet-Auktionen (Einzelhandel) Diese Klasse umfasst nicht: - Einzelhandel mit Kraftfahrzeugen und Kraftfahrzeugteilen und –zubehör über das Internet (s. 45.1, 45.3) - Einzelhandel mit Krafträdern und Kraftradteilen und –zubehör über das Internet (s. 45.40) @de
scope note: This class includes retail sale activities via mail order houses or via Internet, i.e. retail sale activities where the buyer makes his choice on the basis of advertisements, catalogues, information provided on a website, models or any other means of advertising and places his order by mail, phone or over the Internet (usually through special means provided by a website). The products purchased can be either directly downloaded from the Internet or physically delivered to the customer. This class includes: - retail sale of any kind of product by mail order - retail sale of any kind of product over the Internet This class also includes: - direct sale via television, radio and telephone - Internet retail auctions This class excludes: - retail sale of motor vehicles and motor vehicles parts and accessories over the Internet, see groups 45.1, 45.3 - retail sale of motorcycles and motorcycles parts and accessories over the Internet, see 45.40 @en
scope note: Esta clase comprende las actividades de comercio al por menor por correspondencia o por Internet, es decir, el comercio al por menor en el que el comprador elige los productos a partir de anuncios publicitarios, catálogos de información facilitada en un sitio web, muestrarios o cualquier otro tipo de oferta, y efectúa su pedido por correo, teléfono o Internet (suele hacerse por medios especiales que facilita un sitio web). Los productos comprados pueden descargarse directamente de Internet o entregarse físicamente al cliente. Esta clase comprende: - el comercio al por menos de cualquier tipo de producto por correo - el comercio al por menos de cualquier tipo de producto por medio de Internet Esta clase comprende también: - la venta directa a través de la televisión, la radio o el teléfono - las subastas por Internet (al por menor) Esta clase no comprende: - la venta al por menor de vehículos de motor y de sus repuestos y accesorios por Internet (véanse los grupos 45.1 y 45.3) - la venta al por menor de motocicletas y de sus repuestos y accesorios por Internet (véase 45.40) @es
scope note: Cette classe comprend le commerce de détail, par correspondance ou par Internet, c'est-à-dire le commerce de détail où l’acheteur fait son choix à l’aide de publicités, de catalogues, d’informations figurant sur un site web, de modèles ou de tout autre moyen publicitaire et effectue sa commande par courrier, téléphone ou Internet (en général grâce à des procédures particulières prévues par les sites web). Les produits achetés peuvent être téléchargés directement sur Internet ou livrés physiquement au client. Cette classe comprend: - le commerce de détail de tous types de produits par correspondance - le commerce de détail de tous types de produits par Internet Cette classe comprend également: - la vente directe par téléphone ou par le truchement de la radio ou de la télévision - les activités de vente aux enchères au détail sur Internet Cette classe ne comprend pas: - le commerce de détail de véhicules automobiles et de leurs pièces et accessoires par Internet, voir les groupes 45.1 et 45.3 - le commerce de détail de motocycles et de leurs pièces et accessoires par Internet, voir 45.40 @fr
scope note: Ovaj razred uključuje djelatnosti trgovine na malo preko pošte ili interneta, tj. djelatnosti trgovine na malo kada kupac donosi odluku o kupnji na osnovi oglasa, kataloga, informacije dobivene s internetskih stranica ili nekih drugih oblika oglašavanja. Kupac naručuje robu poštom, telefonom ili preko interneta (obično pomoću posebnih metoda naručivanja koje se nalaze na internetskim stranicama). Kupljeni proizvodi se mogu preuzeti izravno s interneta ili se fizički dostavljaju kupcu (naručitelju). Ovaj razred uključuje: - trgovinu na malo bilo kojom vrstom proizvoda preko pošte - trgovinu na malo bilo kojom vrstom proizvoda preko interneta Ovaj razred također uključuje: - izravnu prodaju preko televizije, radija i telefona - dražbe preko interneta u vezi s trgovinom na malo Ovaj razred isključuje: - trgovinu na malo motornim vozilima te dijelovima i priborom za motorna vozila putem interneta, vidi skupine 45.1, 45.3 - trgovinu na malo motociklima te dijelovima i priborom za motocikle putem interneta, vidi 45.40
scope note: Į šią klasę įeina užsakomasis pardavimas paštu arba internetu, t.y. mažmeninės prekybos veikla, kai pirkėjas remdamasis reklama, katalogais, informacija, pateikta interneto svetainėje, modeliais arba kitomis reklamos priemonėmis pasirenka prekes ir užsako jas paštu, telefonu arba internetu (paprastai naudojamasi specialiomis svetainės priemonėmis). Užsakyta prekė gali būti tiesiogiai atsiųsta internetu arba pristatyta pirkėjui fiziniu būdu. Į šią klasę įeina: - visų rūšių produktų mažmeninė prekyba, užsakant prekes paštu - visų rūšių produktų mažmeninė prekyba, užsakant prekes internetu Į šią klasę taip pat įeina: - tiesioginė prekyba per televiziją, radiją ar telefonu - mažmeniniai aukcionai internetu Į šią klasę neįeina: - mažmeninė prekyba variklinėmis transporto priemonėmis, variklinių transporto priemonių dalimis ir pagalbiniais reikmenimis internetu, žr. grupes 45.1, 45.3 - mažmeninė prekyba motociklais, motociklų dalimis ir pagalbiniais reikmenimis internetu, žr. 45.40 @lt
scope note: Данная группа включает все наземные пассажирские перевозки, за исключением железнодорожных перевозок. Однако перевозки по внутригородским и пригородным железным дорогам, включены в данную группу. @ru
scope note: Bu sınıf, posta ile satış yapan evler veya internet yoluyla perakende satış faaliyetlerini, yani alıcının reklamlara, kataloglara, bir web sitesinden sağlanan bilgiye, modellere ve diğer reklam araçlarına dayalı olarak seçimini yaptığı ve siparişini posta, telefon veya internet üzerinden (genellikle bir web sitesi tarafından sağlanan özel aletler vasıtasıyla) verdiği perakende satış faaliyetlerini kapsamaktadır. Satın alınan ürünler ya doğrudan internetten yüklenebilmekte ya da fiziki olarak müşteriye ulaştırılmaktadır.Bu sınıf aşağıdakileri kapsamaktadır; - posta siparişi vasıtasıyla her çeşit ürünün perakende ticareti, - internet üzerinden her çeşit ürünün perakende ticareti. Ayrıca bu sınıf aşağıdakileri de kapsamaktadır; - televizyon, radyo ve telefon yoluyla doğrudan satış, - internet üzerinden perakende müzayedeler. Kapsam dışı olanlar; - internet üzerinden motorlu taşıtların ve motorlu taşıt parçalarının ve aksesuarlarının perakende satışı, bkz. Grup 45.1 ve Grup 45.3, - internet üzerinden motosikletlerin ve motosiklet parçalarının ve aksesuarlarının perakende satışı, bkz. 45.40. @tr
preferred label: Търговия на дребно чрез поръчки по пощата, телефона или Интернет @bg
preferred label: Maloobchod prostřednictvím internetu nebo zásilkové služby @cs
preferred label: Detailhandel fra postordre- eller internetforretninger @da
preferred label: Versand- und Internet-Einzelhandel @de
preferred label: Λιανικό εμπόριο από επιχειρήσεις πωλήσεων με αλληλογραφία ή μέσω διαδικτύου @el
preferred label: Comercio al por menor por correspondencia o Internet @es
preferred label: Jaemüük posti või Interneti teel @et
preferred label: Vähittäiskauppa postimyyntiliikkeiden tai Internetin välityksellä @fi
preferred label: Vente à distance @fr
preferred label: Csomagküldő, internetes kiskereskedelem
preferred label: Commercio al dettaglio per corrispondenza o attraverso Internet @it
preferred label: Užsakomasis pardavimas paštu arba internetu @lt
preferred label: Mazumtirdzniecība pa pastu vai Interneta veikalos @lv
preferred label: Bejgħ bl-imnut permezz ta' postijiet għall-ordnijiet bil-posta jew permezz ta' l-Internet @mt
preferred label: Detailhandel via postorderbedrijven of via internet @nl
preferred label: Postordrehandel og handel via internett @no
preferred label: Sprzedaż detaliczna prowadzona przez domy sprzedaży wysyłkowej lub Internet @pl
preferred label: Comércio a retalho por correspondência ou via Internet @pt
preferred label: Comerţ cu amănuntul prin intermediul caselor de comenzi sau prin Internet @ro
preferred label: Розничная торговля через фирмы, выполняющие заказы по почте и через Интернет @ru
preferred label: Zásielkový predaj alebo predaj cez internet @sk
preferred label: Trgovina na drobno po pošti ali po internetu @sl
preferred label: Postorderhandel och detaljhandel på Internet @sv
preferred label: Posta yoluyla veya internet üzerinden yapılan perakende ticaret @tr
broader: Retail trade not in stores, stalls or markets

Other retail sale not in stores, stalls or markets
type: Concept
notation: 47.99
status: valid
status modified: 2013-10-18
accepted date: 2013-10-18
in scheme: Statistical Classification of Economic Activities in the European Community, Rev. 2 (2008)
scope note: - търговия на дребно с разнообразни стоки, осъществявана с различни средства, некласифицирана другаде: • директни продажби или доставки по домовете • чрез автомати - директни продажби на нафта за отопление, газ в бутилки, дърва за горене и други, доставени до мястото на клиента - други продажби на дребно чрез търг (с изключение на продажбите чрез търг по Интернет) - търговия на дребно извън търговски обекти чрез търговски агенти @bg
scope note: Z: - maloobchod s nejrůznějším zbožím a formami prodeje neuvedenými v předchozích třídách: • přímý prodej nebo podomní prodej • prodej v automatech atd. - přímý prodej paliv (topný olej, palivové dříví atd.), která jsou dodávána zákazníkům - provozovatelům (domů, závodů atd.) - maloobchodní aukce mimo prodejní prostory (kromě internetu) - maloobchod prostřednictvím obchodních zástupců (mimo prostory prodejen) @cs
scope note: Diese Klasse umfasst: - Einzelhandel mit Waren aller Art und in allen Vertriebsformen a. n. g.: • Direktverkauf oder Haustürverkauf • Automatenverkauf usw. - Direktverkauf von Brennstoffen (Heizöl, Brennholz usw.), die an die Kunden ausgeliefert werden - Auktionen nicht in Verkaufsräumen (Einzelhandel, ausgenommen Internet) - Einzelhandel durch Handelsvertreter (nicht in Verkaufsräumen) @de
scope note: This class includes: - retail sale of any kind of product in any way that is not included in previous classes: • by direct sales or door-to-door sales persons • through vending machines etc. - direct selling of fuel (heating oil, firewood, etc.), delivered to the customers premises - activities of non-store auctions (retail, except Internet) - retail sale by (non-store) commission agents @en
scope note: Esta clase comprende: - el comercio al por menor de cualquier tipo de producto realizado de una forma que no esté comprendida en ninguna de las clases anteriores: • por medio de venta directa o vendedores a domicilio • por medio de máquinas expendedoras, etc. - venta directa de combustible (combustible para calefacción, leña, etc.) entregada en las instalaciones del cliente - las actividades de las subastas no realizadas en establecimientos (al por menor, excepto por Internet) - el comercio al por menor por intermediarios no realizada en establecimientos @es
scope note: Cette classe comprend: - le commerce de détail de tous types de produits exercé selon des modalités non prévues dans les classes précédentes: • vente directe ou démarcheurs • par distributeurs automatiques, etc. - la vente directe de combustibles (mazout, bois de chauffage, etc.) livrés chez le client - les autres activités de vente aux enchères hors magasin (détail, à l’exception d’Internet) - le commerce de détail (hors magasin) par des intermédiaires du commerce @fr
scope note: Ovaj razred uključuje: - trgovinu na malo bilo kojom vrstom proizvoda koja nije uključena u prethodnim razredima: • izravnu prodaju ili prodaju od vrata do vrata • prodaju pomoću samoposlužnih aparata itd. - izravnu prodaju goriva (loživog ulja, drva za loženje, itd.), uz dostavu kupcu - dražbe izvan prodavaonica (u vezi s trgovinom na malo) - trgovinu na malo preko posrednika (izvan prodavaonica)
scope note: Į šią klasę įeina: - įvairių produktų ar gaminių mažmeninė prekyba bet kokiu, ankstesnėse klasėse nenurodytu būdu: • tiesioginė ar išnešiojamoji prekyba per prekiautojus • iš automatų smulkioms prekėms pardavinėti ir kt. - tiesioginė prekyba degalais (krosnių kuru, malkomis ir kt.), pristatomais į pirkėjo patalpas - mažmeninių aukcionų ne parduotuvėse (išskyrus internetu) veikla - mažmeninė prekyba ne parduotuvėse per komiso agentus @lt
scope note: Этот класс включает: - наземные пассажирские перевозки посредством внутригородских и пригородных транспортных систем. Сюда могут относиться различные виды наземного транспорта, такие как автобусы, трамваи, троллейбусы, метро и подвесная железная дорога и т.д. Перевозки осуществляются по установленному маршруту в соответствии с заранее разработанным расписанием на основе посадки и высадки пассажиров на специально отведенных станциях. Этот класс также включает: - линии, соединяющие город с аэропортом и аэропорт с городом - управление канатными дорогами, подвесными канатными дорогами и т.д., если это входит в систему внутригородских и пригородных перевозок Этот класс исключает: - пассажирские перевозки по междугородним железным дорогам, см. 49.10 @ru
scope note: Bu sınıf aşağıdakileri kapsamaktadır; - önceki sınıflarda hiçbir şekilde dahil edilmemiş olan her çeşit ürünün perakende ticareti: • doğrudan satışlar veya kapı kapı dolaşılarak yapılan satışlar, • otomatik satış makineleri vb. aracılığıyla yapılan satış, - müşterinin istediği yere ulaştırılarak yapılan doğrudan yakıt satışı, (kalorifer yakıtı, yakacak odun vb.) - mağaza dışı müzayede faaliyetleri (perakende, internet hariç), - komisyoncular tarafından yapılan (mağaza dışı) perakende satış. @tr
preferred label: Търговия на дребно извън търговски обекти, некласифицирана другаде @bg
preferred label: Ostatní maloobchod mimo prodejny, stánky a trhy @cs
preferred label: Anden detailhandel undtagen fra forretninger, stadepladser og markeder @da
preferred label: Sonstiger Einzelhandel, nicht in Verkaufsräumen, an Verkaufsständen oder auf Märkten @de
preferred label: Άλλο λιανικό εμπόριο εκτός καταστημάτων, υπαίθριων πάγκων ή αγορών @el
preferred label: Otro comercio al por menor no realizado ni en establecimientos, ni en puestos de venta ni en mercadillos @es
preferred label: Muu jaemüük väljaspool kauplusi, kioskeid ja turge @et
preferred label: Muu vähittäiskauppa muualla kuin myymälöissä @fi
preferred label: Autres commerces de détail hors magasin, éventaires ou marchés @fr
preferred label: Egyéb nem bolti, piaci kiskereskedelem
preferred label: Altri tipi di commercio al dettaglio al di fuori dei negozi, delle bancarelle e dei mercati @it
preferred label: Kita mažmeninė prekyba ne parduotuvėse, kioskuose ar prekyvietėse @lt
preferred label: Pārējā mazumtirdzniecība ārpus veikaliem, stendiem un tirgiem @lv
preferred label: Bejgħ ieħor bl-imnut mhux minn ħwienet, tilari jew swieq @mt
preferred label: Overige detailhandel, niet in winkels en exclusief markt- en straathandel @nl
preferred label: Detaljhandel utenom utsalgssted ellers @no
preferred label: Sprzedaż detaliczna pozostała prowadzona poza siecią sklepową, straganami i targowiskami @pl
preferred label: Comércio a retalho por outros métodos, não efectuado em estabelecimentos, bancas, feiras ou unidades móveis de venda @pt
preferred label: Comerţ cu amănuntul efectuat în afara magazinelor, standurilor, chioşcurilor şi pieţelor @ro
preferred label: Другие виды розничной торговли вне магазинов, торговых палаток или рынков @ru
preferred label: Ostatný maloobchod mimo predajní, stánkov a trhov @sk
preferred label: Druga trgovina na drobno zunaj prodajaln, stojnic in tržnic @sl
preferred label: Övrig detaljhandel, ej i butik, på torg eller marknad @sv
preferred label: Mağazalar, tezgahlar ve pazar yerleri dışında yapılan diğer perakende ticaret @tr
broader: Retail trade not in stores, stalls or markets

Land transport and transport via pipelines
type: Concept
notation: 49
status: valid
status modified: 2013-10-18
accepted date: 2013-10-18
in scheme: Statistical Classification of Economic Activities in the European Community, Rev. 2 (2008)
scope note: превоз на пътници и товари с автомобилен и железопътен транспорт, както и пренос на продукти с тръбопроводен транспорт. @bg
scope note: Tento oddíl zahrnuje dopravu osob a nákladů po silnících a kolejích a nákladní dopravu potrubím. @cs
scope note: Diese Abteilung umfasst die Beförderung von Personen und Gütern auf Straßen und Schienen sowie von Gütern in Rohrfernleitungen. @de
scope note: This division includes the transport of passengers and freight via road and rail, as well as freight transport via pipelines. @en
scope note: Esta división comprende el transporte de pasajeros y mercancías por carretera y ferrocarril, así como el transporte de mercancías por tubería. @es
scope note: Cette division couvre les activités de transport de passagers et de marchandises par la route et le rail, ainsi que le transport de marchandises par conduites. @fr
scope note: Ovaj odjeljak uključuje prijevoz putnika ili robe cestom i željeznicom, kao i prijevoz robe cjevovodima.
scope note: Į šį skyrių įeina keleivių ir krovinių vežimas keliais ir geležinkeliais, taip pat krovinių transportavimas vamzdynais. @lt
scope note: Этот класс включает: - прочие виды пассажирских перевозок: • услуги рейсовых автобусов дальнего следования • чартерные рейсы, экскурсии и прочие услуги, предоставляемые на нерегулярной основе • автобусы аэропортов - управление конвейерами, канатными дорогами, горнолыжными и канатными подъемниками, если они не входят в систему городских и междугородних транспортных перевозок Этот класс также включает: - управление школьными и служебными автобусами - пассажирские перевозки при управлении человеком или на гужевой тяге Этот класс исключает: - услуги транспорта скорой медицинской помощи, см. 86.90 @ru
scope note: Bu bölüm, boru hatları vasıtasıyla yük taşınması dahil karayolu ve demiryolu vasıtasıyla yük ve yolcuların taşınmasını kapsamaktadır. @tr
preferred label: Сухопътен транспорт @bg
preferred label: Pozemní a potrubní doprava @cs
preferred label: Landtransport; rørtransport @da
preferred label: Landverkehr und Transport in Rohrfernleitungen @de
preferred label: Χερσαίες μεταφορές και μεταφορές μέσω αγωγών @el
preferred label: Transporte terrestre y por tubería @es
preferred label: Maismaaveondus ja torutransport @et
preferred label: Maaliikenne ja putkijohtokuljetus @fi
preferred label: Transports terrestres et transport par conduites @fr
preferred label: Szárazföldi, csővezetékes szállítás
preferred label: Trasporto terrestre e trasporto mediante condotte @it
preferred label: Sausumos transportas ir transportavimas vamzdynais @lt
preferred label: Sauszemes transports un cauruļvadu transports @lv
preferred label: Trasport bl-art u transport permezz ta' sistemi ta' katusi @mt
preferred label: Vervoer te land en vervoer via pijpleidingen @nl
preferred label: Landtransport og rørtransport @no
preferred label: Transport lądowy oraz transport rurociągowy @pl
preferred label: Transportes terrestres e transportes por oleodutos ou gasodutos @pt
preferred label: Transporturi terestre şi transporturi prin conducte @ro
preferred label: Сухопутный транспорт и транспортирование по трубопроводам @ru
preferred label: Pozemná doprava a doprava potrubím @sk
preferred label: Kopenski promet; cevovodni transport @sl
preferred label: Landtransport; transport i rörsystem @sv
preferred label: Kara taşımacılığı ve boru hattı taşımacılığı @tr
broader: TRANSPORTATION AND STORAGE
narrower: Passenger rail transport, interurban
narrower: Freight rail transport
narrower: Other passenger land transport
narrower: Freight transport by road and removal services
narrower: Transport via pipeline

Passenger rail transport, interurban
type: Concept
notation: 49.1
status: valid
status modified: 2013-10-18
accepted date: 2013-10-18
in scheme: Statistical Classification of Economic Activities in the European Community, Rev. 2 (2008)
scope note: Данная группа включает все виды наземных грузовых перевозок, за исключением железнодорожных перевозок. @ru
preferred label: Пътнически железопътен транспорт, междуселищен @bg
preferred label: Železniční osobní doprava meziměstská @cs
preferred label: Passagertransport med regional- eller fjerntog @da
preferred label: Personenbeförderung im Eisenbahnfernverkehr @de
preferred label: Υπεραστικές σιδηροδρομικές μεταφορές επιβατών @el
preferred label: Transporte interurbano de pasajeros por ferrocarril @es
preferred label: Sõitjate linnadevaheline raudteevedu @et
preferred label: Rautateiden henkilöliikenne, kaukoliikenne @fi
preferred label: Transport ferroviaire interurbain de voyageurs @fr
preferred label: Helyközi vasúti személyszállítás
preferred label: Trasporto ferroviario di passeggeri (interurbano) @it
preferred label: Tarpmiestinis keleivinis geležinkelio transportas @lt
preferred label: Pasažieru dzelzceļa transports @lv
preferred label: Trasport ta' passiġġieri bil-ferrovija, interurban @mt
preferred label: Interlokaal personenvervoer per spoor @nl
preferred label: Passasjertransport med jernbane @no
preferred label: Transport kolejowy pasażerski, międzymiastowy @pl
preferred label: Transporte interurbano de passageirospor caminho-de-ferro @pt
preferred label: Transporturi interurbane de călători pe calea ferată @ro
preferred label: Пассажирский железнодорожный транспорт, междугородний @ru
preferred label: Osobná železničná doprava, medzimestská @sk
preferred label: Železniški potniški promet @sl
preferred label: Järnvägstransport, passagerartrafik @sv
preferred label: Demiryolu ile şehirlerarası yolcu taşımacılığı @tr
broader: Land transport and transport via pipelines
narrower: Passenger rail transport, interurban

Passenger rail transport, interurban
type: Concept
notation: 49.10
status: valid
status modified: 2013-10-18
accepted date: 2013-10-18
in scheme: Statistical Classification of Economic Activities in the European Community, Rev. 2 (2008)
scope note: - превоз на пътници чрез железопътен подвижен състав, движещ се по основните железопътни линии на дълго разстояние - междуселищен и международен железопътен превоз на пътници - експлоатация на спални вагони или вагон-ресторанти, като неразделна част от експлоатацията на железопътните компании - пътнически градски и крайградски транспорт по транспортни мрежи - 49.31 - експлоатация на пътнически железопътни гари - 52.21 - експлоатация на железопътната инфраструктура; маневрени дейности в железопътния транспорт - 52.21 - експлоатация на спални вагони или вагон-ресторанти, когато се извършва от самостоятелни единици - 55.90, 56.10 @bg
scope note: Z: - doprava osob železničními vozy s lokomotivami (vlakovými soupravami) na hlavních tratích rozsáhlé oblasti - osobní dopravu meziměstskou železnicí - provoz lůžkových a jídelních vozů jako integrální součásti provozu železničních společností N: - osobní doprava městských a příměstských dopravních systémů (49.31) - činnosti terminálů (odbavovací zařízení, nádraží) pro cestující (52.21) - činnosti spojené s železniční infrastrukturou, jako seřazování a posunování ( 52.21) - provoz lůžkových a jídelních vozů provozovaných samostatnými podniky (55.90 a 56.10) @cs
scope note: Diese Klasse umfasst: - Personenbeförderung mit Schienenfahrzeugen auf Hauptstrecken des Schienenfernverkehrs - Personenbeförderung im Schienenfernverkehr - Betrieb von Schlafwagen und Speisewagen als Teil der Tätigkeit eines Bahnunternehmens Diese Klasse umfasst nicht: - Personenbeförderungsleistungen im Orts- und Nahverkehr (s. 49.31) - Tätigkeiten im Zusammenhang mit Passagierterminals (s. 52.21) - Betrieb von Eisenbahninfrastrukturen und damit verbundene Tätigkeiten wie Weichenstellen und Rangieren (s. 52.21) - Betrieb von Schlafwagen und Speisewagen durch eigenständige Unternehmen (s. 55.90 und 56.10) @de
scope note: This class includes: - rail transportation of passengers using railroad rolling stock on mainline networks, spread over an extensive geographic area - passenger transport by interurban railways - operation of sleeping cars or dining cars as an integrated operation of railway companies This class excludes: - passenger transport by urban and suburban transit systems, see 49.31 - passenger terminal activities, see 52.21 - operation of railroad infrastructure; related activities such as switching and shunting, see 52.21 - operation of sleeping cars or dining cars when operated by separate units, see 55.90, 56.10 @en
scope note: Esta clase comprende: - el transporte de pasajeros por ferrocarril usando redes de larga distancia, desplegadas por una amplia área geográfica - el transporte de pasajeros por ferrocarril interurbano - la explotación de coches-cama o coches-restaurante como operación integrante de las compañías de ferrocarril Esta clase no comprende: - el transporte de pasajeros por sistemas de tránsito urbano y suburbano (véase 49.31) - las actividades de las terminales de pasajeros (véase 52.21) - la explotación de las infraestructuras ferroviarias y las actividades relacionadas, como los cambios de aguja y los cambios de vía (véase 52.21) - la explotación de coches-cama o coches-restaurante, prestada por unidades independientes (véanse 55.90 y 56.10) @es
scope note: Cette classe comprend: - le transport ferroviaire de voyageurs au moyen de matériel ferroviaire circulant sur de grandes lignes, distribuées sur une grande zone géographique - le transport interurbain de passagers par chemin de fer - l’exploitation de voitures-lits et de voitures-restaurants dans le cadre d’une exploitation intégrée par les compagnies de chemin de fer Cette classe ne comprend pas: - le transport de voyageurs par des systèmes de transit urbain et suburbain, voir 49.31 - les activités des gares de voyageurs, voir 52.21 - l’exploitation de l’infrastructure ferroviaire; les activités connexes telles que les opérations d’aiguillage, voir 52.21 - l’exploitation de voitures-lits ou de voitures-restaurants dans le cadre d’une exploitation par des unités distinctes, voir 55.90 et 56.10 @fr
scope note: Ovaj razred uključuje: - željeznički prijevoz putnika glavnim željezničkim prugama, koje su razgranate većim zemljopisnim područjem - željeznički prijevoz putnika međugradskom željeznicom - djelatnosti kola za spavanje ili kola za ručanje kao integrirane djelatnosti željezničkih poduzeća Ovaj razred isključuje: - prijevoz putnika gradskim i prigradskim prijevoznim sustavima, vidi 49.31 - djelatnosti putničkog terminala, vidi 52.21 - rad željezničke infrastrukture; povezane djelatnosti koje se odnose na ranžiranje i manevriranje, vidi 52.21 - djelatnosti kola za spavanje ili kola za ručanje kada ih obavljaju samostalne jedinice, vidi 55.90, 56.10
scope note: Į šią klasę įeina: - keleivių vežimas geležinkelio transporto priemonėmis magistralinių linijų tinklais, išdėstytais plačioje geografinėje teritorijoje - keleivių vežimas tarpmiestiniais geležinkeliais - miegamųjų vagonų ar vagonų - restoranų eksploatavimas, sudarantis geležinkelio kompanijų veiklos dalį Į šią klasę neįeina: - keleivių vežimas miesto ir priemiestinėmis transporto sistemomis, žr. 49.31 - keleivinio transporto terminalų veikla, žr. 52.21 - geležinkelių infrastruktūros darbas; susijusi veikla, tokia kaip manevravimas ir parengiamasis traukinio formavimas, žr. 52.21 - miegamųjų vagonų ar vagonų - restoranų eksploatavimas, atliekamas skirtingų veiklos vienetų, žr. 55.90, 56.10 @lt
scope note: Этот класс включает: - все виды деятельности, связанные с грузовыми перевозками автомобильным транспортом: • перевозку лесоматериалов • перевозку крупногабаритных грузов • рефрижераторные перевозки • перевозку тяжелых грузов • перевозку насыпных грузов, включая перевозку в автомобильных цистернах и сбор молока в фермерских хозяйствах • перевозку автомобилей • перевозку мусора и различных отходов без сбора или утилизации Этот класс также включает: - аренду грузовых автомобилей с предоставлением водителя - грузовые перевозки транспортными средствами, передвигаемыми человеком или на животной тяге Этот класс исключает: - перевозку лесоматериалов в пределах леса как часть операций по заготовке и транспортировке леса, см. 02.40 - перевозку воды на грузовиках, см. 36.00 - услуги терминалов по транспортной обработке грузов, см. 52.21 - упаковочные работы при транспортировке, см. 52.29 - почтовые и курьерские услуги, см. 53.10, 53.20 - транспортировку отходов, как неотъемлемую часть работ по сбору отходов, см. 38.11, 38.12 @ru
scope note: Bu sınıf aşağıdakileri kapsamaktadır; - geniş bir alana yayılı, ana şebekeler üzerinde demiryolu taşıtlarının kullanılması suretiyle yolcu taşımacılığı, - şehirler arası demiryolları ile yolcu taşıma, - demiryolu şirketlerinin ortak bir uygulaması olarak yataklı ve yemekli vagonların işletilmesi. Kapsam dışı olanlar; - şehir içi ve banliyö transit sistemleri ile yolcu taşımacılığı, bkz. 49.31, - yolcu terminal faaliyetleri, bkz. 52.21, - demiryolu altyapısının işletilmesi; makaslama ve manevra gibi ilgili faaliyetler, bkz. 52.21, - yataklı ve yemekli vagonların ayrı birimler tarafından işletilmesi, bkz 55.90, 56.10. @tr
preferred label: Пътнически железопътен транспорт, междуселищен @bg
preferred label: Železniční osobní doprava meziměstská @cs
preferred label: Passagertransport med regional- eller fjerntog @da
preferred label: Personenbeförderung im Eisenbahnfernverkehr @de
preferred label: Υπεραστικές σιδηροδρομικές μεταφορές επιβατών @el
preferred label: Transporte interurbano de pasajeros por ferrocarril @es
preferred label: Sõitjate linnadevaheline raudteevedu @et
preferred label: Rautateiden henkilöliikenne, kaukoliikenne @fi
preferred label: Transport ferroviaire interurbain de voyageurs @fr
preferred label: Helyközi vasúti személyszállítás
preferred label: Trasporto ferroviario di passeggeri (interurbano) @it
preferred label: Tarpmiestinis keleivinis geležinkelio transportas @lt
preferred label: Pasažieru dzelzceļa transports @lv
preferred label: Trasport ta' passiġġieri bil-ferrovija, interurban @mt
preferred label: Interlokaal personenvervoer per spoor @nl
preferred label: Passasjertransport med jernbane @no
preferred label: Transport kolejowy pasażerski, międzymiastowy @pl
preferred label: Transporte interurbano de passageiros por caminho-de-ferro @pt
preferred label: Transporturi interurbane de călători pe calea ferată @ro
preferred label: Пассажирский железнодорожный транспорт, междугородний @ru
preferred label: Osobná železničná doprava, medzimestská @sk
preferred label: Železniški potniški promet @sl
preferred label: Järnvägstransport, passagerartrafik @sv
preferred label: Demiryolu ile şehirlerarası yolcu taşımacılığı @tr
broader: Passenger rail transport, interurban

Freight rail transport
type: Concept
notation: 49.2
status: valid
status modified: 2013-10-18
accepted date: 2013-10-18
in scheme: Statistical Classification of Economic Activities in the European Community, Rev. 2 (2008)
scope note: Этот класс включает: - услуги по перевозке на автодорожном транспорте, оказываемые при переезде физическим и юридическим лицам @ru
preferred label: Товарен железопътен транспорт @bg
preferred label: Železniční nákladní doprava @cs
preferred label: Godstransport med tog @da
preferred label: Güterbeförderung im Eisenbahnverkehr @de
preferred label: Σιδηροδρομικές μεταφορές εμπορευμάτων @el
preferred label: Transporte de mercancías por ferrocarril @es
preferred label: Kauba raudteevedu @et
preferred label: Rautateiden tavaraliikenne @fi
preferred label: Transports ferroviaires de fret @fr
preferred label: Vasúti áruszállítás
preferred label: Trasporto ferroviario di merci @it
preferred label: Krovininis geležinkelio transportas @lt
preferred label: Kravu dzelzceļa transports @lv
preferred label: Trasport ta' merkanzija bil-ferrovija @mt
preferred label: Goederenvervoer per spoor @nl
preferred label: Godstransport med jernbane @no
preferred label: Transport kolejowy towarów @pl
preferred label: Transporte de mercadorias por caminho-de-ferro @pt
preferred label: Transporturi de marfă pe calea ferată @ro
preferred label: Грузовой железнодорожный транспорт @ru
preferred label: Nákladná železničná doprava @sk
preferred label: Železniški tovorni promet @sl
preferred label: Järnvägstransport, godstrafik @sv
preferred label: Demiryolu ile yük taşımacılığı @tr
broader: Land transport and transport via pipelines
narrower: Freight rail transport

Freight rail transport
type: Concept
notation: 49.20
status: valid
status modified: 2013-10-18
accepted date: 2013-10-18
in scheme: Statistical Classification of Economic Activities in the European Community, Rev. 2 (2008)
scope note: - превоз на товари с железопътен транспорт по основните железопътни линии, както и по техните разклонения на късо разстояние - складиране и съхраняване на товари - 52.10 - експлоатация на товарни терминали - 52.21 - експлоатация на железопътната инфраструктура; маневрени дейности в железопътния транспорт - 52.21 - обработка на товари - 52.24 @bg
scope note: Z: - doprava nákladů po hlavních železničních tratích i tratích vedlejších N: - skladování a úschova (52.10) - činnosti nákladních terminálů (52.21) - činnosti spojené s železniční infrastrukturou, jako seřazování a posunování (52.21) - manipulace s nákladem (52.24) @cs
scope note: Diese Klasse umfasst: - Güterbeförderung mit Schienenfahrzeugen auf Hauptverkehrsnetzen und auf Nebenstrecken des Frachtverkehrs Diese Klasse umfasst nicht: - Lagerei (s. 52.10) - Tätigkeiten im Zusammenhang mit Abfertigungseinrichtungen für den Frachtumschlag (s. 52.21) - Betrieb von Eisenbahninfrastrukturen und damit verbundene Tätigkeiten wie Weichenstellen und Rangieren (s. 52.21) - Frachtumschlag (s. 52.24) @de
scope note: This class includes: - freight transport on mainline rail networks as well as short line freight railroads This class excludes: - warehousing and storage, see 52.10 - freight terminal activities, see 52.21 - operation of railroad infrastructure; related activities such as switching and shunting, see 52.21 - cargo handling, see 52.24 @en
scope note: Esta clase comprende: - el transporte de mercancías por ferrocarril usando redes de vías de larga distancia, así como por vías de corta distancia Esta clase no comprende: - el depósito y almacenamiento (véase 52.10) - las actividades de las terminales de carga (véase 52.21) - la explotación de las infraestructuras ferroviarias y las actividades relacionadas, como los cambios de aguja y los cambios de vía (véase 52.21) - la manipulación de mercancías (véase 52.24) @es
scope note: Cette classe comprend: - le transport ferroviaire de fret sur de grandes lignes, ainsi que sur des lignes secondaires Cette classe ne comprend pas: - l’entreposage, voir 52.10 - les activités des terminaux de marchandises, voir 52.21 - l’exploitation de l’infrastructure ferroviaire; les activités connexes telles que les opérations d’aiguillage, voir 52.21 - la manutention du fret, voir 52.24 @fr
scope note: Ovaj razred uključuje: - prijevoz robe međugradskom, prigradskom i gradskom željeznicom Ovaj razred isključuje: - skladištenje, vidi 52.10 - djelatnost robnih terminala, vidi 52.21 - rad željezničke infrastrukture; povezane djelatnosti koje se odnose na ranžiranje i manevriranje, vidi 52.21 - djelatnost prekrcaja tereta, vidi 52.24
scope note: Į šią klasę įeina: - krovinių vežimas geležinkelio magistralinių linijų tinklais taip pat ir požeminiais geležinkeliais Į šią klasę neįeina: - sandėliavimas ir laikymas, žr. 52.10 - krovininio transporto terminalų veikla, žr. 52.21 - geležinkelių infrastruktūros darbas; susijusi veikla, tokia kaip manevravimas ir parengiamasis traukinio formavimas, žr. 52.21 - krovinių tvarkymas, žr. 52.24 @lt
scope note: Bu sınıf aşağıdakileri kapsamaktadır; - kısa mesafeli demiryolu yük taşımacılığının yanı sıra ana demiryolu şebekeleri üzerindeki yük taşımacılığı. Kapsam dışı olanlar; - depolama ve ambarlama, bkz. 52.10, - yük terminali faaliyetleri, bkz. 52.21, - demiryolu altyapısının işletilmesi; makaslama ve manevra gibi ilgili faaliyetler, bkz. 52.21, - kargo yükleme-boşaltma hizmetleri, bkz. 52.24. @tr
preferred label: Товарен железопътен транспорт @bg
preferred label: Železniční nákladní doprava @cs
preferred label: Godstransport med tog @da
preferred label: Güterbeförderung im Eisenbahnverkehr @de
preferred label: Σιδηροδρομικές μεταφορές εμπορευμάτων @el
preferred label: Transporte de mercancías por ferrocarril @es
preferred label: Kauba raudteevedu @et
preferred label: Rautateiden tavaraliikenne @fi
preferred label: Transports ferroviaires de fret @fr
preferred label: Vasúti áruszállítás
preferred label: Trasporto ferroviario di merci @it
preferred label: Krovininis geležinkelio transportas @lt
preferred label: Kravu dzelzceļa transports @lv
preferred label: Trasport ta' merkanzija bil-ferrovija @mt
preferred label: Goederenvervoer per spoor @nl
preferred label: Godstransport med jernbane @no
preferred label: Transport kolejowy towarów @pl
preferred label: Transporte de mercadorias por caminho-de-ferro @pt
preferred label: Transporturi de marfă pe calea ferată @ro
preferred label: Грузовой железнодорожный транспорт @ru
preferred label: Nákladná železničná doprava @sk
preferred label: Železniški tovorni promet @sl
preferred label: Järnvägstransport, godstrafik @sv
preferred label: Demiryolu ile yük taşımacılığı @tr
broader: Freight rail transport

Other passenger land transport
type: Concept
notation: 49.3
status: valid
status modified: 2013-10-18
accepted date: 2013-10-18
in scheme: Statistical Classification of Economic Activities in the European Community, Rev. 2 (2008)
scope note: Тази група включва всякакъв друг вид пътнически сухопътен транспорт, различен от железопътния. Пътническият железопътен транспорт като част от градските и крайградските транспортни системи е включен тук. @bg
scope note: Tato skupina zahrnuje pozemní osobní dopravu, jinou než železniční. Je zde však zahrnuta doprava po kolejích jako součást městských nebo příměstských dopravních systémů @cs
scope note: Diese Gruppe umfasst alle Tätigkeiten zur Personenbeförderung zu Lande außer der Beförderung mit der Eisenbahn. Schienenverkehr als Teil des Orts- und Nahverkehrs ist jedoch eingeschlossen. @de
scope note: This group includes all land-based passenger transport activities other than rail transport. However, rail transport as part of urban or suburban transport systems is included there. @en
scope note: Este grupo comprende todas las actividades de transporte terrestre de pasajeros, excepto el transporte por ferrocarril. Sin embargo, se incluye el transporte por ferrocarril incluido cuando forma parte de los sistemas de transporte urbano y suburbano. @es
scope note: Ce groupe comprend l’ensemble des activités de transport par voie terrestre de passagers autre que ferroviaire. Ce groupe comprend toutefois les activités de transport ferroviaire s’inscrivant dans le cadre de systèmes de transport urbain et suburbain. @fr
scope note: Ova skupina uključuje sve djelatnosti kopnenog prijevoza putnika, osim željezničkoga. Međutim ovdje je također uključen željeznički prijevoz kao dio gradskog i prigradskog prijevoznog sustava.
scope note: Į šią grupę įeina viso sausumos keleivinio transporto veikla, išskyrus geležinkelio transportą. Tačiau, geležinkelio transportas, kaip miesto ar priemiestinio transporto sistemos dalis, klasifikuojama šioje grupėje. @lt
scope note: Этот класс включает: - транспортировку газа, жидкостей, воды, жидкого цементного раствора и прочих материалов по трубопроводу Этот класс также включает: - деятельность насосных станций Этот класс исключает: - распределение природного и отопительного газа, пара и воды, см. 35.22, 35.30, 36.00 - транспортировку жидкостей автоцистернами, см. 49.41 @ru
scope note: Bu grup, demiryolu taşımacılığından ziyade tüm kara taşımacılığı temelli yolcu taşıma faaliyetlerini kapsamaktadır. Bununla birlikte, şehir içi ve banliyö taşımacılık sistemlerinin parçası olarak demiryolu taşımacılığı buraya dahildir. @tr
preferred label: Друг пътнически сухопътен транспорт @bg
preferred label: Ostatní pozemní osobní doprava @cs
preferred label: Anden landpassagertransport @da
preferred label: Sonstige Personenbeförderung im Landverkehr @de
preferred label: Άλλες χερσαίες μεταφορές επιβατών @el
preferred label: Otro transporte terrestre de pasajeros @es
preferred label: Sõitjate muu maismaavedu @et
preferred label: Muu maaliikenteen henkilöliikenne @fi
preferred label: Autres transports terrestres de voyageurs @fr
preferred label: Egyéb szárazföldi személyszállítás
preferred label: Altri trasporti terrestri di passeggeri @it
preferred label: Kitas keleivinis sausumos transportas @lt
preferred label: Pārējais pasažieru sauszemes transports @lv
preferred label: Trasport ieħor tal-passiġġieri bl-art @mt
preferred label: Overig personenvervoer te land @nl
preferred label: Annen landtransport med passasjerer @no
preferred label: Transport lądowy pasażerski pozostały @pl
preferred label: Outros transportes terrestres de passageiros @pt
preferred label: Alte transporturi terestre de călători @ro
preferred label: Прочий пассажирский сухопутный транспорт @ru
preferred label: Ostatná osobná pozemná doprava @sk
preferred label: Drug kopenski potniški promet @sl
preferred label: Annan landtransport, passagerartrafik @sv
preferred label: Kara taşımacılığı ile yapılan diğer yolcu taşımacılığı @tr
broader: Land transport and transport via pipelines
narrower: Urban and suburban passenger land transport
narrower: Taxi operation
narrower: Other passenger land transport n.e.c.

Urban and suburban passenger land transport
type: Concept
notation: 49.31
status: valid
status modified: 2013-10-18
accepted date: 2013-10-18
in scheme: Statistical Classification of Economic Activities in the European Community, Rev. 2 (2008)
scope note: - пътнически сухопътен транспорт по градски и крайградски транспортни мрежи. Превозът може да се осъществява чрез различни превозни средства за сухопътен транспорт като автобуси, трамваи, тролейбуси, метрополитен (подземен, наземен и надземен) и други. Транспортът се извършва по утвърдена транспортна схема с маршрутни разписания на линиите с качване и слизане на пътниците на постоянно определени спирки - специализиран превоз на пътници с автобусен транспорт като превоз на пътници от града до летището или от града до гари, автогари - превоз на пътници с въжени линии и други, ако превозът е част от градските и крайградските транспортни мрежи - пътнически междуселищен железопътен транспорт - 49.10 @bg
scope note: Z: - pozemní dopravu osob městskými nebo příměstskými dopravními systémy. Ty mohou zahrnovat různé druhy pozemní dopravy, autobusy, tramvaje, trolejbusy, podzemní a nadzemní dráhy atd. Doprava je provozována po pevně stanovených trasách, pravidelně, podle pevného jízdního řádu, přičemž cestující mohou nastupovat a vystupovat na stálých zastávkách. ZT: - linky mezi městem a letištěm nebo nádražím - provoz kolejových a visutých lanových drah atd., pokud jsou součástí městského a příměstského dopravního systému. N: - dopravu osob v meziměstské železniční dopravě (49.10) @cs
scope note: Diese Klasse umfasst: - Personenbeförderung im Orts- und Nahverkehr zu Lande. Verschiedene Verkehrsmittel können zum Einsatz kommen, z. B. Omnibusse, Straßenbahnen, Oberleitungsbusse, U-Bahnen, Hochbahnen usw. Die Beförderung erfolgt auf festgelegten Strecken, meistens nach festem Fahrplan, wobei die Fahrgäste an meist festen Haltestellen zu- oder aussteigen können. Diese Klasse umfasst ferner: - Flughafen- oder Bahnhofszubringerlinien - Betrieb von Zahnrad- und Seilbahnen usw., soweit diese Teil von Orts- und Nahverkehrssystemen sind Diese Klasse umfasst nicht: - Personenbeförderung im Schienenfernverkehr (s. 49.10) @de
scope note: This class includes: - land transport of passengers by urban or suburban transport systems. This may include different modes of land transport, such as by motor bus, tramway, streetcar, trolley bus, underground and elevated railways etc. The transport is carried out on scheduled routes normally following a fixed time schedule, entailing the picking up and setting down of passengers at normally fixed stops. This class also includes: - town-to-airport or town-to-station lines - operation of funicular railways, aerial cableways etc. if part of urban or suburban transit systems This class excludes: - passenger transport by interurban railways, see 49.10 @en
scope note: Esta clase comprende: - el transporte terrestre de pasajeros por sistemas de transporte urbanos o suburbanos. Puede incluir distintas formas de transporte terrestre, como autobuses, tranvías, trolebuses, ferrocarriles subterráneos y elevados, etc. El transporte se efectúa por itinerarios regulares y según un horario establecido, tomando y dejando a los pasajeros en paradas fijas. Esta clase comprende también: - las líneas de servicio al aeropuerto o la estación - la explotación de funiculares, teleféricos, etc. si forman parte de los sistemas de tránsito urbanos o suburbanos. Esta clase no comprende: - el transporte de pasajeros por ferrocarril interurbano (véase 49.10) @es
scope note: Cette classe comprend: - le transport par voie terrestre de passagers par des systèmes de transport urbain et suburbain. Il peut s’agir de divers modes de transport, tels que autobus ou autocar, tramway, trolley-bus, métro souterrain ou aérien, etc. Les activités de transport de passagers sont effectuées sur des lignes déterminées, conformément à un horaire établi des départs et arrivées aux arrêts indiqués sur ces horaires. Cette classe comprend également: - l’exploitation de navettes vers les aéroports et les gares - l’exploitation de funiculaires, de téléphériques, etc., s’inscrivant dans le cadre de systèmes de transport urbain et suburbain Cette classe ne comprend pas: - le transport interurbain de passagers par chemin de fer, voir 49.10 @fr
scope note: Ovaj razred uključuje: - kopneni prijevoz putnika gradskim i prigradskim prijevoznim sustavima. Ovdje se mogu uključiti različiti oblici kopnenog prijevoza kao što su autobusi, tramvaji, ulična vozila, trolejbusi, podzemna željeznica, nadzemna željeznica itd. Djelatnost prometa obično se realizira na redovitim linijama koje poštuju vozni red te preuzimaju i prevoze putnike na utvrđenim postajama. Ovaj razred također uključuje: - linije od grada do zračne luke ili od grada do željezničkoga kolodvora - djelatnost uspinjača, žičara itd. ako su dio gradskoga, prigradskoga ili međugradskoga kopnenoga tranzitnog sustava Ovaj razred isljučuje: - prijevoz putnika međugradskom željeznicom, vidi 49.10
scope note: Į šią klasę įeina: - keleivių vežimas miesto ar priemiestiniu sausumos transportu. Čia gali įeiti įvairios sausumos transporto rūšys, tokios kaip autobusai, tramvajai, troleibusai, požeminiai ar estakadiniai geležinkeliai ir kt. Vežimas atliekamas tvarkaraštyje nurodytais maršrutais, įlaipinant ir išlaipinant keleivius tam tikslui nustatytose stotelėse, laikantis iš anksto nustatytų tvarkaraščių. Į šią klasę taip pat įeina: - transporto linijų miestas – oro uostas ar miestas – stotis veikla - funikulierių, kabamųjų lynų kelių ir kt. eksploatavimas, jeigu jie yra miesto arba priemiestinio transporto sistemų dalis Į šią klasę neįeina: - tarpmiestinis keleivinis geležinkelių transportas, žr. 49.10 @lt
scope note: Данный раздел включает как рейсовые, так и нерейсовые перевозки пассажиров или грузов. Сюда также относится буксировка лодок, экскурсионных и туристических катеров, паромов, разъездных катеров и т.д. Несмотря на то, что местоположение является определяющим указателем на расстояние между сушей и водой, решающим фактором все же является тип используемого транспортного средства. Перевозки на морских суднах классифицированы в группах 50.1 и 50.2, в то время как классификация перевозок на прочих транспортных средствах приводится в группах 50.3 и 50.4. Данный раздел исключает ресторанные услуги на борту морских суден (см. 56.10, 56.30), если они предоставляются отдельными фирмами. @ru
scope note: Bu sınıf aşağıdakileri kapsamaktadır; - şehir içi veya banliyö taşıma sistemleriyle yapılan yolcu taşıma faaliyetleri. Bu, otobüs, tramvay, yeraltı tramvayı, troleybüs, yer altı ve yükseltilmiş demiryolları vb. gibi farklı kara taşımacılığı çeşitlerini kapsayabilir. Taşıma, olağan olarak belirli duraklarda yolcu bindirilmesi ve indirilmesi zorunluluğunu getiren belirli bir zaman çizelgesine göre tarifeli güzergahlar üzerinden gerçekleştirilmektedir. Ayrıca bu sınıf aşağıdakileri de kapsamaktadır; - şehirden havaalanına veya şehirden istasyona olan hatlar, - şehir içi veya banliyö transit sistemlerinin parçası olmak koşuluyla, dağ demiryollarının, havai kablolu hatların işletilmesi. Kapsam dışı olanlar; - şehirlerarası demiryolları ile yolcu taşınması, bkz. 49.10. @tr
preferred label: Пътнически градски и крайградски транспорт @bg
preferred label: Městská a příměstská pravidelná pozemní osobní doprava @cs
preferred label: Landpassagertransport i by- og forstadsområder @da
preferred label: Personenbeförderung im Nahverkehr zu Lande (ohne Taxis) @de
preferred label: Αστικές και προαστιακές χερσαίες μεταφορές επιβατών @el
preferred label: Transporte terrestre urbano y suburbano de pasajeros @es
preferred label: Sõitjate asulasisene ja linnalähitransport @et
preferred label: Paikallisliikenne @fi
preferred label: Transports urbains et suburbains de voyageurs @fr
preferred label: Városi, elővárosi, város-térségi szárazföldi személyszállítás
preferred label: Trasporto terrestre di passeggeri in aree urbane e suburbane @it
preferred label: Keleivių vežimas miesto arba priemiestiniu sausumos transportu @lt
preferred label: Pilsētas un piepilsētas pasažieru sauszemes pārvadājumi @lv
preferred label: Trasport tal-passiġġieri bl-art f'żona urbana usuburbana @mt
preferred label: Personenvervoer te land binnen steden of voorsteden @nl
preferred label: Transport med rutebil og sporvei i by- og forstadsområde @no
preferred label: Transport lądowy pasażerski miejski i podmiejski @pl
preferred label: Transportes terrestres, urbanos e suburbanos, de passageiros @pt
preferred label: Transporturi urbane, suburbane şi metropolitane de călători @ro
preferred label: Городской и пригородный пассажирский наземный транспорт @ru
preferred label: Mestská alebo prímestská osobná pozemná doprava @sk
preferred label: Mestni in primestni kopenski potniški promet @sl
preferred label: Kollektivtrafik @sv
preferred label: Kara taşımacılığı ile yapılan şehir içi ve banliyö yolcu taşımacılığı @tr
broader: Other passenger land transport

Taxi operation
type: Concept
notation: 49.32
status: valid
status modified: 2013-10-18
accepted date: 2013-10-18
in scheme: Statistical Classification of Economic Activities in the European Community, Rev. 2 (2008)
scope note: - даване под наем на частни леки автомобили с водач @bg
scope note: ZT: - ostatní pronájem osobních vozů s řidičem @cs
scope note: Diese Klasse umfasst auch: - sonstige Pkw-Vermietung mit Fahrer @de
scope note: This class also includes: - other renting of private cars with driver @en
scope note: Esta clase comprende también: - el alquiler de vehículos privados con conductor @es
scope note: Cette classe comprend également: - les autres types de location de voitures particulières avec chauffeur @fr
scope note: Ovaj razred također uključuje: - ostalo iznajmljivanje osobnih automobila s vozačem
scope note: Į šią klasę taip pat įeina: - kita privačių lengvųjų automobilių, su vairuotojo samdymu, nuoma @lt
scope note: Данная группа включает пассажирские перевозки на суднах, сконструированных для использования на море и в прибрежных водах. Также сюда относятся пассажирские перевозки на крупных озерах и т.д. при использовании транспортных средств такого же типа. @ru
scope note: Ayrıca bu sınıf aşağıdakileri de kapsamaktadır; - sürücü ile birlikte diğer özel araçların kiralanması. @tr
preferred label: Пътнически таксиметров транспорт @bg
preferred label: Taxislužba a pronájem osobních vozů s řidičem @cs
preferred label: Taxikørsel @da
preferred label: Betrieb von Taxis @de
preferred label: Εκμετάλλευση ταξί @el
preferred label: Transporte por taxi @es
preferred label: Taksovedu @et
preferred label: Taksiliikenne @fi
preferred label: Transports de voyageurs par taxis @fr
preferred label: Taxis személyszállítás
preferred label: Trasporto con taxi @it
preferred label: Taksi veikla @lt
preferred label: Taksometru pakalpojumi @lv
preferred label: Operazzjoni ta' taksis @mt
preferred label: Exploitatie van taxi's @nl
preferred label: Drosjebiltransport @no
preferred label: Działalność taksówek osobowych @pl
preferred label: Transporte ocasional de passageiros em veículos ligeiros @pt
preferred label: Transporturi cu taxiuri @ro
preferred label: Деятельность такси @ru
preferred label: Taxislužba @sk
preferred label: Obratovanje taksijev @sl
preferred label: Taxitrafik @sv
preferred label: Taksi taşımacılığı @tr
broader: Other passenger land transport

Other passenger land transport n.e.c.
type: Concept
notation: 49.39
status: valid
status modified: 2013-10-18
accepted date: 2013-10-18
in scheme: Statistical Classification of Economic Activities in the European Community, Rev. 2 (2008)
scope note: - друг пътнически автомобилен транспорт: • междуселищен превоз на пътници по разписание с автобуси • чартърни маршрути, туристически и други услуги на случайния пътнически транспорт • специализиран превоз на пътници по разписание от летища до определено място и обратно (airport shuttles) - превоз на пътници с въжени линии и ски лифтове, когато не е част от градските и крайградските транспортни мрежи - специализиран превоз на пътници с автобусен транспорт като превоз на деца и ученици до и от детски градини и училища, превоз на служители и работници от и до местоработата им и т.н. - превоз на пътници с превозни средства, теглени от хора или животни - превоз на пациенти с линейки или с друг вид транспорт - 86.90 @bg
scope note: Z: - ostatní silniční dopravu osob: • linkovou autobusovou dopravu - dálkovou • charterovou, zájezdovou a příležitostnou autobusovou dopravu • kyvadlovou dopravu na letiště nebo nádraží - provoz lanovek, pozemních lanovek, lyžařských a lanových výtahů, pokud nejsou součástí městského či příměstského dopravního systému ZT: - provoz školních autobusů a autobusů pro přepravu zaměstnanců - pronájem autobusů s řidičem - osobní dopravu vozidly, která jsou tažena lidmi nebo zvířaty N: - přepravu sanitkami (86.90) @cs
scope note: Diese Klasse umfasst: - sonstige Personenbeförderung im Landverkehr: • linienmäßiger Busfernverkehr • Charter- und Ausflugsverkehr mit Omnibussen • Flughafen-Shuttles - Betrieb von Standseilbahnen, Seilschwebebahnen und Skiliften, soweit diese nicht Teil von Orts- und Nahverkehrssystemen sind Diese Klasse umfasst ferner: - Betrieb von Schulbussen und von Bussen im Werksverkehr - Personenbeförderung mit von Menschen oder Tieren gezogenen Fahrzeugen Diese Klasse umfasst nicht: - Rettungsdienste und Krankentransport (s. 86.90) @de
scope note: This class includes: - other passenger road transport: • scheduled long-distance bus services • charters, excursions and other occasional coach services • airport shuttles - operation of teleferics, funiculars, ski and cable lifts if not part of urban or suburban transit systems This class also includes: - operation of school buses and buses for transport of employees - passenger transport by man- or animal-drawn vehicles This class excludes: - ambulance transport, see 86.90 @en
scope note: Esta clase comprende: - otro transporte de pasajeros por carretera • los servicios regulares de autobuses de largo recorrido • los servicios discrecionales de autocares, para excursiones, etc. • los servicios de los autobuses dentro de los aeropuertos - la explotación de funiculares, teleféricos, telesillas, etc. si no forman parte de los sistemas de tránsito urbanos o suburbanos. Esta clase comprende también: - la explotación de autobuses escolares y autobuses para el transporte de empleados - el transporte de pasajeros en vehículos de tracción animal o manual Esta clase no comprende: - el transporte por ambulancia (véase 86.90) @es
scope note: Cette classe comprend: - les autres transports routiers de passagers: • exploitation de lignes régulières d’autobus sur de longues distances • transports à la demande, excursions et autres services occasionnels de transport par autocar • navettes d’aéroports - l’exploitation de téléphériques, de funiculaires, d’engins de remontée mécanique ne s’inscrivant pas dans le cadre de systèmes de transport urbain et suburbain Cette classe comprend également: - l’exploitation d’autobus scolaires et de bus de transport des travailleurs - le transport de voyageurs par véhicules à traction humaine ou animale Cette classe ne comprend pas: - le transport en ambulance, voir 86.90 @fr
scope note: Ovaj razred uključuje: - ostali kopneni prijevoz putnika: • redoviti autobusni prijevoz, dugolinijski • čarterske vožnje, izlete i druge povremene prijevozne usluge • prijevozna sredstva unutar aerodroma - rad žičara, sedežnica, skijaških žičara i vučnica ako nisu dio gradskog ili prigradskog tranzitnog sustava Ovaj razred također uključuje: - prijevoz školskim autobusima i autobusima za prijevoz radnika na posao - prijevoz putnika vozilima pomoću ljudske ili životinjske snage (rikše ili zaprežna kola) Ovaj razred isključuje: - prijevoz vozilima hitne medicinske pomoći, vidi 86.90
scope note: Į šią klasę įeina: - kitas keleivinis kelių transportas: • tolimojo susisiekimo autobusų pagal tvarkaraštį teikiamos paslaugos • užsakomos, ekskursijų ir kitokios vienkartinės autobusų paslaugos • oro uostų maršrutiniai autobusai - kabamųjų lynų kelių, funikulierių, slidinėjimo ir linijinių keltuvų eksploatavimas, jeigu jie nėra miesto ar priemiestinio transporto dalis Į šią klasę taip pat įeina: - mokyklų autobusų ar darbuotojų pervežimo autobusų eksploatavimas - keleivių vežimas žmogaus ar gyvulių traukiamomis transporto priemonėmis Į šią klasę neįeina: - greitosios pagalbos transportas, žr. 86.90 @lt
scope note: Этот класс включает: - пассажирские перевозки как рейсовые, так и нерейсовые по морю и в прибрежных водах: • управление катерами и пароходами, используемыми в туристических целях (для проведения экскурсий, круизов или осмотра достопримечательностей) • управление паромами, разъездными катерами и т.д. Этот класс также включает: - аренду прогулочных катеров с судовой командой для перевозок по морю и прибрежным водам (например, для рыбалки) Этот класс исключает: - ресторанные услуги на борту морских суден, если они предоставляются отдельными фирмами, см. 56.10, 56.30 - аренду прогулочных катеров и яхт без судовой команды, см. 77.21 - аренду торговых пароходов и катеров без судовой команды, см. 77.34 - управление 99.99казино на воде99.99, см. 92.00 @ru
scope note: Bu sınıf aşağıdakileri kapsamaktadır; - diğer karayolu yolcu taşımacılığı: • uzun mesafe tarifeli otobüs servisleri, • ucuz tarifeli otobüs servisleri, geziler ve diğer istisnai yolcu otobüs servisleri, • havaalanı taşıma servisleri, - şehir içi veya banliyönün parçası olmamak koşuluyla, teleferikler, dağ demiryolları, kayak ve kablolu asansörlerin işletilmesi. Ayrıca bu sınıf aşağıdakileri de kapsamaktadır; - okul otobüslerinin ve çalışanların taşınması için otobüslerin işletilmesi, - insanlar veya hayvanlar tarafından çekilen araçlarla yolcu taşımacılığı, Kapsam dışı olanlar; - ambulans ile yapılan taşımacılık, bkz. 86.90. @tr
preferred label: Друг пътнически сухопътен транспорт, некласифициран другаде @bg
preferred label: Ostatní pozemní osobní doprava j. n. @cs
preferred label: Anden landpassagertransport i.a.n. @da
preferred label: Sonstige Personenbeförderung im Landverkehr a. n. g. @de
preferred label: Άλλες χερσαίες μεταφορές επιβατών π.δ.κ.α. @el
preferred label: Otros tipos de transporte terrestre de pasajeros n.c.o.p. @es
preferred label: Sõitjate muu mujal liigitamata maismaavedu @et
preferred label: Muualla luokittelematon maaliikenteen henkilöliikenne @fi
preferred label: Autres transports terrestres de voyageurs n.c.a. @fr
preferred label: M.n.s. egyéb szárazföldi személyszállítás
preferred label: Altri trasporti terrestri di passeggeri n.c.a. @it
preferred label: Kitas, niekur kitur nepriskirtas, keleivinis sausumos transportas @lt
preferred label: Citur neklasificēts pasažieru sauszemes transports @lv
preferred label: Trasport ieħor tal-passiġġieri bl-art n.e.c. @mt
preferred label: Overig personenvervoer te land, n.e.g. @nl
preferred label: Landtransport med passasjerer ikke nevnt annet sted @no
preferred label: Transport lądowy pasażerski pozostały, gdzie indziej niesklasyfikowany @pl
preferred label: Outros transportes terrestres de passageiros, n.e. @pt
preferred label: Alte transporturi terestre de călători n.c.a. @ro
preferred label: Прочие виды наземных пассажирских перевозок, не отнесенные к другим категориям @ru
preferred label: Ostatná osobná pozemná doprava i. n. @sk
preferred label: Drug kopenski potniški promet @sl
preferred label: Annan landtransport av passagerare @sv
preferred label: Başka yerde sınıflandırılmamış kara taşımacılığı ile yapılan diğer yolcu taşımacılığı @tr
broader: Other passenger land transport

Freight transport by road and removal services
type: Concept
notation: 49.4
status: valid
status modified: 2013-10-18
accepted date: 2013-10-18
in scheme: Statistical Classification of Economic Activities in the European Community, Rev. 2 (2008)
scope note: Тази група включва товарния автомобилен транспорт, различен от железопътния. @bg
scope note: Tato skupina zahrnuje všechny činnosti pozemní nákladní dopravy kromě dopravy po železnici. @cs
scope note: Diese Gruppe umfasst alle Tätigkeiten zur Güterbeförderung zu Lande außer der Beförderung mit der Eisenbahn. @de
scope note: This group includes all land-based freight transport activities other than rail transport. @en
scope note: Este grupo comprende todas las actividades de transporte terrestre de mercancías, salvo el transporte por ferrocarril @es
scope note: Ce groupe comprend l’ensemble des activités de transport de marchandises par voie terrestre autre que ferroviaire. @fr
scope note: Ova skupina uključuje cjelokupni kopneni prijevoz robe osim željezničkoga.
scope note: Į šią grupę įeina visa sausumos krovininio transporto veikla, kitokia nei geležinkelio transportas. @lt
scope note: Данная группа включает грузовые перевозки на суднах, сконструированных для использования на море и в прибрежных водах. Также сюда относятся грузовые перевозки на крупных озерах и т.д. при использовании транспортных средств того же типа. @ru
scope note: Bu grup, demiryolu taşımacılığından ziyade tüm karayolu yük taşıma faaliyetlerini kapsamaktadır. @tr
preferred label: Товарен автомобилен транспорт и услуги по преместване @bg
preferred label: Silniční nákladní doprava a stěhovací služby @cs
preferred label: Vejgodstransport og flytning @da
preferred label: Güterbeförderung im Straßenverkehr, Umzugstransporte @de
preferred label: Οδικές μεταφορές εμπορευμάτων και υπηρεσίες μετακόμισης @el
preferred label: Transporte de mercancías por carretera y servicios de mudanza @es
preferred label: Kaubavedu maanteel ja kolimisteenused @et
preferred label: Tieliikenteen tavarakuljetus ja muuttopalvelut @fi
preferred label: Transports routiers de fret et services de déménagement @fr
preferred label: Közúti áruszállítás, költöztetés
preferred label: Trasporto di merci su strada e servizi di trasloco @it
preferred label: Krovininis kelių transportas ir perkraustymo veikla @lt
preferred label: Kravu pārvadājumi pa autoceļiem @lv
preferred label: Trasport tal-merkanzija bit-triq u servizzi tal-ġarr @mt
preferred label: Goederenvervoer over de weg en verhuisbedrijven @nl
preferred label: Godstransport på vei, herunder flyttetransport @no
preferred label: Transport drogowy towarów oraz działalność usługowa związana z przeprowadzkami @pl
preferred label: Transportes rodoviários de mercadorias e serviços de mudanças @pt
preferred label: Transporturi rutiere de mărfuri şi servicii de mutare @ro
preferred label: Грузовые перевозки автомобильным транспортом и услуги по вывозу отходов @ru
preferred label: Nákladná cestná doprava a sťahovacie služby @sk
preferred label: Cestni tovorni promet in selitvena dejavnost @sl
preferred label: Vägtransport, godstrafik och flyttjänster @sv
preferred label: Karayolu ile yük taşımacılığı ve taşımacılık hizmetleri @tr
broader: Land transport and transport via pipelines
narrower: Freight transport by road
narrower: Removal services

Freight transport by road
type: Concept
notation: 49.41
status: valid
status modified: 2013-10-18
accepted date: 2013-10-18
in scheme: Statistical Classification of Economic Activities in the European Community, Rev. 2 (2008)
scope note: - превоз на всякакви товари с автомобилен транспорт: • превоз на дървени трупи • превоз на живи животни и птици • превоз на охладени или замразени стоки • превоз на твърди (сухи)насипни товари • превоз на течни и газообразни товари чрез автомобили-цистерни, вкл. превоз на събраното от фермите мляко • превоз на леки автомобили • превоз на отпадъци и отпадъчни материали, без събирането или обезвреждането им - даване под наем на товарни автомобили с водач - превоз на товари с превозни средства, теглени от хора или животни - превоз на добития дървен материал на територията на горското стопанство като част от дърводобива - 02.40 - доставяне на води чрез автомобили-цистерни - 36.00 - експлоатация на товарни терминали - 52.21 - дейности по опаковане и пакетиране с цел транспортиране - 52.29 - пощенски и куриерски дейности - 53.10, 53.20 - превоз на отпадъци като интегрирана част от дейностите по събирането им - 38.11, 38.12 @bg
scope note: Z: - veškeré činnosti silniční nákladní dopravy: • přepravu vytěženého dřeva • přepravu zboží • dopravu chladicími vozy • těžkou nákladní dopravu • přepravu ve velkém, včetně cisternových vozů i pro sběr mléka zemědělců • přepravu automobilů • přepravu odpadů a odpadních materiálů bez jeho sběru či likvidace ZT: - pronájem nákladních automobilů s řidičem - nákladní dopravu vozidly, která jsou tažena lidmi nebo zvířaty N: - přepravu klád v lese jako součásti těžebních prací (02.40) - rozvoz vody nákladními automobily (36.00) - provoz zařízení terminálů pro manipulaci s nákladem (52.21) - bednění a balení pro dopravu (52.29) - poštovní a kurýrní činnosti (53.10 a 53.20) - přepravu odpadů jako integrální části činností spojených se sběrem odpadů (38.11 a 38.12) @cs
scope note: Diese Klasse umfasst: - sämtliche Tätigkeiten der Güterbeförderung im Straßenverkehr: • Holztransport • Viehtransport • Kühlwagentransport • Schwertransport • Tankwagentransport einschl. Milchsammlung, Transport mit Silofahrzeugen • Transport von Kraftwagen • Transport von Abfällen und Abfallstoffen (jedoch nicht deren Sammlung und Beseitigung) Diese Klasse umfasst ferner: - Lkw-Vermietung mit Fahrer - Güterbeförderung mit von Menschen oder Tieren gezogenen Fahrzeugen Diese Klasse umfasst nicht: - Transport von Stämmen im Wald im Rahmen der Holzfällerei (s. 02.40) - Verteilung von Wasser durch Lastkraftwagen (s. 36.00) - Betrieb von Abfertigungseinrichtungen für Fracht (s. 52.21) - Verpacken im Hinblick auf den Transport (s. 52.29) - Post- und Kurierdienste (s. 53.10 und 53.20) - Abfalltransport als integraler Bestandteil der Abfallsammlung (s. 38.11 und 38.12) @de
scope note: This class includes: - all freight transport operations by road: • logging haulage • stock haulage • refrigerated haulage • heavy haulage • bulk haulage, including haulage in tanker trucks including milk collection at farms • haulage of automobiles • transport of waste and waste materials, without collection or disposal This class also includes: - renting of trucks with driver - freight transport by man or animal-drawn vehicles This class excludes: - log hauling within the forest, as part of logging operations, see 02.40 - distribution of water by trucks, see 36.00 - operation of terminal facilities for handling freight, see 52.21 - crating and packing activities for transport, see 52.29 - post and courier activities, see 53.10, 53.20 - waste transport as integrated part of waste collection activities, see 38.11, 38.12 @en
scope note: Esta clase comprende: - todos los servicios de transporte de mercancías por carretera: • transporte de troncos • transporte de animales • transporte frigorífico • transporte pesado • transporte de mercancías a granel, incluido el transporte en camiones cisterna, como la recogida de leche en las explotaciones • transporte de automóviles • transporte de residuos y materiales de desecho, sin incluir la recogida y la eliminación Esta clase comprende también: - el alquiler de camiones con conductor - el transporte de mercancías en vehículos de tracción animal o manual Esta clase no comprende: - el transporte de troncos en el interior del bosque, como parte de las operaciones de explotación forestal (véase 02.40) - la distribución de agua en camiones (véase 36.00) - los servicios de terminales para las operaciones de carga (véase 52.21) - los servicios de empaquetado y reempaquetado para el transporte (véase 52.29) - las actividades postales y de correos (véanse 53.10 y 53.20) - el transporte de residuos, como parte indisociable de las actividades de recogida de residuos (véanse 38.11 y 38.12) @es
scope note: Cette classe comprend: - les activités de transport de marchandises par route: • le transport de bois de sciage • le transport de bétail • le transport frigorifique • le transport lourd • le transport en vrac, y compris par camions-citernes, y compris la collecte de lait dans les fermes • le transport de voitures • le transport de déchets, sans collecte ni élimination Cette classe comprend également: - la location de camions avec chauffeur - le transport de marchandises par véhicules à traction humaine ou animale Cette classe ne comprend pas: - le transport de grumes dans les forêts, dans le cadre de l’exploitation forestière, voir 02.40 - la distribution de l’eau par camions, voir 36.00 - l’exploitation d’installations de terminaux destinées à la manutention du fret, voir 52.21 - les activités d’emballage dans le cadre des activités de transport, voir 52.29 - les activités de poste et de courrier, voir 53.10 et 53.20 - le transport de déchets dans le cadre d’activités de collecte des déchets, voir 38.11 et 38.12 @fr
scope note: Ovaj razred uključuje: - cjelokupni cestovni prijevoz: • prijevoz trupaca • prijevoz stoke • prijevoz rashlađene robe • prijevoz teških tereta • prijevoz rasutog tereta, uključujući prijevoz cisternama te prikupljanje mlijeka na farmama • prijevoz automobila • prijevoz otpada i otpadnog materijala, bez skupljanja ili odlaganja Ovaj razred također uključuje: - iznajmljivanje kamiona s vozačem - prijevoz robe vozilima pomoću ljudske ili životinjske snage (rikše ili zaprežna kola) Ovaj razred isključuje: - prijevoz oblovine unutar šume, kao dio usluge u vezi sa sječom drva, vidi 02.40 - opskrba vodom kamionima, vidi 36.00 - rad uređaja za prekrcaj robe na terminalima, vidi 52.21 - usluge pakiranja za prijevoz, vidi 52.29 - poštanske i kurirske djelatnosti, vidi 53.10 i 53.20 - prijevoz otpada, kao sastavni dio djelatnosti skupljanja otpada koju provode specijalizirana poduzeća, vidi 38.11, 38.12
scope note: Į šią klasę įeina: - visas krovinių vežimo keliais transportas: • miško medžiagos vežimas • gyvulių vežimas • šaldytų produktų vežimas • sunkių krovinių vežimas • betarių krovinių vežimas, tame tarpe autocisternose, įskaitant pieno surinkimą iš ūkių • automobilių vežimas • atliekų ir antrinių žaliavų vežimas be jų surinkimo ar šalinimo Į šią klasę taip pat įeina: - krovininių automobilių, su vairuotojo samdymu, nuoma - krovinių vežimas žmogaus ar gyvulių traukiamomis transporto priemonėmis Į šią klasę neįeina: - rąstų vežimas miške kaip medienos ruošos dalis, žr. 02.40 - vandens pristatymas vandenvežiais, žr. 36.00 krovinių tvarkymo transporto terminalų eksploatavimas, žr. 52.21 - pakavimo vežimui paslaugos, žr. 52.29 - pašto ir pasiuntinių (kurjerių) veikla, žr. 53.10, 53.20 - atliekų vežimas, kaip sudėtinė atliekų surinkimo veiklos dalis, žr. 38.11, 38.12 @lt
scope note: Этот класс включает: - грузовые перевозки по морю и в прибрежных водах, как рейсовые, так и нерейсовые - буксировку барж, нефтяных вышек и т.д. Этот класс также включает: - аренду морских судов для осуществления грузовых перевозок по морю или в прибрежных водах Этот класс исключает: - хранение грузов, см. 52.10 - управление деятельностью морских портов и гаваней, а также прочие вспомогательные услуги, такие как строительство доков, проводка судов, разгрузка/погрузка судов лихтером, услуги спасательных судов, см. 52.22 - погрузочно-разгрузочные работы, см. 52.24 - аренду торговых пароходов и катеров без судовой команды, см. 77.34 @ru
scope note: Bu sınıf aşağıdakileri kapsamaktadır; - karayolu ile tüm yük taşıma işlemleri: • tomruk taşınması, • canlı hayvan taşınması, • dondurulmuş ürünlerin taşınması, • ağır yük taşınması, • çiftliklerde süt toplanan tanker kamyonlar içinde yük taşınması da dahil dökme yük taşımacılığı, • otomobillerin taşınması, • toplanmaksızın ve bertaraf edilmeksizin, atıkların ve atık maddelerinin taşınması. Ayrıca bu sınıf aşağıdakileri de kapsamaktadır; - sürücü ile birlikte kamyonların kiralanması, - insanlar veya hayvanlar tarafından çekilen araçlarla yük taşınması, Kapsam dışı olanlar; - ağaç kesme işlemlerinin parçası olarak, orman içerisinde ağaç taşınması, bkz. 02.40, - kamyonlarla su dağıtımı, bkz. 36.00, - yüklerin boşaltılması ve yüklenmesi ile ilgili terminal tesislerinin işletilmesi, bkz. 52.21, - taşıma için kasalara yerleştirme ve paketleme hizmetleri, bkz. 52.29, - posta ve kuryecilik faaliyetleri, bkz. 53.10, 53.20, - atık toplama faaliyetlerinin bir entegre parçası olarak atıkların taşınması, bkz. 38.11, 38.12. @tr
preferred label: Товарен автомобилен транспорт @bg
preferred label: Silniční nákladní doprava @cs
preferred label: Vejgodstransport @da
preferred label: Güterbeförderung im Straßenverkehr @de
preferred label: Οδικές μεταφορές εμπορευμάτων @el
preferred label: Transporte de mercancías por carretera @es
preferred label: Kaubavedu maanteel @et
preferred label: Tieliikenteen tavarakuljetus @fi
preferred label: Transports routiers de fret @fr
preferred label: Közúti áruszállítás
preferred label: Trasporto di merci su strada @it
preferred label: Krovininis kelių transportas @lt
preferred label: Kravu pārvadājumi pa autoceļiem @lv
preferred label: Trasport ta'merkanzija bit-triq @mt
preferred label: Goederenvervoer over de weg @nl
preferred label: Godstransport på vei @no
preferred label: Transport drogowy towarów @pl
preferred label: Transportes rodoviários de mercadorias @pt
preferred label: Transporturi rutiere de mărfuri @ro
preferred label: Грузовые перевозки автомобильным транспортом @ru
preferred label: Nákladná cestná doprava @sk
preferred label: Cestni tovorni promet @sl
preferred label: Vägtransport, godstrafik @sv
preferred label: Karayolu ile yük taşımacılığı @tr
broader: Freight transport by road and removal services

Removal services
type: Concept
notation: 49.42
status: valid
status modified: 2013-10-18
accepted date: 2013-10-18
in scheme: Statistical Classification of Economic Activities in the European Community, Rev. 2 (2008)
scope note: - услуги по преместване (пренасяне) с автомобилен транспорт за предприятия и домакинства @bg
scope note: Z: - Stěhovací služby pro firmy a domácnosti poskytované silniční dopravou @cs
scope note: Diese Klasse umfasst: - Umzugsdienstleistungen für Unternehmen und Haushalte im Straßenverkehr @de
scope note: This class includes: - removal (relocation) services to businesses and households by road transport @en
scope note: Esta clase comprende: - los servicios de mudanza por carretera para empresas y hogares @es
scope note: Cette classe comprend: - les services de déménagement par transport routier fournis aux entreprises et aux ménages @fr
scope note: Ovaj razred uključuje: - usluge preseljenja poslovnih subjekata ili kućanstava kopnenim prijevozom
scope note: Į šią klasę įeina: - perkraustymo (persikėlimo) paslaugų teikimas kelių transportu įmonėms ir namų ūkiams @lt
scope note: Данная группа включает пассажирские перевозки во внутренних водах, с суден, которые не пригодны для морских перевозок. @ru
scope note: Bu sınıf aşağıdakileri kapsamaktadır; - karayolu taşımacılığı ile işyerlerine ve evlere verilen taşımacılık hizmetleri. @tr
preferred label: Услуги по преместване @bg
preferred label: Stěhovací služby @cs
preferred label: Flytteforretninger @da
preferred label: Umzugstransporte @de
preferred label: Υπηρεσίες μετακόμισης @el
preferred label: Servicios de mudanza @es
preferred label: Kolimisteenused @et
preferred label: Muuttopalvelut @fi
preferred label: Services de déménagement @fr
preferred label: Költöztetés
preferred label: Servizi di trasloco @it
preferred label: Perkraustymo veikla @lt
preferred label: Individuālie kravu pārvadāšanas pakalpojumi @lv
preferred label: Servizzi ta' ġarr @mt
preferred label: Verhuisbedrijven @nl
preferred label: Flyttetransport @no
preferred label: Działalność usługowa związana z przeprowadzkami @pl
preferred label: Serviços de mudanças @pt
preferred label: Servicii de mutare @ro
preferred label: Услуги по перевозкам @ru
preferred label: Sťahovacie služby @sk
preferred label: Selitvena dejavnost @sl
preferred label: Flyttjänster @sv
preferred label: Ev ve iş yerlerine verilen taşımacılık hizmetleri @tr
broader: Freight transport by road and removal services

Transport via pipeline
type: Concept
notation: 49.5
status: valid
status modified: 2013-10-18
accepted date: 2013-10-18
in scheme: Statistical Classification of Economic Activities in the European Community, Rev. 2 (2008)
scope note: Этот класс включает: - пассажирские перевозки по рекам, каналам, озерам и прочим внутренним водам, в том числе внутри гаваней и морских портов Этот класс также включает: - аренду прогулочных катеров с судовой командой для перевозок по внутренним водам Этот класс исключает: - аренду прогулочных катеров и яхт без судовой команды, см. 77.21 @ru
preferred label: Тръбопроводен транспорт @bg
preferred label: Potrubní doprava @cs
preferred label: Rørtransport @da
preferred label: Transport in Rohrfernleitungen @de
preferred label: Μεταφορές μέσω αγωγών @el
preferred label: Transporte por tubería @es
preferred label: Torutransport @et
preferred label: Putkijohtokuljetus @fi
preferred label: Transports par conduites @fr
preferred label: Csővezetékes szállítás
preferred label: Trasporto mediante condotte @it
preferred label: Transportavimas vamzdynais @lt
preferred label: Cauruļvadu transports @lv
preferred label: Trasport permezz ta' sistema ta' katusi @mt
preferred label: Vervoer via pijpleidingen @nl
preferred label: Transport rurociągowy @pl
preferred label: Transportes por oleodutos ou gasodutos @pt
preferred label: Transporturi prin conducte @ro
preferred label: Транспортирование по трубопроводу @ru
preferred label: Doprava potrubím @sk
preferred label: Cevovodni transport @sl
preferred label: Transporter i rörsystem @sv
preferred label: Boru hattı taşımacılığı @tr
broader: Land transport and transport via pipelines
narrower: Transport via pipeline

Transport via pipeline
type: Concept
notation: 49.50
status: valid
status modified: 2013-10-18
accepted date: 2013-10-18
in scheme: Statistical Classification of Economic Activities in the European Community, Rev. 2 (2008)
scope note: - пренос на газове, течности, вода и други продукти по магистрални тръбопроводи - експлоатация на помпени станции - разпределяне и доставяне на газообразни горива, топлинна енергия и вода - 35.22, 35.30, 36.00 - превоз на течни и газообразни товари с автомобили-цистерни - 49.41 @bg
scope note: Z: - přepravu plynů, kapalin, vody, odpadních kalů a jiných komodit dálkovým potrubím ZT: - provoz čerpacích stanic N: - distribuci zemního plynu nebo svítiplynu, páry nebo vody (včetně rozvozu vody nákladními automobily (35.22, 35.30, 36.00) - přepravu kapalin nákladními automobily (49.41) @cs
scope note: Diese Klasse umfasst: - Transport von Gasen, Flüssigkeiten, Schlämmen und anderen Gütern in Rohrfernleitungen Diese Klasse umfasst ferner: - Betrieb von Pumpstationen Diese Klasse umfasst nicht: - Verteilung von Erd- oder Stadtgas, Dampf oder Wasser (s. 35.22, 35.30, 36.00) - Transport von Flüssigkeiten mit Lastkraftwagen (s. 49.41) @de
scope note: This class includes: - transport of gases, liquids, water, slurry and other commodities via pipelines This class also includes: - operation of pump stations This class excludes: - distribution of natural or manufactured gas, steam or water, see 35.22, 35.30, 36.00 - transport of liquids by trucks, see 49.41 @en
scope note: Esta clase comprende: - el transporte de gases, líquidos, agua, lodos y otros productos por tuberías Esta clase comprende también: - las actividades de las estaciones de bombeo Esta clase no comprende: - la distribución de gas natural o fabricado, vapor o agua (véanse 35.22, 35.30 y 36.00) - el transporte de líquidos por camión (véase 49.41) @es
scope note: Cette classe comprend: - le transport de gaz, de liquides, d’eau, de boues et d’autres substances, par conduites Cette classe comprend également: - l’exploitation de stations de pompage Cette classe ne comprend pas: - la distribution de gaz naturel ou manufacturé, d’eau ou de vapeur (y compris la distribution de l’eau par camions), voir 35.22, 35.30 et 36.00 - le transport de liquides par camions, voir 49.41 @fr
scope note: Ovaj razred uključuje: - transport plina, tekućina, vode, mulja i drugih roba pomoću cjevovoda Ovaj razred također uključuje: - rad crpnih stanica Ovaj razred isključuje: - distribuciju prirodnog ili proizvedenog plina, vode ili pare, vidi 35.22, 35.30 i 36.00 - transport vode, tekućina itd. kamionima, vidi 49.41
scope note: Į šią klasę įeina: - dujų, skysčių, vandens, suspensijų ir kitų pardavimui skirtų produktų transportavimas vamzdynais Į šią klasę taip pat įeina: - siurblinių eksploatavimas Į šią klasę neįeina: - gamtinių ar gamyklinių dujų, garo ar vandens paskirstymas, žr. 35.22, 35.30, 36.00 - skysčių vežimas vilkikais, žr. 49.41 @lt
scope note: Данная группа включает грузовые перевозки во внутренних водах, с использованием судов, не пригодных для морских перевозок. @ru
scope note: Bu sınıf aşağıdakileri kapsamaktadır; - gazların, sıvıların, suyun, sulu çimento ve diğer malların boru hatları vasıtasıyla taşınması. Ayrıca bu sınıf aşağıdakileri de kapsamaktadır; - pompa istasyonlarının işletilmesi. Kapsam dışı olanlar; - doğal veya işlenmiş gaz, buhar veya suyun dağıtımı, bkz. 35.22, 35.30, 36.00, - sıvıların kamyonlarla taşınması, bkz. 49.41. @tr
preferred label: Тръбопроводен транспорт @bg
preferred label: Potrubní doprava @cs
preferred label: Rørtransport @da
preferred label: Transport in Rohrfernleitungen @de
preferred label: Μεταφορές μέσω αγωγών @el
preferred label: Transporte por tubería @es
preferred label: Torutransport @et
preferred label: Putkijohtokuljetus @fi
preferred label: Transports par conduites @fr
preferred label: Csővezetékes szállítás
preferred label: Trasporto mediante condotte @it
preferred label: Transportavimas vamzdynais @lt
preferred label: Cauruļvadu transports @lv
preferred label: Transport permezz ta' sistema ta' katusi @mt
preferred label: Vervoer via pijpleidingen @nl
preferred label: Transport rurociągowy @pl
preferred label: Transportes por oleodutos ou gasodutos @pt
preferred label: Transporturi prin conducte @ro
preferred label: Транспортирование по трубопроводу @ru
preferred label: Doprava potrubím @sk
preferred label: Cevovodni transport @sl
preferred label: Transporter i rörsystem @sv
preferred label: Boru hattı taşımacılığı @tr
broader: Transport via pipeline

Water transport
type: Concept
notation: 50
status: valid
status modified: 2013-10-18
accepted date: 2013-10-18
in scheme: Statistical Classification of Economic Activities in the European Community, Rev. 2 (2008)
scope note: превоз на пътници и товари по вода по разписание или не; превози чрез влекачи и тласкачи на шлепове; еднодневни екскурзии по море, разглеждане на забележителности с плавателни съдове и експлоатация на кораби за круизи; експлоатация на фериботи, водни таксита и други.Определящ критерий за разделянето на морски и транспорт по вътрешни водни пътища е видът на използвания плавателен съд, въпреки че местонахождението е показател за това. Морският и крайбрежният транспорт се класифицират в групите 50.1 и 50.2, а транспортът по вътрешни водни пътища се класифицира в групите 50.3 и 50.4. - дейности на ресторанти и питейни заведения на борда на кораби (клас 56.10, 56.30), ако са осъществени от самостоятелни единици @bg
scope note: Tento oddíl zahrnuje dopravu osob i nákladů po vodě, pravidelnou i nepravidelnou dopravu. Zahrnuje také vlečení a tlačení lodí, plavbu lodí pro potřeby exkurzí, pro zábavu a poznávání, dopravu trajekty a vodními taxi atd. Ačkoli poloha je určitým kriteriem pro zařazení do námořní nebo vnitrozemské vodní dopravy, tím rozhodujícím faktorem je druh použitého plavidla. Doprava námořními plavidly je začleněna do skupin 50.1 a 50.2, doprava jinými plavidly je klasifikována ve skupinách 50.3 a 50.4. Tento oddíl nezahrnuje provoz restaurací a barů na palubě lodí, pokud jsou provozovány samostatnými firmami (56.10 a 56.30) @cs
scope note: Diese Abteilung umfasst die Personen- und Güterbeförderung zu Wasser im Linien- oder Gelegenheitsverkehr. Ebenso enthalten ist der Betrieb von Schlepp- und Schubschiffen, Ausflugs- und Kreuzfahrtschiffen, Fähren, Wassertaxis usw. Zwar lässt der Einsatzort Rückschlüsse auf die Unterscheidung zwischen See-/Küstenschifffahrt einerseits und Binnenschifffahrt andererseits zu, doch ausschlaggebend ist letztlich die Art des eingesetzten Wasserfahrzeugs. Die Beförderung auf Seeschiffen ist in die Gruppen 50.1 und 50.2 eingeordnet, der Transport mit anderen Schiffen hingegen in die Gruppen 50.3 und 50.4. Nicht eingeschlossen in dieser Abteilung ist der Betrieb von Restaurants und Bars an Bord von Schiffen (s. Klassen 56.10 und 56.30), falls dieser durch eigenständige Unternehmen erfolgt. @de
scope note: This division includes the transport of passengers or freight over water, whether scheduled or not. Also included are the operation of towing or pushing boats, excursion, cruise or sightseeing boats, ferries, water taxis etc. Although the location is an indicator for the separation between sea and inland water transport, the deciding factor is the type of vessel used. Transport on sea-going vessels is classified in groups 50.1 and 50.2, while transport using other vessels is classified in groups 50.3 and 50.4. This division excludes restaurant and bar activities on board ships (see 56.10, 56.30), if carried out by separate units. @en
scope note: Esta división comprende el transporte marítimo y por vías de navegación interiores de pasajeros o mercancías, sea regular o no. Comprende también el transporte por remolque o impulso de barcazas, los barcos de excursión, turísticos o cruceros, los transbordadores, las embarcaciones taxi, etc. Aunque la ubicación es un factor para la separación entre transporte marítimo y por vías de navegación interior, el factor principal es el tipo de embarcación que se utilice. El transporte en buques de altura se clasifica en los grupos 50.1 y 50.2, mientras que el transporte que utiliza otros tipos de embarcación se clasifica en los grupos 50.3 y 50.4. Esta división no comprende las actividades de servicio de bar y restaurante a bordo de embarcaciones (véase 56.10 y 56.30), prestadas por unidades independientes. @es
scope note: Cette division comprend le transport, régulier ou non, de passagers et de marchandises par eau. Elle comprend également l’exploitation de remorqueurs et de pousseurs de péniches, de bateaux d’excursion, de croisière ou de tourisme, de bacs, de bateaux-taxis, etc. Si le lieu d’activité permet de déterminer s’il s’agit de transport par voies navigables intérieures ou maritimes, c’est le type d’embarcation utilisée qui est le facteur décisif. Le transport effectué par des bateaux destinés à la navigation maritime est classé dans les groupes 50.1 et 50.2, tandis que le transport par d’autres navires est rangé dans les groupes 50.3 et 50.4. Cette division ne comprend pas les activités des bars et des restaurants installés à bord de bateaux (voir 56.10 et 56.30), s’ils sont exploités par des unités distinctes. @fr
scope note: Ovaj odjeljak uključuje prijevoz putnika ili robe vodom, bilo da je riječ o redovitom ili izvanrednom prijevozu. Također su uključeni vuča ili guranje brodova, izleti, kružna putovanja i razgledanja brodom, prijevoz trajektima, taksijima itd. Iako je mjesto indikator za razdvajanje morskog od slatkovodnog prijevoza, odlučujući faktor zapravo je vrsta plovila koje se koristi. Prijevoz plovilima na moru razvrstava se pod skupine 50.1 i 50.2, dok se prijevoz koji se koristi drugim vrstama plovila razvrstava pod skupine 50.3 i 50.4. Ovaj odjeljak isključuje djelatnosti restorana i barova na palubama broda (vidi razrede 56.10 i 56.30), ako ih izvode izdvojene jedinice.
scope note: Į šį skyrių įeina keleivių ir krovinių vežimas vandeniu, pagal tvarkaraštį arba ne. Į šį skyrių taip pat įeina stumtuvų arba vilkikų, ekskursinių katerių, kruizinių arba apžvalgos laivų, keltų, vandens taksi ir kt. eksploatavimas. Nors buvimo vieta yra rodiklis, leidžiantis atskirti jūros ir vidaus vandenų transportą, lemiamas veiksnys yra naudojamo laivo tipas. Vežimas jūros laivais įeina į grupes 50.1 ir 50.2, o vežimas kitais laivais įeina į grupes 50.3 ir 50.4. Į šį skyrių neįeina restoranų ir barų veikla laivuose (žr. 56.10, 56.30) tuo atveju, jeigu šią veiklą atlieką skirtingi verslo vienetai. @lt
scope note: Этот класс включает: - грузовые перевозки по рекам, каналам, озерам и прочим внутренним водам, в том числе внутри гаваней и морских портов Этот класс также включает: - аренду судов с судовой командой для грузовых перевозок во внутренних водах Этот класс исключает: - погрузочно-разгрузочные работы, см. 52.24 - аренду торговых пароходов и катеров без судовой команды, см. 77.34 @ru
scope note: Bu bölüm, tarifeli olsun ya da olmasın, su üzerinde yolcu ve yük taşınmasını kapsamaktadır. Çekici ve itici botlar, gezi, seyahat veya tur botları, araba vapurları, deniz otobüsleri ve benzerlerinin işletilmesi de burada kapsanmaktadır. Yer, deniz ve iç su taşımacılığı arasındaki ayrım için bir gösterge olmasına rağmen, belirleyici faktör kullanılan taşıma aletlerinin türü olmaktadır. Denizde kullanılan gemi ya da teknelerle yapılan taşımacılık Gruplar 50.1 ve 50.2`de sınıflandırılırken, diğer gemilerle yapılan taşımacılık Gruplar 50.3 ve 50.4`de sınıflandırılmaktadır. Bu bölüm, eğer ayrı birimler tarafından işletiliyorlar ise gemilerdeki restoran ve bar faaliyetlerini hariç tutmaktadır (bkz. 56.10 ve 56.30). @tr
preferred label: Воден транспорт @bg
preferred label: Vodní doprava @cs
preferred label: Skibsfart @da
preferred label: Schifffahrt @de
preferred label: Πλωτές μεταφορές @el
preferred label: Transporte marítimo y por vías navegables interiores @es
preferred label: Veetransport @et
preferred label: Vesiliikenne @fi
preferred label: Transports par eau @fr
preferred label: Vízi szállítás
preferred label: Trasporti marittimi e per vie d'acqua @it
preferred label: Vandens transportas @lt
preferred label: Ūdens transports @lv
preferred label: Trasport bl-ilma @mt
preferred label: Vervoer over water @nl
preferred label: Sjøfart @no
preferred label: Transport wodny @pl
preferred label: Transportes por água @pt
preferred label: Transporturi pe apă @ro
preferred label: Водный транспорт @ru
preferred label: Vodná doprava @sk
preferred label: Vodni promet @sl
preferred label: Sjötransport @sv
preferred label: Su yolu taşımacılığı @tr
broader: TRANSPORTATION AND STORAGE
narrower: Sea and coastal passenger water transport
narrower: Sea and coastal freight water transport
narrower: Inland passenger water transport
narrower: Inland freight water transport

Sea and coastal passenger water transport
type: Concept
notation: 50.1
status: valid
status modified: 2013-10-18
accepted date: 2013-10-18
in scheme: Statistical Classification of Economic Activities in the European Community, Rev. 2 (2008)
scope note: превоз на пътници с плавателни съдове, предназначени за плаване по морски и крайбрежни води. Включва още превоз на пътници по големи езера и други водни пространства, където се използват подобни видове плавателни съдове. @bg
scope note: Tato skupina zahrnuje dopravu cestujících plavidly, která byla konstruována pro plavbu na moři nebo v pobřežních vodách. Zahrnuje také osobní dopravu na velkých jezerech atd., pokud se používají podobná plavidla. @cs
scope note: Diese Gruppe umfasst die Beförderung von Passagieren auf Wasserfahrzeugen, die für den Einsatz auf hoher See oder in Küstengewässern konstruiert wurden. Eingeschlossen ist auch die Personenbeförderung auf großen Seen usw., falls ähnliche Wasserfahrzeuge zum Einsatz kommen. @de
scope note: This group includes the transport of passengers on vessels designed for operating on sea or coastal waters. Also included is the transport of passengers on great lakes etc. when similar types of vessels are used. @en
scope note: Este grupo comprende el transporte de pasajeros en embarcaciones diseñadas para navegar por aguas marinas, incluidas las costeras. Comprende también el transporte de pasajeros en grandes lagos, etc. cuando se utilizan los mismos tipos de embarcaciones. @es
scope note: Ce groupe comprend le transport de passagers sur des bateaux conçus pour naviguer en mer ou dans les eaux côtières. Le transport de passagers sur de grands lacs, etc., est également inclus si le type de bateaux utilisé est similaire. @fr
scope note: Ova skupina uključuje prijevoz putnika plovilima koja su osposobljena za prijevoz morem ili priobaljem. Također je uključen prijevoz putnika na velikim jezerima itd. kada se koriste iste vrste plovila.
scope note: Į šią grupę įeina keleivių vežimas laivais, skirtais naudoti jūroje arba pakrančių vandenyse. Į šią grupę taip pat įeina keleivių vežimas dideliais ežerais ir kt., kai naudojami šio tipo laivai. @lt
scope note: Данный раздел включает пассажирские или грузовые перевозки по воздуху или в космическом пространстве. Данный раздел исключает: - опыление сельскохозяйственных культур с воздуха, см. 01.61 - капитальный ремонт воздушных суден или авиадвигателей, см. 33.16 - управление деятельностью аэропортов, см. 52.23 - воздушную рекламу, см. 73.11 - аэрофотосъемку, см. 74.20 @ru
scope note: Bu grup, deniz veya sahil sularında işletilmek için dizayn edilen gemilerle yapılan yolcu taşımacılığını kapsamaktadır. Ayrıca, benzer gemilerin kullanılması halinde büyük göller vb. yerlerdeki yolcu taşımacılığı da bu kapsama dahildir. @tr
preferred label: Пътнически морски и крайбрежен транспорт @bg
preferred label: Námořní a pobřežní osobní doprava @cs
preferred label: Sø- og kysttransport af passagerer @da
preferred label: Personenbeförderung in der See- und Küstenschifffahrt @de
preferred label: Θαλάσσιες και ακτοπλοϊκές μεταφορές επιβατών @el
preferred label: Transporte marítimo de pasajeros @es
preferred label: Sõitjatevedu merel ja rannavetes @et
preferred label: Meri- ja rannikkovesiliikenteen henkilökuljetus @fi
preferred label: Transports maritimes et côtiers de passagers @fr
preferred label: Tengeri személyszállítás
preferred label: Trasporto marittimo e costiero di passeggeri @it
preferred label: Jūrų ir pakrančių keleivinis vandens transportas @lt
preferred label: Pasažieru jūras un piekrastes ūdens transports @lv
preferred label: Trasport ta' passiġġieri fuq il-baħar u mal-kosta @mt
preferred label: Zee- en kustvaart, personenvervoer @nl
preferred label: Sjøfart og kysttrafikk med passasjerer @no
preferred label: Transport morski i wodny przybrzeżny pasażerski @pl
preferred label: Transportes marítimos de passageiros @pt
preferred label: Transporturi maritime şi costiere de pasageri @ro
preferred label: Морской и прибрежный пассажирский транспорт @ru
preferred label: Námorná a pobrežná osobná vodná doprava @sk
preferred label: Pomorski potniški promet @sl
preferred label: Havs- och kustsjöfart, passagerartrafik @sv
preferred label: Deniz ve kıyı sularında yolcu taşımacılığı @tr
broader: Water transport
narrower: Sea and coastal passenger water transport

Sea and coastal passenger water transport
type: Concept
notation: 50.10
status: valid
status modified: 2013-10-18
accepted date: 2013-10-18
in scheme: Statistical Classification of Economic Activities in the European Community, Rev. 2 (2008)
scope note: - превоз на пътници по морски и крайбрежни води по разписание или не: • еднодневни екскурзии по море, разглеждане на забележителности с плавателни съдове и експлоатация на кораби за круизи • експлоатация на фериботи, водни таксита и други - даване под наем на плавателни съдове за развлечение, с екипаж (например за пътувания с цел риболов) - дейности на ресторанти и питейни заведения на борда на кораби, когато са осъществени от самостоятелни единици - 56.10, 56.30 - даване под наем на яхти и други плавателни съдове за развлечение, без екипаж - 77.21 - даване под наем на търговски кораби или други плавателни съдове, без екипаж - 77.34 - експлоатация на плаващи казина - 92.00 @bg
scope note: Z: - dopravu osob v mořských a pobřežních vodách pravidelnou dopravou nebo příležitostně: • provozování lodí pro exkurze, zábavu, poznávání • provozování trajektů, vodních taxi atd. ZT: - pronájem výletních lodí s posádkou pro námořní a pobřežní plavbu (např. plavba s rybařením) N: - provozování restaurací a barů na palubě lodí, pokud patří samostatné firmě (56.10 a 56.30) - pronájem výletních lodí a jachet bez posádky (77.21) - pronájem komerčních lodí a člunů bez posádky (77.34) - provoz „plovoucích kasin“ (92.00) @cs
scope note: Diese Klasse umfasst: - Personenbeförderung in der See- und Küstenschifffahrt, im Linien- oder Gelegenheitsverkehr: • Betrieb von Ausflugs- und Kreuzfahrtschiffen • Betrieb von Fähren, Wassertaxis usw. Diese Klasse umfasst ferner: - Vermietung von Vergnügungsschiffen mit Besatzung für den Hochsee- und Küstenverkehr (z. B. für Fischfangfahrten) Diese Klasse umfasst nicht: - Betrieb von Restaurants und Bars an Bord von Schiffen, falls dieser durch eigenständige Unternehmen erfolgt (s. 56.10 und 56.30) - Vermietung von Vergnügungsschiffen und Yachten ohne Besatzung (s. 77.21) - Vermietung von Handelsschiffen ohne Besatzung (s. 77.34) - Betrieb von "schwimmenden Casinos" (s. 92.00) @de
scope note: This class includes: - transport of passengers over seas and coastal waters, whether scheduled or not: • operation of excursion, cruise or sightseeing boats • operation of ferries, water taxis etc. This class also includes: - renting of pleasure boats with crew for sea and coastal water transport (e.g. for fishing cruises) This class excludes: - restaurant and bar activities on board ships, when provided by separate units, see 56.10, 56.30 - renting of pleasure boats and yachts without crew, see 77.21 - renting of commercial ships or boats without crew, see 77.34 - operation of "floating casinos”, see 92.00 @en
scope note: Esta clase comprende: - el transporte marítimo (incluido el costero) de pasajeros, regular o no: • las actividades de los barcos de excursión, turísticos o cruceros • las actividades de los transbordadores, embarcaciones taxi, etc. Esta clase comprende también: - el alquiler de embarcaciones de recreo con tripulación para transporte marítimo (incluido el costero) (por ejemplo, para cruceros de pesca) Esta clase no comprende: - las actividades de servicio de bar y restaurante a bordo de embarcaciones, prestadas por unidades independientes (véanse 56.10 y 56.30) - el alquiler de embarcaciones de recreo y yates sin tripulación (véase 77.21) - el alquiler de barcos y buques comerciales sin tripulación (véase 77.34) - la explotación de “casinos flotantes” (véase 92.00) @es
scope note: Cette classe comprend: - le transport maritime et côtier, régulier ou non, de passagers: • l’exploitation de bateaux d’excursion, de croisière ou de tourisme • l’exploitation de bacs, de bateaux-taxis, etc. Cette classe comprend également: - la location de bateaux de plaisance avec équipage pour le transport maritime et côtier (par exemple: pour des croisières de pêche) Cette classe ne comprend pas: - les activités des bars et des restaurants installés à bord de bateaux, s’ils sont exploités par des unités distinctes, voir 56.10 et 56.30. - la location de bateaux de plaisance et voiliers sans équipage, voir 77.21 - la location de bateaux et navires commerciaux sans équipage, voir 77.34 - l’exploitation de "casinos flottants", voir 92.00 @fr
scope note: Ovaj razred uključuje: - prijevoz putnika morem i priobaljem, redoviti ili izvanredni: • prijevoz brodovima ili čamcima za izlete, kružna putovanja ili razgledanje • prijevoz trajektima, taksijima na vodi itd. Ovaj razred također uključuje: - iznajmljivanje čamaca za razonodu s posadom za prijevoz morem i priobaljem (npr. za ribolov) Ovaj razred isključuje: - djelatnosti restorana i barova na brodovima, osim kada obavlja samostalno poduzeće, vidi 56.10 i 56.30 - iznajmljivanje čamaca i jedrilica za razonodu, bez posade, vidi 77.21 - iznajmljivanje komercijalnih brodova ili čamaca, bez posade, vidi 77.34 - djelatnost „kockarnica na vodi", vidi 92.00
scope note: Į šią klasę įeina: - keleivių vežimas jūrų ir pakrančių vandenimis, pagal tvarkaraštį arba be jo: • ekskursinių katerių, kruizinių arba apžvalgos laivų eksploatavimas • keltų, vandens taksi ir kt. eksploatavimas Į šią klasę taip pat įeina: - pramoginių katerių, su įgulos samdymu, nuoma vežimui jūrų ir pakrančių vandenimis (pvz., žvejybiniams kruizams) Į šią klasę neįeina: - restoranų ir barų veikla laivuose tuo atveju, jeigu šią veiklą atlieka skirtingi verslo vienetai, žr. 56.10, 56.30 - pramoginių katerių ir jachtų, be įgulos samdymo, nuoma, žr. 77.21 - prekybinių laivų arba katerių, be įgulos samdymo, nuoma, žr. 77.34 - plaukiojančių lošimo namų veikla, žr. 92.00 @lt
scope note: Bu sınıf aşağıdakileri kapsamaktadır; - tarifeli olsun ya da olmasın, deniz ve sahil sularında yolcuların taşınması, • gezi, seyahat veya tur botlarının işletilmesi, • feribotlar, deniz otobüsleri ve benzerlerinin işletilmesi. Ayrıca bu sınıf aşağıdakileri de kapsamaktadır; - deniz ve sahil sularında taşımacılık için mürettebatla birlikte gezinti gemilerinin kiralanması (örneğin balıkçılık teknelerinin kiralanması). Kapsam dışı olanlar; - ayrı birimler tarafından gerçekleştirildiğinde gemilerde restoran ve bar faaliyetleri, bkz. 56.10, 56.30, - gezinti teknelerinin ve yatların mürettebatsız olarak kiralanması, bkz. 77.21, - ticari gemilerin veya botların mürettebatsız olarak kiralanması, bkz. 77.34, - yüzer kumarhaneler`in işletilmesi, bkz 92.00. @tr
preferred label: Пътнически морски и крайбрежен транспорт @bg
preferred label: Námořní a pobřežní osobní doprava @cs
preferred label: Sø- og kysttransport af passagerer @da
preferred label: Personenbeförderung in der See- und Küstenschifffahrt @de
preferred label: Θαλάσσιες και ακτοπλοϊκές μεταφορές επιβατών @el
preferred label: Transporte marítimo de pasajeros @es
preferred label: Sõitjatevedu merel ja rannavetes @et
preferred label: Meri- ja rannikkovesiliikenteen henkilökuljetus @fi
preferred label: Transports maritimes et côtiers de passagers @fr
preferred label: Tengeri személyszállítás
preferred label: Trasporto marittimo e costiero di passeggeri @it
preferred label: Jūrų ir pakrančių keleivinis vandens transportas @lt
preferred label: Pasažieru jūras un piekrastes ūdens transports @lv
preferred label: Trasport ta' passiġġieri fuq il-baħar u mal-kosta @mt
preferred label: Zee- en kustvaart, personenvervoer @nl
preferred label: Sjøfart og kysttrafikk med passasjerer @no
preferred label: Transport morski i wodny przybrzeżny pasażerski @pl
preferred label: Transportes marítimos de passageiros @pt
preferred label: Transporturi maritime şi costiere de pasageri @ro
preferred label: Морской и прибрежный пассажирский транспорт @ru
preferred label: Námorná a pobrežná osobná vodná doprava @sk
preferred label: Pomorski potniški promet @sl
preferred label: Havs- och kustsjöfart, passagerartrafik @sv
preferred label: Deniz ve kıyı sularında yolcu taşımacılığı @tr
broader: Sea and coastal passenger water transport

Sea and coastal freight water transport
type: Concept
notation: 50.2
status: valid
status modified: 2013-10-18
accepted date: 2013-10-18
in scheme: Statistical Classification of Economic Activities in the European Community, Rev. 2 (2008)
scope note: превоз на товари с плавателни съдове, предназначени за плаване по морски и крайбрежни води.Включва още превоз на товари по големи езера и други водни пространства, когато са използвани подобни видове плавателни съдове. @bg
scope note: Tato skupina zahrnuje dopravu nákladů plavidly, která byla konstruována pro plavbu na moři nebo v pobřežních vodách. Zahrnuje rovněž nákladní dopravu na velkých jezerech atd., pokud se používají podobná plavidla. @cs
scope note: Diese Gruppe umfasst die Beförderung von Gütern auf Wasserfahrzeugen, die für den Einsatz auf hoher See oder in Küstengewässern konstruiert wurden. Eingeschlossen ist auch die Güterbeförderung auf großen Seen usw., falls ähnliche Wasserfahrzeuge zum Einsatz kommen. @de
scope note: This group includes the transport of freight on vessels designed for operating on sea or coastal waters. Also included is the transport of freight on great lakes etc. when similar types of vessels are used. @en
scope note: Este grupo comprende el transporte de mercancías en embarcaciones diseñadas para navegar por aguas marinas, incluidas las costeras. Comprende también el transporte de mercancías en grandes lagos, etc. cuando se utilizan los mismos tipos de embarcaciones. @es
scope note: Ce groupe comprend le transport de marchandises sur des bateaux conçus pour naviguer en mer ou dans les eaux côtières. Le transport de marchandises sur de grands lacs, etc., est également inclus si le type de bateaux utilisé est similaire. @fr
scope note: Ova skupina uključuje pomorski prijevoz robe plovilima koja su osposobljena za prijevoz morem ili priobaljem. Također je uključen prijevoz robe na velikim jezerima itd. kada se koriste iste vrste plovila.
scope note: Į šią grupę įeina krovinių vežimas laivais, skirtais naudoti jūroje arba pakrančių vandenyse. Į šią grupę taip pat įeina krovinių vežimas dideliais ežerais ir kt., kai naudojami panašaus tipo laivai. @lt
scope note: Этот класс включает: - пассажирские перевозки воздушным транспортом по стандартному маршруту и в соответствии со стандартным расписанием - чартерные рейсы для пассажиров - полеты с целью осмотра достопримечательностей Этот класс также включает: - аренду воздушно-транспортного оборудования с целью осуществления пассажирских перевозок - авиационные услуги общего характера, такие как: • пассажирские перевозки, организованные аэроклубами с целью инструктажа или развлечения Этот класс исключает: - аренду воздушно-транспортного оборудования без оператора, см. 77.35 @ru
scope note: Bu grup deniz veya sahil sularında işletilmek için dizayn edilen gemilerle yapılan yük taşımacılığını kapsamaktadır. Ayrıca, benzer gemilerin kullanılması halinde büyük göller vb. yerlerdeki yük taşımacılığı da bu kapsama dahildir. @tr
preferred label: Товарен морски и крайбрежен транспорт @bg
preferred label: Námořní a pobřežní nákladní doprava @cs
preferred label: Sø- og kysttransport af gods @da
preferred label: Güterbeförderung in der See- und Küstenschifffahrt @de
preferred label: Θαλάσσιες και ακτοπλοϊκές μεταφορές εμπορευμάτων @el
preferred label: Transporte marítimo de mercancías @es
preferred label: Kaubavedu merel ja rannavetes @et
preferred label: Meri- ja rannikkovesiliikenteen tavarakuljetus @fi
preferred label: Transports maritimes et côtiers de fret @fr
preferred label: Tengeri áruszállítás
preferred label: Trasporto marittimo e costiero di merci @it
preferred label: Jūrų ir pakrančių krovininis vandens transportas @lt
preferred label: Kravu jūras un piekrastes ūdens transports @lv
preferred label: Trasport ta' merkanzija fuq il-baħar u mal-kosta @mt
preferred label: Zee- en kustvaart, goederenvervoer @nl
preferred label: Sjøfart og kysttrafikk med gods @no
preferred label: Transport morski i wodny przybrzeżny towarów @pl
preferred label: Transportes marítimos de mercadorias @pt
preferred label: Transporturi maritime şi costiere de marfă @ro
preferred label: Морской и прибрежный грузовой транспорт @ru
preferred label: Námorná a pobrežná nákladná vodná doprava @sk
preferred label: Pomorski tovorni promet @sl
preferred label: Havs- och kustsjöfart, godstrafik @sv
preferred label: Deniz ve kıyı sularında yük taşımacılığı @tr
broader: Water transport
narrower: Sea and coastal freight water transport

Sea and coastal freight water transport
type: Concept
notation: 50.20
status: valid
status modified: 2013-10-18
accepted date: 2013-10-18
in scheme: Statistical Classification of Economic Activities in the European Community, Rev. 2 (2008)
scope note: - превоз на товари по морски и крайбрежни води по разписание или не - превоз чрез влекачи и тласкачи на шлепове, нефтени платформи и други - даване под наем на плавателни съдове за превоз на товари, с екипаж - складиране на товари - 52.10 - експлоатация на пристанища и други спомагателни дейности като акостиране, навигация, изваждане на потънали кораби и други - 52.22 - обработка на товари - 52.24 - даване под наем на търговски кораби или други плавателни съдове, без екипаж - 77.34 @bg
scope note: Z: - dopravu nákladu po moři a v pobřežních vodách, pravidelnou nebo nepravidelnou: - dopravu vlečením a tlačením remorkéry, dopravu ropných plošin atd. ZT: - pronájem lodí s posádkou pro námořní a pobřežní nákladní dopravu N: - skladování nákladu(52.10) - provoz přístavu a ostatní pomocné činnosti, jako činnosti v docích, lodivodství, překládání zboží pomocí námořních člunů, záchrana lodí (52.22) - manipulace s nákladem (52.24) - pronájem komerčních lodí a člunů bez posádky (77.34) @cs
scope note: Diese Klasse umfasst: - Güterbeförderung in der See- und Küstenschifffahrt, im Linien- oder Gelegenheitsverkehr - Betrieb von Schlepp- und Schubschiffen, Bohrinseln usw. Diese Klasse umfasst ferner: - Vermietung von Schiffen mit Besatzung für die Güterbeförderung in der See- und Küstenschifffahrt Diese Klasse umfasst nicht: - Lagerei (s. 52.10) - Hafenbetrieb und sonstige Hilfstätigkeiten wie Docken, Lotsendienst, Leichtertransport, Bergung von Schiffen (s. 52.22) - Frachtumschlag (s. 52.24) - Vermietung von Handelsschiffen ohne Besatzung (s. 77.34) @de
scope note: This class includes: - transport of freight over seas and coastal waters, whether scheduled or not - transport by towing or pushing of barges, oil rigs etc. This class also includes: - renting of vessels with crew for sea and coastal freight water transport This class excludes: - storage of freight, see 52.10 - harbour operation and other auxiliary activities such as docking, pilotage, lighterage, vessel salvage, see 52.22 - cargo handling, see 52.24 - renting of commercial ships or boats without crew, see 77.34 @en
scope note: Esta clase comprende: - el transporte marítimo (incluido el costero) de mercancías, regular o no - el transporte por remolque o impulso de barcazas, plataformas petrolíferas, etc. Esta clase comprende también: - el alquiler de embarcaciones con tripulación para el transporte marítimo (incluido el costero) de mercancías Esta clase no comprende: - el almacenamiento de mercancías (véase 52.10) - los servicios portuarios y otras actividades auxiliares como el atraque, pilotaje, descarga de mercancías en gabarras desde el buque hasta tierra, salvamento marítimo (véase 52.22) - la manipulación de mercancías (véase 52.24) - el alquiler de barcos y buques comerciales sin tripulación (véase 77.34) @es
scope note: Cette classe comprend: - le transport maritime et côtier, régulier ou non, de marchandises - l’exploitation de remorqueurs et de pousseurs de péniches, de plates-formes de forage pétrolier, etc. Cette classe comprend également: - la location de bateaux avec équipage pour le transport maritime et côtier de fret Cette classe ne comprend pas: - l’entreposage de marchandises, voir 52.10 - l’exploitation de ports et les autres activités auxiliaires telles que le radoub et le carénage, le pilotage, le déchargement par allèges, le sauvetage d’épaves, voir 52.22 - la manutention du fret, voir 52.24 - la location de bateaux et navires commerciaux sans équipage, voir 77.34 @fr
scope note: Ovaj razred uključuje: - prijevoz robe morem ili priobaljem, redoviti ili izvanredni - prijevoz vučom ili guranjem teglenica, morske platforme za bušenje i crpljenje nafte Ovaj razred također uključuje: - iznajmljivanje brodova s posadom za morski i obalni prijevoz robe Ovaj razred isključuje: - skladištenje robe, vidi 52.10 - upravljanje lukom i druge pomoćne djelatnosti kao što su: vezivanje broda, pilotiranje, prijevoz tereta pomoću maune (teglenice), spašavanje brodova, vidi 52.22 - prekrcaj tereta, vidi 52.24 - iznajmljivanje komercijalnih brodova ili čamaca, bez posade, vidi 77.34
scope note: Į šią klasę įeina: - krovinių vežimas jūrų ir pakrančių vandenimis, pagal tvarkaraštį arba be jo - transportavimas stumiamomis arba velkamomis baržomis, naftos gręžinių platformų eksploatavimas ir kt. Į šią klasę taip pat įeina: - krovininių jūrų ir pakrančių vandenų laivų, su įgulos samdymu, nuoma Į šią klasę neįeina: - krovinių sandėliavimas ir saugojimas, žr. 52.10 - uosto eksploatavimas ir kita pagalbinė veikla, tokia kaip laivų švartavimas doke, laivų vedimas (locmanų paslaugos), laivų pakrovimas (iškrovimas) baržomis (lichteriu), laivų gelbėjimas, žr. 52.22 - krovinių tvarkymas, žr. 52.24 - prekybinių laivų arba katerių, be įgulos samdymo, nuoma, žr. 77.34 @lt
scope note: Bu sınıf aşağıdakileri kapsamaktadır; - tarifeli olsun ya da olmasın, deniz ve sahil sularında yük taşınması, - mavnalar, petrol külleri vb.nin çekme ve itme yöntemi ile taşınması Ayrıca bu sınıf aşağıdakileri de kapsamaktadır; - deniz ve sahil sularında yük taşımacılığı amacıyla teknelerin mürettebatıyla beraber kiralanması Kapsam dışı olanlar; - yükün depolanması, bkz. 52.10, - liman işletimi ve geminin limana sokulması, kılavuzluk, geminin boşaltılması, kurtarma aracı gibi diğer yardımcı faaliyetler, bkz. 52.22, - kargo yükleme boşaltma hizmetleri, bkz. 52.24, - ticari gemilerin veya botların mürettebatsız olarak kiralanması, bkz. 77.34. @tr
preferred label: Товарен морски и крайбрежен транспорт @bg
preferred label: Námořní a pobřežní nákladní doprava @cs
preferred label: Sø- og kysttransport af gods @da
preferred label: Güterbeförderung in der See- und Küstenschifffahrt @de
preferred label: Θαλάσσιες και ακτοπλοϊκές μεταφορές εμπορευμάτων @el
preferred label: Transporte marítimo de mercancías @es
preferred label: Kaubavedu merel ja rannavetes @et
preferred label: Meri- ja rannikkovesiliikenteen tavarakuljetus @fi
preferred label: Transports maritimes et côtiers de fret @fr
preferred label: Tengeri áruszállítás
preferred label: Trasporto marittimo e costiero di merci @it
preferred label: Jūrų ir pakrančių krovininis vandens transportas @lt
preferred label: Kravu jūras un piekrastes ūdens transports @lv
preferred label: Trasport ta' merkanzija fuq il-baħar u mal-kosta @mt
preferred label: Zee- en kustvaart, goederenvervoer @nl
preferred label: Sjøfart og kysttrafikk med gods @no
preferred label: Transport morski i wodny przybrzeżny towarów @pl
preferred label: Transportes marítimos de mercadorias @pt
preferred label: Transporturi maritime şi costiere de marfă @ro
preferred label: Морской и прибрежный грузовой транспорт @ru
preferred label: Námorná a pobrežná nákladná vodná doprava @sk
preferred label: Pomorski tovorni promet @sl
preferred label: Havs- och kustsjöfart, godstrafik @sv
preferred label: Deniz ve kıyı sularında yük taşımacılığı @tr
broader: Sea and coastal freight water transport

Inland passenger water transport
type: Concept
notation: 50.3
status: valid
status modified: 2013-10-18
accepted date: 2013-10-18
in scheme: Statistical Classification of Economic Activities in the European Community, Rev. 2 (2008)
scope note: превоз на пътници по речни и други вътрешни водни пътища чрез плавателни съдове, който не са подходящи за морски транспорт. @bg
scope note: Tato skupina zahrnuje dopravu cestujících ve vnitrozemských vodách plavidly, která nejsou určena pro plavbu na moři. @cs
scope note: Diese Gruppe umfasst die Beförderung von Passagieren auf Binnengewässern mit Wasserfahrzeugen, die nicht für die See- und Küstenschifffahrt konstruiert wurden. @de
scope note: This group includes the transport of passengers on inland waters, involving vessels that are not suitable for sea transport. @en
scope note: Este grupo comprende el transporte de pasajeros por vías de navegación interior, realizado por embarcaciones que no son adecuadas para el transporte marítimo @es
scope note: Ce groupe comprend le transport de passagers en eaux intérieures, sur des bateaux ne convenant pas au transport maritime. @fr
scope note: Ova skupina uključuje prijevoz putnika unutrašnjim vodenim putovima, uključujući plovila koja nisu prikladna za prijevoz morem.
scope note: Į šią grupę įeina keleivių vežimas vidaus vandenimis, įskaitant vežimą laivais, netinkamais vežti jūra. @lt
scope note: Этот класс включает: - грузовые перевозки воздушным транспортом по стандартному маршруту и в соответствии со стандартным расписанием - внеплановые грузовые перевозки воздушным путем Этот класс также включает: - аренду воздушно-транспортного оборудования с оператором с целью осуществления грузовых перевозок @ru
scope note: Bu grup, deniz taşımacılığı için uygun olmayan gemilerin kullanıldığı iç sulardaki yolcu taşımacılığını kapsamaktadır. @tr
preferred label: Пътнически транспорт по вътрешни водни пътища @bg
preferred label: Vnitrozemská vodní osobní doprava @cs
preferred label: Transport af passagerer ad indre vandveje @da
preferred label: Personenbeförderung in der Binnenschifffahrt @de
preferred label: Εσωτερικές πλωτές μεταφορές επιβατών @el
preferred label: Transporte de pasajeros por vías navegables interiores @es
preferred label: Sõitjatevedu sisevetel @et
preferred label: Sisävesiliikenteen henkilökuljetus @fi
preferred label: Transports fluviaux de passagers @fr
preferred label: Belvízi személyszállítás
preferred label: Trasporto di passeggeri per vie d'acqua interne @it
preferred label: Vidaus vandenų keleivinis transportas @lt
preferred label: Pasažieru pārvadājumi iekšzemes ūdeņos @lv
preferred label: Trasport ġewwieni ta' passiġieri fuq l-ilma @mt
preferred label: Binnenvaart, personenvervoer @nl
preferred label: Passasjertransport på elver og innsjøer @no
preferred label: Transport wodny śródlądowy pasażerski @pl
preferred label: Transportes de passageiros por vias navegáveis interiores @pt
preferred label: Transporturi de pasageri pe căi navigabile interioare @ro
preferred label: Речной пассажирский транспорт @ru
preferred label: Vnútrozemská osobná vodná doprava @sk
preferred label: Potniški promet po celinskih vodah @sl
preferred label: Sjöfart på inre vattenvägar, passagerartrafik @sv
preferred label: İç sularda yolcu taşımacılığı @tr
broader: Water transport
narrower: Inland passenger water transport

Inland passenger water transport
type: Concept
notation: 50.30
status: valid
status modified: 2013-10-18
accepted date: 2013-10-18
in scheme: Statistical Classification of Economic Activities in the European Community, Rev. 2 (2008)
scope note: - превоз на пътници по реки, канали, езера и други, вкл. вътрешни пристанища и докове - даване под наем на плавателни съдове за развлечение, с екипаж - даване под наем на яхти и други плавателни съдове за развлечение, без екипаж - 77.21 @bg
scope note: Z: - osobní dopravu po řekách, kanálech, jezerech a jiných vnitrozemských vodních cestách včetně vnitrozemských přístavů a přístavišť ZT: - pronájem výletních lodí s posádkou pro vnitrozemskou vodní dopravu N: - pronájem výletních lodí a jachet bez posádky (77.21) @cs
scope note: Diese Klasse umfasst: - Personenbeförderung auf Flüssen, Kanälen, Seen und anderen Binnengewässern sowie innerhalb von Häfen Diese Klasse umfasst ferner: - Vermietung von Vergnügungsschiffen mit Besatzung Diese Klasse umfasst nicht: - Vermietung von Vergnügungsschiffen und Yachten ohne Besatzung (s. 77.21) @de
scope note: This class includes: - transport of passengers via rivers, canals, lakes and other inland waterways, including inside harbours and ports This class also includes: - renting of pleasure boats with crew for inland water transport This class excludes: - renting of pleasure boats and yachts without crew, see 77.21 @en
scope note: Esta clase comprende: - el transporte de pasajeros por ríos, canales, lagos y otras vías navegables, incluidos puertos y dársenas Esta clase comprende también: - el alquiler de embarcaciones de recreo con tripulación para transporte por vías de navegación interior Esta clase no comprende: - el alquiler de embarcaciones de recreo y yates sin tripulación (véase 77.21) @es
scope note: Cette classe comprend: - le transport de passagers sur les fleuves, les canaux, les lacs et les autres voies navigables intérieures, y compris les ports et les docks Cette classe comprend également: - la location de bateaux de plaisance avec équipage pour le transport fluvial Cette classe ne comprend pas: - la location de bateaux de plaisance et voiliers sans équipage, voir 77.21 @fr
scope note: Ovaj razred uključuje: - prijevoz putnika rijekama, kanalima, jezerima i ostalim unutarnjim vodenim putovima, uključujući prijevoz unutar luka i dokova Ovaj razred također uključuje: - iznajmljivanje čamaca za razonodu s posadom za prijevoz unutarnjim vodenim putovima Ovaj razred isključuje: - iznajmljivanje čamaca i jedrilica za razonodu, bez posade, vidi 77.21
scope note: Į šią klasę įeina: - keleivių vežimas upėmis, kanalais, ežerais ir kitais vidaus vandenų keliais, įskaitant vežimą uostuose ar dokuose Į šią klasę taip pat įeina: - pramoginių katerių, su įgulos samdymu, nuoma vežimui vidaus vandenimis Į šią neįeina: - pramoginių katerių ir jachtų, be įgulos samdymo, nuoma, žr. 77.21 @lt
scope note: Этот класс включает: - запуск спутников и космических кораблей - пассажирские и грузовые перевозки в космическом пространстве @ru
scope note: Bu sınıf aşağıdakileri kapsamaktadır; - iç limanlar ve iskeleler de dahil olmak üzere, ırmaklar, kanallar, göller ve diğer iç sular vasıtasıyla yapılan yolcu taşımacılığı. Ayrıca bu sınıf aşağıdakileri de kapsamaktadır; - iç su taşımacılığı için mürettebatı ile birlikte gezinti teknelerinin kiralanması. Kapsam dışı olanlar; - gezinti teknelerinin ve yatların mürettebatsız olarak kiralanması, bkz. 77.21. @tr
preferred label: Пътнически транспорт по вътрешни водни пътища @bg
preferred label: Vnitrozemská vodní osobní doprava @cs
preferred label: Transport af passagerer ad indre vandveje @da
preferred label: Personenbeförderung in der Binnenschifffahrt @de
preferred label: Εσωτερικές πλωτές μεταφορές επιβατών @el
preferred label: Transporte de pasajeros por vías navegables interiores @es
preferred label: Sõitjatevedu sisevetel @et
preferred label: Sisävesiliikenteen henkilökuljetus @fi
preferred label: Transports fluviaux de passagers @fr
preferred label: Belvízi személyszállítás
preferred label: Trasporto di passeggeri per vie d'acqua interne @it
preferred label: Vidaus vandenų keleivinis transportas @lt
preferred label: Pasažieru pārvadājumi iekšzemes ūdeņos @lv
preferred label: Trasport ġewwieni ta' passiġieri fuq l-ilma @mt
preferred label: Binnenvaart, personenvervoer @nl
preferred label: Passasjertransport på elver og innsjøer @no
preferred label: Transport wodny śródlądowy pasażerski @pl
preferred label: Transportes de passageiros por vias navegáveis interiores @pt
preferred label: Transportul de pasageri pe căi navigabile interioare @ro
preferred label: Речной пассажирский транспорт @ru
preferred label: Vnútrozemská osobná vodná doprava @sk
preferred label: Potniški promet po celinskih vodah @sl
preferred label: Sjöfart på inre vattenvägar, passagerartrafik @sv
preferred label: İç sularda yolcu taşımacılığı @tr
broader: Inland passenger water transport

Inland freight water transport
type: Concept
notation: 50.4
status: valid
status modified: 2013-10-18
accepted date: 2013-10-18
in scheme: Statistical Classification of Economic Activities in the European Community, Rev. 2 (2008)
scope note: превоз на товари по вътрешни водни пътища чрез плавателни съдове, който не са подходящи за морски транспорт. @bg
scope note: Tato skupina zahrnuje dopravu nákladu ve vnitrozemských vodách plavidly, která nejsou vhodná pro námořní dopravu. @cs
scope note: Diese Gruppe umfasst die Beförderung von Gütern auf Binnengewässern mit Wasserfahrzeugen, die nicht für die See- und Küstenschifffahrt konstruiert wurden. @de
scope note: This group includes the transport of freight on inland waters, involving vessels that are not suitable for sea transport. @en
scope note: Este grupo comprende el transporte de mercancías por vías de navegación interior, realizado por embarcaciones que no son adecuadas para el transporte marítimo @es
scope note: Ce groupe comprend le transport de marchandises en eaux intérieures, sur des bateaux ne convenant pas au transport maritime. @fr
scope note: Ova skupina uključuje prijevoz robe unutrašnjim vodenim putovima, uključujući plovila koja nisu prikladna za prijevoz morem.
scope note: Į šią grupę įeina krovinių vežimas vidaus vandenimis, įskaitant vežimą laivais, netinkamais vežti jūra. @lt
scope note: Данный раздел включает хранение на складах и техническую поддержку при транспортировке, в том числе управление транспортной инфраструктурой (например, аэропортами, гаванями, морскими портами, туннелями, мостами и т.д.), а также услуги транспортных компаний и по погрузочно-разгрузочным работам. @ru
scope note: Bu grup, deniz taşımacılığı için uygun olmayan gemilerin kullanıldığı, iç sulardaki yük taşımacılığını kapsamaktadır. @tr
preferred label: Товарен транспорт по вътрешни водни пътища @bg
preferred label: Vnitrozemská nákladní vodní doprava @cs
preferred label: Transport af gods ad indre vandveje @da
preferred label: Güterbeförderung in der Binnenschifffahrt @de
preferred label: Εσωτερικές πλωτές μεταφορές εμπορευμάτων @el
preferred label: Transporte de mercancías por vías navegables interiores @es
preferred label: Kaubavedu sisevetel @et
preferred label: Sisävesiliikenteen tavarakuljetus @fi
preferred label: Transports fluviaux de fret @fr
preferred label: Belvízi áruszállítás
preferred label: Trasporto di merci per vie d'acqua interne @it
preferred label: Vidaus vandenų krovininis transportas @lt
preferred label: Kravu pārvadājumi iekšzemes ūdeņos @lv
preferred label: Trasport ġewwieni ta' merkanzija fuq l-ilma @mt
preferred label: Binnenvaart, goederenvervoer @nl
preferred label: Godstransport på elver og innsjøer @no
preferred label: Transport wodny śródlądowy towarów @pl
preferred label: Transportes de mercadorias por vias navegáveis interiores @pt
preferred label: Transportul de marfă pe căi navigabile interioare @ro
preferred label: Речной грузовой транспорт @ru
preferred label: Vnútrozemská nákladná vodná doprava @sk
preferred label: Tovorni promet po celinskih vodah @sl
preferred label: Sjöfart på inre vattenvägar, godstrafik @sv
preferred label: İç sularda yük taşımacılığı @tr
broader: Water transport
narrower: Inland freight water transport

Inland freight water transport
type: Concept
notation: 50.40
status: valid
status modified: 2013-10-18
accepted date: 2013-10-18
in scheme: Statistical Classification of Economic Activities in the European Community, Rev. 2 (2008)
scope note: - превоз на товари по реки, канали, езера и други, вкл. вътрешни пристанища и докове - даване под наем на плавателни съдове за превоз на товари по вътрешни водни пътища, с екипаж - обработка на товари - 52.24 - даване под наем на търговски кораби или други плавателни съдове, без екипаж - 77.34 @bg
scope note: Z: - dopravu nákladů po řekách, kanálech, jezerech a jiných vnitrozemských vodních cestách, včetně uvnitř přístavů ZT: - pronájem lodí bez posádky pro vnitrozemskou vodní nákladní dopravu N: - manipulaci s nákladem (52.24) - pronájem komerčních lodí a člunů bez posádky (77.34) @cs
scope note: Diese Klasse umfasst: - Güterbeförderung auf Flüssen, Kanälen, Seen und anderen Binnengewässern sowie innerhalb von Häfen Diese Klasse umfasst ferner: - Vermietung von Schiffen ohne Besatzung für die Güterbeförderung in der Binnenschifffahrt Diese Klasse umfasst nicht: - Frachtumschlag (s. 52.24) - Vermietung von Handelsschiffen ohne Besatzung (s. 77.34) @de
scope note: This class includes: - transport of freight via rivers, canals, lakes and other inland waterways, including inside harbours and ports This class also includes: - renting of vessels with crew for inland freight water transport This class excludes: - cargo handling, see 52.24 - renting of commercial ships or boats without crew, see 77.34 @en
scope note: Esta clase comprende: - el transporte de mercancías por ríos, canales, lagos y otras vías navegables, incluidos puertos y dársenas Esta clase comprende también: - el alquiler de embarcaciones con tripulación para el transporte de mercancías por vías de navegación interiores Esta clase no comprende: - la manipulación de mercancías (véase 52.24) - el alquiler de barcos y buques comerciales sin tripulación (véase 77.34) @es
scope note: Cette classe comprend: - le transport de marchandises sur les fleuves, les canaux, les lacs et les autres voies navigables intérieures, y compris les ports et les docks Cette classe comprend également: - la location de bateaux avec équipage pour le transport fluvial de fret Cette classe ne comprend pas: - la manutention du fret, voir 52.24 - la location de bateaux et navires commerciaux sans équipage, voir 77.34 @fr
scope note: Ovaj razred uključuje: - prijevoz robe rijekama, kanalima, jezerima i drugim unutrašnjim vodenim putovima, uključujući prijevoz unutar luka i dokova Ovaj razred također uključuje: - iznajmljivanje brodova s posadom za prijevoz robe unutrašnjim vodenim putovima Ovaj razred isključuje: - prekrcaj tereta, vidi 52.24 - iznajmljivanje komercijalnih brodova ili čamaca, bez posade, vidi 77.34
scope note: Į šią klasę įeina: - krovinių vežimas upėmis, kanalais, ežerais ir kitais vidaus vandenų keliais, įskaitant vežimą uostuose ar dokuose Į šią klasę taip pat įeina: - krovininių vidaus vandenų laivų, su įgulos samdymu, nuoma Į šią klasę neįeina: - krovinių tvarkymas, žr. 52.24 - prekybinių laivų arba valčių, be įgulos samdymo, nuoma, žr. 77.34 @lt
scope note: Bu sınıf aşağıdakileri kapsamaktadır; - iç limanlar ve iskeleler de dahil olmak üzere, ırmaklar, kanallar, göller ve diğer iç sular vasıtasıyla yapılan yük taşımacılığı. Ayrıca bu sınıf aşağıdakileri de kapsamaktadır; - iç sularda yük taşımacılığı amacıyla teknelerin mürettebatıyla beraber kiralanması Kapsam dışı olanlar; - kargo yükleme boşaltma hizmetleri, bkz. 52.24, - ticari gemilerin veya botların mürettebatsız olarak kiralanması, bkz. 77.34. @tr
preferred label: Товарен транспорт по вътрешни водни пътища @bg
preferred label: Vnitrozemská nákladní vodní doprava @cs
preferred label: Transport af gods ad indre vandveje @da
preferred label: Güterbeförderung in der Binnenschifffahrt @de
preferred label: Εσωτερικές πλωτές μεταφορές εμπορευμάτων @el
preferred label: Transporte de mercancías por vías navegables interiores @es
preferred label: Kaubavedu sisevetel @et
preferred label: Sisävesiliikenteen tavarakuljetus @fi
preferred label: Transports fluviaux de fret @fr
preferred label: Belvízi áruszállítás
preferred label: Trasporto di merci per vie d'acqua interne @it
preferred label: Vidaus vandenų krovininis transportas @lt
preferred label: Kravu pārvadājumi iekšzemes ūdeņos @lv
preferred label: Trasport ġewwieni ta' merkanzija fuq l-ilma @mt
preferred label: Binnenvaart, goederenvervoer @nl
preferred label: Godstransport på elver og innsjøer @no
preferred label: Transport wodny śródlądowy towarów @pl
preferred label: Transportes de mercadorias por vias navegáveis interiores @pt
preferred label: Transportul de marfă pe căi navigabile interioare @ro
preferred label: Речной грузовой транспорт @ru
preferred label: Vnútrozemská nákladná vodná doprava @sk
preferred label: Tovorni promet po celinskih vodah @sl
preferred label: Sjöfart på inre vattenvägar, godstrafik @sv
preferred label: İç sularda yük taşımacılığı @tr
broader: Inland freight water transport

Air transport
type: Concept
notation: 51
status: valid
status modified: 2013-10-18
accepted date: 2013-10-18
in scheme: Statistical Classification of Economic Activities in the European Community, Rev. 2 (2008)
scope note: превоз на пътници и товари с въздушен или космически транспорт. - наторяване и пръскане от въздуха - 01.61 - ремонт на въздухоплавателни средства и техните двигатели - 33.16 - дейности на летища - 52.23 - авиореклама - 73.11 - фотографиране от въздуха - 74.20 @bg
scope note: Tento oddíl zahrnuje dopravu osob nebo nákladů letecky nebo dopravu kosmickým prostorem. Tento oddíl nezahrnuje: - postřik proti škůdcům (letecký) (01.61) - opravy letadel nebo leteckých motorů (33.16) - provoz letišť (52.23) - leteckou reklamu (nápisy na obloze) (73.11) - letecké snímkování (74.20) @cs
scope note: Diese Abteilung umfasst die Personen- und Güterbeförderung in der Luft- und Raumfahrt. Diese Abteilung umfasst nicht: - Schädlingsbekämpfung mit Flugzeugen (s. 01.61) - Instandhaltung und Reparatur von Flugzeugen, Flugzeugmotoren und Triebwerken (s. 33.16) - Betrieb von Flughäfen (s. 52.23) - Luftwerbung (Himmelsschrift) (s. 73.11) - Luftbildfotografie (s. 74.20) @de
scope note: This division includes the transport of passengers or freight by air or via space. This division excludes: - crop spraying, see 01.61 - overhaul of aircraft or aircraft engines, see 33.16 - operation of airports, see 52.23 - aerial advertising (sky-writing), see 73.11 - aerial photography, see 74.20 @en
scope note: Esta división comprende el transporte de pasajeros y mercancías por vía aérea o espacial Esta división no comprende: - la fumigación de cosechas (véase 01.61) - la reparación de aviones o motores de aviones (véase 33.16) - la explotación de aeropuertos (véase 52.23) - la publicidad aérea (véase 73.11) - la fotografía aérea (véase 74.20) @es
scope note: Cette division comprend le transport aérien ou spatial de passagers et de marchandises. Cette division ne comprend pas: - la pulvérisation des récoltes, voir 01.61 - la révision des aéronefs et de leurs moteurs, voir 33.16 - l’exploitation d’aéroports, voir 52.23 - la publicité aérienne (tracée dans le ciel par un avion), voir 73.11 - la photographie aérienne, voir 74.20 @fr
scope note: Ovaj odjeljak uključuje prijevoz putnika ili robe zrakom ili svemirom. Ovaj odjeljak isključuje: - zaprašivanje usjeva, vidi 01.61 - remont zrakoplova i zrakoplovnih motora, vidi 33.16 - djelatnost zračnih luka, vidi 52.23 - reklamiranje iz zraka, vidi 73.11 - fotografiranje iz zraka, vidi 74.20
scope note: Į šį skyrių įeina keleivių ar krovinių vežimas oro ar kosminiu transportu. Į šį skyrių neįeina: - pasėlių purškimas, žr. 01.61 - orlaivių ar jų variklių kapitalinis remontas, žr. 33.16 - oro uostų eksploatavimas, žr. 52.23 - oro reklama (užrašai danguje), žr. 73.11 - fotografavimas iš orlaivių, žr. 74.20 @lt
scope note: Этот класс включает: - деятельность по хранению и складированию всех типов грузов: • услуги зернохранилищ, товарных складов общего назначения, складов-холодильников, бункеров и т.д. Этот класс также включает: - хранение товаров в зонах свободной торговли - замораживание продуктов в интенсивном потоке воздуха Этот класс исключает: - услуги стоянок для автотранспорта, см. 52.21 - управление складами самообслуживания, см. 68.20 - аренду свободных помещений, см. 68.20 @ru
scope note: Bu bölüm hava veya uzay yoluyla yolcu veya yük taşımacılığını kapsamaktadır. Kapsam dışı olanlar; - ürünlerin havadan ilaçlanması, bkz. 01.61, - uçak ve uçak motorlarının bakım ve onarımı, bkz. 33.16, - havalimanlarının işletilmesi, bkz. 52.23, - hava araçları kullanılarak yapılan reklamcılık (gökyüzüne uçakla yazı yazılması), bkz. 73.11, - havadan fotoğraf çekilmesi, bkz. 74.20. @tr
preferred label: Въздушен транспорт @bg
preferred label: Letecká doprava @cs
preferred label: Luftfart @da
preferred label: Luftfahrt @de
preferred label: Αεροπορικές μεταφορές @el
preferred label: Transporte aéreo @es
preferred label: Õhutransport @et
preferred label: Ilmaliikenne @fi
preferred label: Transports aériens @fr
preferred label: Légi szállítás
preferred label: Trasporto aereo @it
preferred label: Oro transportas @lt
preferred label: Gaisa transports @lv
preferred label: Trasport bl-ajru @mt
preferred label: Luchtvaart @nl
preferred label: Lufttransport @no
preferred label: Transport lotniczy @pl
preferred label: Transportes aéreos @pt
preferred label: Transporturi aeriene @ro
preferred label: Воздушный транспорт @ru
preferred label: Zračni promet @sl
preferred label: Havayolu taşımacılığı @tr
broader: TRANSPORTATION AND STORAGE
narrower: Passenger air transport
narrower: Freight air transport and space transport

Passenger air transport
type: Concept
notation: 51.1
status: valid
status modified: 2013-10-18
accepted date: 2013-10-18
in scheme: Statistical Classification of Economic Activities in the European Community, Rev. 2 (2008)
scope note: Данная группа включает мероприятия, сопровождающие пассажирские или грузовые перевозки, такие как деятельность в рамках транспортной инфраструктуры или погрузочно-разгрузочные работы непосредственно до или после транспортировки или между транспортными сегментами. Включена эксплуатация и техобслуживание всех транспортных средств, упомянутых выше. @ru
preferred label: Пътнически въздушен транспорт @bg
preferred label: Letecká osobní doprava @cs
preferred label: Lufttransport af passagerer @da
preferred label: Personenbeförderung in der Luftfahrt @de
preferred label: Αεροπορικές μεταφορές επιβατών @el
preferred label: Transporte aéreo de pasajeros @es
preferred label: Sõitjate õhutransport @et
preferred label: Matkustajalentoliikenne @fi
preferred label: Transports aériens de passagers @fr
preferred label: Légi személyszállítás
preferred label: Trasporto aereo di passeggeri @it
preferred label: Keleivinis oro transportas @lt
preferred label: Pasažieru aviopārvadājumi @lv
preferred label: Trasport ta' passiġġieri bl-ajru @mt
preferred label: Personenvervoer door de lucht @nl
preferred label: Lufttransport med passasjerer @no
preferred label: Transport lotniczy pasażerski @pl
preferred label: Transportes aéreos de passageiros @pt
preferred label: Transporturi aeriene de pasageri @ro
preferred label: Пассажирский воздушный транспорт @ru
preferred label: Osobná letecká doprava @sk
preferred label: Potniški zračni promet @sl
preferred label: Lufttransport, passagerartrafik @sv
preferred label: Havayolu ile yolcu taşımacılığı @tr
broader: Air transport
narrower: Passenger air transport

Passenger air transport
type: Concept
notation: 51.10
status: valid
status modified: 2013-10-18
accepted date: 2013-10-18
in scheme: Statistical Classification of Economic Activities in the European Community, Rev. 2 (2008)
scope note: - превоз на пътници с въздушен транспорт по установени маршрути и по разписание - чартърни полети за пътници - панорамни полети и полети за разглеждане на забележителности - даване под наем на въздухоплавателни средства, с екипаж с цел превоз на пътници - специализиран превоз на пътници с граждански въздухоплавателни средства, извършван от аероклубове, с цел обучение или развлечение - даване под наем на въздухоплавателни средства, без екипаж - 77.35 @bg
scope note: Z: - dopravu osob letecky na pravidelných linkách podle pevných letových řádů - charterové lety v osobní dopravě - vyhlídkové lety ZT: - pronájem prostředků letecké dopravy s operátorem pro přepravu cestujících - všeobecné letecké činnosti, jako: • přeprava cestujících zajišťovaná aerokluby z důvodu instruktáže nebo zábavy N: - pronájem prostředků letecké dopravy bez operátora (77.35) @cs
scope note: Diese Klasse umfasst: - Personenbeförderung im Linienflugverkehr - Charterflüge für Personen - Rundflüge Diese Klasse umfasst ferner: - Vermietung von Luftfahrzeugen zur Personenbeförderung mit Bedienungspersonal - allgemeiner Luftverkehr, wie z. B.: • Vergnügungs- oder Unterrichtsflüge, die von Luftsportvereinen durchgeführt werden Diese Klasse umfasst nicht: - Vermietung von Luftfahrzeugen ohne Bedienungspersonal (s. 77.35) @de
scope note: This class includes: - transport of passengers by air over regular routes and on regular schedules - charter flights for passengers - scenic and sightseeing flights This class also includes: - renting of air transport equipment with operator for the purpose of passenger transportation - general aviation activities, such as: • transport of passengers by aero clubs for instruction or pleasure This class excludes: - renting of air transport equipment without operator, see 77.35 @en
scope note: Esta clase comprende: - el transporte aéreo de pasajeros según un trayecto y un horario regulares - los vuelos charter para pasajeros - vuelos que realizan recorridos turísticos o paisajísticos Esta clase comprende también: - el alquiler de medios de transporte aéreo con piloto para transporte de pasajeros - actividades generales de aviación, como: • el transporte de pasajeros realizada por aeroclubes con fines de instrucción o de recreo Esta clase no comprende: - el alquiler de medios de transporte aéreo sin tripulación (véase 77.35) @es
scope note: Cette classe comprend: - le transport aérien de passagers sur des lignes régulières et avec des horaires réguliers - les vols par charters pour passagers - les vols de tourisme Cette classe comprend également: - la location de matériels de transport aérien avec pilote aux fins du transport de passagers - les activités générales d’aviation, telles que: • le transport de passagers par des aéro-clubs à des fins de cours ou de loisirs Cette classe ne comprend pas: - la location de matériels de transport aérien sans pilote, voir 77.35 @fr
scope note: Ovaj razred uključuje: - zračni prijevoz putnika na redovitim linijama i prema utvrđenom redu letenja - čarter-letove za putnike - panoramsko razgledanje iz zraka Ovaj razred također uključuje: - iznajmljivanje opreme za zračni prijevoz putnika s rukovateljem - ostale djelatnosti zračnog prijevoza kao što su: • prijevoz putnika kojeg obavljaju aeroklubovi u svrhu poduke ili razonode Ovaj razred isključuje: - iznajmljivanje opreme za zračni prijevoz bez rukovatelja, vidi 77.35
scope note: Į šią klasę įeina: - keleivių vežimas oru reguliariuoju oro susisiekimu - užsakomieji keleiviniai reisai - parodomieji ir apžvalginiai skrydžiai Į šią klasę taip pat įeina: - oro transporto priemonių, su operatoriaus samdymu, nuoma keleivių vežimo tikslais - bendrosios aviacijos veikla, tokia kaip: • keleivių vežimas, kurį atlieką aeroklubai mokymo ar pramogų tikslais Į šią klasę neįeina: - oro transporto priemonių, be operatoriaus samdymo, nuoma, žr. 77.35 @lt
scope note: Этот класс включает: - деятельность, относящуюся к наземным пассажирским перевозкам, а также перевозкам животных или грузов: • услуги железнодорожных вокзалов, автобусных станций, перегрузочных товарных станций • эксплуатацию железнодорожной инфраструктуры • функционирование дорог, мостов, туннелей, автомобильных парковок или гаражей, стоянок для велосипедов и хранения автофургонов в зимнее время - маневровую работу и формирование поездов - буксировку и техническую помощь при выполнении работ на обочине Этот класс также включает: - сжижение газа с целью транспортировки Этот класс исключает: - погрузочно-разгрузочные работы, см. 52.24 @ru
scope note: Bu sınıf aşağıdakileri kapsamaktadır; - belirli rotalar üzerinden ve belirli tarifelere göre hava yolu ile yolcu taşımacılığı, - yolcular için çartır seferleri, - turistik ve gezi uçuşları. Ayrıca bu sınıf aşağıdakileri de kapsamaktadır; - yolcu taşımacılığı için operatör ile birlikte havayolu taşımacılığına ait araçların kiralanması. - aşağıdakiler gibi, genel havacılık faaliyetleri: • eğitim veya gezi amaçlı olarak havacılık klüpleri tarafından yapılan yolcu taşımacılığı. Kapsam dışı olanlar; -operatörsüz olarak hava taşımacılığına ait araçların kiralanması, bkz. 77.35. @tr
preferred label: Пътнически въздушен транспорт @bg
preferred label: Letecká osobní doprava @cs
preferred label: Lufttransport af passagerer @da
preferred label: Personenbeförderung in der Luftfahrt @de
preferred label: Αεροπορικές μεταφορές επιβατών @el
preferred label: Transporte aéreo de pasajeros @es
preferred label: Sõitjate õhutransport @et
preferred label: Matkustajalentoliikenne @fi
preferred label: Transports aériens de passagers @fr
preferred label: Légi személyszállítás
preferred label: Trasporto aereo di passeggeri @it
preferred label: Keleivinis oro transportas @lt
preferred label: Pasažieru aviopārvadājumi @lv
preferred label: Trasport ta' passiġġieri bl-ajru @mt
preferred label: Personenvervoer door de lucht @nl
preferred label: Lufttransport med passasjerer @no
preferred label: Transport lotniczy pasażerski @pl
preferred label: Transportes aéreos de passageiros @pt
preferred label: Transporturi aeriene de pasageri @ro
preferred label: Пассажирский воздушный транспорт @ru
preferred label: Osobná letecká doprava @sk
preferred label: Potniški zračni promet @sl
preferred label: Lufttransport, passagerartrafik @sv
preferred label: Havayolu ile yolcu taşımacılığı @tr
broader: Passenger air transport

Freight air transport and space transport
type: Concept
notation: 51.2
status: valid
status modified: 2013-10-18
accepted date: 2013-10-18
in scheme: Statistical Classification of Economic Activities in the European Community, Rev. 2 (2008)
scope note: Этот класс включает: - деятельность, относящуюся к водным пассажирским перевозкам, а также перевозкам животных или грузов: • деятельность терминалов, таких как гавани, порты и пирсы • эксплуатация шлюзов и т.д. • деятельность, связанную с навигацией, лоцманской проводкой судов, швартовкой у причала • деятельность, связанную с погрузкой и разгрузкой судов посредством лихтеров, спасанием судов • деятельность маяков Этот класс исключает: - погрузочно-разгрузочные работы, см. 52.24 - деятельность гаваней (пристаней) для прогулочных судов, см. 93.29 @ru
preferred label: Товарен въздушен транспорт; космически транспорт @bg
preferred label: Letecká nákladní doprava a kosmická doprava @cs
preferred label: Lufttransport af gods og rumfart @da
preferred label: Güterbeförderung in der Luftfahrt und Raumtransport @de
preferred label: Αεροπορικές μεταφορές εμπορευμάτων και διαστημικές μεταφορές @el
preferred label: Transporte aéreo de mercancías y transporte espacial @es
preferred label: Kauba õhutransport ja kosmosetransport @et
preferred label: Lentoliikenteen tavarakuljetus ja avaruusliikenne @fi
preferred label: Transports aériens de fret et transports spatiaux @fr
preferred label: Légi áruszállítás
preferred label: Trasporto aereo di merci e trasporto spaziale @it
preferred label: Krovininis oro transportas ir kosminis transportas @lt
preferred label: Kravu aviopārvadājumi un kosmiskais transports @lv
preferred label: Trasort ta' merkanzija bl-ajru u trasport fl-ispazju @mt
preferred label: Goederenvervoer door de lucht; ruimtevaart @nl
preferred label: Lufttransport med gods samt romfart @no
preferred label: Transport lotniczy towarów i transport kosmiczny @pl
preferred label: Transportes aéreos de mercadorias e transportes espaciais @pt
preferred label: Transporturi aeriene de marfă şi transporturi spaţiale @ro
preferred label: Воздушный грузовой транспорт и транспортная космическая система @ru
preferred label: Nákladná letecká a kozmická doprava @sk
preferred label: Tovorni zračni in vesoljski promet @sl
preferred label: Lufttransport, godstrafik och rymdfart @sv
preferred label: Hava yolu ile yük taşımacılığı ve uzay taşımacılığı @tr
broader: Air transport
narrower: Freight air transport
narrower: Space transport

Freight air transport
type: Concept
notation: 51.21
status: valid
status modified: 2013-10-18
accepted date: 2013-10-18
in scheme: Statistical Classification of Economic Activities in the European Community, Rev. 2 (2008)
scope note: - превоз на товари с въздушен транспорт по установени маршрути и по разписание - превоз на товари с въздушен транспорт без разписание - даване под наем на въздухоплавателни средства с екипаж, с цел превоз на товари @bg
scope note: Z: - dopravu nákladů letecky, pravidelnými linkami podle pevných letových řádů - dopravu nákladů letecky, nepravidelně ZT: - pronájem leteckých dopravních prostředků s operátorem za účelem přepravy nákladů @cs
scope note: Diese Klasse umfasst: - Güterbeförderung im Linienflugverkehr - Güterbeförderung im Gelegenheitsflugverkehr Diese Klasse umfasst ferner: - Vermietung von Luftfahrzeugen zur Güterbeförderung mit Bedienungspersonal @de
scope note: This class includes: - transport freight by air over regular routes and on regular schedules - non-scheduled transport of freight by air This class also includes: - renting of air transport equipment with operator for the purpose of freight transportation @en
scope note: Esta clase comprende: - el transporte aéreo de mercancías según un trayecto y un horario regulares - el transporte aéreo no regular de mercancías Esta clase comprende también: - el alquiler de medios de transporte aéreo con piloto para transporte de mercancías @es
scope note: Cette classe comprend: - le transport aérien de marchandises sur des lignes régulières et avec des horaires réguliers - les transports aériens non réguliers de marchandises Cette classe comprend également: - la location de matériels de transport aérien avec pilote aux fins du transport de marchandises @fr
scope note: Ovaj razred uključuje: - zračni prijevoz robe na redovitim linijama i prema utvrđenom redu letenja - izvanredni zračni prijevoz robe Ovaj razred također uključuje: - iznajmljivanje opreme za zračni prijevoz s pilotom za potrebe zračnog prijevoza robe
scope note: Į šią klasę įeina: - krovinių vežimas oru reguliariuoju oro susisiekimu - krovinių vežimas oro transportu tvarkaraštyje nenurodytu laiku Į šią klasę taip pat įeina: - oro transporto priemonių, su operatoriaus samdymu, nuoma krovinių vežimo tikslais @lt
scope note: Этот класс включает: - деятельность, относящуюся к перевозкам воздушным транспортом пассажиров, животных и грузов: • деятельность терминалов, таких как аэропорты • услуги аэропортов и других касс по продаже авиабилетов и т.д. • деятельность, связанную с наземным обслуживанием на аэродромах и т.п. Этот класс также включает: - услуги по пожаротушению и противопожарным мерам в аэропортах Этот класс исключает: - погрузочно-разгрузочные работы, см. 52.24 - функционирование летных школ, см. 85.32, 85.53 @ru
scope note: Bu sınıf aşağıdakileri kapsamaktadır; - belirli rotalar üzerinden ve belirli tarifelere göre hava yolu ile yük taşımacılığı, - havayolu ile tarifeli olmayan yük taşımacılığı, Ayrıca bu sınıf aşağıdakileri de kapsamaktadır; - yük taşımacılığı için operatör ile birlikte havayolu taşımacılığına ait araçların kiralanması, @tr
preferred label: Товарен въздушен транспорт @bg
preferred label: Letecká nákladní doprava @cs
preferred label: Lufttransport af gods @da
preferred label: Güterbeförderung in der Luftfahrt @de
preferred label: Αεροπορικές μεταφορές εμπορευμάτων @el
preferred label: Transporte aéreo de mercancías @es
preferred label: Kauba õhutransport @et
preferred label: Lentoliikenteen tavarakuljetus @fi
preferred label: Transports aériens de fret @fr
preferred label: Légi áruszállítás
preferred label: Trasporto aereo di merci @it
preferred label: Krovininis oro transportas @lt
preferred label: Kravu aviopārvadājumi @lv
preferred label: Trasport ta' merkanzija bl-ajru @mt
preferred label: Goederenvervoer door de lucht @nl
preferred label: Lufttransport med gods @no
preferred label: Transport lotniczy towarów @pl
preferred label: Transportes aéreos de mercadorias @pt
preferred label: Transporturi aeriene de marfă @ro
preferred label: Грузовой воздушный транспорт @ru
preferred label: Nákladná letecká doprava @sk
preferred label: Tovorni zračni promet @sl
preferred label: Lufttransport, godstrafik @sv
preferred label: Hava yolu ile yük taşımacılığı @tr
broader: Freight air transport and space transport

Space transport
type: Concept
notation: 51.22
status: valid
status modified: 2013-10-18
accepted date: 2013-10-18
in scheme: Statistical Classification of Economic Activities in the European Community, Rev. 2 (2008)
scope note: - извеждане в космоса на спътници и космически летателни апарати - превоз на пътници и товари с космически транспорт @bg
scope note: Z: - vypouštění satelitů a kosmických dopravních prostředků - kosmickou dopravu nákladů i osob @cs
scope note: Diese Klasse umfasst: - Starten von Satelliten und Raumfahrzeugen - Personen- und Güterbeförderung in der Raumfahrt @de
scope note: This class includes: - launching of satellites and space vehicles - space transport of freight and passengers @en
scope note: Esta clase comprende: - el lanzamiento de satélites y vehículos espaciales - el transporte espacial de mercancías y pasajeros @es
scope note: Cette classe comprend: - le lancement de satellites et de véhicules spatiaux - le transport, dans l’espace, de marchandises et de personnes @fr
scope note: Ovaj razred uključuje: - lansiranje satelita i svemirskih letjelica - svemirski prijevoz roba i putnika
scope note: Į šią klasę įeina: - palydovų ir kosminių laivų paleidimas - krovinių ir keleivių vežimas kosmose @lt
scope note: Этот класс включает: - погрузку и разгрузку товаров или багажа пассажиров, независимо от типа транспорта, используемого для перевозки - погрузку, включая крепление груза и разгрузку судов (стивидорные работы) - погрузку и разгрузку грузовых железнодорожных вагонов Этот класс исключает: - деятельность складских терминалов, см. 52.21, 52.22 и 52.23 @ru
scope note: Bu sınıf aşağıdakileri kapsamaktadır; - uyduların ve uzay taşıtlarının fırlatılması, - yük ve yolcuların uzay taşımacılığı. @tr
preferred label: Космически транспорт @bg
preferred label: Kosmická doprava @cs
preferred label: Rumfart @da
preferred label: Raumtransport @de
preferred label: Διαστημικές μεταφορές @el
preferred label: Transporte espacial @es
preferred label: Kosmosetransport @et
preferred label: Avaruusliikenne @fi
preferred label: Transports spatiaux @fr
preferred label: Űrszállítás
preferred label: Trasporto spaziale @it
preferred label: Kosminis transportas @lt
preferred label: Kosmiskais transports @lv
preferred label: Trasport fl-ispazju @mt
preferred label: Ruimtevaart @nl
preferred label: Romfart @no
preferred label: Transport kosmiczny @pl
preferred label: Transportes espaciais @pt
preferred label: Transporturi spaţiale @ro
preferred label: Транспортная космическая система @ru
preferred label: Kozmická doprava @sk
preferred label: Vesoljski promet @sl
preferred label: Rymdfart @sv
preferred label: Uzay taşımacılığı @tr
broader: Freight air transport and space transport

Warehousing and support activities for transportation
type: Concept
notation: 52
status: valid
status modified: 2013-10-18
accepted date: 2013-10-18
in scheme: Statistical Classification of Economic Activities in the European Community, Rev. 2 (2008)
scope note: складиране и спомагателни дейности в транспорта като експлоатация на транспортната инфраструктура (например летища, пристанища, тунели, мостове и т.н.), дейностите на агенции, свързани с превоз на товари, както и обработката на товари. @bg
scope note: Tento oddíl zahrnuje skladování a pomocné činnosti pro dopravu, jako je provozování dopravní infrastruktury (např. letišť, přístavů, tunelů, mostů atd.), činnosti dopravních agentur a manipulaci s nákladem. @cs
scope note: Diese Abteilung umfasst die Lagerei sowie die Erbringung von anderen Dienstleistungen für den Verkehr, wie den Betrieb von Verkehrsinfrastrukturen (z. B. Flughäfen, Häfen, Tunnel, Brücken usw.), die Verkehrsvermittlung und den Frachtumschlag. @de
scope note: This division includes warehousing and support activities for transportation, such as operating of transport infrastructure (e.g. airports, harbours, tunnels, bridges, etc.), the activities of transport agencies and cargo handling. @en
scope note: Esta división comprende el almacenamiento y las actividades complementarias para el transporte, como la explotación de la infraestructura de transporte (por ejemplo, aeropuertos, puertos, túneles, puentes, etc.), las actividades de las agencias de transporte y la manipulación de mercancías. @es
scope note: Cette division comprend les activités d’entreposage et les services auxiliaires des transports, tels que l’exploitation des infrastructures de transport (comme les aéroports, les ports, les tunnels, les ponts, etc.), les activités des agences de transport et de manutention du fret. @fr
scope note: Ovaj odjeljak uključuje skladištenje i pomoćne djelatnosti za prijevoz kao što su djelatnost prijevozne infrastrukture (npr. zračne luke, morske luke, tuneli, mostovi, itd.) i djelatnosti agencija za prijevoz i rukovanje teretima.
scope note: Į šį skyrių įeina sandėliavimas ir kita transportavimui būdinga veikla, tokia kaip transporto infrastruktūros eksploatavimas (pvz., oro uostų, uostų, tunelių, tiltų ir kt.), transporto agentūrų veikla ir krovinių tvarkymas. @lt
scope note: Этот класс включает: - передачу груза - организацию транспортировки по железной дороге, автотранспортом, морем или по воздуху - организацию групповых или индивидуальных отправлений товаров (включая сбор и доставку груза, а также группирование при отправлении) - выдачу и получение транспортной документации и накладных - деятельность работников таможни - деятельность экспедиторов по переправке грузов морским путем и агентов, работающих с воздушными грузовыми перевозками - посреднические операции по фрахту грузового места на судне или в самолете - погрузочно-разгрузочные работы, например, временную упаковку в ящики с целью обеспечения защиты груза во время перевозки, выгрузку, отбор проб и взвешивание товаров Этот класс исключает: - курьерскую деятельность, см. 53.20 - обеспечение транспортного страхования для автомобилей, морских судов и авиационной техники, см. 65.12 - деятельность туристских агентств, см. 79.11 - деятельность туроператоров, см. 79.12 - деятельность, связанную с содействием в области туризма, см. 79.90 @ru
scope note: Bu bölüm, taşımacılık alt yapı tesislerinin işletilmesi (örneğin havaalanları, limanlar, tüneller, köprüler vb.), taşımacılık acenteleri ve kargo ofislerinin faaliyetleri gibi taşımacılık için depolama ve destekleyici faaliyetleri kapsamaktadır. @tr
preferred label: Складиране на товари и спомагателни дейности в транспорта @bg
preferred label: Skladování a vedlejší činnosti v dopravě @cs
preferred label: Hjælpevirksomhed i forbindelse med transport @da
preferred label: Lagerei sowie Erbringung von sonstigen Dienstleistungen für den Verkehr @de
preferred label: Αποθήκευση και υποστηρικτικές προς τη μεταφορά δραστηριότητες @el
preferred label: Almacenamiento y actividades anexas al transporte @es
preferred label: Laondus ja veondust abistavad tegevusalad @et
preferred label: Varastointi ja liikennettä palveleva toiminta @fi
preferred label: Entreposage et services auxiliaires des transports @fr
preferred label: Raktározás, szállítást kiegészítő tevékenység
preferred label: Magazzinaggio e attività di supporto ai trasporti @it
preferred label: Sandėliavimas ir transportui būdingų paslaugų veikla @lt
preferred label: Uzglabāšanas un transporta palīgdarbības @lv
preferred label: Magazzinaġġ u attivitajiet ta' sostenn għat-trasport @mt
preferred label: Opslag en vervoerondersteunende activiteiten @nl
preferred label: Lagring og andre tjenester tilknyttet transport @no
preferred label: Magazynowanie i działalność usługowa wspomagająca transport @pl
preferred label: Armazenagem e actividades auxiliares dos transportes @pt
preferred label: Depozitare şi activităţi auxiliare pentru transporturi @ro
preferred label: Складское хозяйство и вспомогательная транспортная деятельность @ru
preferred label: Skladové a pomocné činnosti v doprave @sk
preferred label: Skladiščenje in spremljajoče prometne dejavnosti @sl
preferred label: Magasinering och stödtjänster till transport @sv
preferred label: Taşımacılık için depolama ve destekleyici faaliyetler @tr
broader: TRANSPORTATION AND STORAGE
narrower: Warehousing and storage
narrower: Support activities for transportation

Warehousing and storage
type: Concept
notation: 52.1
status: valid
status modified: 2013-10-18
accepted date: 2013-10-18
in scheme: Statistical Classification of Economic Activities in the European Community, Rev. 2 (2008)
scope note: Данный раздел включает почтовые и курьерские услуги, такие как услуги по выемке, перевозке и доставке писем и посылок на различных условиях. Включены также местные доставки и услуги рассыльных и курьеров. @ru
preferred label: Складиране и съхраняване на товари @bg
preferred label: Skladování @cs
preferred label: Oplagrings- og pakhusvirksomhed @da
preferred label: Lagerei @de
preferred label: Αποθήκευση @el
preferred label: Depósito y almacenamiento @es
preferred label: Laondus @et
preferred label: Varastointi @fi
preferred label: Entreposage et stockage @fr
preferred label: Raktározás, tárolás
preferred label: Magazzinaggio e custodia @it
preferred label: Sandėliavimas ir saugojimas @lt
preferred label: Uzglabāšana un noliktavu saimniecība @lv
preferred label: Magazzinaġġ u ħażna @mt
preferred label: Opslag @nl
preferred label: Lagring @no
preferred label: Magazynowanie i przechowywanie towarów @pl
preferred label: Armazenagem @pt
preferred label: Depozitări @ro
preferred label: Складирование и хранение @ru
preferred label: Skladovanie a uskladňovanie @sk
preferred label: Skladiščenje @sl
preferred label: Magasinering och varulagring @sv
preferred label: Depolama ve ambarlama @tr
broader: Warehousing and support activities for transportation
narrower: Warehousing and storage

Warehousing and storage
type: Concept
notation: 52.10
status: valid
status modified: 2013-10-18
accepted date: 2013-10-18
in scheme: Statistical Classification of Economic Activities in the European Community, Rev. 2 (2008)
scope note: - експлоатация на складове за всякакъв вид стоки: • експлоатация на зърнени силози, общи търговски складове, хладилни складове, складове резервоари (цистерни) и други - съхраняване на стоки в свободни зони - съхраняване на стоки чрез шоково замразяване - експлоатация на места за паркиране - 52.21 - експлоатация на собствени складове - 68.20 - даване под наем на собствени недвижими имоти - 68.20 @bg
scope note: Z: - provozování skladových zařízení pro všechny druhy zboží: • provoz obilných sil, všeobecných obchodních skladišť, chlazených skladů, skladovacích nádrží atd. ZT: - skladování zboží v zónách zahraničního obchodu - zmrazování ve zmrazovacím tunelu N: - parkovací zařízení pro motorová vozidla (52.21) - provozování vlastních skladovacích zařízení (68.20) - pronájem volného prostoru (68.20) @cs
scope note: Diese Klasse umfasst: - Betrieb von Lagereinrichtungen für alle Arten von Gütern: • Getreidesilos, Lagerhäuser, Kühlhäuser, Lagertanks usw. Diese Klasse umfasst ferner: - Lagerung von Gütern in Freilagern - Schockgefrieren Diese Klasse umfasst nicht: - Betrieb von Parkplätzen und -häusern (s. 52.21) - Betrieb von Selbsteinlagerungssystemen (s. 68.20) - Vermietung von Lagerraum (s. 68.20) @de
scope note: This class includes: - operation of storage and warehouse facilities for all kinds of goods: • operation of grain silos, general merchandise warehouses, refrigerated warehouses, storage tanks etc. This class also includes: - storage of goods in foreign trade zones - blast freezing This class excludes: - parking facilities for motor vehicles, see 52.21 - operation of self storage facilities, see 68.20 - rental of vacant space, see 68.20 @en
scope note: Esta clase comprende: - la explotación de instalaciones de almacenamiento y depósito de todo tipo de mercancías: • la explotación de silos, almacenes generales para mercancías, almacenes frigoríficos, tanques de almacenamiento, etc. Esta clase comprende también: - el almacenamiento de mercancías en zonas francas - los servicios de ultracongelación Esta clase no comprende: - la explotación de aparcamientos para vehículos de motor (véase 52.21) - la explotación de almacenes privados para uso propio (véase 68.20) - el alquiler de espacios vacíos (véase 68.20) @es
scope note: Cette classe comprend: - l’exploitation d’installations d’entreposage pour tous les types de produits: • silos à grains, entrepôts généraux, entrepôts frigorifiques, réservoirs, etc. Cette classe comprend également: - l’entreposage de marchandises dans des zones franches - la congélation par air forcé Cette classe ne comprend pas: - les installations de stationnement pour véhicules automobiles, voir 52.21 - les installations d’entreposage libre-service, voir 68.20 - la location d’espaces libres, voir 68.20 @fr
scope note: Ovaj razred uključuje: - rad skladišta i skladišnih uređaja za sve vrste robe: • silosa za žitarice, skladišta za mješovitu robu, rashladnih skladišta, skladišta cisterni (tankova) Ovaj razred također uključuje: - skladištenje roba u vanjskotrgovinskim zonama - komore za naglo zamrzavanje Ovaj razred isključuje: - parkirališta za motorna vozila, vidi 52.21 - djelatnost postrojenja za samoskladištenje, vidi 68.20 - iznajmljivanje praznih prostora, vidi 68.20
scope note: Į šią klasę įeina: - visų rūšių prekių saugyklų ir sandėlių eksploatavimas: • grūdų elevatorių, bendrosios paskirties prekių sandėlių, sandėlių šaldytuvų, cisternų ir kt. eksploatavimas Į šią klasę taip pat įeina: - prekių saugojimas užsienio prekybos zonose - sušaldymas intensyvioje oro srovėje Į šią klasę neįeina: - transporto priemonių stovėjimo aikštelių paslaugos, žr. 52.21 - savų saugojimo įrenginių eksploatavimas, žr. 68.20 - laisvo ploto nuomojimas, žr. 68.20 @lt
scope note: Bu sınıf aşağıdakileri kapsamaktadır; - her tür mal için depolama ve ambarlama tesislerinin işletilmesi: • hububat silolarının, genel mal ambarlarının, soğuk hava depolarının, depolama tanklarının vb.nin işletilmesi. Ayrıca bu sınıf aşağıdakileri de kapsamaktadır; - dış ticaret bölgelerinde malların depolanması, - şok dondurma hizmetleri. Kapsam dışı olanlar; - motorlu taşıtlar için park tesisleri, bkz. 52.21, - kendine ait depolama tesislerinin işletilmesi, bkz. 68.20, - boş alanların kiralanması, bkz. 68.20. @tr
preferred label: Складиране и съхраняване на товари @bg
preferred label: Skladování @cs
preferred label: Oplagrings- og pakhusvirksomhed @da
preferred label: Lagerei @de
preferred label: Αποθήκευση @el
preferred label: Depósito y almacenamiento @es
preferred label: Laondus @et
preferred label: Varastointi @fi
preferred label: Entreposage et stockage @fr
preferred label: Raktározás, tárolás
preferred label: Magazzinaggio e custodia @it
preferred label: Sandėliavimas ir saugojimas @lt
preferred label: Uzglabāšana un noliktavu saimniecība @lv
preferred label: Magazzinaġġ u ħażna @mt
preferred label: Opslag @nl
preferred label: Lagring @no
preferred label: Magazynowanie i przechowywanie towarów @pl
preferred label: Armazenagem @pt
preferred label: Depozitări @ro
preferred label: Складирование и хранение @ru
preferred label: Skladovanie a uskladňovanie @sk
preferred label: Skladiščenje @sl
preferred label: Magasinering och varulagring @sv
preferred label: Depolama ve ambarlama @tr
broader: Warehousing and storage

Support activities for transportation
type: Concept
notation: 52.2
status: valid
status modified: 2013-10-18
accepted date: 2013-10-18
in scheme: Statistical Classification of Economic Activities in the European Community, Rev. 2 (2008)
scope note: спомагателни дейности в транспорта на пътници или товари като експлоатация на части от транспортната инфраструктура или дейности, свързани с обработката на товари непосредствено преди, по време или след превоза им. Включва още експлоатация и поддържане на всички транспортни съоръжения. @bg
scope note: Tato skupina zahrnuje činnosti podporující přepravu osob nebo nákladů, jako je provozování částí dopravní infrastruktury nebo činnosti spojené s manipulací s nákladem bezprostředně před nebo po přepravě mezi jednotlivými dopravními úseky. Rovněž zahrnuje provoz a údržbu všech dopravních zařízení. @cs
scope note: Diese Gruppe umfasst Tätigkeiten im Zusammenhang mit der Beförderung von Personen oder Gütern wie z. B. den Betrieb von Teilen der Verkehrsinfrastruktur oder Tätigkeiten im Frachtumschlag unmittelbar vor oder nach der Beförderung oder zwischen einzelnen Verkehrsabschnitten. Der Betrieb und die Wartung sämtlicher Verkehrseinrichtungen sind eingeschlossen. @de
scope note: This group includes activities supporting the transport of passengers or freight, such as operation of parts of the transport infrastructure or activities related to handling freight immediately before or after transport or between transport segments. The operation and maintenance of all transport facilities is included. @en
scope note: Este grupo comprende las actividades complementarias para el transporte de pasajeros o mercancías, como la explotación de partes de la infraestructura de transporte o las actividades relacionadas con la manipulación de mercancías inmediatamente antes o después o entre segmentos de transporte. Comprende la explotación y el mantenimiento de todas las instalaciones de transporte. @es
scope note: Ce groupe comprend les activités auxiliaires liées au transport de personnes ou de marchandises, telles que l’exploitation de certaines parties d’infrastructures de transport ou des activités liées à la manutention du fret immédiatement avant ou après le transport ou entre différents segments de transport. Sont également comprises les activités d’exploitation et d’entretien de toute installation de transport. @fr
scope note: Ova skupina uključuje prateće djelatnosti u prijevozu putnika ili roba kao što su dijelovi prijevozne infrastrukture ili djelatnosti koje se odnose na rukovanje teretima prije, poslije ili između pojedinih prijevoznih segmenata. Uključeni su rad i održavanje cjelokupne prijevozne opreme.
scope note: Į šią grupę įeina keleivių arba krovinių vežimui būdinga veikla, tokia kaip transporto infrastruktūros dalių valdymas arba veikla, susijusi su krovinių tvarkymu iškart prieš vežimą ar po jo arba tarp vežimų. Į šį skyrių taip pat įeina visų transporto įrenginių eksploatavimas ir techninė priežiūra. @lt
scope note: Данный класс включает деятельность почтовых служб, функционирующих в соответствии с обязательствами по предоставлению услуг в зоне всеобщего охвата под управлением одного или нескольких специально назначенных поставщиков услуг. Данная деятельность включает использование инфраструктуры зоны всеобщего охвата, включая места розничной продажи, сортировочное и технологическое оборудование, а также маршрутов доставки, по которым следует забирать и доставлять почту. Доставка включает почтовые отправления, т.е. письма, открытки, печатные издания (газеты, периодику, рекламные издания и т.д.), мелкие посылки, товары или документы. Также сюда относятся прочие услуги, необходимые для выполнения обязательств по предоставлению услуг в зоне всеобщего охвата. Этот класс включает: - выемку, сортировку, транспортировку и доставку (внутреннюю и международную) почтовых отправлений в виде посылок и бандеролей посредством службы почтовой доставки в соответствии с обязательствами по предоставлению услуг в зоне всеобщего охвата. При этом можно использовать один или более видов транспортировки и данная деятельность может осуществляться как на собственном (частном) транспорте, так и через общественный транспорт. - сбор писем и посылок из частных почтовых ящиков или из почтовых отделений связи Этот класс исключает: - деятельность, связанную с почтовыми безналичными расчетами (жирочетами), сбережениями на почтово-сберегательных счетах и почтовыми денежными переводами, см. 64.19 @ru
scope note: Bu grup, taşımacılık altyapı tesislerinin işletilmesi veya taşıma öncesinde ve sonrasında veya taşıma evreleri arasında gecikmeksizin yükün indirilip bindirilmesi faaliyetleri gibi, yolcu ve yük taşımacılığını destekleyen faaliyetleri kapsamaktadır. Tüm taşımacılık tesislerinin işletilmesi ve bakımı da buna dahildir. @tr
preferred label: Спомагателни дейности в транспорта @bg
preferred label: Vedlejší činnosti v dopravě @cs
preferred label: Anden hjælpevirksomhed i forbindelse med transport @da
preferred label: Erbringung von sonstigen Dienstleistungen für den Verkehr @de
preferred label: Υποστηρικτικές προς τη μεταφορά δραστηριότητες @el
preferred label: Actividades anexas al transporte @es
preferred label: Veondust abistavad tegevusalad @et
preferred label: Liikennettä palveleva toiminta @fi
preferred label: Services auxiliaires des transports @fr
preferred label: Szállítást kiegészítő tevékenység
preferred label: Attività di supporto ai trasporti @it
preferred label: Transportui būdingų paslaugų veikla @lt
preferred label: Transporta palīgdarbības @lv
preferred label: Attivitajiet ta' sostenn għat-trasport @mt
preferred label: Vervoerondersteunende activiteiten @nl
preferred label: Andre tjenester tilknyttet transport @no
preferred label: Działalność usługowa wspomagająca transport @pl
preferred label: Actividades auxiliares dos transportes @pt
preferred label: Activităţi anexe pentru transporturi @ro
preferred label: Вспомогательные виды деятельности при транспортировке @ru
preferred label: Pomocné činnosti v doprave @sk
preferred label: Spremljajoče prometne dejavnosti @sl
preferred label: Stödtjänster till transport @sv
preferred label: Taşımacılık için destekleyici faaliyetler @tr
broader: Warehousing and support activities for transportation
narrower: Service activities incidental to land transportation
narrower: Service activities incidental to water transportation
narrower: Service activities incidental to air transportation
narrower: Cargo handling
narrower: Other transportation support activities