Codelist of habitat types
type: ConceptScheme
notation: habitats
is part of: art17 2018
registration status: Public draft
user modified: demo_user
date modified: 2019-01-17 09:20:22.0
vocabulary type: Common
is numeric concept identifiers: false
is notations equal identifiers: false

Sandbanks which are slightly covered by sea water all the time
type: Concept
notation: 1110
definition: http://eunis.eea.europa.eu/habitats/10003
status: valid
status modified: 2017-12-22
accepted date: 2017-12-22
in scheme: Codelist of habitat types

Posidonia beds (Posidonion oceanicae)
type: Concept
notation: 1120
definition: http://eunis.eea.europa.eu/habitats/10004
status: valid
status modified: 2017-12-22
accepted date: 2017-12-22
in scheme: Codelist of habitat types

Estuaries
type: Concept
notation: 1130
definition: http://eunis.eea.europa.eu/habitats/10005
status: valid
status modified: 2017-12-22
accepted date: 2017-12-22
in scheme: Codelist of habitat types

Mudflats and sandflats not covered by seawater at low tide
type: Concept
notation: 1140
definition: http://eunis.eea.europa.eu/habitats/10006
status: valid
status modified: 2017-12-22
accepted date: 2017-12-22
in scheme: Codelist of habitat types

Coastal lagoons
type: Concept
notation: 1150
definition: http://eunis.eea.europa.eu/habitats/10007
status: valid
status modified: 2017-12-22
accepted date: 2017-12-22
in scheme: Codelist of habitat types

Large shallow inlets and bays
type: Concept
notation: 1160
definition: http://eunis.eea.europa.eu/habitats/10008
status: valid
status modified: 2017-12-22
accepted date: 2017-12-22
in scheme: Codelist of habitat types

Reefs
type: Concept
notation: 1170
definition: http://eunis.eea.europa.eu/habitats/10009
status: valid
status modified: 2017-12-22
accepted date: 2017-12-22
in scheme: Codelist of habitat types

Submarine structures made by leaking gases
type: Concept
notation: 1180
definition: http://eunis.eea.europa.eu/habitats/10010
status: valid
status modified: 2017-12-22
accepted date: 2017-12-22
in scheme: Codelist of habitat types

Annual vegetation of drift lines
type: Concept
notation: 1210
definition: http://eunis.eea.europa.eu/habitats/10012
status: valid
status modified: 2017-12-22
accepted date: 2017-12-22
in scheme: Codelist of habitat types

Perennial vegetation of stony banks
type: Concept
notation: 1220
definition: http://eunis.eea.europa.eu/habitats/10013
status: valid
status modified: 2017-12-22
accepted date: 2017-12-22
in scheme: Codelist of habitat types

Vegetated sea cliffs of the Atlantic and Baltic Coasts
type: Concept
notation: 1230
definition: http://eunis.eea.europa.eu/habitats/10014
status: valid
status modified: 2017-12-22
accepted date: 2017-12-22
in scheme: Codelist of habitat types

Vegetated sea cliffs of the Mediterranean coasts with endemic Limonium spp.
type: Concept
notation: 1240
definition: http://eunis.eea.europa.eu/habitats/10015
status: valid
status modified: 2017-12-22
accepted date: 2017-12-22
in scheme: Codelist of habitat types

Vegetated sea cliffs with endemic flora of the Macaronesian coasts
type: Concept
notation: 1250
definition: http://eunis.eea.europa.eu/habitats/10016
status: valid
status modified: 2017-12-22
accepted date: 2017-12-22
in scheme: Codelist of habitat types

Salicornia and other annuals colonizing mud and sand
type: Concept
notation: 1310
definition: http://eunis.eea.europa.eu/habitats/10018
status: valid
status modified: 2017-12-22
accepted date: 2017-12-22
in scheme: Codelist of habitat types

Spartina swards (Spartinion maritimae)
type: Concept
notation: 1320
definition: http://eunis.eea.europa.eu/habitats/10019
status: valid
status modified: 2017-12-22
accepted date: 2017-12-22
in scheme: Codelist of habitat types

Atlantic salt meadows (Glauco-Puccinellietalia maritimae)
type: Concept
notation: 1330
definition: http://eunis.eea.europa.eu/habitats/10020
status: valid
status modified: 2017-12-22
accepted date: 2017-12-22
in scheme: Codelist of habitat types

Inland salt meadows
type: Concept
notation: 1340
definition: http://eunis.eea.europa.eu/habitats/10021
status: valid
status modified: 2017-12-22
accepted date: 2017-12-22
in scheme: Codelist of habitat types

Mediterranean salt meadows (Juncetalia maritimi)
type: Concept
notation: 1410
definition: http://eunis.eea.europa.eu/habitats/10023
status: valid
status modified: 2017-12-22
accepted date: 2017-12-22
in scheme: Codelist of habitat types

Mediterranean and thermo-Atlantic halophilous scrubs (Sarcocornetea fruticosi)
type: Concept
notation: 1420
definition: http://eunis.eea.europa.eu/habitats/10024
status: valid
status modified: 2017-12-22
accepted date: 2017-12-22
in scheme: Codelist of habitat types

Halo-nitrophilous scrubs (Pegano-Salsoletea)
type: Concept
notation: 1430
definition: http://eunis.eea.europa.eu/habitats/10025
status: valid
status modified: 2017-12-22
accepted date: 2017-12-22
in scheme: Codelist of habitat types

Mediterranean salt steppes (Limonietalia)
type: Concept
notation: 1510
definition: http://eunis.eea.europa.eu/habitats/10027
status: valid
status modified: 2017-12-22
accepted date: 2017-12-22
in scheme: Codelist of habitat types

Iberian gypsum vegetation (Gypsophiletalia)
type: Concept
notation: 1520
definition: http://eunis.eea.europa.eu/habitats/10028
status: valid
status modified: 2017-12-22
accepted date: 2017-12-22
in scheme: Codelist of habitat types

Pannonic salt steppes and salt marshes
type: Concept
notation: 1530
definition: http://eunis.eea.europa.eu/habitats/10029
status: valid
status modified: 2017-12-22
accepted date: 2017-12-22
in scheme: Codelist of habitat types

Baltic esker islands with sandy, rocky and shingle beach vegetation and sublittoral vegetation
type: Concept
notation: 1610
definition: http://eunis.eea.europa.eu/habitats/10031
status: valid
status modified: 2017-12-22
accepted date: 2017-12-22
in scheme: Codelist of habitat types

Boreal Baltic islets and small islands
type: Concept
notation: 1620
definition: http://eunis.eea.europa.eu/habitats/10032
status: valid
status modified: 2017-12-22
accepted date: 2017-12-22
in scheme: Codelist of habitat types

Boreal Baltic coastal meadows
type: Concept
notation: 1630
definition: http://eunis.eea.europa.eu/habitats/10033
status: valid
status modified: 2017-12-22
accepted date: 2017-12-22
in scheme: Codelist of habitat types

Boreal Baltic sandy beaches with perennial vegetation
type: Concept
notation: 1640
definition: http://eunis.eea.europa.eu/habitats/10034
status: valid
status modified: 2017-12-22
accepted date: 2017-12-22
in scheme: Codelist of habitat types

Boreal Baltic narrow inlets
type: Concept
notation: 1650
definition: http://eunis.eea.europa.eu/habitats/10035
status: valid
status modified: 2017-12-22
accepted date: 2017-12-22
in scheme: Codelist of habitat types

Embryonic shifting dunes
type: Concept
notation: 2110
definition: http://eunis.eea.europa.eu/habitats/10038
status: valid
status modified: 2017-12-22
accepted date: 2017-12-22
in scheme: Codelist of habitat types

Shifting dunes along the shoreline with Ammophila arenaria ("white dunes")
type: Concept
notation: 2120
definition: http://eunis.eea.europa.eu/habitats/10039
status: valid
status modified: 2017-12-22
accepted date: 2017-12-22
in scheme: Codelist of habitat types

Fixed coastal dunes with herbaceous vegetation ("grey dunes")
type: Concept
notation: 2130
definition: http://eunis.eea.europa.eu/habitats/10040
status: valid
status modified: 2017-12-22
accepted date: 2017-12-22
in scheme: Codelist of habitat types

Decalcified fixed dunes with Empetrum nigrum
type: Concept
notation: 2140
definition: http://eunis.eea.europa.eu/habitats/10041
status: valid
status modified: 2017-12-22
accepted date: 2017-12-22
in scheme: Codelist of habitat types

Atlantic decalcified fixed dunes (Calluno-Ulicetea)
type: Concept
notation: 2150
definition: http://eunis.eea.europa.eu/habitats/10042
status: valid
status modified: 2017-12-22
accepted date: 2017-12-22
in scheme: Codelist of habitat types

Dunes with Hippophae rhamnoides
type: Concept
notation: 2160
definition: http://eunis.eea.europa.eu/habitats/10043
status: valid
status modified: 2017-12-22
accepted date: 2017-12-22
in scheme: Codelist of habitat types

Dunes with Salix repens ssp. argentea (Salicion arenariae)
type: Concept
notation: 2170
definition: http://eunis.eea.europa.eu/habitats/10044
status: valid
status modified: 2017-12-22
accepted date: 2017-12-22
in scheme: Codelist of habitat types

Wooded dunes of the Atlantic, Continental and Boreal region
type: Concept
notation: 2180
definition: http://eunis.eea.europa.eu/habitats/10045
status: valid
status modified: 2017-12-22
accepted date: 2017-12-22
in scheme: Codelist of habitat types

Humid dune slacks
type: Concept
notation: 2190
definition: http://eunis.eea.europa.eu/habitats/10046
status: valid
status modified: 2017-12-22
accepted date: 2017-12-22
in scheme: Codelist of habitat types

Machairs (* in Ireland)
type: Concept
notation: 21A0
definition: http://eunis.eea.europa.eu/habitats/10047
status: valid
status modified: 2017-12-22
accepted date: 2017-12-22
in scheme: Codelist of habitat types

Crucianellion maritimae fixed beach dunes
type: Concept
notation: 2210
definition: http://eunis.eea.europa.eu/habitats/10049
status: valid
status modified: 2017-12-22
accepted date: 2017-12-22
in scheme: Codelist of habitat types

Dunes with Euphorbia terracina
type: Concept
notation: 2220
definition: http://eunis.eea.europa.eu/habitats/10050
status: valid
status modified: 2017-12-22
accepted date: 2017-12-22
in scheme: Codelist of habitat types

Malcolmietalia dune grasslands
type: Concept
notation: 2230
definition: http://eunis.eea.europa.eu/habitats/10051
status: valid
status modified: 2017-12-22
accepted date: 2017-12-22
in scheme: Codelist of habitat types

Brachypodietalia dune grasslands with annuals
type: Concept
notation: 2240
definition: http://eunis.eea.europa.eu/habitats/10052
status: valid
status modified: 2017-12-22
accepted date: 2017-12-22
in scheme: Codelist of habitat types

Coastal dunes with Juniperus spp.
type: Concept
notation: 2250
definition: http://eunis.eea.europa.eu/habitats/10053
status: valid
status modified: 2017-12-22
accepted date: 2017-12-22
in scheme: Codelist of habitat types

Cisto-Lavenduletalia dune sclerophyllous scrubs
type: Concept
notation: 2260
definition: http://eunis.eea.europa.eu/habitats/10054
status: valid
status modified: 2017-12-22
accepted date: 2017-12-22
in scheme: Codelist of habitat types

Wooded dunes with Pinus pinea and/or Pinus pinaster
type: Concept
notation: 2270
definition: http://eunis.eea.europa.eu/habitats/10055
status: valid
status modified: 2017-12-22
accepted date: 2017-12-22
in scheme: Codelist of habitat types

Dry sand heaths with Calluna and Genista
type: Concept
notation: 2310
definition: http://eunis.eea.europa.eu/habitats/10057
status: valid
status modified: 2017-12-22
accepted date: 2017-12-22
in scheme: Codelist of habitat types

Dry sand heaths with Calluna and Empetrum nigrum
type: Concept
notation: 2320
definition: http://eunis.eea.europa.eu/habitats/10058
status: valid
status modified: 2017-12-22
accepted date: 2017-12-22
in scheme: Codelist of habitat types

Inland dunes with open Corynephorus and Agrostis grasslands
type: Concept
notation: 2330
definition: http://eunis.eea.europa.eu/habitats/10059
status: valid
status modified: 2017-12-22
accepted date: 2017-12-22
in scheme: Codelist of habitat types

Pannonic inland dunes
type: Concept
notation: 2340
definition: http://eunis.eea.europa.eu/habitats/10060
status: valid
status modified: 2017-12-22
accepted date: 2017-12-22
in scheme: Codelist of habitat types

Oligotrophic waters containing very few minerals of sandy plains (Littorelletalia uniflorae)
type: Concept
notation: 3110
definition: http://eunis.eea.europa.eu/habitats/10063
status: valid
status modified: 2017-12-22
accepted date: 2017-12-22
in scheme: Codelist of habitat types

Oligotrophic waters containing very few minerals generally on sandy soils of the West Mediterranean, with Isoetes spp.
type: Concept
notation: 3120
definition: http://eunis.eea.europa.eu/habitats/10064
status: valid
status modified: 2017-12-22
accepted date: 2017-12-22
in scheme: Codelist of habitat types

Oligotrophic to mesotrophic standing waters with vegetation of the Littorelletea uniflorae and/or of the Iso�to-Nanojuncetea
type: Concept
notation: 3130
definition: http://eunis.eea.europa.eu/habitats/10065
status: valid
status modified: 2017-12-22
accepted date: 2017-12-22
in scheme: Codelist of habitat types

Hard oligo-mesotrophic waters with benthic vegetation of Chara spp.
type: Concept
notation: 3140
definition: http://eunis.eea.europa.eu/habitats/10066
status: valid
status modified: 2017-12-22
accepted date: 2017-12-22
in scheme: Codelist of habitat types

Natural eutrophic lakes with Magnopotamion or Hydrocharition - type vegetation
type: Concept
notation: 3150
definition: http://eunis.eea.europa.eu/habitats/10067
status: valid
status modified: 2017-12-22
accepted date: 2017-12-22
in scheme: Codelist of habitat types

Natural dystrophic lakes and ponds
type: Concept
notation: 3160
definition: http://eunis.eea.europa.eu/habitats/10068
status: valid
status modified: 2017-12-22
accepted date: 2017-12-22
in scheme: Codelist of habitat types

Mediterranean temporary ponds
type: Concept
notation: 3170
definition: http://eunis.eea.europa.eu/habitats/10069
status: valid
status modified: 2017-12-22
accepted date: 2017-12-22
in scheme: Codelist of habitat types

Turloughs
type: Concept
notation: 3180
definition: http://eunis.eea.europa.eu/habitats/10070
status: valid
status modified: 2017-12-22
accepted date: 2017-12-22
in scheme: Codelist of habitat types

Lakes of gypsum karst
type: Concept
notation: 3190
definition: http://eunis.eea.europa.eu/habitats/10240
status: valid
status modified: 2017-12-22
accepted date: 2017-12-22
in scheme: Codelist of habitat types

Transylvanian hot-spring lotus beds
type: Concept
notation: 31A0
definition: http://eunis.eea.europa.eu/habitats/10241
status: valid
status modified: 2017-12-22
accepted date: 2017-12-22
in scheme: Codelist of habitat types

Fennoscandian natural rivers
type: Concept
notation: 3210
definition: http://eunis.eea.europa.eu/habitats/10072
status: valid
status modified: 2017-12-22
accepted date: 2017-12-22
in scheme: Codelist of habitat types

Alpine rivers and the herbaceous vegetation along their banks
type: Concept
notation: 3220
definition: http://eunis.eea.europa.eu/habitats/10073
status: valid
status modified: 2017-12-22
accepted date: 2017-12-22
in scheme: Codelist of habitat types

Alpine rivers and their ligneous vegetation with Myricaria germanica
type: Concept
notation: 3230
definition: http://eunis.eea.europa.eu/habitats/10074
status: valid
status modified: 2017-12-22
accepted date: 2017-12-22
in scheme: Codelist of habitat types

Alpine rivers and their ligneous vegetation with Salix elaeagnos
type: Concept
notation: 3240
definition: http://eunis.eea.europa.eu/habitats/10075
status: valid
status modified: 2017-12-22
accepted date: 2017-12-22
in scheme: Codelist of habitat types

Constantly flowing Mediterranean rivers with Glaucium flavum
type: Concept
notation: 3250
definition: http://eunis.eea.europa.eu/habitats/10076
status: valid
status modified: 2017-12-22
accepted date: 2017-12-22
in scheme: Codelist of habitat types

Water courses of plain to montane levels with the Ranunculion fluitantis and Callitricho-Batrachion vegetation
type: Concept
notation: 3260
definition: http://eunis.eea.europa.eu/habitats/10077
status: valid
status modified: 2017-12-22
accepted date: 2017-12-22
in scheme: Codelist of habitat types

Rivers with muddy banks with Chenopodion rubri p.p. and Bidention p.p. vegetation
type: Concept
notation: 3270
definition: http://eunis.eea.europa.eu/habitats/10078
status: valid
status modified: 2017-12-22
accepted date: 2017-12-22
in scheme: Codelist of habitat types

Constantly flowing Mediterranean rivers with Paspalo-Agrostidion species and hanging curtains of Salix and Populus alba
type: Concept
notation: 3280
definition: http://eunis.eea.europa.eu/habitats/10079
status: valid
status modified: 2017-12-22
accepted date: 2017-12-22
in scheme: Codelist of habitat types

Intermittently flowing Mediterranean rivers of the Paspalo-Agrostidion
type: Concept
notation: 3290
definition: http://eunis.eea.europa.eu/habitats/10080
status: valid
status modified: 2017-12-22
accepted date: 2017-12-22
in scheme: Codelist of habitat types

Tufa cascades of karstic rivers in the Dinaric Alps
type: Concept
notation: 32A0
definition: http://eunis.eea.europa.eu/habitats/10274
status: valid
status modified: 2017-12-22
accepted date: 2017-12-22
in scheme: Codelist of habitat types

Northern Atlantic wet heaths with Erica tetralix
type: Concept
notation: 4010
definition: http://eunis.eea.europa.eu/habitats/10082
status: valid
status modified: 2017-12-22
accepted date: 2017-12-22
in scheme: Codelist of habitat types

Temperate Atlantic wet heaths with Erica ciliaris and Erica tetralix
type: Concept
notation: 4020
definition: http://eunis.eea.europa.eu/habitats/10083
status: valid
status modified: 2017-12-22
accepted date: 2017-12-22
in scheme: Codelist of habitat types

European dry heaths
type: Concept
notation: 4030
definition: http://eunis.eea.europa.eu/habitats/10084
status: valid
status modified: 2017-12-22
accepted date: 2017-12-22
in scheme: Codelist of habitat types

Dry Atlantic coastal heaths with Erica vagans
type: Concept
notation: 4040
definition: http://eunis.eea.europa.eu/habitats/10085
status: valid
status modified: 2017-12-22
accepted date: 2017-12-22
in scheme: Codelist of habitat types

Endemic macaronesian heaths
type: Concept
notation: 4050
definition: http://eunis.eea.europa.eu/habitats/10086
status: valid
status modified: 2017-12-22
accepted date: 2017-12-22
in scheme: Codelist of habitat types

Alpine and Boreal heaths
type: Concept
notation: 4060
definition: http://eunis.eea.europa.eu/habitats/10087
status: valid
status modified: 2017-12-22
accepted date: 2017-12-22
in scheme: Codelist of habitat types

Bushes with Pinus mugo and Rhododendron hirsutum (Mugo-Rhododendretum hirsuti)
type: Concept
notation: 4070
definition: http://eunis.eea.europa.eu/habitats/10088
status: valid
status modified: 2017-12-22
accepted date: 2017-12-22
in scheme: Codelist of habitat types

Sub-Arctic Salix spp. scrub
type: Concept
notation: 4080
definition: http://eunis.eea.europa.eu/habitats/10089
status: valid
status modified: 2017-12-22
accepted date: 2017-12-22
in scheme: Codelist of habitat types

Endemic oro-Mediterranean heaths with gorse
type: Concept
notation: 4090
definition: http://eunis.eea.europa.eu/habitats/10090
status: valid
status modified: 2017-12-22
accepted date: 2017-12-22
in scheme: Codelist of habitat types

Subcontinental peri-Pannonic scrub
type: Concept
notation: 40A0
definition: http://eunis.eea.europa.eu/habitats/10242
status: valid
status modified: 2017-12-22
accepted date: 2017-12-22
in scheme: Codelist of habitat types

Rhodope Potentilla fruticosa thickets
type: Concept
notation: 40B0
definition: http://eunis.eea.europa.eu/habitats/10261
status: valid
status modified: 2017-12-22
accepted date: 2017-12-22
in scheme: Codelist of habitat types

Ponto-Sarmatic deciduous thickets
type: Concept
notation: 40C0
definition: http://eunis.eea.europa.eu/habitats/10262
status: valid
status modified: 2017-12-22
accepted date: 2017-12-22
in scheme: Codelist of habitat types

Stable xerothermophilous formations with Buxus sempervirens on rock slopes (Berberidion p.p.)
type: Concept
notation: 5110
definition: http://eunis.eea.europa.eu/habitats/10093
status: valid
status modified: 2017-12-22
accepted date: 2017-12-22
in scheme: Codelist of habitat types

Mountain Cytisus purgans formations
type: Concept
notation: 5120
definition: http://eunis.eea.europa.eu/habitats/10094
status: valid
status modified: 2017-12-22
accepted date: 2017-12-22
in scheme: Codelist of habitat types

Juniperus communis formations on heaths or calcareous grasslands
type: Concept
notation: 5130
definition: http://eunis.eea.europa.eu/habitats/10095
status: valid
status modified: 2017-12-22
accepted date: 2017-12-22
in scheme: Codelist of habitat types

Cistus palhinhae formations on maritime wet heaths
type: Concept
notation: 5140
definition: http://eunis.eea.europa.eu/habitats/10096
status: valid
status modified: 2017-12-22
accepted date: 2017-12-22
in scheme: Codelist of habitat types

Arborescent matorral with Juniperus spp.
type: Concept
notation: 5210
definition: http://eunis.eea.europa.eu/habitats/10097
status: valid
status modified: 2017-12-22
accepted date: 2017-12-22
in scheme: Codelist of habitat types

Arborescent matorral with Zyziphus
type: Concept
notation: 5220
definition: http://eunis.eea.europa.eu/habitats/10098
status: valid
status modified: 2017-12-22
accepted date: 2017-12-22
in scheme: Codelist of habitat types

Arborescent matorral with Laurus nobilis
type: Concept
notation: 5230
definition: http://eunis.eea.europa.eu/habitats/10099
status: valid
status modified: 2017-12-22
accepted date: 2017-12-22
in scheme: Codelist of habitat types

Laurus nobilis thickets
type: Concept
notation: 5310
definition: http://eunis.eea.europa.eu/habitats/10100
status: valid
status modified: 2017-12-22
accepted date: 2017-12-22
in scheme: Codelist of habitat types

Low formations of Euphorbia close to cliffs
type: Concept
notation: 5320
definition: http://eunis.eea.europa.eu/habitats/10103
status: valid
status modified: 2017-12-22
accepted date: 2017-12-22
in scheme: Codelist of habitat types

Thermo-Mediterranean and pre-desert scrub
type: Concept
notation: 5330
definition: http://eunis.eea.europa.eu/habitats/10104
status: valid
status modified: 2017-12-22
accepted date: 2017-12-22
in scheme: Codelist of habitat types

West Mediterranean clifftop phryganas (Astragalo-Plantaginetum subulatae)
type: Concept
notation: 5410
definition: http://eunis.eea.europa.eu/habitats/10106
status: valid
status modified: 2017-12-22
accepted date: 2017-12-22
in scheme: Codelist of habitat types

Sarcopoterium spinosum phryganas
type: Concept
notation: 5420
definition: http://eunis.eea.europa.eu/habitats/10107
status: valid
status modified: 2017-12-22
accepted date: 2017-12-22
in scheme: Codelist of habitat types

Endemic phryganas of the Euphorbio-Verbascion
type: Concept
notation: 5430
definition: http://eunis.eea.europa.eu/habitats/10108
status: valid
status modified: 2017-12-22
accepted date: 2017-12-22
in scheme: Codelist of habitat types

Rupicolous calcareous or basophilic grasslands of the Alysso-Sedion albi
type: Concept
notation: 6110
definition: http://eunis.eea.europa.eu/habitats/10111
status: valid
status modified: 2017-12-22
accepted date: 2017-12-22
in scheme: Codelist of habitat types

Xeric sand calcareous grasslands
type: Concept
notation: 6120
definition: http://eunis.eea.europa.eu/habitats/10112
status: valid
status modified: 2017-12-22
accepted date: 2017-12-22
in scheme: Codelist of habitat types

Calaminarian grasslands of the Violetalia calaminariae
type: Concept
notation: 6130
definition: http://eunis.eea.europa.eu/habitats/10113
status: valid
status modified: 2017-12-22
accepted date: 2017-12-22
in scheme: Codelist of habitat types

Siliceous Pyrenean Festuca eskia grasslands
type: Concept
notation: 6140
definition: http://eunis.eea.europa.eu/habitats/10114
status: valid
status modified: 2017-12-22
accepted date: 2017-12-22
in scheme: Codelist of habitat types

Siliceous alpine and boreal grasslands
type: Concept
notation: 6150
definition: http://eunis.eea.europa.eu/habitats/10115
status: valid
status modified: 2017-12-22
accepted date: 2017-12-22
in scheme: Codelist of habitat types

Oro-Iberian Festuca indigesta grasslands
type: Concept
notation: 6160
definition: http://eunis.eea.europa.eu/habitats/10116
status: valid
status modified: 2017-12-22
accepted date: 2017-12-22
in scheme: Codelist of habitat types

Alpine and subalpine calcareous grasslands
type: Concept
notation: 6170
definition: http://eunis.eea.europa.eu/habitats/10117
status: valid
status modified: 2017-12-22
accepted date: 2017-12-22
in scheme: Codelist of habitat types

Macaronesian mesophile grasslands
type: Concept
notation: 6180
definition: http://eunis.eea.europa.eu/habitats/10118
status: valid
status modified: 2017-12-22
accepted date: 2017-12-22
in scheme: Codelist of habitat types

Rupicolous pannonic grasslands (Stipo-Festucetalia pallentis)
type: Concept
notation: 6190
definition: http://eunis.eea.europa.eu/habitats/10243
status: valid
status modified: 2017-12-22
accepted date: 2017-12-22
in scheme: Codelist of habitat types

Semi-natural dry grasslands and scrubland facies on calcareous substrates (Festuco-Brometalia) (* important orchid sites)
type: Concept
notation: 6210
definition: http://eunis.eea.europa.eu/habitats/10120
status: valid
status modified: 2017-12-22
accepted date: 2017-12-22
in scheme: Codelist of habitat types

Pseudo-steppe with grasses and annuals of the Thero-Brachypodietea
type: Concept
notation: 6220
definition: http://eunis.eea.europa.eu/habitats/10121
status: valid
status modified: 2017-12-22
accepted date: 2017-12-22
in scheme: Codelist of habitat types

Species-rich Nardus grasslands, on siliceous substrates in mountain areas (and submountain areas, in Continental Europe)
type: Concept
notation: 6230
definition: http://eunis.eea.europa.eu/habitats/10122
status: valid
status modified: 2017-12-22
accepted date: 2017-12-22
in scheme: Codelist of habitat types

Sub-Pannonic steppic grasslands
type: Concept
notation: 6240
definition: http://eunis.eea.europa.eu/habitats/10123
status: valid
status modified: 2017-12-22
accepted date: 2017-12-22
in scheme: Codelist of habitat types

Pannonic loess steppic grasslands
type: Concept
notation: 6250
definition: http://eunis.eea.europa.eu/habitats/10124
status: valid
status modified: 2017-12-22
accepted date: 2017-12-22
in scheme: Codelist of habitat types

Pannonic sand steppes
type: Concept
notation: 6260
definition: http://eunis.eea.europa.eu/habitats/10125
status: valid
status modified: 2017-12-22
accepted date: 2017-12-22
in scheme: Codelist of habitat types

Fennoscandian lowland species-rich dry to mesic grasslands
type: Concept
notation: 6270
definition: http://eunis.eea.europa.eu/habitats/10126
status: valid
status modified: 2017-12-22
accepted date: 2017-12-22
in scheme: Codelist of habitat types

Nordic alvar and precambrian calcareous flatrocks
type: Concept
notation: 6280
definition: http://eunis.eea.europa.eu/habitats/10127
status: valid
status modified: 2017-12-22
accepted date: 2017-12-22
in scheme: Codelist of habitat types

Eastern sub-Mediterranean dry grasslands (Scorzoneratalia villosae)
type: Concept
notation: 62A0
definition: http://eunis.eea.europa.eu/habitats/10244
status: valid
status modified: 2017-12-22
accepted date: 2017-12-22
in scheme: Codelist of habitat types

Serpentinophilous grasslands of Cyprus
type: Concept
notation: 62B0
definition: http://eunis.eea.europa.eu/habitats/10245
status: valid
status modified: 2017-12-22
accepted date: 2017-12-22
in scheme: Codelist of habitat types

Ponto-Sarmatic steppes
type: Concept
notation: 62C0
definition: http://eunis.eea.europa.eu/habitats/10263
status: valid
status modified: 2017-12-22
accepted date: 2017-12-22
in scheme: Codelist of habitat types

Oro-Moesian acidophilous grasslands
type: Concept
notation: 62D0
definition: http://eunis.eea.europa.eu/habitats/10264
status: valid
status modified: 2017-12-22
accepted date: 2017-12-22
in scheme: Codelist of habitat types

Dehesas with evergreen Quercus spp.
type: Concept
notation: 6310
definition: http://eunis.eea.europa.eu/habitats/10129
status: valid
status modified: 2017-12-22
accepted date: 2017-12-22
in scheme: Codelist of habitat types

Molinia meadows on calcareous, peaty or clayey-silt-laden soils (Molinion caeruleae)
type: Concept
notation: 6410
definition: http://eunis.eea.europa.eu/habitats/10131
status: valid
status modified: 2017-12-22
accepted date: 2017-12-22
in scheme: Codelist of habitat types

Mediterranean tall humid grasslands of the Molinio-Holoschoenion
type: Concept
notation: 6420
definition: http://eunis.eea.europa.eu/habitats/10132
status: valid
status modified: 2017-12-22
accepted date: 2017-12-22
in scheme: Codelist of habitat types

Hydrophilous tall herb fringe communities of plains and of the montane to alpine levels
type: Concept
notation: 6430
definition: http://eunis.eea.europa.eu/habitats/10133
status: valid
status modified: 2017-12-22
accepted date: 2017-12-22
in scheme: Codelist of habitat types

Alluvial meadows of river valleys of the Cnidion dubii
type: Concept
notation: 6440
definition: http://eunis.eea.europa.eu/habitats/10134
status: valid
status modified: 2017-12-22
accepted date: 2017-12-22
in scheme: Codelist of habitat types

Northern boreal alluvial meadows
type: Concept
notation: 6450
definition: http://eunis.eea.europa.eu/habitats/10135
status: valid
status modified: 2017-12-22
accepted date: 2017-12-22
in scheme: Codelist of habitat types

Peat grasslands of Troodos
type: Concept
notation: 6460
definition: http://eunis.eea.europa.eu/habitats/10246
status: valid
status modified: 2017-12-22
accepted date: 2017-12-22
in scheme: Codelist of habitat types

Lowland hay meadows (Alopecurus pratensis, Sanguisorba officinalis)
type: Concept
notation: 6510
definition: http://eunis.eea.europa.eu/habitats/10137
status: valid
status modified: 2017-12-22
accepted date: 2017-12-22
in scheme: Codelist of habitat types

Mountain hay meadows
type: Concept
notation: 6520
definition: http://eunis.eea.europa.eu/habitats/10138
status: valid
status modified: 2017-12-22
accepted date: 2017-12-22
in scheme: Codelist of habitat types

Fennoscandian wooded meadows
type: Concept
notation: 6530
definition: http://eunis.eea.europa.eu/habitats/10139
status: valid
status modified: 2017-12-22
accepted date: 2017-12-22
in scheme: Codelist of habitat types

Sub-Mediterranean grasslands of the Molinio-Hordeion secalini
type: Concept
notation: 6540
definition: http://eunis.eea.europa.eu/habitats/10275
status: valid
status modified: 2017-12-22
accepted date: 2017-12-22
in scheme: Codelist of habitat types

Active raised bogs
type: Concept
notation: 7110
definition: http://eunis.eea.europa.eu/habitats/10142
status: valid
status modified: 2017-12-22
accepted date: 2017-12-22
in scheme: Codelist of habitat types

Degraded raised bogs still capable of natural regeneration
type: Concept
notation: 7120
definition: http://eunis.eea.europa.eu/habitats/10143
status: valid
status modified: 2017-12-22
accepted date: 2017-12-22
in scheme: Codelist of habitat types

Blanket bogs (* if active bog)
type: Concept
notation: 7130
definition: http://eunis.eea.europa.eu/habitats/10144
status: valid
status modified: 2017-12-22
accepted date: 2017-12-22
in scheme: Codelist of habitat types

Transition mires and quaking bogs
type: Concept
notation: 7140
definition: http://eunis.eea.europa.eu/habitats/10145
status: valid
status modified: 2017-12-22
accepted date: 2017-12-22
in scheme: Codelist of habitat types

Depressions on peat substrates of the Rhynchosporion
type: Concept
notation: 7150
definition: http://eunis.eea.europa.eu/habitats/10146
status: valid
status modified: 2017-12-22
accepted date: 2017-12-22
in scheme: Codelist of habitat types

Fennoscandian mineral-rich springs and springfens
type: Concept
notation: 7160
definition: http://eunis.eea.europa.eu/habitats/10147
status: valid
status modified: 2017-12-22
accepted date: 2017-12-22
in scheme: Codelist of habitat types

Calcareous fens with Cladium mariscus and species of the Caricion davallianae
type: Concept
notation: 7210
definition: http://eunis.eea.europa.eu/habitats/10149
status: valid
status modified: 2017-12-22
accepted date: 2017-12-22
in scheme: Codelist of habitat types

Petrifying springs with tufa formation (Cratoneurion)
type: Concept
notation: 7220
definition: http://eunis.eea.europa.eu/habitats/10150
status: valid
status modified: 2017-12-22
accepted date: 2017-12-22
in scheme: Codelist of habitat types

Alkaline fens
type: Concept
notation: 7230
definition: http://eunis.eea.europa.eu/habitats/10151
status: valid
status modified: 2017-12-22
accepted date: 2017-12-22
in scheme: Codelist of habitat types

Alpine pioneer formations of Caricion bicoloris-atrofuscae
type: Concept
notation: 7240
definition: http://eunis.eea.europa.eu/habitats/10152
status: valid
status modified: 2017-12-22
accepted date: 2017-12-22
in scheme: Codelist of habitat types

Aapa mires
type: Concept
notation: 7310
definition: http://eunis.eea.europa.eu/habitats/10154
status: valid
status modified: 2017-12-22
accepted date: 2017-12-22
in scheme: Codelist of habitat types

Palsa mires
type: Concept
notation: 7320
definition: http://eunis.eea.europa.eu/habitats/10155
status: valid
status modified: 2017-12-22
accepted date: 2017-12-22
in scheme: Codelist of habitat types

Siliceous scree of the montane to snow levels (Androsacetalia alpinae and Galeopsietalia ladani)
type: Concept
notation: 8110
definition: http://eunis.eea.europa.eu/habitats/10158
status: valid
status modified: 2017-12-22
accepted date: 2017-12-22
in scheme: Codelist of habitat types

Calcareous and calcshist screes of the montane to alpine levels (Thlaspietea rotundifolii)
type: Concept
notation: 8120
definition: http://eunis.eea.europa.eu/habitats/10159
status: valid
status modified: 2017-12-22
accepted date: 2017-12-22
in scheme: Codelist of habitat types

Western Mediterranean and thermophilous scree
type: Concept
notation: 8130
definition: http://eunis.eea.europa.eu/habitats/10160
status: valid
status modified: 2017-12-22
accepted date: 2017-12-22
in scheme: Codelist of habitat types

Eastern Mediterranean screes
type: Concept
notation: 8140
definition: http://eunis.eea.europa.eu/habitats/10161
status: valid
status modified: 2017-12-22
accepted date: 2017-12-22
in scheme: Codelist of habitat types

Medio-European upland siliceous screes
type: Concept
notation: 8150
definition: http://eunis.eea.europa.eu/habitats/10162
status: valid
status modified: 2017-12-22
accepted date: 2017-12-22
in scheme: Codelist of habitat types

Medio-European calcareous scree of hill and montane levels
type: Concept
notation: 8160
definition: http://eunis.eea.europa.eu/habitats/10163
status: valid
status modified: 2017-12-22
accepted date: 2017-12-22
in scheme: Codelist of habitat types

Calcareous rocky slopes with chasmophytic vegetation
type: Concept
notation: 8210
definition: http://eunis.eea.europa.eu/habitats/10165
status: valid
status modified: 2017-12-22
accepted date: 2017-12-22
in scheme: Codelist of habitat types

Siliceous rocky slopes with chasmophytic vegetation
type: Concept
notation: 8220
definition: http://eunis.eea.europa.eu/habitats/10166
status: valid
status modified: 2017-12-22
accepted date: 2017-12-22
in scheme: Codelist of habitat types

Siliceous rock with pioneer vegetation of the Sedo-Scleranthion or of the Sedo albi-Veronicion dillenii
type: Concept
notation: 8230
definition: http://eunis.eea.europa.eu/habitats/10167
status: valid
status modified: 2017-12-22
accepted date: 2017-12-22
in scheme: Codelist of habitat types

Limestone pavements
type: Concept
notation: 8240
definition: http://eunis.eea.europa.eu/habitats/10168
status: valid
status modified: 2017-12-22
accepted date: 2017-12-22
in scheme: Codelist of habitat types

Caves not open to the public
type: Concept
notation: 8310
definition: http://eunis.eea.europa.eu/habitats/10170
status: valid
status modified: 2017-12-22
accepted date: 2017-12-22
in scheme: Codelist of habitat types

Fields of lava and natural excavations
type: Concept
notation: 8320
definition: http://eunis.eea.europa.eu/habitats/10171
status: valid
status modified: 2017-12-22
accepted date: 2017-12-22
in scheme: Codelist of habitat types

Submerged or partially submerged sea caves
type: Concept
notation: 8330
definition: http://eunis.eea.europa.eu/habitats/10172
status: valid
status modified: 2017-12-22
accepted date: 2017-12-22
in scheme: Codelist of habitat types

Permanent glaciers
type: Concept
notation: 8340
definition: http://eunis.eea.europa.eu/habitats/10173
status: valid
status modified: 2017-12-22
accepted date: 2017-12-22
in scheme: Codelist of habitat types

Western Ta�ga
type: Concept
notation: 9010
definition: http://eunis.eea.europa.eu/habitats/10176
status: valid
status modified: 2017-12-22
accepted date: 2017-12-22
in scheme: Codelist of habitat types

Fennoscandian hemiboreal natural old broad-leaved deciduous forests (Quercus, Tilia, Acer, Fraxinus or Ulmus) rich in epiphytes
type: Concept
notation: 9020
definition: http://eunis.eea.europa.eu/habitats/10177
status: valid
status modified: 2017-12-22
accepted date: 2017-12-22
in scheme: Codelist of habitat types

Natural forests of primary succession stages of landupheaval coast
type: Concept
notation: 9030
definition: http://eunis.eea.europa.eu/habitats/10178
status: valid
status modified: 2017-12-22
accepted date: 2017-12-22
in scheme: Codelist of habitat types

Nordic subalpine/subarctic forests with Betula pubescens ssp. czerepanovii
type: Concept
notation: 9040
definition: http://eunis.eea.europa.eu/habitats/10179
status: valid
status modified: 2017-12-22
accepted date: 2017-12-22
in scheme: Codelist of habitat types

Fennoscandian herb-rich forests with Picea abies
type: Concept
notation: 9050
definition: http://eunis.eea.europa.eu/habitats/10180
status: valid
status modified: 2017-12-22
accepted date: 2017-12-22
in scheme: Codelist of habitat types

Coniferous forests on, or connected to, glaciofluvial eskers
type: Concept
notation: 9060
definition: http://eunis.eea.europa.eu/habitats/10181
status: valid
status modified: 2017-12-22
accepted date: 2017-12-22
in scheme: Codelist of habitat types

Fennoscandian wooded pastures
type: Concept
notation: 9070
definition: http://eunis.eea.europa.eu/habitats/10182
status: valid
status modified: 2017-12-22
accepted date: 2017-12-22
in scheme: Codelist of habitat types

Fennoscandian deciduous swamp woods
type: Concept
notation: 9080
definition: http://eunis.eea.europa.eu/habitats/10183
status: valid
status modified: 2017-12-22
accepted date: 2017-12-22
in scheme: Codelist of habitat types

Luzulo-Fagetum beech forests
type: Concept
notation: 9110
definition: http://eunis.eea.europa.eu/habitats/10185
status: valid
status modified: 2017-12-22
accepted date: 2017-12-22
in scheme: Codelist of habitat types

Atlantic acidophilous beech forests with Ilex and sometimes also Taxus in the shrublayer (Quercion robori-petraeae or Ilici-Fagenion)
type: Concept
notation: 9120
definition: http://eunis.eea.europa.eu/habitats/10186
status: valid
status modified: 2017-12-22
accepted date: 2017-12-22
in scheme: Codelist of habitat types

Asperulo-Fagetum beech forests
type: Concept
notation: 9130
definition: http://eunis.eea.europa.eu/habitats/10187
status: valid
status modified: 2017-12-22
accepted date: 2017-12-22
in scheme: Codelist of habitat types

Medio-European subalpine beech woods with Acer and Rumex arifolius
type: Concept
notation: 9140
definition: http://eunis.eea.europa.eu/habitats/10188
status: valid
status modified: 2017-12-22
accepted date: 2017-12-22
in scheme: Codelist of habitat types

Medio-European limestone beech forests of the Cephalanthero-Fagion
type: Concept
notation: 9150
definition: http://eunis.eea.europa.eu/habitats/10189
status: valid
status modified: 2017-12-22
accepted date: 2017-12-22
in scheme: Codelist of habitat types

Sub-Atlantic and medio-European oak or oak-hornbeam forests of the Carpinion betuli
type: Concept
notation: 9160
definition: http://eunis.eea.europa.eu/habitats/10190
status: valid
status modified: 2017-12-22
accepted date: 2017-12-22
in scheme: Codelist of habitat types

Galio-Carpinetum oak-hornbeam forests
type: Concept
notation: 9170
definition: http://eunis.eea.europa.eu/habitats/10191
status: valid
status modified: 2017-12-22
accepted date: 2017-12-22
in scheme: Codelist of habitat types

Tilio-Acerion forests of slopes, screes and ravines
type: Concept
notation: 9180
definition: http://eunis.eea.europa.eu/habitats/10192
status: valid
status modified: 2017-12-22
accepted date: 2017-12-22
in scheme: Codelist of habitat types

Old acidophilous oak woods with Quercus robur on sandy plains
type: Concept
notation: 9190
definition: http://eunis.eea.europa.eu/habitats/10193
status: valid
status modified: 2017-12-22
accepted date: 2017-12-22
in scheme: Codelist of habitat types

Old sessile oak woods with Ilex and Blechnum in the British Isles
type: Concept
notation: 91A0
definition: http://eunis.eea.europa.eu/habitats/10194
status: valid
status modified: 2017-12-22
accepted date: 2017-12-22
in scheme: Codelist of habitat types

Eastern white oak woods
type: Concept
notation: 91AA
definition: http://eunis.eea.europa.eu/habitats/10270
status: valid
status modified: 2017-12-22
accepted date: 2017-12-22
in scheme: Codelist of habitat types

Thermophilous Fraxinus angustifolia woods
type: Concept
notation: 91B0
definition: http://eunis.eea.europa.eu/habitats/10195
status: valid
status modified: 2017-12-22
accepted date: 2017-12-22
in scheme: Codelist of habitat types

Moesian silver fir forests
type: Concept
notation: 91BA
definition: http://eunis.eea.europa.eu/habitats/10271
status: valid
status modified: 2017-12-22
accepted date: 2017-12-22
in scheme: Codelist of habitat types

Caledonian forest
type: Concept
notation: 91C0
definition: http://eunis.eea.europa.eu/habitats/10196
status: valid
status modified: 2017-12-22
accepted date: 2017-12-22
in scheme: Codelist of habitat types

Rhodopide and Balkan Range Scots pine forests
type: Concept
notation: 91CA
definition: http://eunis.eea.europa.eu/habitats/10272
status: valid
status modified: 2017-12-22
accepted date: 2017-12-22
in scheme: Codelist of habitat types

Bog woodland
type: Concept
notation: 91D0
definition: http://eunis.eea.europa.eu/habitats/10197
status: valid
status modified: 2017-12-22
accepted date: 2017-12-22
in scheme: Codelist of habitat types

Alluvial forests with Alnus glutinosa and Fraxinus excelsior (Alno-Padion, Alnion incanae, Salicion albae)
type: Concept
notation: 91E0
definition: http://eunis.eea.europa.eu/habitats/10198
status: valid
status modified: 2017-12-22
accepted date: 2017-12-22
in scheme: Codelist of habitat types

Riparian mixed forests of Quercus robur, Ulmus laevis and Ulmus minor, Fraxinus excelsior or Fraxinus angustifolia, along the great rivers (Ulmenion minoris)
type: Concept
notation: 91F0
definition: http://eunis.eea.europa.eu/habitats/10199
status: valid
status modified: 2017-12-22
accepted date: 2017-12-22
in scheme: Codelist of habitat types

Pannonic woods with Quercus petraea and Carpinus betulus
type: Concept
notation: 91G0
definition: http://eunis.eea.europa.eu/habitats/10200
status: valid
status modified: 2017-12-22
accepted date: 2017-12-22
in scheme: Codelist of habitat types

Pannonian woods with Quercus pubescens
type: Concept
notation: 91H0
definition: http://eunis.eea.europa.eu/habitats/10201
status: valid
status modified: 2017-12-22
accepted date: 2017-12-22
in scheme: Codelist of habitat types

Euro-Siberian steppic woods with Quercus spp.
type: Concept
notation: 91I0
definition: http://eunis.eea.europa.eu/habitats/10202
status: valid
status modified: 2017-12-22
accepted date: 2017-12-22
in scheme: Codelist of habitat types

Taxus baccata woods of the British Isles
type: Concept
notation: 91J0
definition: http://eunis.eea.europa.eu/habitats/10203
status: valid
status modified: 2017-12-22
accepted date: 2017-12-22
in scheme: Codelist of habitat types

Illyrian Fagus sylvatica forests (Aremonio-Fagion)
type: Concept
notation: 91K0
definition: http://eunis.eea.europa.eu/habitats/10247
status: valid
status modified: 2017-12-22
accepted date: 2017-12-22
in scheme: Codelist of habitat types

Illyrian oak-hornbeam forests (Erythronio-Carpinion)
type: Concept
notation: 91L0
definition: http://eunis.eea.europa.eu/habitats/10248
status: valid
status modified: 2017-12-22
accepted date: 2017-12-22
in scheme: Codelist of habitat types

Pannonian-Balkanic turkey oak-sessile oak forests
type: Concept
notation: 91M0
definition: http://eunis.eea.europa.eu/habitats/10249
status: valid
status modified: 2017-12-22
accepted date: 2017-12-22
in scheme: Codelist of habitat types

Pannonic inland sand dune thicket (Junipero-Populetum albae)
type: Concept
notation: 91N0
definition: http://eunis.eea.europa.eu/habitats/10250
status: valid
status modified: 2017-12-22
accepted date: 2017-12-22
in scheme: Codelist of habitat types

Holy Cross fir forests (Abietetum polonicum)
type: Concept
notation: 91P0
definition: http://eunis.eea.europa.eu/habitats/10251
status: valid
status modified: 2017-12-22
accepted date: 2017-12-22
in scheme: Codelist of habitat types

Western Carpathian calcicolous Pinus sylvestris forests
type: Concept
notation: 91Q0
definition: http://eunis.eea.europa.eu/habitats/10252
status: valid
status modified: 2017-12-22
accepted date: 2017-12-22
in scheme: Codelist of habitat types

Dinaric dolomite Scots pine forests (Genisto januensis-Pinetum)
type: Concept
notation: 91R0
definition: http://eunis.eea.europa.eu/habitats/10253
status: valid
status modified: 2017-12-22
accepted date: 2017-12-22
in scheme: Codelist of habitat types

Western Pontic beech forests
type: Concept
notation: 91S0
definition: http://eunis.eea.europa.eu/habitats/10265
status: valid
status modified: 2017-12-22
accepted date: 2017-12-22
in scheme: Codelist of habitat types

Central European lichen Scots pine forests
type: Concept
notation: 91T0
definition: http://eunis.eea.europa.eu/habitats/10254
status: valid
status modified: 2017-12-22
accepted date: 2017-12-22
in scheme: Codelist of habitat types

Sarmatic steppe pine forest
type: Concept
notation: 91U0
definition: http://eunis.eea.europa.eu/habitats/10255
status: valid
status modified: 2017-12-22
accepted date: 2017-12-22
in scheme: Codelist of habitat types

Dacian Beech forests (Symphyto-Fagion)
type: Concept
notation: 91V0
definition: http://eunis.eea.europa.eu/habitats/10256
status: valid
status modified: 2017-12-22
accepted date: 2017-12-22
in scheme: Codelist of habitat types

Moesian beech forests
type: Concept
notation: 91W0
definition: http://eunis.eea.europa.eu/habitats/10266
status: valid
status modified: 2017-12-22
accepted date: 2017-12-22
in scheme: Codelist of habitat types

Dobrogean beech forests
type: Concept
notation: 91X0
definition: http://eunis.eea.europa.eu/habitats/10267
status: valid
status modified: 2017-12-22
accepted date: 2017-12-22
in scheme: Codelist of habitat types

Dacian oak & hornbeam forests
type: Concept
notation: 91Y0
definition: http://eunis.eea.europa.eu/habitats/10268
status: valid
status modified: 2017-12-22
accepted date: 2017-12-22
in scheme: Codelist of habitat types

Moesian silver lime woods
type: Concept
notation: 91Z0
definition: http://eunis.eea.europa.eu/habitats/10269
status: valid
status modified: 2017-12-22
accepted date: 2017-12-22
in scheme: Codelist of habitat types

Apennine beech forests with Taxus and Ilex
type: Concept
notation: 9210
definition: http://eunis.eea.europa.eu/habitats/10205
status: valid
status modified: 2017-12-22
accepted date: 2017-12-22
in scheme: Codelist of habitat types

Apennine beech forests with Abies alba and beech forests with Abies nebrodensis
type: Concept
notation: 9220
definition: http://eunis.eea.europa.eu/habitats/10206
status: valid
status modified: 2017-12-22
accepted date: 2017-12-22
in scheme: Codelist of habitat types

Galicio-Portuguese oak woods with Quercus robur and Quercus pyrenaica
type: Concept
notation: 9230
definition: http://eunis.eea.europa.eu/habitats/10207
status: valid
status modified: 2017-12-22
accepted date: 2017-12-22
in scheme: Codelist of habitat types

Quercus faginea and Quercus canariensis Iberian woods
type: Concept
notation: 9240
definition: http://eunis.eea.europa.eu/habitats/10208
status: valid
status modified: 2017-12-22
accepted date: 2017-12-22
in scheme: Codelist of habitat types

Quercus trojana woods
type: Concept
notation: 9250
definition: http://eunis.eea.europa.eu/habitats/10209
status: valid
status modified: 2017-12-22
accepted date: 2017-12-22
in scheme: Codelist of habitat types

Castanea sativa woods
type: Concept
notation: 9260
definition: http://eunis.eea.europa.eu/habitats/10210
status: valid
status modified: 2017-12-22
accepted date: 2017-12-22
in scheme: Codelist of habitat types

Hellenic beech forests with Abies borisii-regis
type: Concept
notation: 9270
definition: http://eunis.eea.europa.eu/habitats/10211
status: valid
status modified: 2017-12-22
accepted date: 2017-12-22
in scheme: Codelist of habitat types

Quercus frainetto woods
type: Concept
notation: 9280
definition: http://eunis.eea.europa.eu/habitats/10212
status: valid
status modified: 2017-12-22
accepted date: 2017-12-22
in scheme: Codelist of habitat types

Cupressus forests (Acero-Cupression)
type: Concept
notation: 9290
definition: http://eunis.eea.europa.eu/habitats/10213
status: valid
status modified: 2017-12-22
accepted date: 2017-12-22
in scheme: Codelist of habitat types

Salix alba and Populus alba galleries
type: Concept
notation: 92A0
definition: http://eunis.eea.europa.eu/habitats/10214
status: valid
status modified: 2017-12-22
accepted date: 2017-12-22
in scheme: Codelist of habitat types

Riparian formations on intermittent Mediterranean water courses with Rhododendron ponticum, Salix and others
type: Concept
notation: 92B0
definition: http://eunis.eea.europa.eu/habitats/10215
status: valid
status modified: 2017-12-22
accepted date: 2017-12-22
in scheme: Codelist of habitat types

Platanus orientalis and Liquidambar orientalis woods (Platanion orientalis)
type: Concept
notation: 92C0
definition: http://eunis.eea.europa.eu/habitats/10216
status: valid
status modified: 2017-12-22
accepted date: 2017-12-22
in scheme: Codelist of habitat types

Southern riparian galleries and thickets (Nerio-Tamaricetea and Securinegion tinctoriae)
type: Concept
notation: 92D0
definition: http://eunis.eea.europa.eu/habitats/10217
status: valid
status modified: 2017-12-22
accepted date: 2017-12-22
in scheme: Codelist of habitat types

Aegean Quercus brachyphylla woods
type: Concept
notation: 9310
definition: http://eunis.eea.europa.eu/habitats/10219
status: valid
status modified: 2017-12-22
accepted date: 2017-12-22
in scheme: Codelist of habitat types

Olea and Ceratonia forests
type: Concept
notation: 9320
definition: http://eunis.eea.europa.eu/habitats/10220
status: valid
status modified: 2017-12-22
accepted date: 2017-12-22
in scheme: Codelist of habitat types

Quercus suber forests
type: Concept
notation: 9330
definition: http://eunis.eea.europa.eu/habitats/10221
status: valid
status modified: 2017-12-22
accepted date: 2017-12-22
in scheme: Codelist of habitat types

Quercus ilex and Quercus rotundifolia forests
type: Concept
notation: 9340
definition: http://eunis.eea.europa.eu/habitats/10222
status: valid
status modified: 2017-12-22
accepted date: 2017-12-22
in scheme: Codelist of habitat types

Quercus macrolepis forests
type: Concept
notation: 9350
definition: http://eunis.eea.europa.eu/habitats/10223
status: valid
status modified: 2017-12-22
accepted date: 2017-12-22
in scheme: Codelist of habitat types

Macaronesian laurel forests (Laurus, Ocotea)
type: Concept
notation: 9360
definition: http://eunis.eea.europa.eu/habitats/10224
status: valid
status modified: 2017-12-22
accepted date: 2017-12-22
in scheme: Codelist of habitat types

Palm groves of Phoenix
type: Concept
notation: 9370
definition: http://eunis.eea.europa.eu/habitats/10225
status: valid
status modified: 2017-12-22
accepted date: 2017-12-22
in scheme: Codelist of habitat types

Forests of Ilex aquifolium
type: Concept
notation: 9380
definition: http://eunis.eea.europa.eu/habitats/10226
status: valid
status modified: 2017-12-22
accepted date: 2017-12-22
in scheme: Codelist of habitat types

Scrub and low forest vegetation with Quercus alnifolia
type: Concept
notation: 9390
definition: http://eunis.eea.europa.eu/habitats/10257
status: valid
status modified: 2017-12-22
accepted date: 2017-12-22
in scheme: Codelist of habitat types

Woodlands with Quercus infectoria (Anagyro foetidae-Quercetum infectoriae)
type: Concept
notation: 93A0
definition: http://eunis.eea.europa.eu/habitats/10258
status: valid
status modified: 2017-12-22
accepted date: 2017-12-22
in scheme: Codelist of habitat types

Acidophilous Picea forests of the montane to alpine levels (Vaccinio-Piceetea)
type: Concept
notation: 9410
definition: http://eunis.eea.europa.eu/habitats/10228
status: valid
status modified: 2017-12-22
accepted date: 2017-12-22
in scheme: Codelist of habitat types

Alpine Larix decidua and/or Pinus cembra forests
type: Concept
notation: 9420
definition: http://eunis.eea.europa.eu/habitats/10229
status: valid
status modified: 2017-12-22
accepted date: 2017-12-22
in scheme: Codelist of habitat types

Subalpine and montane Pinus uncinata forests (* if on gypsum or limestone)
type: Concept
notation: 9430
definition: http://eunis.eea.europa.eu/habitats/10230
status: valid
status modified: 2017-12-22
accepted date: 2017-12-22
in scheme: Codelist of habitat types

Southern Apennine Abies alba forests
type: Concept
notation: 9510
definition: http://eunis.eea.europa.eu/habitats/10232
status: valid
status modified: 2017-12-22
accepted date: 2017-12-22
in scheme: Codelist of habitat types

Abies pinsapo forests
type: Concept
notation: 9520
definition: http://eunis.eea.europa.eu/habitats/10233
status: valid
status modified: 2017-12-22
accepted date: 2017-12-22
in scheme: Codelist of habitat types

(Sub-) Mediterranean pine forests with endemic black pines
type: Concept
notation: 9530
definition: http://eunis.eea.europa.eu/habitats/10234
status: valid
status modified: 2017-12-22
accepted date: 2017-12-22
in scheme: Codelist of habitat types

Mediterranean pine forests with endemic Mesogean pines
type: Concept
notation: 9540
definition: http://eunis.eea.europa.eu/habitats/10235
status: valid
status modified: 2017-12-22
accepted date: 2017-12-22
in scheme: Codelist of habitat types

Canarian endemic pine forests
type: Concept
notation: 9550
definition: http://eunis.eea.europa.eu/habitats/10236
status: valid
status modified: 2017-12-22
accepted date: 2017-12-22
in scheme: Codelist of habitat types

Endemic forests with Juniperus spp.
type: Concept
notation: 9560
definition: http://eunis.eea.europa.eu/habitats/10237
status: valid
status modified: 2017-12-22
accepted date: 2017-12-22
in scheme: Codelist of habitat types

Tetraclinis articulata forests
type: Concept
notation: 9570
definition: http://eunis.eea.europa.eu/habitats/10238
status: valid
status modified: 2017-12-22
accepted date: 2017-12-22
in scheme: Codelist of habitat types

Mediterranean Taxus baccata woods
type: Concept
notation: 9580
definition: http://eunis.eea.europa.eu/habitats/10239
status: valid
status modified: 2017-12-22
accepted date: 2017-12-22
in scheme: Codelist of habitat types

Cedrus brevifolia forests (Cedrosetum brevifoliae)
type: Concept
notation: 9590
definition: http://eunis.eea.europa.eu/habitats/10259
status: valid
status modified: 2017-12-22
accepted date: 2017-12-22
in scheme: Codelist of habitat types

High oro-Mediterranean pine forests
type: Concept
notation: 95A0
definition: http://eunis.eea.europa.eu/habitats/10260
status: valid
status modified: 2017-12-22
accepted date: 2017-12-22
in scheme: Codelist of habitat types

All habitats
type: Concept
notation: HabAll
status: valid
status modified: 2017-12-22
accepted date: 2017-12-22
in scheme: Codelist of habitat types

Abyssal
type: Concept
notation: HabBenAbyssal
status: valid
status modified: 2017-12-22
accepted date: 2017-12-22
in scheme: Codelist of habitat types

All benthic habitats
type: Concept
notation: HabBenAll
status: valid
status modified: 2017-12-22
accepted date: 2017-12-22
in scheme: Codelist of habitat types

Lower bathyal rock and biogenic reef
type: Concept
notation: HabBenBathyalLowRock
status: valid
status modified: 2017-12-22
accepted date: 2017-12-22
in scheme: Codelist of habitat types

Lower bathyal sediment
type: Concept
notation: HabBenBathyalLowSed
status: valid
status modified: 2017-12-22
accepted date: 2017-12-22
in scheme: Codelist of habitat types

Upper bathyal rock and biogenic reef
type: Concept
notation: HabBenBathyalUpReef
status: valid
status modified: 2017-12-22
accepted date: 2017-12-22
in scheme: Codelist of habitat types

Upper bathyal sediment
type: Concept
notation: HabBenBathyalUpSed
status: valid
status modified: 2017-12-22
accepted date: 2017-12-22
in scheme: Codelist of habitat types

Circalittoral coarse sediment
type: Concept
notation: HabBenCircalitCoarSed
status: valid
status modified: 2017-12-22
accepted date: 2017-12-22
in scheme: Codelist of habitat types

Circalittoral mud
type: Concept
notation: HabBenCircalitMud
status: valid
status modified: 2017-12-22
accepted date: 2017-12-22
in scheme: Codelist of habitat types

Circalittoral mixed sediment
type: Concept
notation: HabBenCircalitMxdSed
status: valid
status modified: 2017-12-22
accepted date: 2017-12-22
in scheme: Codelist of habitat types

Circalittoral rock and biogenic reef
type: Concept
notation: HabBenCircalitRock
status: valid
status modified: 2017-12-22
accepted date: 2017-12-22
in scheme: Codelist of habitat types

Circalittoral sand
type: Concept
notation: HabBenCircalitSand
status: valid
status modified: 2017-12-22
accepted date: 2017-12-22
in scheme: Codelist of habitat types

Infralittoral coarse sediment
type: Concept
notation: HabBenInfralitCoarSed
status: valid
status modified: 2017-12-22
accepted date: 2017-12-22
in scheme: Codelist of habitat types

Infralittoral mud
type: Concept
notation: HabBenInfralitMud
status: valid
status modified: 2017-12-22
accepted date: 2017-12-22
in scheme: Codelist of habitat types

Infralittoral mixed sediment
type: Concept
notation: HabBenInfralitMxdSed
status: valid
status modified: 2017-12-22
accepted date: 2017-12-22
in scheme: Codelist of habitat types

Infralittoral rock and biogenic reef
type: Concept
notation: HabBenInfralitRock
status: valid
status modified: 2017-12-22
accepted date: 2017-12-22
in scheme: Codelist of habitat types

Infralittoral sand
type: Concept
notation: HabBenInfralitSand
status: valid
status modified: 2017-12-22
accepted date: 2017-12-22
in scheme: Codelist of habitat types

Littoral rock and biogenic reef
type: Concept
notation: HabBenLitRock
status: valid
status modified: 2017-12-22
accepted date: 2017-12-22
in scheme: Codelist of habitat types

Littoral sediment
type: Concept
notation: HabBenLitSed
status: valid
status modified: 2017-12-22
accepted date: 2017-12-22
in scheme: Codelist of habitat types

Offshore circalittoral coarse sediment
type: Concept
notation: HabBenOffshCoarSed
status: valid
status modified: 2017-12-22
accepted date: 2017-12-22
in scheme: Codelist of habitat types

Offshore circalittoral mud
type: Concept
notation: HabBenOffshMud
status: valid
status modified: 2017-12-22
accepted date: 2017-12-22
in scheme: Codelist of habitat types

Offshore circalittoral mixed sediment
type: Concept
notation: HabBenOffshMxdSed
status: valid
status modified: 2017-12-22
accepted date: 2017-12-22
in scheme: Codelist of habitat types

Offshore circalittoral rock and biogenic reef
type: Concept
notation: HabBenOffshRock
status: valid
status modified: 2017-12-22
accepted date: 2017-12-22
in scheme: Codelist of habitat types

Offshore circalittoral sand
type: Concept
notation: HabBenOffshSand
status: valid
status modified: 2017-12-22
accepted date: 2017-12-22
in scheme: Codelist of habitat types

Other benthic habitats
type: Concept
notation: HabBenOther
status: valid
status modified: 2017-12-22
accepted date: 2017-12-22
in scheme: Codelist of habitat types

Other habitats
type: Concept
notation: HabOther
status: valid
status modified: 2017-12-22
accepted date: 2017-12-22
in scheme: Codelist of habitat types

All pelagic habitats
type: Concept
notation: HabPelagAll
status: valid
status modified: 2017-12-22
accepted date: 2017-12-22
in scheme: Codelist of habitat types

Coastal
type: Concept
notation: HabPelagCoastal
status: valid
status modified: 2017-12-22
accepted date: 2017-12-22
in scheme: Codelist of habitat types

Oceanic/beyond shelf
type: Concept
notation: HabPelagOcean
status: valid
status modified: 2017-12-22
accepted date: 2017-12-22
in scheme: Codelist of habitat types

Other pelagic habitats
type: Concept
notation: HabPelagOther
status: valid
status modified: 2017-12-22
accepted date: 2017-12-22
in scheme: Codelist of habitat types

Shelf
type: Concept
notation: HabPelagShelf
status: valid
status modified: 2017-12-22
accepted date: 2017-12-22
in scheme: Codelist of habitat types

Variable salinity
type: Concept
notation: HabPelagVarSalinity
status: valid
status modified: 2017-12-22
accepted date: 2017-12-22
in scheme: Codelist of habitat types