CDR QaQc Habitats Directive Article 17 Reporting
type: ConceptScheme
notation: cdrqaqc
is part of: art17 2018
registration status: Public draft
user modified: demo_user
date modified: 2019-04-02 16:43:39.0
vocabulary type: Common
is numeric concept identifiers: false
is notations equal identifiers: false

Invalid code.
type: Concept
notation: G001
definition: Please check the vocabulary countries.
status: valid
status modified: 2019-03-20
accepted date: 2019-03-20
in scheme: CDR QaQc Habitats Directive Article 17 Reporting
error type: BLOCKER

Mandatory information missing.
type: Concept
notation: G002
definition: Information on country code is expected.
status: valid
status modified: 2019-03-20
accepted date: 2019-03-20
in scheme: CDR QaQc Habitats Directive Article 17 Reporting
error type: BLOCKER

Mandatory information missing.
type: Concept
notation: G003
definition: Information on main achievements under the Habitats Directive during the reporting period is expected.
status: valid
status modified: 2019-03-20
accepted date: 2019-03-20
in scheme: CDR QaQc Habitats Directive Article 17 Reporting
error type: ERROR

Mandatory information missing.
type: Concept
notation: G004
definition: Information relating to the Habitats Directive and the Natura 2000 network of the Member State is expected.
status: valid
status modified: 2019-03-20
accepted date: 2019-03-20
in scheme: CDR QaQc Habitats Directive Article 17 Reporting
error type: ERROR

Mandatory information missing.
type: Concept
notation: G005
definition: General information on the network of pSCIs, SCIs and SACs is expected.
status: valid
status modified: 2019-03-20
accepted date: 2019-03-20
in scheme: CDR QaQc Habitats Directive Article 17 Reporting
error type: ERROR

Mandatory information missing.
type: Concept
notation: G006
definition: General information on monitoring is expected.
status: valid
status modified: 2019-03-20
accepted date: 2019-03-20
in scheme: CDR QaQc Habitats Directive Article 17 Reporting
error type: ERROR

Mandatory information missing.
type: Concept
notation: G007
definition: General information on species protection is expected.
status: valid
status modified: 2019-03-20
accepted date: 2019-03-20
in scheme: CDR QaQc Habitats Directive Article 17 Reporting
error type: ERROR

Mandatory information missing.
type: Concept
notation: G008
definition: General information on the implementation of conservation measures within the Natura 2000 sites and their impact on conservation status expected.
status: valid
status modified: 2019-03-20
accepted date: 2019-03-20
in scheme: CDR QaQc Habitats Directive Article 17 Reporting
error type: ERROR

Mandatory information missing.
type: Concept
notation: G009
definition: General information on transposition of the Directive is expected.
status: valid
status modified: 2019-03-20
accepted date: 2019-03-20
in scheme: CDR QaQc Habitats Directive Article 17 Reporting
error type: ERROR

Incorrect data format.
type: Concept
notation: G010
definition: Numeric field, only integers greater than 0 are permitted.
status: valid
status modified: 2019-03-20
accepted date: 2019-03-20
in scheme: CDR QaQc Habitats Directive Article 17 Reporting
error type: ERROR

Incoherent information.
type: Concept
notation: G011
definition: The total number of all SACs cannot be higher than the total number of all sites (pSCIs, SCIs and SACs).
status: valid
status modified: 2019-03-20
accepted date: 2019-03-20
in scheme: CDR QaQc Habitats Directive Article 17 Reporting
error type: ERROR

Incoherent information.
type: Concept
notation: G012
definition: The total number of marine sites (pSCIs, SCIs and SACs) cannot be higher than the total number of all sites (pSCIs, SCIs and SACs).
status: valid
status modified: 2019-03-20
accepted date: 2019-03-20
in scheme: CDR QaQc Habitats Directive Article 17 Reporting
error type: ERROR

Mandatory information missing.
type: Concept
notation: G013
definition: The total number of all sites (pSCIs, SCIs, SACs) should be provided.
status: valid
status modified: 2019-03-20
accepted date: 2019-03-20
in scheme: CDR QaQc Habitats Directive Article 17 Reporting
error type: ERROR

Incorrect data format.
type: Concept
notation: G014
definition: Numeric field, only decimals greater than 0 are permitted.
status: valid
status modified: 2019-03-20
accepted date: 2019-03-20
in scheme: CDR QaQc Habitats Directive Article 17 Reporting
error type: ERROR

Incoherent information.
type: Concept
notation: G015
definition: The surface area of all SACs cannot be higher than the surface area of all sites (pSCIs, SCIs and SACs).
status: valid
status modified: 2019-03-20
accepted date: 2019-03-20
in scheme: CDR QaQc Habitats Directive Article 17 Reporting
error type: ERROR

Incoherent information.
type: Concept
notation: G016
definition: The surface area of terrestrial sites (pSCIs, SCIs and SACs) cannot be higher than the surface area of all sites (pSCIs, SCIs and SACs).
status: valid
status modified: 2019-03-20
accepted date: 2019-03-20
in scheme: CDR QaQc Habitats Directive Article 17 Reporting
error type: ERROR

Incoherent information.
type: Concept
notation: G017
definition: The surface area of marine sites (pSCIs, SCIs and SACs) cannot be higher than the surface area of all sites (pSCIs, SCIs and SACs).
status: valid
status modified: 2019-03-20
accepted date: 2019-03-20
in scheme: CDR QaQc Habitats Directive Article 17 Reporting
error type: ERROR

Incoherent information.
type: Concept
notation: G018
definition: The surface area of terrestrial sites (pSCIs, SCIs and SACs) plus the surface area of marine sites (pSCIs, SCIs and SACs) together should give the surface area of all sites (pSCIs, SCIs and SACs).
status: valid
status modified: 2019-03-20
accepted date: 2019-03-20
in scheme: CDR QaQc Habitats Directive Article 17 Reporting
error type: ERROR

Mandatory information missing.
type: Concept
notation: G019
definition: The surface area of all sites (pSCIs, SCIs, SACs) should be provided.
status: valid
status modified: 2019-03-20
accepted date: 2019-03-20
in scheme: CDR QaQc Habitats Directive Article 17 Reporting
error type: ERROR

Incorrect data format.
type: Concept
notation: G020
definition: Numeric field, only integers greater than 0 are permitted.
status: valid
status modified: 2019-03-20
accepted date: 2019-03-20
in scheme: CDR QaQc Habitats Directive Article 17 Reporting
error type: ERROR

Incoherent information.
type: Concept
notation: G021
definition: The total number of marine SACs cannot be higher than the total number of all SACs.
status: valid
status modified: 2019-03-20
accepted date: 2019-03-20
in scheme: CDR QaQc Habitats Directive Article 17 Reporting
error type: ERROR

Mandatory information missing.
type: Concept
notation: G022
definition: The total number of all SACs should be provided.
status: valid
status modified: 2019-03-20
accepted date: 2019-03-20
in scheme: CDR QaQc Habitats Directive Article 17 Reporting
error type: ERROR

Incorrect data format.
type: Concept
notation: G023
definition: Numeric field, only decimals greater than 0 are permitted.
status: valid
status modified: 2019-03-20
accepted date: 2019-03-20
in scheme: CDR QaQc Habitats Directive Article 17 Reporting
error type: ERROR

Incoherent information.
type: Concept
notation: G024
definition: The surface area of terrestrial SACs cannot be higher than the surface area of all SACs.
status: valid
status modified: 2019-03-20
accepted date: 2019-03-20
in scheme: CDR QaQc Habitats Directive Article 17 Reporting
error type: ERROR

Incoherent information.
type: Concept
notation: G025
definition: The surface area of marine SACs cannot be higher than the surface area of all SACs.
status: valid
status modified: 2019-03-20
accepted date: 2019-03-20
in scheme: CDR QaQc Habitats Directive Article 17 Reporting
error type: ERROR

Incoherent information.
type: Concept
notation: G026
definition: The surface area of terrestrial SACs plus the surface area of marine SACs together should give the surface area of all SACs.
status: valid
status modified: 2019-03-20
accepted date: 2019-03-20
in scheme: CDR QaQc Habitats Directive Article 17 Reporting
error type: WARNING

Mandatory information missing.
type: Concept
notation: G027
definition: The surface area of all SACs should be provided.
status: valid
status modified: 2019-03-20
accepted date: 2019-03-20
in scheme: CDR QaQc Habitats Directive Article 17 Reporting
error type: ERROR

Incorrect data format.
type: Concept
notation: G028
definition: Numeric field, only decimals greater than 0 are permitted.
status: valid
status modified: 2019-03-20
accepted date: 2019-03-20
in scheme: CDR QaQc Habitats Directive Article 17 Reporting
error type: ERROR

Incoherent information.
type: Concept
notation: G029
definition: The surface area of terrestrial SACs cannot be higher than the surface area of terrestrial sites (pSCIs, SCIs and SACs).
status: valid
status modified: 2019-03-20
accepted date: 2019-03-20
in scheme: CDR QaQc Habitats Directive Article 17 Reporting
error type: ERROR

Mandatory information missing.
type: Concept
notation: G030
definition: The surface area of terrestrial sites (pSCIs, SCIs, SACs) should be provided.
status: valid
status modified: 2019-03-20
accepted date: 2019-03-20
in scheme: CDR QaQc Habitats Directive Article 17 Reporting
error type: ERROR

Incorrect data format.
type: Concept
notation: G031
definition: Numeric field, only decimals greater than 0 are permitted.
status: valid
status modified: 2019-03-20
accepted date: 2019-03-20
in scheme: CDR QaQc Habitats Directive Article 17 Reporting
error type: ERROR

Mandatory information missing.
type: Concept
notation: G032
definition: The surface area of terrestrial SACs should be provided.
status: valid
status modified: 2019-03-20
accepted date: 2019-03-20
in scheme: CDR QaQc Habitats Directive Article 17 Reporting
error type: ERROR

Incorrect data format.
type: Concept
notation: G033
definition: Numeric field, only integers greater than 0 are permitted.
status: valid
status modified: 2019-03-20
accepted date: 2019-03-20
in scheme: CDR QaQc Habitats Directive Article 17 Reporting
error type: ERROR

Incoherent information.
type: Concept
notation: G034
definition: The total number of marine SACs cannot be higher than the total number of marine sites (pSCIs, SCIs and SACs).
status: valid
status modified: 2019-03-20
accepted date: 2019-03-20
in scheme: CDR QaQc Habitats Directive Article 17 Reporting
error type: ERROR

Mandatory information missing.
type: Concept
notation: G035
definition: The total number of marine sites (pSCIs, SCIs and SACs) should be provided.
status: valid
status modified: 2019-03-20
accepted date: 2019-03-20
in scheme: CDR QaQc Habitats Directive Article 17 Reporting
error type: ERROR

Incorrect data format.
type: Concept
notation: G036
definition: Numeric field, only integers greater than 0 are permitted.
status: valid
status modified: 2019-03-20
accepted date: 2019-03-20
in scheme: CDR QaQc Habitats Directive Article 17 Reporting
error type: ERROR

Incoherent information.
type: Concept
notation: G037
definition: The surface area of marine SACs cannot be higher than the surface area of marine sites (pSCIs, SCIs and SACs).
status: valid
status modified: 2019-03-20
accepted date: 2019-03-20
in scheme: CDR QaQc Habitats Directive Article 17 Reporting
error type: ERROR

Mandatory information missing.
type: Concept
notation: G038
definition: The surface area of marine sites (pSCIs, SCIs and SACs) should be provided.
status: valid
status modified: 2019-03-20
accepted date: 2019-03-20
in scheme: CDR QaQc Habitats Directive Article 17 Reporting
error type: ERROR

Incorrect data format.
type: Concept
notation: G039
definition: Numeric field, only integers greater than 0 are permitted.
status: valid
status modified: 2019-03-20
accepted date: 2019-03-20
in scheme: CDR QaQc Habitats Directive Article 17 Reporting
error type: ERROR

Mandatory information missing.
type: Concept
notation: G040
definition: The total number of marine SACs should be provided.
status: valid
status modified: 2019-03-20
accepted date: 2019-03-20
in scheme: CDR QaQc Habitats Directive Article 17 Reporting
error type: ERROR

Incorrect data format.
type: Concept
notation: G041
definition: Numeric field, only integers greater than 0 are permitted.
status: valid
status modified: 2019-03-20
accepted date: 2019-03-20
in scheme: CDR QaQc Habitats Directive Article 17 Reporting
error type: ERROR

Mandatory information missing.
type: Concept
notation: G042
definition: The surface area of marine SACs should be provided.
status: valid
status modified: 2019-03-20
accepted date: 2019-03-20
in scheme: CDR QaQc Habitats Directive Article 17 Reporting
error type: ERROR

Mandatory information missing.
type: Concept
notation: G043
definition: The date of the last database delivered during the reporting period (2013-2018) is expected. Supply this information in the [DD]-MM-YYYY format.
status: valid
status modified: 2019-03-20
accepted date: 2019-03-20
in scheme: CDR QaQc Habitats Directive Article 17 Reporting
error type: ERROR

Incorrect data format.
type: Concept
notation: G044
definition: Numeric field, only integers greater than 0 are permitted.
status: valid
status modified: 2019-03-20
accepted date: 2019-03-20
in scheme: CDR QaQc Habitats Directive Article 17 Reporting
error type: ERROR

Mandatory information missing.
type: Concept
notation: G045
definition: The total number of SACs for which necessary conservation measures have been established should be provided.
status: valid
status modified: 2019-03-20
accepted date: 2019-03-20
in scheme: CDR QaQc Habitats Directive Article 17 Reporting
error type: ERROR

Incorrect data format.
type: Concept
notation: G046
definition: Numeric field, only decimals greater than 0 are permitted.
status: valid
status modified: 2019-03-20
accepted date: 2019-03-20
in scheme: CDR QaQc Habitats Directive Article 17 Reporting
error type: ERROR

Incoherent information.
type: Concept
notation: G047
definition: The proportion of the network area for which necessary conservation measures have been established should be between 0 and 100 %.
status: valid
status modified: 2019-03-20
accepted date: 2019-03-20
in scheme: CDR QaQc Habitats Directive Article 17 Reporting
error type: ERROR

Mandatory information missing.
type: Concept
notation: G048
definition: The proportion of the network area for which necessary conservation measures have been established should be provided.
status: valid
status modified: 2019-03-20
accepted date: 2019-03-20
in scheme: CDR QaQc Habitats Directive Article 17 Reporting
error type: ERROR

Incorrect data format.
type: Concept
notation: G049
definition: Numeric field, only integers greater than 0 are permitted.
status: valid
status modified: 2019-03-20
accepted date: 2019-03-20
in scheme: CDR QaQc Habitats Directive Article 17 Reporting
error type: ERROR

Mandatory information missing.
type: Concept
notation: G050
definition: The total number of SACs for which a comprehensive management plan or a similar instrument is in place should be provided.
status: valid
status modified: 2019-03-20
accepted date: 2019-03-20
in scheme: CDR QaQc Habitats Directive Article 17 Reporting
error type: ERROR

Incorrect data format.
type: Concept
notation: G051
definition: Numeric field, only decimals greater than 0 are permitted.
status: valid
status modified: 2019-03-20
accepted date: 2019-03-20
in scheme: CDR QaQc Habitats Directive Article 17 Reporting
error type: ERROR

Incoherent information.
type: Concept
notation: G052
definition: The proportion of the network area for a comprehensive management plan or a similar instrument is in place should be between 0 and 100 %.
status: valid
status modified: 2019-03-20
accepted date: 2019-03-20
in scheme: CDR QaQc Habitats Directive Article 17 Reporting
error type: ERROR

Mandatory information missing.
type: Concept
notation: G053
definition: The proportion of the network area for which a comprehensive management plan or a similar instrument is in place should be provided.
status: valid
status modified: 2019-03-20
accepted date: 2019-03-20
in scheme: CDR QaQc Habitats Directive Article 17 Reporting
error type: ERROR

Incorrect data format.
type: Concept
notation: G054
definition: The site code should contain 9 characters (letters and numbers).
status: valid
status modified: 2019-03-20
accepted date: 2019-03-20
in scheme: CDR QaQc Habitats Directive Article 17 Reporting
error type: WARNING

Incoherent information.
type: Concept
notation: G055
definition: The site name should be provided in addition to the sitecode.
status: valid
status modified: 2019-03-20
accepted date: 2019-03-20
in scheme: CDR QaQc Habitats Directive Article 17 Reporting
error type: ERROR

Incoherent information.
type: Concept
notation: G056
definition: The title of project/plan should be provided.
status: valid
status modified: 2019-03-20
accepted date: 2019-03-20
in scheme: CDR QaQc Habitats Directive Article 17 Reporting
error type: ERROR

Incoherent information.
type: Concept
notation: G057
definition: The year when Commission was informed about compensatory measures should be provided.
status: valid
status modified: 2019-03-20
accepted date: 2019-03-20
in scheme: CDR QaQc Habitats Directive Article 17 Reporting
error type: ERROR

Incoherent information.
type: Concept
notation: G058
definition: The year when project/plan was started to be implemented should be provided.
status: valid
status modified: 2019-03-20
accepted date: 2019-03-20
in scheme: CDR QaQc Habitats Directive Article 17 Reporting
error type: ERROR

Invalid code.
type: Concept
notation: G059
definition: Code should be 'Yes' or 'No'.
status: valid
status modified: 2019-03-20
accepted date: 2019-03-20
in scheme: CDR QaQc Habitats Directive Article 17 Reporting
error type: BLOCKER

Incoherent information.
type: Concept
notation: G060
definition: Indicate whether a Commission opinion was requested.
status: valid
status modified: 2019-03-20
accepted date: 2019-03-20
in scheme: CDR QaQc Habitats Directive Article 17 Reporting
error type: ERROR

Mandatory information missing.
type: Concept
notation: G061
definition: A general description of the main measures taken is expected.
status: valid
status modified: 2019-03-20
accepted date: 2019-03-20
in scheme: CDR QaQc Habitats Directive Article 17 Reporting
error type: ERROR

Invalid code.
type: Concept
notation: G062
definition: Please check the vocabulary HDspecies.
status: valid
status modified: 2019-03-20
accepted date: 2019-03-20
in scheme: CDR QaQc Habitats Directive Article 17 Reporting
error type: BLOCKER

Incoherent information.
type: Concept
notation: G063
definition: This section is to report on the reintroduction of Annex IV species only.
status: valid
status modified: 2019-03-20
accepted date: 2019-03-20
in scheme: CDR QaQc Habitats Directive Article 17 Reporting
error type: WARNING

Incoherent information.
type: Concept
notation: G064
definition: The combination species code/scientific name should exist in the look up table lu_hd_species.
status: valid
status modified: 2019-03-20
accepted date: 2019-03-20
in scheme: CDR QaQc Habitats Directive Article 17 Reporting
error type: WARNING

Incoherent information.
type: Concept
notation: G065
definition: The scientific name should be provided.
status: valid
status modified: 2019-03-20
accepted date: 2019-03-20
in scheme: CDR QaQc Habitats Directive Article 17 Reporting
error type: ERROR

Incoherent information.
type: Concept
notation: G066
definition: The reintroduction period should be provided.
status: valid
status modified: 2019-03-20
accepted date: 2019-03-20
in scheme: CDR QaQc Habitats Directive Article 17 Reporting
error type: ERROR

Incoherent information.
type: Concept
notation: G067
definition: The name of the reintroduction location and number of individuals reintroduced should be provided.
status: valid
status modified: 2019-03-20
accepted date: 2019-03-20
in scheme: CDR QaQc Habitats Directive Article 17 Reporting
error type: ERROR

Invalid code.
type: Concept
notation: G068
definition: Please check the vocabulary yesNoTooEearly.
status: valid
status modified: 2019-03-20
accepted date: 2019-03-20
in scheme: CDR QaQc Habitats Directive Article 17 Reporting
error type: BLOCKER

Incoherent information.
type: Concept
notation: G069
definition: The question on successful introduction should be answered.
status: valid
status modified: 2019-03-20
accepted date: 2019-03-20
in scheme: CDR QaQc Habitats Directive Article 17 Reporting
error type: ERROR

Incorrect data format.
type: Concept
notation: H001
definition: Numeric field, only decimals greater than 0 is permitted.
status: valid
status modified: 2019-03-20
accepted date: 2019-03-20
in scheme: CDR QaQc Habitats Directive Article 17 Reporting
error type: ERROR

Mandatory information missing.
type: Concept
notation: H002
definition: Surface area should be provided.
status: valid
status modified: 2019-03-20
accepted date: 2019-03-20
in scheme: CDR QaQc Habitats Directive Article 17 Reporting
error type: ERROR

Incorrect data format.
type: Concept
notation: H003
definition: Incorrect data format, it must be YYYY-YYYY.
status: valid
status modified: 2019-03-20
accepted date: 2019-03-20
in scheme: CDR QaQc Habitats Directive Article 17 Reporting
error type: ERROR

Incoherent information.
type: Concept
notation: H004
definition: Incoherent information provided. Year1 should be greater or equal year2.
status: valid
status modified: 2019-03-20
accepted date: 2019-03-20
in scheme: CDR QaQc Habitats Directive Article 17 Reporting
error type: ERROR

Mandatory information missing.
type: Concept
notation: H005
definition: Period should be provided.
status: valid
status modified: 2019-03-20
accepted date: 2019-03-20
in scheme: CDR QaQc Habitats Directive Article 17 Reporting
error type: ERROR

Invalid code.
type: Concept
notation: H006
definition: Please check the vocabulary trends.
status: valid
status modified: 2019-03-20
accepted date: 2019-03-20
in scheme: CDR QaQc Habitats Directive Article 17 Reporting
error type: BLOCKER

Mandatory information missing.
type: Concept
notation: H008
definition: Trend should be provided. In case the information to be reported in this section is not available use 'Unk - unknown'.
status: valid
status modified: 2019-03-20
accepted date: 2019-03-20
in scheme: CDR QaQc Habitats Directive Article 17 Reporting
error type: ERROR

Incorrect data format.
type: Concept
notation: H009
definition: Numeric field, only decimals greater or equal 0 are permitted.
status: valid
status modified: 2019-03-20
accepted date: 2019-03-20
in scheme: CDR QaQc Habitats Directive Article 17 Reporting
error type: ERROR

Incorrect data format.
type: Concept
notation: H010
definition: Numeric field, only decimals greater or equal 0 are permitted.
status: valid
status modified: 2019-03-20
accepted date: 2019-03-20
in scheme: CDR QaQc Habitats Directive Article 17 Reporting
error type: ERROR

4.4b Short-term trend Magnitude - max should be greater or equal min.
type: Concept
notation: H011
status: valid
status modified: 2019-03-20
accepted date: 2019-03-20
in scheme: CDR QaQc Habitats Directive Article 17 Reporting
error type: ERROR

Invalid code.
type: Concept
notation: H012
definition: Please check the vocabulary methodsUsed.
status: valid
status modified: 2019-03-20
accepted date: 2019-03-20
in scheme: CDR QaQc Habitats Directive Article 17 Reporting
error type: BLOCKER

Incoherent information.
type: Concept
notation: H013
definition: Inconsistent values provided in fields 4.3 Short-term trend Direction and 4.5 Short-term trend Method used. When the method is 'AbsentData - Insufficient or no data available', the trend cannot be defined. If you want to report a trend as stable, increasing or decreasing based on a method using limited data, please select 'estimateExpert - Based mainly on expert opinion with very limited data' for the method used.
status: valid
status modified: 2019-03-20
accepted date: 2019-03-20
in scheme: CDR QaQc Habitats Directive Article 17 Reporting
error type: WARNING

Mandatory information missing.
type: Concept
notation: H014
definition: The method should be provided. In case the information to be reported in this section is not available use 'AbsentData - Insufficient or no data available'.
status: valid
status modified: 2019-03-20
accepted date: 2019-03-20
in scheme: CDR QaQc Habitats Directive Article 17 Reporting
error type: ERROR

Incorrect data format.
type: Concept
notation: H015
definition: Incorrect data format, it must be YYYY-YYYY.
status: valid
status modified: 2019-03-20
accepted date: 2019-03-20
in scheme: CDR QaQc Habitats Directive Article 17 Reporting
error type: ERROR

Incoherent information.
type: Concept
notation: H016
definition: Incoherent information provided. Year1 should be greater or equal year2.
status: valid
status modified: 2019-03-20
accepted date: 2019-03-20
in scheme: CDR QaQc Habitats Directive Article 17 Reporting
error type: ERROR

Invalid code.
type: Concept
notation: H017
definition: Please check the vocabulary trends.
status: valid
status modified: 2019-03-20
accepted date: 2019-03-20
in scheme: CDR QaQc Habitats Directive Article 17 Reporting
error type: BLOCKER

Incorrect data format.
type: Concept
notation: H019
definition: Numeric field, only decimals greater or equal 0 are permitted.
status: valid
status modified: 2019-03-20
accepted date: 2019-03-20
in scheme: CDR QaQc Habitats Directive Article 17 Reporting
error type: ERROR

Incorrect data format.
type: Concept
notation: H020
definition: Numeric field, only decimals greater or equal 0 are permitted.
status: valid
status modified: 2019-03-20
accepted date: 2019-03-20
in scheme: CDR QaQc Habitats Directive Article 17 Reporting
error type: ERROR

4.8b Long-term trend Magnitude - max should be greater or equal min.
type: Concept
notation: H021
status: valid
status modified: 2019-03-20
accepted date: 2019-03-20
in scheme: CDR QaQc Habitats Directive Article 17 Reporting
error type: ERROR

Invalid code.
type: Concept
notation: H022
definition: Please check the vocabulary methodsUsed.
status: valid
status modified: 2019-03-20
accepted date: 2019-03-20
in scheme: CDR QaQc Habitats Directive Article 17 Reporting
error type: BLOCKER

Incorrect data format.
type: Concept
notation: H024
definition: Numeric field, only decimals greater than 0 permitted.
status: valid
status modified: 2019-03-20
accepted date: 2019-03-20
in scheme: CDR QaQc Habitats Directive Article 17 Reporting
error type: ERROR

Only one of 4.10a, b or c Favourable reference range should be filled in.
type: Concept
notation: H025
definition: If an operator is used, there is no need to insert a value. If the value is provided for range in km2, no operator should be used. Moreover, the use of 'x - unknown' is not compatible with the use of value or operators.
status: valid
status modified: 2019-03-20
accepted date: 2019-03-20
in scheme: CDR QaQc Habitats Directive Article 17 Reporting
error type: ERROR

Incoherent information.
type: Concept
notation: H026
definition: Incoherent information provided. The Favourable reference range is smaller than 4.1 Surface area. Check whether this is on purpose.
status: valid
status modified: 2019-03-20
accepted date: 2019-03-20
in scheme: CDR QaQc Habitats Directive Article 17 Reporting
error type: WARNING

Mandatory information missing.
type: Concept
notation: H027
definition: Information on Favourable reference range should be provided (4.10a, b or c). In case the information to be reported in this section is not available use 'x - unknown' in 4.10c, knowing the use of operators should help to reduce the use of 'unknown' to a minimum.
status: valid
status modified: 2019-03-20
accepted date: 2019-03-20
in scheme: CDR QaQc Habitats Directive Article 17 Reporting
error type: ERROR

Invalid code.
type: Concept
notation: H028
definition: Please check the vocabulary favourableOperator.
status: valid
status modified: 2019-03-20
accepted date: 2019-03-20
in scheme: CDR QaQc Habitats Directive Article 17 Reporting
error type: ERROR

Invalid code.
type: Concept
notation: H031
definition: Only 'x - unknown' is allowed in this section.
status: valid
status modified: 2019-03-20
accepted date: 2019-03-20
in scheme: CDR QaQc Habitats Directive Article 17 Reporting
error type: BLOCKER

Invalid code.
type: Concept
notation: H034
definition: Please check the vocabulary reasonChange.
status: valid
status modified: 2019-03-20
accepted date: 2019-03-20
in scheme: CDR QaQc Habitats Directive Article 17 Reporting
error type: BLOCKER

Incoherent information.
type: Concept
notation: H035
definition: If 'noChange' is selected, there is no need to explain the nature of change.
status: valid
status modified: 2019-03-20
accepted date: 2019-03-20
in scheme: CDR QaQc Habitats Directive Article 17 Reporting
error type: ERROR

Incoherent information.
type: Concept
notation: H036
definition: Only one main reason is expected and should be part of the reported reasons.
status: valid
status modified: 2019-03-20
accepted date: 2019-03-20
in scheme: CDR QaQc Habitats Directive Article 17 Reporting
error type: ERROR

Mandatory information missing.
type: Concept
notation: H037
definition: Indicate if there is any change since the previous reporting period (2007-2012) in the range surface area reported. Report 'noChange' if the answer to the question: 'Is there a change between reporting periods?' is 'No'. Provide the nature of that change (more than one option can be chosen) if the answer is 'Yes'.
status: valid
status modified: 2019-03-20
accepted date: 2019-03-20
in scheme: CDR QaQc Habitats Directive Article 17 Reporting
error type: ERROR

Incorrect data format.
type: Concept
notation: H038
definition: Incorrect data format, it must be YYYY or YYYY-YYYY.
status: valid
status modified: 2019-03-20
accepted date: 2019-03-20
in scheme: CDR QaQc Habitats Directive Article 17 Reporting
error type: ERROR

Incoherent information.
type: Concept
notation: H039
definition: Incoherent information provided. Year1 should be greater or equal year2.
status: valid
status modified: 2019-03-20
accepted date: 2019-03-20
in scheme: CDR QaQc Habitats Directive Article 17 Reporting
error type: ERROR

Mandatory information missing.
type: Concept
notation: H040
definition: The year or period should be provided.
status: valid
status modified: 2019-03-20
accepted date: 2019-03-20
in scheme: CDR QaQc Habitats Directive Article 17 Reporting
error type: ERROR

Incorrect data format.
type: Concept
notation: H041
definition: Numeric field, only decimals greater or equal 0 are permitted.
status: valid
status modified: 2019-03-20
accepted date: 2019-03-20
in scheme: CDR QaQc Habitats Directive Article 17 Reporting
error type: ERROR

Incorrect data format.
type: Concept
notation: H042
definition: Numeric field, only decimals greater than 0 are permitted.
status: valid
status modified: 2019-03-20
accepted date: 2019-03-20
in scheme: CDR QaQc Habitats Directive Article 17 Reporting
error type: ERROR

5.2b Surface area covered by the habitat - max should be greater or equal min.
type: Concept
notation: H043
status: valid
status modified: 2019-03-20
accepted date: 2019-03-20
in scheme: CDR QaQc Habitats Directive Article 17 Reporting
error type: ERROR

Incorrect data format.
type: Concept
notation: H044
definition: Numeric field, only decimals greater than 0 are permitted.
status: valid
status modified: 2019-03-20
accepted date: 2019-03-20
in scheme: CDR QaQc Habitats Directive Article 17 Reporting
error type: ERROR

Mandatory information missing.
type: Concept
notation: H045
definition: Surface area covered by the habitat should be provided as interval (5.2a, b) and/or single value (5.2c). When only a minimum (or maximum) value of the surface area covered by the habitat is known (e.g. through expert opinion) this should be entered in the 'Best single value' field and NOT the '(a) Minimum' or '(b) Maximum' fields.
status: valid
status modified: 2019-03-20
accepted date: 2019-03-20
in scheme: CDR QaQc Habitats Directive Article 17 Reporting
error type: ERROR

Invalid code.
type: Concept
notation: H046
definition: Please check the vocabulary typeEstimate. The value 'mean - multi-year mean' is not allowed in this section.
status: valid
status modified: 2019-03-20
accepted date: 2019-03-20
in scheme: CDR QaQc Habitats Directive Article 17 Reporting
error type: BLOCKER

Incoherent information.
type: Concept
notation: H047
definition: Type of estimate was provided although there is no entry for surface area covered by the habitat (5.2a,b,c). Check coherence between these two fields. If both interval (5.2a 'Minimum' and 5.2b 'Maximum') and a single value (5.2c 'Best single value') are provided, field 5.3 'Type of estimate' should correspond to the more accurate estimate. This should be noted in 5.15 'Additional information'
status: valid
status modified: 2019-03-20
accepted date: 2019-03-20
in scheme: CDR QaQc Habitats Directive Article 17 Reporting
error type: WARNING

Mandatory information missing.
type: Concept
notation: H048
definition: The type of estimate for the surface area covered by the habitat should be provided.
status: valid
status modified: 2019-03-20
accepted date: 2019-03-20
in scheme: CDR QaQc Habitats Directive Article 17 Reporting
error type: ERROR

Invalid code.
type: Concept
notation: H049
definition: Please check the vocabulary methodsUsed.
status: valid
status modified: 2019-03-20
accepted date: 2019-03-20
in scheme: CDR QaQc Habitats Directive Article 17 Reporting
error type: BLOCKER

Incoherent information.
type: Concept
notation: H050
definition: Incoherent information provided. 5.3 Type of estimate should be empty when Surface area Method used is 'AbsentData - Insufficient or no data available'. When the method is assessed as 'AbsentData - Insufficient or no data available', the type of estimate used for the surface area covered by the habitat cannot be defined. If you want to report an estimate based on a method using limited data, please select 'estimateExpert - Based mainly on expert opinion with very limited data' for the method used.
status: valid
status modified: 2019-03-20
accepted date: 2019-03-20
in scheme: CDR QaQc Habitats Directive Article 17 Reporting
error type: WARNING

Mandatory information missing.
type: Concept
notation: H051
definition: The method should be provided. In case the information to be reported in this section is not available use 'AbsentData - Insufficient or no data available'.
status: valid
status modified: 2019-03-20
accepted date: 2019-03-20
in scheme: CDR QaQc Habitats Directive Article 17 Reporting
error type: ERROR

Incorrect data format.
type: Concept
notation: H052
definition: Incorrect data format, it must be YYYY-YYYY.
status: valid
status modified: 2019-03-20
accepted date: 2019-03-20
in scheme: CDR QaQc Habitats Directive Article 17 Reporting
error type: ERROR

Incoherent information.
type: Concept
notation: H053
definition: Incoherent information provided. Year1 should be greater or equal year2.
status: valid
status modified: 2019-03-20
accepted date: 2019-03-20
in scheme: CDR QaQc Habitats Directive Article 17 Reporting
error type: ERROR

Mandatory information missing.
type: Concept
notation: H054
definition: The period should be provided.
status: valid
status modified: 2019-03-20
accepted date: 2019-03-20
in scheme: CDR QaQc Habitats Directive Article 17 Reporting
error type: ERROR

Invalid code.
type: Concept
notation: H055
definition: Please check the vocabulary trends.
status: valid
status modified: 2019-03-20
accepted date: 2019-03-20
in scheme: CDR QaQc Habitats Directive Article 17 Reporting
error type: BLOCKER

Mandatory information missing.
type: Concept
notation: H057
definition: Trend should be provided. In case the information to be reported in this section is not available use 'Unk - unknown'.
status: valid
status modified: 2019-03-20
accepted date: 2019-03-20
in scheme: CDR QaQc Habitats Directive Article 17 Reporting
error type: ERROR

Incorrect data format.
type: Concept
notation: H058
definition: Numeric field, only decimals greater or equal 0 are permitted.
status: valid
status modified: 2019-03-20
accepted date: 2019-03-20
in scheme: CDR QaQc Habitats Directive Article 17 Reporting
error type: ERROR

Incorrect data format.
type: Concept
notation: H059
definition: Numeric field, only decimals greater or equal 0 are permitted.
status: valid
status modified: 2019-03-20
accepted date: 2019-03-20
in scheme: CDR QaQc Habitats Directive Article 17 Reporting
error type: ERROR

5.7b Short-term trend Magnitude - max should be greater or equal min.
type: Concept
notation: H060
status: valid
status modified: 2019-03-20
accepted date: 2019-03-20
in scheme: CDR QaQc Habitats Directive Article 17 Reporting
error type: ERROR

Incorrect data format.
type: Concept
notation: H061
definition: Numeric field, only decimals greater or equal 0 are permitted.
status: valid
status modified: 2019-03-20
accepted date: 2019-03-20
in scheme: CDR QaQc Habitats Directive Article 17 Reporting
error type: ERROR

Invalid code.
type: Concept
notation: H062
definition: Please check the vocabulary methodsUsed.
status: valid
status modified: 2019-03-20
accepted date: 2019-03-20
in scheme: CDR QaQc Habitats Directive Article 17 Reporting
error type: BLOCKER

Incoherent information.
type: Concept
notation: H063
definition: Inconsistent values provided in fields 5.6 Short-term trend Direction and 5.8 Short-term trend Method used. When the method is assessed as 'AbsentData - Insufficient or no data available', the trend cannot be defined. If you want to report a trend as stable, increasing or decreasing based on a method using limited data, please select 'estimateExpert - Based mainly on expert opinion with very limited data' for the method used.
status: valid
status modified: 2019-03-20
accepted date: 2019-03-20
in scheme: CDR QaQc Habitats Directive Article 17 Reporting
error type: WARNING

Mandatory information missing.
type: Concept
notation: H064
definition: The method should be provided. In case the information to be reported in this section is not available use 'AbsentData - Insufficient or no data available'.
status: valid
status modified: 2019-03-20
accepted date: 2019-03-20
in scheme: CDR QaQc Habitats Directive Article 17 Reporting
error type: ERROR

Incorrect data format.
type: Concept
notation: H065
definition: Incorrect data format, it must be YYYY-YYYY.
status: valid
status modified: 2019-03-20
accepted date: 2019-03-20
in scheme: CDR QaQc Habitats Directive Article 17 Reporting
error type: ERROR

Incoherent information.
type: Concept
notation: H066
definition: Incoherent information provided. Year1 should be greater or equal year2.
status: valid
status modified: 2019-03-20
accepted date: 2019-03-20
in scheme: CDR QaQc Habitats Directive Article 17 Reporting
error type: ERROR

Invalid code.
type: Concept
notation: H067
definition: Please check the vocabulary trends.
status: valid
status modified: 2019-03-20
accepted date: 2019-03-20
in scheme: CDR QaQc Habitats Directive Article 17 Reporting
error type: BLOCKER

Incorrect data format.
type: Concept
notation: H069
definition: Numeric field, only decimals greater or equal 0 are permitted.
status: valid
status modified: 2019-03-20
accepted date: 2019-03-20
in scheme: CDR QaQc Habitats Directive Article 17 Reporting
error type: ERROR

Incorrect data format.
type: Concept
notation: H070
definition: Numeric field, only decimals greater or equal 0 are permitted.
status: valid
status modified: 2019-03-20
accepted date: 2019-03-20
in scheme: CDR QaQc Habitats Directive Article 17 Reporting
error type: ERROR

5.11b Long-term trend Magnitude - max should be greater or equal min.
type: Concept
notation: H071
status: valid
status modified: 2019-03-20
accepted date: 2019-03-20
in scheme: CDR QaQc Habitats Directive Article 17 Reporting
error type: ERROR

Incorrect data format.
type: Concept
notation: H072
definition: Numeric field, only decimals greater or equal 0 are permitted.
status: valid
status modified: 2019-03-20
accepted date: 2019-03-20
in scheme: CDR QaQc Habitats Directive Article 17 Reporting
error type: ERROR

Invalid code.
type: Concept
notation: H073
definition: Please check the vocabulary methodsUsed.
status: valid
status modified: 2019-03-20
accepted date: 2019-03-20
in scheme: CDR QaQc Habitats Directive Article 17 Reporting
error type: BLOCKER

Incorrect data format.
type: Concept
notation: H075
definition: Numeric field, only decimals greater than 0 is permitted.
status: valid
status modified: 2019-03-20
accepted date: 2019-03-20
in scheme: CDR QaQc Habitats Directive Article 17 Reporting
error type: ERROR

Only one of 5.13a, b or c Favourable reference area should be filled in.
type: Concept
notation: H076
definition: If an operator is used, there is no need to insert a value. If the value is provided for area in km2, no operator should be used. Moreover, the use of 'x - unknown' is not compatible with the use of value or operators.
status: valid
status modified: 2019-03-20
accepted date: 2019-03-20
in scheme: CDR QaQc Habitats Directive Article 17 Reporting
error type: ERROR

Incoherent information.
type: Concept
notation: H077
definition: Incoherent information provided. The Favourable reference area is smaller than 5.2 Surface area. Check whether this is on purpose.
status: valid
status modified: 2019-03-20
accepted date: 2019-03-20
in scheme: CDR QaQc Habitats Directive Article 17 Reporting
error type: WARNING

Mandatory information missing.
type: Concept
notation: H078
definition: Information on Favourable reference area should be provided (5.13a, b or c). In case the information to be reported in this section is not available use 'x - unknown' in 5.13c, knowing the use of operators should help to reduce the use of 'unknown' to a minimum.
status: valid
status modified: 2019-03-20
accepted date: 2019-03-20
in scheme: CDR QaQc Habitats Directive Article 17 Reporting
error type: ERROR

Invalid code.
type: Concept
notation: H079
definition: Please check the vocabulary favourableOperator.
status: valid
status modified: 2019-03-20
accepted date: 2019-03-20
in scheme: CDR QaQc Habitats Directive Article 17 Reporting
error type: BLOCKER

Invalid code.
type: Concept
notation: H082
definition: Only the symbol 'x - unknown' is allowed in this section.
status: valid
status modified: 2019-03-20
accepted date: 2019-03-20
in scheme: CDR QaQc Habitats Directive Article 17 Reporting
error type: BLOCKER

Invalid code.
type: Concept
notation: H085
definition: Please check the vocabulary reasonChange.
status: valid
status modified: 2019-03-20
accepted date: 2019-03-20
in scheme: CDR QaQc Habitats Directive Article 17 Reporting
error type: BLOCKER

Incoherent information.
type: Concept
notation: H086
definition: If 'noChange' is selected, there is no need to explain the nature of change.
status: valid
status modified: 2019-03-20
accepted date: 2019-03-20
in scheme: CDR QaQc Habitats Directive Article 17 Reporting
error type: ERROR

Incoherent information.
type: Concept
notation: H087
definition: Only one main reason is expected and should be part of the reported reasons.
status: valid
status modified: 2019-03-20
accepted date: 2019-03-20
in scheme: CDR QaQc Habitats Directive Article 17 Reporting
error type: ERROR

Mandatory information missing.
type: Concept
notation: H088
definition: Indicate if there is any change since the previous reporting period (2007-2012) in the area covered by habitat reported. Report 'noChange' if the answer to the question: 'Is there a change between reporting periods?' is 'No'. Provide the nature of that change (more than one option can be chosen) if the answer is 'Yes'.
status: valid
status modified: 2019-03-20
accepted date: 2019-03-20
in scheme: CDR QaQc Habitats Directive Article 17 Reporting
error type: ERROR

Incorrect data format.
type: Concept
notation: H089
definition: Numeric field, only decimals greater or equal 0 are permitted.
status: valid
status modified: 2019-03-20
accepted date: 2019-03-20
in scheme: CDR QaQc Habitats Directive Article 17 Reporting
error type: ERROR

Mandatory information missing.
type: Concept
notation: H090
definition: The minimum area of habitat with 'good' condition should be provided. Report '0' when the surface is null. The area is reported in km2 and can be reported as a range (minimum and maximum); if a precise value is known this value should be reported for both the 'minimum' and 'maximum' fields.
status: valid
status modified: 2019-03-20
accepted date: 2019-03-20
in scheme: CDR QaQc Habitats Directive Article 17 Reporting
error type: ERROR

Incorrect data format.
type: Concept
notation: H091
definition: Numeric field, only decimals greater or equal 0 are permitted.
status: valid
status modified: 2019-03-20
accepted date: 2019-03-20
in scheme: CDR QaQc Habitats Directive Article 17 Reporting
error type: ERROR

6.1a2 Area in good condition - max should be greater or equal min.
type: Concept
notation: H092
status: valid
status modified: 2019-03-20
accepted date: 2019-03-20
in scheme: CDR QaQc Habitats Directive Article 17 Reporting
error type: ERROR

Mandatory information missing.
type: Concept
notation: H093
definition: The maximum area of habitat with 'good' condition should be provided. Report '0' when the surface is null. The area is reported in km2 and can be reported as a range (minimum and maximum); if a precise value is known this value should be reported for both the 'minimum' and 'maximum' fields.
status: valid
status modified: 2019-03-20
accepted date: 2019-03-20
in scheme: CDR QaQc Habitats Directive Article 17 Reporting
error type: ERROR

Incorrect data format.
type: Concept
notation: H094
definition: Numeric field, only decimals greater or equal 0 are permitted.
status: valid
status modified: 2019-03-20
accepted date: 2019-03-20
in scheme: CDR QaQc Habitats Directive Article 17 Reporting
error type: ERROR

Mandatory information missing.
type: Concept
notation: H095
definition: The minimum area of habitat with 'not-good' condition should be provided. Report '0' when the surface is null. The area is reported in km2 and can be reported as a range (minimum and maximum); if a precise value is known this value should be reported for both the 'minimum' and 'maximum' fields.
status: valid
status modified: 2019-03-20
accepted date: 2019-03-20
in scheme: CDR QaQc Habitats Directive Article 17 Reporting
error type: ERROR

Incorrect data format.
type: Concept
notation: H096
definition: Numeric field, only decimals greater or equal 0 are permitted.
status: valid
status modified: 2019-03-20
accepted date: 2019-03-20
in scheme: CDR QaQc Habitats Directive Article 17 Reporting
error type: ERROR

6.1b2 Area in not-good condition - max should be greater or equal min.
type: Concept
notation: H097
status: valid
status modified: 2019-03-20
accepted date: 2019-03-20
in scheme: CDR QaQc Habitats Directive Article 17 Reporting
error type: ERROR

Mandatory information missing.
type: Concept
notation: H098
definition: The maximum area of habitat with 'not-good' condition should be provided. Report '0' when the surface is null. The area is reported in km2 and can be reported as a range (minimum and maximum); if a precise value is known this value should be reported for both the 'minimum' and 'maximum' fields.
status: valid
status modified: 2019-03-20
accepted date: 2019-03-20
in scheme: CDR QaQc Habitats Directive Article 17 Reporting
error type: ERROR

Incorrect data format.
type: Concept
notation: H099
definition: Numeric field, only decimals greater or equal 0 are permitted.
status: valid
status modified: 2019-03-20
accepted date: 2019-03-20
in scheme: CDR QaQc Habitats Directive Article 17 Reporting
error type: ERROR

Mandatory information missing.
type: Concept
notation: H100
definition: The minimum area of habitat with 'unknown' condition should be provided. Report '0' when the surface is null. The area is reported in km2 and can be reported as a range (minimum and maximum); if a precise value is known this value should be reported for both the 'minimum' and 'maximum' fields.
status: valid
status modified: 2019-03-20
accepted date: 2019-03-20
in scheme: CDR QaQc Habitats Directive Article 17 Reporting
error type: ERROR

Incorrect data format.
type: Concept
notation: H101
definition: Numeric field, only decimals greater or equal 0 are permitted.
status: valid
status modified: 2019-03-20
accepted date: 2019-03-20
in scheme: CDR QaQc Habitats Directive Article 17 Reporting
error type: ERROR

6.1c2 Area where condition is not known - max should be greater or equal min.
type: Concept
notation: H102
status: valid
status modified: 2019-03-20
accepted date: 2019-03-20
in scheme: CDR QaQc Habitats Directive Article 17 Reporting
error type: ERROR

Mandatory information missing.
type: Concept
notation: H103
definition: The maximum area of habitat with 'unknown' condition should be provided. Report '0' when the surface is null. The area is reported in km2 and can be reported as a range (minimum and maximum); if a precise value is known this value should be reported for both the 'minimum' and 'maximum' fields.
status: valid
status modified: 2019-03-20
accepted date: 2019-03-20
in scheme: CDR QaQc Habitats Directive Article 17 Reporting
error type: ERROR

Invalid code.
type: Concept
notation: H104
definition: Please check the vocabulary methodsUsed.
status: valid
status modified: 2019-03-20
accepted date: 2019-03-20
in scheme: CDR QaQc Habitats Directive Article 17 Reporting
error type: BLOCKER

Mandatory information missing.
type: Concept
notation: H105
definition: The method should be provided. In case the information to be reported in this section is not available use 'AbsentData - Insufficient or no data available'.
status: valid
status modified: 2019-03-20
accepted date: 2019-03-20
in scheme: CDR QaQc Habitats Directive Article 17 Reporting
error type: ERROR

Incorrect data format.
type: Concept
notation: H106
definition: Incorrect data format, it must be YYYY-YYYY.
status: valid
status modified: 2019-03-20
accepted date: 2019-03-20
in scheme: CDR QaQc Habitats Directive Article 17 Reporting
error type: ERROR

Incoherent information.
type: Concept
notation: H107
definition: Incoherent information provided. Year1 should be greater or equal year2.
status: valid
status modified: 2019-03-20
accepted date: 2019-03-20
in scheme: CDR QaQc Habitats Directive Article 17 Reporting
error type: ERROR

Mandatory information missing.
type: Concept
notation: H108
definition: The period should be provided.
status: valid
status modified: 2019-03-20
accepted date: 2019-03-20
in scheme: CDR QaQc Habitats Directive Article 17 Reporting
error type: ERROR

Invalid code.
type: Concept
notation: H109
definition: Please check the vocabulary trends.
status: valid
status modified: 2019-03-20
accepted date: 2019-03-20
in scheme: CDR QaQc Habitats Directive Article 17 Reporting
error type: BLOCKER

Mandatory information missing.
type: Concept
notation: H111
definition: The trend should be provided. In case the information to be reported in this section is not available use 'Unk - unknown'.
status: valid
status modified: 2019-03-20
accepted date: 2019-03-20
in scheme: CDR QaQc Habitats Directive Article 17 Reporting
error type: ERROR

Invalid code.
type: Concept
notation: H112
definition: Please check the vocabulary methodsUsed.
status: valid
status modified: 2019-03-20
accepted date: 2019-03-20
in scheme: CDR QaQc Habitats Directive Article 17 Reporting
error type: BLOCKER

Incoherent information.
type: Concept
notation: H113
definition: Inconsistent values provided in fields 6.4 Short-term trend of habitat area in good condition Direction and 6.5 Short-term trend of habitat area in good condition Method used. When the method is assessed as 'AbsentData - Insufficient or no data available', the trend cannot be defined. If you want to report a trend as stable, increasing or decreasing based on a method using limited data, please select 'estimateExpert - Based mainly on expert opinion with very limited data' for the method used.
status: valid
status modified: 2019-03-20
accepted date: 2019-03-20
in scheme: CDR QaQc Habitats Directive Article 17 Reporting
error type: WARNING

Mandatory information missing.
type: Concept
notation: H114
definition: The method should be provided. In case the information to be reported in this section is not available use 'AbsentData - Insufficient or no data available'.
status: valid
status modified: 2019-03-20
accepted date: 2019-03-20
in scheme: CDR QaQc Habitats Directive Article 17 Reporting
error type: ERROR

Invalid code.
type: Concept
notation: H115
definition: Please check the vocabulary threats.
status: valid
status modified: 2019-03-20
accepted date: 2019-03-20
in scheme: CDR QaQc Habitats Directive Article 17 Reporting
error type: BLOCKER

More entries than permitted.
type: Concept
notation: H116
definition: More entries than permitted. Maximum of 10 pressures per biogeographical assessment.
status: valid
status modified: 2019-03-20
accepted date: 2019-03-20
in scheme: CDR QaQc Habitats Directive Article 17 Reporting
error type: ERROR

More entries than permitted.
type: Concept
notation: H117
definition: More entries than permitted. Maximum of 10 threats per biogeographical assessment.
status: valid
status modified: 2019-03-20
accepted date: 2019-03-20
in scheme: CDR QaQc Habitats Directive Article 17 Reporting
error type: ERROR

More entries than permitted.
type: Concept
notation: H118
definition: More entries than permitted. Maximum of 5 pressures with 'H - High importance' per biogeographical assessment.
status: valid
status modified: 2019-03-20
accepted date: 2019-03-20
in scheme: CDR QaQc Habitats Directive Article 17 Reporting
error type: ERROR

More entries than permitted.
type: Concept
notation: H119
definition: More entries than permitted. Maximum of 5 threats with 'H - High importance' per biogeographical assessment.
status: valid
status modified: 2019-03-20
accepted date: 2019-03-20
in scheme: CDR QaQc Habitats Directive Article 17 Reporting
error type: ERROR

Incoherent information.
type: Concept
notation: H120
definition: Code 'Xu - Unknown pressure' or 'Xxp - No pressures ' should be reported as a pressure, not as a threat.
status: valid
status modified: 2019-03-20
accepted date: 2019-03-20
in scheme: CDR QaQc Habitats Directive Article 17 Reporting
error type: ERROR

Incoherent information.
type: Concept
notation: H121
definition: Code 'Xt - No information on threats' used but other threats listed.
status: valid
status modified: 2019-03-20
accepted date: 2019-03-20
in scheme: CDR QaQc Habitats Directive Article 17 Reporting
error type: WARNING

Incoherent information.
type: Concept
notation: H122
definition: Code 'Xp - No information on pressures' used but other pressures listed.
status: valid
status modified: 2019-03-20
accepted date: 2019-03-20
in scheme: CDR QaQc Habitats Directive Article 17 Reporting
error type: WARNING

Mandatory information missing.
type: Concept
notation: H125
definition: The list of pressures and/or threats should be provided. Report 'Xp - No information on pressures' and/or 'Xt - No information on threats' for missing information.
status: valid
status modified: 2019-03-20
accepted date: 2019-03-20
in scheme: CDR QaQc Habitats Directive Article 17 Reporting
error type: ERROR

Mandatory information missing.
type: Concept
notation: H126
definition: The list of threats should be provided. Report 'Xt - No information on threats' for missing information.
status: valid
status modified: 2019-03-20
accepted date: 2019-03-20
in scheme: CDR QaQc Habitats Directive Article 17 Reporting
error type: ERROR

Mandatory information missing.
type: Concept
notation: H127
definition: The list of pressures should be provided. Report 'Xp - No information on pressures' for missing information.
status: valid
status modified: 2019-03-20
accepted date: 2019-03-20
in scheme: CDR QaQc Habitats Directive Article 17 Reporting
error type: ERROR

Invalid code.
type: Concept
notation: H128
definition: Please check the vocabulary ranking.
status: valid
status modified: 2019-03-20
accepted date: 2019-03-20
in scheme: CDR QaQc Habitats Directive Article 17 Reporting
error type: BLOCKER

Incoherent information.
type: Concept
notation: H129
definition: Ranking is provided although no code indicated for pressure and/or threat.
status: valid
status modified: 2019-03-20
accepted date: 2019-03-20
in scheme: CDR QaQc Habitats Directive Article 17 Reporting
error type: ERROR

Mandatory information missing.
type: Concept
notation: H130
definition: This field cannot be empty unless the reported code is 'Xp', 'Xt', 'Xu', 'Xxp' or 'Xxt'.
status: valid
status modified: 2019-03-20
accepted date: 2019-03-20
in scheme: CDR QaQc Habitats Directive Article 17 Reporting
error type: ERROR

Invalid code.
type: Concept
notation: H131
definition: Code should be 'p' = pressure or 't' = threat.
status: valid
status modified: 2019-03-20
accepted date: 2019-03-20
in scheme: CDR QaQc Habitats Directive Article 17 Reporting
error type: ERROR

Incoherent information.
type: Concept
notation: H132
definition: Type of pressure/threat is provided although no code indicated for pressure and/or threat.
status: valid
status modified: 2019-03-20
accepted date: 2019-03-20
in scheme: CDR QaQc Habitats Directive Article 17 Reporting
error type: ERROR

Mandatory information missing.
type: Concept
notation: H133
definition: The type of pressure or threats should be systematically provided. Code should be 'p' = pressure or 't' = threat.
status: valid
status modified: 2019-03-20
accepted date: 2019-03-20
in scheme: CDR QaQc Habitats Directive Article 17 Reporting
error type: ERROR

Invalid code.
type: Concept
notation: H134
definition: Code should be 'Yes' or 'No'.
status: valid
status modified: 2019-03-20
accepted date: 2019-03-20
in scheme: CDR QaQc Habitats Directive Article 17 Reporting
error type: BLOCKER

Mandatory information missing.
type: Concept
notation: H135
definition: Indicate whether measures are needed or not.
status: valid
status modified: 2019-03-20
accepted date: 2019-03-20
in scheme: CDR QaQc Habitats Directive Article 17 Reporting
error type: ERROR

Incoherent information.
type: Concept
notation: H136
definition: Status of measures is not expected if no measures are needed.
status: valid
status modified: 2019-03-20
accepted date: 2019-03-20
in scheme: CDR QaQc Habitats Directive Article 17 Reporting
error type: ERROR

Invalid code.
type: Concept
notation: H137
definition: Please check the vocabulary measuresIdentified.
status: valid
status modified: 2019-03-20
accepted date: 2019-03-20
in scheme: CDR QaQc Habitats Directive Article 17 Reporting
error type: BLOCKER

Mandatory information missing.
type: Concept
notation: H138
definition: Status of measures should be provided if measures are needed.
status: valid
status modified: 2019-03-20
accepted date: 2019-03-20
in scheme: CDR QaQc Habitats Directive Article 17 Reporting
error type: ERROR

Incoherent information.
type: Concept
notation: H139
definition: The main purpose of measures taken is not expected if no measures are identified and taken.
status: valid
status modified: 2019-03-20
accepted date: 2019-03-20
in scheme: CDR QaQc Habitats Directive Article 17 Reporting
error type: WARNING

Invalid code.
type: Concept
notation: H140
definition: Please check the vocabulary: measuresPurposeHabitats.
status: valid
status modified: 2019-03-20
accepted date: 2019-03-20
in scheme: CDR QaQc Habitats Directive Article 17 Reporting
error type: BLOCKER

Incoherent information.
type: Concept
notation: H141
definition: The main purpose of measures taken is expected if measures are identified and taken.
status: valid
status modified: 2019-03-20
accepted date: 2019-03-20
in scheme: CDR QaQc Habitats Directive Article 17 Reporting
error type: ERROR

Incoherent information.
type: Concept
notation: H142
definition: Location of measures is not expected if no measures are identified and taken.
status: valid
status modified: 2019-03-20
accepted date: 2019-03-20
in scheme: CDR QaQc Habitats Directive Article 17 Reporting
error type: WARNING

Invalid code.
type: Concept
notation: H143
definition: Please check the vocabulary measuresLocation.
status: valid
status modified: 2019-03-20
accepted date: 2019-03-20
in scheme: CDR QaQc Habitats Directive Article 17 Reporting
error type: BLOCKER

Incoherent information.
type: Concept
notation: H144
definition: The location of the measures is expected if measures are identified and taken.
status: valid
status modified: 2019-03-20
accepted date: 2019-03-20
in scheme: CDR QaQc Habitats Directive Article 17 Reporting
error type: ERROR

Incoherent information.
type: Concept
notation: H145
definition: Time frame of response to measures is not expected if no measures are identified and taken.
status: valid
status modified: 2019-03-20
accepted date: 2019-03-20
in scheme: CDR QaQc Habitats Directive Article 17 Reporting
error type: WARNING

Invalid code.
type: Concept
notation: H146
definition: Please check the vocabulary measuresResponse.
status: valid
status modified: 2019-03-20
accepted date: 2019-03-20
in scheme: CDR QaQc Habitats Directive Article 17 Reporting
error type: BLOCKER

Mandatory information missing.
type: Concept
notation: H147
definition: The time frame of the response to measures should be provided if measures are identified and taken.
status: valid
status modified: 2019-03-20
accepted date: 2019-03-20
in scheme: CDR QaQc Habitats Directive Article 17 Reporting
error type: ERROR

Invalid code.
type: Concept
notation: H148
definition: Please check the vocabulary measures.
status: valid
status modified: 2019-03-20
accepted date: 2019-03-20
in scheme: CDR QaQc Habitats Directive Article 17 Reporting
error type: BLOCKER

More entries than permitted.
type: Concept
notation: H150
definition: More entries than permitted. Maximum of 10 measures per biogeographical assessment.
status: valid
status modified: 2019-03-20
accepted date: 2019-03-20
in scheme: CDR QaQc Habitats Directive Article 17 Reporting
error type: ERROR

Mandatory information missing.
type: Concept
notation: H151
definition: The list of measures should be provided if measures are identified and taken.
status: valid
status modified: 2019-03-20
accepted date: 2019-03-20
in scheme: CDR QaQc Habitats Directive Article 17 Reporting
error type: ERROR

Invalid code.
type: Concept
notation: H152
definition: Please check the vocabulary Prospects.
status: valid
status modified: 2019-03-20
accepted date: 2019-03-20
in scheme: CDR QaQc Habitats Directive Article 17 Reporting
error type: BLOCKER

Mandatory information missing.
type: Concept
notation: H153
definition: The future prospects of each of the three parameters should be provided. In case the information to be reported in this section is not available use 'unk - unknown'.
status: valid
status modified: 2019-03-20
accepted date: 2019-03-20
in scheme: CDR QaQc Habitats Directive Article 17 Reporting
error type: ERROR

Invalid code.
type: Concept
notation: H154
definition: Please check the vocabulary Prospects.
status: valid
status modified: 2019-03-20
accepted date: 2019-03-20
in scheme: CDR QaQc Habitats Directive Article 17 Reporting
error type: BLOCKER

Mandatory information missing.
type: Concept
notation: H155
definition: The future prospects of each of the three parameters should be provided. In case the information to be reported in this section is not available use 'unk - unknown'.
status: valid
status modified: 2019-03-20
accepted date: 2019-03-20
in scheme: CDR QaQc Habitats Directive Article 17 Reporting
error type: ERROR

Invalid code.
type: Concept
notation: H156
definition: Please check the vocabulary Prospects.
status: valid
status modified: 2019-03-20
accepted date: 2019-03-20
in scheme: CDR QaQc Habitats Directive Article 17 Reporting
error type: BLOCKER

Mandatory information missing.
type: Concept
notation: H157
definition: The future prospects of each of the three parameters should be provided. In case the information to be reported in this section is not available use 'unk - unknown'.
status: valid
status modified: 2019-03-20
accepted date: 2019-03-20
in scheme: CDR QaQc Habitats Directive Article 17 Reporting
error type: ERROR

Invalid code.
type: Concept
notation: H158
definition: Please check the vocabulary assessments.
status: valid
status modified: 2019-03-20
accepted date: 2019-03-20
in scheme: CDR QaQc Habitats Directive Article 17 Reporting
error type: BLOCKER

Incoherent information.
type: Concept
notation: H159
definition: The conclusion for Range should be 'U2 - Unfavourable - Bad' when range surface area is more than 10% below favourable reference range (reported value in 4.10b is '>> - Much more than').
status: valid
status modified: 2019-03-20
accepted date: 2019-03-20
in scheme: CDR QaQc Habitats Directive Article 17 Reporting
error type: ERROR

Incoherent information.
type: Concept
notation: H160
definition: The conclusion for Range cannot be 'FV - Favourable' when the trend is decreasing (reported value in 4.3 is 'D - Decreasing').
status: valid
status modified: 2019-03-20
accepted date: 2019-03-20
in scheme: CDR QaQc Habitats Directive Article 17 Reporting
error type: ERROR

Mandatory information missing.
type: Concept
notation: H161
definition: The conclusion for Range should be provided.
status: valid
status modified: 2019-03-20
accepted date: 2019-03-20
in scheme: CDR QaQc Habitats Directive Article 17 Reporting
error type: ERROR

Invalid code.
type: Concept
notation: H162
definition: Please check the vocabulary assessments.
status: valid
status modified: 2019-03-20
accepted date: 2019-03-20
in scheme: CDR QaQc Habitats Directive Article 17 Reporting
error type: BLOCKER

Incoherent information.
type: Concept
notation: H163
definition: Conclusion for Area should be 'U2 - Unfavourable - Bad' when area covered by habitat is more than 10% below favourable reference area (reported value in 5.13b is '>> - Much more than').
status: valid
status modified: 2019-03-20
accepted date: 2019-03-20
in scheme: CDR QaQc Habitats Directive Article 17 Reporting
error type: ERROR

Incoherent information.
type: Concept
notation: H164
definition: The conclusion for Area cannot be 'FV - Favourable' when the trend is decreasing (reported value in 5.6 is 'D - Decreasing').
status: valid
status modified: 2019-03-20
accepted date: 2019-03-20
in scheme: CDR QaQc Habitats Directive Article 17 Reporting
error type: ERROR

Mandatory information missing.
type: Concept
notation: H165
definition: The conclusion for Area should be provided.
status: valid
status modified: 2019-03-20
accepted date: 2019-03-20
in scheme: CDR QaQc Habitats Directive Article 17 Reporting
error type: ERROR

Invalid code.
type: Concept
notation: H166
definition: Please check the vocabulary assessments.
status: valid
status modified: 2019-03-20
accepted date: 2019-03-20
in scheme: CDR QaQc Habitats Directive Article 17 Reporting
error type: BLOCKER

Mandatory information missing.
type: Concept
notation: H167
definition: The conclusion for Specific structure and functions should be provided.
status: valid
status modified: 2019-03-20
accepted date: 2019-03-20
in scheme: CDR QaQc Habitats Directive Article 17 Reporting
error type: ERROR

Invalid code.
type: Concept
notation: H168
definition: Please check the vocabulary assessments.
status: valid
status modified: 2019-03-20
accepted date: 2019-03-20
in scheme: CDR QaQc Habitats Directive Article 17 Reporting
error type: BLOCKER

Incoherent information.
type: Concept
notation: H169
definition: Conclusion for Future prospects should be 'FV - Favourable' if all parameters (9.1a,b,c) have 'good' prospects, or prospects of one parameter is 'unk - unknown' and the other prospects are 'good'.
status: valid
status modified: 2019-03-20
accepted date: 2019-03-20
in scheme: CDR QaQc Habitats Directive Article 17 Reporting
error type: ERROR

Incoherent information.
type: Concept
notation: H170
definition: Conclusion for Future prospects should be 'U2 - Unfavourable - Bad' if one or more parameters (9.1a,b,c) have 'bad' prospects.
status: valid
status modified: 2019-03-20
accepted date: 2019-03-20
in scheme: CDR QaQc Habitats Directive Article 17 Reporting
error type: ERROR

Incoherent information.
type: Concept
notation: H171
definition: Conclusion for Future prospects should be 'XX - Unknown' if two or more parameters (9.1a,b,c) are 'unk - unknown' and no parameter with 'bad' prospects.
status: valid
status modified: 2019-03-20
accepted date: 2019-03-20
in scheme: CDR QaQc Habitats Directive Article 17 Reporting
error type: ERROR

Mandatory information missing.
type: Concept
notation: H172
definition: The conclusion for Future prospects should be provided.
status: valid
status modified: 2019-03-20
accepted date: 2019-03-20
in scheme: CDR QaQc Habitats Directive Article 17 Reporting
error type: ERROR

Invalid code.
type: Concept
notation: H173
definition: Please check the vocabulary assessments.
status: valid
status modified: 2019-03-20
accepted date: 2019-03-20
in scheme: CDR QaQc Habitats Directive Article 17 Reporting
error type: BLOCKER

Incoherent information.
type: Concept
notation: H174
definition: Overall assessment should be 'FV - Favourable' if all assessments of parameters (10.1 to 10.4) are 'FV - Favourable', or three are 'FV - Favourable' and one is 'XX - Unknown'.
status: valid
status modified: 2019-03-20
accepted date: 2019-03-20
in scheme: CDR QaQc Habitats Directive Article 17 Reporting
error type: ERROR

Incoherent information.
type: Concept
notation: H175
definition: Overall assessment should be 'U2 - Unfavourable - Bad' if at least one assessment of parameters (10.1 to 10.4) is 'U2 - Unfavourable - Bad'.
status: valid
status modified: 2019-03-20
accepted date: 2019-03-20
in scheme: CDR QaQc Habitats Directive Article 17 Reporting
error type: ERROR

Incoherent information.
type: Concept
notation: H176
definition: Overall assessment should be 'U1 - Unfavourable - Inadequate' if at least one assessment of parameters (10.1 to 10.4) is 'U1 - Unfavourable - Inadequate' and none is 'U2 - Unfavourable - Bad'.
status: valid
status modified: 2019-03-20
accepted date: 2019-03-20
in scheme: CDR QaQc Habitats Directive Article 17 Reporting
error type: ERROR

Mandatory information missing.
type: Concept
notation: H177
definition: Conclusion for Overall assessment of Conservation Status should be provided.
status: valid
status modified: 2019-03-20
accepted date: 2019-03-20
in scheme: CDR QaQc Habitats Directive Article 17 Reporting
error type: ERROR

Mandatory information missing.
type: Concept
notation: H178
definition: Conclusion for Overall assessment of Conservation Status should be provided as other conclusions are provided (10.1 to 10.4).
status: valid
status modified: 2019-03-20
accepted date: 2019-03-20
in scheme: CDR QaQc Habitats Directive Article 17 Reporting
error type: ERROR

Invalid code.
type: Concept
notation: H179
definition: Please check the vocabulary trendsConclusion.
status: valid
status modified: 2019-03-20
accepted date: 2019-03-20
in scheme: CDR QaQc Habitats Directive Article 17 Reporting
error type: BLOCKER

Mandatory information missing.
type: Concept
notation: H181
definition: Overall trend in conservation status should be provided when 10.5 Conclusions - Overall assessment of Conservation Status is not 'XX - Unknown'.
status: valid
status modified: 2019-03-20
accepted date: 2019-03-20
in scheme: CDR QaQc Habitats Directive Article 17 Reporting
error type: ERROR

Invalid code.
type: Concept
notation: H182
definition: Please check the vocabulary reasonChange.
status: valid
status modified: 2019-03-20
accepted date: 2019-03-20
in scheme: CDR QaQc Habitats Directive Article 17 Reporting
error type: BLOCKER

Incoherent information.
type: Concept
notation: H183
definition: If 'noChange' is selected, there is no need to explain the nature of change.
status: valid
status modified: 2019-03-20
accepted date: 2019-03-20
in scheme: CDR QaQc Habitats Directive Article 17 Reporting
error type: ERROR

Incoherent information.
type: Concept
notation: H184
definition: Only one main reason is expected and should be part of the reported reasons.
status: valid
status modified: 2019-03-20
accepted date: 2019-03-20
in scheme: CDR QaQc Habitats Directive Article 17 Reporting
error type: ERROR

Mandatory information missing.
type: Concept
notation: H185
definition: Indicate if there is any change since the previous reporting period (2007-2012) in conservation status. Report 'noChange' if the answer to the question: 'Is there a change from the previous reporting round?' is 'No, there is no difference'. Provide the nature of that change (more than one option can be chosen) if the answer is 'Yes'.
status: valid
status modified: 2019-03-20
accepted date: 2019-03-20
in scheme: CDR QaQc Habitats Directive Article 17 Reporting
error type: ERROR

Invalid code.
type: Concept
notation: H186
definition: Please check the vocabulary reasonChange.
status: valid
status modified: 2019-03-20
accepted date: 2019-03-20
in scheme: CDR QaQc Habitats Directive Article 17 Reporting
error type: BLOCKER

Incoherent information.
type: Concept
notation: H187
definition: If 'noChange' is selected, there is no need to explain the nature of change.
status: valid
status modified: 2019-03-20
accepted date: 2019-03-20
in scheme: CDR QaQc Habitats Directive Article 17 Reporting
error type: ERROR

Incoherent information.
type: Concept
notation: H188
definition: Only one main reason is expected and should be part of the reported reasons.
status: valid
status modified: 2019-03-20
accepted date: 2019-03-20
in scheme: CDR QaQc Habitats Directive Article 17 Reporting
error type: ERROR

Mandatory information missing.
type: Concept
notation: H189
definition: Indicate if there is any change since the previous reporting period (2007-2012) in trend in conservation status. Report 'noChange' if the answer to the question: 'Is there a change from the previous reporting round?' is 'No, there is no difference'. Provide the nature of that change (more than one option can be chosen) if the answer is 'Yes'.
status: valid
status modified: 2019-03-20
accepted date: 2019-03-20
in scheme: CDR QaQc Habitats Directive Article 17 Reporting
error type: ERROR

Incorrect data format.
type: Concept
notation: H190
definition: Numeric field, only decimals greater or equal 0 are permitted.
status: valid
status modified: 2019-03-20
accepted date: 2019-03-20
in scheme: CDR QaQc Habitats Directive Article 17 Reporting
error type: ERROR

Incorrect data format.
type: Concept
notation: H191
definition: Numeric field, only decimals greater or equal 0 are permitted.
status: valid
status modified: 2019-03-20
accepted date: 2019-03-20
in scheme: CDR QaQc Habitats Directive Article 17 Reporting
error type: ERROR

11.1b Surface area within Natura 2000 network - max should be greater or equal min.
type: Concept
notation: H192
status: valid
status modified: 2019-03-20
accepted date: 2019-03-20
in scheme: CDR QaQc Habitats Directive Article 17 Reporting
error type: ERROR

Incorrect data format.
type: Concept
notation: H193
definition: Numeric field, only decimals greater or equal 0 are permitted.
status: valid
status modified: 2019-03-20
accepted date: 2019-03-20
in scheme: CDR QaQc Habitats Directive Article 17 Reporting
error type: ERROR

Mandatory information missing.
type: Concept
notation: H194
definition: Surface area of the habitat type within Natura 2000 network should be provided as an interval (11.1a, b) and/or a single value (11.1c). When only a minimum (or maximum) value of the surface area of the habitat type within the network is known (e.g. through expert opinion) this should be entered in the 'Best single value' field and NOT the '(a) Minimum' or '(b) Maximum' fields.
status: valid
status modified: 2019-03-20
accepted date: 2019-03-20
in scheme: CDR QaQc Habitats Directive Article 17 Reporting
error type: ERROR

Invalid code.
type: Concept
notation: H195
definition: Please check the vocabulary typeEstimate. The value 'mean - multi-year mean' is not allowed in this section.
status: valid
status modified: 2019-03-20
accepted date: 2019-03-20
in scheme: CDR QaQc Habitats Directive Article 17 Reporting
error type: BLOCKER

Incoherent information.
type: Concept
notation: H196
definition: Type of estimate was provided although there is no entry for surface area within Natura 2000 network (11.1a,b,c). Check coherence between these two fields. If both interval (11.1a 'Minimum' and 11.1b 'Maximum') and a single value (11.1c 'Best single value') are provided, field 11.2 'Type of estimate' should correspond to the more accurate estimate. This should be noted in 11.6 'Additional information'.
status: valid
status modified: 2019-03-20
accepted date: 2019-03-20
in scheme: CDR QaQc Habitats Directive Article 17 Reporting
error type: WARNING

Mandatory information missing.
type: Concept
notation: H197
definition: The type of estimate for the surface area covered by the habitat should be provided.
status: valid
status modified: 2019-03-20
accepted date: 2019-03-20
in scheme: CDR QaQc Habitats Directive Article 17 Reporting
error type: ERROR

Invalid code.
type: Concept
notation: H198
definition: Please check the vocabulary methodsUsed.
status: valid
status modified: 2019-03-20
accepted date: 2019-03-20
in scheme: CDR QaQc Habitats Directive Article 17 Reporting
error type: BLOCKER

Incoherent information.
type: Concept
notation: H199
definition: Incoherent information provided. 11.2 Type of estimate should be empty when Surface area within Natura 2000 Method used is 'AbsentData - Insufficient or no data available'. When the method is assessed as 'AbsentData - Insufficient or no data available', the type of estimate used for the surface area inside the network cannot be defined. If you want to report an estimate based on a method using limited data, please select 'estimateExpert - Based mainly on expert opinion with very limited data' for the method used.
status: valid
status modified: 2019-03-20
accepted date: 2019-03-20
in scheme: CDR QaQc Habitats Directive Article 17 Reporting
error type: WARNING

Mandatory information missing.
type: Concept
notation: H200
definition: Method should be provided. In case the information to be reported in this section is not available use 'AbsentData - Insufficient or no data available'.
status: valid
status modified: 2019-03-20
accepted date: 2019-03-20
in scheme: CDR QaQc Habitats Directive Article 17 Reporting
error type: ERROR

Invalid code.
type: Concept
notation: H201
definition: Please check the vocabulary trends.
status: valid
status modified: 2019-03-20
accepted date: 2019-03-20
in scheme: CDR QaQc Habitats Directive Article 17 Reporting
error type: BLOCKER

Mandatory information missing.
type: Concept
notation: H202
definition: The trend should be provided. In case the information to be reported in this section is not available use 'Unk - unknown'.
status: valid
status modified: 2019-03-20
accepted date: 2019-03-20
in scheme: CDR QaQc Habitats Directive Article 17 Reporting
error type: ERROR

Invalid code.
type: Concept
notation: H203
definition: Please check the vocabulary methodsUsed.
status: valid
status modified: 2019-03-20
accepted date: 2019-03-20
in scheme: CDR QaQc Habitats Directive Article 17 Reporting
error type: BLOCKER

Incoherent information.
type: Concept
notation: H204
definition: Inconsistent values provided in fields 11.4 Short-term trend Direction and 11.5 Short-term trend Method used. When the method is assessed as 'AbsentData - Insufficient or no data available', the trend cannot be defined. If you want to report a trend as stable, increasing or decreasing based on a method using limited data, please select 'estimateExpert - Based mainly on expert opinion with very limited data' for the method used.
status: valid
status modified: 2019-03-20
accepted date: 2019-03-20
in scheme: CDR QaQc Habitats Directive Article 17 Reporting
error type: WARNING

Mandatory information missing.
type: Concept
notation: H205
definition: The method should be provided. In case the information to be reported in this section is not available use 'AbsentData - Insufficient or no data available'.
status: valid
status modified: 2019-03-20
accepted date: 2019-03-20
in scheme: CDR QaQc Habitats Directive Article 17 Reporting
error type: ERROR

Invalid code.
type: Concept
notation: H500
definition: Please check the vocabulary countries.
status: valid
status modified: 2019-03-20
accepted date: 2019-03-20
in scheme: CDR QaQc Habitats Directive Article 17 Reporting
error type: BLOCKER

Mandatory information missing.
type: Concept
notation: H501
definition: The country code should be provided.
status: valid
status modified: 2019-03-20
accepted date: 2019-03-20
in scheme: CDR QaQc Habitats Directive Article 17 Reporting
error type: BLOCKER

Invalid code.
type: Concept
notation: H502
definition: Please check the vocabulary habitats.
status: valid
status modified: 2019-03-20
accepted date: 2019-03-20
in scheme: CDR QaQc Habitats Directive Article 17 Reporting
error type: BLOCKER

Mandatory information missing.
type: Concept
notation: H503
definition: The habitat code should be provided.
status: valid
status modified: 2019-03-20
accepted date: 2019-03-20
in scheme: CDR QaQc Habitats Directive Article 17 Reporting
error type: BLOCKER

Incorrect data format.
type: Concept
notation: H504
definition: Format must be YYYY or YYYY-YYYY.
status: valid
status modified: 2019-03-20
accepted date: 2019-03-20
in scheme: CDR QaQc Habitats Directive Article 17 Reporting
error type: ERROR

Incoherent information.
type: Concept
notation: H505
definition: Incoherent information provided. Year1 should be greater or equal year2.
status: valid
status modified: 2019-03-20
accepted date: 2019-03-20
in scheme: CDR QaQc Habitats Directive Article 17 Reporting
error type: ERROR

Mandatory information missing.
type: Concept
notation: H506
definition: Year or period should be provided.
status: valid
status modified: 2019-03-20
accepted date: 2019-03-20
in scheme: CDR QaQc Habitats Directive Article 17 Reporting
error type: ERROR

Invalid code.
type: Concept
notation: H507
definition: Please check the vocabulary methodsUsed.
status: valid
status modified: 2019-03-20
accepted date: 2019-03-20
in scheme: CDR QaQc Habitats Directive Article 17 Reporting
error type: BLOCKER

Mandatory information missing.
type: Concept
notation: H508
definition: Method should be provided. In case the information to be reported in this section is not available use 'AbsentData - Insufficient or no data available'.
status: valid
status modified: 2019-03-20
accepted date: 2019-03-20
in scheme: CDR QaQc Habitats Directive Article 17 Reporting
error type: ERROR

Invalid code.
type: Concept
notation: H509
definition: Please check the vocabulary bioGeoReg.
status: valid
status modified: 2019-03-20
accepted date: 2019-03-20
in scheme: CDR QaQc Habitats Directive Article 17 Reporting
error type: BLOCKER

Mandatory information missing.
type: Concept
notation: H510
definition: Information on biogeographical or marine region is expected.
status: valid
status modified: 2019-03-20
accepted date: 2019-03-20
in scheme: CDR QaQc Habitats Directive Article 17 Reporting
error type: BLOCKER

Invalid code.
type: Concept
notation: S001
definition: Please check the vocabulary countries.
status: valid
status modified: 2019-03-20
accepted date: 2019-03-20
in scheme: CDR QaQc Habitats Directive Article 17 Reporting
error type: BLOCKER

Mandatory information missing.
type: Concept
notation: S002
definition: The country code should be provided.
status: valid
status modified: 2019-03-20
accepted date: 2019-03-20
in scheme: CDR QaQc Habitats Directive Article 17 Reporting
error type: BLOCKER

Invalid code.
type: Concept
notation: S003
definition: Please check the vocabulary HDspecies.
status: valid
status modified: 2019-03-20
accepted date: 2019-03-20
in scheme: CDR QaQc Habitats Directive Article 17 Reporting
error type: BLOCKER

Mandatory information missing.
type: Concept
notation: S004
definition: The species code should be provided.
status: valid
status modified: 2019-03-20
accepted date: 2019-03-20
in scheme: CDR QaQc Habitats Directive Article 17 Reporting
error type: BLOCKER

Incoherent information.
type: Concept
notation: S005
definition: Incoherent information in this section. The combination species code/scientific name should exist in the vocabulary HDspecies.
status: valid
status modified: 2019-03-20
accepted date: 2019-03-20
in scheme: CDR QaQc Habitats Directive Article 17 Reporting
error type: WARNING

Incoherent information.
type: Concept
notation: S006
definition: Incoherent information in this section.The scientific name should be provided.
status: valid
status modified: 2019-03-20
accepted date: 2019-03-20
in scheme: CDR QaQc Habitats Directive Article 17 Reporting
error type: ERROR

Invalid code.
type: Concept
notation: S007
definition: Code should be 'Yes' or 'No'.
status: valid
status modified: 2019-03-20
accepted date: 2019-03-20
in scheme: CDR QaQc Habitats Directive Article 17 Reporting
error type: BLOCKER

Mandatory information missing.
type: Concept
notation: S008
definition: Indicate whether information on species distribution is sensitive.
status: valid
status modified: 2019-03-20
accepted date: 2019-03-20
in scheme: CDR QaQc Habitats Directive Article 17 Reporting
error type: ERROR

Incorrect data format.
type: Concept
notation: S009
definition: Incorrect data format, it must be YYYY or YYYY-YYYY.
status: valid
status modified: 2019-03-20
accepted date: 2019-03-20
in scheme: CDR QaQc Habitats Directive Article 17 Reporting
error type: ERROR

Incoherent information.
type: Concept
notation: S010
definition: Year1 should be lower or equal than year2.
status: valid
status modified: 2019-03-20
accepted date: 2019-03-20
in scheme: CDR QaQc Habitats Directive Article 17 Reporting
error type: ERROR

Mandatory information missing.
type: Concept
notation: S011
definition: Year or period should be provided.
status: valid
status modified: 2019-03-20
accepted date: 2019-03-20
in scheme: CDR QaQc Habitats Directive Article 17 Reporting
error type: ERROR

Invalid code.
type: Concept
notation: S012
definition: Please check the vocabulary methodsUsed.
status: valid
status modified: 2019-03-20
accepted date: 2019-03-20
in scheme: CDR QaQc Habitats Directive Article 17 Reporting
error type: BLOCKER

Mandatory information missing.
type: Concept
notation: S013
definition: Method should be provided. In case the information to be reported in this section is not available use 'AbsentData - Insufficient or no data available'.
status: valid
status modified: 2019-03-20
accepted date: 2019-03-20
in scheme: CDR QaQc Habitats Directive Article 17 Reporting
error type: ERROR

Invalid code.
type: Concept
notation: S014
definition: Code should be 'Yes' or 'No'.
status: valid
status modified: 2019-03-20
accepted date: 2019-03-20
in scheme: CDR QaQc Habitats Directive Article 17 Reporting
error type: BLOCKER

Mandatory information missing.
type: Concept
notation: S016
definition: Indicate whether this Annex V species is taken or exploited. Report 'No' if the answer to the question: 'Is the species taken in the wild/exploited' is 'No'.
status: valid
status modified: 2019-03-20
accepted date: 2019-03-20
in scheme: CDR QaQc Habitats Directive Article 17 Reporting
error type: ERROR

Incoherent information.
type: Concept
notation: S017
definition: Incoherent information in this section. This section Spec.3.2 should be filled when the species is taken in the wild or exploited ('Yes' reported in Spec.3.1) and the conservation status of the species is 'unfavourable' (U1 or U2) in at least one biogeographical or marine region.
status: valid
status modified: 2019-03-20
accepted date: 2019-03-20
in scheme: CDR QaQc Habitats Directive Article 17 Reporting
error type: WARNING

Mandatory information missing.
type: Concept
notation: S018
definition: This section should be filled when the species is taken in the wild or exploited ('Yes' reported in Spec.3.1) and the conservation status of the species is 'unfavourable' (U1 or U2) in at least one biogeographical or marine region.
status: valid
status modified: 2019-03-20
accepted date: 2019-03-20
in scheme: CDR QaQc Habitats Directive Article 17 Reporting
error type: ERROR

Invalid code.
type: Concept
notation: S019
definition: Code should be 'Yes' or 'No'.
status: valid
status modified: 2019-03-20
accepted date: 2019-03-20
in scheme: CDR QaQc Habitats Directive Article 17 Reporting
error type: BLOCKER

Invalid code.
type: Concept
notation: S020
definition: Code should be 'Yes' or 'No'.
status: valid
status modified: 2019-03-20
accepted date: 2019-03-20
in scheme: CDR QaQc Habitats Directive Article 17 Reporting
error type: BLOCKER

Invalid code.
type: Concept
notation: S021
definition: Code should be 'Yes' or 'No'.
status: valid
status modified: 2019-03-20
accepted date: 2019-03-20
in scheme: CDR QaQc Habitats Directive Article 17 Reporting
error type: BLOCKER

Invalid code.
type: Concept
notation: S022
definition: Code should be 'Yes' or 'No'.
status: valid
status modified: 2019-03-20
accepted date: 2019-03-20
in scheme: CDR QaQc Habitats Directive Article 17 Reporting
error type: BLOCKER

Invalid code.
type: Concept
notation: S023
definition: Code should be 'Yes' or 'No'.
status: valid
status modified: 2019-03-20
accepted date: 2019-03-20
in scheme: CDR QaQc Habitats Directive Article 17 Reporting
error type: BLOCKER

Invalid code.
type: Concept
notation: S024
definition: Code should be 'Yes' or 'No'.
status: valid
status modified: 2019-03-20
accepted date: 2019-03-20
in scheme: CDR QaQc Habitats Directive Article 17 Reporting
error type: BLOCKER

Invalid code.
type: Concept
notation: S025
definition: Code should be 'Yes' or 'No'.
status: valid
status modified: 2019-03-20
accepted date: 2019-03-20
in scheme: CDR QaQc Habitats Directive Article 17 Reporting
error type: BLOCKER

Invalid code.
type: Concept
notation: S026
definition: Code should be 'Yes' or 'No'.
status: valid
status modified: 2019-03-20
accepted date: 2019-03-20
in scheme: CDR QaQc Habitats Directive Article 17 Reporting
error type: BLOCKER

Incoherent information.
type: Concept
notation: S027
definition: The measures taken should be described only when 'yes, other measures' have been selected ('Yes' reported in Spec.3.2h1).
status: valid
status modified: 2019-03-20
accepted date: 2019-03-20
in scheme: CDR QaQc Habitats Directive Article 17 Reporting
error type: ERROR

Mandatory information missing.
type: Concept
notation: S028
definition: The measures taken should be described when other measures have been selected ('Yes' reported in Spec.3.2h1).
status: valid
status modified: 2019-03-20
accepted date: 2019-03-20
in scheme: CDR QaQc Habitats Directive Article 17 Reporting
error type: ERROR

Invalid code.
type: Concept
notation: S029
definition: Please check the vocabulary populationUnits.
status: valid
status modified: 2019-03-20
accepted date: 2019-03-20
in scheme: CDR QaQc Habitats Directive Article 17 Reporting
error type: ERROR

Mandatory information missing.
type: Concept
notation: S030
definition: Population unit for the hunting bag or quantity taken in the wild should be provided for Annex V species (Mammals and Acipenseridae), having an Unfavourable conservation status in one or more biogeographical/marine region where the species occurs.
status: valid
status modified: 2019-03-20
accepted date: 2019-03-20
in scheme: CDR QaQc Habitats Directive Article 17 Reporting
error type: ERROR

Incoherent information.
type: Concept
notation: S031
definition: If a Member State wishes to report population size using a different unit this can be reported in field 6.4, but this must be in addition to the reporting unit specified in the checklist and not as an alternative.
status: valid
status modified: 2019-03-20
accepted date: 2019-03-20
in scheme: CDR QaQc Habitats Directive Article 17 Reporting
error type: ERROR

Incoherent information.
type: Concept
notation: S032
definition: The reported additional population unit is similar to the recommended unit in the checklist on the reference portal.The reported additional population unit should be converted to the reporting unit in field 6.2.
status: valid
status modified: 2019-03-20
accepted date: 2019-03-20
in scheme: CDR QaQc Habitats Directive Article 17 Reporting
error type: WARNING

Invalid code.
type: Concept
notation: S058
definition: Please check the vocabulary methodsUsed.
status: valid
status modified: 2019-03-20
accepted date: 2019-03-20
in scheme: CDR QaQc Habitats Directive Article 17 Reporting
error type: BLOCKER

Mandatory information missing.
type: Concept
notation: S059
definition: The method should be provided. In case the information to be reported in this section is not available use 'AbsentData - Insufficient or no data available'.
status: valid
status modified: 2019-03-20
accepted date: 2019-03-20
in scheme: CDR QaQc Habitats Directive Article 17 Reporting
error type: ERROR

Invalid code.
type: Concept
notation: S060
definition: Please check the vocabulary bioGeoReg.
status: valid
status modified: 2019-03-20
accepted date: 2019-03-20
in scheme: CDR QaQc Habitats Directive Article 17 Reporting
error type: BLOCKER

Mandatory information missing.
type: Concept
notation: S061
definition: Information on biogeographical or marine region is expected.
status: valid
status modified: 2019-03-20
accepted date: 2019-03-20
in scheme: CDR QaQc Habitats Directive Article 17 Reporting
error type: BLOCKER

Incorrect data format.
type: Concept
notation: S062
definition: Numeric field, only decimals greater or equal 0 is permitted.
status: valid
status modified: 2019-03-20
accepted date: 2019-03-20
in scheme: CDR QaQc Habitats Directive Article 17 Reporting
error type: ERROR

Mandatory information missing.
type: Concept
notation: S063
definition: Surface area should be provided.
status: valid
status modified: 2019-03-20
accepted date: 2019-03-20
in scheme: CDR QaQc Habitats Directive Article 17 Reporting
error type: ERROR

Incorrect data format.
type: Concept
notation: S064
definition: Format must be YYYY-YYYY.
status: valid
status modified: 2019-03-20
accepted date: 2019-03-20
in scheme: CDR QaQc Habitats Directive Article 17 Reporting
error type: ERROR

Incoherent information.
type: Concept
notation: S065
definition: Year1 should be lower or equal than year2.
status: valid
status modified: 2019-03-20
accepted date: 2019-03-20
in scheme: CDR QaQc Habitats Directive Article 17 Reporting
error type: ERROR

Mandatory information missing.
type: Concept
notation: S066
definition: Period should be provided.
status: valid
status modified: 2019-03-20
accepted date: 2019-03-20
in scheme: CDR QaQc Habitats Directive Article 17 Reporting
error type: ERROR

Invalid code.
type: Concept
notation: S067
definition: Please check the vocabulary trends.
status: valid
status modified: 2019-03-20
accepted date: 2019-03-20
in scheme: CDR QaQc Habitats Directive Article 17 Reporting
error type: BLOCKER

Mandatory information missing.
type: Concept
notation: S068
definition: Trend should be provided. In case the information to be reported in this section is not available use 'Unk - unknown'.
status: valid
status modified: 2019-03-20
accepted date: 2019-03-20
in scheme: CDR QaQc Habitats Directive Article 17 Reporting
error type: ERROR

Incorrect data format.
type: Concept
notation: S069
definition: Numeric field, only decimals greater or equal 0 are permitted.
status: valid
status modified: 2019-03-20
accepted date: 2019-03-20
in scheme: CDR QaQc Habitats Directive Article 17 Reporting
error type: ERROR

Incorrect data format.
type: Concept
notation: S070
definition: Numeric field, only decimals greater or equal 0 are permitted.
status: valid
status modified: 2019-03-20
accepted date: 2019-03-20
in scheme: CDR QaQc Habitats Directive Article 17 Reporting
error type: ERROR

5.4b Short-term trend Magnitude - max should be greater or equal min.
type: Concept
notation: S071
status: valid
status modified: 2019-03-20
accepted date: 2019-03-20
in scheme: CDR QaQc Habitats Directive Article 17 Reporting
error type: ERROR

Invalid code.
type: Concept
notation: S072
definition: Please check the vocabulary methodsUsed.
status: valid
status modified: 2019-03-20
accepted date: 2019-03-20
in scheme: CDR QaQc Habitats Directive Article 17 Reporting
error type: BLOCKER

Incoherent information.
type: Concept
notation: S073
definition: Inconsistent values provided in fields 5.3 Short-term trend Direction and 5.5 Short-term trend Method used. When the method is 'AbsentData - Insufficient or no data available', the trend cannot be defined. If you want to report a trend as stable, increasing or decreasing based on a method using limited data, please select 'estimateExpert - Based mainly on expert opinion with very limited data' for the method used.
status: valid
status modified: 2019-03-20
accepted date: 2019-03-20
in scheme: CDR QaQc Habitats Directive Article 17 Reporting
error type: WARNING

Mandatory information missing.
type: Concept
notation: S074
definition: The method should be provided. In case the information to be reported in this section is not available use 'AbsentData - Insufficient or no data available'.
status: valid
status modified: 2019-03-20
accepted date: 2019-03-20
in scheme: CDR QaQc Habitats Directive Article 17 Reporting
error type: ERROR

Incorrect data format.
type: Concept
notation: S075
definition: Incorrect data format, it must be YYYY-YYYY.
status: valid
status modified: 2019-03-20
accepted date: 2019-03-20
in scheme: CDR QaQc Habitats Directive Article 17 Reporting
error type: ERROR

Incoherent information.
type: Concept
notation: S076
definition: Year1 should be lower or equal than year2.
status: valid
status modified: 2019-03-20
accepted date: 2019-03-20
in scheme: CDR QaQc Habitats Directive Article 17 Reporting
error type: ERROR

Invalid code.
type: Concept
notation: S077
definition: Please check the vocabulary trends.
status: valid
status modified: 2019-03-20
accepted date: 2019-03-20
in scheme: CDR QaQc Habitats Directive Article 17 Reporting
error type: BLOCKER

Incorrect data format.
type: Concept
notation: S078
definition: Numeric field, only decimals greater or equal 0 are permitted.
status: valid
status modified: 2019-03-20
accepted date: 2019-03-20
in scheme: CDR QaQc Habitats Directive Article 17 Reporting
error type: ERROR

Incorrect data format.
type: Concept
notation: S079
definition: Numeric field, only decimals greater or equal 0 are permitted.
status: valid
status modified: 2019-03-20
accepted date: 2019-03-20
in scheme: CDR QaQc Habitats Directive Article 17 Reporting
error type: ERROR

5.8b Long-term trend Magnitude - max should be greater or equal min.
type: Concept
notation: S080
status: valid
status modified: 2019-03-20
accepted date: 2019-03-20
in scheme: CDR QaQc Habitats Directive Article 17 Reporting
error type: ERROR

Invalid code.
type: Concept
notation: S081
definition: Please check the vocabulary methodsUsed.
status: valid
status modified: 2019-03-20
accepted date: 2019-03-20
in scheme: CDR QaQc Habitats Directive Article 17 Reporting
error type: BLOCKER

Only one of 5.10a, b or c Favourable reference range should be filled in.
type: Concept
notation: S082
definition: If an operator is used, there is no need to insert a value. If the value is provided for range in km2, no operator should be used. Moreover, the use of 'x - unknown' is not compatible with the use of value or operators.
status: valid
status modified: 2019-03-20
accepted date: 2019-03-20
in scheme: CDR QaQc Habitats Directive Article 17 Reporting
error type: ERROR

Mandatory information missing.
type: Concept
notation: S083
definition: Information on Favourable reference range should be provided (5.10a, b or c). In case the information to be reported in this section is not available use 'x - unknown' in 5.10c, knowing the use of operators should help to reduce the use of 'unknown' to a minimum.
status: valid
status modified: 2019-03-20
accepted date: 2019-03-20
in scheme: CDR QaQc Habitats Directive Article 17 Reporting
error type: ERROR

Incorrect data format.
type: Concept
notation: S084
definition: Numeric field, only decimals greater than 0 is permitted.
status: valid
status modified: 2019-03-20
accepted date: 2019-03-20
in scheme: CDR QaQc Habitats Directive Article 17 Reporting
error type: ERROR

Incoherent information.
type: Concept
notation: S085
definition: The Favourable reference range is smaller than 5.1 Surface area. Check whether this is on purpose.
status: valid
status modified: 2019-03-20
accepted date: 2019-03-20
in scheme: CDR QaQc Habitats Directive Article 17 Reporting
error type: WARNING

Invalid code.
type: Concept
notation: S086
definition: Please check the vocabulary favourableOperator.
status: valid
status modified: 2019-03-20
accepted date: 2019-03-20
in scheme: CDR QaQc Habitats Directive Article 17 Reporting
error type: ERROR

Invalid code.
type: Concept
notation: S087
definition: Only 'x - unknown' is allowed in this section.
status: valid
status modified: 2019-03-20
accepted date: 2019-03-20
in scheme: CDR QaQc Habitats Directive Article 17 Reporting
error type: BLOCKER

Invalid code.
type: Concept
notation: S088
definition: Please check the vocabulary reasonChange.
status: valid
status modified: 2019-03-20
accepted date: 2019-03-20
in scheme: CDR QaQc Habitats Directive Article 17 Reporting
error type: BLOCKER

Incoherent information.
type: Concept
notation: S089
definition: Incoherent information in this section. If 'noChange' is selected, there is no need to explain the nature of change.
status: valid
status modified: 2019-03-20
accepted date: 2019-03-20
in scheme: CDR QaQc Habitats Directive Article 17 Reporting
error type: ERROR

Incoherent information.
type: Concept
notation: S090
definition: Incoherent information in this section. Only one main reason is expected and should be part of the reported reasons.
status: valid
status modified: 2019-03-20
accepted date: 2019-03-20
in scheme: CDR QaQc Habitats Directive Article 17 Reporting
error type: ERROR

Mandatory information missing.
type: Concept
notation: S092
definition: Indicate if there is any change since the previous reporting period (2007-2012) in the range surface area reported. Report 'noChange' if the answer to the question: 'Is there a change between reporting periods?' is 'No'. Provide the nature of that change (more than one option can be chosen) if the answer is 'Yes'.
status: valid
status modified: 2019-03-20
accepted date: 2019-03-20
in scheme: CDR QaQc Habitats Directive Article 17 Reporting
error type: ERROR

Incorrect data format.
type: Concept
notation: S093
definition: Incorrect data format, it must be YYYY or YYYY-YYYY.
status: valid
status modified: 2019-03-20
accepted date: 2019-03-20
in scheme: CDR QaQc Habitats Directive Article 17 Reporting
error type: ERROR

Incoherent information.
type: Concept
notation: S094
definition: Year1 should be lower or equal than year2.
status: valid
status modified: 2019-03-20
accepted date: 2019-03-20
in scheme: CDR QaQc Habitats Directive Article 17 Reporting
error type: ERROR

Mandatory information missing.
type: Concept
notation: S095
definition: The year or period should be provided.
status: valid
status modified: 2019-03-20
accepted date: 2019-03-20
in scheme: CDR QaQc Habitats Directive Article 17 Reporting
error type: ERROR

Invalid code.
type: Concept
notation: S096
definition: Please check the vocabulary populationUnits.
status: valid
status modified: 2019-03-20
accepted date: 2019-03-20
in scheme: CDR QaQc Habitats Directive Article 17 Reporting
error type: BLOCKER

Incoherent information.
type: Concept
notation: S097
definition: The reported population unit differs with the recommended unit in the checklist on the reference portal. If a Member State wishes to report population size using a different unit this can be reported in field 6.4, but this must be in addition to the reporting unit specified in the checklist and not as an alternative.
status: valid
status modified: 2019-03-20
accepted date: 2019-03-20
in scheme: CDR QaQc Habitats Directive Article 17 Reporting
error type: ERROR

Incoherent information.
type: Concept
notation: S098
definition: Population size unit (6.2a) cannot be empty when Population size (6.2b,c,d) is provided.
status: valid
status modified: 2019-03-20
accepted date: 2019-03-20
in scheme: CDR QaQc Habitats Directive Article 17 Reporting
error type: ERROR

Mandatory information missing.
type: Concept
notation: S099
definition: Population size unit should be provided.
status: valid
status modified: 2019-03-20
accepted date: 2019-03-20
in scheme: CDR QaQc Habitats Directive Article 17 Reporting
error type: ERROR

Incorrect data format.
type: Concept
notation: S100
definition: Numeric field, only decimals greater or equal 0 are permitted.
status: valid
status modified: 2019-03-20
accepted date: 2019-03-20
in scheme: CDR QaQc Habitats Directive Article 17 Reporting
error type: ERROR

Incorrect data format.
type: Concept
notation: S101
definition: Numeric field, only decimals greater or equal 0 are permitted.
status: valid
status modified: 2019-03-20
accepted date: 2019-03-20
in scheme: CDR QaQc Habitats Directive Article 17 Reporting
error type: ERROR

6.2c Population size - max should be greater or equal min.
type: Concept
notation: S102
status: valid
status modified: 2019-03-20
accepted date: 2019-03-20
in scheme: CDR QaQc Habitats Directive Article 17 Reporting
error type: ERROR

Incorrect data format.
type: Concept
notation: S103
definition: Numeric field, only decimals greater or equal 0 are permitted.
status: valid
status modified: 2019-03-20
accepted date: 2019-03-20
in scheme: CDR QaQc Habitats Directive Article 17 Reporting
error type: ERROR

Mandatory information missing.
type: Concept
notation: S104
definition: Population size should be provided as interval (6.2b, c) and/or single value (6.2d). When only a minimum (or maximum) value of population size is known (e.g. through expert opinion) this should be entered in the 'Best single value' field and NOT the '(b) Minimum' or '(c) Maximum' fields.
status: valid
status modified: 2019-03-20
accepted date: 2019-03-20
in scheme: CDR QaQc Habitats Directive Article 17 Reporting
error type: ERROR

Invalid code.
type: Concept
notation: S105
definition: Please check the vocabulary typeEstimate. The value 'mean - multi-year mean' is allowed in this section.
status: valid
status modified: 2019-03-20
accepted date: 2019-03-20
in scheme: CDR QaQc Habitats Directive Article 17 Reporting
error type: BLOCKER

Incoherent information.
type: Concept
notation: S106
definition: Type of estimate was provided although there is no entry for population size (6.2b,c,d). Check coherence between these two fields. If both interval (6.2b 'Minimum' and 6.2c 'Maximum') and a single value (6.2d 'Best single value') are provided, field 6.3 'Type of estimate' should correspond to the more accurate estimate. This should be noted in 6.17 'Additional information'.
status: valid
status modified: 2019-03-20
accepted date: 2019-03-20
in scheme: CDR QaQc Habitats Directive Article 17 Reporting
error type: WARNING

Mandatory information missing.
type: Concept
notation: S107
definition: The type of estimate for population size should be provided.
status: valid
status modified: 2019-03-20
accepted date: 2019-03-20
in scheme: CDR QaQc Habitats Directive Article 17 Reporting
error type: ERROR

Invalid code.
type: Concept
notation: S108
definition: Please check the vocabulary populationUnits.
status: valid
status modified: 2019-03-20
accepted date: 2019-03-20
in scheme: CDR QaQc Habitats Directive Article 17 Reporting
error type: ERROR

Incoherent information.
type: Concept
notation: S109
definition: Additional population size unit (6.4a) cannot be empty when Additional population size (6.4b,c,d) is provided.
status: valid
status modified: 2019-03-20
accepted date: 2019-03-20
in scheme: CDR QaQc Habitats Directive Article 17 Reporting
error type: ERROR

Incorrect data format.
type: Concept
notation: S110
definition: Numeric field, only decimals greater or equal 0 are permitted.
status: valid
status modified: 2019-03-20
accepted date: 2019-03-20
in scheme: CDR QaQc Habitats Directive Article 17 Reporting
error type: ERROR

Incorrect data format.
type: Concept
notation: S111
definition: Numeric field, only decimals greater or equal 0 are permitted.
status: valid
status modified: 2019-03-20
accepted date: 2019-03-20
in scheme: CDR QaQc Habitats Directive Article 17 Reporting
error type: ERROR

6.4c Additional population size - max should be greater or equal min.
type: Concept
notation: S112
status: valid
status modified: 2019-03-20
accepted date: 2019-03-20
in scheme: CDR QaQc Habitats Directive Article 17 Reporting
error type: ERROR

Invalid code.
type: Concept
notation: S113
definition: Please check the vocabulary typeEstimate. The value 'mean - multi-year mean' is allowed in this section.
status: valid
status modified: 2019-03-20
accepted date: 2019-03-20
in scheme: CDR QaQc Habitats Directive Article 17 Reporting
error type: BLOCKER

Invalid code.
type: Concept
notation: S114
definition: Please check the vocabulary methodsUsed.
status: valid
status modified: 2019-03-20
accepted date: 2019-03-20
in scheme: CDR QaQc Habitats Directive Article 17 Reporting
error type: BLOCKER

Incoherent information.
type: Concept
notation: S115
definition: 6.3 Type of estimate should be empty when Population size Method used is 'AbsentData - Insufficient or no data available'. When the method is assessed as 'AbsentData - Insufficient or no data available', the type of estimate used for the population size cannot be defined. If you want to report an estimate based on a method using limited data, please select 'estimateExpert - Based mainly on expert opinion with very limited data' for the method used.
status: valid
status modified: 2019-03-20
accepted date: 2019-03-20
in scheme: CDR QaQc Habitats Directive Article 17 Reporting
error type: WARNING

Mandatory information missing.
type: Concept
notation: S116
definition: The method should be provided. In case the information to be reported in this section is not available use 'AbsentData - Insufficient or no data available'.
status: valid
status modified: 2019-03-20
accepted date: 2019-03-20
in scheme: CDR QaQc Habitats Directive Article 17 Reporting
error type: ERROR

Incorrect data format.
type: Concept
notation: S117
definition: Incorrect data format, it must be YYYY-YYYY.
status: valid
status modified: 2019-03-20
accepted date: 2019-03-20
in scheme: CDR QaQc Habitats Directive Article 17 Reporting
error type: ERROR

Incoherent information.
type: Concept
notation: S118
definition: Year1 should be lower or equal than year2.
status: valid
status modified: 2019-03-20
accepted date: 2019-03-20
in scheme: CDR QaQc Habitats Directive Article 17 Reporting
error type: ERROR

Mandatory information missing.
type: Concept
notation: S119
definition: The period should be provided.
status: valid
status modified: 2019-03-20
accepted date: 2019-03-20
in scheme: CDR QaQc Habitats Directive Article 17 Reporting
error type: ERROR

Invalid code.
type: Concept
notation: S120
definition: Please check the vocabulary trends.
status: valid
status modified: 2019-03-20
accepted date: 2019-03-20
in scheme: CDR QaQc Habitats Directive Article 17 Reporting
error type: BLOCKER

Mandatory information missing.
type: Concept
notation: S121
definition: Trend should be provided. In case the information to be reported in this section is not available use 'Unk - unknown'.
status: valid
status modified: 2019-03-20
accepted date: 2019-03-20
in scheme: CDR QaQc Habitats Directive Article 17 Reporting
error type: ERROR

Incorrect data format.
type: Concept
notation: S122
definition: Numeric field, only decimals greater or equal 0 are permitted.
status: valid
status modified: 2019-03-20
accepted date: 2019-03-20
in scheme: CDR QaQc Habitats Directive Article 17 Reporting
error type: ERROR

Incorrect data format.
type: Concept
notation: S123
definition: Numeric field, only decimals greater or equal 0 are permitted.
status: valid
status modified: 2019-03-20
accepted date: 2019-03-20
in scheme: CDR QaQc Habitats Directive Article 17 Reporting
error type: ERROR

6.9b Short-term trend Magnitude - max should be greater or equal min.
type: Concept
notation: S124
status: valid
status modified: 2019-03-20
accepted date: 2019-03-20
in scheme: CDR QaQc Habitats Directive Article 17 Reporting
error type: ERROR

Incorrect data format.
type: Concept
notation: S125
definition: Numeric field, only decimals greater or equal 0 are permitted.
status: valid
status modified: 2019-03-20
accepted date: 2019-03-20
in scheme: CDR QaQc Habitats Directive Article 17 Reporting
error type: ERROR

Invalid code.
type: Concept
notation: S126
definition: Please check the vocabulary methodsUsed.
status: valid
status modified: 2019-03-20
accepted date: 2019-03-20
in scheme: CDR QaQc Habitats Directive Article 17 Reporting
error type: BLOCKER

Incoherent information.
type: Concept
notation: S127
definition: Inconsistent values provided in fields 6.8 Short-term trend Direction and 6.10 Short-term trend Method used. When the method is assessed as 'AbsentData - Insufficient or no data available', the trend cannot be defined. If you want to report a trend as stable, increasing or decreasing based on a method using limited data, please select 'estimateExpert - Based mainly on expert opinion with very limited data' for the method used.
status: valid
status modified: 2019-03-20
accepted date: 2019-03-20
in scheme: CDR QaQc Habitats Directive Article 17 Reporting
error type: WARNING

Mandatory information missing.
type: Concept
notation: S128
definition: The method should be provided. In case the information to be reported in this section is not available use 'AbsentData - Insufficient or no data available'.
status: valid
status modified: 2019-03-20
accepted date: 2019-03-20
in scheme: CDR QaQc Habitats Directive Article 17 Reporting
error type: ERROR

Incorrect data format.
type: Concept
notation: S129
definition: Incorrect data format, it must be YYYY-YYYY.
status: valid
status modified: 2019-03-20
accepted date: 2019-03-20
in scheme: CDR QaQc Habitats Directive Article 17 Reporting
error type: ERROR

Incoherent information.
type: Concept
notation: S130
definition: Year1 should be lower or equal than year2.
status: valid
status modified: 2019-03-20
accepted date: 2019-03-20
in scheme: CDR QaQc Habitats Directive Article 17 Reporting
error type: ERROR

Invalid code.
type: Concept
notation: S131
definition: Please check the vocabulary trends.
status: valid
status modified: 2019-03-20
accepted date: 2019-03-20
in scheme: CDR QaQc Habitats Directive Article 17 Reporting
error type: BLOCKER

Incorrect data format.
type: Concept
notation: S132
definition: Numeric field, only decimals greater or equal 0 are permitted.
status: valid
status modified: 2019-03-20
accepted date: 2019-03-20
in scheme: CDR QaQc Habitats Directive Article 17 Reporting
error type: ERROR

Incorrect data format.
type: Concept
notation: S133
definition: Numeric field, only decimals greater or equal 0 are permitted.
status: valid
status modified: 2019-03-20
accepted date: 2019-03-20
in scheme: CDR QaQc Habitats Directive Article 17 Reporting
error type: ERROR

6.13b Long-term trend Magnitude - max should be greater or equal min.
type: Concept
notation: S134
status: valid
status modified: 2019-03-20
accepted date: 2019-03-20
in scheme: CDR QaQc Habitats Directive Article 17 Reporting
error type: ERROR

Incorrect data format.
type: Concept
notation: S135
definition: Numeric field, only decimals greater or equal 0 are permitted.
status: valid
status modified: 2019-03-20
accepted date: 2019-03-20
in scheme: CDR QaQc Habitats Directive Article 17 Reporting
error type: ERROR

Invalid code.
type: Concept
notation: S136
definition: Please check the vocabulary methodsUsed.
status: valid
status modified: 2019-03-20
accepted date: 2019-03-20
in scheme: CDR QaQc Habitats Directive Article 17 Reporting
error type: BLOCKER

Only one of 6.15a1, b or c Favourable reference population should be filled in.
type: Concept
notation: S137
definition: If an operator is used, there is no need to insert a value. If the value is provided for population size, no operator should be used. Moreover, the use of 'x - unknown' is not compatible with the use of value or operators.
status: valid
status modified: 2019-03-20
accepted date: 2019-03-20
in scheme: CDR QaQc Habitats Directive Article 17 Reporting
error type: ERROR

Mandatory information missing.
type: Concept
notation: S138
definition: Information on Favourable reference population should be provided (6.15a, b or c). In case the information to be reported in this section is not available use 'x - unknown' in 6.15c, knowing the use of operators should help to reduce the use of 'unknown' to a minimum.
status: valid
status modified: 2019-03-20
accepted date: 2019-03-20
in scheme: CDR QaQc Habitats Directive Article 17 Reporting
error type: ERROR

Incorrect data format.
type: Concept
notation: S139
definition: Numeric field, only decimals greater than 0 is permitted.
status: valid
status modified: 2019-03-20
accepted date: 2019-03-20
in scheme: CDR QaQc Habitats Directive Article 17 Reporting
error type: ERROR

Incoherent information.
type: Concept
notation: S140
definition: The Favourable reference population size is smaller than 6.2 current population size. Check whether this is on purpose.
status: valid
status modified: 2019-03-20
accepted date: 2019-03-20
in scheme: CDR QaQc Habitats Directive Article 17 Reporting
error type: WARNING

Incoherent information.
type: Concept
notation: S141
definition: The Favourable reference population size is smaller than 6.4 current additional population size. Check whether this is on purpose.
status: valid
status modified: 2019-03-20
accepted date: 2019-03-20
in scheme: CDR QaQc Habitats Directive Article 17 Reporting
error type: WARNING

Invalid code.
type: Concept
notation: S142
definition: Please check the vocabulary populationUnits.
status: valid
status modified: 2019-03-20
accepted date: 2019-03-20
in scheme: CDR QaQc Habitats Directive Article 17 Reporting
error type: ERROR

Incoherent information.
type: Concept
notation: S143
definition: The Favourable reference population size unit should correspond to the current recommended or additional population size (SpecReg.6.2a, SpecReg.6.4a).
status: valid
status modified: 2019-03-20
accepted date: 2019-03-20
in scheme: CDR QaQc Habitats Directive Article 17 Reporting
error type: ERROR

Invalid code.
type: Concept
notation: S144
definition: Please check the vocabulary favourableOperator.
status: valid
status modified: 2019-03-20
accepted date: 2019-03-20
in scheme: CDR QaQc Habitats Directive Article 17 Reporting
error type: BLOCKER

Invalid code.
type: Concept
notation: S145
definition: Only 'x - unknown' is allowed in this section.
status: valid
status modified: 2019-03-20
accepted date: 2019-03-20
in scheme: CDR QaQc Habitats Directive Article 17 Reporting
error type: BLOCKER

Invalid code.
type: Concept
notation: S146
definition: Please check the vocabulary reasonChange.
status: valid
status modified: 2019-03-20
accepted date: 2019-03-20
in scheme: CDR QaQc Habitats Directive Article 17 Reporting
error type: BLOCKER

Incoherent information.
type: Concept
notation: S147
definition: Incoherent information in this section. If 'noChange' is selected, there is no need to explain the nature of change.
status: valid
status modified: 2019-03-20
accepted date: 2019-03-20
in scheme: CDR QaQc Habitats Directive Article 17 Reporting
error type: ERROR

Incoherent information.
type: Concept
notation: S148
definition: Incoherent information in this section. Only one main reason is expected and should be part of the reported reasons.
status: valid
status modified: 2019-03-20
accepted date: 2019-03-20
in scheme: CDR QaQc Habitats Directive Article 17 Reporting
error type: ERROR

Mandatory information missing.
type: Concept
notation: S150
definition: Indicate if there is any change since the previous reporting period (2007-2012) in the population size reported. Report 'noChange' if the answer to the question: 'Is there a change between reporting periods?' is 'No'. Provide the nature of that change (more than one option can be chosen) if the answer is 'Yes'.
status: valid
status modified: 2019-03-20
accepted date: 2019-03-20
in scheme: CDR QaQc Habitats Directive Article 17 Reporting
error type: ERROR

Invalid code.
type: Concept
notation: S151
definition: Please check the vocabulary yesNoUnknown.
status: valid
status modified: 2019-03-20
accepted date: 2019-03-20
in scheme: CDR QaQc Habitats Directive Article 17 Reporting
error type: BLOCKER

Mandatory information missing.
type: Concept
notation: S152
definition: Information on the sufficiency and quality of occupied habitat area should be provided.
status: valid
status modified: 2019-03-20
accepted date: 2019-03-20
in scheme: CDR QaQc Habitats Directive Article 17 Reporting
error type: ERROR

Invalid code.
type: Concept
notation: S153
definition: Please check the vocabulary yesNoUnknown.
status: valid
status modified: 2019-03-20
accepted date: 2019-03-20
in scheme: CDR QaQc Habitats Directive Article 17 Reporting
error type: BLOCKER

Incoherent information.
type: Concept
notation: S154
definition: Incoherent information in this section. Information on unoccupied habitat area is only expected if the answer to the question: 'Are area and quality of the occupied habitat sufficient' is 'N - No'.
status: valid
status modified: 2019-03-20
accepted date: 2019-03-20
in scheme: CDR QaQc Habitats Directive Article 17 Reporting
error type: WARNING

Mandatory information missing.
type: Concept
notation: S155
definition: Information related to unoccupied habitat area should be provided.
status: valid
status modified: 2019-03-20
accepted date: 2019-03-20
in scheme: CDR QaQc Habitats Directive Article 17 Reporting
error type: ERROR

Invalid code.
type: Concept
notation: S156
definition: Please check the vocabulary methodsUsed.
status: valid
status modified: 2019-03-20
accepted date: 2019-03-20
in scheme: CDR QaQc Habitats Directive Article 17 Reporting
error type: BLOCKER

Mandatory information missing.
type: Concept
notation: S157
definition: The method should be provided. In case the information to be reported in this section is not available use 'AbsentData - Insufficient or no data available'.
status: valid
status modified: 2019-03-20
accepted date: 2019-03-20
in scheme: CDR QaQc Habitats Directive Article 17 Reporting
error type: ERROR

Incorrect data format.
type: Concept
notation: S158
definition: Incorrect data format, it must be YYYY-YYYY.
status: valid
status modified: 2019-03-20
accepted date: 2019-03-20
in scheme: CDR QaQc Habitats Directive Article 17 Reporting
error type: ERROR

Incoherent information.
type: Concept
notation: S159
definition: Year1 should be lower or equal than year2.
status: valid
status modified: 2019-03-20
accepted date: 2019-03-20
in scheme: CDR QaQc Habitats Directive Article 17 Reporting
error type: ERROR

Mandatory information missing.
type: Concept
notation: S160
definition: The period should be provided.
status: valid
status modified: 2019-03-20
accepted date: 2019-03-20
in scheme: CDR QaQc Habitats Directive Article 17 Reporting
error type: ERROR

Invalid code.
type: Concept
notation: S161
definition: Please check the vocabulary trends.
status: valid
status modified: 2019-03-20
accepted date: 2019-03-20
in scheme: CDR QaQc Habitats Directive Article 17 Reporting
error type: BLOCKER

Mandatory information missing.
type: Concept
notation: S162
definition: Trend should be provided. In case the information to be reported in this section is not available use 'Unk - unknown'.
status: valid
status modified: 2019-03-20
accepted date: 2019-03-20
in scheme: CDR QaQc Habitats Directive Article 17 Reporting
error type: ERROR

Invalid code.
type: Concept
notation: S163
definition: Please check the vocabulary methodsUsed.
status: valid
status modified: 2019-03-20
accepted date: 2019-03-20
in scheme: CDR QaQc Habitats Directive Article 17 Reporting
error type: BLOCKER

Incoherent information.
type: Concept
notation: S164
definition: Inconsistent values provided in fields 7.4 Short-term trend Direction and 7.5 Short-term trend Method used. When the method is assessed as 'AbsentData - Insufficient or no data available', the trend cannot be defined. If you want to report a trend as stable, increasing or decreasing based on a method using limited data, please select 'estimateExpert - Based mainly on expert opinion with very limited data' for the method used.
status: valid
status modified: 2019-03-20
accepted date: 2019-03-20
in scheme: CDR QaQc Habitats Directive Article 17 Reporting
error type: WARNING

Mandatory information missing.
type: Concept
notation: S165
definition: The method should be provided. In case the information to be reported in this section is not available use 'AbsentData - Insufficient or no data available'.
status: valid
status modified: 2019-03-20
accepted date: 2019-03-20
in scheme: CDR QaQc Habitats Directive Article 17 Reporting
error type: ERROR

Incorrect data format.
type: Concept
notation: S166
definition: Incorrect data format, it must be YYYY-YYYY.
status: valid
status modified: 2019-03-20
accepted date: 2019-03-20
in scheme: CDR QaQc Habitats Directive Article 17 Reporting
error type: ERROR

Incoherent information.
type: Concept
notation: S167
definition: Year1 should be lower or equal than year2.
status: valid
status modified: 2019-03-20
accepted date: 2019-03-20
in scheme: CDR QaQc Habitats Directive Article 17 Reporting
error type: ERROR

Invalid code.
type: Concept
notation: S168
definition: Please check the vocabulary trends.
status: valid
status modified: 2019-03-20
accepted date: 2019-03-20
in scheme: CDR QaQc Habitats Directive Article 17 Reporting
error type: BLOCKER

Invalid code.
type: Concept
notation: S169
definition: Please check the vocabulary methodsUsed.
status: valid
status modified: 2019-03-20
accepted date: 2019-03-20
in scheme: CDR QaQc Habitats Directive Article 17 Reporting
error type: BLOCKER

Invalid code.
type: Concept
notation: S170
definition: Please check the vocabulary threats.
status: valid
status modified: 2019-03-20
accepted date: 2019-03-20
in scheme: CDR QaQc Habitats Directive Article 17 Reporting
error type: BLOCKER

More entries than permitted.
type: Concept
notation: S171
definition: More entries than permitted. Maximum of 10 pressures per biogeographical assessment.
status: valid
status modified: 2019-03-20
accepted date: 2019-03-20
in scheme: CDR QaQc Habitats Directive Article 17 Reporting
error type: ERROR

More entries than permitted.
type: Concept
notation: S172
definition: More entries than permitted. Maximum of 10 threats per biogeographical assessment.
status: valid
status modified: 2019-03-20
accepted date: 2019-03-20
in scheme: CDR QaQc Habitats Directive Article 17 Reporting
error type: ERROR

More entries than permitted.
type: Concept
notation: S173
definition: More entries than permitted. Maximum of 5 pressures with 'H - High importance' per biogeographical assessment.
status: valid
status modified: 2019-03-20
accepted date: 2019-03-20
in scheme: CDR QaQc Habitats Directive Article 17 Reporting
error type: ERROR

More entries than permitted.
type: Concept
notation: S174
definition: More entries than permitted. Maximum of 5 threats with 'H - High importance' per biogeographical assessment.
status: valid
status modified: 2019-03-20
accepted date: 2019-03-20
in scheme: CDR QaQc Habitats Directive Article 17 Reporting
error type: ERROR

Incoherent information.
type: Concept
notation: S175
definition: Incoherent information in this section. Code 'Xu - Unknown pressure' or 'Xxp - No pressures ' should be reported as a pressure, not as a threat.
status: valid
status modified: 2019-03-20
accepted date: 2019-03-20
in scheme: CDR QaQc Habitats Directive Article 17 Reporting
error type: ERROR

Incoherent information.
type: Concept
notation: S176
definition: Incoherent information in this section. Code 'Xt - No information on threats' used but other threats listed.
status: valid
status modified: 2019-03-20
accepted date: 2019-03-20
in scheme: CDR QaQc Habitats Directive Article 17 Reporting
error type: WARNING

Incoherent information.
type: Concept
notation: S177
definition: Incoherent information in this section. Code 'Xp - No information on pressures' used but other pressures listed.
status: valid
status modified: 2019-03-20
accepted date: 2019-03-20
in scheme: CDR QaQc Habitats Directive Article 17 Reporting
error type: WARNING

Mandatory information missing.
type: Concept
notation: S178
definition: The list of pressures and/or threats should be provided. Report 'Xp - No information on pressures' and/or 'Xt - No information on threats' for missing information.
status: valid
status modified: 2019-03-20
accepted date: 2019-03-20
in scheme: CDR QaQc Habitats Directive Article 17 Reporting
error type: ERROR

Mandatory information missing.
type: Concept
notation: S179
definition: The list of threats should be provided. Report 'Xt - No information on threats' for missing information.
status: valid
status modified: 2019-03-20
accepted date: 2019-03-20
in scheme: CDR QaQc Habitats Directive Article 17 Reporting
error type: ERROR

Mandatory information missing.
type: Concept
notation: S180
definition: The list of pressures should be provided. Report 'Xp - No information on pressures' for missing information.
status: valid
status modified: 2019-03-20
accepted date: 2019-03-20
in scheme: CDR QaQc Habitats Directive Article 17 Reporting
error type: ERROR

Invalid code.
type: Concept
notation: S181
definition: Please check the vocabulary ranking.
status: valid
status modified: 2019-03-20
accepted date: 2019-03-20
in scheme: CDR QaQc Habitats Directive Article 17 Reporting
error type: BLOCKER

Incoherent information.
type: Concept
notation: S182
definition: Incoherent information in this section. Ranking is provided although no code indicated for pressure and/or threat.
status: valid
status modified: 2019-03-20
accepted date: 2019-03-20
in scheme: CDR QaQc Habitats Directive Article 17 Reporting
error type: ERROR

Mandatory information missing.
type: Concept
notation: S183
definition: This field cannot be empty unless the reported code is 'Xp', 'Xt', 'Xu', 'Xxp' or 'Xxt'.
status: valid
status modified: 2019-03-20
accepted date: 2019-03-20
in scheme: CDR QaQc Habitats Directive Article 17 Reporting
error type: ERROR

Invalid code.
type: Concept
notation: S184
definition: Code should be 'p' = pressure or 't' = threat.
status: valid
status modified: 2019-03-20
accepted date: 2019-03-20
in scheme: CDR QaQc Habitats Directive Article 17 Reporting
error type: ERROR

Incoherent information.
type: Concept
notation: S185
definition: Incoherent information in this section. Type of pressure/threat is provided although no code indicated for pressure and/or threat.
status: valid
status modified: 2019-03-20
accepted date: 2019-03-20
in scheme: CDR QaQc Habitats Directive Article 17 Reporting
error type: ERROR

Mandatory information missing.
type: Concept
notation: S186
definition: The type of pressure or threats should be systematically provided. Code should be 'p' = pressure or 't' = threat.
status: valid
status modified: 2019-03-20
accepted date: 2019-03-20
in scheme: CDR QaQc Habitats Directive Article 17 Reporting
error type: ERROR

Invalid code.
type: Concept
notation: S187
definition: Code should be 'Yes' or 'No'.
status: valid
status modified: 2019-03-20
accepted date: 2019-03-20
in scheme: CDR QaQc Habitats Directive Article 17 Reporting
error type: BLOCKER

Mandatory information missing.
type: Concept
notation: S188
definition: Indicate whether measures are needed or not.
status: valid
status modified: 2019-03-20
accepted date: 2019-03-20
in scheme: CDR QaQc Habitats Directive Article 17 Reporting
error type: ERROR

Incoherent information.
type: Concept
notation: S189
definition: Incoherent information in this section. Status of measures is not expected if no measures are needed.
status: valid
status modified: 2019-03-20
accepted date: 2019-03-20
in scheme: CDR QaQc Habitats Directive Article 17 Reporting
error type: ERROR

Invalid code.
type: Concept
notation: S190
definition: Please check the vocabulary measuresIdentified.
status: valid
status modified: 2019-03-20
accepted date: 2019-03-20
in scheme: CDR QaQc Habitats Directive Article 17 Reporting
error type: BLOCKER

Mandatory information missing.
type: Concept
notation: S191
definition: Status of measures should be provided if measures are needed.
status: valid
status modified: 2019-03-20
accepted date: 2019-03-20
in scheme: CDR QaQc Habitats Directive Article 17 Reporting
error type: ERROR

Incoherent information.
type: Concept
notation: S192
definition: Incoherent information in this section. The main purpose of measures taken is not expected if no measures are identified and taken.
status: valid
status modified: 2019-03-20
accepted date: 2019-03-20
in scheme: CDR QaQc Habitats Directive Article 17 Reporting
error type: WARNING

Invalid code.
type: Concept
notation: S193
definition: Please check the vocabulary measuresPurposeSpecies.
status: valid
status modified: 2019-03-20
accepted date: 2019-03-20
in scheme: CDR QaQc Habitats Directive Article 17 Reporting
error type: BLOCKER

Incoherent information.
type: Concept
notation: S194
definition: Incoherent information in this section. The main purpose of measures taken is expected if measures are identified and taken.
status: valid
status modified: 2019-03-20
accepted date: 2019-03-20
in scheme: CDR QaQc Habitats Directive Article 17 Reporting
error type: ERROR

Incoherent information.
type: Concept
notation: S195
definition: Incoherent information in this section. Location of measures is not expected if no measures are identified and taken.
status: valid
status modified: 2019-03-20
accepted date: 2019-03-20
in scheme: CDR QaQc Habitats Directive Article 17 Reporting
error type: WARNING

Invalid code.
type: Concept
notation: S196
definition: Please check the vocabulary measuresLocation.
status: valid
status modified: 2019-03-20
accepted date: 2019-03-20
in scheme: CDR QaQc Habitats Directive Article 17 Reporting
error type: BLOCKER

Incoherent information.
type: Concept
notation: S197
definition: Incoherent information in this section. The location of the measures is expected if measures are identified and taken.
status: valid
status modified: 2019-03-20
accepted date: 2019-03-20
in scheme: CDR QaQc Habitats Directive Article 17 Reporting
error type: ERROR

Incoherent information.
type: Concept
notation: S198
definition: Incoherent information in this section. Time frame of response to measures is not expected if no measures are identified and taken.
status: valid
status modified: 2019-03-20
accepted date: 2019-03-20
in scheme: CDR QaQc Habitats Directive Article 17 Reporting
error type: WARNING

Invalid code.
type: Concept
notation: S199
definition: Please check the vocabulary measuresResponse.
status: valid
status modified: 2019-03-20
accepted date: 2019-03-20
in scheme: CDR QaQc Habitats Directive Article 17 Reporting
error type: BLOCKER

Mandatory information missing.
type: Concept
notation: S200
definition: The time frame of the response to measures should be provided if measures are identified and taken.
status: valid
status modified: 2019-03-20
accepted date: 2019-03-20
in scheme: CDR QaQc Habitats Directive Article 17 Reporting
error type: ERROR

Invalid code.
type: Concept
notation: S201
definition: Please check the vocabulary measures.
status: valid
status modified: 2019-03-20
accepted date: 2019-03-20
in scheme: CDR QaQc Habitats Directive Article 17 Reporting
error type: BLOCKER

More entries than permitted.
type: Concept
notation: S203
definition: More entries than permitted. Maximum of 10 measures per biogeographical assessment.
status: valid
status modified: 2019-03-20
accepted date: 2019-03-20
in scheme: CDR QaQc Habitats Directive Article 17 Reporting
error type: ERROR

Mandatory information missing.
type: Concept
notation: S204
definition: The list of measures should be provided if measures are identified and taken.
status: valid
status modified: 2019-03-20
accepted date: 2019-03-20
in scheme: CDR QaQc Habitats Directive Article 17 Reporting
error type: ERROR

Invalid code.
type: Concept
notation: S205
definition: Please check the vocabulary Prospects.
status: valid
status modified: 2019-03-20
accepted date: 2019-03-20
in scheme: CDR QaQc Habitats Directive Article 17 Reporting
error type: BLOCKER

Mandatory information missing.
type: Concept
notation: S206
definition: The future prospects of each of the three parameters should be provided. In case the information to be reported in this section is not available use 'unk - unknown'.
status: valid
status modified: 2019-03-20
accepted date: 2019-03-20
in scheme: CDR QaQc Habitats Directive Article 17 Reporting
error type: ERROR

Invalid code.
type: Concept
notation: S207
definition: Please check the vocabulary Prospects.
status: valid
status modified: 2019-03-20
accepted date: 2019-03-20
in scheme: CDR QaQc Habitats Directive Article 17 Reporting
error type: BLOCKER

Mandatory information missing.
type: Concept
notation: S208
definition: The future prospects of each ofThe three parameters should be provided. In case the information to be reported in this section is not available use 'unk - unknown'.
status: valid
status modified: 2019-03-20
accepted date: 2019-03-20
in scheme: CDR QaQc Habitats Directive Article 17 Reporting
error type: ERROR

Invalid code.
type: Concept
notation: S209
definition: Please check the vocabulary Prospects.
status: valid
status modified: 2019-03-20
accepted date: 2019-03-20
in scheme: CDR QaQc Habitats Directive Article 17 Reporting
error type: BLOCKER

Mandatory information missing.
type: Concept
notation: S210
definition: The future prospects of each of the three parameters should be provided. In case the information to be reported in this section is not available use 'unk - unknown'.
status: valid
status modified: 2019-03-20
accepted date: 2019-03-20
in scheme: CDR QaQc Habitats Directive Article 17 Reporting
error type: ERROR

Invalid code.
type: Concept
notation: S211
definition: Please check the vocabulary assessments.
status: valid
status modified: 2019-03-20
accepted date: 2019-03-20
in scheme: CDR QaQc Habitats Directive Article 17 Reporting
error type: BLOCKER

Incoherent information.
type: Concept
notation: S212
definition: Incoherent information in this section. The conclusion for Range should be 'U2 - Unfavourable - Bad' when range surface area is more than 10% below favourable reference range (reported value in 5.10b is '>> - Much more than').
status: valid
status modified: 2019-03-20
accepted date: 2019-03-20
in scheme: CDR QaQc Habitats Directive Article 17 Reporting
error type: ERROR

Incoherent information.
type: Concept
notation: S213
definition: Incoherent information in this section. The conclusion for Range cannot be 'FV - Favourable' when the trend is decreasing (reported value in 5.3 is 'D - Decreasing').
status: valid
status modified: 2019-03-20
accepted date: 2019-03-20
in scheme: CDR QaQc Habitats Directive Article 17 Reporting
error type: ERROR

Mandatory information missing.
type: Concept
notation: S214
definition: The conclusion for Range should be provided.
status: valid
status modified: 2019-03-20
accepted date: 2019-03-20
in scheme: CDR QaQc Habitats Directive Article 17 Reporting
error type: ERROR

Invalid code.
type: Concept
notation: S215
definition: Please check the vocabulary assessments.
status: valid
status modified: 2019-03-20
accepted date: 2019-03-20
in scheme: CDR QaQc Habitats Directive Article 17 Reporting
error type: BLOCKER

Incoherent information.
type: Concept
notation: S216
definition: Incoherent information in this section. Conclusion for Population should be 'U2 - Unfavourable - Bad' when population size is more than 25% below favourable reference population (reported value in 6.15b is '>> - Much more than').
status: valid
status modified: 2019-03-20
accepted date: 2019-03-20
in scheme: CDR QaQc Habitats Directive Article 17 Reporting
error type: ERROR

Incoherent information.
type: Concept
notation: S217
definition: Incoherent information in this section. The conclusion for Population cannot be 'FV - Favourable' when the trend is decreasing (reported value in 6.8 is 'D - Decreasing').
status: valid
status modified: 2019-03-20
accepted date: 2019-03-20
in scheme: CDR QaQc Habitats Directive Article 17 Reporting
error type: ERROR

Mandatory information missing.
type: Concept
notation: S218
definition: The conclusion for Population should be provided.
status: valid
status modified: 2019-03-20
accepted date: 2019-03-20
in scheme: CDR QaQc Habitats Directive Article 17 Reporting
error type: ERROR

Invalid code.
type: Concept
notation: S219
definition: Please check the vocabulary assessments.
status: valid
status modified: 2019-03-20
accepted date: 2019-03-20
in scheme: CDR QaQc Habitats Directive Article 17 Reporting
error type: BLOCKER

Mandatory information missing.
type: Concept
notation: S220
definition: The conclusion for Habitat for the species should be provided.
status: valid
status modified: 2019-03-20
accepted date: 2019-03-20
in scheme: CDR QaQc Habitats Directive Article 17 Reporting
error type: ERROR

Invalid code.
type: Concept
notation: S221
definition: Please check the vocabulary assessments.
status: valid
status modified: 2019-03-20
accepted date: 2019-03-20
in scheme: CDR QaQc Habitats Directive Article 17 Reporting
error type: BLOCKER

Incoherent information.
type: Concept
notation: S222
definition: Incoherent information in this section. Conclusion for Future prospects should be 'FV - Favourable' if all parameters (10.1a,b,c) have 'good' prospects, or prospects of one parameter is 'unk - unknown' and the other prospects are 'good'.
status: valid
status modified: 2019-03-20
accepted date: 2019-03-20
in scheme: CDR QaQc Habitats Directive Article 17 Reporting
error type: ERROR

Incoherent information.
type: Concept
notation: S223
definition: Incoherent information in this section. Conclusion for Future prospects should be 'U2 - Unfavourable - Bad' if one or more parameters (10.1a,b,c) have 'bad' prospects.
status: valid
status modified: 2019-03-20
accepted date: 2019-03-20
in scheme: CDR QaQc Habitats Directive Article 17 Reporting
error type: ERROR

Incoherent information.
type: Concept
notation: S224
definition: Incoherent information in this section. Conclusion for Future prospects should be 'XX - Unknown' if two or more parameters (10.1a,b,c) are 'unk - unknown' and no parameter with 'bad' prospects.
status: valid
status modified: 2019-03-20
accepted date: 2019-03-20
in scheme: CDR QaQc Habitats Directive Article 17 Reporting
error type: ERROR

Mandatory information missing.
type: Concept
notation: S225
definition: The conclusion for Future prospects should be provided.
status: valid
status modified: 2019-03-20
accepted date: 2019-03-20
in scheme: CDR QaQc Habitats Directive Article 17 Reporting
error type: ERROR

Invalid code.
type: Concept
notation: S226
definition: Please check the vocabulary assessments.
status: valid
status modified: 2019-03-20
accepted date: 2019-03-20
in scheme: CDR QaQc Habitats Directive Article 17 Reporting
error type: BLOCKER

Incoherent information.
type: Concept
notation: S227
definition: Incoherent information in this section. Overall assessment should be 'FV - Favourable' if all assessments of parameters (11.1 to 11.4) are 'FV - Favourable', or three are 'FV - Favourable' and one is 'XX - Unknown'.
status: valid
status modified: 2019-03-20
accepted date: 2019-03-20
in scheme: CDR QaQc Habitats Directive Article 17 Reporting
error type: ERROR

Incoherent information.
type: Concept
notation: S228
definition: Incoherent information in this section. Overall assessment should be 'U2 - Unfavourable - Bad' if at least one assessment of parameters (11.1 to 11.4) is 'U2 - Unfavourable - Bad'.
status: valid
status modified: 2019-03-20
accepted date: 2019-03-20
in scheme: CDR QaQc Habitats Directive Article 17 Reporting
error type: ERROR

Incoherent information.
type: Concept
notation: S229
definition: Incoherent information in this section. Overall assessment should be 'U1 - Unfavourable - Inadequate' if at least one assessment of parameters (11.1 to 11.4) is 'U1 - Unfavourable - Inadequate' and none is 'U2 - Unfavourable - Bad'.
status: valid
status modified: 2019-03-20
accepted date: 2019-03-20
in scheme: CDR QaQc Habitats Directive Article 17 Reporting
error type: ERROR

Mandatory information missing.
type: Concept
notation: S230
definition: Conclusion for Overall assessment of Conservation Status should be provided.
status: valid
status modified: 2019-03-20
accepted date: 2019-03-20
in scheme: CDR QaQc Habitats Directive Article 17 Reporting
error type: ERROR

Mandatory information missing.
type: Concept
notation: S231
definition: Conclusion for Overall assessment of Conservation Status should be provided as other conclusions are provided (11.1 to 11.4).
status: valid
status modified: 2019-03-20
accepted date: 2019-03-20
in scheme: CDR QaQc Habitats Directive Article 17 Reporting
error type: ERROR

Invalid code.
type: Concept
notation: S232
definition: Please check the vocabulary trendsConclusion.
status: valid
status modified: 2019-03-20
accepted date: 2019-03-20
in scheme: CDR QaQc Habitats Directive Article 17 Reporting
error type: BLOCKER

Mandatory information missing.
type: Concept
notation: S233
definition: Overall trend in conservation status should be provided when 11.5 Conclusions - Overall assessment of Conservation Status is not 'XX - Unknown'.
status: valid
status modified: 2019-03-20
accepted date: 2019-03-20
in scheme: CDR QaQc Habitats Directive Article 17 Reporting
error type: ERROR

Invalid code.
type: Concept
notation: S234
definition: Please check the vocabulary reasonChange.
status: valid
status modified: 2019-03-20
accepted date: 2019-03-20
in scheme: CDR QaQc Habitats Directive Article 17 Reporting
error type: BLOCKER

Incoherent information.
type: Concept
notation: S235
definition: Incoherent information in this section. If 'noChange' is selected,There is no need to explain the nature of change.
status: valid
status modified: 2019-03-20
accepted date: 2019-03-20
in scheme: CDR QaQc Habitats Directive Article 17 Reporting
error type: ERROR

Incoherent information.
type: Concept
notation: S236
definition: Incoherent information in this section. Only one main reason is expected and should be part of the reported reasons.
status: valid
status modified: 2019-03-20
accepted date: 2019-03-20
in scheme: CDR QaQc Habitats Directive Article 17 Reporting
error type: ERROR

Mandatory information missing.
type: Concept
notation: S238
definition: Indicate if there is any change since the previous reporting period (2007-2012) in conservation status. Report 'noChange' if the answer to the question: 'Is there a change from the previous reporting round?' is 'No, there is no difference'. Provide the nature of that change (more than one option can be chosen) if the answer is 'Yes'.
status: valid
status modified: 2019-03-20
accepted date: 2019-03-20
in scheme: CDR QaQc Habitats Directive Article 17 Reporting
error type: ERROR

Invalid code.
type: Concept
notation: S239
definition: Please check the vocabulary reasonChange.
status: valid
status modified: 2019-03-20
accepted date: 2019-03-20
in scheme: CDR QaQc Habitats Directive Article 17 Reporting
error type: BLOCKER

Incoherent information.
type: Concept
notation: S240
definition: Incoherent information in this section. If 'noChange' is selected, there is no need to explain the nature of change.
status: valid
status modified: 2019-03-20
accepted date: 2019-03-20
in scheme: CDR QaQc Habitats Directive Article 17 Reporting
error type: ERROR

Incoherent information.
type: Concept
notation: S241
definition: Incoherent information in this section. Only one main reason is expected and should be part of the reported reasons.
status: valid
status modified: 2019-03-20
accepted date: 2019-03-20
in scheme: CDR QaQc Habitats Directive Article 17 Reporting
error type: ERROR

Mandatory information missing.
type: Concept
notation: S243
definition: Indicate if there is any change since the previous reporting period (2007-2012) in trend in conservation status. Report 'noChange' if the answer to the question: 'Is there a change from the previous reporting round?' is 'No,There is no difference'. Provide the nature of that change (more than one option can be chosen) if the answer is 'Yes'.
status: valid
status modified: 2019-03-20
accepted date: 2019-03-20
in scheme: CDR QaQc Habitats Directive Article 17 Reporting
error type: ERROR

Invalid code.
type: Concept
notation: S244
definition: Please check the vocabulary populationUnits.
status: valid
status modified: 2019-03-20
accepted date: 2019-03-20
in scheme: CDR QaQc Habitats Directive Article 17 Reporting
error type: BLOCKER

Incoherent information.
type: Concept
notation: S245
definition: The reported population size unit within Natura 2000 network differs with the reporting unit used in 6.2.
status: valid
status modified: 2019-03-20
accepted date: 2019-03-20
in scheme: CDR QaQc Habitats Directive Article 17 Reporting
error type: ERROR

Incoherent information.
type: Concept
notation: S246
definition: Population size unit within Natura 2000 network (12.1a) cannot be empty when Population size within within Natura 2000 network (12.1b,c,d) is provided.
status: valid
status modified: 2019-03-20
accepted date: 2019-03-20
in scheme: CDR QaQc Habitats Directive Article 17 Reporting
error type: ERROR

Mandatory information missing.
type: Concept
notation: S247
definition: Population size unit within Natura 2000 network should be provided.
status: valid
status modified: 2019-03-20
accepted date: 2019-03-20
in scheme: CDR QaQc Habitats Directive Article 17 Reporting
error type: ERROR

Incorrect data format.
type: Concept
notation: S248
definition: Numeric field, only decimals greater or equal 0 are permitted.
status: valid
status modified: 2019-03-20
accepted date: 2019-03-20
in scheme: CDR QaQc Habitats Directive Article 17 Reporting
error type: ERROR

Incorrect data format.
type: Concept
notation: S249
definition: Numeric field, only decimals greater or equal 0 are permitted.
status: valid
status modified: 2019-03-20
accepted date: 2019-03-20
in scheme: CDR QaQc Habitats Directive Article 17 Reporting
error type: ERROR

12.1c Population size within Natura 2000 network - max should be greater or equal min.
type: Concept
notation: S250
status: valid
status modified: 2019-03-20
accepted date: 2019-03-20
in scheme: CDR QaQc Habitats Directive Article 17 Reporting
error type: ERROR

Incorrect data format.
type: Concept
notation: S251
definition: Numeric field, only decimals greater or equal 0 are permitted.
status: valid
status modified: 2019-03-20
accepted date: 2019-03-20
in scheme: CDR QaQc Habitats Directive Article 17 Reporting
error type: ERROR

Mandatory information missing.
type: Concept
notation: S252
definition: Population size within Natura 2000 network should be provided as interval (12.1b, c) and/or single value (12.1d) for annex II species. When only a minimum (or maximum) value of population size is known (e.g. through expert opinion) this should be entered in the 'Best single value' field and NOT the '(b) Minimum' or '(c) Maximum' fields.
status: valid
status modified: 2019-03-20
accepted date: 2019-03-20
in scheme: CDR QaQc Habitats Directive Article 17 Reporting
error type: ERROR

Invalid code.
type: Concept
notation: S253
definition: Please check the vocabulary typeEstimate. The value 'mean - multi-year mean' is allowed in this section.
status: valid
status modified: 2019-03-20
accepted date: 2019-03-20
in scheme: CDR QaQc Habitats Directive Article 17 Reporting
error type: BLOCKER

Incoherent information.
type: Concept
notation: S254
definition: Type of estimate was provided although there is no entry for population size within Natura 2000 network (12.1b,c,d). Check coherence between these two fields. If both interval (12.1b 'Minimum' and 12.1c 'Maximum') and a single value (12.1d 'Best single value') are provided, field 12.2 'Type of estimate' should correspond to the more accurate estimate. This should be noted in 12.6 'Additional information'.
status: valid
status modified: 2019-03-20
accepted date: 2019-03-20
in scheme: CDR QaQc Habitats Directive Article 17 Reporting
error type: WARNING

Mandatory information missing.
type: Concept
notation: S255
definition: The type of estimate for the population size within Natura 2000 network should be provided.
status: valid
status modified: 2019-03-20
accepted date: 2019-03-20
in scheme: CDR QaQc Habitats Directive Article 17 Reporting
error type: ERROR

Invalid code.
type: Concept
notation: S256
definition: Please check the vocabulary methodsUsed.
status: valid
status modified: 2019-03-20
accepted date: 2019-03-20
in scheme: CDR QaQc Habitats Directive Article 17 Reporting
error type: BLOCKER

Incoherent information.
type: Concept
notation: S257
definition: 12.2 Type of estimate should be empty when Population size inside the network Method used is 'AbsentData - Insufficient or no data available'. When the method is assessed as 'AbsentData - Insufficient or no data available', the type of estimate used for the population size cannot be defined. If you want to report an estimate based on a method using limited data, please select 'estimateExpert - Based mainly on expert opinion with very limited data' for the method used.
status: valid
status modified: 2019-03-20
accepted date: 2019-03-20
in scheme: CDR QaQc Habitats Directive Article 17 Reporting
error type: WARNING

Mandatory information missing.
type: Concept
notation: S258
definition: The method should be provided. In case the information to be reported in this section is not available use 'AbsentData - Insufficient or no data available'.
status: valid
status modified: 2019-03-20
accepted date: 2019-03-20
in scheme: CDR QaQc Habitats Directive Article 17 Reporting
error type: ERROR

Invalid code.
type: Concept
notation: S259
definition: Please check the vocabulary trends.
status: valid
status modified: 2019-03-20
accepted date: 2019-03-20
in scheme: CDR QaQc Habitats Directive Article 17 Reporting
error type: BLOCKER

Mandatory information missing.
type: Concept
notation: S260
definition: The Trend should be provided. In case the information to be reported in this section is not available use 'Unk - unknown'.
status: valid
status modified: 2019-03-20
accepted date: 2019-03-20
in scheme: CDR QaQc Habitats Directive Article 17 Reporting
error type: ERROR

Invalid code.
type: Concept
notation: S261
definition: Please check the vocabulary methodsUsed.
status: valid
status modified: 2019-03-20
accepted date: 2019-03-20
in scheme: CDR QaQc Habitats Directive Article 17 Reporting
error type: BLOCKER

Incoherent information.
type: Concept
notation: S262
definition: Inconsistent values provided in fields 12.4 Short-term trend Direction and 12.5 Short-term trend Method used. When the method is assessed as 'AbsentData - Insufficient or no data available', the trend cannot be defined. If you want to report a trend as stable, increasing or decreasing based on a method using limited data, please select 'estimateExpert - Based mainly on expert opinion with very limited data' for the method used.
status: valid
status modified: 2019-03-20
accepted date: 2019-03-20
in scheme: CDR QaQc Habitats Directive Article 17 Reporting
error type: WARNING

Mandatory information missing.
type: Concept
notation: S263
definition: The method should be provided. In case the information to be reported in this section is not available use 'AbsentData - Insufficient or no data available'.
status: valid
status modified: 2019-03-20
accepted date: 2019-03-20
in scheme: CDR QaQc Habitats Directive Article 17 Reporting
error type: ERROR

Min/max value should be provided systematically for all seasons.
type: Concept
notation: S500
definition: Report '0' if no hunting bag or there was a temporary ban.
status: valid
status modified: 2019-03-20
accepted date: 2019-03-20
in scheme: CDR QaQc Habitats Directive Article 17 Reporting
error type: ERROR

Incoherent information.
type: Concept
notation: S501
definition: Only min/max or unknown value is expected for 3.3.b1 Statistics/quantity per hunting season or year over the reporting period - Season/year1.
status: valid
status modified: 2019-03-20
accepted date: 2019-03-20
in scheme: CDR QaQc Habitats Directive Article 17 Reporting
error type: ERROR

Mandatory information missing.
type: Concept
notation: S502
definition: Statistics/quantity per hunting season or year over the reporting period - Season/year1 should be provided (3.3.b1min, 3.3.b1max, 3.3.b1x) when 3.3a Hunting bag unit is reported.
status: valid
status modified: 2019-03-20
accepted date: 2019-03-20
in scheme: CDR QaQc Habitats Directive Article 17 Reporting
error type: ERROR

Incorrect data format.
type: Concept
notation: S503
definition: Numeric field, only decimals greater or equal 0 are permitted.
status: valid
status modified: 2019-03-20
accepted date: 2019-03-20
in scheme: CDR QaQc Habitats Directive Article 17 Reporting
error type: ERROR

Incorrect data format.
type: Concept
notation: S504
definition: Numeric field, only decimals greater or equal 0 are permitted.
status: valid
status modified: 2019-03-20
accepted date: 2019-03-20
in scheme: CDR QaQc Habitats Directive Article 17 Reporting
error type: ERROR

3.3b1max Statistics/quantity on season/year 1- max should be greater or equal min.
type: Concept
notation: S505
status: valid
status modified: 2019-03-20
accepted date: 2019-03-20
in scheme: CDR QaQc Habitats Directive Article 17 Reporting
error type: ERROR

Invalid code.
type: Concept
notation: S506
definition: Code should be 'Yes' or 'No'.
status: valid
status modified: 2019-03-20
accepted date: 2019-03-20
in scheme: CDR QaQc Habitats Directive Article 17 Reporting
error type: ERROR

Mandatory information missing.
type: Concept
notation: S507
definition: This field cannot be empty. Code should be 'Yes' or 'No' when 3.3a Hunting bag unit is reported.
status: valid
status modified: 2019-03-20
accepted date: 2019-03-20
in scheme: CDR QaQc Habitats Directive Article 17 Reporting
error type: ERROR

Min/max value should be provided systematically for all seasons.
type: Concept
notation: S508
definition: Report '0' if no hunting bag or there was a temporary ban.
status: valid
status modified: 2019-03-20
accepted date: 2019-03-20
in scheme: CDR QaQc Habitats Directive Article 17 Reporting
error type: ERROR

Incoherent information.
type: Concept
notation: S509
definition: Only min/max or unknown value is expected for 3.3.b2 Statistics/quantity per hunting season or year over the reporting period - Season/year2.
status: valid
status modified: 2019-03-20
accepted date: 2019-03-20
in scheme: CDR QaQc Habitats Directive Article 17 Reporting
error type: ERROR

Mandatory information missing.
type: Concept
notation: S510
definition: Statistics/quantity per hunting season or year over the reporting period - Season/year2 should be provided (3.3.b2min, 3.3.b2max, 3.3.b2x) when 3.3a Hunting bag unit is reported.
status: valid
status modified: 2019-03-20
accepted date: 2019-03-20
in scheme: CDR QaQc Habitats Directive Article 17 Reporting
error type: ERROR

Incorrect data format.
type: Concept
notation: S511
definition: Numeric field, only decimals greater or equal 0 are permitted.
status: valid
status modified: 2019-03-20
accepted date: 2019-03-20
in scheme: CDR QaQc Habitats Directive Article 17 Reporting
error type: ERROR

Incorrect data format.
type: Concept
notation: S512
definition: Numeric field, only decimals greater or equal 0 are permitted.
status: valid
status modified: 2019-03-20
accepted date: 2019-03-20
in scheme: CDR QaQc Habitats Directive Article 17 Reporting
error type: ERROR

3.3b2max Statistics/quantity on season/year 2- max should be greater or equal min.
type: Concept
notation: S513
status: valid
status modified: 2019-03-20
accepted date: 2019-03-20
in scheme: CDR QaQc Habitats Directive Article 17 Reporting
error type: ERROR

Invalid code.
type: Concept
notation: S514
definition: Code should be 'Yes' or 'No'.
status: valid
status modified: 2019-03-20
accepted date: 2019-03-20
in scheme: CDR QaQc Habitats Directive Article 17 Reporting
error type: ERROR

Mandatory information missing.
type: Concept
notation: S515
definition: This field cannot be empty. Code should be 'Yes' or 'No' when 3.3a Hunting bag unit is reported.
status: valid
status modified: 2019-03-20
accepted date: 2019-03-20
in scheme: CDR QaQc Habitats Directive Article 17 Reporting
error type: ERROR

Min/max value should be provided systematically for all seasons.
type: Concept
notation: S516
definition: Report '0' if no hunting bag or there was a temporary ban.
status: valid
status modified: 2019-03-20
accepted date: 2019-03-20
in scheme: CDR QaQc Habitats Directive Article 17 Reporting
error type: ERROR

Incoherent information.
type: Concept
notation: S517
definition: Only min/max or unknown value is expected for 3.3.b3 Statistics/quantity per hunting season or year over the reporting period - Season/year3.
status: valid
status modified: 2019-03-20
accepted date: 2019-03-20
in scheme: CDR QaQc Habitats Directive Article 17 Reporting
error type: ERROR

Mandatory information missing.
type: Concept
notation: S518
definition: Statistics/quantity per hunting season or year over the reporting period - Season/year3 should be provided (3.3.b3min, 3.3.b3max, 3.3.b3x) when 3.3a Hunting bag unit is reported.
status: valid
status modified: 2019-03-20
accepted date: 2019-03-20
in scheme: CDR QaQc Habitats Directive Article 17 Reporting
error type: ERROR

Incorrect data format.
type: Concept
notation: S519
definition: Numeric field, only decimals greater or equal 0 are permitted.
status: valid
status modified: 2019-03-20
accepted date: 2019-03-20
in scheme: CDR QaQc Habitats Directive Article 17 Reporting
error type: ERROR

Incorrect data format.
type: Concept
notation: S520
definition: Numeric field, only decimals greater or equal 0 are permitted.
status: valid
status modified: 2019-03-20
accepted date: 2019-03-20
in scheme: CDR QaQc Habitats Directive Article 17 Reporting
error type: ERROR

3.3b3max Statistics/quantity on season/year 3- max should be greater or equal min.
type: Concept
notation: S521
status: valid
status modified: 2019-03-20
accepted date: 2019-03-20
in scheme: CDR QaQc Habitats Directive Article 17 Reporting
error type: ERROR

Invalid code.
type: Concept
notation: S522
definition: Code should be 'Yes' or 'No'.
status: valid
status modified: 2019-03-20
accepted date: 2019-03-20
in scheme: CDR QaQc Habitats Directive Article 17 Reporting
error type: ERROR

Mandatory information missing.
type: Concept
notation: S523
definition: This field cannot be empty. Code should be 'Yes' or 'No' when 3.3a Hunting bag unit is reported.
status: valid
status modified: 2019-03-20
accepted date: 2019-03-20
in scheme: CDR QaQc Habitats Directive Article 17 Reporting
error type: ERROR

Min/max value should be provided systematically for all seasons.
type: Concept
notation: S524
definition: Report '0' if no hunting bag or there was a temporary ban.
status: valid
status modified: 2019-03-20
accepted date: 2019-03-20
in scheme: CDR QaQc Habitats Directive Article 17 Reporting
error type: ERROR

Incoherent information.
type: Concept
notation: S525
definition: Only min/max or unknown value is expected for 3.3.b4 Statistics/quantity per hunting season or year over the reporting period - Season/year4.
status: valid
status modified: 2019-03-20
accepted date: 2019-03-20
in scheme: CDR QaQc Habitats Directive Article 17 Reporting
error type: ERROR

Mandatory information missing.
type: Concept
notation: S526
definition: Statistics/quantity per hunting season or year over the reporting period - Season/year4 should be provided (3.3.b4min, 3.3.b4max, 3.3.b4x) when 3.3a Hunting bag unit is reported.
status: valid
status modified: 2019-03-20
accepted date: 2019-03-20
in scheme: CDR QaQc Habitats Directive Article 17 Reporting
error type: ERROR

Incorrect data format.
type: Concept
notation: S527
definition: Numeric field, only decimals greater or equal 0 are permitted.
status: valid
status modified: 2019-03-20
accepted date: 2019-03-20
in scheme: CDR QaQc Habitats Directive Article 17 Reporting
error type: ERROR

Incorrect data format.
type: Concept
notation: S528
definition: Numeric field, only decimals greater or equal 0 are permitted.
status: valid
status modified: 2019-03-20
accepted date: 2019-03-20
in scheme: CDR QaQc Habitats Directive Article 17 Reporting
error type: ERROR

3.3b4max Statistics/quantity on season/year 4- max should be greater or equal min.
type: Concept
notation: S529
status: valid
status modified: 2019-03-20
accepted date: 2019-03-20
in scheme: CDR QaQc Habitats Directive Article 17 Reporting
error type: ERROR

Invalid code.
type: Concept
notation: S530
definition: Code should be 'Yes' or 'No'.
status: valid
status modified: 2019-03-20
accepted date: 2019-03-20
in scheme: CDR QaQc Habitats Directive Article 17 Reporting
error type: ERROR

Mandatory information missing.
type: Concept
notation: S531
definition: This field cannot be empty. Code should be 'Yes' or 'No' when 3.3a Hunting bag unit is reported.
status: valid
status modified: 2019-03-20
accepted date: 2019-03-20
in scheme: CDR QaQc Habitats Directive Article 17 Reporting
error type: ERROR

Min/max value should be provided systematically for all seasons.
type: Concept
notation: S532
definition: Report '0' if no hunting bag or there was a temporary ban.
status: valid
status modified: 2019-03-20
accepted date: 2019-03-20
in scheme: CDR QaQc Habitats Directive Article 17 Reporting
error type: ERROR

Incoherent information.
type: Concept
notation: S533
definition: Only min/max or unknown value is expected for 3.3.b5 Statistics/quantity per hunting season or year over the reporting period - Season/year5.
status: valid
status modified: 2019-03-20
accepted date: 2019-03-20
in scheme: CDR QaQc Habitats Directive Article 17 Reporting
error type: ERROR

Mandatory information missing.
type: Concept
notation: S534
definition: Statistics/quantity per hunting season or year over the reporting period - Season/year5 should be provided (3.3.b5min, 3.3.b5max, 3.3.b5x) when 3.3a Hunting bag unit is reported.
status: valid
status modified: 2019-03-20
accepted date: 2019-03-20
in scheme: CDR QaQc Habitats Directive Article 17 Reporting
error type: ERROR

Incorrect data format.
type: Concept
notation: S535
definition: Numeric field, only decimals greater or equal 0 are permitted.
status: valid
status modified: 2019-03-20
accepted date: 2019-03-20
in scheme: CDR QaQc Habitats Directive Article 17 Reporting
error type: ERROR

Incorrect data format.
type: Concept
notation: S536
definition: Numeric field, only decimals greater or equal 0 are permitted.
status: valid
status modified: 2019-03-20
accepted date: 2019-03-20
in scheme: CDR QaQc Habitats Directive Article 17 Reporting
error type: ERROR

3.3b5max Statistics/quantity on season/year 5- max should be greater or equal min.
type: Concept
notation: S537
status: valid
status modified: 2019-03-20
accepted date: 2019-03-20
in scheme: CDR QaQc Habitats Directive Article 17 Reporting
error type: ERROR

Invalid code.
type: Concept
notation: S538
definition: Code should be 'Yes' or 'No'.
status: valid
status modified: 2019-03-20
accepted date: 2019-03-20
in scheme: CDR QaQc Habitats Directive Article 17 Reporting
error type: ERROR

Mandatory information missing.
type: Concept
notation: S539
definition: This field cannot be empty. Code should be 'Yes' or 'No' when 3.3a Hunting bag unit is reported.
status: valid
status modified: 2019-03-20
accepted date: 2019-03-20
in scheme: CDR QaQc Habitats Directive Article 17 Reporting
error type: ERROR

Min/max value should be provided systematically for all seasons.
type: Concept
notation: S540
definition: Report '0' if no hunting bag or there was a temporary ban.
status: valid
status modified: 2019-03-20
accepted date: 2019-03-20
in scheme: CDR QaQc Habitats Directive Article 17 Reporting
error type: ERROR

Incoherent information.
type: Concept
notation: S541
definition: Only min/max or unknown value is expected for 3.3.b6 Statistics/quantity per hunting season or year over the reporting period - Season/year6.
status: valid
status modified: 2019-03-20
accepted date: 2019-03-20
in scheme: CDR QaQc Habitats Directive Article 17 Reporting
error type: ERROR

Mandatory information missing.
type: Concept
notation: S542
definition: Statistics/quantity per hunting season or year over the reporting period - Season/year5 should be provided (3.3.b6min, 3.3.b6max, 3.3.b6x) when 3.3a Hunting bag unit is reported.
status: valid
status modified: 2019-03-20
accepted date: 2019-03-20
in scheme: CDR QaQc Habitats Directive Article 17 Reporting
error type: ERROR

Incorrect data format.
type: Concept
notation: S543
definition: Numeric field, only decimals greater or equal 0 are permitted.
status: valid
status modified: 2019-03-20
accepted date: 2019-03-20
in scheme: CDR QaQc Habitats Directive Article 17 Reporting
error type: ERROR

Incorrect data format.
type: Concept
notation: S544
definition: Numeric field, only decimals greater or equal 0 are permitted.
status: valid
status modified: 2019-03-20
accepted date: 2019-03-20
in scheme: CDR QaQc Habitats Directive Article 17 Reporting
error type: ERROR

3.3b6max Statistics/quantity on season/year 6- max should be greater or equal min.
type: Concept
notation: S545
status: valid
status modified: 2019-03-20
accepted date: 2019-03-20
in scheme: CDR QaQc Habitats Directive Article 17 Reporting
error type: ERROR

Invalid code.
type: Concept
notation: S546
definition: Code should be 'Yes' or 'No'.
status: valid
status modified: 2019-03-20
accepted date: 2019-03-20
in scheme: CDR QaQc Habitats Directive Article 17 Reporting
error type: ERROR

Mandatory information missing.
type: Concept
notation: S547
definition: This field cannot be empty. Code should be 'Yes' or 'No' when 3.3a Hunting bag unit is reported.
status: valid
status modified: 2019-03-20
accepted date: 2019-03-20
in scheme: CDR QaQc Habitats Directive Article 17 Reporting
error type: ERROR

Incoherent information.
type: Concept
notation: S548
definition: The Favourable reference population size unit (6.15a2) cannot be empty when the Favourable reference population size (6.15a1) is provided.
status: valid
status modified: 2019-03-20
accepted date: 2019-03-20
in scheme: CDR QaQc Habitats Directive Article 17 Reporting
error type: ERROR